
##TITLE=AC1350_CHIRS12168_7160055_efMWbtibv7
##JCAMPDX= 6.0         $$ Bruker NMR JCAMP-DX V2.0
##DATA TYPE= NMR SPECTRUM
##DATA CLASS= NTUPLES
##ORIGIN= BRUKER
##OWNER= Administrator
$$ 1.72 TOPSPIN		Version 2.1
$$ 2012-11-30 20:45:06.664 -0500  Administrator@X
$$ Compression mode = diff/dup
##.OBSERVE FREQUENCY= 400.02188249412
##.OBSERVE NUCLEUS= ^1H
##.ACQUISITION MODE= SIMULTANEOUS (DQD)
##.ACQUISITION SCHEME= undefined
##.AVERAGES= 64
##.DIGITISER RES= 22
##SPECTROMETER/DATA SYSTEM= spect
##.PULSE SEQUENCE= noesygpps1d.comp
##.SOLVENT NAME= COFFEE_meoh
##.SHIFT REFERENCE= INTERNAL, COFFEE_meoh, 1, 14.96103
##AUDIT TRAIL= $$ (NUMBER, WHEN, WHO, WHERE, PROCESS, VERSION, WHAT)
$$ ##TITLE= Audit trail, TOPSPIN		Version 2.1
$$ ##JCAMPDX= 5.01
$$ ##ORIGIN= Bruker BioSpin GmbH
$$ ##OWNER= Administrator
$$ $$ E:\/data/COFFEE/nmr/AC1350_CHIRS12168_7160055_efMWbtibv7/12/pdata/1/auditp.txt
$$ ##AUDIT TRAIL=  $$ (NUMBER, WHEN, WHO, WHERE, PROCESS, VERSION, WHAT)
(   1,<2012-11-30 20:45:00.696 -0500>,<Administrator>,<X>,<go>,<TOPSPIN 2.1>,
      <created by zg
	started at 2012-11-30 20:33:31.474 -0500,
	POWCHK enabled, PULCHK disabled,
       configuration hash MD5:
       86 BA 57 50 F2 9D 5C 9B 26 00 A9 28 5F 66 2E 89
       data hash MD5: 64K
       11 94 AF 51 54 FD 65 BD FC 8B 54 14 6E FB 8A A8>)
(   2,<2012-11-30 20:45:03.867 -0500>,<Administrator>,<X>,<proc1d>,<TOPSPIN 2.1>,
      <Start of raw data processing
       efp LB = 0.3 FT_mod = 6 PKNL = 1 PHC0 = 0 PHC1 = 0 SI = 128K 
       data hash MD5: 128K
       C1 F3 E3 4D F4 8A 24 F1 10 36 9B BC 95 13 C6 0F>)
(   3,<2012-11-30 20:45:04.930 -0500>,<Administrator>,<X>,<proc1d>,<TOPSPIN 2.1>,
      <pk PHC0 = -81.29883 PHC1 = 0 
       data hash MD5: 128K
       35 85 69 AE A5 45 33 55 7F 7D 72 E4 84 65 F2 72>)
(   4,<2012-11-30 20:45:05.664 -0500>,<Administrator>,<X>,<proc1d>,<TOPSPIN 2.1>,
      <abs ABSG = 1 
       data hash MD5: 128K
       A4 27 B0 34 65 24 79 4E D9 09 C0 ED 68 D7 A9 3A>)
(   5,<2012-11-30 20:45:05.836 -0500>,<Administrator>,<X>,<proc1d>,<TOPSPIN 2.1>,
      <abs ABSG = 2 
       data hash MD5: 128K
       1A 46 36 CC 16 0B 15 B4 95 34 4B 0F A4 B5 F9 8A>)
(   6,<2012-11-30 20:45:05.992 -0500>,<Administrator>,<X>,<proc1d>,<TOPSPIN 2.1>,
      <abs ABSG = 3 
       data hash MD5: 128K
       00 D6 34 5B 6B 73 3D 83 21 B7 3E F9 D3 AF BC EB>)
(   7,<2012-11-30 20:45:06.149 -0500>,<Administrator>,<X>,<proc1d>,<TOPSPIN 2.1>,
      <abs ABSG = 4 
       data hash MD5: 128K
       3D 57 77 A1 F2 2E 05 D3 99 5A 6A 38 18 BE 5D 0D>)
(   8,<2012-11-30 20:45:06.352 -0500>,<Administrator>,<X>,<proc1d>,<TOPSPIN 2.1>,
      <abs ABSG = 5 
       data hash MD5: 128K
       AA 63 00 36 31 20 9C 79 37 D3 94 26 D9 2E 6B 63>)
$$ ##END=
$$ 
$$ $$ hash MD5
$$ $$ 8F CA C7 DE 36 48 B7 FC F4 AE BA 3A 03 85 7C F4
##$RELAX= 
##$RELAX= 
##$RELAX= 
##$RELAX= 
##$RELAX= 
##$RELAX= 
##$RELAX= 
##$RELAX= 
$$ Bruker specific parameters
$$ --------------------------
##$DU= <E:\>
##$EXPNO= 12
$$ [...]
150 150 150 150 150 150 150 150
##$TP07= 0
##$TPNAME0= <>
##$TPNAME1= <>
##$TPNAME2= <>
##$TPNAME3= <>
##$TPNAME4= <>
##$TPNAME5= <>
##$TPNAME6= <>
##$TPNAME7= <>
##$TPOAL= (0..7)
0.5 0.5 0.5 0.5 0.5 0.5 0.5 0.5
##$TPOFFS= (0..7)
0 0 0 0 0 0 0 0
##$TUNHIN= 0
##$TUNHOUT= 0
##$TUNXOUT= 0
##$USERA1= <user>
##$USERA2= <user>
##$USERA3= <user>
##$USERA4= <user>
##$USERA5= <user>
##$V9= 5
##$VALIST= <valist>
##$VCLIST= <CCCCCCCCCCCCCCC>
##$VD= 0
##$VDLIST= <DDDDDDDDDDDDDDD>
##$VPLIST= <PPPPPPPPPPPPPPP>
##$VTLIST= <TTTTTTTTTTTTTTT>
##$WBST= 1024
##$WBSW= 4
##$XGAIN= (0..3)
0 0 0 0
##$XL= 0
##$YL= 0
##$YMAX_a= 7638879
##$YMIN_a= -13582877
##$ZGOPTNS= <>
##$ZL1= 120
##$ZL2= 120
##$ZL3= 120
##$ZL4= 120
##$ABSF1= 14.96103
##$ABSF2= -5.597152
##$ABSG= 5
##$ABSL= 3
##$ALPHA= 0
##$AQORDER= 0
##$ASSFAC= 0
##$ASSFACI= 0
##$ASSFACX= 0
##$ASSWID= 0
##$AUNMP= <proc_prof1d_extract.lims>
##$AXLEFT= 0
##$AXNAME= <>
##$AXNUC= <1H>
##$AXRIGHT= 0
##$AXTYPE= 0
##$AXUNIT= <>
##$AZFE= 0.1
##$AZFW= 0.1
##$BCFW= 0
##$BC_mod= 0
##$BYTORDP= 0
##$COROFFS= 0
##$CY= 15
##$DATMOD= 1
##$DC= 0
##$DFILT= <>
##$DTYPP= 0
##$F1P= 0
##$F2P= 0
##$FCOR= 0.5
##$FTSIZE= 131072
##$FT_mod= 6
##$GAMMA= 0
##$GB= 0
##$INTBC= 1
##$INTSCL= 1
##$ISEN= 128
##$LB= 0.3
##$LEV0= 0
##$LPBIN= 0
##$MAXI= 10000
##$MC2= 0
##$MEAN= 0
##$ME_mod= 0
##$MI= 0
##$NCOEF= 0
##$NC_proc= -2
##$NLEV= 6
##$NOISF1= 0
##$NOISF2= 0
##$NSP= 0
##$NTH_PI= 0
##$NZP= 0
##$OFFSET= 14.96103
##$PC= 1
##$PHC0= -81.29883
##$PHC1= 0
##$PH_mod= 1
##$PKNL= yes
##$PPARMOD= 0
##$PPDIAG= 0
##$PPIPTYP= 0
##$PPMPNUM= 2147483647
##$PPRESOL= 1
##$PSCAL= 4
##$PSIGN= 0
##$PYNMP= <proc.py>
##$REVERSE= no
##$SF= 400.02000962644
##$SI= 131072
##$SIGF1= 0
##$SIGF2= 0
##$SINO= 400
##$SIOLD= 131072
##$SPECTYP= <>
##$SREGLST= <1H.CDCl3>
##$SSB= 0
##$STSI= 131072
##$STSR= 0
##$SW_p= 8223.68421052631
##$SYMM= 0
##$S_DEV= 0
##$TDeff= 65536
##$TDoff= 0
##$TI= <>
##$TILT= no
##$TM1= 0
##$TM2= 0
##$TOPLEV= 0
##$USERP1= <user>
##$USERP2= <user>
##$USERP3= <user>
##$USERP4= <user>
##$USERP5= <user>
##$WDW= 1
##$XDIM= 131072
##$YMAX_p= 432783097
##$YMIN_p= -12072
##$CURPLOT= <Network HP LaserJet P1505>
##$CURPRIN= <$Network HP LaserJet P1505>
##$DFORMAT= <normdp>
##$LAYOUT= <+/1D_H.xwp>
##$LFORMAT= <normlp>
##$PFORMAT= <normpl>
##$SURQMSG= 1
$$ End of Bruker specific parameters
$$ ---------------------------------
##NTUPLES= NMR SPECTRUM
##VAR_NAME=  FREQUENCY,     SPECTRUM/REAL,   SPECTRUM/IMAG
##SYMBOL=    X,             R,               I
##VAR_TYPE=  INDEPENDENT,   DEPENDENT,       DEPENDENT
##VAR_FORM=  AFFN,          ASDF,            ASDF
##VAR_DIM=   131072,        131072,          131072
##UNITS=     HZ,            ARBITRARY UNITS, ARBITRARY UNITS
##FACTOR=    0.0627417313425164, 1,          1
##FIRST=     8223.62146879497, -442,         -68823
##LAST=      0,             1781,            -69561
##MIN=       0,             -12072,          0
##MAX=       8223.62146879497, 432783097,    0
$$ Real data points
##PAGE= N=1
##DATA TABLE= (X++(R..R)), XYDATA
$$ [...]
$$ plain form
63861 813163 847914 883896 921291 960288 1000226 1039911 1078369 1114846 1148467 1178402 1204169
63850 1204169 1225441 1241805 1252905 1258553 1258519 1252541 1240720 1223597 1201781 1175872 1146684 1114922
63838 1114922 1080566 1043310 1003863 963989 924834 885951 846512 806829 767937 730289 693702
63827 693702 658326 624913 594170 566318 541112 517862 495703 474311 454152 435735 418986
63816 418986 403698 390053 378105 367281 357075 347821 340023 333324 326929 320663 314726 308740 302188
63803 302188 295666 290497 286896 283526 279188 274064 268979 264384 260459 257392 254955 252432 249503 246610
63789 246610 244024 241244 237886 234544 232014 230179 228429 226804 225875 225653 225496 225076 224701 224561 224349 223831
63773 223831 223242 222827 222387 221633 220720 220122 220043 220119 219679 218347 216507 215125 214897 215569 216266 216416 216076 215454
$$ packed form
63861H13163L4751L5982L7395L8997L9938L9685L8458L6477L3621K9935K5767
63850A204169K1272J6364J1100N648l4n978j1821j7123k1816k5909k9188l1762
63838A114922l4356l7256l9447l9874l9155l8883l9439l9683l8892l7648l6587
63827F93702l5376l3413l0743k7852k5206k3250k2159k1392k0159j8417j6749
63816D18986j5288j3645j1948j0824j0206r254p798o699o395o266n937n986o552
63803C02188o522n169l601l370m338n124n085m595l925l067k437k523k929k893
63789B46610k586k780l358l342k530j835j750j625r29k22j57m20l75j40k12n18
63773B23831n89m15m40p54r13n98p9P6m40j332j840j382k28O72O97J50l40o22
$$ plain form
63755 215454 214574 213557 212808 212599 212709 212712 212476 212155 211957 212200 213370 215675 218618 221420 223944 226785 230315
63738 230315 233992 236944 239014 240889 243237 246020 248721 251075 253452 256557 260861 266406 273150 281315
63724 281315 291121 302223 313781 325232 336710 348479 360279 371537 381921 391194 398706 403630
63712 403630 405805 405859 404307 400902 395041 386523 375848 364194 353199 344183 337144 330927 324723 319001
63698 319001 314568 311220 308132 305279 303585 303531 304452 305483 306605 308321 310735 313438 316036 318413 320580
63683 320580 322628 324698 326752 328491 329743 330827 332211 333946 335783 337896 341154 346444 353848 362478
63669 362478 371080 378849 385932 393213 401421 410278 418631 425484 430700 434570 436887 436797 433589 427378 418951
63654 418951 409125 398402 387121 375737 364835 354820 345573 336594 327705 319599 313363 309298 306503
$$ packed form
63755B15454q80j017p49k09J10Lk36l21j98K43J170K305K943K802K524K841L530
63738B30315L677K952K070J875K348K783K701K354K377L105M304N545O744Q165
63724B81315R806J1102J1558J1451J1478J1769J1800J1258J0384R273P512M924
63712D03630K175N4j552l405n861q518j0675j1654j0995r016p039o217o204n722
63698C19001m433l348l088k853j694n4R21J031J122J716K414K703K598K377K167
63683C20580K048K070K054J739J252J084J384J735J837K113L258N290P404Q630
63669C62478Q602P769P083P281Q208Q857Q353O853N216L870K317r0l208o211q427
63654D18951r826j0723j1281j1384j0902j0015r247q979q889q106o236m065k795
$$ plain form
63641 306503 303822 300997 298612 297121 296412 296305 296985 298703 301332 304401 307435 310155 312606 315243 318752
63626 318752 323551 329530 336280 343411 350604 357744 365270 374148 385099 397910 411805 426426 442162
63613 442162 459519 478571 499169 521430 545737 572319 600997 631237 662218 692777 721508
63602 721508 747048 768314 784497 795094 800268 801092 799049 795082 789351 782032 774003 766340 759326
63589 759326 752344 744591 735402 724030 709831 692961 674476 655535 636867 619087 602907 588597
63577 588597 575717 563902 553607 545588 539893 535891 533137 531700 531733 533223 536168 540520 545921 551896
63563 551896 558345 565518 573439 581758 590186 598742 607483 616380 625595 635562 646704 659363 674168
63550 674168 692069 713768 739323 768594 801844 839493 881111 924649 966617 1003045 1030665
$$ packed form
63641C06503k681k825k385j491p09j07O80J718K629L069L034K720K451K637L509
63626C18752M799N979O750P131P193P140P526Q878J0951J2811J3895J4621J5736
63613D42162J7357J9052K0598K2261K4307K6582K8678L0240L0981L0559K8731
63602G21508K5540K1266J6183J0597N174Q24k043l967n731p319q029p663p014
63589G59326o982p753r189j1372j4199j6870j8485j8941j8668j7780j6180j4310
63577E88597j2880j1815j0295q019n695m002k754j437L3J490K945M352N401N975
63563E51896O449P173P921Q319Q428Q556Q741Q897R215R967J1142J2659J4805
63550F74168J7901K1699K5555K9271L3250L7649M1618M3538M1968L6428K7620
$$ plain form
63539 1030665 1047737 1054263 1051747 1042797 1030630 1018399 1008513 1002174 999342 999125 1000465 1002556 1004491
63526 1004491 1004644 1000965 992271 978880 961630 940691 915947 888183 858923 829001 798122 766209
63514 766209 734460 704485 676864 651231 627560 606689 589366 575207 562880 551238 540111
63503 540111 530048 521408 513874 506861 500192 494177 489164 485251 482291 479878 477410 474588 471811 469689
63489 469689 468124 466368 464126 462087 461121 461428 462818 465391 469412 474834 481496 489645 499677 511357
63475 511357 523712 535735 546841 556641 564706 570736 574563 575821 573917 568600 560294 549655 536989
63462 536989 522476 506825 491234 476561 462860 449996 438424 428968 421801 416123 411021 406407
63450 406407 402843 400698 399838 400083 401525 404270 408147 412861 418327 424764 432558 442129 453785 467704
$$ packed form
63539A030665J7072O526k516q950j2167j2231r886o339k832k17J340K091J935
63526A004491J53l679q694j3391j7250k0939k4744k7764k9260k9922l0879l1913
63514G66209l1749k9975k7621k5633k3671k0871j7323j4159j2327j1642j1127
63503E40111j0063q640p534p013o669o015n013l913k960k413k468k822k777k122
63489D69689j565j756k242k039r66L07J390K573M021N422O662Q149J0032J1680
63475E11357J2355J2023J1106R800Q065O030L827J258j904n317q306j0639j2666
63462E36989j4513j5651j5591j4673j3701j2864j1572r456p167n678n102m614
63450D06407l564k145q60K45J442K745L877M714N466O437P794R571J1656J3919
$$ plain form
63436 467704 484158 503816 527562 555803 587791 621491 653957 682054 703414 717279 724609 727323
63424 727323 727310 725993 724584 724558 727771 735893 749625 768560 791987 819600 851105 885255 919699
63411 919699 951856 979657 1001539 1016405 1024032 1025259 1021453 1013923 1003930 992890 982059 971986
63399 971986 962402 952501 941144 927042 909215 887535 862832 836442 809561 782823 756413 730658
63387 730658 706423 684634 665457 648282 632632 618737 607009 597421 589735 584088 580889 580193 581458
63374 581458 583833 586566 589366 592664 597361 604073 612674 622708 633938 646244 659391 673395 688885
63361 688885 706545 726216 747081 768791 792033 817854 846772 878521 912229 946561 979841
63350 979841 1010196 1035672 1054521 1065878 1070208 1068804 1062868 1053377 1041682 1029559 1018315 1008009
$$ packed form
63436D67704J6454J9658K3746K8241L1988L3700L2466K8097K1360J3865P330K714
63424G27323j3j317j409k6L213Q122J3732J8935K3427K7613L1505L4150L4444
63411I19699L2157K7801K1882J4866P627J227l806p530r993j1040j0831j0073
63399I71986r584r901j1357j4102j7827k1680k4703k6390k6881k6738k6410k5755
63387G30658k4235k1789j9177j7175j5650j3895j1728r588p686n647l199o96J265
63374E81458K375K733K800L298M697O712Q601J0034J1230J2306J3147J4004J5490
63361F88885J7660J9671K0865K1710K3242K5821K8918L1749L3708L4332L3280
63350I79841L0355K5476J8849J1357M330j404n936r491j1695j2123j1244j0306
$$ plain form
63338 1008009 997667 986001 971924 954883 935054 913070 889418 864279 838048 811616 785925
63327 785925 761475 738458 717153 698014 681661 669019 661121 658412 660258 665151 670922 674603 672954
63314 672954 664149 649044 630284 610272 590371 571594 554822 540105 526739 514498 504026 495439
63302 495439 487443 478788 470074 462983 457888 453376 448186 442443 436566 430112 422617 414886 408337 403271
63288 403271 398706 393880 389089 384856 381048 377255 373502 370077 366936 363709 360248 356788 353632 350899
63274 350899 348630 346922 345840 345245 344734 343759 341864 338952 335378 331746 328577 326132 324504 323729 323636 323592
63258 323592 322707 320650 318163 316391 315664 315342 314910 314689 315082 315658 315592 314758 313761 313025 312513 312284 312605 313340
63240 313340 313863 313842 313605 313494 313413 313345 313790 315163 317104 318888 320357 321999 324244 327034 330004 332726 334875
$$ packed form
63338A008009j0342j1666j4077j7041j9829k1984k3652k5139k6231k6432k5691
63327G85925k4450k3017k1305j9139j6353j2642p898k709J846M893N771L681j649
63314F72954q805j5105j8760k0012j9901j8777j6772j4717j3366j2241j0472q587
63302D95439p996q655q714p091n095m512n190n743n877o454p495p731o549n066
63288D03271m565m826m791m233l808l793l753l425l141l227l461l460l156k733
63274C50899k269j708j082n95n11r75j895k912l574l632l169k445j628p75r3m4
63258C23592q85k057k487j772p27l22m32k21L93N76o6q34r97p36n12k29L21P35
63240C13340N23k1k37j11q1o8M45J373J941J784J469J642K245K790K970K722K149
$$ plain form
63223 334875 336492 338129 340463 343710 347500 351233 354472 357143 359576 362288 365564 369263 372979 376278
63209 376278 378766 380260 380999 381418 381594 381175 379984 378342 376642 374985 373487 372567 372504 372972 373440 373875 374682
63192 374682 376080 377896 379927 382253 385228 389282 394607 400884 407637 414978 423612 433767 444534 454781
63178 454781 464429 474255 484624 495030 504851 514040 522983 532094 541605 551389 560873 569406 576747 583017
63164 583017 588229 592097 594241 594369 592358 588375 582729 575426 566156 555069 543195 531561 520051
63151 520051 507667 493852 479152 464731 451697 440695 431544 423287 415202 407766 402145 398716 396640
63138 396640 394895 393177 391693 390637 390070 389941 390106 390583 391675 393445 395322 396848 398640 401793 406282
63123 406282 410824 414478 417592 420915 424679 428954 434019 439789 445506 450659 455696 461191 466891 472299
$$ packed form
63223C34875J617J637K334L247L790L733L239K671K433K712L276L699L716L299
63209C76278K488J494P39M19J76m19j191j642j700j657j498r20o3M68M68M35Q07
63192C74682J398J816K031K326K975M054N325O277O753P341Q634J0155J0767J0247
63178D54781R648R826J0369J0406R821R189Q943R111R511R784R484Q533P341O270
63164E83017N212L868K144J28k011l983n646p303r270j1087j1874j1634j1510
63151E20051j2384j3815j4700j4421j3034j1002r151q257q085p436n621l429k076
63138C96640j745j718j484j056n67j29J65M77J092J770J877J526J792L153M489
63123D06282M542L654L114L323L764M275N065N770N717N153N037N495N700N408
$$ plain form
63109 472299 477779 484208 491706 499424 506589 513105 519091 524413 528912 532793 536612 540973 546210 552263
63095 552263 558890 565948 573260 580244 586218 591275 596325 601851 607049 610687 612454 612914 612394 610578 607142
63080 607142 602194 596049 589018 581456 573625 565410 556558 547234 537985 529120 520498 512105 504483 498285
63066 498285 493606 489999 487146 485241 484560 484788 485090 485028 485169 486446 489034 492342 496109 500906 507250 514710
63050 514710 522370 529855 537496 545762 554984 565414 576978 589027 600802 612126 623268 634251
63038 634251 644793 654929 665091 675400 685400 694774 703910 713316 722707 731059 737566 742181 745204
63025 745204 746680 746402 744303 740499 734998 727706 718802 708793 697980 686191 673427 660530 648693
63012 648693 638449 629639 622287 616825 613360 611455 610938 612280 615762 620872 627044 634476 643608 654226
$$ packed form
63109D72299N480O429P498P718P165O516N986N322M499L881L819M361N237O053
63095E52263O627P058P312O984N974N057N050N526N198L638J767M60n20j816l436
63080F07142m948o145p031p562p831q215q852r324r249q865q622q393p622o198
63066D98285m679l607k853j905o81K28L02o2J41J277K588L308L767M797O344P460
63050E14710P660P485P641Q266R222J0430J1564J2049J1775J1324J1142J0983
63038F34251J0542J0136J0162J0309J0000R374R136R406R391Q352O507M615L023
63025G45204J476k78k099l804n501p292q904j0009j0813j1789j2764j2897j1837
63012F48693j0244q810p352n462l465j905n17J342L482N110O172P432R132J0618
$$ plain form
62998 654226 665779 678245 691919 706521 721290 735924 750782 766125 781759 797491 813274
62987 813274 828776 843403 856992 870028 882905 895291 906398 915513 922106 925723 926040 922826 915779
62974 915779 904634 889539 871103 850074 827192 803378 779668 756741 734733 713602 693489
62963 693489 674586 656873 640118 624154 609127 595499 583600 573088 563148 553414 544319 536121
62951 536121 528028 518999 509127 499425 490298 481108 471360 461434 451853 442652 433890 426049 419342 413245
62937 413245 407316 401912 397463 393546 389422 385135 381278 377917 374611 371431 369109 368022 367681 367410 366977
62922 366977 366348 365386 364116 362900 362024 361334 360505 359470 358401 357459 356702 356101 355557 355084 354988 355646 357049
62905 357049 358852 360888 363269 365936 368663 371755 376183 382497 389901 396996 403313 409569 416532 424209
$$ packed form
62998F54226J1553J2466J3674J4602J4769J4634J4858J5343J5634J5732J5783
62987H13274J5502J4627J3589J3036J2877J2386J1107R115O593L617L17l214p047
62974I15779j1145j5095j8436k1029k2882k3814k3710k2927k2008k1131k0113
62963F93489j8903j7713j6755j5964j5027j3628j1899j0512r940r734r095q198
62951E36121q093r029r872r702r127r190r748r926r581r201q762p841o707o097
62937D13245n929n404m449l917m124m287l857l361l306l180k322j087l41k71m33
62922C66977o29r62j270j216q76o90q29j035j069r42p57o01n44m73r6O58J403
62905C57049J803K036K381K667K727L092M428O314P404P095O317O256O963P677
$$ plain form
62891 424209 432240 440411 448399 455490 461037 465034 467912 469917 471011 471240 470818 469857 468296 466063 463032
62876 463032 458894 453414 446865 439932 433102 426447 420019 414037 408478 402821 396615 390156 384261 379447
62862 379447 375564 372159 368876 365455 361741 357904 354482 351961 350283 348887 347249 345345 343628 342629
62848 342629 342621 343503 344823 345930 346347 346165 345952 346072 346252 346063 345697 345833 346687 347630 347959 347723 347523 347791 348585
62829 348585 349809 351207 352205 352227 351261 349892 348750 348100 347955 348319 349209 350570 352203 353736 354773 355231
62813 355231 355436 355723 356069 356270 356303 356193 355668 354400 352631 351195 350707 350966 351298 351312 351204 351454 352371 353817
62795 353817 355264 356225 356696 357150 358069 359559 361405 363357 365294 367214 369223 371557 374550 378511 383615
62780 383615 389938 397594 406672 416868 427352 437449 447458 458397 470710 483610 495905 507042
$$ packed form
62891D24209Q031Q171P988P091N547L997K878K005J094K29m22r61j561k233l031
62876D63032m138n480o549o933o830o655o428n982n559n657o206o459n895m814
62862C79447l883l405l283l421l714l837l422k521j678j396j638j904j717r99
62848C42629qQ82J320J107M17j82k13J20J80j89l66J36Q54R43L29k36k00K68P94
62829C48585J224J398R98K2r66j369j142o50j45L64Q90J361J633J533J037M58
62813C55231K05K87L46K01L3j10n25j268j769j436m88K59L32J4j08K50R17J446
62795C53817J447R61M71M54R19J490J846J952J937J920K009K334K993L961N104
62780C83615O323P656R078J0196J0484J0097J0009J0939J2313J2900J2295J1137
$$ plain form
62768 507042 516994 525596 532633 538364 543267 547210 549390 549165 546551 541906 535557 527842 519075 509369
62754 509369 498856 488057 477624 467623 457546 447178 436991 427509 418646 409888 400802 391271
62742 391271 381606 372581 364940 358716 353443 349131 346360 345048 343758 340945 336636 332344 329470 328298
62728 328298 328372 329210 330440 331641 332393 332548 332532 333288 335572 339121 342776 345661 347963 350309 352826 355295
62712 355295 357980 361744 367342 374888 383868 393334 402411 411159 420844 432835 447317 463581 481262
62699 481262 500493 520901 541595 562555 585164 610576 638187 666462 694850 723984 754123
62688 754123 784277 812964 839120 862009 880881 895147 904552 908820 907397 899863 886468 868115
62676 868115 845935 820938 793737 764479 733404 701683 671163 642890 616315 590508 565729
$$ packed form
62768E07042R952Q602P037N731M903L943K180k25k614m645o349p715q767r706
62754E09369j0513j0799j0433j0001j0077j0368j0187r482q863q758r086r531
62742C91271r665r025p641o224n273m312k771j312j290k813m309m292k874j172
62728C28298P4Q38J230J201P52J55j6P56K284L549L655K885K302K346K517K469
62712C55295K685L764N598P546Q980R466R077Q748R685J1991J4482J6264J7681
62699D81262J9231K0408K0694K0960K2609K5412K7611K8275K8388K9134L0139
62688G54123L0154K8687K6156K2889J8872J4266R405M268j423p534j3395j8353
62676H68115k2180k4997k7201k9258l1075l1721l0520k8273k6575k5807k4779
$$ plain form
62665 565729 543084 522911 504516 487448 472006 458253 445628 434110 424763 418137 412783 406505
62653 406505 398854 391374 385445 380878 376772 372804 369190 366015 363117 360353 357710 355379 353847 353518
62639 353518 354067 354605 354642 354527 354744 355242 355727 356202 356791 357338 357563 357426 356973 356040 354453 352385 350205 348124
62621 348124 346255 344901 344383 344597 345008 345139 344934 344672 344689 345088 345595 345755 345435 345011 344885 344873 344369 343221
62603 343221 342294 342889 345415 348718 351024 351678 351744 352702 354917 357809 361190 365592 371211 377265 382815 387721
62587 387721 392340 396723 400559 403715 406359 408632 410486 411774 412317 412048 411244 410331 409226 407189 403612
62572 403612 398748 393372 387970 382596 377301 372253 367516 363060 359036 355758 353366 351616 350006 348129
62558 348129 346082 344530 344005 344039 343390 341365 338604 336269 334800 333795 332807 331825 331166 331259 332370 334209
$$ packed form
62665E65729k2645k0173j8395j7068j5442j3753j2625j1518r347o626n354o278
62653D06505p651p480n929m567m106l968l614l175k898k764k643k331j532l29
62639C53518N49N38L7j15K17M98M85M75N89N47K25j37m53r33j587k068k180k081
62621C48124j869j354n18K14M11J31k05k62J7L99N07J60l20m24j26j2n04j148
62603C43221r27N95K526L303K306O54O6R58K215K892L381M402N619O054N550M906
62587C87721M619M383L836L156K644K273J854J288N43k69q04r13j105k037l577
62572D03612m864n376n402n374n295n048m737m456m024l278k392j750j610j877
62558C48129k047j552n25L4o49k025k761k335j469j005r88r82o59R3J111J839
$$ plain form
62542 334209 335945 336888 337023 336744 336389 336327 337111 339085 341988 345147 347824 349294 349186 348192 347899 349349 352141
62525 352141 355440 359313 364328 370346 376616 382858 389387 396405 403969 412536 422635 434102 446509
62512 446509 460201 475851 492995 510130 526509 542836 559866 577344 594711 611748 627855
62501 627855 641647 652189 660037 666262 670887 673042 672257 668845 663349 656402 649058 642592 637892 635347
62487 635347 635142 637204 641068 646324 653208 662431 674452 689102 705767 723675 742119 760564 778325
62474 778325 794078 806155 813738 817426 818208 816081 810021 799009 782721 761627 737013 710729 684267
62461 684267 657936 631225 603905 576509 549998 525355 503341 484152 467370 452609 440008
62450 440008 429748 421408 414376 408650 404426 400958 396761 391313 385850 381953 379783 378227 376489 374965
$$ packed form
62542C34209J736R43J35k79l55o2P84J974K903L159K677J470j08r94k93J450K792
62525C52141L299L873N015O018O270O242O529P018P564Q567J0099J1467J2407
62512D46509J3692J5650J7144J7135J6379J6327J7030J7478J7367J7037J6107
62501F27855J3792J0542P848O225M625K155p85l412n496o947p344o466m700k545
62487F35347k05K062L864N256O884R223J2021J4650J6665J7908J8444J8445J7761
62474G78325J5753J2077P583L688P82k127o060j1012j6288k1094k4614k6284k6462
62461F84267k6331k6711k7320k7396k6511k4643k2014j9189j6782j4761j2601
62450D40008j0260q340p032n726m224l468m197n448n463l897k170j556j738j524
$$ plain form
62436 374965 374573 375569 377148 378100 377863 376916 376060 375439 374560 373242 372029 371429 371129 370424 369222 368237 368165 368916
62418 368916 369657 369443 367884 365476 363245 361853 361020 360049 358864 358188 358613 359822 360960 361493 361462 361140 360857
62401 360857 361097 362210 363912 365399 366208 366686 367443 368649 370169 372122 374895 378683 383366 388779 394803
62386 394803 401169 407541 413850 420368 427479 435531 444729 454813 464980 474625 484157 494596 506283
62373 506283 518528 530663 542850 555601 569078 583285 598468 614789 632026 650192 670165
62362 670165 693047 719004 747403 778100 812007 850215 893022 940057 990934 1045356 1102638
62351 1102638 1161323 1219295 1274283 1324341 1367931 1403684 1430395 1447479 1455322 1454980 1447609 1434179
62339 1434179 1415346 1391264 1361797 1327407 1289668 1250461 1210717 1170394 1129627 1089328 1050623
$$ packed form
62436C74965l92R96J579R52k37r47q56o21q79j318j213o00l00p05j202r85p2P51
62418C68916P41k14j559k408k231j392q33r71j185o76M25J209J138N33l1l22k83
62401C60857K40J113J702J487Q09M78P57J206J520J953K773L788M683N413O024
62386C94803O366O372O309O518P111Q052R198J0084J0167R645R532J0439J1687
62373E06283J2245J2135J2187J2751J3477J4207J5183J6321J7237J8166J9973
62362F70165K2882K5957K8399L0697L3907L8208M2807M7035N0877N4422N7282
62351A102638N8685N7972N4988N0058M3590L5753K6711J7084P843l42p371j3430
62339A434179j8833k4082k9467l4390l7739l9207l9744m0323m0767m0299l8705
$$ plain form
62328 1050623 1014207 980380 949160 920073 892289 865311 839276 814369 790273 766504 742939
62317 742939 719700 696788 674290 652725 632758 614552 597755 582066 567487 554058 541706
62306 541706 530469 520599 512277 505372 499571 494688 490803 488141 486726 486081 485436 484507 484000 484993 487719
62291 487719 491235 494468 497350 500713 505124 510111 514545 517699 519910 522297 525788 530369 535218 539565
62277 539565 543290 546709 550059 553437 557111 561493 566790 572958 580098 588593 598691 610225 623118
62264 623118 638004 655995 677750 702998 731063 761761 795782 834301 878143 927163 980417
62253 980417 1037003 1096542 1158584 1221664 1283283 1340772 1391802 1434155 1465800 1485731 1494427 1493064
62241 1493064 1482459 1463134 1436079 1402789 1364450 1321516 1274252 1223384 1170130 1115919 1062226
$$ packed form
62328A050623l6416l3827l1220k9087k7784k6978k6035k4907k4096k3769k3565
62317G42939k3239k2912k2498k1565j9967j8206j6797j5689j4579j3429j2352
62306E41706j1237r870q322o905n801m883l885k662j415o45o45r29n07R93K726
62291D87719L516L233K882L363M411M987M434L154K211K387L491M581M849M347
62277E39565L725L419L350L378L674M382N297O168P140Q495J0098J1534J2893
62264F23118J4886J7991K1755K5248K8065L0698L4021L8519M3842M9020N3254
62253I80417N6586N9539O2042O3080O1619N7489N1030M2353L1645J9931Q696j363
62241A493064j0605j9325k7055l3290l8339m2934m7264n0868n3254n4211n3693
$$ plain form
62230 1062226 1010425 961525 916017 873959 835074 798870 765079 734141 706930 683726 663624
62219 663624 645273 628088 612441 598759 586852 576280 566979 559110 552389 545965 539172 532211 525966
62206 525966 521192 517967 515763 513901 512055 510574 510354 512137 515850 520749 526231 532375 539754 548975
62192 548975 560477 574413 590444 607878 626339 646196 667993 691514 715683 739464 762571
62181 762571 785219 807382 828524 847888 864789 878616 888831 895365 899167 902175 906451 913241
62169 913241 922963 935899 952550 973269 998035 1026906 1060341 1098667 1141273 1186624 1232897 1278262
62157 1278262 1320634 1357663 1387248 1408061 1419688 1422547 1417535 1405460 1386705 1361579 1330849 1295638
62145 1295638 1256808 1214794 1170094 1123727 1077155 1031929 989268 949679 913038 879312 849054
$$ packed form
62230A062226n1801m8900m5508m2058l8885l6204l3791l0938k7211k3204k0102
62219F63624j8351j7185j5647j3682j1907j0572r301p869o721o424o793o961o245
62206E25966m774l225k204j862j846j481k20J783L713M899N482O144P379R221
62192E48975J1502J3936J6031J7434J8461J9857K1797K3521K4169K3781K3107
62181G62571K2648K2163K1142J9364J6901J3827J0215O534L802L008M276O790
62169I13241R722J2936J6651K0719K4766K8871L3435L8326M2606M5351M6273M5365
62157A278262M2372L7029K9585K0813J1627K859n012j2075j8755k5126l0730l5211
62145A295638l8830m2014m4700m6367m6572m5226m2661l9589l6641l3726l0258
$$ plain form
62134 849054 822815 800248 780318 762386 746496 732645 720523 710153 702002 696021 691241 686940
62122 686940 683615 682156 682532 684164 687360 693483 703599 717574 734512 753347 772795 791310 807539
62109 807539 820689 830453 836986 841029 843617 845424 846576 846989 846363 843769 837884 828082 814968 799749
62095 799749 783545 767652 753761 743157 735844 731076 728617 728972 732466 738742 747386 758562 772780
62082 772780 790264 810748 833734 858816 885854 914877 945691 977654 1010100 1043030 1077060
62071 1077060 1112488 1148517 1183492 1215812 1244679 1270271 1293408 1314969 1335467 1355165 1374452
62060 1374452 1393803 1413209 1431839 1448362 1461481 1470162 1473679 1471781 1464775 1453257 1437811 1418975
62048 1418975 1397278 1373031 1346109 1316138 1282924 1246698 1208118 1168181 1128018 1088542 1050274
$$ packed form
62134H49054k6239k2567j9930j7932j5890j3851j2122j0370q151n981m780m301
62122F86940l325j459L76J632L196O123J0116J3975J6938J8835J9448J8515J6229
62109H07539J3150R764O533M043K588J807J152M13o26k594n885r802j3114j5219
62095G99749j6204j5893j3891j0604p313m768k459L55L494O276Q644J1176J4218
62082G72780J7484K0484K2986K5082K7038K9023L0814L1963L2446L2930L4030
62071A077060L5428L6029L4975L2320K8867K5592K3137K1561K0498J9698J9287
62060A374452J9351J9406J8630J6523J3119Q681L517j898p006j1518j5446j8836
62048A418975k1697k4247k6922k9971l3214l6226l8580l9937m0163l9476l8268
$$ plain form
62037 1050274 1013608 979082 947196 918034 891337 866959 845092 826008 809787 796367 785758
62026 785758 778083 773344 771112 770427 770147 769476 768023 765310 760496 752898 742624 730437 717076 703017
62012 703017 688808 675199 662835 652147 643632 637917 635307 635552 638328 643822 652619 665041 680734
61999 680734 698806 718175 737797 756712 773957 788499 799338 805763 807637 805442 799988 791916
61987 791916 781412 768475 753407 736806 719045 700156 680429 660751 641947 624106 607037
61976 607037 591102 576985 564808 554197 545204 538299 533300 529163 525251 522067 520146 518921 517443
61963 517443 515853 515280 516494 519388 523689 529406 536382 544065 552054 560526 569926 580462 592135 605055
61949 605055 619608 636366 655826 678162 703310 731461 763400 800217 842772 891515 946570
$$ packed form
62037A050274l6666l4526l1886k9162k6697k4378k1867j9084j6221j3420j0609
62026G85758p675m739k232o85k80o71j453k713m814p598j0274j2187j3361j4059
62012G03017j4209j3609j2364j0688q515n715k610K45K776N494Q797J2422J5693
61999F80734J8072J9369J9622J8915J7245J4542J0839O425J874k195n454q072
61987G91916j0504j2937j5068j6601j7761j8889j9727j9678j8804j7841j7069
61976F07037j5935j4117j2177j0611q993o905m999m137l912l184j921j225j478
61963E17443j590n73J214K894M301N717O976P683P989Q472R400J0536J1673J2920
61949F05055J4553J6758J9460K2336K5148K8151L1939L6817M2555M8743N5055
$$ plain form
61938 946570 1007595 1073648 1143495 1216070 1290468 1365698 1440796 1515173 1588514 1660234 1729206
61927 1729206 1793954 1852977 1905058 1949464 1985740 2013061 2030097 2035911 2030909 2016603 1994749 1967254
61915 1967254 1936769 1906564 1879489 1857396 1841730 1834211 1836608 1849964 1874104 1907749 1949071 1996332
61903 1996332 2047890 2101348 2152827 2197558 2231314 2251280 2256061 2245640 2221297 2184881 2137989
61892 2137989 2082238 2020095 1954457 1887131 1818537 1749260 1681061 1615780 1554007 1495502 1440382
61881 1440382 1388966 1340854 1295068 1251077 1208958 1168693 1130121 1093743 1060828 1032354 1008293
61870 1008293 988165 971878 959663 951480 946959 945938 948790 956050 967789 983535 1002967 1026593
61858 1026593 1055486 1090343 1131177 1178091 1231942 1293889 1364566 1444091 1532565 1629948 1735508
$$ packed form
61938I46570O1025O6053O9847P2575P4398P5230P5098P4377P3341P1720O8972
61927A729206O4748N9023N2081M4406L6276K7321J7036N814n002j4306k1854k7495
61915A967254l0485l0205k7075k2093j5666p519K397J3356K4140L3645M1322M7261
61903A996332N1558N3458N1479M4731L3756J9966M781j0421k4343l6416m6892
61892B137989n5751o2143o5638o7326o8594o9277o8199o5281o1773n8505n5120
61881A440382n1416m8112m5786m3991m2119m0265l8572l6378l2915k8474k4061
61870A008293k0128j6287j2215q183m521j021K852P260J1739J5746J9432K3626
61858A026593K8893L4857M0834M6914N3851O1947P0677P9525Q8474R7383J05560
$$ plain form
61847 1735508 1847964 1966191 2089189 2215075 2340544 2461609 2574631 2676450 2763934 2833932
61837 2833932 2883815 2912036 2918535 2905000 2874807 2832432 2782710 2730441 2680299 2636615 2603019
61826 2603019 2582278 2576256 2585652 2609469 2644866 2687750 2733590 2777699 2815000 2840172 2848557 2837161
61814 2837161 2804884 2752135 2680474 2592413 2490992 2379295 2260499 2138231 2016282 1897558
61804 1897558 1783481 1674680 1572067 1476887 1389797 1310326 1237379 1170212 1108883 1053827 1005003
61793 1005003 961453 921821 885336 852044 821990 794577 769129 745802 725398 708235 693672
61782 693672 680822 669272 658925 649575 641056 633556 627338 622191 617531 613037 608880 605227 601864
61769 601864 598525 595393 592841 590774 588616 586154 584039 583117 583397 584012 584198 583990 583902 584236 584844 585385 585646
$$ packed form
61847A735508J12456J18227J22998J25886J25469J21065J13022J01819Q7484O9998
61837B833932M9883K8221O499j3535l0193m2375m9722n2269n0142m3684l3596
61826B603019k0741o022R396K3817L5397M2884M5840M4109L7301K5172Q385j1396
61814B837161l2277n2749p1661q8061j01421j11697j18796j22268j21949j18724
61804A897558j14077j08801j02613r5180q7090p9471p2947o7167o1329n5056m8824
61793A005003m3550l9632l6485l3292l0054k7413k5448k3327k0404j7163j4563
61782F93672j2850j1550j0347r350q519p500o218n147m660m494m157l653l363
61769F01864l339l132k552k067k158k462k115r22K80O15J86k08q8L34O08N41K61
$$ plain form
61752 585646 585678 585648 585513 585008 584157 583625 584086 585266 586135 586182 585843 585432 584316 581837 578542 575696 573793 572328
61734 572328 571005 570280 570534 571444 572575 574056 576175 578722 581282 584058 587918 593524 600611 608215 615549
61719 615549 622668 630242 638557 646829 653712 658509 661628 663857 665526 666439 666190 664216 659814 652532 642591
61704 642591 630817 618224 605656 593527 581730 570026 558680 548423 539605 531763 524428 517979
61692 517979 513120 509618 506240 502076 497449 493327 490241 487993 486122 484349 482684 481276 480095 478784
61678 478784 477103 475450 474572 474605 474870 474819 474752 475180 475929 476439 476657 476922 477085 476471 474871 472974 471544 470674
61660 470674 470093 469755 469788 470288 471536 474006 477709 481866 485741 489545 494041 499538 505917 513389 522431
61645 522431 532911 544052 555506 567783 581257 595325 608987 621817 633802 644463 652706 657517
$$ packed form
61752E85646L2l0j35n05q51n32M61J180Q69M7l39m11j116k479l295k846j903j465
61734E72328j323p25K54R10J131J481K119K547K560K776L860N606P087P604P334
61719F15549P119P574Q315Q272O883M797L119K229J669R13k49j974m402p282r941
61704F42591j1774j2593j2568j2129j1797j1704j1346j0257q818p842p335o449
61692E17979m859l502l378m164m627m122l086k248j871j773j665j408j181j311
61678D78784j681j653q78L3K65n1o7M28P49N10K18K65J63o14j600j897j430q70
61660D70674n81l38L3N00J248K470L703M157L875L804M496N497O379P472R042
61645E22431J0480J1141J1454J2277J3474J4068J3662J2830J1985J0661Q243M811
$$ plain form
61633 657517 658483 655731 649735 641228 631066 620093 609074 598543 588588 579025 569966 561988 555555
61620 555555 550568 546694 543848 542067 541247 541377 542688 545085 547620 549088 549030 547634 544837 540146 533356
61605 533356 524762 514596 502872 489950 476659 463574 450790 438672 428138 419655 412430 405177
61593 405177 397405 389488 381897 375021 369437 365512 362714 360055 357313 355100 353536 351627 348506 344708
61579 344708 341494 339179 336874 333904 330740 328225 326409 324668 322738 321065 320062 319440 318558 317169 315571
61564 315571 314117 312906 311987 311551 311731 312322 312879 313109 313084 313085 313298 313645 313912 314044 314349 315251 316777 318378
61546 318378 319452 319998 320581 321589 322737 323497 323936 324886 327202 330966 335573 340505 345821 351838 358485
61531 358485 365148 371060 375686 378801 380458 380951 380598 379387 376924 372945 367836 362489 357648 353468 349666
$$ packed form
61633F57517R66k752n996q507j0162j0973j1019j0531r955r563r059p978o433
61620E55555m987l874k846j781q20J30J311K397K535J468n8j396k797m691o790
61605E33356q594j0166j1724j2922j3291j3085j2784j2118j0534q483p225p253
61593D05177p772p917p591o876n584l925k798k659k742k213j564j909l121l798
61579C44708l214k315k305k970l164k515j816j741j930j673j003o22q82j389j598
61564C15571j454j211r19m36J80N91N57K30k5JK13L47K67J32L05R02J526J601
61546C18378J074N46N83J008J148P60M39R50K316L764M607M932N316O017O647
61531C58485O663N912M626L115J657M93l53j211k463l979n109n347m841m180l802
$$ plain form
61516 349666 345932 342201 338699 335764 333518 331679 329807 327746 325728 324058 322888 322242 321992 321754 321163
61501 321163 320354 319822 319605 319016 317588 315938 315121 315323 315773 315821 315452 314743 313618 312387 311803 312150 312779 313002
61483 313002 312943 313019 313105 312857 312494 312539 313033 313685 314584 315996 317589 318659 319176 319823 320888 321869 322417 322893 323603
61464 323603 324108 323822 322875 321981 321754 322377 323538 324466 324526 324100 324344 325737 327412 328349 328671 329201 330246 331561
61446 331561 333108 335074 337327 339569 341921 344693 347768 350976 355022 361133 369570 379184 388741 398048
61432 398048 407435 416773 425596 433865 441967 449997 457530 464219 470341 476499 482918 489312 495529 502058
61418 502058 509542 517843 526000 533181 539201 543927 546761 547254 545819 543181 539303 533484 525489 516018
61404 516018 506103 496502 487626 479424 471291 462651 453808 445750 439003 433183 427730 422600 418011 414100
$$ packed form
61516C49666l734l731l502k935k246j839j872k061k018j670j170o46k50k38n91
61501C21163q09n32k17n89j428j650q17K02M50M8l69p09j125j231n84L47O29K23
61483C13002n9P6Q6k48l63M5M94O52Q99J412J593J070N17O47J065R81N48M76P10
61464C23603N05k86r47q94k27O23J161R28O0m26K44J393J675R37L22N30J045J315
61446C31561J547J966K253K242K352K772L075L208M046O111Q437R614R557R307
61432C98048R387R338Q823Q269Q102Q030P533O689O122O158O419O394O217O529
61418E02058P484Q301Q157P181O020M726K834M93j435k638l878n819p995r471
61404E16018r915r601q876q202q133q640q843q058o747n820n453n130m589l911
$$ plain form
61390 414100 411065 409181 408294 407699 406869 406043 405775 406152 406780 407371 408017 408979 410406 412210 414154 416122 418301
61373 418301 420910 423858 426931 430221 433993 438183 442495 446995 452023 457401 462327 466314 469750 473293
61359 473293 477277 482032 488137 495804 504459 513546 523403 534800 547906 562359 578145 595722 615246
61346 615246 636232 658055 680374 703052 725941 748796 771099 792131 811539 829692 847034
61335 847034 863178 877120 888244 896537 901762 903120 900042 892841 882234 868690 852714 835472
61323 835472 818445 802423 787279 772866 759685 748347 738597 729370 719891 710413 701688 693993 687035
61310 687035 680643 675077 670465 666375 662308 658507 655938 655410 656849 659429 662259 664934 667550 670210
61296 670210 672473 673338 671873 667918 662221 655987 650217 645242 640677 635898 630754 625819 621891 619261
$$ packed form
61390D14100l035j884q87n95q30q26k68L77O28N91O46R62J427J804J944J968K179
61373D18301K609K948L073L290L772M190M312M500N028N378M926L987L436L543
61359D73293L984M755O105P667Q655R087R857J1397J3106J4453J5786J7577J9524
61346F15246K0986K1823K2319K2678K2889K2855K2303K1032J9408J8153J7342
61335H47034J6144J3942J1124Q293N225J358l078p201j0607j3544j5976j7242
61323H35472j7027j6022j5144j4413j3181j1338r750r227r479r478q725p695o958
61310F87035o392n566m612m090m067l801k569n28J439K580K830K675K616K660
61296F70210K263Q65j465l955n697o234n770m975m565m779n144m935l928k630
$$ plain form
61282 619261 617623 616684 616732 618517 622540 628531 635695 643508 652107 661770 672152 682373 692023 701837
61268 701837 713104 726394 741024 755798 770204 784770 800345 817337 835868 856511 880309
61257 880309 907866 938702 971759 1006208 1041400 1076292 1109436 1139517 1165511 1186441 1201395
61246 1201395 1209824 1211467 1206169 1194226 1176757 1155146 1130067 1101626 1070425 1037832 1005093 972917
61234 972917 942077 913647 888155 865137 843938 824469 806780 790606 775864 763087 752710
61223 752710 744348 737371 731708 727404 723821 720121 716343 713192 710886 708983 707275 706056 705413 704932 704335
61208 704335 703806 703504 703265 702918 702394 701367 699355 696564 694247 693806 695745 699815 705973 714811 726933
61193 726933 742162 759582 778458 798930 821534 845970 870676 893785 914253 931929 947042
$$ packed form
61282F19261j638r39M8J785M023N991P164P813Q599R663J0382J0221R650R814
61268G01837J1267J3290J4630J4774J4406J4566J5575J6992J8531K0643K3798
61257H80309K7557L0836L3057L4449L5192L4892L3144L0081K5994K0930J4954
61246A201395Q429J643n298j1943j7469k1611k5079k8441l1201l2593l2739l2176
61234I72917l0840k8430k5492k3018k1199j9469j7689j6174j4742j2777j0377
61223G52710q362o977n663m304l583l700l778l151k306j903j708j219o43m81n97
61208G04335n29l02k39l47n24j027k012k791k317m41J939M070O158Q838J2122
61193G26933J5229J7420J8876K0472K2604K4436K4706K3109K0468J7676J5113
$$ plain form
61182 947042 960161 972311 984405 996478 1007955 1018736 1029518 1040909 1052596 1063576 1073001 1080663
61170 1080663 1086869 1091944 1095818 1098048 1098223 1096138 1091449 1083546 1072138 1057751 1041246 1023010 1003039
61157 1003039 981602 959310 936663 914138 892691 873547 857255 843366 831181 820424 811090
61146 811090 803077 796156 789925 783662 776539 768139 758465 747448 734904 721095 706827 692731 678866
61133 678866 665374 653105 643164 636002 631290 628511 627335 627569 629118 632130 636984 644001 653203 664356
61119 664356 677237 691887 708604 727555 748454 770747 794139 818740 844569 871026 897054
61108 897054 921940 945896 969675 993509 1016621 1038031 1057630 1075928 1092738 1106742 1116707 1122588
61096 1122588 1124982 1123929 1118879 1109629 1096706 1080971 1063329 1044699 1025677 1006239 986164 965660
$$ packed form
61182I47042J3119J2150J2094J2073J1477J0781J0782J1391J1687J0980R425P662
61170A080663O206N075L874K230J75k085m689p903j1408j4387j6505j8236j9971
61157A003039k1437k2292k2647k2525k1447j9144j6292j3889j2185j0757r334
61146H11090q013o921o231o263p123q400r674j1017j2544j3809j4268j4096j3865
61133F78866j3492j2269r941p162m712k779j176K34J549L012M854P017R202J1153
61119F64356J2881J4650J6717J8951K0899K2293K3392K4601K5829K6457K6028
61108H97054K4886K3956K3779K3834K3112K1410J9599J8298J6810J4004R965N881
61096A122588K394j053n050r250j2923j5735j7642j8630j9022j9438k0075k0504
$$ plain form
61084 965660 945174 924870 904836 885643 868001 851926 836821 822296 808291 794559 780881
61073 780881 767872 756688 747637 739744 732037 724598 718039 712543 707965 704424 702316 701853 702859 704854
61059 704854 707320 710191 714037 719358 725745 732356 739210 747326 757374 768906 781262 794561 809411
61046 809411 826118 844668 865045 887186 910865 935924 962387 990279 1019762 1051411 1085712
61035 1085712 1122119 1159342 1196879 1235595 1276480 1319537 1364384 1411250 1460754 1513172 1568488
61024 1568488 1626758 1687882 1751268 1816098 1881732 1947898 2015260 2086182 2164221 2252373 2352261
61013 2352261 2465220 2593173 2737856 2900117 3081024 3283553 3513177 3777923 4088569
61004 4088569 4458026 4900131 5430453 6069656 6845886 7794439 8957710 10386169 12134414
$$ packed form
61084I65660k0486k0304k0034j9193j7642j6075j5105j4525j4005j3732j3678
61073G80881j3009j1184r051p893p707p439o559n496m578l541k108m63J006J995
61059G04854K466K871L846N321O387O611O854Q116J0048J1532J2356J3299J4850
61046H09411J6707J8550K0377K2141K3679K5059K6463K7892K9483L1649L4301
61035A085712L6407L7223L7537L8716M0885M3057M4847M6866M9504N2418N5316
61024A568488N8270O1124O3386O4830O5634O6166O7362P0922P8039Q8152R9888
61013B352261J12959J27953J44683J62261J80907K02529K29624K64746L10646
61004D088569L69457M42105N30322O39203P76230R48553J163271J428459J748245
$$ plain form
60995 12134414 14248258 16747369 19606282 22727098 25907126 28837698 31178517 32696469
60987 32696469 33382435 33455494 33251488 33081773 33144133 33491633 34020744 34474719 34504054 33799095
60977 33799095 32230441 29901110 27078395 24066687 21109594 18359086 15890251 13726727
60969 13726727 11861426 10271771 8929266 7803314 6862847 6078725 5425447 4880457 4423011
60960 4423011 4034818 3701273 3411273 3156351 2930488 2729871 2551695 2393212 2252171
60951 2252171 2127410 2018164 1923043 1840084 1767249 1702208 1642095 1584265 1527237 1470584 1414292
60940 1414292 1358751 1304922 1253710 1205237 1159100 1115102 1073249 1033330 995147 958992 925390
60929 925390 894404 865668 839009 814553 792239 771678 752588 735063 719428 706018 694998
$$ packed form
60995A2134414K113844K499111K858913L120816L180028K930572K340819J517952
60987C2696469O85966P3059k04006j69715O2360L47500N29111M53975K9335p04959
60977C3799095j568654k329331k822715l011708k957093k750508k468835k163524
60969A3726727j865301j589655j342505j125952r40467p84122o53278n44990m57446
60960D423011l88193l33545k90000k54922k25863k00617j78176j58483j41041
60951B252171j24761j09246r5121q2959p2835o5041o0113n7830n7028n6653n6292
60940A414292n5541n3829n1212m8473m6137m3998m1853l9919l8183l6155l3602
60929I25390l0986k8736k6659k4456k2314k0561j9090j7525j5635j3410j1020
$$ plain form
60918 694998 686077 678436 671239 664238 657739 652115 647500 643732 640368 636917 633366 630253 627948 626076
60904 626076 623971 621506 619035 616655 613963 610544 606325 601450 596189 590990 586231 581760 576920 571183
60890 571183 564652 557896 551438 545436 539724 534103 528582 523313 518291 513299 508220 503205 498436 493932
60876 493932 489829 486572 484535 483506 482859 482205 481681 481713 482661 484574 487116 489845 492776 496477 501312 506808
60860 506808 512127 517011 521864 527025 532394 537733 542818 547263 550724 553451 556186 559243 562070 564075
60846 564075 565517 567213 569541 572091 574162 575178 574626 572073 567517 561610 555302 549211 543386 537660
60832 537660 532194 527584 524371 522387 520767 518787 516725 515798 517071 520434 524759 529085 533590 539294
60818 539294 546914 556192 566352 576944 588136 600358 613912 628849 644961 661865 679265 697226
$$ packed form
60918F94998q921p641p197p001o499n624m615l768l364l451l551l113k305j872
60904F26076k105k465k471k380k692l419m219m875n261n199m759m471m840n737
60890E71183o531o756o458o002n712n621n521n269n022m992n079n015m769m504
60876D93932m103l257k037j029o47o54n24L2R48J913K542K729K931L701M835N496
60860E06808N319M884M853N161N369N339N085M445L461K727K735L057K827K005
60846E64075J442J696K328K550K071J016n52k553m556n907o308o091n825n726
60832E37660n466m610l213j984j620j980k062r27J273L363M325M326M505N704
60818E39294P620R278J0160J0592J1192J2222J3554J4937J6112J6904J7400J7961
$$ plain form
60806 697226 716080 735978 756549 776943 796070 812890 826752 837587 845676 851223 854257 854917
60794 854917 853503 850072 844247 835713 824829 812500 799478 786025 772206 758205 744243 730397
60782 730397 716593 702656 688386 673825 659503 646148 634019 622768 612079 602092 592907 584054
60770 584054 574960 565772 557153 549260 541432 533018 524110 515331 507290 500357 494467 488971 483134 477028
60756 477028 471401 466389 461032 454604 447844 442032 437244 432539 427698 423685 421152 419486 417840 416343
60742 416343 415625 415642 415589 414734 412820 409858 406096 402107 398498 395480 393001 391173 390309 390596 392028 394451
60726 394451 397477 400479 403018 405185 407220 408919 409788 409766 409431 409433 409936 410569 410636 409416 406628 402716 398489
60709 398489 394360 390132 385474 380322 374787 369054 363528 358772 355069 352166 349574 346995 344396 341962
$$ packed form
60806F97226J8854J9898K0571K0394J9127J6820J3862J0835Q089N547L034O60
60794H54917j414l431n825q534j0884j2329j3022j3453j3819j4001j3962j3846
60782G30397j3804j3937j4270j4561j4322j3355j2129j1251j0689r987r185q853
60770E84054r094r188q619p893p828q414q908q779q041o933n890n496n837o106
60756D77028n627n012n357o428o760n812m788m705m841m013k533j666j646j497
60742D16343p18J7n3q55j914k962l762l989l609l018k479j828q64K87J432K423
60726C94451L026L002K539K167K035J699Q69k2l35KN03O33O7j220k788l912m227
60709C98489m129m228m658n152n535n733n526m756l703k903k592k579k599k434
$$ plain form
60695 341962 340056 338901 338054 336499 333643 330120 327240 325720 325228 325058 324872 324731 324812 325311 326394 328118
60679 328118 330425 333282 336601 340118 343645 347409 351632 355667 358118 358328 357360 357002 357932 359434 360676
60664 360676 361613 362567 363636 364819 366261 368054 370124 372538 375582 379362 383640 388298 393517 399250 404996
60649 404996 410560 416542 423481 430812 437368 442773 447628 452222 455740 456982 455511 451904 447226 442383
60635 442383 437704 432942 427804 422460 417297 412315 407198 402031 397432 393838 391046 388663 386596 384818
60621 384818 383043 381014 378924 377214 376040 375196 374555 374336 374866 376088 377360 377864 377370 376542 376243 376674
60605 376674 377430 378323 379673 381684 383937 385708 386555 386449 385653 384665 384037 384011 384432 385019 385538 385726 385408 384775
60587 384775 384288 384230 384687 385942 388374 391791 395318 398222 400507 402550 404639 407154 410687 415544 421424
$$ packed form
60695C41962j906j155q47j555k856l523k880j520m92j70j86j41Q1M99J083J724
60679C28118K307K857L319L517L527L764M223M035K451K10r68l58R30J502J242
60664C60676R37R54J069J183J442J793K070K414L044L780M278M658N219N733N746
60649D04996N564N982O939P331O556N405M855M594L518J242j471l607m678m843
60635D42383m679m762n138n344n163m982n117n167m599l594k792k383k067j778
60621C84818j775k029k090j710j174q44o41k19N30J222J272N04m94q28k99M31
60605C76674P56Q93J350K011K253J771Q47j06p96r88o28k6M21N87N19J88l18o33
60587C84775m87n8M57J255K432L417L527K904K285K043K089K515L533M857N880
$$ plain form
60572 421424 427974 435338 443833 453454 464199 476579 491331 508747 528675 550975 575549 602070
60560 602070 629906 658028 684611 707100 723253 732161 734023 729314 718692 703475 685610 667197
60548 667197 650204 636241 626006 619171 615390 615129 618956 626413 636503 649194 665513 686136 710846
60535 710846 739545 772798 810685 851639 892790 931025 963546 988187 1003960 1011054 1010089 1001782
60523 1001782 987692 970564 953049 936183 919639 903280 887843 874088 861905 850653 840202
60512 840202 831412 825505 823004 823403 825923 830432 837268 846311 856814 868383 881689 897972 918391
60499 918391 944179 976882 1017665 1066626 1123516 1189062 1264702 1350676 1444883 1543937 1644770
60488 1644770 1744680 1840285 1927354 2001952 2061345 2103691 2127462 2131676 2116444 2082751 2031727
$$ packed form
60572D21424O550P364Q495R621J0745J2380J4752J7416J9928K2300K4574K6521
60560F02070K7836K8122K6583K2489J6153Q908J862m709j0622j5217j7865j8413
60548F67197j6993j3963j0235o835l781k61L827P457J0090J2691J6319K0623K4710
60535G10846K8699L3253L7887M0954M1151L8235L2521K4641J5773P094r65q307
60523A001782j4090j7128j7515j6866j6544j6359j5437j3755j2183j1252j0451
60512H40202q790n907k501L99K520M509O836R043J0503J1569J3306J6283K0419
60499I18391K5788L2703M0783M8961N6890O5546P5640Q5974R4207R9054J00833
60488A644770R9910R5605Q7069P4598N9393M2346K3771M214j5232l3693n1024
$$ plain form
60477 2031727 1964536 1882962 1789639 1687675 1580531 1472338 1367474 1269084 1178170 1094514
60467 1094514 1018116 949288 887830 833067 784655 742582 706306 674643 646748 622485 601582
60456 601582 583082 566060 550354 536182 523486 512071 501911 492853 484415 476413 469439 464160
60444 464160 460361 457227 454362 451984 450218 448774 447347 445871 444315 442603 440778 438995 437392 436217
60430 436217 435900 436509 437222 436799 434695 431366 427515 423507 419547 415935 412880 410382 408459 407252 406746
60415 406746 406675 406804 407066 407309 407238 406785 406285 406057 405983 405670 404911 403910 403222 403494 404963 407018 408541 408929
60397 408929 408637 408586 409244 410438 411828 413184 414345 415226 415952 416809 418037 419703 421667 423539 424817 425277
60381 425277 425216 425150 425349 425787 426452 427468 428899 430620 432384 433917 435035 435866 436981 439053 442280 446215
$$ packed form
60477B031727o7191q1574r3323j01964j07144j08193j04864r8390r0914q3656
60467A094514p6398o8828o1458n4763m8412m2073l6276l1663k7895k4263k0903
60456F01582j8500j7022j5706j4172j2696j1415j0160r058q438q002o974n279
60444D64160l799l134k865k378j766j444j427j476j556j712j825j783j603j175
60430D36217l17O09P13m23k104l329l851m008l960l612l055k498j923j207n06
60415D06746p1J29K62K43p1m53n00k28p4l13p59j001o88K72J469K055J523L88
60397D08929k92n1O58J194J390J356J161Q81P26Q57J228J666J964J872J278M60
60381D25277o1o6J99M38O65J016J431J721J764J533J118Q31J115K072L227L935
$$ plain form
60365 446215 450186 453765 456858 459533 461876 463907 465486 466386 466520 466098 465455 464740 463820 462546 461090 459927
60349 459927 459423 459511 459903 460561 461748 463580 465814 468260 471132 474645 478423 481729 484275 486355 488092
60334 488092 489057 488983 488515 488737 490035 491778 493145 493926 494490 495301 496640 498512 500569 502190 502864 502586 501774
60317 501774 500830 499850 498758 497586 496561 495964 496075 497325 500365 505710 513204 522113 532004 543570 558370
60302 558370 577728 601976 630648 663015 698014 733707 767235 795649 816856 829675 833165 826393
60290 826393 809328 783863 753482 721629 690478 661152 634545 611406 591829 575171 560619
60279 560619 547598 535801 525230 516240 509112 503427 498236 493013 488110 484049 480799 478096 476150
60266 476150 475479 476084 477254 478265 478940 479464 479971 480518 481274 482492 484226 486101 487436 487694 486937 485732
$$ packed form
60365D46215L971L579L093K675K343K031J579R00J34m22o43p15r20j274j456j163
60349D59927n04Q8L92O58J187J832K234K446K872L513L778L306K546K080J737
60334D88092R65p4m68K22J298J743J367P81N64Q11J339J872K057J621O74k78q12
60317E01774r44r80j092j172j025n97J11J250L040N345P494Q909R891J1566J4800
60302E58370J9358K4248K8672L2367L4999L5693L3528K8414K1207J2819L490o772
60290H26393j7065k5465l0381l1853l1151k9326k6607k3139j9577j6658j4552
60279E60619j3021j1797j0571q990p128n685n191n223m903m061l250k703j946
60266D76150o71O05J170J011O75N24N07N47P56J218J734J875J335K58p57j205
$$ plain form
60250 485732 484515 483139 481217 478820 476555 474929 473799 472564 470746 468407 466145 464769 464763 465871 467249
60235 467249 468162 468558 468979 469943 471521 473408 475317 477235 479405 482110 485438 489141 492706 495623 497667
60220 497667 498923 499511 499402 498562 497260 496094 495743 496698 499106 502629 506458 509689 511865 513139 514008 514995
60204 514995 516452 518317 520035 521086 521726 522867 525040 527713 529897 531170 531804 532129 532190 532004 531784 531796
60188 531796 532166 532800 533335 533211 532013 529804 527035 524196 521595 519314 517177 514944 512746 511183 510707
60173 510707 511037 511467 511704 512029 512739 513815 515208 516997 519028 520753 521723 522118 522499 523104 523673 524022 524560
60156 524560 526004 528538 531532 534263 536797 539825 543681 547902 551962 556036 560794 566667 573673 581696
60142 581696 590554 599912 609488 619299 629376 639426 649090 658419 667667 676734 685222 692907 699644 704840
$$ packed form
60250D85732j217j376j922k397k265j626j130j235j818k339k262j376oJ108J378
60235D67249R13L96M21R64J578J887J909J918K170K705L328L703L565K917K044
60220D97667J256N88j09q40j302j166l51R55K408L523L829L231K176J274Q69R87
60204E14995J457J865J718J051O40J141K173K673K184J273O34L25O1j86k20J2
60188E31796L70O34N35j24j198k209k769k839k601k281k137k233k198j563m76
60173E10707L30M30K37L25P10J076J393J789K031J725R70L95L81O05N69L49N38
60156E24560J444K534K994K731K534L028L856M221M060M074M758N873P006Q023
60142E81696Q858R358R576R811J0077J0050R664R329R248R067Q488P685O737N196
$$ plain form
60128 704840 707701 708067 706412 702881 697003 688749 679241 669858 661007 652437 644513 638404 634817 633015
60114 633015 631467 629320 626950 625157 624132 623417 622676 622104 621981 622225 622671 623446 624529 625124 624113 621296
60098 621296 617671 614257 611061 607554 603796 600585 598552 597519 596937 596780 597764 600518 604720 609346 613899
60083 613899 619050 625727 633820 642217 649961 656899 663202 668716 672888 674984 674419 671252 666336 660581
60069 660581 654130 646705 638625 630807 623763 617305 611330 606059 601182 595601 588561 580484 572191 563874
60055 563874 555447 547373 540385 534619 529670 525334 521779 519082 517060 515465 514032 512528 511143 510652
60041 510652 511781 514527 518373 522839 527449 531477 534317 535999 536935 537248 536672 534933 531842 527272 521528
60026 521528 515534 510181 505529 500972 495983 490335 483866 476641 469249 462413 456289 450559 445141 440360
$$ packed form
60128G04840K861L66j655l531n878q254r508r383q851q570p924o109l587j802
60114F33015j548k147k370j793j025p15p41n72j23K44M46P75J083N95j011k817
60098F21296l625l414l196l507l758l211k033j033n82j57R84K754M202M626M553
60083F13899N151O677Q093Q397P744O938O303N514M172K096n65l167m916n755
60069F60581o451p425q080p818p044o458n975n271m877n581p040q077q293q317
60055E63874q427q074o988n766m949m336l555k697k022j595j433j504j385m91
60041E10652J129K746L846M466M610M028K840J682R36L13n76j739l091m570n744
60026E21528n994n353m652m557m989n648o469p225p392o836o124n730n418m781
$$ plain form
60012 440360 436470 433391 430867 428558 426149 423729 421945 421358 421798 422735 424039 425872 427993 429797 430980
59997 430980 431690 432126 432511 433302 434821 436728 438451 440041 442035 444524 447107 449807 453298 458078 463946
59982 463946 470404 476957 482975 487951 492095 496057 499900 503039 505331 507498 510109 512855 515198 517176
59968 517176 519135 521239 523643 526585 529838 532638 534675 536710 539664 543499 547506 551295 554918 558340
59954 558340 561389 564005 565931 566364 564544 560710 555969 551231 546607 541840 536891 532001 527362 522804
59940 522804 517794 512028 506062 500993 497237 493976 490156 485687 481277 477489 474552 472823 472704 474058
59926 474058 476243 478820 481788 485097 488418 491551 494726 498290 502299 506529 510724 514831 519120 524036
59912 524036 529723 535705 541224 545896 549937 553917 558451 563915 570101 576264 581776 586649 591103 594835
$$ packed form
60012D40360l890l079k524k309k409k420j784n87M40R37J304J833K121J804J183
59997D30980P10M36L85P91J519J907J723J590J994K489K583K700L491M780N868
59982D63946O458O553O018M976M144L962L843L139K292K167K611K746K343J978
59968E17176J959K104K404K942L253K800K037K035K954L835M007L789L623L422
59954E58340L049K616J926M33j820l834m741m738m624m767m949m890m639m558
59940E22804n010n766n966n069l756l261l820m469m410l788k937j729j19J354
59926D74058K185K577K968L309L321L133L175L564M009M230M195M107M289M916
59912E24036N687N982N519M672M041L980M534N464O186O163N512M873M454L732
$$ plain form
59898 594835 597215 598131 598126 597581 596209 593610 590036 586349 583377 581433 580310 579641 579343 579707 580951 582809
59882 582809 584841 587051 589836 593303 597063 600854 604960 609751 615087 620431 625321 629422 632380 634000
59868 634000 634503 634269 633342 631526 629009 626533 624724 623465 622185 620658 619189 618023 616902 615446 613782
59853 613782 612453 611732 611343 610994 610971 612040 614888 619829 626859 635803 646311 657802 669287 679362
59839 679362 686746 691119 693216 693904 693503 692419 691963 693619 697276 700832 701885 699402 693615 685078 674502
59824 674502 663027 651694 640605 629292 617969 607733 599287 592060 585036 577980 571381 565537 560340
59811 560340 555807 552141 549128 545994 542126 537665 533194 529137 525642 522665 519845 516556 512529 508304
59797 508304 504710 501879 499115 495741 491793 487820 484277 481231 478423 475477 472182 468710 465490 462855
$$ packed form
59898E94835K380R16nn45j372k599l574l687k972j944j123o69k98L64J244J858
59882E82809K032K210K785L467L760L791M106M791N336N344M890M101K958J620
59868F34000N03k34r27j816k517k476j809j259j280j527j469j166j121j456j664
59853F13782j329p21l89l49k3J069K848M941P030Q944J0508J1491J1485J0075
59839F79362P384M373K097O88m01j084m56J656L657L556J053k483n787q537j0576
59824F74502j1475j1333j1089j1313j1323j0236q446p227p024p056o599n844n197
59811E60340m533l666l013l134l868m461m471m057l495k977k820l289m027m225
59797E08304l594k831k764l374l948l973l543l046k808k946l295l472l220k635
$$ plain form
59783 462855 460875 459462 458401 457277 455651 453430 450903 448367 445923 443641 441660 439992 438516 437314
59769 437314 436783 437215 438543 440623 443413 446566 449191 450542 450848 451012 451540 452225 452864 453739 455143 456867
59753 456867 458534 460234 462469 465573 469439 473787 478472 483454 488661 493937 499071 503903 508485 513106
59739 513106 518009 522955 527205 530077 531563 532277 532735 532779 531837 529686 526839 524117 521971 520257 518512
59724 518512 516313 513497 510305 507350 505236 503999 502895 500872 497351 492644 487716 483557 480673 479020
59710 479020 478315 478406 479360 481240 483824 486609 489122 491222 493096 494966 496837 498477 499602 500130 500284 500414
59694 500414 500637 500747 500543 500122 499620 498807 497331 495381 493703 492764 492291 491903 491734 492037 492468 492372 491643 490747
59676 490747 489906 488786 487060 484753 482010 479044 476460 474999 474706 474827 474724 474390 473796 472473 470291 468090
$$ packed form
59783D62855j980j413j061j124j626k221k527k536k444k282j981j668j476j202
59769D37314n31M32J328K080K790L153K625J351L06J64N28O85O39Q75J404J724
59753D56867J667J700K235L104L866M348M685M982N207N276N134M832M582M621
59739E13106M903M946M250K872J486P14M58M4r42k151k847k722k146j714j745
59724E18512k199k816l192k955k114j237j104k023l521m707m928m159k884j653
59710D79020p05R1R54J880K584K785K513K100J874J870J871J640J125N28J54J30
59694E00414K23J10k04m21n02q13j476j950j678r39m73l88j69L03M31r6p29q96
59676D90747q41j120j726k307k743k966k584j461k93J21j03l34n94j323k182k201
$$ plain form
59660 468090 466726 465849 464455 462461 460908 460586 461258 462419 464011 465977 467685 468402 468209 468046 468938 471237
59644 471237 474268 476498 476386 473565 469164 464759 461125 458178 455779 454008 452765 451701 450835 450811 452135
59629 452135 454394 456629 458385 459960 461590 462855 463195 462702 462017 461552 461164 460546 459614 458434 457102 455823
59613 455823 454850 454183 453553 452836 452260 452061 452177 452502 453185 454319 455557 456424 456978 457718 458771 459551 459425 458464
59595 458464 457359 456708 456592 456701 456725 456627 456654 457063 457750 458201 457915 456915 455812 455293 455530 456037 456053 455038 452796
59576 452796 449348 444908 440032 435502 431840 428936 426327 423794 421619 420316 420210 421184 422655 423829 424148
59561 424148 423640 422809 422229 422251 422941 424124 425518 426970 428608 430652 433108 435788 438618 441756 445350 449330
59545 449330 453558 458029 462774 467645 472433 477335 483214 491272 502450 517135 535227 556114 578280
$$ packed form
59660D68090j364q77j394j994j553l22O72J161J592J966J708P17j93j63Q92K299
59644D71237L031K230j12k821m401m405l634k947k399j771j243j064q66k4J324
59629D52135K259K235J756J575J630J265L40m93o85m65l88o18r32j180j332j279
59613D55823r73o67o30p17n76j99J16L25O83J134J238Q67N54P40J053P80j26r61
59595D58464j105o51j16J09K4r8K7M09O87M51k86j000j103n19K37N07J6j015k242
59576D52796l448m440m876m530l662k904k609k533k175j303j06R74J471J174L19
59561D24148n08q31n80K2O90J183J394J452J638K044K456K680K830L138L594L980
59545D49330M228M471M745M871M788M902N879Q058J1178J4685J8092K0887K2166
$$ plain form
59532 578280 599060 615177 624027 624918 619490 611055 603168 598150 596475 597371 599917 603632 608310 613667
59518 613667 619231 624386 628495 631106 632058 631229 628257 622811 615123 605946 595875 585017 573438 561629
59504 561629 550298 539871 530409 521830 514077 507165 501128 495778 490533 484862 479017 473948 470278 467677
59490 467677 465534 463824 462836 462368 461736 460573 459145 457907 457146 457093 457993 459844 462249 464615 466454 467620
59474 467620 468526 470028 472819 476858 481530 486210 490449 493756 495734 496536 496903 497592 498881 500690 502943
59459 502943 505693 509006 512935 517611 523393 530849 540409 551959 564830 578223 591491 604041 615357
59446 615357 625318 634177 641901 647798 651107 651678 649687 645006 637404 627248 615462 602852 590025
59433 590025 577927 567766 560140 554620 550329 546621 543173 539990 537600 536836 538052 540778 544425 549088
$$ packed form
59532E78280K0780J6117Q850Q91n428q435p887n018j675Q96K546L715M678N357
59518F13667N564N155M109K611R52q29k972n446p688r177j0071j0858j1579j1809
59504E61629j1331j0427r462q579p753o912o037n350n245n671n845n069l670k601
59490D67677k143j710r88m68o32j163j428j238p61n3R00J851K405K366J839J166
59474D67620R06J502K791M039M672M680M239L307J978Q02L67O89J289J809K253
59459E02943K750L313L929M676N782P456R560J1550J2871J3393J3268J2550J1316
59446F15357R961Q859P724N897L309N71j991m681p602j0156j1786j2610j2827
59433E90025j2098j0161p626n520m291l708l448l183k390p64J216K726L647M663
$$ plain form
59419 549088 555465 564191 575549 589661 606606 626329 648640 673446 700935 731216 763237 793676
59407 793676 817300 829277 827803 814810 794561 771855 750954 734865 724838 720723 721984 727813
59395 727813 735846 741403 739174 726376 704387 677450 649877 624170 601002 580281 561981 546230
59383 546230 533099 522572 514604 508930 504908 501821 499396 497867 497539 498504 500729 504103 508293 512791
59369 512791 517178 521279 525118 528924 533091 537772 542537 546741 550299 553841 558052 563171 569113 575720
59355 575720 582781 590191 598224 607333 617554 628428 639766 652191 666614 683263 701353 719617
59343 719617 737201 754252 771643 789810 807833 823941 837008 847236 855405 861813 865983 866892
59331 866892 863403 855086 842951 828993 814653 799940 784217 767371 749913 732444 715547 699980
$$ packed form
59419E49088O377Q726J1358J4112J6945J9723K2311K4806K7489L0281L2021L0439
59407G93676K3624J1977j474j2993k0249k2706k0901j6089j0027m115J261N829
59395G27813Q033N557k229j2798k1989k6937k7573k5707k3168k0721j8300j5751
59383E46230j3131j0527p968n674m022l087k425j529l28R65K225L374M190M498
59369E12791M387M101L839L806M167M681M765M204L558L542M211N119N942O607
59355E75720P061P410Q033R109J0221J0874J1338J2425J4423J6649J8090J8264
59343G19617J7584J7051J7391J8167J8023J6108J3067J0228Q169O408M170R09
59331H66892l489q317j2135j3958j4340j4713j5723j6846j7458j7469j6897j5567
$$ plain form
59319 699980 686368 674731 664585 655458 647187 639925 634057 629877 627136 625158 623569 622589 622386 622580
59305 622580 622782 623296 624820 627685 631804 637179 644049 652674 663402 676805 693377 713206 736186
59292 736186 762166 790181 817440 839535 852103 852681 841736 822478 799376 776008 753930 733492
59280 733492 715199 699764 687212 676861 668332 661989 658259 657088 658253 661687 667211 674381 682939
59267 682939 693068 704800 717347 729373 739891 748620 755455 759851 761021 758772 753881 747289 738952
59254 738952 727996 714220 698995 684175 670486 657571 645367 634569 625624 618132 611664 606551
59242 606551 603305 601647 600751 600295 600703 602378 605223 609062 614027 620171 626967 633623 639863 645974 651898
59227 651898 656636 659003 658873 657228 654858 651437 646230 639327 631711 624157 616605 608743 600846 593715
$$ packed form
59319F99980j3612j1637j0146r127q271p262n868m180k741j978j589r80k03J94
59305F22580K02N14J524K865M119N375O870Q625J0728J3403J6572J9829K2980
59292G36186K5980K8015K7259K2095J2568N78j0945j9258k3102k3368k2078k0438
59280G33492j8293j5435j2552j0351q529o343l730j171J165L434N524P170Q558
59267F82939J0129J1732J2547J2026J0518Q729O835M396J170k249m891o592q337
59254G38952j0956j3776j5225j4820j3689j2915j2204j0798q945p492o468n113
59242F06551l246j658q96m56M08J675K845L839M965O144O796O656O240O111N924
59227F51898M738K367j30j645k370l421n207o903p616p554p552p862p897p131
$$ plain form
59213 593715 587936 583402 579592 576193 573443 571860 571645 572407 573482 574421 575132 575731 576412 577354 578544 579725
59197 579725 580722 581756 583316 585728 588976 592804 596812 600574 604003 607571 611916 617133 622668 627901
59183 627901 632627 636873 640513 643243 644860 645428 645311 645092 645363 646428 648185 650362 652821 655625 658878
59168 658878 662637 666974 672078 678170 685316 693348 702036 711222 720642 729707 737713 744329 749690 753892
59154 753892 756632 757481 756381 753617 749383 743633 736398 728092 719390 710802 702465 694379 686775 680035
59140 680035 674199 668842 663704 659236 656122 654337 653132 651959 650934 650315 650096 650386 651680 654279 657748
59125 657748 661391 665122 669550 675385 682991 692407 703520 716339 731152 748178 766959 786540 806471
59112 806471 827200 849173 872061 895360 919275 944307 970166 995753 1020114 1042913 1064098
$$ packed form
59213E93715n779m534l810l399k750j583k15P62J075R39P11N99O81R42J190J181
59197E79725R97J034J560K412L248L828M008L762L429L568M345N217N535N233
59183F27901M726M246L640K730J617N68j17k19K71J065J757K177K459K804L253
59168F58878L759M337N104O092P146Q032Q688R186R420R065Q006O616N361M202
59154G53892K740Q49j100k764m234n750p235q306q702q588q337q086p604o740
59140F80035n836n357n138m468l114j785j205j173j025o19k19K90J294K599L469
59125F57748L643L731M428N835P606R416J1113J2819J4813J7026J8781J9581J9931
59112H06471K0729K1973K2888K3299K3915K5032K5859K5587K4361K2799K1185
$$ plain form
59101 1064098 1083685 1101843 1118632 1133542 1145617 1154039 1158431 1158943 1156503 1152719 1148848 1144918 1140312
59088 1140312 1135023 1129694 1124538 1118951 1112235 1103971 1093480 1079649 1061667 1039684 1014627 987695
59076 987695 960051 932495 905275 878478 852543 828028 805053 783569 764010 746931 732012
59065 732012 718267 705387 694022 684500 676091 668011 660406 653760 647969 642598 637613 633266 629607
59052 629607 626577 624271 622630 621244 619858 618718 617996 617305 616307 615434 615460 616611 618654 621553 625421 630042
59036 630042 635124 640970 648273 657176 667042 677214 687623 698585 710417 723339 737546 753367
59024 753367 771503 792870 817837 845777 875704 907171 939974 973151 1004934 1033745 1058644
59013 1058644 1078632 1092239 1098391 1097472 1091187 1081538 1070162 1058375 1047358 1038161 1031676 1028578 1029146
$$ packed form
59101A064098J9587J8158J6789J4910J2075Q422M392N12k440l784l871l930m606
59088A140312n289n329n156n587o716q264j0491j3831j7982k1983k5057k6932
59076I87695k7644k7556k7220k6797k5935k4515k2975k1484j9559j7079j4919
59065G32012j3745j2880j1365r522q409q080p605o646n791n371m985m347l659
59052F29607l030k306j641j386j386j140p22o91r98q73K6J151K043K899L868M621
59036F30042N082N846P303Q903R866J0172J0409J0962J1832J2922J4207J5821
59024G53367J8136K1367K4967K7940K9927L1467L2803L3177L1783K8811K4899
59013A058644J9988J3607O152r19o285r649j1376j1787j1017r197o485l098N68
$$ plain form
59000 1029146 1033057 1039447 1047189 1055169 1062403 1068041 1071344 1071806 1069347 1064193 1056359 1045398 1030984 1013709
58986 1013709 994848 975132 954217 931703 908329 885600 864379 844497 825893 809398 795960
58975 795960 785484 777077 770295 765616 763646 764319 766933 770593 774557 778586 783150 788970 796204 804395
58961 804395 813278 823080 833760 844468 854186 862494 869263 874008 876198 875903 873437 868584 860973 851256
58947 851256 841168 832223 824987 819778 817459 819106 825308 836023 850720 868254 886844 904428 918907
58934 918907 928106 930195 924716 912984 897074 878430 857657 835353 812696 791086 771395 753628
58922 753628 737244 721779 707189 693702 681581 671141 662771 656586 652142 648762 646046 643852 641992
58909 641992 640390 639365 639244 639790 640637 642263 645807 651712 659218 667513 676788 687723 700308 713707
$$ packed form
59000A029146L911O390P742P980P234N638L303M62k459n154p834j0961j4414j7275
58986A013709j8861j9716k0915k2514k3374k2729k1221j9882j8604j6495j3438
58975G95960j0476q407o782m679j970O73K614L660L964M029M564N820P234Q191
58961H04395Q883R802J0680J0708R718Q308O769M745K190k95k466m853p611r717
58947H51256j0088q945p236n209k319J647O202J0715J4697J7534J8590J7584J4479
58934I18907R199K089n479j1732j5910j8644k0773k2304k2657k1610j9691j7767
58922G53628j6384j5465j4590j3487j2121j0440q370o185m444l380k716k194j860
58909F41992j602j025j21N46Q47J626L544N905P506Q295R275J0935J2585J3399
$$ plain form
58895 713707 727025 739844 752219 764463 776911 789808 803545 818905 836634 856684 878298
58884 878298 900895 924301 947948 970446 990350 1006842 1019373 1027155 1029601 1026960 1020062 1009677
58872 1009677 996332 980450 962323 942373 921728 902094 884626 869296 855748 844150 834540
58861 834540 825857 816578 806306 795924 786124 776416 765789 753865 741172 728612 716914 706408
58849 706408 697145 689249 683138 679322 677896 678088 678256 676551 672060 665371 657752 649817 641380 632390 623306
58834 623306 614415 605621 597189 589978 584436 579999 575969 572391 569493 566911 564200 561695 560034 559135
58820 559135 558333 557333 556457 556134 556661 558202 560468 562718 564579 566507 568912 571303 573019 574314 575845
58805 575845 577456 578428 578687 578760 578721 578218 577553 577652 578718 579781 579899 579154 578244 577623 577202 576339 574186 570724
$$ packed form
58895G13707J3318J2819J2375J2244J2448J2897J3737J5360J7729K0050K1614
58884H78298K2597K3406K3647K2498J9904J6492J2531P782K446k641o898j0385
58872A009677j3345j5882j8127j9950k0645j9634j7468j5330j3548j1598r610
58861H34540q683r279j0272j0382r800r708j0627j1924j2693j2560j1698j0506
58849G06408r263p896o111l816j426J92J68j705m491o689p619p935q437q990r084
58834F23306q891q794q432p211n542m437m030l578k898k582k711k505j661q99
58820E59135q02j000q76l23N27J541K266K250J861J928K405K391J716J295J531
58805E75845J611R72K59P3l9n03o65R9J066J063J18p45r10o21m21q63k153l462
$$ plain form
58787 570724 567412 566010 566714 568227 569707 571678 574768 578626 582603 586711 591267 596206 601316 606666
58773 606666 612201 617188 620592 621840 621045 618781 615859 612933 610075 606974 603614 600306 597031 593397
58759 593397 589512 586298 584526 584035 584327 585497 588091 592307 597694 603488 609021 614068 619004 624310 629817
58744 629817 634856 639313 644024 649876 657016 665281 674825 685792 697832 710517 723978 738567 754186
58731 754186 770559 788055 807437 828562 849745 868750 884312 896551 906099 913117 917326 918817
58719 918817 918491 917526 916698 916447 917347 919930 924122 929306 935021 941127 947229 952393 955598 956141 953538 947499
58703 947499 938142 925860 910844 893077 872809 850519 826385 800442 773485 747121 722578 699948
58691 699948 678948 659783 642823 627971 614962 603843 594605 586704 579569 573242 567894 562995 557707
$$ packed form
58787E70724l312j402P04J513J480J971L090L858L977M108M556M939N110N350
58773F06666N535M987L404J248p95k264k922k926k858l101l360l308l275l634
58759E93397l885l214j772m91K92J170K594M216N387N794N533N047M936N306N507
58744F29817N039M457M711N852P140Q265R544J0967J2040J2685J3461J4589J5619
58731G54186J6373J7496J9382K1125K1183J9005J5562J2239R548P018M209J491
58719I18817l26r65q28k51R00K583M192N184N715O106O102N164L205N43k603o039
58703I47499r357j2282j5016j7767k0268k2290k4134k5943k6957k6364k4543k2630
58691F99948k1000j9165j6960j4852j3009j1119r238p901p135o327n348m899n288
$$ plain form
58678 557707 552028 546893 543105 540708 539495 539587 541242 544384 548518 552985 557308 561525 566316 572659 581281
58663 581281 592344 605432 619618 633674 646476 657241 665403 670505 672472 671868 669681 666843 663898
58650 663898 660883 657397 653008 647788 642281 636835 631234 625194 618920 612903 607353 602161 597270 592834
58636 592834 589145 586635 585719 586291 587506 588422 588811 589100 589596 590126 590395 590362 590221 590338 591308 593742 597678
58619 597678 602307 606598 610301 614191 619198 625455 632417 639743 647574 655777 663409 669429 673736 676973
58605 676973 679422 680655 680302 678561 675767 671940 667124 661761 656386 651163 646034 641152 636893 633512
58591 633512 631032 629427 628783 629283 631075 634213 638890 645733 655486 668040 682069 696152 710049 724256
58577 724256 738460 751295 761803 770324 777583 783639 788327 792233 796567 802303 809896 819582 831503
$$ packed form
58678E57707n679n135l788k397j213R2J655L142M134M467M323M217M791O343Q622
58663E81281J1063J3088J4186J4056J2802J0765Q162N102J967o04k187k838k945
58650F63898l015l486m389n220n507n446n601o040o274o017n550n192m891m436
58636E92834l689k510r16N72J215R16L89K89M96N30K69l3j41J17R70K434L936
58619E97678M629M291L703L890N007O257O962P326P831Q203P632O020M307L237
58605F76973K449J233l53j741k794l827m816n363n375n223n129m882m259l381
58591F33512k480j605o44N00J792L138M677O843R753J2554J4029J4083J3897J4207
58577G24256J4204J2835J0508Q521P259O056M688L906M334N736P593R686J1921
$$ plain form
58564 831503 845704 862413 882118 904952 930188 956754 984180 1012600 1041836 1070825 1098058
58553 1098058 1122405 1143470 1161233 1175441 1185366 1190148 1189269 1182656 1170549 1153580 1132809 1109340
58541 1109340 1083883 1056990 1029443 1001990 974727 947369 920203 894310 870803 850236 832655
58530 832655 817638 804310 792029 781163 772562 766221 761248 757255 754887 754642 756004 758199 761034
58517 761034 764501 768322 772446 777290 782860 788213 792443 795671 798361 800203 800381 798625 795375 791263
58503 791263 786941 782996 779410 775496 770860 765972 761195 755912 749477 742699 737410 734563 733430 732630
58489 732630 731393 729926 729063 729643 731934 735756 741214 748806 758578 769866 782347 796717 813637 832528
58475 832528 852026 871117 889102 904991 917814 927238 933107 934751 931626 924318 914155 902021
$$ packed form
58564H31503J4201J6709J9705K2834K5236K6566K7426K8420K9236K8989K7233
58553A098058K4347K1065J7763J4208R925M782q79o613j2107j6969k0771k3469
58541A109340k5457k6893k7547k7453k7263k7358k7166k5893k3507k0567j7581
58530H32655j5017j3328j2281j0866q601o341m973l993k368k45J362K195K835
58517G61034L467L821M124M844N570N353M230L228K690J842J78j756l250m112
58503G91263m322l945l586l914m636m888m777n283o435o778n289k847j133q00
58489G32630j237j467q63N80K291L822N458P592R772J1288J2481J4370J6920J8891
58475H32528J9498J9091J7985J5889J2823R424N869J644l125p308j0163j2134
$$ plain form
58463 902021 888328 873801 859367 845464 832264 820450 810920 803895 799104 796652 796761 798754 801237
58450 801237 803398 805360 807222 808509 808717 807752 805780 803225 800856 799275 798280 797246 796071 795250 795205 796118
58434 796118 798167 801311 805095 809370 814863 822245 830943 839862 849139 860181 874075 890927 910656
58421 910656 933297 958279 984347 1010367 1035361 1057538 1074205 1083111 1083538 1076219 1063025 1046678
58409 1046678 1029698 1013110 996643 980139 964096 948999 935151 923336 914612 909078 905717 903775
58397 903775 903510 905258 908617 913032 918404 924547 930647 935756 939433 941483 941567 939501 935654 930709 925277
58382 925277 919868 914825 910122 905574 901434 898462 897205 897461 898505 899668 900788 902280 904679 907992
58368 907992 911853 916460 922713 930981 940444 950347 961158 973569 987002 1000191 1012817 1025349 1037712
$$ packed form
58463I02021j3693j4527j4434j3903j3200j1814r530p025m791k452J09J993K483
58450H01237K161J962J862J287K08r65j972k555k369j581r95j034j175q21m5R13
58434G96118K049L144L784M275N493P382Q698Q919R277J1042J3894J6852J9729
58421I10656K2641K4982K6068K6020K4994K2177J6667Q906M27p319j3194j6347
58409A046678j6980j6588j6467j6504j6043j5097j3848j1815q724n534l361j942
58397I03775k65J748L359M415N372O143O100N109L677K050Q4k066l847m945n432
58382I25277n409n043m703m548m140k972j257K56J044J163J120J492K399L313
58368I07992L861M607O253Q268R463R903J0811J2411J3433J3189J2626J2532J2363
$$ plain form
58355 1037712 1049432 1060822 1072604 1084349 1094609 1102730 1109329 1115028 1119972 1124743 1130370 1137094 1144274
58342 1144274 1151818 1160596 1171143 1183063 1195988 1210088 1225341 1241274 1257724 1274874 1292393 1309465
58330 1309465 1325689 1340931 1354413 1365292 1374078 1382010 1388934 1393439 1395397 1396716 1399078 1402517 1406731
58317 1406731 1412051 1418299 1424332 1429810 1436171 1444829 1455577 1467647 1481188 1496641 1513655 1531658
58305 1531658 1550690 1570859 1591724 1612953 1634738 1656988 1678967 1700265 1721159 1741470 1760135
58294 1760135 1776547 1791318 1805179 1818190 1830658 1843721 1858396 1874961 1893695 1915042 1938570
58283 1938570 1963042 1988051 2014380 2042394 2071545 2102025 2135250 2171957 2211275 2252355 2295345
58272 2295345 2340007 2385131 2430237 2476288 2523865 2572422 2622339 2675829 2734489 2797635 2864330
$$ packed form
58355A037712J1720J1390J1782J1745J0260Q121O599N699M944M771N627O724P180
58342A144274P544Q778J0547J1920J2925J4100J5253J5933J6450J7150J7519J7072
58330A309465J6224J5242J3482J0879Q786P932O924M505J958J319K362L439M214
58317A406731N320O248O033N478O361Q658J0748J2070J3541J5453J7014J8003
58305A531658J9032K0169K0865K1229K1785K2250K1979K1298K0894K0311J8665
58294A760135J6412J4771J3861J3011J2468J3063J4675J6565J8734K1347K3528
58283A938570K4472K5009K6329K8014K9151L0480L3225L6707L9318M1080M2990
58272B295345M4662M5124M5106M6051M7577M8557M9917N3490N8660O3146O6695
$$ plain form
58261 2864330 2935223 3010838 3089609 3169203 3248427 3326433 3401569 3472788 3541152 3608540 3675867
58250 3675867 3743658 3813084 3885250 3960716 4040670 4127098 4220836 4321102 4427875 4542872 4667206
58239 4667206 4800123 4941167 5091476 5251709 5421047 5599558 5789179 5991021 6204259
58230 6204259 6429162 6668419 6923837 7194722 7481457 7787637 8116611 8469095 8846471
58221 8846471 9253227 9693613 10169206 10682397 11238980 11844790 12503576 13221141 14007886
58212 14007886 14874598 15830293 16887627 18066005 19386372 20868777 22539808 24437645
58204 24437645 26606767 29095664 31966446 35301152 39194459 43750210 49095146 55392696
58196 55392696 62844130 71698494 82285903 95046233 110528052 129373745 152289094
$$ packed form
58261B864330P0893P5615P8771P9594P9224P8006P5136P1219O8364O7388O7327
58250C675867O7791O9426P2166P5466P9954Q6428R3738J00266J06773J14997J24334
58239D667206J32917J41044J50309J60233J69338J78511J89621K01842K13238
58230F204259K24903K39257K55418K70885K86735L06180L28974L52484L77376
58221H846471M06756M40386M75593N13191N56583O05810O58786P17565P86745
58212A4007886Q66712R55695J057334J178378J320367J482405J671031J897837
58204B4437645K169122K488897K870782L334706L893307M555751N344936O297550
58196E5392696P451434Q854364J0587409J2760330J5481819J8845693K2915349
$$ plain form
58189 152289094 179933306 212686870 250347645 291805328 334683737 375089040 407925342
58182 407925342 428176224 432783097 421954024 398939224 368488713 335142596 302274206
58175 302274206 271897980 244784519 220679324 198728381 178077944 158333836 139618810
58168 139618810 122305527 106714928 92977321 81050066 70791546 62020829 54548853
58161 54548853 48192752 42783927 38172249 34226509 30834286 27903375 25361287 23149838
58153 23149838 21218904 19524393 18028570 16698942 15507279 14430860 13452754 12558822
58145 12558822 11735802 10973773 10268238 9617297 9018086 8467608 7964704 7508285 7094774
58136 7094774 6719615 6380110 6074344 5798132 5545013 5308528 5083057 4863963 4649283
$$ packed form
58189A52289094K7644212L2753564L7660775M1457683M2878409M0405303L2836302
58182D07925342K0250882M606873j0829073k3014800l0450511l3346117l2868390
58175C02274206l0376226k7113461k4105195k1950943k0650437j9744108j8715026
58168A39618810j7313283j5590599j3737607j1927255j0258520q770717p471976
58161E4548853o356101n408825m611678l945740l392223k930911k542088k211449
58153B3149838j930934j694511j495823j329628j191663j076419r78106q93932
58145A2558822q23020p62029p05535o50941n99211n50478n02904m56419m13511
58136G094774l75159l39505l05766k76212k53119k36485k25471k19094k14680
$$ plain form
58127 4649283 4440688 4241136 4052183 3874495 3709110 3556206 3413895 3280276 3155612
58118 3155612 3040699 2934247 2833869 2738644 2648719 2563388 2481703 2404191 2331797 2263628 2197748
58107 2197748 2133806 2072954 2015425 1959989 1905740 1852830 1801479 1751568 1703138 1656262 1610713
58096 1610713 1566755 1525767 1488982 1456101 1426097 1398705 1373957 1351059 1329134 1308550 1290177
58085 1290177 1273793 1258518 1244294 1231561 1219780 1207521 1193746 1177919 1159301 1137381 1112727
58074 1112727 1086412 1058928 1030598 1002470 975662 950312 926249 904102 884553 867095 850789
58063 850789 835744 822548 810761 799479 788999 780336 773158 765635 756393 745490 733534 721096
58051 721096 708972 697859 687580 677479 667514 658120 649291 640798 633015 626424 620539 614477 608353
$$ packed form
58127D649283k08595j99552j88953j77688j65385j52904j42311j33619j24664
58118C155612j14913j06452j00378r5225q9925q5331q1685p7512p2394o8169o5880
58107B197748o3942o0852n7529n5436n4249n2910n1351m9911m8430m6876m5549
58096A610713m3958m0988l6785l2881l0004k7392k4748k2898k1925k0584j8373
58085A290177j6384j5275j4224j2733j1781j2259j3775j5827j8618k1920k4654
58074A112727k6315k7484k8330k8128k6808k5350k4063k2147j9549j7458j6306
58063H50789j5045j3196j1787j1282j0480q663p178p523r242j0903j1956j2438
58051G21096j2124j1113j0279j0101r965r394q829q493p783o591n885o062o124
$$ plain form
58038 608353 602846 597524 591050 583169 575209 568315 562309 556509 550511 543742 535296 524854 513229 501638
58024 501638 490901 481394 473080 465411 457760 450120 442954 436405 430248 424535 419640 415663 412365 409661
58010 409661 407593 405932 404348 402894 401842 401199 400846 400806 400895 400613 400039 400266 402055 404554 406399 407665
57994 407665 409542 412359 415167 417244 418828 420281 421597 422897 424435 425999 427179 428217 429606 430804
57980 430804 430401 427708 423288 417862 411702 405199 398905 392759 386234 379490 373399 368227 363355 358653
57966 358653 355055 353224 352602 352291 352066 352046 352216 352850 354591 357434 360244 361911 362486 362637 362572 362148 361609
57949 361609 361508 362033 362880 363700 364461 365507 367352 370180 373560 376973 380562 384860 389838 394875 399747
57934 399747 404966 410997 417779 425219 433414 442014 449915 456003 459868 461622 461460 459639 456395 451701
$$ packed form
58038F08353n507n322o474p881p960o894o006n800n998o769q446j0442j1625j1591
58024E01638j0737r507q314p669p651p640p166o549o157n713m895l977l298k704
58010D09661k068j661j584j454j052o43l53m0Q9k82n74K27J789K499J845J266
57994D07665J877K817K808K077J584J453J316J300J538J564J180J038J389J198
57980D30804m03k693m420n426o160o503o294o146o525o744o091n172m872m702
57966C58653l598j831o22l11k25k0J70O34J741K843K810J667N75J51o5m24n39
57949C61609j01N25Q47Q20P61J046J845K828L380L413L589M298M978N037M872
57934C99747N219O031O782P440Q195Q600P901O088L865J754j62j821l244m694
$$ plain form
57920 451701 445503 438328 431110 424205 417062 409016 399974 390252 380337 370975 362937 356467 351304 347274
57906 347274 344333 342106 340050 338092 336428 334741 332457 329810 327728 326524 325695 325141 325395 326177 325994
57891 325994 323943 320971 318561 317051 316075 315826 316718 318334 319763 320690 321282 321297 320239 318175 315553 312285
57875 312285 307864 302419 296910 292135 288058 284200 280148 275591 270328 264531 258785 253714 249688 246828
57861 246828 245109 244426 244645 245628 247245 249457 252400 256211 260792 265843 271072 276169 280808 285019 289388
57846 289388 294346 299327 303163 305288 306092 306262 306459 307467 309607 311832 312382 310738 308139 305854 303871
57831 303871 301803 300050 299180 298924 298715 298795 299911 302201 305145 308459 312338 316872 321675 325979 328890
57816 328890 329897 329498 328907 328751 328478 327378 325584 323507 320843 316841 311201 304133 295969 287342 279277
$$ packed form
57920D51701o198p175p218o905p143q046r042r722r915r362q038o470n163m030
57906C47274k941k227k056j958j664j687k284k647k082j204q29n54K54P82j83
57891C25994k051k972k410j510r76k49Q92J616J429R27N92J5j058k064k622l268
57875C12285m421n445n509m775m077l858m052m557n263n797n746n071m026k860
57861B46828j719o83K19R83J617K212K943L811M581N051N229N097M639M211M369
57846B89388M958M981L836K125Q04J70J97J008K140K225N50j644k599k285j983
57831C03871k068j753q70k56k09Q0J116K290K944L314L879M534M803M304K911
57816C28890J007l99n91j56k73j100j794k077k664m002n640p068q164q627q065
$$ plain form
57801 279277 272366 266043 259312 251948 244467 237349 231000 226092 223102 221609 220734 220088 219700 219343 218783
57786 218783 218494 219266 221065 223054 224807 226808 229666 233479 238134 243719 250378 258094 266656 275598 284263
57771 284263 292249 299681 306671 312749 317297 320247 321760 321408 318428 312887 306015 299171 292820 286606
57757 286606 280011 272865 265448 258157 251037 243817 236574 230025 224888 221356 219433 219243 220459 221889
57743 221889 222332 221589 220103 217991 215101 211640 208000 204161 200026 196097 193097 191117 189783 189004 188736
57728 188736 188409 187508 186568 186549 187366 188014 188116 188299 188967 189772 190456 191221 192088 192841 193792 195500 197472 198209
57710 198209 197030 194921 193148 191996 191372 191601 192828 194401 195642 196656 197778 198852 199734 200921 202980
57695 202980 205834 209212 213253 217913 222273 225232 226568 226672 225635 223410 220615 218326 217111 216850 217438
$$ packed form
57801B79277o911o323o731p364p481p118o349m908k990j493q75o46l88l57n60
57786B18783k89P72J799J989J753K001K858L813M655N585O659P716Q562Q942Q665
57771B84263P986P432O990O078M548K950J513l52k980n541o872o844o351o214
57757B86606o595p146p417p291p120p220p243o549n137l532j923j90J216J430
57743B21889M43p43j486k112k890l461l640l839m135l929l000j980j334p79k68
57728A88736l27r01r40j9Q17O48J02J83O68Q05O84P65Q67P53R51J708J972P37
57710A98209j179k109j773j152o24K29J227J573J241J014J122J074Q82J187K059
57695B02980K854L378M041M660M360K959J336J04j037k225k795k289j215k61N88
$$ plain form
57680 217438 219069 221906 226088 232095 240648 252248 267242 286389 311039 342791 383290 434177
57668 434177 496795 571808 659070 757096 861440 963067 1048891 1105265 1122723 1099398 1041418
57657 1041418 960177 868040 774863 686779 606824 536136 474982 423297 380650 345933 317540
57646 317540 293988 274220 257359 242749 230411 220804 213677 207608 201244 194696 189144 185286 182715
57633 182715 180646 178641 176596 174568 172770 171438 170622 170271 170340 170514 170038 168361 165924 163836 162677 161962
57617 161962 160844 158955 156460 153747 151327 149748 149226 149426 149786 149952 149774 148963 147168 144545 142019 140578
57601 140578 140233 139971 138918 137266 135773 134715 133894 133432 133729 134439 134271 132280 128966 125635 123051 121073
57585 121073 119257 117248 114873 112256 109734 107338 104674 101618 98736 96480 94417 91938 89465 88119
$$ packed form
57680B17438J631K837M182O007Q553J1600J4994J9147K4650L1752M0499N0887
57668D34177O2618P5013Q7262R8026J04344J01627Q5824N6374J7458k3325n7980
57657A041418q1241r2137r3177q8084p9955p0688o1154n1685m2647l4717k8393
57646C17540k3552j9768j6861j4610j2338r607p127o069o364o548n552l858k571
57633A82715k069k005k045k028j798j332q16l51O9J74m76j677k437k088j159p15
57617A61962j118j889k495k713k420j579n22K00L60J66j78q11j795k623k526j441
57601A40578l45k62j053j652j493j058q21m62K97P10j68j991l314l331k584j978
57585A21073j816k009k375k617k522k396k664l056k882k256k063k479k473j346
$$ plain form
57571 88119 88164 88551 88107 86557 84329 82022 80252 79353 78898 78059 76690 75519 74982 74502 73437 72222 71878
57554 71878 72713 74102 75423 76591 77728 78911 80308 82066 83876 85068 85364 85309 85744 87003 88730 90278
57538 90278 91245 91835 92872 95190 98770 102613 105687 107855 109626 111161 111978 111706 110776 110081 110114 110657 111223
57521 111223 111602 111950 112475 113149 113752 114165 114542 115062 115589 115781 115566 115268 115161 115088 114746 114149 113523 112757 111262
57502 111262 108529 104780 100998 98239 96762 95822 94438 92416 90438 89089 88122 86922 85467 84389 84133
57487 84133 84422 84671 84655 84606 84694 84657 84111 83244 82891 83595 84772 85368 85360 85917 87799 90243 92011 92959 93862 95049
57467 95049 96084 96739 97508 99036 101532 104775 108225 111136 113046 114182 115053 115846 116617 117697 119162 120207
57451 120207 119953 118770 117839 117395 116433 114325 111691 109353 107429 105870 104924 104518 104069 103465 103399 104095 104589
$$ packed form
57571H8119M5L87m44j550k228k307j770q99m55q39j369j171n37m80j065j215l44
57554G1878Q35J389J321J168J137J183J397J758J810J192K96n5M35J259J727J548
57538I0278R67N90J037K318L580L843L074K168J771J535Q17k72r30o95L3N43N66
57521A11223L79L48N25O74O03M13L77N20N27J92k15k98j07p3l42n97o26p66j495
57502A11262k733l749l782k759j477r40j384k022j978j349r67j200j455j078k56
57487H4133K89K49j6m9Q8l7n46q67l53P04J177N96qN57J882K444J768R48R03J187
57467I5049J035O55P69J528K496L243L450K911J910J136Q71P93P71J080J465J045
57451A20207k54j183r31m44r62k108k634k338j924j559r46m06m49o04o6O96M94
$$ plain form
57434 104589 104016 102880 102221 102169 102172 102036 101872 101534 101002 100847 101429 102088 102055 101723 101941 102440 102197 101222 100749 101503
57414 101503 102855 103951 104660 105049 104818 103807 102469 101318 100374 99531 99094 99470 100511 101503 101777 101222 100265
57397 100265 99366 98566 97669 96845 96605 97001 97377 97411 97825 99388 101621 103289 103998 104446 105221 106218 107290 108623
57379 108623 110175 111478 112309 113084 114378 116382 118904 121444 123289 124074 124305 124843 125854 126779 127244 127403
57363 127403 127446 127526 128180 129960 132459 134528 135746 136876 138493 139991 140469 139956 139131 138412 137956 138130 139241
57346 139241 140948 142532 143708 144783 146100 147587 148813 149328 149130 148912 149595 151421 153740 155765 157194
57331 157194 158036 158306 158156 157938 157870 157930 158231 159069 160377 161553 162175 162509 162947 163335 163315 163111 163489 164963 167310
57312 167310 169815 171820 173180 174298 175614 177060 178260 179272 180714 183052 186092 189292 192246 194714
$$ packed form
57434A04589n73j136o59n2Lj36j64l38n32j55N82O59l3l32K18M99k43r75m73P54
57414A01503J352J096P09L89k31j011j338j151r44q43m37L76J041R92K74n55r57
57397A00265q99q00q97q24k40L96L76L4M14J563K233J668P09M48P75R97J072J333
57379A08623J552J303Q31P75J294K004K522K540J845P85K31N38J011R25M65J59
57363A27403M3Q0O54J780K499K069J218J130J617J498M78n13q25p19m56J74J111
57346A39241J707J584J176J075J317J487J226N15j98k18O83J826K319K025J429
57331A57194Q42K70j50k18o8O0L01Q38J308J176O22L34M38L88k0k04L78J474K347
57312A67310K505K005J360J118J316J446J200J012J442K338L040L200K954K468
$$ plain form
57298 194714 196648 198355 200236 202167 203641 204695 206113 208393 211050 213322 215052 216370 217115 217237 217365
57283 217365 218240 219817 221611 223708 226629 230194 233345 235385 236938 239383 243605 249451 256079 262641
57269 262641 268893 275362 282848 291532 300561 308534 314568 319040 323349 328760 335360 342192 348394 353948
57255 353948 359312 364691 369902 374688 378896 382514 385854 389560 394168 399627 405365 410799 415734 420437
57241 420437 425419 431051 437279 443767 450248 456533 462328 467505 472621 478714 486293 494786 503130 510637
57227 510637 517193 523071 528832 535087 542028 549392 557004 565019 573476 582059 590580 599334 608589 618074
57213 618074 627325 636261 645072 653799 662444 671238 680393 689765 699075 708269 717369 726226 734789 743393
57199 743393 752378 761592 770706 779933 790039 801589 814405 827729 840873 853818 867282 881929
$$ packed form
57298A94714J934J707J881J931J474J054J418K280K657K272J730J318P45J22J28
57283B17365Q75J577J794K097K921L565L151K040J553K445M222N846O628O562
57269B62641O252O469P486Q684R029P973O034M472M309N411O600O832O202N554
57255C53948N364N379N211M786M208L618L340L706M608N459N738N434M935M703
57241D20437M982N632O228O488O481O285N795N177N116O093P579Q493Q344P507
57227E10637O556N878N761O255O941P364P612Q015Q457Q583Q521Q754R255R485
57213F18074R251Q936Q811Q727Q645Q794R155R372R310R194R100Q857Q563Q604
57199G43393Q985R214R114R227J0106J1550J2816J3324J3144J2945J3464J4647
$$ plain form
57187 881929 897461 912854 927590 942210 957373 972898 988132 1002893 1017540 1032419 1047682
57176 1047682 1063416 1079525 1095724 1111974 1128631 1145842 1163152 1180152 1197122 1214563 1232456
57165 1232456 1250548 1269054 1288394 1308402 1328399 1347959 1367157 1386224 1405423 1425123 1445437
57154 1445437 1465963 1486300 1506604 1527137 1547506 1566977 1585373 1603079 1620312 1636931 1652846
57143 1652846 1668054 1682391 1695823 1708824 1721941 1735180 1748415 1762172 1777263 1793724 1810815
57132 1810815 1827998 1845274 1862629 1879863 1896969 1914072 1931081 1948028 1965624 1984758 2005478
57121 2005478 2027141 2049395 2072237 2095278 2117976 2140662 2164480 2190308 2218620 2250338 2286725
57110 2286725 2328326 2375164 2428259 2489873 2562004 2645928 2743821 2859874 2999325 3167584 3371154
$$ packed form
57187H81929J5532J5393J4736J4620J5163J5525J5234J4761J4647J4879J5263
57176A047682J5734J6109J6199J6250J6657J7211J7310J7000J6970J7441J7893
57165A232456J8092J8506J9340K0008J9997J9560J9198J9067J9199J9700K0314
57154A445437K0526K0337K0304K0533K0369J9471J8396J7706J7233J6619J5915
57143A652846J5208J4337J3432J3001J3117J3239J3235J3757J5091J6461J7091
57132A810815J7183J7276J7355J7234J7106J7103J7009J6947J7596J9134K0720
57121B005478K1663K2254K2842K3041K2698K2686K3818K5828K8312L1718L6387
57110B286725M1601M6838N3095O1614P2131Q3924R7893J16053J39451J68259K03570
$$ plain form
57099 3371154 3618601 3920017 4286328 4729687 5263578 5901759 6657743 7545253 8577255
57090 8577255 9762787 11104621 12599052 14234082 15983831 17803416 19629118 21383847
57082 21383847 22989286 24390503 25588889 26657359 27709744 28831748 30020754 31179144
57074 31179144 32160762 32831088 33103692 32945062 32362063 31387898 30073372 28482611 26689279
57065 26689279 24770574 22799954 20841557 18947491 17156673 15494486 13973931 12598478
57057 12598478 11365095 10266300 9291718 8429649 7668206 6995672 6400845 5873793 5406190
57048 5406190 4990728 4620514 4289420 3992660 3726383 3486642 3269174 3070193 2887001
57039 2887001 2717750 2560948 2415296 2279674 2153046 2034608 1924213 1822492 1730296 1648053
$$ packed form
57099C371154K47447L01416L66311M43359N33891O38181P55984Q87510J032002
57090H577255J185532J341834J494431J635030J749749J819585J825702J754729
57082B1383847J605439J401217J198386J068470J052385J122004J189006J158390
57074C1179144R81618O70326K72604j58630n82999r74165j314526j590761j793332
57065B6689279j918705j970620j958397j894066j790818j662187j520555j375453
57057A2598478j233383j098795r74582q62069p61443o72534n94827n27052m67603
57048E406190m15462l70214l31094k96760k66277k39741k17468j98981j83192
57039B887001j69251j56802j45652j35622j26628j18438j10395j01721r2196q2243
$$ plain form
57029 1648053 1575813 1513829 1462898 1424140 1398598 1387288 1391767 1414491 1457886 1522196 1603478
57018 1603478 1693160 1778984 1846504 1881551 1874331 1823569 1737141 1628059 1509023 1389516 1275901
57007 1275901 1172210 1080387 1000561 931756 872504 821191 776543 738024 705502 678480 655934
56996 655934 636843 620531 606492 594320 583910 575355 568562 563298 559713 558450 560033 564325 570651
56983 570651 578224 586334 594334 601396 606112 606531 601196 590358 575837 559590 542682 525593 508887
56970 508887 493167 478752 465828 454771 446021 439733 435745 433872 434148 436916 442743 452117 465180
56957 465180 481725 501123 521816 540971 555227 562161 560979 552138 536962 517666 496932 476829
56945 476829 458281 441663 427374 415593 406099 398855 394452 393499 395942 401452 410166 422507 438581
$$ packed form
57029A648053p2240o1984n0931l8758k5542j1310M479K2724M3395O4310Q1282
57018A603478Q9682Q5824O7520L5047p220n0762q6428j09082j19036j19507j13615
57007A275901j03691r1823p9826o8805n9252n1313m4648l8519l2522k7022k2546
56996F55934j9091j6312j4039j2172j0410q555o793n264l585j263J583M292O326
56983E70651P573Q110Q000P062M716M19n335j0838j4521j6247j6908j7089j6706
56970E08887j5720j4415j2924j1057q750o288l988j873K76K768N827R374J3063
56957D65180J6545J9398K0693J9155J4256O934j182q841j5176j9296k0734k0103
56945D76829j8548j6618j4289j1781r494p244m403r53K443N510Q714J2341J6074
$$ plain form
56932 438581 458318 481936 509385 539085 567586 590652 604569 606954 597383 577792 551836 523219
56920 523219 494379 466523 440435 416925 396646 379772 365878 354173 343963 334951 327084 320256
56908 320256 314398 309821 307051 306093 306068 305923 305445 305318 306180 307908 309936 312021 314386 317283 320808 325234
56892 325234 331171 339140 349226 361304 375309 390972 407531 424182 440637 456613 470659 480055
56880 480055 482301 476633 464165 446997 427414 407474 388809 372639 359960 351475 347252 346813 349828
56867 349828 356595 367701 383538 404464 431255 464995 506502 555839 611989 672330 732120 784724
56855 784724 822943 841143 837403 814485 778632 736749 694049 653741 618039 588671 566426 550931
56843 550931 541499 538250 542270 554736 576143 606564 646521 697337 760427 836215 923351 1018082
$$ packed form
56932D38581J9737K3618K7449K9700K8501K3066J3917K385r571j9591k5956k8617
56920E23219k8840k7856k6088k3510k0279j6874j3894j1705j0210r012p867o828
56908C20256n858m577k770r58k5j45m78j27Q62J728K028K085K365K897L525M426
56892C25234N937P969J0086J2078J4005J5663J6559J6651J6455J5976J4046R396
56880D80055K246n668j2468j7168j9583j9940j8665j6170j2679q485m223m39L015
56867C49828O767J1106J5837K0926K6791L3740M1507M9337N6150O0341N9790N2604
56855G84724L8219J8200l740k2918l5853m1883m2700m0308l5702k9368k2245j5495
56843E50931r432l249M020J2466K1407L0421L9957N0816O3090P5788Q7136R4731
$$ plain form
56831 1018082 1113419 1198969 1262755 1294922 1291232 1254324 1192222 1115211 1032671 951325 875365
56820 875365 807423 748990 700267 660519 629173 606498 593136 589330 594959 610179 635767 672791
56808 672791 721779 781655 848992 918066 981574 1031436 1059907 1061690 1036325 988732 926959 858961
56796 858961 790780 726380 668012 616545 572076 534679 504642 482102 466697 457654 454261 456363
56784 456363 464467 479219 500692 528149 560256 594906 628534 656076 672387 674245 661394 636124
56772 636124 602083 563118 522529 482748 445275 410732 379175 350684 325625 304188 285893
56761 285893 269992 256221 244597 234531 224908 215312 206535 199433 193811 188888 184413 180732 178017
56748 178017 175935 173981 171752 169114 166422 164407 163454 163148 162849 162502 162471 162782 163012 162909 162683 162626 162756
$$ packed form
56831A018082R5337Q5550O3786L2167l690l6908o2102p7011q2540q1346p5960
56820H75365o7942n8433m8723l9748l1346k2675j3362l806N629J5220K5588L7024
56808F72791M8988N9876O7337O9074O3508M9862K8471J783k5365m7593o1773o7998
56796H58961o8181o4400n8368n1467m4469l7397l0037k2540j5405r043l393K102
56784D56363Q104J4752K1473K7457L2107L4650L3628K7542J6311J858j2851k5270
56772F36124l4041l8965m0589l9781l7473l4543l1557k8491k5059k1437j8295
56761B85893j5901j3771j1624j0066r623r596q777p102n622m923m475l681k715
56748A78017k082j954k229k638k692k015r53l06k99l47l1L11K30j03k26n7J30
$$ plain form
56731 162756 162926 163056 163163 163261 163299 163203 163028 163053 163521 164257 164760 164707 164117 163032 161411 159474 157782 156780 156484
56712 156484 156703 157230 157720 157819 157560 157278 157060 156745 156557 157055 158210 159151 159221 158700 158096 157438 156786 156819 158112
56693 158112 160223 162161 163418 164000 163914 163356 163086 163795 165266 166688 167521 167458 166071 163432 160771 159453
56677 159453 159332 159087 158164 157346 157195 157002 155877 154109 152751 152275 152227 152008 151534 151167 151229 151660 152115 152477
56659 152477 153106 154398 156205 157948 159245 160132 160841 161664 162965 164949 167471 170346 173685 177535 181352
56644 181352 184306 186181 187608 189364 191743 194627 197883 201527 205548 209506 212438 213592 213409 213258 213884
56629 213884 214620 214516 213652 212672 211603 210073 208407 207464 207301 206865 205299 203005 201136 200382 200337 199783 197705
56612 197705 194333 191039 188859 187397 185603 183241 180951 179186 177806 176547 175137 173075 170116 166990
$$ packed form
56731A62756J70J30J07R8L8r6j75K5M68P36N03n3n90j085j621j937j692j002k96
56712A56484K19N27M90R9k59k82k18l15j88M98J155R41P0n21o04o58o52L3J293
56693A58112K111J938J257N82q6n58k70P09J471J422Q33o3j387k639k661j318
56677A59453j21k45r23q18j51j93j125j768j358m76m8k19m74l67O2M31M55L62
56659A52477O29J292J807J743J297Q87P09Q23J301J984K522K875L339L850L817
56644A81352K954J875J427J756K379K884L256L644M021L958K932J154j83j51O26
56629B13884P36j04q64r80j069j530j666r43j63m36j566k294j869p54m5n54k078
56612A97705l372l294k180j462j794k362k290j765j380j259j410k062k959l126
$$ plain form
56598 166990 164888 164163 164163 164255 164351 164527 164857 165644 167043 168487 169265 169671 170708 172597 174463 175654 176487 177406
56580 177406 178337 179277 180676 182690 184639 185739 185947 185761 185650 185990 187028 188581 190225 191982 194326 197314
56564 197314 200341 203096 206204 210490 215978 221999 227940 233667 239486 245836 252651 258984 263781 267100
56550 267100 270012 273186 276226 278598 280458 282144 283526 284386 285046 286041 287341 288246 287957 286186 283434
56535 283434 280676 278424 276136 272981 269096 265447 262433 259394 255704 251666 248005 245032 242575 240256
56521 240256 237568 234211 230627 227755 226028 224966 223834 222188 219831 216896 214129 212385 211603 210909 209848
56506 209848 208841 208208 207604 206722 205839 205225 204662 203902 203065 202258 201365 200489 199970 199776 199546 199408 199969 201201
56488 201201 202228 202544 202557 202576 202230 201412 200823 200867 200896 200350 199882 200503 202145 203891 205152 205935 206406 206807 207406
$$ packed form
56598A66990k102p25%R2R6J76L30P87J399J444P78M06J037J889J866J191Q33R19
56580A77406R31R40J399K014J949J100K08j86j11L40J038J553J644J757K344K988
56564A97314L027K755L108M286N488O021N941N727N819O350O815O333M797L319
56550B67100K912L174L040K372J860J686J382Q60O60R95J300R05k89j771k752
56535B83434k758k252k288l155l885l649l014l039l690m038l661k973k457k319
56521B40256k688l357l584k872j727j062j132j646k357k935k767j744p82o94j061
56506B09848j007o33o04q82q83o14n63p60q37q07q93q76n19j94k30j38N61J232
56488B01201J027L16J3J9l46q18n89M4K9n46m68O21J642J746J261P83M71M01N99
$$ plain form
56469 207406 208066 208360 208466 209192 210635 211730 211858 211993 213316 215483 217315 218575 219937 221609 223114 224179
56453 224179 224820 224766 223784 222494 221975 222565 223717 224886 225863 226397 226296 225883 225702 225791 225715 225237 224469 223569 222804
56434 222804 222674 223453 224755 225981 226930 227624 227974 228207 229153 231348 234061 235913 236386 236161 236106 236468 236958
56417 236958 237218 237235 237529 238575 239927 240463 239812 238860 238430 238263 237908 237780 238442 239520 240331 241068 242287 243636
56399 243636 244224 244036 243904 244137 244166 243620 242878 242485 242641 243271 244025 244304 243848 243174 242902 242908 242797 242892 244030 246529
56379 246529 250004 254009 258190 262089 265498 268783 272232 275332 277357 278364 278906 279185 279249 279614 280715
56364 280715 282030 282710 282778 282765 282477 281311 279640 278645 278642 278693 278054 277015 276096 275439 275244 275900 277253 278445
56346 278445 278841 278564 277983 277368 277219 278179 280239 282546 284267 285217 285536 285334 284911 284819 285365 286283 287070 287450
$$ packed form
56469B07406O60K94J06P26J443J095J28J35J323K167J832J260J362J672J505J065
56453B24179O41n4r82j290n19N90J152J169R77N34j01m13j81Q9p6m78p68r00p65
56434B22804j30P79J302J226R49O94L50K33R46K195K713J852M73k25n5L62M90
56417B36958K60J7K94J046J352N36o51r52m30j67l55j28O62J078Q11P37J219J349
56399B43636N88j88j32K33K9n46p42l93J56O30P54K79m56o74k72Oj11R5J138K499
56379B46529L475M005M181L899L409L285L449L100K025J007N42K79O4L65J101
56364B80715J315O80O8j3k88j166j671r95lN1o39j039r19o57j95O56J353J192
56346B78445L96k77n81o15j49R60K060K307J721R50L19k02m23r2N46R18P87L80
$$ plain form
56328 287450 287557 287859 288808 290318 291832 293118 294577 296453 298250 299491 300547 302015 303728 305100 306051
56313 306051 306763 306945 306282 305336 305083 305723 306812 308224 310048 311765 312683 313146 314241 316270 318444 320165
56297 320165 321650 323184 324683 326162 327856 329709 331437 333117 335063 337096 338711 339901 341142 342681
56283 342681 344545 347026 350216 353301 355330 356653 358549 361460 364589 367246 369521 371545 373223 374912
56269 374912 377289 380296 383115 385472 388074 391567 395945 401203 407607 414987 422623 430231 438370 447568
56255 447568 457693 468384 479554 491375 504335 519252 536566 555755 576182 598267 622858
56244 622858 649662 677405 705416 733848 762380 789994 816182 841079 864195 884280 900762
56233 900762 914048 923977 929275 929148 924329 915864 903889 888333 869954 849877 828686 806577 783896
$$ packed form
56328B87450J07L02R49J510J514J286J459J876J797J241J056J468J713J372R51
56313C06051P12J82o63r46k53O40J089J412J824J717R18M63J095K029K174J721
56297C20165J485J534J499J479J694J853J728J680J946K033J615J190J241J539
56283C42681J864K481L190L085K029J323J896K911L129K657K275K024J678J689
56269C74912K377L007K819K357K602L493M378N258O404P380P636P608Q139R198
56255D47568J0125J0691J1170J1821J2960J4917J7314J9189K0427K2085K4591
56244F22858K6804K7743K8011K8432K8532K7614K6188K4897K3116K0085J6482
56233I00762J3286R929N298j27m819q465j1975j5556j8379k0077k1191k2109k2681
$$ plain form
56220 783896 761048 738336 716282 695669 676960 660041 644615 630433 617186 604699 593143
56209 593143 582528 572287 562137 552951 545821 540520 535932 531724 528453 526293 524959 524669 525705 527117
56195 527117 527461 526885 526964 528300 529949 531448 533614 536739 539702 541724 543564 546036 548590 550280 551213
56180 551213 552216 553858 556360 559669 563125 565849 567797 569721 572043 574693 577910 581940 586006 589102
56166 589102 591823 595746 600862 605544 609457 614467 621867 630546 638937 647150 656078 665923 676678 688780
56152 688780 702195 716068 730188 745611 762976 781568 801017 822626 847985 877485 911209
56141 911209 950183 995744 1048761 1110373 1182419 1266251 1362003 1469406 1587673 1713627 1841318
56130 1841318 1964581 2079032 2181325 2268746 2341266 2402684 2458043 2510262 2559542 2604246 2641087
$$ packed form
56220G83896k2848k2712k2054k0613j8709j6919j5426j4182j3247j2487j1556
56209E93143j0615j0241j0150r186p130n301m588m208l271k160j334k90J036J412
56195E27117L44n76P9J336J649J499K166L125K963K022J840K472K554J690R33
56180E51213J003J642K502L309L456K724J948J924K322K650L217M030M066L096
56166E89102K721L923N116M682L913N010P400Q679Q391Q213Q928R845J0755J2102
56152F88780J3415J3873J4120J5423J7365J8592J9449K1609K5359K9500L3724
56141I11209L8974M5561N3017O1612P2046Q3832R5752J07403J18267J25954J27691
56130A841318J23263J14451J02293Q7421P2520O1418N5359N2219M9280M4704L6841
$$ plain form
56119 2641087 2665959 2676498 2673624 2660122 2638789 2612235 2582341 2548235 2505829 2450590 2380113
56108 2380113 2293909 2192883 2080539 1963162 1847169 1736883 1635228 1544615 1465876 1397915
56098 1397915 1339752 1291563 1252752 1220923 1194149 1172589 1156442 1144090 1133844 1125792 1120264 1116139
56086 1116139 1112492 1110290 1110537 1112148 1113493 1114747 1116902 1119865 1123314 1128073 1134759 1142327 1149697 1157560
56072 1157560 1166842 1176859 1186775 1197440 1209884 1223410 1237140 1251993 1269097 1287639 1306336 1325711
56060 1325711 1346803 1368978 1391089 1413504 1436747 1459387 1479473 1497017 1513119 1527909 1541358
56049 1541358 1554728 1569105 1583793 1598197 1613816 1632175 1652296 1672483 1693118 1715388 1738789
56038 1738789 1762438 1787496 1815807 1847394 1881496 1918519 1958593 1999810 2040410 2081160 2123187
$$ packed form
56119B641087K4872J0539k874j3502k1333k6554k9894l4106m2406n5239p0477
56108B380113q6204j01026j12344j17377j15993j10286j01655r0613p8739o7961
56098A397915n8163m8189l8811l1829k6774k1560j6147j2352j0246q052n528m125
56086A116139l647k202K47J611J345J254K155K963L449M759O686P568P370P863
56072A157560R282J0017R916J0665J2444J3526J3730J4853J7104J8542J8697J9375
56060A325711K1092K2175K2111K2415K3243K2640K0086J7544J6102J4790J3449
56049A541358J3370J4377J4688J4404J5619J8359K0121K0187K0635K2270K3401
56038A738789K3649K5058K8311L1587L4102L7023M0074M1217M0600M0750M2027
$$ plain form
56027 2123187 2165389 2206648 2248629 2293439 2340372 2387956 2437236 2489735 2544067 2598121 2652974
56016 2652974 2711104 2772298 2834929 2899827 2969275 3043477 3121450 3203912 3291854 3383874 3478550
56005 3478550 3577815 3684304 3797088 3913825 4035343 4164162 4300276 4442575 4592700 4753346
55995 4753346 4924503 5105403 5298003 5504167 5721604 5947174 6181963 6428469 6685567
55986 6685567 6951664 7230296 7527064 7843507 8179749 8540485 8932268 9357558 9817768
55977 9817768 10319272 10869743 11471823 12127826 12847662 13644548 14526553 15501117 16584758
55968 16584758 17799760 19165357 20702623 22445417 24437278 26722699 29354057 32404729
55960 32404729 35965520 40135384 45032092 50811517 57669426 65841436 75631426 87447983
$$ packed form
56027B123187M2202M1259M1981M4810M6933M7584M9280N2499N4332N4054N4853
56016B652974N8130O1194O2631O4898O9448P4202P7973Q2462Q7942R2020R4676
56005C478550R9265J06489J12784J16737J21518J28819J36114J42299J50125J60646
55995D753346J71157J80900J92600K06164K17437K25570K34789K46506K57098
55986F685567K66097K78632K96768L16443L36242L60736L91783M25290M60210
55977I817768N01504N50471O02080O56003P19836P96886Q82005R74564J083641
55968A6584758J215002J365597J537266J742794J991861K285421K631358L050672
55960C2404729L560791M169864M896708N779425O857909Q172010R789990J1816557
$$ plain form
55952 87447983 101808300 119320517 140665152 166520360 197361566 233170397 273123830
55945 273123830 315241614 356042378 390617381 413649326 421254695 412590705 390079015
55938 390079015 358143142 321459063 283780592 247614772 214391533 184757832 158858878
55931 158858878 136560847 117578504 101534495 88015333 76631119 67039738 58938552
55924 58938552 52064491 46206318 41198936 36901587 33190899 29969787 27165304 24713977
55916 24713977 22558126 20654039 18970836 17479361 16150342 14961980 13899303 12945611
55908 12945611 12082609 11298226 10585917 9936365 9337582 8782927 8271402 7799910 7362107
55899 7362107 6954941 6579499 6234824 5916795 5623267 5354652 5109169 4882901 4674678
$$ packed form
55952H7447983J4360317J7512217K1344635K5855208L0841206L5808831L9953433
55945B73123830M2117784M0800764L4575003K3031945P605369q663990k2511690
55938C90079015l1935873l6684079l7678471l6165820l3223239k9633701k5898954
55931A58858878k2298031j8982343j6044009j3519162j1384214r591381q101186
55924E8938552o874061n858173n007382m297349l710688l221112k804483k451327
55916B4713977k155851j904087j683203j491475j329019j188362j062677r53692
55908A2945611q63002p84383p12309o49552n98783n54655n11525m71492m37803
55899G362107m07166l75442l44675l18029k93528k68615k45483k26268k08223
$$ plain form
55890 4674678 4485889 4315478 4159976 4018385 3892320 3781630 3684704 3602961 3540284 3497935
55880 3497935 3474509 3470659 3488893 3527874 3580559 3637855 3690009 3724664 3728779 3694683 3622292 3515962
55868 3515962 3382392 3230879 3071044 2909056 2748338 2593255 2448525 2315292 2191582
55859 2191582 2076874 1972854 1879620 1794817 1717074 1647188 1585437 1530628 1482085 1439721 1401923
55848 1401923 1366151 1331783 1299671 1269016 1237770 1206232 1177123 1151696 1128607 1106843 1086849
55837 1086849 1068368 1050076 1031929 1015238 999857 983820 966211 947994 929761 911234 893279
55826 893279 877709 864555 851936 839010 826513 814099 799942 783728 767435 752406 737981
55815 737981 723709 710505 698822 688060 678556 671816 667896 664819 661566 659479 659739 661601 664189
$$ packed form
55890D674678j88789j70411j55502j41591j26065j10690r6926q1743o2677m2349
55880C497935k3426l850J8234L8981N2685N7296N2154L4655M115l4096p2391j06330
55868C515962j33570j51513j59835j61988j60718j55083j44730j33233j23710
55859B191582j14708j04020r3234q4803p7743o9886o1751n4809m8543m2364l7798
55848A401923l5772l4368l2112l0655l1246l1538k9109k5427k3089k1764j9994
55837A086849j8481j8292j8147j6691j5381j6037j7609j8217j8233j8527j7955
55826H93279j5570j3154j2619j2926j2497j2414j4157j6214j6293j5029j4425
55815G37981j4272j3204j1683j0762r504o740l920l077l253k087K60J862K588
$$ plain form
55802 664189 667981 673342 679435 685783 693194 702007 710944 718683 725024 729606 731147 729086 724546 718610
55788 718610 710967 701242 690340 679424 668700 658050 647721 637417 625720 611367 594429 575774
55776 575774 556291 537135 519734 504983 493161 484767 480472 480097 482645 487250 492819 496998 497317
55763 497317 493693 488195 482100 474825 466045 456803 447830 438608 428947 419770 411326 402249 391552 380214
55749 380214 369754 360516 352328 345478 339811 334095 327603 321397 316865 313829 311249 309008 307764 307558
55735 307558 307698 307680 307374 306597 305207 303351 301171 298588 295680 292700 289435 285255 280198 275318 271498
55720 271498 268501 265539 262188 258506 254896 252108 250674 250151 249630 249074 249290 250550 252259 254121 256482
55705 256482 259266 261735 263679 265631 267419 267688 265467 261163 255522 248724 241161 233924 227650 221765
$$ packed form
55802F64189L792N361O093O348P411Q813Q937P739O341M582J541k061m540n936
55788G18610p643r725j0902j0916j0724j0650j0329j0304j1697j4353j6938j8655
55776E75774j9483j9156j7401j4751j1822q394m295l75K548M605N569M179L19
55763D97317l624n498o095p275q780r242q973r222r661r177q444r077j0697j1338
55749C80214j0460r238q188o850n667n716o492o206m532l036k580k241j244k06
55735C07558J40j8l06p77j390j856k180k583k908k980l265m180n057m880l820
55720B71498k997k962l351l682l610k788j434n23n21n56K16J260J709J862K361
55705B56482K784K469J944J952J788K69k221m304n641o798p563p237o274n885
$$ plain form
55691 221765 215665 209809 204947 201040 197710 195029 193183 192034 191579 192177 193768 195621 197372 199472 202007
55676 202007 203943 204307 203446 202390 201471 200144 197681 193646 188364 183293 180150 179159 178822 177801 176206
55661 176206 174751 173725 173396 174346 176598 179261 181827 185004 189526 194911 200211 205294 210524 215847 220921
55646 220921 225605 229632 232404 233721 234041 233423 231028 226398 220392 214065 207448 200312 193349 187449 182359
55631 182359 177097 171294 165288 159453 154372 151133 150280 150791 151057 150645 150138 149623 148549 147039 146210 146872
55615 146872 148587 150225 150938 150476 149081 147218 145150 142742 139868 136817 134116 132162 131150 130987 131065
55600 131065 130617 129596 128683 128149 127326 125675 123748 122503 122166 122285 122422 122265 121585 120702 120497 121350 122501
55583 122501 123098 123386 124212 125742 127423 128885 130287 132018 134642 138775 144466 150968 157617 164544 172092
$$ packed form
55691B21765o100n856m862l907l330k681j846j149m55N98J591J853J751K100K535
55676B02007J936L64q61j056r19j327k463m035n282n071l143r91l37j021j595
55661A76206j455j026l29R50K252K663K566L177M522N385N300N083N230N323N074
55646B20921M684M027K772J317L20o18k395m630o006o327o617p136o963n900n090
55631A82359n262n803o006n835n081l239q53N11K66m12n07n15j074j510q29O62
55615A46872J715J638P13m62j395j863k068k408k874l051k701j954j012j63P8
55600A31065m48j021r13n34q23j651j927j245l37J19J37j57o80q83k05Q53J151
55583A22501N97K88Q26J530J681J462J402J731K624M133N691O502O649O927P548
$$ plain form
55568 172092 180067 188124 196259 204134 210436 213820 214204 212346 208550 202651 194984 186417 177541 168593
55554 168593 160096 152733 146655 141556 137359 134159 131629 129228 126987 125401 124550 123983 123485 123303 123447
55539 123447 123340 122362 120442 118108 116161 115159 114859 114367 113212 112005 111556 111640 111292 110127 108685 107526
55523 107526 106627 105781 105043 104588 104516 104849 105402 105647 105048 103595 101726 99817 97975 96256 94745 93486 92570
55506 92570 92255 92748 93920 95334 96391 96401 94923 92321 89683 87879 86892 86258 85790 85640 86040 87246 89366
55489 89366 91876 93778 94621 95054 95957 97378 98690 99390 99340 98621 97549 96561 95727 94715 93486 92539 92216
55472 92216 92355 92913 94155 95716 96354 95417 93895 93250 93787 94956 96526 98438 100009 100461 99989 99344 98696
55455 98696 97884 97422 97972 98977 99048 97824 96440 95924 96108 96322 96264 95895 95213 94485 94161 94360 94849 95525 96369
$$ packed form
55568A72092P975Q057Q135P875O302L384L84j858l796n899p667q567q876q948
55554A68593q497p363o078n099m197l200k530k401k241j586q51n67m98j82J44
55539A23447j07r78j920k334j947j002l00m92j155j207m49Q4l48j165j442j159
55523A07526q99q46p38m55p2L33N53K45n99j453j869j909j842j719j511j259r16
55506I2570l15M93J172J414J057J0j478k602k638j804r87o34m68j50M00J206K120
55489H9366K510J902Q43M33R03J421J312P00n0p19j072r88q34j012j229r47l23
55472I2216J39N58J242J561O38r37j522o45N37J169J570J912J571M52m72o45o48
55455I8696q12m62N50J005P1j224j384n16J84K14n8l69o82p28l24J99M89O76Q44
$$ plain form
55436 96369 97037 97154 97003 97238 97900 98370 98279 97803 97099 96187 95430 95361 95932 96633 97390 98613 100302 101897 103204
55417 103204 104756 107117 110461 114891 120301 125743 129806 132010 133126 133823 133768 132490 130371 128131 125858
55402 125858 123156 119968 116742 113973 111894 110423 109148 107563 105551 103451 101618 100174 99189 98674 98301
55387 98301 97535 96239 94864 93950 93782 94491 95990 97669 98644 98600 98123 98038 98628 99563 100294 100459 100181 99972
55369 99972 100082 100142 99806 99514 99979 101001 101424 100427 98327 96051 94332 93449 93188 92921 92210 91414 91180 91406
55351 91406 91351 90776 90228 90044 89892 89621 89746 90595 91608 92051 92001 92065 92398 92524 91927 90501 88590 86831 85832
55332 85832 85806 86586 87875 89224 89960 89762 89310 89719 91172 92720 93616 94136 94765 95264 95126 94460 93767 93149
55314 93149 92288 91077 89821 88831 88162 87749 87617 87973 89110 91064 93386 95429 96856 97681 97985 97962 98050
$$ packed form
55436I6369O68J17j51K35O62M70r1m76p04r12p57o9N71P01P57J223J689J595J307
55417A03204J552K361L344M430N410N442M063K204J116O97n5j278k119k240k273
55402A25858k702l188l226k769k079j471j275j585k012k100j833j444r85n15l73
55387I8301p66j296j375r14j68P09J499J679R75m4m77q5N90R35P31J65k78k09
55369I9972J10O0l36k92M65J022M23r97k100k276j719q83k61k67p11p96k34K26
55351I1406n5n75n48j84j52k71J25Q49J013M43n0O4L33J26n97j426j911j759r99
55332H5832k6P80J289J349P36j98m52M09J453J548Q96N20O29M99j38o66o93o18
55314I3149q61j211j256r90o69m13j32L56J137J954K322K043J427Q25L04k3Q8
$$ plain form
55297 98050 98461 98722 98265 97424 97107 97443 97627 97291 97090 97483 97827 97354 96447 96140 96748 97708 98512 99110 99473
55278 99473 99388 98802 98048 97663 98041 99140 100466 101542 102374 103128 103472 102857 101564 100733 100977 101638 101832 101644
55260 101644 101643 101789 101566 100946 100491 100608 101150 101654 101571 100564 99027 98049 98336 99347 100004 99973 99660 99275 98704
55241 98704 98218 98380 99007 99025 97846 96349 95919 96777 97841 98118 97724 97378 97370 97367 97080 96724 96714 97219 98091 99030
55221 99030 99639 99583 98951 98278 97912 97547 96788 95995 96049 97261 98943 100146 100471 100115 99495 98913 98342 97493 96317
55202 96317 95254 94605 93957 92841 91796 91939 93439 95215 96299 96737 96923 96897 96727 96803 97193 97254 96449 95084
55184 95084 93826 93000 92721 93163 94174 95109 95560 95839 96331 96908 97429 98185 99246 99966 99872 99553 99875 100714
55166 100714 101298 101509 101985 103063 104388 105525 106314 106683 106700 106764 107220 107878 108359 108717 109177 109499 109261 108606
$$ packed form
55297I8050M11K61m57q41l17L36J84l36k01L93L44m73r07l07O08R60Q04N98L63
55278I9473q5n86p54l85L78J099J326J076Q32P54L44o15j293q31K44O61J94j88
55260A01644jJ46k23o20m55J17N42N04q3j007j537r78K87J011O57l1l13l85n71
55241I8704m86J62O27J8j179j497m30Q58J064K77l94l46qlk87l56j0N05Q72R39
55221I9030O09n6o32o73l66l65p59p93N4J212J682J203L25l56o20n82n71q49j176
55202I6317j063o49o48j116j045J43J500J776J084M38J86k6j70P6L90O1q05j365
55184I5084j258q26k79M42J011R35M51K79M92N77N21P56J061P20r4l19L22Q39
55166A00714N84K11M76J078J325J137P89L69J7O4M56O58M81L58M60L22k38o55
$$ plain form
55148 108606 108058 107731 107396 107246 107813 109020 109984 109948 108928 107377 105675 104059 102594 101090 99411 97934
55132 97934 97348 97945 99413 101267 103144 104749 105917 106725 107309 107670 107906 108340 109034 109493 109312 108795 108331
55115 108331 107548 105857 103609 101825 100827 99997 98925 97942 97425 97380 97894 99169 100821 101950 102273 102501 103266
55098 103266 104347 105307 106210 107229 108167 108869 109560 110270 110456 109820 109044 109067 109931 110937 111601 111859 111622 110830
55080 110830 109859 109249 109039 108905 108832 109083 109497 109512 108999 108491 108305 108016 107210 106336 106259 107127 108164 108563 108209
55061 108209 107502 106838 106380 106102 105862 105640 105746 106506 107625 108260 108016 107535 107682 108402 108974 109152 109350 109689
55043 109689 109713 109296 109022 109240 109487 109429 109688 110866 112250 112479 111330 109890 109001 108492 108074 108040 108631 109355
55025 109355 109495 108877 107777 106437 105090 104146 103956 104482 105391 106337 107029 107304 107350 107596 108144 108488 108056 106895
$$ packed form
55148A08606n48l27l35j50N67J207R64l6j020j551j702j616j465j504j679j477
55132I7934n86N97J468J854J877J605J168Q08N84L61K36M34O94M59j81n17m64
55115A08331p83j691k248j784r98q30j072r83n17m5N14J275J652J129L23K28P65
55098A03266J081R60R03J019R38P02O91P10J86o36p76K3Q64J006O64K58k37p92
55080A10830r71o10k10j34p3K51M14J5n13n08j86k89q06q74p7Q68J037L99l54
55061A08209p07o64m58k78k40k22J06P60J119O35k44m81J47P20N72J78J98L39
55043A09689K4m17k74K18K47n8K59J178J384K29j149j440q89n09m18l4N91P24
55025A09355J40o18j100j340j347r44j90N26R09R46O92K75M6K46N48L44m32j161
$$ plain form
55007 106895 105652 104958 104995 105511 106105 106542 106853 107144 107398 107551 107744 108297 109435 111173 113378 115747 117790
54990 117790 119054 119350 118700 117315 115850 115333 116304 118139 119710 120564 120961 120993 120489 119804 119744 120397 120823 120410
54972 120410 119804 119917 120584 121039 121263 122001 123505 125141 126332 127260 128285 129183 129342 128546 127244 126130 125611
54955 125611 125655 126025 126587 127404 128520 129719 130602 130940 130908 130843 130765 130321 129371 128503 128608 129853 131419 132467
54937 132467 132988 133434 133929 134361 134954 136034 137350 138305 138887 139683 140856 141945 142956 144904 148725 154232
54921 154232 160787 168505 177969 188904 199910 209664 217906 225084 231418 236479 239417 239429 236162 229879
54907 229879 221352 211610 201736 192619 184684 177852 171814 166343 161401 157140 153763 151177 148851 146346
54893 146346 144017 142733 142771 143411 143856 144083 144449 144846 144876 144706 145155 146868 149757 153285 157063 161131 165924
$$ packed form
55007A06895j243o94L7N16N94M37L11K91K54J53J93N53J138J738K205K369K043
54990A17790J264K96o50j385j465n17R71J835J571Q54L97L2n04o85o0O53M26m13
54972A20410o06J13O67M55K24P38J504J636J191R28J025Q98J59p96j302j114n19
54955A25611M4L70N62Q17J116J199Q83L38l2o5p8m44r50q68J05J245J566J048
54937A32467N21M46M95M32N93J080J316R55N82P96J173J089J011J948L821N507
54921A54232O555P718R464J0935J1006R754Q242P178O334N061K938J2l267o283
54907B29879q527r742r874r117p935o832o038n471m942m261l377k586k326k505
54893A46346k329j284L8O40M45K27L66L97L0j70M49J713K889L528L778M068M793
$$ plain form
54876 165924 172040 179830 189114 199304 209688 219479 227754 233675 236793 237067 234656 229855 223137 215093
54862 215093 206363 197677 189797 183145 177523 172420 167598 163260 159683 156863 154548 152447 150348 148057
54848 148057 145311 141930 138149 134643 131965 129974 128112 126233 124756 123902 123211 122108 120684 119596 119372
54833 119372 120011 121093 122065 122551 122648 122769 123121 123552 123983 124623 125551 126452 127094 127651 128180 128162 127122 125447
54815 125447 124050 123359 123176 123307 123685 123948 123667 123136 123272 124395 125684 126256 126336 126846 128095 129382 129881
54798 129881 129508 128807 128283 128064 128085 128329 128721 128966 128770 128270 127975 128129 128309 127827 126387 124312 122375 121567
54780 121567 122619 125355 128765 132047 135307 138889 142442 145384 148020 151338 155636 160225 164738 169931
54766 169931 176743 185203 194802 205317 216581 227815 237940 246442 253253 257910 259509 257638 252857
$$ packed form
54876A65924O116P790R284J0190J0384R791Q275N921L118K74k411m801o718q044
54862B15093q730q686p880o652n622n103m822m338l577k820k315k101k099k291
54848A48057k746l381l781l506k678j991j862j879j477q54o91j103j424j088k24
54833A19372O39J082R72M86R7J21L52M31M31O40R28R01O42N57N29j8j040j675
54815A25447j397o91j83J31L78K63k81n31J36J123J289N72Q0N10J249J287M99
54798A29881l73p01n24k19K1K44L92K45j96n00k95J54J80m82j440k075j937q08
54780A21567J052K736L410L282L260L582L553K942K636L318M298M589M513N193
54766A69931O812Q460R599J0515J1264J1234J0125Q502O811M657J599j871m781
$$ plain form
54753 252857 246078 237977 229127 220168 211422 202654 193656 184975 177654 172270 168459 165383 162424 159512
54739 159512 157126 156056 156765 158671 160268 160352 159100 157740 157258 157743 158920 160744 163246 166211 169447
54724 169447 173157 177694 183070 189067 195691 203095 211045 218871 225993 232091 236667 238857 238025 234333
54710 234333 228529 221370 213450 205336 197496 190124 183286 177176 171986 167557 163488 159663 156413 153960
54696 153960 151948 149840 147720 146316 146032 146209 145781 144569 143504 143405 143931 144122 143719 143439 143983 145216 146401
54679 146401 146808 145972 143888 141316 139569 139438 140363 141022 140706 139822 139081 138639 138206 137657 137207 137030 136928 136474
54661 136474 135460 134167 133134 132632 132417 132092 131608 131259 131209 131329 131536 132043 133087 134555 136079 137369 138278
54644 138278 138702 138729 138813 139447 140559 141481 141662 141221 140666 140340 140342 140750 141531 142266 142299 141333 139742 138310 137705
$$ packed form
54753B52857o779q101q850q959q746q768q998q681p321n384l811l076k959k912
54739A59512k386j070P09J906J597Q4j252j360m82M85J177J824K502K965L236
54724A69447L710M537N376N997O624P404P950P826P122O098M576K190q32l692
54710B34333n804p159p920q114p840p372o838o110n190m429m069l825l250k453
54696A53960k012k108k120j404k84J77m28j212j065r9N26J91m03k80N44J233J185
54679A46401M07q36k084k572j747j31R25O59l16q84p41m42m33n49m50j77j02m54
54661A36474j014j293j033n02k15l25m84l49n0J20K07N07J044J468J524J290R09
54644A38278M24K7Q4O34J112R22J81m41n55l26KM08P81P35L3r66j591j432o05
$$ plain form
54625 137705 138110 139156 140196 140868 141376 142085 142943 143596 144038 144724 145890 147131 147908 148150 148060 147602 146561
54608 146561 145028 143415 142077 141217 141058 141615 142311 142369 141857 141827 143006 144689 145574 145512 145683 146808 147992
54591 147992 147952 146949 146614 147808 149570 150544 150763 151302 152603 154009 154892 155415 155932 156348 156468 156516 156924 157895
54573 157895 159544 162025 165068 167681 168878 168667 167896 167239 166743 166315 166106 166302 166893 167858 169243 170965
54557 170965 172708 174138 175091 175546 175709 176077 177136 178819 180409 181096 180595 179429 178842 180243 184090 189163
54541 189163 193343 195495 196395 197682 200098 202965 205124 206026 206017 205822 205830 205829 205412 204560 203637 202822 201865 200555
54523 200555 199140 198074 197466 197029 196424 195531 194493 193699 193535 193932 194258 193912 192967 192051 191637 191636 191550 190850 189303
54504 189303 187237 185478 184747 185057 185840 186663 187574 188705 189864 190717 191246 191795 192705 194011 195503 197041
$$ packed form
54625A37705M05J046J040O72N08P09Q58O53M42O86J166J241P77K42r0m58j041
54608A46561j533j613j338q60j59N57O96N8n12l0J179J683Q85o2J71J125J184
54591A47992m0j003l35J194J762R74K19N39J301J406Q83N23N17M16J20M8M08R71
54573A57895J649K481L043K613J197k11p71o57m96m28k09J96N91R65J385J722
54557A70965J743J430R53M55J63L68J059J683J590O87n01j166n87J401L847N073
54541A89163M180K152R00J287K416K867K159R02rj95Qjm17q52r23q15r57j310
54523B00555j415j066o08m37o05q93j038p94j64L97L26l46r45r16m14jq6p00j547
54504A89303k066j759p31L10P83Q23R11J131J159Q53N29N49R10J306J492J538
$$ plain form
54488 197041 198783 201061 203943 206966 209497 211391 213153 215362 218109 221035 223726 225923 227593 229086
54474 229086 231045 233789 236828 239407 241527 243999 247291 250816 253726 255998 258137 260061 260994 260541 259249
54459 259249 257842 256422 254771 252976 251304 249792 248523 248064 248982 250885 252468 252705 251617 249793 247608
54444 247608 245169 242642 240172 237560 234396 230612 226787 223813 222201 221606 220999 219511 217221 215056 213860
54429 213860 213687 214026 214492 215049 215668 216066 215907 215209 214453 214222 214616 215068 214823 213717 212354 211498 211363 211612
54411 211612 211866 211988 211944 211668 211196 210762 210559 210448 210088 209373 208582 208036 207792 207834 208379 209678 211443 212861
54393 212861 213345 213148 213025 213438 214293 215330 216464 217720 219043 220203 220791 220450 219274 217956 217274 217472
54377 217472 218314 219604 221321 223245 224873 225891 226442 226723 226530 225486 223676 221820 220788 220913 221744 222413
$$ packed form
54488A97041J742K278K882L023K531J894J762K209K747K926K691K197J670J493
54474B29086J959K744L039K579K120K472L292L525K910K272K139J924R33m53j292
54459B59249j407j420j651j795j672j512j269m59R18J903J583K37j088j824k185
54444B47608k439k527k470k612l164l784l825k974j612n95o07j488k290k165j196
54429B13860j73L39M66N57O19L98j59o98p56k31L94M52k45j106j363q56j35K49
54411B11612K54J22m4k76m72m34k03j11l60p15p91n46k44M2N45J299J765J418
54393B12861M84j97j23M13Q55J037J134J256J323J160N88l41j176j318o82J98
54377B17472Q42J290J717J924J628J018N51K81j93j044j810j856j032J25Q31O69
$$ plain form
54361 222413 222330 221554 220499 219449 218475 217646 216992 216318 215365 214165 212929 211634 210082 208372 206874 205612
54345 205612 204178 202437 200851 199802 199041 198219 197516 197202 196937 196180 195125 194502 194447 194221 193241 191786 190470
54328 190470 189517 188915 188821 189275 189768 189673 189100 188885 189572 190732 191475 191382 190712 189851 188936 188036 187360 187061 187026 187122
54308 187122 187514 188427 189634 190545 190841 190688 190212 189172 187432 185438 183809 182624 181528 180380 179366 178507
54292 178507 177512 176250 175002 174055 173311 172534 171737 171106 170583 169788 168345 166239 163909 162083 161407 162007 163297
54275 163297 164271 164184 163173 162245 162493 164093 166113 167342 167282 166301 165037 163966 163457 163835 165137 166942 168673
54258 168673 170066 171281 172560 173839 174762 175096 175108 175359 176101 177054 177874 178613 179461 180208 180353 179710 178553
54241 178553 177133 175434 173552 171945 171033 170762 170765 170740 170479 169794 168776 167975 167885 168201 168014 166914 165592 165075
$$ packed form
54361B22413q3p76j055j050r74q29o54o74r53j200j236j295j552j710j498j262
54345B05612j434j741j586j049p61q22p03l14k65p57j055o23n5k26r80j455j316
54328A90470r53o02r4M54M93r5n73k15O87J160P43r3o70q61r15r00o76k99l5R6
54308A87122L92R13J207R11K96j53m76j040j740j994j629j185j096j148j014q59
54292A78507r95j262j248r47p44p77p97o31n23p95j443k106k330j826o76O00J290
54275A63297R74q7j011r28K48J600K020J229o0r81j264j071n09L78J302J805J731
54258A68673J393J215J279J279R23L34J2K51P42R53Q20P39Q48P47J45o43j157
54241A78553j420j699j882j607r12k71Lk5k61o85j018q01r0L16j87j100j322n17
$$ plain form
54223 165075 165491 165926 165490 164226 162853 161881 161289 160945 160923 161291 161849 162282 162391 161980 160750 158681 156436
54206 156436 154982 154713 155256 156151 157343 158816 160154 160901 161193 161616 162417 163201 163512 163435 163426 163687 163937 163816
54188 163816 163310 162624 161760 160472 158783 157352 157000 157865 159211 160173 160492 160475 160474 160576 160676 160601 160221 159565 158821
54169 158821 158179 157752 157680 158120 158953 159634 159599 158825 157824 157089 156673 156269 155562 154559 153678 153424 153830 154329 154423
54150 154423 154313 154537 155046 155155 154561 153921 154059 154906 155701 156080 156482 157400 158636 159498 159525 158882 158197 158122 158848
54131 158848 159881 160452 160357 160245 160866 162178 163493 164414 165166 165929 166334 165979 165152 164584 164574 164807 164986 165228
54113 165228 165673 166090 166134 165739 165065 164307 163755 163764 164280 164590 163991 162638 161350 160546 159825 158702 157373 156491
54095 156491 156460 157225 158512 159937 160943 161016 160119 158812 157856 157673 158113 158708 159133 159462 159939 160626 161384 162168
$$ packed form
54223A65075M16M35m36j264j373r72n92l44k2L68N58M33J09m11j230k069k245
54206A56436j454k69N43Q95J192J473J338P47K92M23Q01P84L11p7rK61K50j21
54188A63816n06o86q64j288j689j431l52Q65J346R62L19j7jJ02J00p5l80o56p44
54169A58821o42m27p2M40Q33O81l5p74j001p35m16m04p07j003q81k54M06M99R4
54150A54423j10K24N09J09n94o40J38Q47P95L79M02R18J236Q62K7o43o85p5P26
54131A58848J033N71r5j12O21J312J315R21P52P63M05l55q27n68j0K33J79K42
54113A65228M45M17M4l95o74p58n52RN16L10n99j353j288q04p21j123j329q82
54095A56491l1P65J287J425J006P3q97j307r56j83M40N95M25L29M77O87P58P84
$$ plain form
54077 162168 163039 163925 164657 165378 166529 168189 169718 170443 170459 170387 170454 170339 169891 169477 169433 169523 169252 168488 167594
54058 167594 167080 167198 167780 168373 168739 169177 170126 171468 172603 173308 174097 175455 177147 178638 179943 181618
54042 181618 184058 187182 190655 194036 196887 199160 201458 204473 208261 212504 217442 223892 232133 241360
54028 241360 250543 259365 267998 276463 284819 293693 303929 315651 327988 339647 349322 355632 357419
54015 357419 354560 348248 340189 331560 322794 314044 305443 297011 288639 280279 272049 264104 256544 249448
54001 249448 242918 237070 232107 228371 226124 225196 224953 224771 224417 223840 222771 220849 218170 215403 213167
53986 213167 211515 210158 208916 207635 205913 203424 200545 198178 196805 196089 195601 195447 195786 196081 195463 193828
53970 193828 192054 191015 190798 190992 191300 191537 191375 190580 189464 188765 189037 190309 192254 194454 196488 198065
$$ packed form
54077A62168Q71Q86P32P21J151J660J529P25J6p2O7j15m48m14m4R0k71p64q94
54058A67594n14J18N82N93L66M38R49J342J135P05P89J358J692J491J305J675
54042A81618K440L124L473L381K851K273K298L015L788M243M938O450Q241R227
54028B41360R183Q822Q633Q465Q356Q874J0236J1722J2337J1659R675O310J787
54015C57419k859o312q059q629q766q750q601q432q372q360q230p945p560p096
54001B49448o530n848m963l736k247r28k43j82l54n77j069j922k679k767k236
53986B13167j652j357j242j281j722k489k879k367j373p16m88j54L39K95o18j635
53970A93828j774j039k17J94L08K37j62p95j116o99K72J272J945K200K034J577
$$ plain form
53954 198065 199199 200133 201089 202271 204044 206751 210164 213454 216028 218216 220778 223844 226775 229141 231412
53939 231412 234425 238401 242806 247110 251420 256318 262213 268906 275720 281960 287157 290920 292802 292644
53925 292644 291012 289005 287483 286657 286401 286652 287346 288309 289455 290890 292593 294289 295976 298275 301845
53910 301845 306570 311821 317339 323298 329390 334513 337679 339002 339508 340151 341163 342147 342617 342503 342142 341765
53894 341765 341159 340090 338840 337856 336941 335358 332844 329912 327006 323956 320606 317356 314607 312116 309500
53879 309500 307022 305276 304310 303690 303281 303368 303979 304648 304875 304453 303293 301421 299209 297280 296009 295448 295778
53862 295778 297518 301155 306690 313466 320153 324965 326345 323683 317404 308495 298211 287918 278569 270159
53848 270159 262100 254253 247189 241402 236728 232774 229538 227272 226011 225447 225090 224406 223062 221214 219389
$$ packed form
53954A98065J134R34R56J182J773K707L413L290K574K188K562L066K931K366K271
53939B31412L013L976M405M304M310M898N895O693O814O240N197L763J882j58
53925B92644j632k007j522q26k56K51O94R63J146J435J703J696J687K299L570
53910C01845M725N251N518N959O092N123L166J323N06O43J012R84M70j14l61l77
53894C41765o06j069j250r84r15j583k514k932k906l050l350l250k749k491k616
53879C09500k478j746r66o20m09Q7O11O69K27m22j160j872k212j929j271n61L30
53862B95778J740L637N535O776O687M812J380k662o279q909j0284j0293r349q410
53848B70159q059p847p064n787m674l954l236k266j261n64l57o84j344j848j825
$$ plain form
53833 219389 217904 216622 215346 214197 213458 213249 213466 213796 213771 213139 212286 211898 212082 212261 212143 212251 213096 214300
53815 214300 215066 215163 214917 214524 214076 214089 215203 217207 219030 219983 220547 221638 223520 225818 228296 231073 234147
53798 234147 237173 239871 242425 245314 248856 253013 257543 262094 266213 269541 272189 274765 277781 281120
53784 281120 284246 286787 288646 289709 289920 289689 289656 289833 289474 288090 286107 284091 281847 278912 275643 273011
53768 273011 271284 269669 267417 264691 262063 259714 257536 255652 254359 253661 253164 252383 251014 249046 246742
53753 246742 244364 241755 238455 234473 230656 227945 226363 225112 223653 222269 221447 221084 220631 219872 219191
53738 219191 219079 219598 220446 221309 221966 222229 222054 221753 221789 222251 222659 222510 221886 221411 221640 222625 223976 225225
53720 225225 226146 226849 227514 228047 228168 227996 228246 229526 231526 233278 234223 234737 235574 237094 239159 241478 243866
$$ packed form
53833B19389j485j282j276j149p39k09K17L30k5o32q53l88J84J79j18J08Q45J204
53815B14300P66R7k46l93m48J3J114K004J823R53N64J091J882K298K478K777L074
53798B34147L026K698K554K889L542M157M530M551M119L328K648K576L016L339
53784B81120L126K541J859J063K11k31l3J77l59j384j983k016k244k935l269k632
53768B73011j727j615k252k726k628k349k178j884j293o98m97p81j369j968k304
53753B46742k378k609l300l982l817k711j582j251j459j384q22l63m53p59o81
53738B19191j12N19Q48Q63O57K63j75l01L6M62M08j49o24m75K29R85J351J249
53720B25225R21P03O65N33J21j72K50J280K000J752R45N14Q37J520K065K319K388
$$ plain form
53703 243866 246280 248751 251208 253471 255610 258237 262057 267001 272157 276764 280980 285364 289841 293559
53689 293559 295744 296454 296503 296858 298104 300249 302806 305061 306423 306776 306641 306838 307764 309057 310114 310768
53673 310768 311155 311172 310690 310260 310854 312589 314329 314987 314699 314250 313914 313597 313637 314522 315868 316595 316228 315328
53655 315328 314402 313108 310862 307720 304301 301198 298756 297084 295949 294913 293809 292890 292398 292241 292184 291994
53639 291994 291355 290111 288759 288156 288423 288613 287822 286200 284514 283192 282293 282001 282531 283765 285503 287813
53623 287813 290681 293588 296026 298176 300471 302731 304433 305661 307020 308707 310418 312184 314468 317305
53609 317305 320258 323405 327506 332753 338110 342491 346026 349575 353521 357632 361676 365502 368747 371099
53595 371099 372711 373947 374875 375497 376184 377360 378863 380131 380928 381407 381575 381259 380628 380205 380213 380278 379911 379040
$$ packed form
53703B43866K414K471K457K263K139K627L820M944N156M607M216M384M477L718
53689B93559K185P10M9L55J246K145K557K255J362L53j35J97R26J293J057O54
53673C10768L87J7m82m30N94J735J740O58k88m49l36l17M0Q85J346P27l67r00
53655C15328r26j294k246l142l419l103k442j672j135j036j104r19m92j57n7j90
53639B91994o39j244j352o03K67J90p91j622j686j322q99k92N30J234J738K310
53623B87813K868K907K438K150K295K260J702J228J359J687J711J766K284K837
53609C17305K953L147M101N247N357M381L535L549L946M111M044L826L245K352
53595C71099J612J236R28O22O87J176J503J268P97M79J68l16o31m23QO5l67q71
$$ plain form
53577 379040 377972 377056 376440 375985 375425 374745 374242 374010 373633 372814 372128 372592 374434 376778 378722 380342 382460
53560 382460 385690 389872 394214 397824 400238 401562 402109 402048 401502 400756 400039 399282 398478 398090 398608 399749 400687
53543 400687 401165 401876 403558 406149 409043 411826 414591 417831 422199 428072 435225 443235 452195 462553
53529 462553 474172 486135 497785 509515 522157 536018 550839 566339 582415 599108 616761
53518 616761 635899 656624 678456 701140 725224 751313 779153 808115 838343 870660 905245
53507 905245 941134 977158 1012825 1048058 1082680 1116729 1151045 1186928 1225044 1264935 1305809
53496 1305809 1347691 1391436 1437474 1484871 1532051 1578239 1623600 1667886 1709747 1747867 1782256
53485 1782256 1813831 1843096 1869984 1894779 1918430 1941869 1965595 1990010 2015525 2042142 2069384
$$ packed form
53577C79040j068r16o16m55n60o80n03k32l77q19o86M64J842K344J944J620K118
53560C82460L230M182M342L610K414J324N47o1n46p46p17p57q04l88N18J141R38
53543D00687M78P11J682K591K894K783K765L240M368N873P153Q010Q960J0358
53529D62553J1619J1963J1650J1730J2642J3861J4821J5500J6076J6693J7653
53518F16761J9138K0725K1832K2684K4084K6089K7840K8962L0228L2317L4585
53507I05245L5889L6024L5667L5233L4622L4049L4316L5883L8116L9891M0874
53496A305809M1882M3745M6038M7397M7180M6188M5361M4286M1861L8120L4389
53485A782256L1575K9265K6888K4795K3651K3439K3726K4415K5515K6617K7242
$$ plain form
53474 2069384 2096843 2124302 2151126 2176023 2197799 2216068 2230943 2242286 2249531 2252024 2249302 2241253
53462 2241253 2228305 2211298 2190935 2167489 2141174 2112460 2081710 2048732 2013100 1974855 1934510
53451 1934510 1892442 1848743 1803850 1758906 1715173 1673139 1632326 1591884 1551208 1510105 1468646
53440 1468646 1427048 1385737 1345534 1307724 1273662 1243975 1218139 1195080 1174358 1156589 1142560
53429 1142560 1132225 1124888 1120300 1119110 1122213 1129920 1141840 1157186 1175094 1195019 1217097 1241845
53417 1241845 1269268 1298557 1328991 1360809 1394847 1431534 1470688 1512047 1555468 1600692 1647492
53406 1647492 1696155 1747347 1801444 1858428 1918535 1982512 2050998 2124011 2201262 2282544 2367500
53395 2367500 2455356 2545320 2637072 2730580 2825616 2921823 3019157 3117848 3217853 3318517 3418703
$$ packed form
53474B069384K7459K7459K6824K4897K1776J8269J4875J1343P245K493k722q049
53462B241253j2948j7007k0363k3446k6315k8714l0750l2978l5632l8245m0345
53451A934510m2068m3699m4893m4944m3733m2034m0813m0442m0676m1103m1459
53440A468646m1598m1311m0203l7810l4062k9687k5836k3059k0722j7769j4029
53429A142560j0335p337m588j190L103P707J1920J5346J7908J9925K2078K4748
53417A241845K7423K9289L0434L1818L4038L6687L9154M1359M3421M5224M6800
53406A647492M8663N1192N4097N6984O0107O3977O8486P3013P7251Q1282Q4956
53395B367500Q7856Q9964R1752R3508R5036R6207R7334R8691J00005J00664J00186
$$ plain form
53384 3418703 3516994 3611825 3701851 3786525 3866322 3942319 4015531 4086583 4155788 4223250 4288860
53373 4288860 4352318 4413275 4471413 4526250 4576772 4621265 4657402 4682369 4693028 4686453 4660847
53362 4660847 4616179 4554058 4477087 4388291 4290679 4186817 4078604 3967420 3854348 3740098
53352 3740098 3624924 3508930 3392447 3276030 3160260 3045813 2933397 2823177 2714314
53343 2714314 2605649 2496972 2389343 2284148 2182247 2084167 1990588 1902246 1819442 1741928
53333 1741928 1669269 1601298 1538344 1481060 1429925 1384984 1346155 1313434 1286395 1263663 1243578
53322 1243578 1225548 1210258 1198419 1189728 1183213 1178121 1174193 1171526 1170507 1171602 1174957 1180369 1187731
53309 1187731 1197040 1207838 1219274 1231159 1244479 1260337 1278736 1298936 1320739 1344819 1371910
$$ packed form
53384C418703R8291R4831R0026Q4674P9797P5997P3212P1052O9205O7462O5610
53373D288860O3458O0957N8138N4837N0522M4493L6137K4967J0659o575k5606
53362D660847m4668o2121p6971q8796r7612j03862j08213j11184j13072j14250
53352C740098j15174j15994j16483j16417j15770j14447j12416j10220j08863
53343B714314j08665j08677j07629j05195j01901r8080r3579q8342q2804p7514
53333A741928p2659o7971o2954n7284n1135m4941l8829l2721k7039k2732k0085
53322A243578j8030j5290j1839q691o515n092l928k667j019J095L355N412P362
53309A187731R309J0798J1436J1885J3320J5858J8399K0200K1803K4080K7091
$$ plain form
53298 1371910 1402188 1435366 1470972 1508542 1547892 1589187 1632513 1677546 1723939 1771814 1821423
53287 1821423 1872414 1923832 1974768 2024695 2073313 2120531 2166595 2211832 2256217 2299489 2341627
53276 2341627 2382863 2423118 2461504 2496319 2525529 2547739 2563132 2573184 2579004 2580088 2574925 2562332
53264 2562332 2541719 2512650 2475199 2430545 2380259 2324977 2264656 2200075 2132959 2064381 1994230
53253 1994230 1922922 1852685 1786160 1724230 1665951 1610171 1556371 1504184 1452947 1401849 1350060
53242 1350060 1296770 1241566 1184740 1126858 1068245 1009296 951138 895381 843171 794892 750748
53231 750748 711145 676360 646191 620046 597161 576761 558359 541892 527329 514162 501709
53220 501709 489859 479013 469189 459752 450396 441826 434868 429122 423173 416240 409035 402662 397125 391424
$$ packed form
53298A371910L0278L3178L5606L7570L9350M1295M3326M5033M6393M7875M9609
53287A821423N0991N1418N0936M9927M8618M7218M6064M5237M4385M3272M2138
53276B341627M1236M0255L8386L4815K9210K2210J5393J0052N820J084n163j2593
53264B562332k0613k9069l7451m4654n0286n5282o0321o4581o7116o8578p0151
53253A994230p1308p0237o6525o1930n8279n5780n3800n2187n1237n1098n1789
53242A350060n3290n5204n6826n7882n8613n8949n8158n5757n2210m8279m4144
53231G50748l9603l4785l0169k6145k2885k0400j8402j6467j4563j3167j2453
53220E01709j1850j0846r824r437r356q570o958n746n949o933p205o373n537n701
$$ plain form
53206 391424 384926 378087 371703 366003 360789 356043 351880 348064 344122 340008 336206 333008 330069 326879
53192 326879 323374 319813 316280 312608 308710 304832 301520 299286 298077 296996 295023 292186 289652 288357
53178 288357 287919 287298 286128 284871 283951 283431 283392 283857 284240 283575 281649 279357 277612 276359 274991 273378
53162 273378 271920 270844 269947 269036 268277 268054 268646 269975 271432 272067 271256 269232 266840 264784 263303 262419
53146 262419 262108 262106 261858 260890 259169 257049 255023 253619 253254 253864 254665 254618 253330 251461 250187 250284 251745
53129 251745 254046 256582 258868 260581 261564 261781 261322 260564 260226 260976 262781 264821 266254 266946 267322 267650
53113 267650 267769 267426 266542 265136 263345 261620 260481 259754 258333 255170 250539 246024 243140 242123 242103 242159
53097 242159 241968 241585 240983 240083 239064 238345 238122 238110 237918 237562 237416 237676 238120 238457 238667 238853 239010 239148 239554
$$ packed form
53206C91424o498o839o384n700n214m746m163l816l942m114l802l198k939l190
53192C26879l505l561l533l672l898l878l312k234j209j081j973k837k534j295
53178B88357m38o21j170j257r20n20l9M65L83o65j926k292j745j253j368j613
53162B73378j458j076q97r11p59k23N92J329J457O35q11k024k392k056j481q84
53146B62419l11kk48r68j721k120k026j404l65O10Q01m7j288j869j274R7J461
53129B51745K301K536K286J713R83K17m59p58l38P50J805K040J433O92L76L28
53113B67650J19l43q84j406j791j725j139p27j421l163m631m515k884j017k0N6
53097B42159j91l83o02r00j019p19k23j2j92l56j46K60M44L37K10J86J57J38M06
$$ plain form
53078 239554 240619 242354 244196 245344 245293 244197 242866 242267 242739 243602 243802 243051 242163 242126 242946 243584 243023
53061 243023 241238 239094 237444 236460 235787 235122 234407 233541 232286 230736 229553 229230 229164 228038 225437 222635
53045 222635 221264 221472 221960 221747 221168 220944 220958 220466 219126 217252 215230 213245 211517 210227 209137 207816
53029 207816 206431 205833 206562 208084 209348 209731 209200 207930 206304 205054 204726 204987 204925 204129 203007 202057 201342
53012 201342 200902 201093 202103 203484 204618 205460 206383 207415 208031 207728 206492 204716 202950 201778 201675 202739
52996 202739 204584 206448 207533 207487 206749 206205 206276 206543 206477 206255 206432 207045 207585 207820 208075 208599 209232 209837 210544
52977 210544 211276 211586 211310 210955 211010 211253 211238 211159 211598 212624 213738 214657 215587 216665 217702 218622 219652 220883
52959 220883 222034 222877 223495 223901 223720 222576 220539 217953 215055 212074 209463 207678 206813 206677 207051 207626
$$ packed form
53078B39554J065J735J842J148n1j096j331n99M72Q63K00p51q88l7Q20O38n61
53061B43023j785k144j650r84o73o65p15q66j255j550j183l23o6j126k601k802
53045B22635j371K08M88k13n79k24J4m92j340j874k022j985j728j290j090j321
53029B07816j385n98P29J522J264L83n31j270j626j250l28K61o2p96j122r50p15
53012B01342m40J91J010J381J134Q42R23J032O16l03j236j776j766j172j03J064
52996B02739J845J864J085m6p38n44P1K67o6k22J77O13N40K35K55N24O33O05P07
52977B10544P32L10k76l55N5K43j5p9M39J026J114R19R30J078J037R20J030J231
52959B20883J151Q43O18M06j81j144k037k586k898k981k611j785q65j36L74N75
$$ plain form
52943 207626 207888 207454 206455 205261 203912 202228 200422 199128 198663 198639 198489 198053 197458 196702 195741 194760 194113
52926 194113 194054 194739 196251 198276 199923 200321 199509 198365 197655 197431 197396 197345 197029 196131 194870 194262 195146 197018
52908 197018 198446 198686 198302 198038 197797 197175 196476 196415 196998 197448 197333 197191 197762 199014 200250 200887 200835 200377
52890 200377 200018 200324 201473 203016 204332 205299 206197 206994 207202 206603 205707 205101 204666 203866 202665 201573 200792
52873 200792 199961 199041 198839 200065 202188 203963 205020 206142 207790 209173 209387 208950 209394 211480 214476 217250
52857 217250 219417 221164 222496 223101 222734 221441 219535 217543 215972 214840 213552 211491 208703 205843 203538
52842 203538 201985 201052 200469 199911 199095 197934 196518 194948 193255 191484 189774 188395 187663 187721 188320 189017
52826 189017 189718 190810 192486 194110 194720 194178 193352 192947 192655 191860 190880 190823 192223 194329 196063 197271 198706
$$ packed form
52943B07626K62m34r99j194j349j684j806j294m65k4j50m36n95p56r61r81o47
52926A94113n9O85J512K025J647L98q12j144p10k24l5n1l16q98j261o08Q84J872
52908A97018J428K40l84k64k41o22o99o1N83M50j15j42N71J252J236O37n2m58
52890B00377l59L06J149J543J316R67Q98P97K08n99q96o06m35q00j201j092p81
52873B00792q31r20k02J226K123J775J057J122J648J383K14m37M44K086K996K774
52857B17250K167J747J332O05l67j293j906j992j571j132j288k061k788k860k305
52842B03538j553r33n83n58q16j161j416j570j693j771j710j379p32N8N99O97
52826A89017P01J092J676J624O10n42q26m05k92p95r80n7J400K106J734J208J435
$$ plain form
52809 198706 201026 204265 208145 212372 216423 219391 220373 219014 215647 211169 206797 203530 201476 199841
52795 199841 197863 195634 193781 192576 191786 191263 191118 191253 191202 190680 189954 189452 189297 189370 189476 189274 188391 186937
52777 186937 185602 184939 184808 184862 185250 186318 187840 189116 189857 190465 191371 192521 193640 194603 195342 195710 195646
52760 195646 195317 194996 194980 195590 196895 198299 198838 198133 196813 195780 195312 195126 195014 195032 195215 195469 195726 195874
52742 195874 195642 194909 194092 193873 194465 195435 196313 197043 197785 198558 199271 199798 199883 199252 198121 197293 197419 198283 199178
52723 199178 199783 200230 200442 200016 198941 197861 197316 197105 196751 196228 195814 195529 195233 195116 195534 196358 196953 196849
52705 196849 196018 194617 193023 192100 192649 194258 195364 194995 193912 193468 193834 194090 193852 193883 194982 196991 199156
52688 199156 200943 202132 202512 201959 200717 199312 198233 197758 197917 198442 198890 199007 198922 198867 198824 198603 198271 198259
$$ packed form
52809A98706K320L239L880M227M051K968R82j359l367m478m372l267k054j635
52795A99841j978k229j853j205p90n23j45J35n1n22p26n02j55P3J06k02q83j454
52777A86937j335o63j31N4L88J068J522J276P41O08R06J150J119R63P39L68o4
52760A95646l29l21j6O10J305J404N39p05j320j033m68j86j12J8J83K54K57J48
52742A95874k32p33q17k19N92R70Q78P30P42P73P13N27Q5o31j131q28J26Q64Q95
52723A99178O05M47K12m26j075j080n45k11l54n23m14k85k96j17M18Q24N95j04
52705A96849q31j401j594r23N49J609J106l69j083m44L66K56k38L1J099K009K165
52688A99156J787J189L80n53j242j405j079m75J59N25M48J17q5n5m3k21l32j2
$$ plain form
52670 198259 198935 200155 201387 202292 203027 203846 204590 204880 204781 204915 205737 207007 208177 209032 209686 210181 210495 210846
52652 210846 211659 213242 215675 218787 221960 224249 225179 225265 225201 224720 222954 219892 216678 214243 212406 210773
52636 210773 209711 209674 210025 209443 207545 205406 204381 204889 206493 208668 211088 213373 214993 215657 215683 215753 216143
52619 216143 216355 215756 214499 213387 212804 212252 211206 209948 209133 208820 208486 207901 207463 207636 208419 209429 210227
52602 210227 210519 210324 209989 209790 209548 208944 208234 208202 209274 210942 212280 212767 212475 211749 211011 210669 210896 211479
52584 211479 212088 212652 213341 214311 215603 217120 218517 219248 219104 218628 218644 219331 220082 220381 220431 220669 221044 221164
52566 221164 220935 220613 220301 219876 219372 218991 218643 217911 216645 215251 214203 213682 213764 214461 215256 215204 214026 212704
52548 212704 212421 213226 214372 215561 216982 218266 218452 217234 215472 214158 213575 213730 214822 216757 218748
$$ packed form
52670A98259O76J220J232R05P35Q19P44K90r9J34Q22J270J170Q55O54M95L14L51
52652B10846Q13J583K433L112L173K289R30Q6o4m81j766l062l214k435j837j633
52636B10773j062l7L51n82j898k139j025N08J604K175K420K285J620O64K6P0L90
52619B16143K12n99j257j112n83n52j046j258q15l13l34n85m38J73P83J010P98
52602B10227K92j95l35j99k42o04p10l2J072J668J338M87k92p26p38l42K27N83
52584B11479O09N64O89R70J292J517J397P31j44m76J6O87P51K99N0K38L75J20
52566B21164k29l22l12m25n04l81l48p32j266j394j048n21Q2O97P95n2j178j322
52548B12704k83Q05J146J189J421J284J86j218j762j314n83J55J092J935J991
$$ plain form
52533 218748 220000 220402 220143 219177 217611 216162 215565 215773 216275 216882 217600 218012 217578 216507 215659 215558 215992
52516 215992 216585 217210 217829 218446 219265 220437 221631 222417 223040 224219 226081 227957 229422 230798 232259 233119
52500 233119 232663 231290 230155 229840 229897 229627 228809 227649 226488 225661 225313 225194 224875 224358 224289 225361 227501
52483 227501 229799 231320 231934 232301 233075 234216 235208 235740 236025 236437 237088 237811 238419 238891 239411 240213 241262
52466 241262 242124 242361 242112 242057 242737 244137 245967 248003 249922 251170 251473 251351 251666 252524 252966 251935 249361
52449 249361 246213 243662 242332 242097 242279 242103 241224 239943 238832 238151 237727 237326 236879 236335 235567 234634 233899
52432 233899 233620 233536 233098 232083 230775 229630 228957 228824 228956 228801 228092 227328 227289 228040 228887 229426 230066 231222
52414 231222 232536 233459 234250 235758 238371 241725 245355 249086 252821 256525 260619 265904 272801 280836 288931
$$ packed form
52533B18748J252M02k59r66j566j449n97K08N02O07P18M12m34j071q48j01M34
52516B15992N93O25O19O17Q19J172J194P86O23J179J862J876J465J376J461Q60
52500B33119m56j373j135l15N7k70q18j160j161q27l48j19l19n17o9J072K140
52483B27501K298J521O14L67P74J141R92N32K85M12O51P23O08M72N20Q02J049
52466B41262Q62K37k49n5O80J400J830K036J919J248L03j22L15Q58M42j031k574
52449B49361l148k551j330k35J82j76q79j281j111o81m24m01m47n44p68r33p35
52432B33899k79q4m38j015j308j145o73j33J32j55p09p64l9P51Q47N39O40J156
52414B31222J314R23P91J508K613L354L630L731L735L704M094N285O897Q035Q095
$$ plain form
52399 288931 295925 300849 303128 302762 300102 295401 288971 281826 275621 271413 268719 266260 263542 261260
52385 261260 260139 259862 259457 258385 256849 255208 253666 252665 253004 255012 257815 259982 260956 261401 262161 263432
52369 263432 265120 267319 269963 272461 274256 275543 276931 278555 280000 280963 281549 281961 282290 282514 282393 281616
52353 281616 280385 279526 279472 279466 278482 276746 275524 275450 275969 276501 277277 278667 280435 282120 283580 284811 285779
52336 285779 286788 288393 290558 292407 293361 294035 295536 298291 302004 306302 310799 314962 318677 322741 328117
52321 328117 334727 341583 348070 354490 361193 367668 372850 376156 378048 379612 381668 384270 387011 389596
52307 389596 391946 394009 395914 398207 401300 404689 407387 409332 411600 414902 418689 422259 425893 430076
52293 430076 434281 437547 439865 441889 443586 444295 444126 444131 444810 445416 445193 444481 444088 444175 444363 444489 444653 444727
$$ packed form
52399B88931O994M924K279l66k660m701o430p145o205m208k694k459k718k282
52385B61260j121k77m05j072j536j641j542j001L39K008K803K167R74M45P60J271
52369B63432J688K199K644K498J795J287J388J624J445R63N86M12L29K24j21p77
52353B81616j231q59n4or84j736j222p4N19N32P76J390J768J685J460J231R68
52336B85779J009J605K165J849R54O74J501K755L713M298M497M163L715M064N376
52321C28117O610O856O487O420O703O475N182L306J892J564K056K602K741K585
52307C89596K350K063J905K293L093L389K698J945K268L302L787L570L634M183
52293D30076M205L266K318K024J697P09j69NO79O06k23p12l93Q7J88J26J64P4
$$ plain form
52275 444727 444402 443834 443928 445726 449360 453650 457062 459251 461383 464700 469187 474089 479154 484477 489388
52260 489388 492686 494208 495264 497129 499826 502737 505650 508689 511879 515411 519819 525230 530812 535569
52246 535569 539431 543005 546505 549510 551656 552998 553781 554321 554994 555901 556561 556474 555950 555928 556934 558633 560563
52229 560563 562802 565660 568921 571770 573490 574103 574300 574775 575750 577229 579556 583285 588387 593971 599147
52214 599147 603895 608707 613644 618238 622268 626115 630244 634719 639359 644067 648770 653305 657490 661183
52200 661183 664169 666231 667495 668582 670255 672978 676743 681126 685416 689013 691946 694815 698035 701268
52186 701268 703855 705658 707082 708274 708671 707608 705125 701913 698614 695424 692302 689221 686137 682986
52172 682986 679884 677087 674588 671992 669107 666446 664756 664097 663807 663444 663255 663566 664171 664746 665556 667183
$$ packed form
52275D44727l25n68R4J798L634M290L412K189K132L317M487M902N065N323M911
52260D89388L298J522J056J865K697K911K913L039L190L532M408N411N582M757
52246E35569L862L574L500L005K146J342P83N40O73R07O60q7n24k2J006J699J930
52229E60563K239K858L261K849J720O13J97M75R75J479K327L729N102N584N176
52214E99147M748M812M937M594M030L847M129M475M640M708M703M535M185L693
52200F61183K986K062J264J087J673K723L765M383M290L597K933K869L220L233
52186G01268K587J803J424J192L97j063k483l212l299l190l122l081l084l151
52172F82986l102k797k499k596k885k661j690o59k90l63j89L11O05N75Q10J627
$$ plain form
52156 667183 669626 672108 673870 674823 675351 675806 676372 677144 678108 679203 680548 682498 685277 688649 692125 695376
52140 695376 698236 700417 701552 701619 701094 700485 699852 698915 697551 695989 694538 693312 692324 691778 692212 694368
52124 694368 698874 705885 714952 725331 736483 748186 760182 771903 782757 792561 801538 809881 817478
52111 817478 824004 829067 832233 833176 832028 829530 826643 823882 821092 817901 814463 811670 810584 811636
52097 811636 814452 818417 823180 828510 833833 838158 840430 839900 836414 830620 823789 817014 810552 804228
52083 804228 798404 794025 791508 790103 788752 787297 786380 786328 786741 787199 787862 789046 790487 791419 791334 790468 789529
52066 789529 789147 789649 791157 793615 796598 799302 800988 801552 801540 801551 801723 801827 801702 801482 801466 801896 802710 803406
52048 803406 803260 801902 799582 796730 793318 788976 783716 778231 773358 769443 766371 763972 762236 761250 761155
$$ packed form
52156F67183K443K482J762R53N28M55N66P72R64J095J345J950K779L372L476L251
52140F95376K860K181J135O7n25o09o33r37j364j562j451j226r88n46M34K156
52124F94368M506P011R067J0379J1152J1703J1996J1721J0854R804Q977Q343P597
52111H17478O526N063L166R43j148k498k887k761k790l191l438k793j086J052
52097H11636K816L965M763N330N323M325K272n30l486n794o831o775o462o324
52083H04228n824m379k517j405j351j455r17n2M13M58O63J184J441R32q5q66r39
52066G89529l82N02J508K458K983K704J686N64j2J1J72J04j25k20j6M30Q14O96
52048H03406j46j358k320k852l412m342n260n485m873l915l072k399j736r86r5
$$ plain form
52033 761155 762064 763852 766083 768304 770353 772228 773782 774744 774965 774401 772936 770530 767589 764830 762651
52018 762651 760903 759379 758114 756963 755326 752892 750456 749358 749979 751258 751789 750952 748808 745479 741010
52003 741010 735485 728794 720477 710253 698557 686116 673143 659420 645200 631499 619317 608941
$$ packed form
52033G61155R09J788K231K221K049J875J554R62K21n64j465k406k941k759k179
52018G62651j748j524j265j151j637k434k436j098O21J279N31q37k144l329m469
52003G41010n525o691q317j0224j1696j2441j2973j3723j4220j3701j2182j0376
$$ [...]
##END NTUPLES=NMR SPECTRUM
##END=
