
##TITLE=AC1350_CHIRS12168_7160055_efMWbtibv7
##JCAMPDX= 6.0         $$ Bruker NMR JCAMP-DX V2.0
##DATA TYPE= NMR SPECTRUM
##DATA CLASS= NTUPLES
##ORIGIN= BRUKER
##OWNER= Administrator
$$ 1.72 TOPSPIN		Version 2.1
$$ 2013-01-30 01:42:30.190 -0500  Administrator@X
$$ Compression mode = diff/dup
##.OBSERVE FREQUENCY= 400.02188249412
##.OBSERVE NUCLEUS= ^1H
##.ACQUISITION MODE= SIMULTANEOUS (DQD)
##.ACQUISITION SCHEME= undefined
##.AVERAGES= 8
##.DIGITISER RES= 22
##SPECTROMETER/DATA SYSTEM= spect
##.PULSE SEQUENCE= zg30
##.SOLVENT NAME= COFFEE_meoh
##.SHIFT REFERENCE= INTERNAL, COFFEE_meoh, 1, 14.98509
##AUDIT TRAIL= $$ (NUMBER, WHEN, WHO, WHERE, PROCESS, VERSION, WHAT)
$$ ##TITLE= Audit trail, TOPSPIN		Version 2.1
$$ ##JCAMPDX= 5.01
$$ ##ORIGIN= Bruker BioSpin GmbH
$$ ##OWNER= Administrator
$$ $$ E:\/data/COFFEE/nmr/AC1350_CHIRS12168_7160055_efMWbtibv7/20/pdata/1/auditp.txt
$$ ##AUDIT TRAIL=  $$ (NUMBER, WHEN, WHO, WHERE, PROCESS, VERSION, WHAT)
(   1,<2013-01-30 01:42:21.940 -0500>,<Administrator>,<X>,<go>,<TOPSPIN 2.1>,
      <created by zg
	started at 2013-01-30 01:41:15.378 -0500,
	POWCHK enabled, PULCHK disabled,
       configuration hash MD5:
       86 BA 57 50 F2 9D 5C 9B 26 00 A9 28 5F 66 2E 89
       data hash MD5: 64K
       D3 AD 1D 8B BB E4 A5 EC CA F3 D7 A8 D3 93 A9 EE>)
(   2,<2013-01-30 01:42:25.081 -0500>,<Administrator>,<X>,<proc1d>,<TOPSPIN 2.1>,
      <Start of raw data processing
       efp LB = 0 FT_mod = 6 PKNL = 1 PHC0 = 0 PHC1 = 0 SI = 32K 
       data hash MD5: 32K
       B9 A2 64 0A 17 92 12 0E 74 35 A5 A8 C5 98 86 D5>)
(   3,<2013-01-30 01:42:25.534 -0500>,<Administrator>,<X>,<proc1d>,<TOPSPIN 2.1>,
      <pk PHC0 = 96.87744 PHC1 = 0 
       data hash MD5: 32K
       23 C1 77 D4 D2 9D 75 80 4F F9 89 E8 0B 0A 31 07>)
(   4,<2013-01-30 01:42:25.768 -0500>,<Administrator>,<X>,<proc1d>,<TOPSPIN 2.1>,
      <abs ABSG = 1 
       data hash MD5: 32K
       FF 1A 11 D4 2C 17 ED E3 F6 B8 AE 27 C4 34 47 92>)
(   5,<2013-01-30 01:42:25.909 -0500>,<Administrator>,<X>,<proc1d>,<TOPSPIN 2.1>,
      <abs ABSG = 2 
       data hash MD5: 32K
       5E EC 2B 90 6B 96 C3 BD C9 16 46 66 AD 58 61 39>)
(   6,<2013-01-30 01:42:26.081 -0500>,<Administrator>,<X>,<proc1d>,<TOPSPIN 2.1>,
      <abs ABSG = 3 
       data hash MD5: 32K
       96 47 65 FF 64 93 58 63 92 28 41 28 22 7C 5B D6>)
(   7,<2013-01-30 01:42:26.221 -0500>,<Administrator>,<X>,<proc1d>,<TOPSPIN 2.1>,
      <abs ABSG = 4 
       data hash MD5: 32K
       B2 CC 59 78 50 85 E5 56 73 91 09 F2 CB 96 E5 E4>)
(   8,<2013-01-30 01:42:26.362 -0500>,<Administrator>,<X>,<proc1d>,<TOPSPIN 2.1>,
      <abs ABSG = 5 
       data hash MD5: 32K
       3F 02 94 4E 31 64 0A 26 CB 55 69 96 C5 1C F8 C8>)
$$ ##END=
$$ 
$$ $$ hash MD5
$$ $$ A0 D6 F9 9E 04 2D 40 B4 0A B6 5C 55 3C E3 F5 04
##$RELAX= 
##$RELAX= 
##$RELAX= 
##$RELAX= 
##$RELAX= 
##$RELAX= 
##$RELAX= 
$$ Bruker specific parameters
$$ --------------------------
##$DU= <E:\>
##$EXPNO= 20
##$NAME= <AC1350_CHIRS12168_7160055_efMWbtibv7>
$$ [...]
##$TP= (0..7)
150 150 150 150 150 150 150 150
##$TP07= 0
##$TPNAME0= <>
##$TPNAME1= <>
##$TPNAME2= <>
##$TPNAME3= <>
##$TPNAME4= <>
##$TPNAME5= <>
##$TPNAME6= <>
##$TPNAME7= <>
##$TPOAL= (0..7)
0.5 0.5 0.5 0.5 0.5 0.5 0.5 0.5
##$TPOFFS= (0..7)
0 0 0 0 0 0 0 0
##$TUNHIN= 0
##$TUNHOUT= 0
##$TUNXOUT= 0
##$USERA1= <user>
##$USERA2= <user>
##$USERA3= <user>
##$USERA4= <user>
##$USERA5= <user>
##$V9= 5
##$VALIST= <valist>
##$VCLIST= <CCCCCCCCCCCCCCC>
##$VD= 0
##$VDLIST= <DDDDDDDDDDDDDDD>
##$VPLIST= <PPPPPPPPPPPPPPP>
##$VTLIST= <TTTTTTTTTTTTTTT>
##$WBST= 1024
##$WBSW= 4
##$XGAIN= (0..3)
0 0 0 0
##$XL= 0
##$YL= 0
##$YMAX_a= 614969
##$YMIN_a= -523692
##$ZGOPTNS= <>
##$ZL1= 120
##$ZL2= 120
##$ZL3= 120
##$ZL4= 120
##$ABSF1= 14.98509
##$ABSF2= -5.573092
##$ABSG= 5
##$ABSL= 3
##$ALPHA= 0
##$AQORDER= 0
##$ASSFAC= 0
##$ASSFACI= 0
##$ASSFACX= 0
##$ASSWID= 0
##$AUNMP= <proc_prof1d_extract_pilot.lims>
##$AXLEFT= 0
##$AXNAME= <>
##$AXNUC= <1H>
##$AXRIGHT= 0
##$AXTYPE= 0
##$AXUNIT= <>
##$AZFE= 0.1
##$AZFW= 0.1
##$BCFW= 0
##$BC_mod= 0
##$BYTORDP= 0
##$COROFFS= 0
##$CY= 15
##$DATMOD= 1
##$DC= 0
##$DFILT= <>
##$DTYPP= 0
##$F1P= 0
##$F2P= 0
##$FCOR= 0.5
##$FTSIZE= 32768
##$FT_mod= 6
##$GAMMA= 0
##$GB= 0
##$INTBC= 1
##$INTSCL= 1
##$ISEN= 128
##$LB= 0
##$LEV0= 0
##$LPBIN= 0
##$MAXI= 10000
##$MC2= 0
##$MEAN= 0
##$ME_mod= 0
##$MI= 0
##$NCOEF= 0
##$NC_proc= -8
##$NLEV= 6
##$NOISF1= 0
##$NOISF2= 0
##$NSP= 0
##$NTH_PI= 0
##$NZP= 0
##$OFFSET= 14.98509
##$PC= 1
##$PHC0= 96.87744
##$PHC1= 0
##$PH_mod= 1
##$PKNL= yes
##$PPARMOD= 0
##$PPDIAG= 0
##$PPIPTYP= 0
##$PPMPNUM= 2147483647
##$PPRESOL= 1
##$PSCAL= 4
##$PSIGN= 0
##$PYNMP= <proc.py>
##$REVERSE= no
##$SF= 400.02
##$SI= 32768
##$SIGF1= 0
##$SIGF2= 0
##$SINO= 400
##$SIOLD= 32768
##$SPECTYP= <>
##$SREGLST= <1H.CDCl3>
##$SSB= 0
##$STSI= 32768
##$STSR= 0
##$SW_p= 8223.68421052631
##$SYMM= 0
##$S_DEV= 0
##$TDeff= 65536
##$TDoff= 0
##$TI= <>
##$TILT= no
##$TM1= 0
##$TM2= 0
##$TOPLEV= 0
##$USERP1= <user>
##$USERP2= <user>
##$USERP3= <user>
##$USERP4= <user>
##$USERP5= <user>
##$WDW= 1
##$XDIM= 32768
##$YMAX_p= 459775774
##$YMIN_p= -796909
##$CURPLOT= <Network HP LaserJet P1505>
##$CURPRIN= <$Network HP LaserJet P1505>
##$DFORMAT= <normdp>
##$LAYOUT= <+/1D_H.xwp>
##$LFORMAT= <normlp>
##$PFORMAT= <normpl>
##$SURQMSG= 1
$$ End of Bruker specific parameters
$$ ---------------------------------
##NTUPLES= NMR SPECTRUM
##VAR_NAME=  FREQUENCY,     SPECTRUM/REAL,   SPECTRUM/IMAG
##SYMBOL=    X,             R,               I
##VAR_TYPE=  INDEPENDENT,   DEPENDENT,       DEPENDENT
##VAR_FORM=  AFFN,          ASDF,            ASDF
##VAR_DIM=   32768,         32768,           32768
##UNITS=     HZ,            ARBITRARY UNITS, ARBITRARY UNITS
##FACTOR=    0.250966925370066, 1,           1
##FIRST=     8223.43324360094, -228342,      -174133
##LAST=      0,             -17133,          63066
##MIN=       0,             -796909,         0
##MAX=       8223.43324360094, 459775774,    0
$$ Real data points
##PAGE= N=1
##DATA TABLE= (X++(R..R)), XYDATA
$$ [...]
23814 24330 473823 19105 -48381 -11726 -182714 279179 -208294 -30631 -200403 152878
23803 732 31500 -206815 -538377 12015 -71552 -173222 194879 -149758 -27162 -245838 224196
23791 -165816 261658 -127019 211398 97483 -125736 102935 -30542 60435 28738 75398
23781 75398 88596 85023 16270 226956 -163398 46446 -158465 203627 -117314 -257087 -81716
23769 199432 323410 -72735 70983 -34762 165111 194988 45696 -246957 23834 78955 143377
23758 143377 -309097 218748 36377 159165 -92372 -18767 -108630 -67290 -27332 216883 126649
23747 126649 398895 -148020 -228315 -146628 163534 -48895 19327 179762 -164413 -165283 -286433
23736 -286433 -207521 113949 12288 -117840 -72067 43178 202649 226870 139668 -242607 -52964
23724 217775 120092 161963 -366950 -65330 177714 174378 171055 -398041 247093 42707 -51236
23712 77661 -35243 -117892 87912 217511 44103 301442 -139360 -4005 -166177 -79037 -179051
23701 -179051 34716 211242 -53390 -218170 62711 -64398 -106623 6161 -314024 166159 2254
23689 311811 21646 -154484 149308 -160970 105337 195663 88306 195016 94266 -91506
23678 -106360 10699 -57784 57615 -187923 70967 233327 -14390 -153022 -188306 115037 -22797
23666 -335245 -153804 -203437 -251802 -352351 -110780 -24115 197423 -114341 153194 281229
23656 281229 -325492 -296616 -218152 8697 -46471 -242043 -63011 14571 6314 -344136 -109657
23644 -16883 -410336 -94449 141619 -167012 170092 -49185 154105 -26439 -88928 -123429 -90364
23633 -90364 181266 -110799 -299730 147886 -118345 277348 230093 97193 211159 -115909
23622 -31653 -37067 15869 -114863 -263320 -59244 -166726 468751 -47686 -117067 -65362 14208
23610 23703 -76418 -163159 317811 2684 -106743 172720 -164762 129505 -100257 -4187 106079
23598 27517 -50584 -235851 59059 163482 25329 -106135 60698 115040 -155528 120520 -21397
23586 -59278 -187721 147931 -113824 -25824 -159340 -274158 267026 146569 148246 298049
23576 298049 51915 19546 170323 204672 40320 119425 111062 171842 -49756 -33925 356046
23564 71684 377771 206890 -188261 -168335 119404 51009 12964 83855 -71200 227301 222686
23553 222686 -167199 220512 123449 58127 -222869 -206145 -21664 -78536 8707 116264 139616
23542 139616 157432 158346 -88635 -41973 227114 42752 -155758 393252 16104 38817 -176717
23530 65682 -137724 -72261 136904 -75158 -150242 -36315 -163887 -102972 315325 -129645 -120548
23519 -120548 -123313 -382915 -6063 17171 -151933 -170573 -211856 -87494 -42553 -474322 -177956
23507 -84811 -59741 -341608 -171519 -84767 115671 305256 -148979 -139058 165905 62304 -156623
23495 -75997 23616 167676 82137 -231551 -563080 233462 128541 59680 -114406 28315
23484 -312338 411671 151258 -171950 -59359 -33788 130558 -296859 -88397 32174 -130342
23473 -490719 160146 -152264 292805 -105004 -203512 207922 -158482 185943 -195780 -265449
23463 -265449 208332 32643 -106961 85928 -142904 272305 -124631 25075 -228350 111220
23452 95446 261677 -111136 306752 -240432 -81961 -288573 4601 -246681 -144699 -25070
23441 -44710 9152 -98823 382887 368342 11172 -53960 157661 -49257 -28969 -192906 32205
23429 97536 9488 -162871 -52250 -161784 -138257 -225568 78190 -310437 83818 4824 313370
23418 313370 -4868 -176191 -148373 -68960 168070 -282628 80523 109561 4953 226340 -69089
23406 -52651 -127044 33256 163613 -23358 -199632 139757 54203 -105769 -150207 -54836 287361
23394 -385120 -88864 -84495 22057 149531 11320 43275 63114 -173632 -48727 -103591 141031
23382 145966 -167885 -292113 26595 -140894 -69287 -244706 208395 -100220 -64515 222162
23371 32289 -215208 -217906 -174729 82985 -93802 332343 20241 175531 -19619 105495 -227825
23359 29650 23025 -141643 -4987 66491 -100567 -14201 -26413 260506 186789 -387511 -159897
23347 -357681 -178998 169078 -78434 -68021 -60417 -74038 349607 -50681 -167521 227167 -110453
23335 -11299 -149132 51763 95321 -125823 -199644 -141451 -95634 104132 -74556 -231314 174608
23323 158922 -81080 -64468 40497 122974 24739 -52424 -17875 -38541 221711 -5966 81709
23311 117511 -133795 29022 -122862 207713 -96061 -312765 -182923 60261 -98174 108281
23300 41240 -347023 118303 146057 -197703 141279 -30504 -452139 -89912 267765 -226235
23289 184326 -2314 -312743 -372383 -107242 -6315 24942 19350 -5465 178808 -133629 54342
23277 120912 112575 113791 -54245 47218 211260 -112348 50740 -142269 -241554 161954 -205961
23265 -261658 -11142 467266 -29474 5451 -70830 -190526 -204798 235043 30914 -81578 -106934
23254 -106934 -72825 -42747 -72925 10727 59524 210699 55377 22347 10146 -24752 -40506
23243 -40506 -200949 -283511 99002 93355 -342397 111219 -171546 -72391 -23587 100843 -220312
23231 -54788 -172515 55150 178368 -130760 100557 124539 84110 27065 22178 84231 26895
23219 103715 -132019 -135776 -100205 -205118 -50906 153740 -121910 -190853 -202277 -42736 -80539
23208 -80539 29738 -47707 89903 -182699 124168 92624 101582 59403 -149645 122935 -240383
23196 70299 16860 -104698 112652 -312025 -20849 -40783 -346208 -81507 -49215 114136 -191710
23184 337263 -68730 59896 -206606 -179434 -122850 -110621 -244808 -377082 -7379 124192 -12516
23172 -37740 207856 72149 -12516 58035 9616 8207 27295 171588 -66373 -6823 148532 15165
23159 97882 -235489 74205 343381 -8694 -174096 -324 -224510 124622 -63383 835 47668 65284
23147 65284 369225 120854 14538 -144687 103585 -242305 -134769 36675 -195058 -235831
23137 -235831 -78763 -122755 24197 132731 105065 -331853 -21055 -122390 324849 137973
23126 -273315 23273 -38017 -149066 344972 -70988 -113517 -120036 -63014 -139186 -238338 229315
23114 -58259 -20062 -31832 -349814 -95337 -30529 -290643 -111179 -398399 -76827 -90073 -55798
23103 -55798 -256703 -84840 -160582 59535 -302182 -72059 -108082 -175249 -34136 -162405 -133349
23092 -133349 183553 20409 -140477 -29917 -111819 -207423 -592584 38879 176971 55966 210494
23081 210494 128589 279008 26657 -228880 155006 233747 155889 -58104 8664 -200480 -217254
23070 -217254 108226 -277156 -92761 -28017 -173019 -67298 -144962 109557 260046 -71385
23059 172251 -131993 -292633 29409 334938 -149676 -312796 64931 -190404 84426 -6347
23048 -124372 -35913 219050 114195 -70834 90339 -48477 -20032 324028 -219320 3293 -110670
23036 505889 36077 -48197 -161066 153306 330023 -84424 -229883 -100436 249350 153952
23026 153952 -17772 212246 165386 66549 -227750 -149090 -62415 203006 67062 -150792 79349
23014 -171885 -157887 -744 126387 -178351 -116649 -114809 -363744 -43151 -41209 199501 -4756 292205
23001 -66093 -142932 363554 -289058 -4491 116079 -105952 85954 -246963 -117222 158304
22990 -25873 -110109 27499 -145122 -150409 -76957 -101996 -203629 54232 -63838 34845 -64801
22978 -191373 35236 69238 163119 -10118 120034 -10041 -112980 122677 -142934 -288237
22968 -288237 -206084 -52659 -285448 -230267 -17844 -454319 166428 54394 -37078 178591 200661
22957 200661 -187152 121790 -16054 142846 -274347 -187540 231618 -143131 -52587 -66058
22947 -66058 -42551 -58041 -95659 -79995 75920 149423 -167047 -9511 278974 109511 164678
22936 164678 188715 111858 -208502 398389 -269495 130801 115262 -41542 291281 -30153
22925 252768 -111915 -148230 333099 -36058 73122 -301562 153944 -86376 -143788 -232797 213913
22913 51910 287256 -94825 69212 202647 209813 -368153 -262831 -329844 -214412 -52367 240679
22901 -377202 177980 136222 -102018 11173 -190623 -122543 -14943 -60051 124298 -15916 63363
22889 30110 -220743 -249291 -296613 -54628 -292583 -130526 -146386 -112752 -175967 -301663 270742
22877 267726 -21140 165602 102059 -159361 37798 157753 8976 -145373 -40382 61346 -1195
22865 -275694 -142154 98538 277635 -218969 -29540 166988 -93408 100449 18567 -96532
22854 86688 192319 -2202 150499 80877 81096 79292 77974 -40696 -63249 -121745 -45641 -63833
22842 -63833 -332504 141713 181511 -329285 -118744 157311 -132328 204524 237162 278281
22832 278281 -199333 12007 -255137 -317139 -92748 -70189 -42957 -28592 183320 -147385 -418933
22821 -418933 -25765 128586 -229240 -199312 -158712 181344 -101948 -347592 -115264 40768
22810 -83507 92436 -46377 -479353 228835 355094 62939 -326411 254247 61155 -238068
22799 -74626 -11873 -220313 -99012 25861 -55094 70012 -131861 87568 -256913 -261680 47839
22787 101956 74991 -31851 207991 234245 -25549 -117189 -140268 129 -4950 259650 -195530
22775 -30599 -129756 265958 225467 378009 -42458 100505 -163908 112066 -62781 -352848
22765 -352848 -77928 -106699 2946 -51241 8700 -289813 11211 -4553 36416 -31654 -153392 -15805
22752 107610 99437 123920 -143802 126637 113786 -217711 187779 -135844 245108 -272548
22741 -15435 -43865 112702 -254186 6907 -106905 102476 253948 379594 48515 -81196 -237024
22730 -237024 -133689 -134591 81338 243561 91859 -384712 161714 -26914 -358292 234997 -243657
22718 60223 -172384 -217310 -167246 147378 158615 105584 105424 223089 155230 265545 18209
22706 18941 -166412 -51910 44137 -3197 10399 46745 30903 -26366 -230756 99120 194891
22695 194891 34838 77996 -83317 -101286 -79738 -88783 -32570 143760 -104930 -442868 -311488
22684 -311488 96383 -51013 -357098 -79752 277594 13029 -151131 -134137 -241906 153252
22673 153887 177802 -263971 -176099 251345 -30753 -570934 -64399 -159570 -5125 80347 -128134
22661 -131120 -31969 259531 -29181 95602 118082 -89579 289656 -67834 150678 5831 -266944
22649 -359127 -138122 -53114 106134 24610 71212 -174423 62214 -22532 -159697 -46637 36154
22637 -98799 -58956 -136334 -56718 -183335 443842 137876 237088 36112 126312 213722 136788
22626 136788 -293541 -226547 -183832 115376 -203118 83845 -46617 1811 -207276 352338 -326754
22614 -133648 -228318 -394404 -28001 -76262 -185319 13026 -69965 -65156 -58866 -180217 -240813
22603 -240813 -52701 -26469 302404 1936 -97201 197648 -117329 175882 137464 -216057 34435
22591 15259 -100514 13012 -125229 -150853 -227608 -71963 -96845 -182046 -22044 223685 -91321
22579 -70945 187348 -135673 67187 -289089 -80671 -364425 -154623 142102 -228453 -129152
22569 -129152 180214 -156407 382680 -77724 225542 187445 16728 53738 -130006 -139615 155200
22557 -177391 -54986 63922 -102967 -96714 -73049 323155 -114757 87066 421 -397622 -81922
22545 -8344 -379356 -400605 48965 -164880 -189750 200675 187260 97614 -54625 288454 -29408
22533 -205241 -123611 40035 -7728 -234468 166399 -290238 -107365 84854 -138155 17250 -131327
22521 292823 -110606 -268489 186537 206271 -107815 -235326 -215222 -30364 228916 -109401
22510 287124 113220 100164 14031 49759 67441 -7735 -189937 -45746 -98329 -413434 -254727
22499 -254727 89938 -36080 32117 -8809 44321 -305456 364941 -107860 196219 131299 13087
22487 -61500 -334970 86015 -96399 -109641 -209712 -89344 141355 187435 -133080 -85678 -38008
22475 -160849 -87790 167556 31613 -205599 -203878 -240397 89782 14717 -145888 71160 137373
22464 137373 -240453 -366086 -118521 174556 62367 -34092 -86958 -118805 -63823 -256969
22454 -256969 -147811 -122482 322373 -132253 19807 -188180 -103931 101243 358026 126153
22443 -77199 -80659 282736 -52477 -216267 -410394 39181 -94157 98946 -13572 171531 -100011
22431 155320 -38194 158725 -417239 72991 204262 -125524 86185 99231 -106066 -123680
22421 -123680 157982 45454 -142373 -159794 -397182 -126195 -392125 50233 44631 -73399 194504
22409 47069 160967 -49365 -106188 166808 -19703 -108038 -53940 -235638 7122 96041 -49908
22397 129249 91154 293340 308101 -107757 -42728 104908 39517 -335522 -8545 244943 -32120
22385 -374811 -35563 14990 -116137 -305417 -256661 -30882 39563 -50642 186950 206546 182046
22374 182046 94063 18941 124767 -174227 18061 -199848 481190 -81814 80430 85194 -139906
22362 84322 -146384 223765 175211 265064 294893 -135963 30228 117707 -257769 126306 -52001
22350 -34698 -12863 -93085 -49432 158542 -291201 -108376 82898 292698 226119 -250004 -245928
22339 -245928 -119666 60540 -73564 -116260 -175221 -134407 267855 -129935 -318575 38811 -163511
22327 -138512 103907 122402 -166605 22808 -195508 -114392 -144569 136761 -88099 -325467
22317 -325467 130527 -246525 104078 175666 247750 -9039 -84099 168312 -68470 111865 -10078
22305 -135841 -159857 134536 -83888 -302392 -127973 -226698 -118638 50056 -76566 -38139 -60668
22294 -60668 -120037 -86052 -188849 54117 -74745 -260604 -74234 -267623 128241 48004 -93688
22282 -112196 67187 196112 235151 -13540 -80620 51680 22970 87119 59139 112206 -106283
22270 -155710 -143707 -82944 -3733 -239042 -258335 142224 30453 -89816 -456743 -243827 -331235
22259 -331235 242892 -82890 -94305 -60568 -2510 -285840 78671 -115514 -139409 -320942 -189703
22248 -189703 -166292 -260241 252483 -17837 -179852 127819 35823 -142747 -70291 -82302 174455
22236 -309097 -29920 41417 -147461 66274 -209086 93953 26278 -329579 221671 -292235
22225 -14319 127984 -130028 -81255 -145823 34165 53387 -43532 294983 45110 -82741 -86332
22214 -86332 392341 -109034 -146268 -98491 19837 -137158 -62899 -52247 -41302 184078 -4178
22202 -261222 -126841 183643 82779 -79778 -328412 -195685 -258464 24011 -163632 -42180
22191 -157988 -47575 -286765 -81740 169851 -216598 54180 -220677 -135999 -286635 46466
22180 134205 71718 63319 245317 137276 47306 164870 81160 19495 296439 -30338 -285429
22169 -285429 44451 -155788 110015 -225559 25611 -61214 -53981 284917 -242373 76692 91999
22158 91999 -19131 -336717 90838 -58198 108057 -161636 -49382 -82157 -68029 247004 -9581
22146 -245046 131163 66786 -36549 -92231 -15207 -197615 245415 -18335 -160775 160545
22135 351822 -60378 -84640 369996 -17191 60299 -18366 -101722 -148164 -259122 22028 235270
22124 235270 -36283 -156554 -72511 -142301 -378614 -416657 -1282 151891 340247 -498677 66185
22112 40366 77605 -14156 121237 21713 102788 -87152 -167344 -27247 -155262 7116 336176
22101 336176 -71931 211263 264215 203872 -34977 -87292 -176530 -8707 214550 71935 -202641
22089 36522 16969 -46226 144549 134456 -16074 -35718 -120221 -98051 -145601 5399 19062 298021
22077 298021 132581 -32183 22777 93915 98474 38096 -87572 -85374 -109708 254732 283026
22066 283026 -70931 154419 -270943 -34739 10281 37551 327249 238920 53963 -204358 44571
22054 -70040 -434669 -458178 -408349 24972 19844 -134185 -135960 -359937 -51888 10192 -1262 122696
22041 215273 48420 -87498 138577 -156648 76339 -482191 -197359 28407 -5778 -141106 -137652
22030 -137652 17583 -254850 170609 48688 -294770 -186259 -66012 -207682 2322 7642 204053
22019 204053 -152006 -203862 -55529 -131483 -93779 -152999 73034 90561 -303573 -336603 293674
22007 -49106 -14190 131904 -70569 -184384 13590 -469652 331207 -154541 -27178 -286586
21997 -286586 7122 -92684 -88081 12548 10197 -100619 81302 26830 -99379 -86295 -169305 223367
21984 119928 78190 28161 -259954 123999 -147392 57500 25097 92048 117214 4682 150085
21973 150085 -182442 -127423 -19535 146362 -79818 -78070 -149661 157288 132186 90973 30200
21961 55313 93275 -184539 154731 -179688 97383 -83045 -322195 -318976 3842 -210818 77792
21949 -138485 -424043 281781 -27551 124719 140764 -87659 -75626 -201727 -179888 41563 -52871
21937 -153066 75410 -74585 315854 -48172 -100539 -253357 -64369 -105716 -143793 133739 -109399
21925 172300 -319116 161827 75119 -120360 103812 -49139 -62509 -329104 136511 -58641
21914 169653 -142095 14077 -287815 -203394 25333 -43929 -245090 90314 -287397 94470 -104681
21902 -82313 -15694 -36543 -14133 -175122 -76382 75794 155131 -247226 -171315 -67773 209218
21890 247203 -68104 10798 43371 -238341 30089 -668 -14483 -117241 -313652 -24654 -96466
21879 -96466 -205204 206200 294710 -97896 -252292 -118833 34453 20434 171926 -48262 -97897
21868 -97897 -88046 54239 -200398 -395538 -48678 126450 194981 -126171 27834 72869 -273166
21856 -199076 -81230 -94298 -330240 161921 -44501 -74572 -130546 127047 -188248 -12755 -406638
21845 -406638 53064 156153 -129903 506631 222476 -87810 65288 329254 181992 86556
21834 32430 -136422 -514249 16189 -117673 518272 58166 -116934 -11263 -97440 -108940 -91127
21823 -91127 112616 -130625 -90395 -53594 -16798 -64160 151244 -128296 17642 -172500 -135058
21812 -135058 -170 31309 -122599 -158956 -39467 -261229 -234568 121373 7668 71778 -93534
21800 128957 -98642 -104685 194259 -115353 127639 193995 -31262 131430 -289997 -230122 -58846
21788 -86677 155278 -51657 -152468 -133404 40191 95205 -420407 207205 -340415 -172281
21778 -172281 -77166 -237129 -327563 -177579 -268153 -152665 -208734 -22131 109425 -104249
21767 322577 -349482 -57909 -234040 6980 81900 -42064 -116193 236917 19026 118441 -370151
21755 -46450 -93298 139806 -330561 -58928 -98060 222838 -57736 -63667 -74806 86214 -140068
21743 101659 -88509 -94240 127199 -188141 24989 -230374 47482 -21196 -133135 -106184 -192127
21732 -192127 343062 89829 141768 352072 -190479 -271665 212914 166250 -91565 1709 -200063
21720 -215088 -129322 22876 131717 -88181 -120520 160821 -300774 -305474 -67355 -25638 43017
21708 -181970 -156380 -109874 93345 73768 205973 -283443 269737 -20449 159895 -42431 -140361
21697 -140361 -866 -18766 -315877 -216704 -138107 -12171 -64492 -114274 -301206 58217 -29338
21685 -72124 -281374 65593 -81845 -150523 -49009 -16382 -286514 -54648 -133440 -42630 457549
21673 1992 116130 64372 71608 -134762 218191 371674 -80940 9068 127367 -171301 -273991
21662 -273991 -115668 -276506 -83097 -175575 -176546 -45947 148146 29978 -124201 -39871 -41394
21651 -41394 25222 -146246 233886 37948 138815 -246246 -13375 148378 93105 -311345
21640 -126222 246553 -58695 -20456 72488 78413 -223510 -290178 -82013 -274746 127788 -283406
21628 -324288 430299 182488 -170604 -112296 119304 337920 185090 -231870 -154569 97687
21617 10888 -143547 -143003 -154258 5922 -316470 -113762 -131319 -141486 -221368 -154444 106942
21605 -70508 76412 -120857 362095 -284696 49779 136401 290863 -329783 115444 57368
21594 -121140 88171 -273113 181231 64772 278445 -93886 -53512 -222091 -235889 -115489
21583 288297 143703 -99220 125472 -116501 -351040 -197152 15112 -62149 -108795 26999
21572 -167930 -380757 67225 -118089 -118031 46816 38819 -184747 333926 -29305 -163514 -183861
21561 -183861 177986 187629 -68737 -122216 133215 52724 -79345 170359 -464185 -135667 361642
21549 -67036 244589 -325703 -110956 -169093 -162768 -35164 -8874 -92988 -33034 -6822 -201336
21538 -201336 -154005 55904 78672 68859 -87280 96685 -77305 270410 -95766 -303997 -66904
21526 -15303 155870 -1722 -370688 82418 -45056 -740 28095 60029 239552 -233206 98220
21514 -90557 -45511 203797 155138 -121260 57523 363095 10990 -102652 -8501 3374 266835
21503 266835 259607 -384747 92076 230584 -182812 -315171 -137587 181987 -56903 -204542
21493 -204542 -154642 -431893 -23144 -323031 130421 -193267 -114667 -113581 141340 -40813 44707
21481 -106046 -115627 -78736 -229773 -16319 -177941 -54960 15352 -56493 299859 -178826 -100746
21470 -100746 -145796 -27666 82537 -178698 245577 -216565 73746 500525 24901 260785
21460 260785 47034 -532115 -16003 -325228 -88771 72626 72673 -197827 64472 294906 -94741
21448 -332104 -128162 -260953 -297417 69410 156671 -290702 -19444 -157028 -125532 497298
21437 82148 459561 624253 204378 506575 341984 336697 176786 -74781 -186230 -19270
21426 -62367 -346422 30270 -215584 27151 163918 -246005 22025 314915 -355210 -333437
21416 -333437 -141393 117175 267964 181658 23972 -13983 -441521 50391 -152629 431293
21405 -289628 152748 117143 372266 52494 25833 -220861 -27387 -61333 -361857 -9770 -199337
21394 -199337 119454 -43779 35708 -280228 218735 -299916 -50539 72611 162476 39232 -129656
21382 -91761 -561600 41320 174850 -104750 -119612 -188620 -4294 -71614 -279032 47807 28358
21371 28358 33161 122962 182562 -231166 353143 -28043 193422 -193584 148813 -204819 -313670
21360 -313670 -78455 -201685 225621 161719 -87834 -236745 14390 200138 -332323 126980
21349 -189275 -204994 -237602 -77390 24923 -266693 -223758 -93732 -121800 122466 151809 269775
21338 269775 50133 -64441 -63987 85486 -87825 -56589 -147270 -396005 319398 37988 8766 -63690
21325 -5466 318410 -80023 27371 -117288 -19371 26665 -139503 -122267 68921 48778 38119
21314 38119 125036 368941 -176954 -25303 81891 151441 -61798 -459207 -113187 -32475 -290009
21303 -290009 119472 -118748 61052 -41437 -46969 78757 150383 216012 165636 3880 -19911
21291 214772 -310718 -167930 -314128 15049 -48688 -156792 -18394 -114214 249824 70135
21280 88309 230066 -356445 257616 -28495 -179225 197916 -263671 -153876 -58285 -226573
21270 -226573 -16488 -176313 -287922 -46048 -345669 -280092 -219061 191761 2429 -59985 -193165
21259 -193165 -48405 390338 122655 -359547 149262 16348 -90720 1591 -340355 -302665 192161
21247 -153727 -285126 -92383 -85162 85571 9762 46769 -62817 84599 -326414 245843 -271149
21235 -186785 118619 -118614 105351 64383 -89914 -153634 33782 62146 -150582 -23879 -42437
21224 -42437 353327 -299594 55186 166783 -72371 -32471 56473 323871 177749 23111 133016
21213 133016 -106728 -90420 -146417 -61512 150868 195641 4284 -311251 -134038 -32148 -60823
21202 -60823 -204266 229890 -198925 132896 -207883 312715 35404 -38020 274167 -81574
21191 87176 185048 61800 -1193 61510 -49622 -208668 104680 -67667 -66848 6007 -81579 -67051
21179 -67051 -147309 135668 85109 -6167 -107971 -88014 -273592 125244 -21489 -325555 -198091
21168 -198091 -310719 44056 -107900 -180236 142316 -218057 89069 -119512 -216460 88075
21157 243362 192257 -80398 -201159 124178 247880 110538 -133979 42658 125667 -201880
21146 -44352 -299221 -222925 -524304 -60135 -149802 -31562 -312512 206107 -38554 -2096 -42664
21135 -42664 -319917 135960 -116997 180025 -168659 83653 -15233 -149505 -18785 197900
21124 -430239 92529 244236 -53736 -41152 63054 -49081 -303486 -248984 81485 193872 37113
21112 927 174289 -19373 16467 -263406 -328687 -86155 -165547 126333 -96605 198142 28780
21100 287732 -17352 170637 58595 -250071 244148 -14241 9573 -62155 121016 -352805 -105256
21088 -92152 48330 1077 -105151 102995 -139595 43360 -155047 -379240 -160194 69692 8480
21076 -12837 217881 124358 -22984 -62538 -52517 29387 -89779 -69123 -147622 -196319 272807
21064 -137161 -371743 -54982 -89995 -114212 -82249 158158 -26945 -225788 -56745 58754 105711
21053 105711 -68819 80452 -353136 -238809 -89278 64499 -211670 -286224 -134445 175607
21042 -138150 -133801 -226268 147617 158535 91019 -110190 -472858 69409 11245 36145 56720
21031 56720 -126150 -132551 -28713 -66191 -95745 16881 -291664 -219057 -56704 -263287 134882
21019 126602 19304 139914 -91961 -31695 63759 -164035 114299 -213871 50152 25805 -128482
21007 128805 110708 -22158 -128731 -49377 -50600 -86238 53977 -87008 -291422 87335 230941
20996 230941 112486 -10554 -307538 -190867 -91728 -18831 -43415 -156027 31226 -115125
20985 -25258 -71538 -77485 -412161 -268369 -470740 68661 -104223 44672 41157 -145581 39334
20973 -43727 177069 34256 -270122 48392 -233989 29726 -112939 17211 128608 43312 -93030
20961 -108944 -332982 -172631 -49916 428692 -28182 67578 184999 82975 -228838 -181632
20951 -181632 -90213 -152490 61202 34259 -9077 256002 -117011 -233880 -221033 -122575 145781
20939 -250961 209374 24612 125955 -74027 116852 -88207 -98302 -131139 -248849 -90588 -344441
20928 -344441 99460 137551 -225814 -47549 -42846 233064 -88294 -81013 6686 35415 -46790 -73642
20916 -73642 -94257 227209 213625 -154308 -366506 -285349 -71327 -200122 39298 -286491 -136630
20904 102831 -143034 -395411 -267169 100894 -30314 252157 -98651 -166960 87010 -69754
20893 76616 72667 86792 -243485 -311122 -161181 -47949 -189383 -106115 -48582 -56620 32561
20881 100829 35199 -28099 54471 -193979 -385955 38205 4641 -37514 -129411 96915 -112157
20869 91515 -143851 -242176 -97795 -113066 99517 58237 121371 112513 -315678 -40240 29918
20857 93611 -23729 -50121 -83162 76875 -191634 -166778 -100947 -36020 167340 314740 45674
20845 47661 -152734 -136899 -203728 -134395 -97179 94146 -90845 -110484 -80785 -4736 9366 -241123
20832 718 -411384 -58622 25209 -342861 99028 191664 9929 -28425 51663 -96849 -178945 216656
20819 66774 -154383 -191637 26282 -168865 -235829 913 116805 181500 -8557 17291 17914 43914
20807 43914 96537 -126484 -194313 147657 -225786 4521 358014 139014 31866 -167357 -311744
20796 -311744 -135885 317285 168327 -110510 -123483 133881 -87581 -151976 149242 -73664
20785 -21002 -126094 11484 -129763 25862 255243 -35844 -118096 -93823 -96612 63724 34079
20774 34079 -418814 -311599 -306480 -95365 -15630 -246559 -45139 -4206 285146 -146261 127591
20762 136828 6905 -144364 -476035 -3042 -142286 -137954 -263237 -169336 -163855 -9695 -214877
20751 -214877 -83152 322575 225167 -8231 67534 -316084 -57798 249517 -246391 -136849 -321817
20740 -321817 -209545 -24495 109293 16087 -39314 -27014 -111394 -314225 19358 -497873 295434
20728 88488 -147127 -274129 301270 156727 59150 -284242 229110 -28841 156633 -119428
20717 246308 273435 -409216 43593 -74373 -89104 99698 311159 158981 -241038 36754 -157303
20705 -80207 -210099 15154 282460 -423998 -224093 -271739 -99303 128921 -49918 -259050
20695 -259050 253942 57140 14824 -159971 -290864 -177406 133336 -65099 -52715 -315609
20685 -315609 -100223 -340866 8959 -102800 -388272 -120860 -162115 -175315 2812 -107655 33307
20673 237240 173817 -203937 108875 287793 -287281 17423 -246443 -207623 -123599 -28903
20662 116581 -201966 -120945 -167233 -218352 -179142 47326 165733 66862 -169784 -129861 90548
20650 -83323 184048 -337739 -81923 -53815 -75266 11936 -196469 -60220 81146 -193442 32693
20638 199082 -38507 23961 94509 -33239 -178326 -143804 -39573 -174212 156361 -125556 -165371
20627 -165371 24072 7833 -363752 169460 43494 86243 220100 -42627 119143 -233015 -159350
20616 -159350 9027 14841 -167162 -221787 -362833 5332 -251901 23321 -78620 2320 80404 -104550
20603 -322910 -15409 -197631 154372 67926 -27011 306408 -297415 -130696 -229035 -197265
20593 -197265 -268011 172758 147482 71378 -274808 -376384 110116 -125627 158222 -272687
20582 -432175 -193749 32176 -157902 -131315 3613 75573 -141431 -247125 -127252 148758
20571 124402 30822 118726 -59877 -38691 -61964 -96789 37533 -177868 106198 181218 -402372
20559 -232718 169715 -82242 -55874 160632 -290371 -301520 361101 -110016 77562 -17095
20548 88138 54788 -221629 210805 24087 -55480 170227 -165893 -177382 -448358 77271 -17315
20536 27859 -261446 62066 -3911 -129643 -124919 48011 225552 215914 -147116 -64379 -183556
20525 -183556 90546 191600 -8094 -31804 -116333 -195822 193427 139262 -481098 -37638 -91836
20514 -91836 -7991 -20890 154917 -260355 126696 140613 -205616 -28674 -151868 -178585 5582
20502 179532 129178 -134289 26977 201558 -90247 11478 -119438 -9334 -228997 62480 -137470
20490 -175529 -17256 -4501 64862 -183796 97527 -30513 -230771 -7636 -129569 -40313 -50491
20479 -50491 -84548 -136589 -200186 149817 -265231 -22769 107040 -33949 -150223 65205 43706
20468 43706 -52519 -209998 -103089 -166218 99130 -332571 -226388 82423 -307525 181436
20457 49225 -112572 46469 124248 -72617 83893 -27982 -299005 -33891 -3290 23222 -63400
20445 96633 -56462 -398394 -36307 -127773 66805 -148733 34212 19143 -122117 223177 235308
20434 235308 -98817 259963 4920 -196926 -138062 -215822 129370 -307694 -86836 45127 -332854
20422 35120 -103923 -69466 111474 -216739 -138099 234551 -80607 27163 122543 57221 -107504
20410 342050 91679 -253085 137009 65426 -107859 -20000 -516195 -465749 63385 66215 -267397
20398 138896 13839 -107280 -186535 345172 -110236 -169255 312149 297350 -139016 268995
20387 214427 239623 148977 164245 102125 -198190 -367482 -54738 -107543 10894 -212197 -32761
20375 -111566 -29582 -278327 128316 -472584 54496 10538 -27796 -65685 -93020 -45927 -306331
20364 -306331 130773 45083 42231 -95095 -52572 -127470 -187999 -59819 -240832 -207053 -312452
20353 -312452 -35931 -35316 -241777 -38010 112599 -94859 57422 -295495 -25127 -193797 -160153
20342 -160153 16645 -130912 -144119 -90537 -15145 -41610 -112538 12948 -42 -91980 -174978 -100246
20330 -100246 178532 137410 94814 -571971 -79944 -171808 -249446 -317938 -230600 -60691 24290
20318 -194874 -252234 -195605 130548 -222902 36047 86206 -70126 -553617 -323189 62924 -86727
20306 -193444 -241995 55430 203054 -88736 -134264 382276 92054 251700 91000 -309998 6583
20294 93262 240434 166416 393359 -152187 -173178 -20358 -310985 -89945 159392 -154384
20283 -190716 -216604 -296118 98059 -219454 100096 -354676 163330 -278591 -168875 -124434
20273 -124434 142418 -112375 129141 -292875 -328277 -106215 -50133 -15732 5094 92914 -133227
20261 -110072 405883 -158783 -90106 -39926 52957 -43028 -195957 -231991 -167312 -49646 -291838
20250 -291838 -240615 -169518 74102 -289286 74932 78119 91980 -58548 127044 433306 126186
20238 585 -27041 -347751 96468 -108447 -8037 -211336 -402165 -81530 70932 -292121 49064
20226 -98798 -279607 -346475 212828 -144522 -20440 -16354 -123884 -35019 -49623 -194874 135772
20214 32093 1355 -132893 108420 -106451 116011 32501 108485 -68653 -29285 -115561 150360
20202 97509 240674 -249125 -202376 -131042 -419968 -192861 36793 -94859 -183963 -73932 308688
20190 93677 72504 -363963 -38236 -526168 104915 -172186 -80275 -276340 19357 -53521 -69367
20179 -69367 -260515 164005 110101 -22781 169530 -59223 37125 116167 -312091 -150573 106671
20167 -388858 -69382 175575 -241637 106254 9849 -104962 -156712 -101755 -31961 -108902 -136127
20156 -136127 11931 69985 -114148 -260363 103957 -263291 98591 -330747 -156579 85340
20145 26283 144811 109154 249132 -21283 -49185 402840 -24585 -124618 -183904 -218352 -169894
20134 -169894 -397577 54344 -93345 -56358 122576 -21452 337390 9690 -14402 273390 5062
20122 130341 -1782 -219024 360430 135189 97184 -226166 -225767 373396 155529 209242 14602
20110 -344572 -383015 -127052 59133 -197349 82257 -20065 -248878 189504 -813 90956 -47491
20098 -124554 70288 26364 -69126 18364 -211451 -404824 -36859 127181 244331 -251896
20087 129457 -201970 161502 101104 78288 -109924 -81781 95800 44812 -153265 -187624 -26217
20075 -394329 -199178 -161266 174013 -289161 -223473 -219368 -136073 27040 -188131 -202372 -285517
20064 -285517 -208921 84551 -86916 218299 174618 -290110 -124670 95881 104901 63311 -106798
20052 -338089 -182679 -250764 -2377 -83506 46214 -2683 32327 39774 -21797 -153997 -174055 -108195
20040 -108195 -39612 -40456 -143800 98254 -157757 -11934 394753 127599 -172130 -186038 -289017
20029 -289017 81953 -177197 -329214 9903 -148138 348191 87830 -77104 -310345 -70103 -77909
20018 -77909 -239873 63213 -73128 83495 -36064 185904 -304296 30503 -145359 -406459 -94433
20006 -274071 125431 228897 -84010 -199748 -248327 -29195 -331126 166650 -164024 -176099
19996 -176099 -311143 54065 -154869 -171935 -130769 171080 -174327 47388 -553654 -19170
19985 73608 -84114 71201 -104516 -28637 92516 -251548 -33019 -139982 -288385 -116021 160768
19973 -198305 -506196 91118 -199640 -60372 67211 -43005 -184714 17573 51495 -196772 -305852
19962 -305852 29034 -129610 242598 150289 -56432 -124401 209249 -5146 135333 44841 -133311
19950 167162 -18321 335242 154498 -54092 105326 19875 -96126 384046 -19814 57653 80543
19939 80543 -54505 -108339 188617 244363 -16904 11868 -348316 272259 -292957 -239034 130950
19927 -325442 -53505 -46267 -66521 -275667 168582 62840 -227080 -186331 -87367 62452 40671
19916 40671 -4419 139653 -459606 -28666 -236524 -248063 -275884 -112753 180711 -216446 120955
19904 77632 -80257 -114100 -120528 126968 -35575 -217599 8523 -55111 -55727 91475 -15866 -24593
19892 -24593 47651 24800 92215 395833 72056 37288 -397137 61376 -146598 61790 96453
19881 96453 -128952 77656 -201247 -46547 42444 406432 -129090 202314 -18889 -103575 -187175
19870 -187175 -61009 145294 -393925 162357 38160 -199303 -204751 -150355 -124804 230211 -17605
19858 139128 5678 -213869 91505 -82742 98572 -150522 -359318 -53181 252339 244351 121372
19846 -323093 -189236 -163344 122614 -60330 -222424 203607 -49887 28312 -136121 -280209
19836 -280209 -342939 -390177 -133110 -509951 142668 -193737 -9728 -156029 310922 107948
19825 -325438 -21389 -203750 -52065 176933 64043 -90039 220706 -145319 149153 373538
19815 373538 -23813 -201218 112364 265526 -87978 -101480 2294 305219 -31392 -171868 81366
19803 -48437 29816 -55557 -110719 14039 -2838 -265685 85070 88968 -299657 -159074 3500 -180158
19790 -178074 -306134 -141944 144867 -55627 -291173 -75736 126685 -18425 -157533 -399713
19780 -399713 -252251 44155 -185974 -242025 -31931 22376 -285207 -192442 -46907 -18116 -220633
19769 -220633 1462 -188704 68838 220940 10517 -172112 128652 -262546 152998 -176204
19758 267725 -105795 -1966 213564 -265908 -214104 -147585 84855 13258 -42488 -128493 96333
19746 51995 5463 -57430 154243 -235003 132179 224082 -329936 -13027 29917 -78426 113706
19734 85913 -53817 -61388 240804 -218758 -97258 76981 -210224 190608 100379 -237240 -107020
19722 87902 -20566 300405 250718 -8198 -108425 -230110 -10165 -166532 -65356 293861 -121025
19710 -104078 -235554 -125821 -136294 79283 175603 -76473 119983 19857 -1860 324924 11203
19698 -205928 180960 -76288 -252987 -125184 -30654 15578 284219 -230987 44614 14571
19687 -164965 -77707 59718 -205671 -67491 -91397 1962 18071 -163871 212617 221055 -305363
19675 128523 43215 77932 -55602 -239339 45932 1582 -325676 -144024 21355 15525 88006
19664 88006 152957 -261493 -230407 -35275 -401208 188423 -110403 -211072 261986 172126
19654 172126 1810 44117 -169511 -134563 -19711 -187596 76115 -177682 -257619 -350720 95244
19642 227747 -85016 20896 -148765 21894 -3302 -341310 -269650 -381900 -99086 73924 6338
19630 -32128 -79310 -237317 343311 -26329 -226568 244731 -19404 -43502 144154 14809 59284
19619 59284 -106965 241777 281579 -181885 -70236 -234528 364228 -32022 -185552 -243051
19609 -243051 -143512 -74506 206976 -49059 59832 -285269 7554 98584 38165 60637 253562
19598 253562 75023 122869 335862 -239344 -7677 -160664 -76769 -118992 -29095 -48170 -286707
19587 -286707 -17597 139606 -10141 -107932 -30585 -157769 -239359 -66247 78419 26037 111751
19576 111751 -25305 -24013 215348 208101 398321 -24940 -54779 -123111 -364473 221851 -319228
19564 13087 -351318 -24912 -14648 417499 -29418 -156262 183023 266371 -229597 50577 702
19552 -197131 158764 -550542 22805 150158 -277142 157019 -82943 -249737 1774 228738
19542 228738 201365 -186522 -209707 -181177 255566 -321532 -337486 -369150 -107240 -301581
19532 -301581 240781 -228833 -34623 -81557 -138238 -286717 -403007 -217795 -349181 -193087
19522 -193087 -176863 -14569 -216226 -265886 -205367 -199916 -229381 196837 -78987 354705 -28301
19510 51365 -16440 -53972 -137621 -178947 -204632 76166 -117149 83234 74033 177818 -260789
19498 69110 289278 11135 -135648 103263 -188683 -10419 -331178 -154457 -1380 -224692
19488 -224692 -113939 -259273 248766 24439 205450 -257575 -277452 -153116 322397 214865
19478 214865 -94739 21036 -302497 -134687 -408535 -40202 -16033 46109 -79221 -101531 7539
19466 27072 -167032 27703 -167960 -162956 97772 -227383 28506 107956 -215149 117324 196139
19455 196139 125245 -143899 234994 89860 -8314 -265496 2841 -150306 -81830 -27087 4511
19443 -6171 -156632 -179146 -158089 -1193 887 56273 -45858 185259 161514 136471 -206220 -254828
19431 -254828 155118 -75471 -84031 99478 85148 30224 -109261 -47267 -83286 -80619 10243
19419 130885 -202346 -55617 78467 -154180 58377 -169839 106742 100306 -1718 -143760 -9012
19407 -67602 -185825 444584 79464 12809 -412834 -57755 62016 -91190 18912 -220095 38059
19395 -153571 251169 173520 -71429 -77173 14826 -194671 50985 6370 47670 -115453 77464
19383 -125108 122534 16332 -200197 36665 -49250 -177723 -169695 -98044 -93651 -381348 -217732
19372 -217732 243042 8080 -23716 -408775 -116890 14734 -45572 -72102 -119867 120007 209222
19361 209222 -4304 -110980 168787 -278948 23952 63318 -489048 -65631 -151183 -64059 -329204
19350 -329204 346694 19791 111568 -206373 -15046 -49144 -44810 85145 -70645 -350597 -440249
19339 -440249 112973 -199281 -180939 -208939 45681 -327473 294004 -195727 -66606 -40988
19329 -40988 -52424 155281 -117630 -160191 -95977 -30100 -416685 73881 -17589 -202520 -185073
19318 -185073 101543 -129159 -71387 -49636 -94862 -8368 -43436 -245505 390132 -311871 233895
19306 -377851 -142758 -205383 -130910 129071 7502 -225476 -155272 -247982 121496 82569 458872
19295 458872 -39287 -145455 -425564 -122681 -114529 109854 -202017 -424658 -255513 61429
19284 -259812 201935 -351844 -353033 97817 -305283 -2917 -56979 -44007 -69689 -223512 -166440
19273 -166440 239114 70669 -181135 -92225 118029 94138 -166718 -158288 63650 -80029 -417164
19262 -417164 -23809 -241172 -284410 28352 -146935 21942 181369 152412 -207592 -341668
19252 -341668 -3220 -410587 91963 -87243 38165 -54398 258818 -57609 191386 129328 -81552
19240 -89101 237690 -76907 -44380 -140959 -81320 68283 -370521 -69562 18152 -187159 -134854
19229 -134854 92499 -163327 345869 65471 138094 -51638 53616 61941 -165728 11250 20370
19218 20370 88493 115189 -247124 -137273 82428 -258445 -245667 135675 91620 181819 -348750
19206 -79597 -12005 90905 -131301 -32069 -281192 30981 179069 -44971 -10076 -18430 16322
19194 30125 288509 -175084 -94971 -269415 44576 -37699 -152525 187234 79502 -167541
19183 13305 107099 -72184 2347 259394 -265452 230411 -140727 -137122 -74493 -117624 253923
19171 33800 32633 -217740 -124477 48232 -88380 129454 90494 -106774 -63000 155545 243582
19160 243582 193401 56922 -2202 -54300 -16933 -251729 -152497 -60525 -521904 -75669 -12717
19148 156379 -65222 198904 120000 -89315 129007 -9565 151267 49882 -85870 -103397 219532
19136 -126885 -336083 -285790 134667 -197579 -73598 -94404 18801 42091 -296218 -91779 -214844
19125 -214844 -238468 -34466 -223291 -80985 -114136 105859 72592 -304298 31207 215889 78013
19113 -71285 109499 138933 165641 -88838 -157269 -276442 -192914 -91913 -405979 139459 -95794
19101 32006 -186284 -189192 -210106 -48603 -90819 -79413 110876 -46193 -207126 206909 31889
19089 -309679 40402 -424500 -120327 -78176 180148 -152181 -158001 -88244 167158 -109242
19078 131486 138024 -261351 -104279 -127374 -155122 -61954 -17086 333243 -84601 184581 -297337
19066 60756 65565 -276697 123650 -114869 -53469 -164504 123814 -116091 -461747 -120426
19055 40737 -66719 47987 150897 -111298 -40814 230362 -67084 -88984 -169706 -184005 126744
19043 -152068 -4676 -97468 -57648 42269 72038 -162386 58681 -63967 43660 -2120 -166676
19032 -166676 -298891 -14116 351834 -165079 -74532 170883 -260497 291716 230325 15764
19021 79195 -31227 -89975 116973 -242142 -183479 22986 -35416 -319286 -17903 -98531 -171820
19010 -171820 -246471 417420 -103327 -182398 -203552 -294740 106661 -231465 -95458 -43609 -137195
18999 -137195 -44993 -27840 113542 -48395 255578 -344290 -174015 -94368 84052 -120494
18988 -300134 45312 48033 -28132 135756 -54130 -162541 45798 -4721 -136431 -168774 252412
18976 126769 -65068 116847 -202888 -129470 -172289 194195 -110495 -316425 -165555 35958
18965 44054 -469782 -6871 -103044 97119 47158 64788 160692 -4726 -127623 -11885 -184734
18954 -184734 -21848 -130491 182007 -337353 -187513 57451 -280668 -305445 -86516 -183254
18944 -183254 -283211 -233785 107515 158196 -205781 39617 -14393 -129931 103118 -31153 240093
18932 60508 -32444 166237 -97774 169316 -33090 -20524 -357237 -133875 89777 -390182 -386862
18921 -386862 128660 -273068 165717 -160337 -140463 -118898 -12987 -59219 249101 -125308
18910 191430 222151 108437 -65549 -103073 233868 54544 -38591 -82256 274262 -117241 54476
18898 40172 -238252 -27202 52277 -86433 85869 119597 -4809 -18475 -29604 31147 43 241197
18886 241197 221010 115791 -136363 -149218 243916 -130789 -41976 39334 -210116 37529
18875 -346094 135221 -121723 -143339 -30056 7974 -249749 106753 -81697 29563 -110318 52019
18863 -11711 -180364 -101257 -253410 103460 -47000 -14642 45843 -68095 97534 98493 -18237
18851 161318 -144106 81259 -353112 -47149 -27466 31435 -166943 257489 341423 165360
18840 5588 -27056 -78876 -6732 -17908 41648 -36020 -66227 251235 -123197 -175282 23669 -167280
18827 -47712 81911 -16904 235257 -275754 -165366 146808 -251036 -10467 -175197 356893
18816 147178 35127 -133761 311270 109037 -173158 83965 49789 26856 -23567 -282924
18806 -282924 -166277 -111408 -52352 -92914 -8494 110245 76973 35327 -92809 -289853 -375485
18795 -375485 283192 -99779 62507 -292284 -188188 -235555 141826 -114914 -70680 -52303
18785 -52303 35861 253484 -123656 -309706 -102169 160297 -472330 82178 -260405 8613
18774 -191204 -283901 -46390 183344 -189308 -135709 16078 157561 -169669 -230602 -14975 -396832
18763 -396832 51582 -83927 -70923 -168818 17019 -73550 192343 -216476 -365508 -374980 -98810
18751 -63195 11972 200895 -322147 -161874 25456 -78429 -134597 -122763 -12524 -249969 34453
18739 -295850 -4359 -232387 25327 -226565 95582 -186582 18499 -203277 24805 74331 -247753
18727 -252811 114052 -447637 -37440 88869 -20402 -378995 -27529 -11967 149110 -32401 54193
18715 -165516 -51435 32980 -99935 138371 45834 263854 -6724 96288 -104204 143685 -47294
18703 -321392 186129 57394 33053 170264 -412395 271216 -150861 82400 87361 -77026 8218
18691 -289505 88876 -302513 58562 -76805 -346818 154013 179558 248924 -326413 284095
18680 -192119 207148 89178 81741 -30873 147488 -236756 122930 -44678 -63140 -292762 -102990
18668 -115914 -254357 149438 180867 43937 3608 -339432 163133 213566 -187564 -233956 -315865
18657 -315865 125960 -93654 -56514 -24680 155271 155208 -54761 430652 -137288 20248 -282246
18645 43822 -115644 93437 -121046 -525632 -375787 -57367 -226528 37698 88962 -98456 295731
18633 104820 150069 -116594 294775 -111080 -38334 93223 -147743 -515861 -33180 102559
18622 -1223 -72765 -342764 242620 -91242 -93179 -174761 -129589 -110190 338358 72055 -171593
18610 -119136 -86193 139185 184672 121129 142611 -20774 -22900 -210540 -221124 -141750 -230940
18599 -230940 101910 21238 198387 57101 -328684 84473 -193508 -186181 -425384 40334 169068
18588 169068 -137713 -184516 -225947 74846 -87519 -118910 -1473 -85925 -286131 91660 42970
18576 -228557 201693 5179 -242092 -118080 317751 -65737 65971 -35233 155643 21317 -764
18564 123518 -61495 90098 75703 85713 -81081 -251616 97733 -196236 -36321 389879 -243629
18552 -50209 77299 -184435 -58912 242659 -191086 -259268 23890 70486 -149770 -20148 150733
18540 -189607 -169213 -240513 -100160 -320458 213939 -453054 47524 -179309 -308239 -45462
18529 -395962 -61091 -161404 85651 196727 66856 27707 435788 -38202 195865 96312 22967
18517 169008 284220 -69859 -74449 -49836 54057 -312240 -212184 -37103 99447 -145094 71021
18505 -67306 -180649 56068 -313122 -61216 29304 30059 204767 -261330 13314 -188095 -75046
18493 -109365 -234525 -61766 -186401 -144786 44835 -59287 -229389 -28795 129532 -298592
18482 -101538 122099 8341 -356871 -174626 104166 -97458 -144591 62452 134167 61357 -263742
18470 179104 -9941 183050 328667 -52561 -6110 -118315 -72009 -354408 -525110 -161649 -1990
18458 164696 318286 -91695 -170509 -172982 48011 152851 -135603 -371448 133637 -110285
18447 -155854 -314697 -57345 -353376 -93739 82490 225265 82111 -76574 105353 -17831 -34170
18436 -34170 -184281 -182907 -109396 -98326 -213909 -453404 289352 54728 241588 -153135 -200252
18425 -200252 225941 -57320 242310 30138 166489 -127964 -18927 222096 -33062 14182
18414 -244603 -48157 107496 74003 -47393 -139001 -8949 202317 204611 271274 -28331 32114
18402 -132203 -209548 -23253 -179477 -63766 -370822 -141067 144835 279023 -297458 201710
18391 -194594 131459 11421 143929 -402802 -277285 126815 -83927 17469 -191125 -124968
18381 -124968 -236680 168860 16 98071 217798 -69178 113543 79737 -32661 -48871 153867
18369 -131331 -480384 -33967 59575 -19455 -415446 -40512 45506 46127 -299071 -60735 73745
18357 -81635 74222 118671 -356916 -259046 -84391 -189533 -257616 -66911 37927 121902 180487
18346 180487 -214107 188818 63357 -143113 -34505 -236920 -4554 -154856 -68694 -122226 -57354
18334 -95134 -164920 302083 -264819 -222439 206995 -15762 -102833 15552 91056 -22643 -87152
18323 -87152 96782 86528 -61955 46102 -441042 96245 -142148 351933 108566 -208057 13579
18311 -368544 -77908 -59590 -191377 56395 -212737 -38898 -165442 -82819 -39545 292436 365744
18300 365744 -154811 209727 -230773 -131878 46912 189486 72449 -184575 112476 -196574
18289 -13954 164341 87980 43978 17336 -61806 275285 41378 70317 -268942 230683 421982
18278 421982 -56153 -159288 -195967 -289038 -103672 246470 28124 241318 306606 128769
18267 26019 -197086 -230813 -115644 -159006 -322220 -363359 -183789 -9307 140384 -92003 88400
18255 145111 -163942 16957 373040 -139795 -114425 -199836 -52462 78890 119706 58161 61469
18244 61469 128957 -150887 -49901 154616 -182781 83158 100477 -180488 -311732 -201227
18234 -201227 -114326 -44818 94074 -225614 -211567 70211 98112 69837 -32726 61194 -102639
18222 70759 96112 -454511 57144 -48597 147237 253638 -36962 20618 -122807 -328874 -149383
18210 -324994 83389 3721 -9892 -45057 -69077 -289637 158563 -130570 13193 41014 -170827
18198 39791 -216909 -22879 221233 -12972 -383461 -25183 -246163 -159809 -144842 139992 5051
18186 83812 85065 -107479 -62751 -303495 -87116 -106331 32211 -208083 -10068 165361 11465
18174 43010 12704 276539 -76878 -109378 175936 -260977 -225745 -52823 -40073 96389 117718
18163 117718 94663 204618 133190 139940 -56947 -109252 55152 -240884 -9178 -637 33466 -252654
18150 59407 425950 -21203 -151243 338181 -223320 -138787 -119742 120725 50997 -226272
18139 52738 253208 -290699 -82532 -147520 -82741 -13758 7166 -245430 -251209 33955 -224378
18127 -101020 -108154 -93783 22562 26933 -157588 -41511 -64386 143737 -165639 -161346 -295884
18116 -295884 -125977 -132108 -345773 343430 -411890 -65827 -156040 52826 104123 129780 -321449
18104 -241057 316783 126376 -56519 -11850 -124963 -122598 173839 59337 -94062 18901 107964
18093 107964 -57798 140331 21448 33337 -175807 394786 -353554 174898 54271 -191989
18082 61052 182272 -153825 -48577 -66053 170243 24938 11264 294220 93788 97522 -140518
18070 -294996 88838 138694 -86816 53774 62786 -12903 -216692 112015 151520 -292765 23503
18058 -374337 20839 -160600 -341805 -2902 203146 48356 -171377 133963 -103276 -4739 2663
18046 -191589 -366142 -274124 225339 -59416 108476 323907 -153180 -126527 3396 -259718
18035 80451 -21327 116978 -185201 207492 49237 -27544 59621 -381278 253575 -133052
18024 13480 -141421 119767 -453479 -46516 -222204 130333 -386100 235052 -97316 187769
18013 228662 24052 -59712 -49329 134711 -163279 -153271 285808 -54652 15607 46153 68932
18002 68932 -1041 -208850 130434 15570 81017 -284102 -135405 -24990 11296 84207 99162
17991 99162 -65793 101938 -119618 121752 -8227 -175369 207783 -7511 145625 276202 40797
17979 -8448 58459 -168981 -39626 -332692 306530 73238 247761 -126433 88063 -341133 -204454
17968 -204454 -60268 -170670 -38568 294578 -157630 -31239 270819 86583 123389 -252875
17957 151752 -89031 -125333 -114841 -177275 35365 -113717 -223780 -81864 64273 191977 -19519
17945 216030 82115 -37687 46259 26242 -186372 -204905 -106779 45226 449624 -20673 322561
17933 -30351 -88672 -140801 -18981 256761 -112097 12598 -35504 172090 -114904 -201591 108181
17921 -18265 231411 -94060 -227810 -288788 179440 2998 -147219 -318721 -188853 183026
17910 -7371 54383 -254966 110005 -311624 46166 219209 -212250 106074 74606 -213263
17899 153894 -311719 -4866 -309508 94771 -34307 219535 149427 -192258 82051 309119 108194
17887 -176910 -307968 30507 -104741 64711 -69164 56407 -389687 -10538 206745 30250 185121
17876 185121 286051 43294 106753 96102 -37856 -68032 -72699 -20734 -102158 -88830 145813
17864 299269 -135567 272691 -226372 136950 -62148 -157878 49112 1547 -106531 178603
17853 -73657 58603 -261145 -278889 -39809 -217864 -27087 11771 -252818 150230 -15738 -229936
17842 -229936 -251747 273375 -106852 38527 -29255 -143403 -96134 -432737 -75277 79363 38424
17830 -45355 98286 245869 -427201 303902 -256517 -40328 -86209 56194 40080 -115581 -19483
17818 -150128 -186322 12326 -122201 201764 -143148 -199067 262938 188043 48565 -148700
17807 73994 -252955 -114872 114866 -30369 10848 248243 281685 111874 75080 -95344 -130293
17796 -130293 184948 -227730 102858 510124 -38111 -233897 -106088 -58880 -163859 130801
17785 -77200 153077 -208162 -223024 -35555 36069 -356960 177510 -218199 88910 -66654 6097
17773 18361 48953 98442 248 -136769 -96361 162230 237952 118428 -280590 -83473 12630
17761 215876 -17289 6516 -65454 112995 168323 143584 134508 102852 -8528 -125539 109714
17749 -111240 -183926 92845 105635 3793 -472635 69159 197021 -36986 173721 -233795 104494
17737 15044 176679 -61255 -81219 155458 -168621 -148897 132617 393445 39947 -101796
17726 -73487 -272396 196327 -127701 80790 -118702 289037 26264 -289132 165884 320204
17716 320204 148440 2303 151938 140017 -75142 27944 29967 295897 20560 -172631 -191612
17705 -191612 40464 8732 94382 -313887 204995 5602 307925 -118987 -210839 22662 55853
17694 55853 305197 -123953 92670 -17624 184083 -160704 103457 -107759 258598 -259720
17683 -243774 221316 16619 -60719 488216 363263 -40080 282718 28685 136851 -97302
17672 286451 -80935 -71753 217942 3890 115895 -214933 167600 4063 -94508 99414 313001
17661 313001 75547 166463 22709 38145 -3195 176468 -199608 291220 -59086 -221 165523
17649 329204 -21553 -181367 86808 -280753 289646 33636 -36632 -64289 -135986 45535 344374
17638 344374 588896 82578 117867 -56656 164327 262839 11147 50072 104867 -1555 267966
17626 -72192 -222392 -238003 -274485 -195714 171395 -241698 316807 286990 135192 101019 139714
17615 139714 50715 16946 125922 136142 230823 286936 116059 -89662 66538 -193685 -114874
17604 -114874 105183 199632 -266004 173232 82960 -87524 4611 231666 84074 109186 -2476
17592 -115633 5770 -40750 -70249 5252 98094 180010 217427 358799 183988 148477 -395860
17580 -63758 -109556 -10266 22524 154661 -265290 -57363 -198805 -528357 -1443 348143 -133350
17568 -38500 -128866 -302969 338760 112649 -21662 50005 215464 -92621 46543 -70834 -17854
17556 -156200 98178 104949 20423 32449 21382 183588 21489 229433 -142915 -12053 -51360
17545 -51360 -265588 -144929 -285285 -34591 329504 155938 175928 230085 -122877 27502
17534 166614 -26493 175148 84861 23085 111742 -176280 225723 -9994 62360 -104480 473474
17522 -123624 59030 47038 -130671 93080 21503 147796 121447 -105981 -136490 114614 261698
17511 261698 53653 -180577 -176369 65552 210769 157840 208573 410807 -75817 73807 106501
17500 106501 81104 -4853 311814 28764 55919 -97951 -52372 86441 253425 250219 49255
17488 188704 256844 91239 191418 157686 282136 -49117 111946 -23606 246131 4635 237253
17477 237253 -8369 185087 385131 60214 -2444 127464 138566 93623 6698 163206 438350
17466 438350 18470 377111 163605 159962 -56569 358277 176763 -67658 122034 -64168 -187231
17455 -187231 258605 151052 54978 411223 293949 278625 434999 355459 618182 747922
17445 747922 269277 194401 227214 510816 -8125 206734 68777 100137 413138 49782 265321
17434 265321 7115 34863 409912 578161 233731 566947 486897 149926 210747 444026
17424 444026 331824 403167 337926 84140 223911 229810 555476 181167 565324 164769
17413 375623 304689 594972 135805 395625 146164 161292 402404 52237 59692 -141346
17402 170016 189381 209054 -67667 91454 -201269 -60842 22632 -102887 229885 -89159 -114114
17391 -114114 73725 97896 -3904 -18896 75380 447277 288346 146346 245974 82151 178452
17380 178452 87316 148993 128378 -91398 366030 184817 48824 164592 -95003 169599 239069
17369 239069 181474 -4236 -78832 155845 -99397 -73400 339852 152940 187032 41659 -23718
17357 131657 116892 354575 24121 76911 173079 240426 186945 154681 16411 69620 210178
17346 210178 103975 64975 368718 334579 629792 351328 -6956 144350 -232332 187683
17335 592819 351387 144131 12283 377933 407861 6448 76496 147663 153710 193688 60918
17323 37775 265271 -76639 209586 237857 93800 147638 110169 -151316 320512 390407 -81494
17311 -40798 97225 -14348 -1567 92713 -254931 299118 133316 -436705 260823 182506 185672
17300 185672 -7506 356908 122812 -85425 205809 44999 564128 221139 139110 400579
17290 400579 273200 184429 87068 81758 -169367 133527 -133986 -120355 155977 56980 375479
17279 375479 321802 293598 145688 189586 213900 97898 228803 542060 123523 177777 82493
17267 195009 90788 -43217 -45195 93744 77493 45834 743 -57427 192432 -317815 369867
17255 -8363 109634 159257 564985 60277 144987 467719 112108 98354 303742 -55309 288664
17243 374642 280286 762909 42259 52337 48439 67729 -63890 -121092 144104 502003 536152
17232 536152 461841 195792 180043 326347 131800 -166949 -138794 228982 252140 331179
17222 331179 306524 -73881 -24714 423392 278318 598130 336856 468290 432978 142026
17211 46224 264694 238176 192220 -96213 391649 23065 -33798 62074 116008 160749 264697
17200 264697 239878 241368 287211 145389 230755 78861 69390 23404 304808 58153 248335
17189 248335 171229 164022 331261 50406 -146168 318377 300880 164008 527664 199294
17178 434601 80706 264583 120634 260095 426706 213655 323372 218603 62614 329191
17168 329191 45577 110585 110688 158756 250815 147363 149619 525747 58043 185796 51714
17156 -102693 14978 77654 158739 482378 174858 293738 373940 282357 303257 278205 111416
17144 345855 464208 393367 104932 426844 578634 201350 322032 137419 252255 254461
17134 254461 289102 161802 -121992 302933 380885 372472 240362 255265 333000 46953 253085
17123 253085 428629 375098 331447 338798 518845 577308 342031 436020 457702 578314 376864
17112 376864 193468 214579 334530 -150139 391248 718904 414793 680566 459817 448545
17102 448545 283799 177812 367574 254336 386561 226720 246872 537710 706030 502590
17092 502590 519346 626208 707824 245280 375754 112845 590568 482436 161251 297535
17082 297535 55248 431545 611777 732306 474020 111425 266922 415366 302438 391990
17072 391990 428567 441907 214894 227749 663861 53070 681840 444183 600774 612422
17062 612422 325121 480126 494879 424233 304097 473589 414063 537627 352738 513348
17052 513348 151616 405940 782185 439153 247793 669324 636176 350080 421409 735374
17042 735374 566486 633249 615377 614254 722128 205063 496323 548518 358931 689884
17032 689884 677778 616166 617808 252478 683004 181076 739606 537813 546350 701214 437610
17021 437610 518299 352360 665568 634808 388871 825773 371204 762576 623453 364106
17011 364106 556354 826852 764143 736239 752191 440921 583527 608523 853311 698735
17001 698735 593849 731771 784242 753745 600507 755018 555742 884874 738729 532704
16991 532704 664245 648498 999507 925265 466451 707057 642343 756030 360125 786750
16981 786750 851500 795446 694355 773699 979980 1255109 675037 1061335 836682 866092
16971 866092 792113 919472 835210 773721 1067247 882745 804274 839254 698620 957529
16961 957529 470217 1211288 1237904 1128258 975873 1358888 1380935 771140 850691 879738
16951 879738 934503 958589 1040821 1093708 780895 1315219 1068680 986466 825131 1303436
16941 1303436 1112663 1059383 1256382 947205 983287 1228584 1212808 1115108 1377681 1417528
16931 1417528 1312375 1296501 1495811 1237053 1133739 1111195 1050419 1353074 1329568 1533471
16921 1533471 1204504 1168888 1302825 1224600 1658846 1564487 1368328 1178155 1607698 1990596
16911 1990596 1391558 1580391 1395631 1643557 1406688 1300749 2034067 1668851 1773465
16902 1773465 1709384 1736693 1615871 1612982 1612840 1821121 1844821 1663508 1778947 1773156 1874108
16891 1874108 1756964 1764018 2055259 2040912 1979507 1969108 2153116 2070704 2164792 2218228 1920429
16880 1920429 2180977 2226749 2210956 2153425 2198058 2050906 2121403 2275735 2685131 2241422
16870 2241422 2581119 2644868 2806578 2579693 2449413 2802314 2360821 2996532 2723886 2445429
16860 2445429 2690091 2888565 2809056 3087035 2868558 3182441 2914766 3219807 3219265 3182222
16850 3182222 3079803 3124562 3268118 3402160 3519543 3240823 3528990 3915442 3816936 3654582
16840 3654582 3835367 3750805 4228667 3743267 4133283 4096885 4106292 4325502 4267123 4414341
16830 4414341 4272409 4404916 4696755 4691535 4877725 4346145 5021480 5044093 5210254 5623332
16820 5623332 5399925 5380849 5513087 5759710 5519244 5820066 5956480 6254385 6501032 6180321
16810 6180321 6603970 6728302 6962401 6772222 6961711 7282542 7714159 7833118 7934932
16801 7934932 8143599 7950622 8399704 8637917 8864393 8945153 9202447 9521351 9699275 10065719
16791 10065719 10337525 10703693 10571109 11163235 11518108 11419778 11769980 12137207 12882683
16782 12882683 13197832 13789569 13971376 14474495 14898324 15333119 15644479 16460928 16998957
16773 16998957 17477329 18046177 18243490 19016554 19782902 20603950 21539747 22169689 23148428
16764 23148428 24063166 25016332 26170812 27072159 28172610 29477445 30993977 32270196
16756 32270196 33531551 34871384 36751478 38243484 40289804 42020466 43797324 46507686
16748 46507686 48990948 51780753 54113683 57021879 60115337 63802962 67018887 71403262
16740 71403262 75054415 79368980 84099862 89260810 93944255 99879408 105313874 111486564
16732 111486564 117372110 124048265 130465403 137008519 143212844 149606159 155819684 161375914
16724 161375914 166129383 170333957 173548742 175660973 177204618 177337680 176232359 174259430
16716 174259430 171096611 167221490 162483135 156915050 151181288 145005125 138416426 131772726
16708 131772726 125082577 119082242 112836543 106640358 100612410 94953694 89563775 84678175
16700 84678175 79952101 75577799 71349623 67484993 63742528 60612871 57278062 54348660
16692 54348660 51364690 49160142 46569154 44194420 42226887 40107108 38200000 36241681
16684 36241681 34802217 33037527 32035208 30421399 28887849 27996191 26566902 25811932
16676 25811932 24659336 23689412 22730848 21681758 21112675 20434408 19422468 19048211 18242696
16667 18242696 17946356 16852455 16255989 15584187 15275161 14524666 14068742 13749364 13277658
16658 13277658 13032351 12372581 12082772 11658497 11336117 11196521 10865005 10487138 10404724
16649 10404724 9673560 9901871 9589134 9074155 8854056 8619396 8637567 8057436 8237047
16640 8237047 7760258 7853150 7713735 7351155 6684871 7149861 6695158 6490304 6626116 6227581
16630 6227581 6405085 5871431 6244237 5749005 5692227 5451647 5538436 5523866 5028471 5147277
16620 5147277 5190989 4929846 4762600 4895322 4676024 4452586 4746552 4391582 4303415 4256626
16610 4256626 4162170 4307992 4040419 3680155 4178468 3782279 3961110 3695785 3651965 3488472
16600 3488472 3556645 3325698 3331915 3110556 3232445 3277845 3195302 2922951 3033547 3131248
16590 3131248 3141872 3260922 2924404 2910861 2802883 2690470 2897806 2730964 2435701 2781908
16580 2781908 2354714 2505548 2078172 2354288 2225623 2283040 2520974 2424084 2020969 1987065
16570 1987065 2212487 1898732 1902938 2278642 1729200 2077897 1951956 2034599 2133720 1785927
16560 1785927 1873819 1657977 1813673 1918100 1889491 1678075 1506760 1433646 1713474 1786528
16550 1786528 1732271 1894641 2104423 1734471 1729723 1432209 1373263 1282866 1654351 1440675
16540 1440675 1196987 1468392 1208465 1312594 1620784 1402881 1388666 1350069 1263023 1191447
16530 1191447 1114112 1396172 1172315 1311956 1218851 1165595 1166476 1267336 1096765 1276928
16520 1276928 835172 1217195 1041473 1036447 1048865 1241269 1239468 1297560 1149921 897210
16510 897210 1153218 732523 913325 1013170 1183891 1006723 1128034 979178 1346914 649689
16499 1003802 829280 1107221 859881 1073829 710032 800552 1017362 872246 945820 881508
16489 881508 1067828 774482 1039632 858710 621480 956364 631870 737698 900232 886568
16479 886568 667819 876626 963306 1198144 823979 604924 699557 789741 758888 1043916
16469 1043916 952684 684568 1162099 598506 629386 943547 763914 771139 391120 1009680
16459 1009680 628962 710527 569503 1023203 673098 906116 821819 623721 347665 443267
16449 443267 553221 261363 841382 508217 849711 801216 787454 786100 496010 371750
16439 371750 617152 474963 629438 604442 643540 567622 565958 882505 663641 620696 655467
16428 655467 426812 408399 620823 553934 399969 337301 256078 681284 371924 556337
16418 556337 175856 446684 545050 431494 484420 357114 668206 157011 385667 569431
16408 569431 482849 650649 278767 824155 429601 286910 369542 247056 363536 841947
16398 841947 381719 167189 278069 381574 303781 110769 570457 234731 520789 112439
16387 42076 483332 662998 300296 525047 522764 377084 457819 315567 288101 26297 251656
16376 251656 257463 362573 319487 339913 559268 269161 39948 602361 392589 425551 235308
16365 235308 131814 414662 502528 117845 329160 448781 772257 337393 335175 25498
16354 418861 281937 165846 369899 179561 93881 291362 51951 449850 381844 469912
16344 469912 419038 652147 136095 209180 300788 541165 190516 458984 -174618 216707
16333 161097 206873 484563 246437 268573 281896 182285 304993 208133 124789 340754 216385
16322 216385 382579 372394 2708 36961 263765 75749 194874 187699 61601 -83540 44550
16310 84133 159613 105299 364264 34506 306514 252590 257976 18202 272270 179733 253367
16299 253367 236106 523154 371810 200581 -23541 244122 -93842 130442 184331 102458
16289 102458 406979 11578 329582 237465 144227 221139 171846 119646 155206 445361 651611
16278 651611 -134279 540537 -28490 -285023 118324 11142 110055 19653 315613 -153409
16267 11294 46206 312445 -35863 170293 102858 215633 218168 45754 -165721 577992 177760
16255 290445 289108 103126 -126034 12321 29228 139445 33720 142879 171132 223142 91530
16243 134395 12589 227686 170340 268286 14858 -212689 139845 142846 115569 238382 178408
16232 178408 -14442 196110 214205 174333 230530 -188271 255840 -83751 349106 159149
16221 35807 34783 270016 244198 -98576 23818 305253 149406 202418 599696 21925 156488
16210 156488 137182 30329 -14300 -60610 -10800 98717 -126581 55560 147970 232443 -71651
16198 336679 232475 134262 159210 -99232 433268 -49293 219452 90080 253659 169740 -219508
16186 67156 52284 268865 -58262 -126148 99162 36260 -55113 64242 -39914 -84077 364510
16174 -193240 -86253 -308766 33032 35347 41387 -96497 231209 101147 71673 -43515 40686
16162 -30860 -54316 -80259 116795 61974 217531 185773 165388 315577 -55574 214304 188093
16151 188093 368435 3845 185251 451560 -204083 100000 450141 -129065 30918 146662
16141 146662 90911 308691 -20361 -29619 -188485 -337854 59765 19345 196296 -288573 161087
16129 283503 114696 6375 76438 10831 -131775 170778 35865 -78322 311407 -77478 254927
16117 156869 -284886 10359 -73117 184475 174728 342583 -51749 -105023 82728 -180269 -139590
16106 -139590 55167 48386 -30427 116508 80739 188153 261037 50147 291834 -157636 -30732
16094 -155596 -24097 -130449 320409 -156895 175401 -151411 -99114 -131668 133840 38079
16083 -103950 227470 29266 282530 41179 -130874 2676 -13768 190297 166424 -279987 138020
16071 -111434 -80449 -145348 34117 -241254 162160 298123 -114542 222696 44412 -67716
16060 57221 -26961 -108836 -102141 364758 -122245 306489 -27061 150789 142715 198594 98636
16048 -17613 -134500 -28291 -2664 -195851 -91153 -25656 129099 -120387 161418 24696 195910
16037 195910 226196 -172186 153595 199442 269870 -194234 94283 -154814 219762 1683 -112075
16025 191911 -194079 -93408 -19619 27263 -34495 -217404 10086 137190 -341693 -112041
16014 -241681 -43125 120078 35869 -47168 23308 -165993 141038 189084 38779 62385 -128912
16002 83925 -224058 -68429 175091 -290475 -187427 -183123 188228 -150612 -206856 -271753 -150447
15991 -150447 -70020 -179154 -107002 188461 18191 34771 -113041 30884 196852 20013 430402
15980 430402 144243 97537 243268 23819 -51921 117703 -25569 -257316 213351 29050
15969 -33466 41146 -241278 30304 -91172 -346108 -87499 140868 96326 244034 -204631 114158
15957 117909 -283591 69891 43855 -21650 55038 -91963 -368697 -22332 -15256 35803 105809
15946 105809 98027 277569 -266650 88192 -167518 -190894 129518 -14122 -61783 -62837 -125199
15935 -125199 177913 -90242 -65445 -23075 83869 -229019 -157040 31627 89673 78564 -173949
15923 -192207 141642 -1641 -209783 -38741 -267098 73887 -22706 -381100 3478 -55565 -270227
15912 -270227 -367543 -21975 103147 -116008 -50381 18075 -77074 -223049 93938 243656 200439
15901 200439 -153709 -64119 -191421 -93249 -15382 -137635 -265347 -106768 -211696 107673
15890 -80319 183638 -51908 -103151 -63956 255817 278876 20127 -211720 -65237 121624 301467
15879 301467 -106160 90484 14576 -223004 418548 -141065 -31008 -242861 -169720 47195
15868 4625 199103 132217 -311502 56619 217613 -45414 274500 53479 -238530 -243725 108831
15856 66044 -272221 167955 -241915 49839 -47046 -178546 190097 34769 98550 -113265
15845 65578 -10962 22987 112331 140054 218132 149788 84221 -54844 144128 -60987 335532
15833 -78542 139346 52959 163507 -263938 252865 -12114 -310278 273336 -140891 -27700
15822 279094 -337227 147060 -117518 -1829 -413486 270 -9142 268985 6514 -456346 75391
15810 -109127 6924 -122784 80607 8780 182097 33031 69738 -68762 -43598 -86818 -49777
15799 -49777 9451 6298 226980 89978 128518 166070 -87790 112700 -3554 377685 39263 57068
15787 57068 186258 -68630 185212 -73635 -129923 -239456 -296572 -17835 -135 -159862 91129
15775 166132 305240 91134 -15148 -67089 -134453 -158163 222254 237691 300615 -133257 -9947
15763 -110817 -170779 -180605 -11334 76250 -50984 -353 -268452 -125840 38481 -275107 11415
15751 292471 -200729 -271617 176283 -6722 -177794 192994 -58817 -306566 -217077 -53499 -352123
15740 -352123 -136188 -197261 69345 -123974 -190877 -308093 -380865 -363100 -328711 109249 106471
15729 106471 -52817 -29152 89434 2594 -184923 18361 -215709 -9656 -60586 -13152 97201
15717 -148567 -77874 -67071 -197367 153572 -152952 -107418 47439 302231 49734 182035
15707 182035 -207698 -202411 -38770 48185 -293023 -82595 -18271 -258954 -19993 42301 188028
15696 188028 -8142 -8499 8358 -113541 -186039 -306335 -94961 -113446 -152267 -18763 -8568 -98067
15684 -98067 402879 58340 10627 -244578 -82006 -232722 -204647 -135989 81125 -35036 -346603
15673 -346603 347187 279438 -131186 -171524 -219192 -4513 117331 312859 218426 -205792 62355
15661 135440 -207419 13778 214117 -134161 -250607 -88295 107901 -118409 82932 -160776
15650 -29901 -117766 -112052 -403566 -18273 -40270 -161389 -144896 -127005 207144 54176 76141
15639 76141 -244656 -153772 231081 -43711 -183146 -185888 -89608 275068 -58058 -63216 -278012
15628 -278012 -28431 -93795 -169195 -107964 -238189 -60805 165712 -170388 70872 33431 131225
15617 131225 -180289 88016 -201589 -160141 -1553 113630 -71874 170351 30057 -213550 -361612
15606 -361612 272961 -472132 -263923 -100113 57803 -50365 83481 -169338 -158796 -94842
15596 -94842 -142636 -124712 -41658 138400 48641 362559 262352 -171473 321240 111600
15585 -74998 140424 92898 3840 -153454 -92618 -139444 142966 -328871 -132204 -155503 -98507
15574 -98507 -44416 -53688 -33855 72533 28055 230079 -266642 -164678 157590 -246730 -38788
15562 -105899 254612 246787 90018 39056 -83194 -2208 85030 -278442 2119 110653 98488
15551 98488 221858 -106745 59249 13268 -311417 -100923 62288 -145013 -115607 -243244
15541 -243244 369350 -70042 37413 -37181 162407 21113 60312 -209284 -104492 -28266 -290016
15530 -290016 -321170 51578 -53428 152000 255767 63700 -30929 -250339 444931 -363555
15519 -109571 -187627 -23923 -255642 -141516 37199 173535 -165315 -104940 -359900 -423878
15509 -423878 -98407 -227837 -171650 -38004 56982 185140 57995 -55425 -133227 -75701 -86681
15498 -86681 -170720 85437 14744 -118711 128575 -25795 13347 149207 -57488 177503 157086
15487 157086 6113 87653 -20716 127172 181495 42610 -88694 184508 99932 318729 416050
15476 416050 254415 366694 458441 -160326 411724 115159 65346 121927 50985 109422
15466 109422 205459 -253058 -86168 186227 197095 405509 268287 328731 356046 303461 -217313
15454 88361 468724 120518 383509 272348 -189779 52033 -188660 286106 -44241 184631
15443 -412502 -87069 -5274 13191 110393 -65065 279517 -68015 -147384 105934 -20141 -7767
15431 19666 -17978 -29206 -17736 54654 238882 -89980 -326898 19374 -147361 120801 4521
15419 132407 -1182 268919 -161189 -57821 -411896 34380 235362 -19764 298767 -33557 133171
15407 39270 29949 -119276 -125396 -76955 -166934 -34662 53844 -101113 -135838 154403 88854
15396 88854 -18574 -79016 145634 -239992 -5460 -471975 -9326 -221378 -231728 -83153 -10325
15384 -148009 68935 -58981 211857 9697 -270440 132535 -111996 26700 5364 -282434 -168491
15373 -168491 -148743 -184713 201411 358990 -6254 -61435 -163415 164508 214446 -88331 236552
15361 -92075 21054 -264165 -33146 -544582 -36390 15281 -54026 -72995 -47909 -52956 -249652
15350 -249652 123421 306414 87000 -157880 -162137 115490 106882 109383 178125 161874 74689
15338 311091 -197184 -13127 -58502 338079 199520 -27587 324103 10612 34562 -70586 118412
15326 -65719 -84517 -32267 221704 -196354 217630 -198849 208254 84709 143493 -14284 113056
15314 203044 206143 229140 172138 45971 253251 304488 177525 10363 119299 -20177 10593
15302 -170431 -251531 65033 -113599 403399 159166 243665 131411 295658 -124235 17068
15291 -58450 -158344 354403 295406 105503 8210 -44150 -56822 -172127 -103098 -36477 239352
15279 101709 231079 218346 257637 -393553 84018 30724 -243977 -58018 144357 -324869
15268 310544 205113 -101930 41863 95887 7334 193724 31976 19066 -74437 236517 -176747
15256 329587 -104215 -154591 120635 104450 91072 149635 13992 592133 520872 1680099
15246 1680099 2196885 1336365 2460229 1279204 425705 -159043 -149173 12422 94334 -113578
15235 189502 50533 120472 6384 114691 -103273 -94782 40325 -387664 197347 22908 158968
15224 158968 -53552 85460 -405844 -64310 -194223 113898 32645 25905 45901 96995 -153748
15212 -13240 434864 314044 -2544 216879 50578 250483 184978 296984 -261584 -19072 112805
15200 127140 94569 52427 282789 -49697 -46621 46130 317760 191411 64959 352759 -182687
15188 226038 152569 101941 -92211 115980 -51622 15279 -43235 -40458 31806 -89852 -19525
15176 237481 83397 181103 -96673 -12384 39087 170378 29199 -134794 -36488 206789 258383
15165 258383 61599 364821 379089 183182 213942 115415 190551 -69898 -233825 144164 -66932
15153 -180136 292099 -87215 -296648 195051 564954 246911 249147 -110489 -64764 -272560
15143 -272560 50323 -85973 69331 245596 496428 197456 -245760 228745 -50470 57812
15132 299942 353173 132273 44472 216216 -28068 96930 394909 99459 64086 147581 378361
15121 378361 171870 324733 839204 239183 -7631 -2191 225994 -355326 445403 314647
15111 314647 208930 185194 88110 -8452 21495 257279 249312 -144172 112421 174945 34739
15099 102364 404440 228981 183865 25188 -206875 -98573 182505 53059 219688 218368 111841
15088 111841 -82292 -33794 151763 104419 87778 115077 -90563 141857 370007 245214 160477
15077 160477 309282 187152 -31220 -88746 271125 287143 149944 -112476 113319 -105212
15066 381103 237898 268399 -298162 -181762 124661 86792 296013 187854 292558 107652
15055 303713 457574 187646 -244951 44753 284191 178181 -78998 555173 191927 63275
15044 144615 178620 8039 247096 91971 38509 28020 280922 342536 211127 137456 205393
15033 205393 -148409 176135 85316 86573 87774 -36477 435210 286789 80589 142121 -89146
15021 472190 96860 121551 151881 230138 -94349 281548 168790 60571 275370 -25837 144175
15009 358402 120796 409940 159872 215902 184319 182762 -163103 8933 35563 129180 166355
14998 166355 302406 342859 328974 26726 379830 252082 197017 -90776 226620 478521
14988 478521 -81952 97424 429106 109735 226518 234825 196024 -38106 412481 375533 376377
14977 376377 -30317 130663 302581 83042 170127 123240 221233 -7297 454055 57509 318065
14966 318065 195367 -132496 277834 254823 578623 37141 -3910 414134 452232 173817
14955 208895 363258 143829 279334 468004 256981 299796 23074 94281 168584 277156
14945 277156 387613 311892 -54628 239584 -112047 -55205 45051 170182 225004 551118
14935 551118 102078 88724 107167 175173 265696 330923 243250 186152 283893 294625 378843
14924 378843 577201 193641 451929 380475 408857 244459 327327 454918 317894 98768
14913 471203 234304 249695 243850 558718 -20026 260044 347544 85998 287047 201193 98063
14901 517964 457091 282580 181466 292540 -10235 536442 245764 199722 335124 -44502
14890 137616 551273 278595 441342 545342 46437 242003 470150 51519 340006 272885
14880 272885 155818 214414 411783 334290 455772 357247 278610 572044 -30017 217041
14869 49964 186953 122242 316511 120872 188839 369150 528887 280195 283250 505370
14859 505370 -25269 427708 -122092 87609 165993 184332 98542 233922 224367 428991 286856
14848 286856 653423 548005 516853 132641 478791 460862 326854 302271 335968 110382
14837 397877 509248 358355 305736 194895 408626 387421 473512 594223 578394 230625
14826 435624 421480 637173 251932 830700 602149 265083 150629 347548 540025 558137
14816 558137 254109 216371 127205 263767 463873 345776 525231 412530 751899 605530
14806 605530 543061 545827 385300 342731 522046 618387 588273 327199 227592 777784 275832
14794 726932 510552 602646 288775 603399 523974 741627 130749 390821 234939 553394
14784 553394 733462 646420 540482 435958 472514 373283 733828 764347 726278 438785
14774 438785 388165 390278 744162 561875 592427 541462 244396 713321 745994 344963 607193
14763 607193 662799 333332 327163 651618 430287 555034 701190 641229 768026 837213
14753 837213 515594 753503 412146 956453 756066 605149 482137 500207 335906 340232
14743 340232 737914 810641 540239 291033 548977 137312 769402 595501 142364 728641
14733 728641 769549 659770 556763 939613 588579 785526 253761 600618 742737 712677
14723 712677 833049 890420 799151 676390 696474 683107 697075 731411 528412 671781 685626
14712 685626 648154 688751 995268 348826 795515 385971 644683 880043 875197 451443
14702 451443 567434 1104755 614419 1014771 504453 803384 534608 760194 705550 1089859
14692 1089859 863961 743653 866255 993228 1119351 896215 721406 1084133 739482
14683 739482 729390 1247239 711110 1053617 999245 1169683 1098877 597854 851063 901221
14673 901221 272994 882596 492258 621210 787807 667959 833901 1137684 1081350 928362
14663 928362 924483 893101 731996 1269749 1040994 913518 978761 972166 1154488 1160265 955845
14652 955845 1222462 1247096 882068 1144722 1485562 922679 832662 948717 1501594 1147513
14642 1147513 975439 1075098 786345 1305931 1351385 1014617 1069852 748833 1574757 1083237
14632 1083237 1371742 1210872 1320933 1133818 1100644 1311633 1167333 1128958 1120852 1300161
14622 1300161 1515131 1351020 1391638 1365383 1102703 1353100 1566900 1250186 1262591 1105070
14612 1105070 1337460 908778 1576715 1149500 1509797 1504504 1219922 1458369 1357457 1328896
14602 1328896 1377083 1400916 1614883 1725974 1582526 1723814 1400987 1815913 1422294 1474329
14592 1474329 1617893 1149135 1661331 1537776 1629171 1311325 2091075 1899912 1742236 1673127
14582 1673127 1740364 1773194 1687867 1624229 1828553 2098334 1836674 1826718 2023041 2297163
14572 2297163 2172074 1538556 1966062 2117926 1777456 2308888 2373056 2249284 2007101 2010778
14562 2010778 2603566 2125765 2456755 2499994 2500348 2794121 2830430 2739036 3026241 3367808
14552 3367808 3674866 4317545 5393894 7320475 11205427 20646458 41644431 44643806
14544 44643806 16886300 7566304 8503276 3913166 2382007 1880197 1812342 1929730 1455338
14535 1455338 1923629 1667169 1706730 1874158 1902086 2091627 1541957 2033291 2021229 2046765
14525 2046765 1880090 2104156 1980790 2477081 2318127 1976766 2253243 2256209 2233881 2451991
14515 2451991 2622073 2434404 2363591 2546831 2243917 2735880 2382779 2880908 2778136 2854429
14505 2854429 2724706 2718724 2797199 2402705 2303351 2913946 3124367 2858478 3195532 3092129
14495 3092129 3141348 2892936 3011113 3236146 3145096 3156262 3226329 3123434 3327882 3317798
14485 3317798 3224674 3553356 3301409 3253384 3666457 3571319 3849007 3590521 3764483 3710811
14475 3710811 3685242 3524235 3738488 3848867 4059508 4013499 3860272 4068206 4262225 3864466
14465 3864466 4217096 4241526 4169972 4313603 4249294 4301042 4731478 4829379 4616452 4598408
14455 4598408 4519211 4715455 4757039 4558510 4718093 4548565 5194897 4766410 5048264 5123172
14445 5123172 5309864 5109347 5160012 5283229 5338774 5423156 5476258 5793267 5507348 5669345
14435 5669345 6052932 5731429 5820595 5855638 6040559 6383102 6538827 6322221 6299425 6551265
14425 6551265 6546944 6841369 6716887 6916068 7138229 7551988 7081952 7609240 7472507 7347549
14415 7347549 7544233 7664642 7716966 7912643 8035021 8182032 8481705 8276916 8722247 9063943
14405 9063943 9071280 9070626 9065773 9258392 9327356 9757949 9903759 9626615 9675383 10253654 10463740
14394 10463740 10740812 10603632 10757046 11025197 11611286 11194933 11840740 11602358 12076340
14385 12076340 12350521 12762766 13086643 12815726 13079502 13011320 13668364 13746297 13891766 14793979
14375 14793979 14702391 15181650 15532053 15767525 16069963 16367799 16563372 16878235 17200609
14366 17200609 17655838 18092535 18080398 18806444 19387850 19693456 19915580 20541340 20835602
14357 20835602 21822299 21773450 22638425 23085130 22945991 23735843 24416334 25132706 25881157
14348 25881157 26402457 27102257 27714688 28391809 29047440 29792109 30960669 31681360 32650733
14339 32650733 33203918 34131920 35360805 36272047 36963073 38070094 39106773 40527185 41878126
14330 41878126 43123402 44137258 45923922 47328718 48921623 50323115 51780186 54037459
14322 54037459 55980903 58000424 60232657 62128969 64321180 67015512 69731357 72209163
14314 72209163 75018298 78424381 81251300 84376693 88341117 92114416 96045801 100144407
14306 100144407 104536108 109741345 114785934 120154785 125987396 131971856 138337519 145431634
14298 145431634 153010692 160811981 169530209 178448841 187686555 198176248 208459311 219663784
14290 219663784 231739478 244520854 257922617 271481440 286157875 301193608 316298544
14283 316298544 332348240 348139761 364258231 380232594 396022829 410834046 424324938
14276 424324938 437182176 447633770 455052430 458416608 459775774 459634487 459381444 458023688
14268 458023688 454427510 448892269 439573934 428375217 416479407 402910373 387749899
14261 387749899 371964561 355617640 339376905 323286982 307534495 292043178 277162793
14254 277162793 262654860 249671182 238157961 225474025 213656508 202594562 192188401
14247 192188401 182527456 173266130 164811259 157074131 149497664 141915796 135355377 128779236
14239 128779236 123273989 118108805 112823862 107869789 102760586 98231697 94410444 90518826
14231 90518826 87343365 83557780 80510440 76650921 74190339 71037867 68361635 66166274
14223 66166274 63504537 61162228 59414757 57481645 55555410 53389936 51736660 50060932
14215 50060932 48062349 47256547 46035068 44494390 42748609 41468764 40274755 38934005
14207 38934005 38719541 37578389 36007261 34845524 34040711 32855955 32164218 31599796 31111410
14198 31111410 29656308 29098956 28337574 27498001 27392699 26289852 25854412 24985750 24060442
14189 24060442 23599037 23273827 22667528 22148462 21632547 20967336 20819087 19897389 19633647
14180 19633647 19492932 18756820 18537034 18210081 17644334 17553248 16992908 16544022 16114981
14171 16114981 16143860 15587521 15340895 15072289 15195926 14394339 14428418 13994335 13824484 13653236
14161 13653236 13289477 13172906 13067906 12710657 12716443 12298282 11876567 11456785 11575625 11566282
14151 11566282 11512442 11001359 10944897 10958664 10487367 10378906 10104804 9853075 9603916 9587255
14141 9587255 9579684 9407590 9354252 9151391 8858736 8897192 8676628 8591373 8517722 8323601
14131 8323601 8454530 8187162 7883081 7667204 8035168 7618430 7374576 7559826 7290168
14122 7290168 7388289 7115366 6774109 7115587 6747014 6986562 6677155 6680342 6399764 7066076
14112 7066076 6253429 6292339 6284805 6352919 5734482 5941868 6128144 5721351 5927117 5760039
14102 5760039 5734220 5479163 5571699 5420798 5178474 5208489 5277865 5337195 5203379 5171160
14092 5171160 4871676 5057940 4926824 5071997 4883686 4977422 4751492 4854978 4977410 4465254
14082 4465254 4245324 4434738 4205682 4341042 4508758 4177092 4158140 3957963 4563808 4379629
14072 4379629 3880578 4054475 4121773 4077444 3772271 3734631 3683542 3643408 3534900 3830074
14062 3830074 3731267 3541197 3685652 3639298 3506400 3659883 3698618 3277254 3659349 3303565
14052 3303565 3306132 3241243 3582670 3488682 3377925 3119858 2798471 3148168 3344893 2991855
14042 2991855 2846472 3079721 2620728 2755338 2961214 2734930 2734944 2917855 2716284 2872058
14032 2872058 2754857 2981387 3150186 2750089 2590455 2545992 2430641 2469045 2432433 2507126
14022 2507126 2380587 1999605 2315920 2362520 2272216 2268064 2475872 2264615 1968591 1990013
14012 1990013 2376252 2098328 2398589 2023532 2126762 2031001 1863635 1974522 1997918 1853041
14002 1853041 1957507 1735926 2049228 1832568 1857531 2060319 1887628 1757086 1481650 1959572
13992 1959572 1889501 1780125 2306815 2931186 6166721 13427185 33268755 49226481 23091552
13982 10688271 6744291 4759454 3819287 3606738 3050075 2978901 2728498 2583786 2584352 2265063
13972 2265063 2304434 2467188 2107797 2023557 2202853 2382003 2174853 2268323 2015594 1794286
13962 1794286 1977051 1614898 1870295 2020894 1756347 1722953 1866538 1683689 1686779 1722040
13952 1722040 1969920 1999403 1530245 1780594 1660246 1447956 1638786 1731944 1587786 1505478
13942 1505478 1449826 1617246 1440225 1802188 1508028 1594188 1593432 1492132 1372650 1260117
13932 1260117 1510593 1641555 1367539 1263246 1386343 1392200 1443739 1216859 1450367 1516308
13922 1516308 1155284 1033455 1232952 1312165 1272930 1537625 1459452 1378488 1470614 1407240
13912 1407240 1458615 1448816 1344684 1118211 1399657 1219361 1455247 1479431 1035539 1112849
13902 1112849 1071951 1052964 1250588 1250210 1415261 1186069 942872 1330591 1198587 1175965
13892 1175965 1215556 1327157 1067201 1625733 1181328 1101414 1338693 1070458 1127920 1180953
13882 1180953 1352282 1005410 1321153 1307371 719507 1055864 1225731 1147045 1214731 1136136
13872 1136136 1047241 1019800 880684 1104152 1095253 1125398 1123329 1206740 1055294 1101775 859083
13861 859083 1033605 878478 937125 672532 1091721 1008204 881399 833064 954031 1198832
13851 1198832 1051773 1110052 1046895 1229017 1000462 951530 1126129 741279 1086940 1238051
13841 1238051 753460 707528 909695 791643 673504 880413 903227 911204 690443 1165494
13831 1165494 972788 944401 1127997 1006231 721620 765201 885600 685738 715810 710682
13821 710682 607162 974445 665453 654465 816340 822075 642237 675593 708637 869870
13811 869870 730167 886448 784058 731710 797325 426374 654849 925737 916995 1121261
13801 1121261 661118 723911 760246 615464 460733 587215 787524 903153 582194 291102
13791 291102 795651 537556 449679 356443 664679 604096 767198 619154 787072 943984
13781 943984 945057 727011 895820 758372 670842 655775 664680 611092 561043 589461 534608
13770 534608 554832 663434 713063 651000 597071 334960 579688 561854 898994 838365 11806
13758 842650 725468 569940 407238 519828 757052 403586 390205 184320 575000 370426
13748 370426 591550 482315 322709 428064 636981 365469 548920 763313 704528 769265
13738 769265 728112 847858 397430 628973 523011 650043 575701 481472 549824 606834
13728 606834 483969 582125 415988 298459 588204 327098 787870 636590 491465 652377
13718 652377 778430 659087 538114 601841 370872 351984 373642 372893 216456 922112 596407
13707 596407 428082 496860 551092 352358 382882 285962 487671 539056 487791 607111 458250
13696 458250 290972 447606 677320 477907 600456 620405 559856 151757 489980 325208
13686 325208 555831 420827 345061 544488 351290 358675 435625 667531 410948 410430 140462
13674 402506 492978 36116 340481 406294 -12842 15772 358287 318598 147617 242704 329021
13663 329021 288104 827848 441767 269237 374247 530273 300631 402775 753262 461217
13653 461217 784035 353172 559180 508129 564821 259147 604915 217845 513267 621612
13643 621612 415502 393157 205908 318340 509374 225951 529460 122473 385031 521119
13633 521119 530927 241803 545998 454920 422318 527691 487175 557480 405173 276540 253375
13622 253375 271194 537157 231388 407373 311042 247842 365017 321752 306064 739239
13612 739239 249165 -87624 272066 551227 127058 284483 645783 481474 709072 356338
13602 356338 534968 282580 515145 179942 140786 -113601 117672 51014 447658 398430
13592 398430 193479 42737 269861 219848 173497 248609 100522 155808 160820 429528 270780
13581 270780 456977 176535 394208 855612 -1308 467115 118703 27177 133120 363197
13571 363197 33406 262653 211283 204403 165361 -30933 304781 148807 262662 163878 465996
13560 465996 428201 665079 -3768 248390 -77973 214291 160648 201272 484938 243251 349459
13549 349459 714575 307110 -41078 -3324 302440 92902 643642 165688 121748 63301 394036
13538 394036 700997 440859 349214 133539 171787 252236 237459 312093 217825 236202 306769
13527 306769 329669 83663 261425 24814 188386 470975 -28381 444608 170398 176142 163167
13516 163167 208234 468349 498334 132263 128805 25344 414866 -88058 113774 568964 132993
13504 349416 129008 6816 537606 266216 342280 319681 173662 176270 226731 502312 399867
13493 399867 44352 331106 479626 353675 100466 121972 -35178 222719 165653 414368
13483 414368 389474 -55474 241166 351257 168664 309493 244185 250247 -101244 214695
13472 183810 393908 -132509 388015 178922 307397 284328 49051 39196 -193137 138352
13461 299177 313589 110429 211509 286982 -59390 127345 393527 363789 469663 56270
13450 269742 90851 612357 192368 275962 420299 179912 315049 299957 -259800 492259
13439 104586 104176 -7039 156884 161901 143229 107817 288260 24654 279101 -35913 -239512
13428 -239512 256009 52226 5138 -40604 317095 266789 63009 124921 -65928 68300 267609
13417 267609 107539 98168 118239 48442 3197 188748 128873 146490 205105 135691 130722 374744
13405 374744 165763 88590 13108 334667 259500 253671 -35874 272483 218991 351072 123025
13393 101811 75145 244067 199861 165215 441470 529173 -70299 90701 118317 -87923 413344
13381 205121 64895 79429 235930 260591 -99060 224860 535911 264121 154252 70078
13370 -36386 -56459 369464 306670 342453 259024 303317 403258 -27925 274381 340676 229558
13359 229558 168272 240655 -18850 376537 57130 -164953 227187 88677 113725 400880 181729
13347 249980 109980 278036 364272 197090 337588 610455 282579 540041 224387 604588
13337 604588 374221 22601 254082 260120 160068 -29400 27448 264621 160695 -29003 -95612
13326 -95612 262870 333702 252008 -44250 268853 294508 334052 310815 628746 205715 154089
13315 154089 194571 238237 229793 217591 585985 -4721 12904 291120 341845 214579 117287
13304 117287 157498 289483 -17103 166460 6107 77404 336156 264529 -150543 240770 -196092
13292 495586 255729 49819 289839 -183848 -32173 3086 35106 -75046 -19725 -49357 399755
13280 164881 9829 -216326 -150635 289595 275394 -131358 -43887 -17946 410516 331932 -260652
13268 -164374 32932 264536 47548 -219501 40492 291364 248372 140003 281924 257771
13258 257771 301525 6439 -33093 244372 281080 31439 71192 221249 205726 -294871 -106592
13246 -15188 209229 7361 63122 -267780 216469 116283 94994 181640 451534 41742 192426
13235 192426 -9749 180569 122227 359705 -6810 154983 106652 129653 -105161 -25980 135183
13223 233642 -39312 74189 111121 -229589 -182370 66889 -130005 406744 26238 -90149 90910
13211 213987 333648 152952 207208 123058 -35988 -6418 147048 344516 72016 68562 -222978
13199 -23502 141218 -1223 -217311 284374 -128327 17296 -170266 52000 121660 -98945 179516
13187 -1205 -4833 -148957 201848 -66734 -258289 298221 13145 102457 -144431 -213438 76433
13175 303038 35323 35963 256631 6185 294831 178217 336568 418447 114648 176097 -126160
13163 7278 103713 106354 296019 121282 46611 114308 405874 198875 146636 -9608 107555
13151 -176141 -94880 195987 327108 114843 -116556 79833 17986 233580 12939 121525
13141 121525 -250925 87992 138706 -23147 129559 -385764 -6618 104817 -70810 21392 224935
13130 224935 -29854 109992 -102610 108523 123853 8059 -117053 193111 46348 -325479
13119 222987 23628 -18289 204520 566987 -177122 -9195 161855 391822 -157607 123673
13108 290703 206058 221237 21364 138687 164431 -20918 64110 374114 349238 217180 1233
13096 -79518 -135783 12706 392901 -103929 -272832 403361 -9376 205370 76755 121797 230616
13085 230616 -243180 -143700 -114057 79862 33754 -154238 -228017 46411 232639 64346 3813
13073 125622 207884 120044 168280 191643 44147 -12143 136755 141118 199555 148152 -87888
13061 182738 140975 3835 138780 186550 65317 -66094 -129114 203887 407531 -143831 101645
13049 -71064 -15586 -129733 106248 145370 -212525 369125 11285 24993 73643 -204970 293422
13037 290166 280102 258580 -227469 90366 -55848 228571 45642 -25854 -13299 330600 -66633
13025 34544 -107458 63474 -225242 -82294 214841 58884 212639 163060 97825 110817 77682
13014 77682 130256 -4774 -216013 -156323 11658 -20682 386733 127910 123461 229185 -60551
13002 -181423 227990 10220 -23699 -20538 27764 218181 189831 -192244 -53089 9854 -60401
12990 -72772 -86505 -235681 -4343 -136794 -120466 -54511 17623 -118069 113502 -61152 -29821
12978 -88767 343774 92068 112662 -183126 -21834 237652 42011 -27960 178181 331741 123821
12966 -277450 -136566 145652 -270745 158894 13876 135594 246159 -77081 136625 159296
12956 159296 141619 -43792 -77710 -8918 19546 -129848 -272035 166501 -347622 -172162 135095
12944 176867 57365 110630 -105286 115638 -104894 69587 11094 -169685 105456 240608
12934 240608 88973 52533 -307220 123720 19706 19447 -4827 -94840 86632 72618 -24338 167026
12921 -104404 48979 -190360 -14317 -15822 267263 61934 77073 10211 137168 215864 -97537
12909 -105126 -33535 208277 199382 105377 -38619 9364 163230 -34805 264798 70572 -23661
12897 88567 237595 -21392 120827 106879 -139143 -234251 414010 177736 190955 -39303 456124
12885 231521 5766 -82308 -289685 77428 71704 86938 52800 109903 -39469 98936 313490
12874 313490 -218451 -35432 -22270 287468 171346 25462 -257544 -360740 -353458 86835 247010
12863 247010 -29898 -134334 -96119 214821 3978 -123548 18175 -182671 189112 316244
12853 316244 -43134 80599 -150785 167666 -138833 -43620 -239411 62408 -33557 -292632
12843 -292632 347660 310628 217683 -119961 -33536 -11472 -182072 -98688 -142813 40416 -86
12831 -205008 7401 -420518 120028 399694 22484 156278 98729 143011 363750 -271270
12820 -286109 -41506 169243 23991 -124582 -208124 197289 -171766 326178 -65144 -361558
12810 -361558 -86172 -169058 369410 66400 333614 -113924 -36507 59062 96727 -32701 -82982
12799 -82982 -43812 -207071 23448 1831 -308924 208666 -87874 -68590 26752 86366 231021
12788 231021 73644 -133398 176290 -247031 -22229 -19381 -79773 149244 101428 -192720 92125
12776 106420 190163 31395 329255 -52471 -25765 81269 -39236 5582 211802 -260263 -72165
12764 -124903 -375237 -1198 136074 269582 -3756 132469 210100 -18400 -39365 119697 211874
12753 211874 2080 -303323 -169738 76192 -107239 38275 -11517 68711 187940 -53757 1101
12741 220634 -81137 140144 161264 533468 255925 -182186 34326 -98108 -128831 182403
12730 -123355 -336318 34398 420256 251055 -60044 127509 11607 86866 40653 -246552
12719 89807 159927 57462 -102003 -261362 -46266 -107072 264841 -27369 -146301 -5460 226187
12707 91994 -90639 -58816 99039 -44318 -75957 45119 -168233 107489 326902 -48232 172607
12695 154306 111096 144125 162833 146044 34562 103365 -423598 -174218 -4847 269409 135540
12684 135540 -35748 -201752 279241 -122306 266143 32811 48427 14753 7346 -73872 318061
12672 257715 20174 -114733 105993 211696 30315 209666 124185 32749 34854 48698 437571
12661 437571 161957 505856 265218 -2133 174066 219503 444770 176235 -279644 174090
12650 -289635 78214 111240 -82882 392131 397302 199528 122757 109782 142692 -99648 -21690
12638 -103021 -92229 -21413 205344 280709 228372 161867 199582 125117 371955 83802 168276
12627 168276 342553 -89036 179177 193383 270556 125984 -105977 277195 52604 -92751
12616 -123452 80186 -30225 7556 -43273 -188750 229550 87542 -215175 175060 408007 -101687
12604 -172146 38482 319379 205210 304041 166762 81610 66522 101841 205229 231220 -239980
12592 10283 206457 71790 -53771 78551 121010 -94524 -27148 -67747 16187 -22542 -82621
12581 -82621 207308 70022 -74875 38387 -128980 170768 239826 192874 -80676 -118569 -357346
12570 -357346 20589 117746 -160113 -47820 71297 22854 -22656 -23623 -267193 -146254 138825
12558 -36748 -132298 -114869 -221675 75617 182739 187437 85021 312686 9061 31054 41208
12547 41208 -346606 39072 203257 69858 113610 72577 -175649 -288209 93176 345202 118333
12535 2393 236435 9047 -232153 -1436 -94432 -63944 -39734 213964 371783 350102 185604
12524 185604 143524 314201 315744 486909 338266 -43141 322243 77445 116355 32148 -252597
12512 61450 -609724 -22621 -71301 73995 -89068 170615 -182225 105664 -164876 -4113 191741
12500 -278181 91457 -213221 49075 76727 -227659 401347 323764 181087 200451 38087 81291
12489 81291 258142 -144949 107368 110310 -10199 84090 6919 279198 -259395 189715 141928
12478 141928 -209648 137332 -380762 42172 70023 -118612 -18015 63176 -35095 -231472
12468 -231472 395028 -126898 -40465 25870 108965 -53911 -32778 121647 -67269 197403 -3760
12456 -92752 395583 -175734 -349742 -51466 81515 -234650 -385871 208187 -50915 -140789
12446 -140789 -25955 97349 234588 254917 282652 92850 -199819 63246 -156051 597491 49073
12434 -28325 9784 -22564 442146 -223947 -124458 -45322 -218529 -43260 174993 105256 39831
12422 74148 153177 -7605 94102 -29317 -420473 -91908 148790 58113 -223043 46169 292983
12411 292983 -34556 -29849 128559 113311 186392 -153355 102672 8851 109099 -163085 -44956
12399 -321971 -33525 80912 -134725 -61914 312625 11232 102256 -38242 106130 96551 212013
12388 212013 136173 -15931 -8492 -130400 -75857 -19725 -84642 48301 -355644 -117445 181900
12376 -53402 -252766 -125320 -109337 -100985 -11662 -366 308069 157476 -221531 202897 -21797
12364 184119 -14498 99097 236569 -131349 -114690 8775 124561 -50654 -241416 -52754 -46329
12353 -46329 172979 26371 -70855 126731 47437 -331953 108274 14587 -76164 -139346 65024
12341 -180020 -113585 -208729 63107 116849 -68645 -33963 -177165 -125858 -197581 144880 -29204
12329 -101596 -89112 -268336 -485698 -196771 -27796 -140739 241872 -169481 -112947 -20323
12318 381039 79559 9959 -229899 -46497 260748 210857 469552 -55026 268032 17517 188633
12307 188633 -70849 414145 -54334 -155585 -343438 -72531 9168 152846 -7158 -83006 -142283
12296 -142283 -29513 -37357 -90428 -206456 70425 322518 -252711 -62212 594 118940 67331
12285 67331 182642 -90778 -220460 249731 -236937 12255 -36504 -107739 28178 35026 54068
12274 54068 74387 97400 78060 -44402 103182 -71785 308913 -259902 -392901 208471 203610
12263 203610 -94120 -35938 -139655 248023 349825 -48568 37742 323512 -232780 13315
12252 264523 235048 139592 -322321 135301 288956 -178026 307815 251086 35138 78933
12242 78933 -86373 60990 -45949 -195183 7698 -159915 27460 -127539 100681 137837 -95761
12230 209946 293578 328937 343709 240417 261142 275630 471343 66531 451116 261813 457518
12219 457518 469223 190853 42032 -54222 133565 224381 137172 452775 -232044 -130686
12209 -130686 71351 -444888 -70839 259854 -182697 -125337 474463 203313 152274 211028
12199 211028 133971 -17124 456630 -12651 407185 116734 476353 232120 299661 162452
12189 162452 36910 28865 333428 59891 338657 306133 381814 490459 -176861 -34954 127998
12177 45466 -226058 343855 262787 902 230460 224053 361234 42461 209903 212888 284695
12166 284695 307748 196613 239100 -47886 -46044 262349 313108 120633 -37410 211710 154324
12155 154324 -21984 184916 258480 324313 -204573 250770 243634 241277 -82932 174034 -19075
12143 -177981 147198 199463 -166156 130346 -75486 53527 167341 -36181 -239864 39946
12132 -129625 102414 -22895 -44763 -18593 -136979 116555 399383 153554 105068 -333031
12121 183089 -73866 -245910 218135 -57135 -32432 103450 -161782 49317 66873 253527
12111 253527 -39729 80224 -83947 354513 -131346 -337731 68563 -67866 439408 242017
12101 242017 83905 39759 -99787 -99588 -78359 128443 -77271 -148590 -148402 -200451 70776 -148962
12088 191818 9553 -150470 29490 473952 -50179 -84079 -39187 158392 -22050 94358 308751
12077 308751 -149903 298220 -183565 -27248 82449 -64718 275129 33142 -229104 109398
12066 821354 1007199 1101534 632040 195856 101529 -25783 -225707 -441184 185388 -70681
12055 332412 -64454 -206503 300274 6688 -98610 -97764 -100411 -84543 108073 -159976 -336189
12044 -336189 -211188 175537 157793 -275525 -101182 1899 23585 -129603 -19829 -49886 -12952
12032 109332 44469 -64652 -489678 -108896 -130833 -24557 -282763 -8622 -165392 -140871 -84525
12021 -84525 -123954 25100 -249196 110946 -311825 70674 -263102 149704 -89618 28077 340716
12010 340716 -297397 95488 -122515 -31691 -79548 -24913 129968 -59616 -260501 -63672 -112279
11999 -112279 380179 -48683 252749 -17415 -113084 54869 -31288 -131295 236313 -149036
11988 -441205 -165452 9432 -36906 -136413 -166769 -97974 -27160 -157772 -323647 -214094 37450
11976 402595 -308346 -42677 220793 37307 226296 -310349 65516 380703 245939 130376
11966 130376 -100230 -110378 -106244 -16590 53979 -176952 -143131 -70916 161383 6966 -78246
11954 50384 426320 -40128 -267480 105663 -149369 -4778 134347 -6157 145031 -436395 190029
11942 62960 8489 258714 113606 224311 -12968 307857 -95272 407413 -6268 -42241 -48806
11931 -48806 -73553 25473 -157292 -60135 25195 -185454 -245964 -163570 -304052 -166856 19264
11919 -249328 -229951 48914 167343 -310829 -73415 -45452 -204310 213416 70981 -98953 -231794
11908 -231794 -324636 -120796 -79891 -94104 357156 198182 24936 -36701 -22312 -86246 -53928
11897 -53928 -201811 -254155 6408 -107862 -305510 -100876 96318 33517 92827 -233535 -265779
11886 -265779 13538 -142616 -308562 27074 -43332 16663 -340632 300996 -46260 -76767 11839
11874 123065 -277631 38196 -325207 50272 213010 -131179 -8259 8629 -62338 219528 -81553
11862 -68266 -377175 -180475 -180005 -254537 -277445 -13337 -309262 246638 -93648 -164919 60990
11850 -98508 270456 -67008 -39664 -271638 272060 407924 -66730 -320365 -151189 -141080
11840 -141080 112011 -41652 -135522 -115121 -410888 12516 -240086 -73014 423498 -225507
11829 -140914 19170 -81563 160038 427250 -313062 -162926 -160749 -122533 -173905 288832 59843
11817 146043 3170 47795 -34885 -147536 -442136 -366026 -192660 62578 -391685 34347 -94696
11805 -337148 43595 233392 52959 -83947 -25477 -207136 -233383 -96311 -147693 -177435 -67046
11793 123654 75214 -3712 100358 -9890 -142124 91150 -154036 312215 -237522 78300 8558
11781 -242171 -102031 147590 137200 66591 111778 -416567 -71992 215349 -142099 -119668
11771 -119668 -16588 -116297 298427 -136749 295343 -45204 -55696 31599 -43413 -171137 -195195
11760 -195195 98301 -289974 -98672 17802 117475 -148421 3222 -18674 433764 -88313 -80779
11749 -80779 -186244 -29442 -87346 -352260 -14302 -199469 12229 337458 69453 -104058 -196452
11738 -196452 -251463 -149294 248432 50010 -75764 -190453 -159190 234722 -88500 -55634 36532
11726 166382 157878 165719 76723 -296373 -160714 -377827 -77365 -144911 29358 -116997 4565
11714 -158333 -70815 91805 -110775 -48930 -30546 4492 35861 -187147 -447280 39536 -108293
11702 -100056 -180423 74470 25867 29716 -155103 19562 74066 -81680 -174745 -59608 -158464
11691 -158464 -11545 30166 -111953 -183103 -278726 141821 464250 1518 139055 18589 -17894
11679 -356659 95635 -11343 -182845 13344 265712 -108328 -158264 -234234 -192350 11490 -219491
11667 -38496 -88397 366052 34813 -287188 -59094 -27992 -191058 248738 170840 198217 191799
11656 191799 85443 -131121 184008 174006 -358305 -168603 -26672 389175 129473 -300084
11645 -39627 -296050 9425 -168749 -171991 240087 -221432 136123 292138 11898 -187915 -44115
11633 -80770 71358 6259 149044 -160277 -239768 -157922 438 214520 18912 -212889 -181233
11622 -181233 345495 37425 -101222 206227 59805 16395 -35461 32740 -171226 10626 -50071
11610 -51728 -2774 -55414 -43139 -10001 170598 120108 23874 -166070 -124959 17606 -124110
11598 -196448 -306855 236830 -37192 -107784 61323 -305008 136548 -4285 122162 -227538
11587 -337764 -365198 96380 -75129 -10521 92935 85668 -11599 -26472 -242740 -23925 21723
11575 -195977 -194176 -81962 -148625 -132156 23600 -98975 11017 -210896 123355 -89468 130767
11563 -85241 165675 163191 -270262 39382 -65244 176497 246663 -213339 21155 -77317 -52778
11552 -52778 215719 -66961 -199329 21396 44063 -100660 -85883 -193552 83347 189976 -293171
11540 -45505 118993 -174843 -71928 -93704 -157517 -34144 579080 -303189 -53276 103666 -128563
11528 -19476 27743 276157 364876 203681 216601 -140566 24717 1823 708042 17289 299003
11517 299003 358514 -104234 40112 415530 230606 40671 366572 -67575 311595 208546
11507 208546 164465 -138515 -572 586824 478033 125032 -35254 -64851 -61892 133595 128805
11496 128805 177 422349 196955 -155146 24067 15058 174329 134470 228405 344834 -472
11484 413936 189860 95284 270684 143865 118168 -100892 381721 152474 154479 180961
11474 180961 -193746 -213527 140735 163229 -171021 185054 125484 -83178 378689 364543
11464 364543 319084 500399 329301 -865 -24049 94976 230634 -125588 165235 93589 321340
11453 321340 -197433 -78413 -104198 -77303 86615 178974 35757 45526 470 -76682 459684 49446
11440 52812 -9307 139229 153727 -14952 493601 244081 142999 41425 406534 237616 59245
11428 -198626 107455 159887 322288 142649 51767 -69678 99348 -69665 23056 -27031 -44425
11417 -44425 -227774 49393 -239248 145960 205276 -161304 -231164 91835 168939 -215599 236342
11405 -118346 91754 251009 -381924 103243 -27867 -303460 -28353 486279 -329935 187649
11394 70756 212268 -288700 -28490 -126000 -220913 -51629 -149843 233104 -262664 -285656 26716
11382 300440 -228849 24337 -369910 300677 11368 70324 -100804 12673 -49927 86649 96955
11371 96955 121766 191507 17022 -149511 -404146 -12706 199392 -92343 -224006 -146105 -121530
11360 -121530 -65104 -413808 -257768 271746 110440 38181 75247 107620 110340 -16151 198438
11348 369718 -59734 -244449 119726 83746 406149 12666 -424608 -37850 -354378 2073 138121
11337 138121 -119917 -222532 -210235 25520 -80268 -35955 78820 331790 -199536 -95206 -38530
11325 213838 -115539 -141659 -40549 95732 -261904 -216542 2350 -2418 -171129 -165184 26699
11313 366408 -26801 112165 114108 -143923 -152146 45503 142332 -181039 283411 93889 -21042
11301 -257202 -504214 -46554 139219 176150 -114171 170327 -103187 -297583 -247869 -107498
11290 167490 -74087 -404556 130549 -3101 72066 214962 -178460 -31091 -38509 -627836 -169660
11278 -239994 -124190 -187582 -131287 -204557 14443 -65887 -151808 -132868 39691 -108937 50378
11266 -112540 -37501 402396 -153831 -27959 -101930 -167059 26469 -97160 -125207 -107807 50128
11254 -109194 166090 -72771 -170719 -229694 -29600 -154379 100203 -271195 -61202 85756 46002
11243 46002 -19511 -364256 42773 -18907 -153533 186990 153678 -200650 159086 179996 -185398
11231 -13114 -184523 -113772 -114278 -9020 -278825 289329 -87963 13960 475439 -14842 -236023
11220 -236023 -237708 45234 -29481 -23906 -55573 -89047 10269 -23407 -151315 -121725 291980
11208 -324460 19339 148150 -121232 -71805 -255147 -108694 -151795 164007 202398 -15540
11197 -132221 -208979 137026 33661 -70535 -532675 -381147 -209038 135594 -401163 102047
11186 73951 -185896 25563 -40788 186748 -74659 221832 234809 -111610 -170439 -158419 -82297
11175 -82297 -603517 -194113 63907 205286 -42122 167929 -111778 75104 -154625 89324
11164 211815 104121 150529 -2531 57629 -89267 59710 120875 -32733 267197 -84691 92702
11152 83316 -146032 -110018 -314341 112232 62025 18130 -37159 -2304 329741 154408 -790
11140 174175 29117 -12186 -57836 -47916 -95775 111326 197662 194707 81829 176435 5077 9159
11128 9159 324335 148679 -111211 -69697 22307 373440 213488 -8830 241847 42212 -188074
11116 -145810 253818 -163128 94329 -66908 167326 243063 39602 337370 95227 244061
11106 244061 329402 -51443 95224 12775 487393 91088 -145748 196307 288664 331324 327334
11095 327334 328641 135429 125178 458031 1423 356718 568104 263915 338656 537771 129838
11083 -8379 474423 264951 289010 274871 217751 366765 230141 529191 710871 367764
11073 367764 278819 383102 449748 502357 299631 869873 156619 379498 818040 385396
11062 529208 607432 802592 656494 569377 426905 412564 832046 929135 843574 871500 1050112
11051 1050112 938717 756714 932109 1227682 1104884 1013800 1515819 1130926 1258919 888464
11041 888464 779828 754750 858207 1190511 964617 1243485 694574 893509 860855 668992
11031 668992 1009488 795253 995128 895117 695456 917510 988660 1330144 1263977 962399
11021 962399 344389 878617 984966 688503 851134 884203 989094 871430 985735 680340
11011 680340 707261 771008 823376 776535 884320 1031078 932062 654380 1148510 610070
11001 610070 565502 800824 1215366 1015987 710646 857217 1104708 490945 898701 538323
10991 538323 875510 815408 910705 975208 910077 1088565 1170161 1061411 1689474 1408859
10981 1408859 1192788 1431298 1682388 2037870 1984052 2220594 2718723 2959840 3462477 3874011
10971 3874011 4482824 4425095 4453599 4588121 4036584 3617382 2721606 2237432 2067407 1631179
10961 1631179 1316663 1525118 1044371 1224409 1239679 932661 969205 893586 636312 647095
10951 647095 515080 333853 282350 197651 126475 323115 319477 232990 52573 87140 142302
10940 142302 305648 257327 79950 310792 2945 158579 275602 250455 4044 77299 198797
10929 198797 -20736 102425 -91590 48173 40635 66 164904 371529 -264444 79132 -189041
10917 174044 -11820 -13581 -106437 80628 -7548 127438 -68919 -22570 -8582 -47669 173002 184329
10905 184329 11997 -53157 172136 19457 117180 -150400 -67342 8527 23939 -233007 -8266
10893 85571 -356937 168455 159203 7336 -281054 152152 -95604 -11665 29690 26156 -60920
10881 111008 -29599 -314118 89682 -16892 294001 -54304 38410 341454 172238 -277273
10870 -13003 17303 96350 49877 -123313 103537 -180315 -141213 -202291 28598 232017 -170832
10858 -148146 -72456 -72461 153019 -177769 133984 -172748 -102955 -418668 -122844 298246 -94448
10846 -408026 -100648 238425 -207211 -102385 -61027 -97437 -142327 170031 -50612 -151569
10836 -151569 -33634 311160 1547 216741 155775 165535 -249992 77288 -45140 302230 301423
10825 301423 27513 -14379 199864 -43888 163436 4967 -248232 -24883 -46838 39851 -14456
10813 -98818 -203723 -172595 38608 53663 223577 335676 147751 49246 205737 36372 -169313
10801 28331 261970 199167 -32366 -174544 -62398 -377275 -79287 192516 -12389 266331 -84154
10789 -184901 -286411 3160 150786 -496267 -75369 -156958 91384 -91789 25601 -38575 -303084
10778 -303084 -167877 27022 -66311 -108801 154024 36002 -44007 -185771 34459 331568 -196012
10766 79881 116668 -84020 -360843 -22905 -119765 -163489 157374 372440 176672 -142268 208910
10754 31862 -60596 -162571 -201106 376686 -246191 140667 -300273 34474 -60690 -286886
10744 -286886 491433 -55728 33981 -127809 97045 -179515 -41141 -61167 -92483 207298 40096
10732 -37879 23433 -154807 -51838 445651 193619 247274 97741 347175 -18202 -161455 -169352
10721 -169352 -147422 111846 -283147 3751 -133117 175466 -236002 478524 272897 51596
10710 -188016 2481 -10986 -205625 -177205 -136791 -102392 -219610 -77144 -124489 -402772 -47319
10698 -85725 -207176 -112964 103321 -113908 -301404 -25353 -181444 75587 -196457 -91953
10687 52541 24213 -165807 475965 -24405 155208 -228695 54334 -182733 -174541 131386 -103308
10675 163426 75193 -101418 -128659 272249 -382093 -93223 149823 261239 -9624 136859
10664 -355172 -301496 -134154 -220852 -93589 -55695 114961 -65311 136311 -236523 -179803 -127761
10653 -127761 -103907 -154282 -79379 -112898 -282072 80279 -307318 177073 -388124 191825
10642 -139078 -49937 11824 -143145 229039 86351 63944 -348642 85944 -10030 66789 115889
10631 115889 125571 192516 -249957 -205040 -56162 -317044 -19988 -198350 9792 -43991 -212339
10620 -212339 -11012 45874 -422072 309312 -142289 -44242 -158331 -163023 -152547 -342276 -356854
10609 -356854 -96971 -216840 -60376 -83092 111830 507898 127862 -28661 23438 -92421 -319811
10598 -319811 -261746 245432 -161432 -308643 86428 -26791 -245572 -70211 -32807 178954
10587 -59405 -102272 138789 46147 -91002 -184160 31123 143382 -318344 -266440 191726 181124
10576 181124 -382813 -115106 200338 -103112 208193 -74327 318389 81926 -193693 -124388
10566 -124388 -167945 16679 28782 -48415 -56619 341545 156451 -111514 -123269 -289215 165148
10554 -65597 -256927 -75559 -287675 27915 -116220 260511 -235652 16646 64648 40851 -269263
10542 108579 -30791 -56075 -337020 219281 221012 -198897 -57490 -269763 172347 -68364 -110782
10531 -110782 106985 -377554 104487 -195713 -254320 -122552 -113064 -25341 310937 194961
10521 194961 85010 -77005 70463 -265076 174032 -40876 -117472 -291991 -173437 212395
10510 122059 -152825 -129989 -265985 -38376 -31919 -12350 -189557 -183432 -42610 -4233 -223864
10499 -223864 -201974 -51479 -31840 195045 212394 -69218 -61746 64569 150100 -232041 -56702
10487 36827 29570 158910 -132640 -14394 12853 404972 -125884 190132 -174093 -86770 93570
10475 -31812 -111986 224098 53203 72654 -88988 -314451 -142818 108889 -54463 210055 160648
10464 160648 59619 29986 -153072 46170 185323 362499 -99486 -96200 127751 -149050 -257902
10453 -257902 163340 -348929 73589 -68093 182091 185929 269889 -120827 -13049 -184312 -131767
10442 -131767 -13333 65477 40835 -142064 -226942 8972 92905 -163101 217898 463616 198083
10430 78410 207096 64293 -250371 -79069 20259 299023 -66389 -306396 -13667 -28560 35623
10418 -4035 147482 -186021 -41470 38461 298016 -201101 -114310 -41233 289807 -189813 -21832
10406 -327265 -15071 31745 148350 -254033 -105407 -11509 28447 31969 34370 182564 40930
10394 -4371 72541 -191047 200616 313857 132142 21379 232507 130755 65898 348682
10384 348682 242845 126380 79354 310522 -276902 359158 334417 308293 450631 229561
10374 229561 380617 55958 436495 400125 267473 554691 337722 770803 552909 609777
10364 609777 530202 888598 328315 555961 -19067 163075 297910 -115638 -123494 252337
10353 203442 297795 739532 1034009 954326 967801 470844 419195 338151 368299 148228 30119
10341 121384 186611 -79643 140889 311538 332996 423325 -115098 67153 75891 116419 85673
10330 85673 22949 146518 -84856 10861 161659 40690 285298 269642 84948 126716 165496
10319 165496 218948 -266280 -177771 -125936 -173450 -194733 163456 -125974 -214045 -155744 209666
10307 182416 -56390 -703 67048 -84885 -134312 -186452 144228 -198272 47295 178273 -321322
10295 -231636 -132092 62696 -199407 33112 367748 -39599 -124616 160598 306095 -21036 -163731
10284 -163731 57099 -185820 65789 -170958 -3787 -220947 -132114 91717 245229 125722 -128018
10272 75728 32052 -27356 -129465 20072 -292217 293255 173670 119170 337617 193840
10262 193840 182798 75811 120158 78755 389074 277731 -162718 400437 -8989 202855 -76470
10250 -112935 94406 12903 -384995 377243 -337928 245287 -6195 78877 -39858 -106045 -8527
10238 -185066 -206639 -421457 147474 -240132 10251 -97201 79316 55979 -114555 90952 -234288
10226 -233417 189306 -287833 -220307 -12288 80076 212092 -126670 -109799 -291128 108638
10215 -73648 -265956 48196 -92017 -276682 97109 156 -129784 -270266 121400 -127848 -34191
10203 -69477 77669 -228524 -423130 -76284 -235455 41174 -70212 -130473 -9214 -245576 -90798
10191 -100849 -31758 -157839 21967 -251726 -460896 121425 -133120 194037 -47733 106466
10180 -175151 -54422 -74436 -46514 -290317 -109873 158529 -62627 208943 -131177 -653549
10170 -653549 249583 10653 32861 75404 69957 -124839 -35902 -183904 18897 113427 216674
10159 216674 -70974 52433 -3092 22528 -168609 -153490 -35110 -73500 -151355 158047 427422
10148 427422 -322891 68852 -461936 9011 17863 21179 -90136 43185 -16316 -127997 -91693
10137 -91693 -264512 -23984 255865 -300756 -106474 -333831 11584 -13579 81012 -25423 34494
10125 -173974 -196193 88889 -186660 -57067 3530 2419 84893 55490 -245115 -47514 -223387
10114 -223387 -324480 121069 7508 -80776 57611 91016 14142 -114398 -79906 -114070 223791
10102 -332762 -101683 -71268 -194361 65361 -204644 54809 -102598 -16258 -227471 -39820
10091 -31691 -75853 232322 -161577 -166390 -89000 -72676 -239171 -113130 23845 226880 26684
10079 282277 -328513 -88197 149024 84488 -68199 -115319 -35385 -20713 135003 13740 -219050
10067 -240943 208459 41810 167390 -183997 188877 -191710 -84414 203503 330251 -212490
10056 -161872 21795 201804 -109162 81578 -222876 -135131 -321172 -103574 -15772 17779
10045 94839 105373 -152834 -154142 -278199 59080 -162193 -72696 -295340 75685 -98603 400790
10033 315300 166300 71541 277435 -166801 -112057 -367525 -264435 102380 60204 128935
10023 128935 -344392 -29131 200657 -272425 24615 -42410 -195749 -302445 -76923 3411 -128489
10011 191797 66833 27008 15045 -59916 -179281 219805 165384 -72369 -54761 -6121 136561
9999 155228 194277 1641 -139644 254062 -88223 37105 -18735 -72275 -141299 -141945 -238697 -98817
9986 -291459 -179291 -75791 18827 -285215 -271039 -60654 -270938 52035 -27607 122500 -396100
9974 -29403 -70338 -333833 -80848 -291530 -72858 -81986 22924 -19110 -293562 -293925 33055 -30434
9961 272716 -169821 -45826 117093 -310891 -182964 341628 -300680 -179031 75881 -267822
9950 -147182 -71759 -293044 216399 4158 122187 58133 -194382 -252443 -58666 141396 263138
9939 263138 -188146 43821 -128211 63720 -195392 -122033 72046 -111249 -92601 27261 113374
9928 113374 -80195 -114325 -5967 -250606 76335 326710 -138839 50074 176987 -263593 -131646
9916 213365 -271480 -7783 -406200 -63371 27880 44199 80716 -114252 113251 186023 8224
9904 -94268 163798 -118800 -28614 123431 79382 68553 62671 90195 -125703 -368741 28345
9892 -193598 -262098 -93617 -189961 -21146 189625 -117764 -244051 280863 13233 84830 -289836
9880 -89707 -446581 -219089 73132 -233940 233935 -98800 -147171 13400 -211796 12048 -184482
9868 67066 -230417 447995 -101056 189991 -235298 -233157 125758 265645 -113963 60303
9857 -22489 -52426 105035 -160518 135037 -134785 -276517 -32760 -305552 177582 103368
9847 103368 47202 174041 25231 -368101 75256 46161 -98139 54669 -14040 -282044 93218
9835 -69003 4673 -122445 -262685 -283367 84737 -65364 -103981 114337 -188413 256117 30662
9823 128146 -191559 -146519 -66486 8718 72643 -15927 92743 144357 -66865 -125277 -109720 -335517
9811 -335517 -237618 -101575 -583 208825 -84699 -320508 127747 8919 -157298 112198 -199915
9799 -93072 35961 -88041 -396094 -47197 -72588 -169035 -150066 -327253 -63041 252561 20613
9787 -293112 65996 -226241 -261783 -20016 -88882 -46072 -145742 183418 -200843 77523 145491
9776 145491 188462 -171988 25886 130908 22762 -161238 -255293 -35290 -9453 -27486 -23208
9765 -23208 179756 219171 106493 -52183 -128277 189829 -40842 -53502 -236060 -216523 85682
9753 123476 100237 -222557 -190099 45619 -107814 70523 -310648 40568 -220470 -521550 -51286
9741 63998 -134134 -81263 53757 54686 -239772 69045 -256653 168923 94130 -246726 172354
9729 -427027 3750 -6617 -378364 -82161 -521805 -177918 -2769 -162101 -121101 101801 -115693
9717 3922 -175952 319129 268021 -582665 10997 -34874 198263 -68919 165772 -115981 245695
9705 52385 -71173 -113276 -437809 93762 16206 -156408 -75393 53682 -315935 45462 23061
9694 23061 247641 -51518 -5255 -81211 351385 -20103 -34751 167708 -57196 67540 18279
9682 -122080 -255854 -210960 -160961 -269712 232152 -276070 177249 -182263 33861 -101008
9671 -143613 30761 -97455 -169052 -52336 -290741 -338312 209763 -28041 110122 25882 -164762
9659 -219994 88155 6706 -213916 -88930 -108969 -290504 68049 95230 297985 -264679 -205308
9648 -205308 -38187 -187761 -67930 56369 43148 168363 -327024 -134065 77327 148947 -60189
9636 -60338 201228 -8767 -338915 -285627 7739 20162 284939 -77738 118595 -188231 309222
9624 -196095 -139442 119861 -53049 122763 -39127 -9753 81934 -165841 -145196 181672 14458
9612 -57921 3074 -44797 297677 -76445 143909 -237787 117723 -193148 -109432 23082 120683
9601 120683 -11347 100266 -74133 -189396 -219407 -72811 -33585 -43211 -43960 -119911 78754 -70105
9588 -43729 -196262 -200967 3075 -97466 341354 -102464 10530 -272239 -10913 -154164 -353215
9577 -353215 -339744 -391522 54354 -55010 23010 139037 169276 -121239 35284 -282311 115172
9565 -21149 155882 217714 -199160 -89382 28990 -219318 -364961 98361 -21216 -253023 127471
9553 -4290 1540 43441 -250884 -198775 -91275 -123574 -44139 161005 -222711 -95914 -39593 300483
9540 -468151 -436635 75609 25295 40647 -256657 -57184 45827 -182708 -74078 -289494 95199
9528 -293751 -149574 -142612 61238 29939 71136 133358 -145568 -26726 -47603 -344491 29996
9516 179515 50336 272490 -13222 161372 -272062 -91982 106093 144402 85441 -115722 74423
9504 -467285 -251082 -130604 -34740 -215567 -32393 -177653 -31768 -164655 228506 118211
9494 118211 5661 -122284 138690 -145569 -166645 143907 -217122 -213195 -7280 -3013 -147064
9483 -147064 80451 248855 -150666 239400 123665 -221190 38345 -94890 -104732 -34965 204836
9471 -165905 -74773 -136496 -189477 -239425 -87443 -267368 -257370 -124652 -144228 -486508 -224899
9459 -133939 128668 44758 -116064 -337717 -223282 -227322 -219919 -230950 -269888 66202 162113
9448 162113 -42497 48332 139352 90934 -15328 -66195 -196987 77091 -20881 -81896 -118938
9437 -118938 116989 -236273 -24628 82417 -144319 -62862 -4653 -56841 9676 -141908 -185784
9426 -185784 -125985 -363941 -166140 285856 -61086 20806 -9114 -212901 -19210 1156 -247287
9414 370465 -116042 72332 199507 15040 -31492 -234940 93934 -129948 -165229 -145041 -344416
9403 -344416 -24482 39840 -153506 -146821 202932 40654 7598 -95822 -190740 63808 -39883 -49315
9391 -49315 -15171 -183882 -206596 -264721 -3542 -175099 11189 35870 -387239 162845 -261720
9379 40635 16322 17724 260061 88611 -198112 -30716 4209 -105717 -166250 -121708 -230292
9368 -230292 -141096 -104256 57232 -387993 -390755 107346 -101142 -30743 -81581 -426510 -43834
9356 -31444 448591 -59956 -28992 -46513 67011 38971 -190412 -49979 -64203 292667 62471
9344 -91669 45535 -168986 -72365 -94234 6746 34851 -258692 -99432 -362483 -389417 -184613
9332 -225062 12238 37174 -77273 -63697 190876 -30476 -70037 58985 -131175 197925 -296214
9320 73072 -49019 -207675 -142238 294580 -135089 124611 -217187 -199951 29291 73630 222966
9309 222966 -145895 -25574 -273012 -240248 -2401 -72924 1794 115034 -402319 -92648 35731
9297 101879 -92116 -113983 -159436 48946 -155099 3158 45391 111681 -112013 -329664 -124938
9285 93802 -131618 -55047 -258566 -177885 -21113 3063 -190285 -237039 -365375 138067 68701
9273 95977 91194 7672 -61952 -253915 -42754 -102058 -251371 -263136 -136977 -193148 197080
9261 59938 -73614 -117458 -109931 -115045 -48821 -236350 130940 -186555 119433 -6152 31225 -5515
9248 135083 130688 -129252 -162938 -145107 141353 65319 -222819 100163 -114387 -315023 45870
9236 -26801 157947 236821 169180 -114183 -117502 -77362 -206234 -181168 -336946 283527 98491
9224 117230 -68690 -358445 298159 193351 4891 124591 -145431 -74829 -13694 -144752 -183381
9213 -183381 -110721 -364442 -138281 -210601 -54322 358465 17206 232686 -168857 -150489 -236107
9202 -236107 57401 256515 28896 -234156 -77523 -333207 -77900 50755 -194556 160951 217939
9191 217939 -87130 -244871 10141 -97441 107403 -50605 -496574 92959 -229123 7911 -115818
9179 -134699 -222042 -305616 -146215 133085 270165 -313244 -357669 -94862 -13989 -39753 -18807
9167 -119425 -83310 -58539 -211356 174390 -269215 -14322 -21642 -164130 68455 -89241 -77301
9156 -77301 -76765 251009 -45665 -258333 77273 -249067 14857 -40048 264551 128478 -196424
9144 196969 -17413 -191557 -64945 -13151 -273187 -123878 39449 120257 -279478 142829 -303835
9132 -360828 -451733 -180776 24870 -65604 20871 -31508 -4844 -132359 147347 30856 -152292
9120 129816 -406529 33398 -388075 -153795 -16635 86730 -90335 -9999 -228955 70659 -10169
9108 -92637 -285817 -199448 -37713 -176943 143746 298391 -223247 80326 221617 131943 95171
9097 95171 -247166 -131050 -204525 -34303 85222 2968 -92677 -70718 -86337 16370 229683
9086 229683 -394169 172375 -227273 -218847 158067 -46861 187540 95999 -265902 8695 261688
9075 261688 23762 -156020 -117150 -79895 164183 250341 -14260 42286 -106324 -154202 206045
9063 103251 -16161 43515 -13458 -523723 -383397 -113516 -179647 -30980 22469 194179 -38549
9051 -10091 -137998 -201076 -186398 347275 -498327 94425 -143212 93418 -141225 75744 428941
9040 428941 -4250 -179834 -206166 -311811 -269486 158305 -136770 138950 93115 250189 -128070
9028 -397501 -3452 -254323 71278 214881 101476 114542 -153898 -24776 91652 -334067 194584
9016 53953 29676 -89227 -34081 201915 -41285 -65748 -281846 204532 -269325 -1105 -88411
9005 -88411 -120099 -2901 -1416 39556 -85134 -292400 -204143 113509 22347 145616 56587 1117
8992 -122511 59162 -130574 -19890 -103262 -106621 47026 -107021 1369 -193493 -253167 5502 65020
8980 65020 89073 130432 -96515 -171300 123841 -2795 -303427 -2988 -214008 -285994 65745 -17188
8967 -142769 -179454 210321 7712 247091 -384123 -54278 127006 -193168 218368 -509981
8956 -361728 37473 -231310 -96618 -61615 -116448 -286380 98716 -120919 -274250 128660 53720
8944 184665 53098 -142147 -196320 202412 136889 24893 -165518 47265 -283788 -124309 206944
8932 -22716 8023 -68564 156620 -57940 140620 161278 -88390 40354 562056 1991547 6545098
8921 6545098 17613887 4107905 968479 526461 479935 385409 435008 -288357 -22489 -54693
8911 -54693 -158016 -49234 82967 398231 133551 55570 184144 -213232 -67623 159230 182590
8900 182590 113298 -99224 -56440 -22475 -145666 -11995 179572 109202 -88586 -10710 -569 83278
8887 -290182 -76587 -142295 146670 1406 35278 46342 321870 -118095 -114230 20054 -280208
8875 130574 -125491 -41249 -28546 -132611 -12079 -111381 144991 -119597 78930 -32337 -281344
8864 -281344 -245832 -135007 -57347 121540 93490 -267260 54210 -171658 -122818 17918 133038
8853 133038 -307651 -297704 108781 196005 -137671 105939 80746 38551 15788 -434262 211008
8841 -44829 -209331 -60443 -397052 -194939 -5164 -185078 121663 175914 -46970 187238 77997
8829 -18928 -78777 -238486 -179018 -76474 -118360 -321672 95055 232337 17359 -225617 -228390
8818 -228390 44343 -173122 270851 -144214 -43359 79305 -133222 54487 125134 5986 -113685
8806 9754 -143284 187437 -228084 -125325 -124700 178927 8895 -101032 10602 -36904 99168
8794 -511374 -137583 -195352 -412492 -182534 280681 -173819 33115 33743 -150303 27716 -76684
8782 -160463 -38378 -357644 16989 -6256 6002 -66459 -296560 52304 -52236 -213509 150406
8770 2757 -134554 -191804 22520 48165 170375 73924 -253492 -260648 96427 145235 -40326 -78934
8758 -78934 188713 205634 201123 -66180 -128273 -64598 -327789 -231122 130816 -217398 -247551
8747 -247551 -72939 1665 9916 137529 -15115 -16109 189119 26309 -177278 -174512 23566 -136019
8734 -22747 -165961 -113789 345717 60083 -97033 -113318 -320709 154659 56732 -10949 80637
8722 150687 55281 141455 26267 -152342 -15028 -124078 -247811 -85121 24642 2857 -268717
8710 161199 108584 -167625 79838 107156 -168324 -91031 -37900 -128981 -210455 -186913 -232297
8699 -232297 261794 -366192 -497497 -16824 -9648 -392 111217 329927 -173164 -169135 175123
8687 -86660 -205057 167897 -45228 -174449 -32008 -11810 -186153 -44364 66363 198976 136037
8676 136037 113332 300091 52703 -48778 158365 -93631 -137496 -259047 -19824 101628 -97604
8664 140084 -195601 -241073 25755 80244 3803 299580 116816 -201142 -48621 261882 233221
8653 233221 -52598 -411460 105976 -130705 97974 191555 -80112 88234 -339083 -172816 134980
8641 -67264 -80612 -61891 -212813 48059 78503 -279773 -17776 193571 142606 -58162 -35365
8630 -35365 68709 172250 -309534 -263520 -254999 -5658 -39826 -30475 282826 158371 -10232 -191982
8618 -191982 -103891 -224892 84682 -195726 -20952 -192167 52149 250 -172285 -73916 -201948
8607 -201948 -64027 174859 -27066 178206 247861 104539 -210424 68184 -246551 4840 33311
8596 33311 15535 -120597 -242277 -109532 -114505 -70642 180533 -139341 -26796 47565 -55291
8584 -47014 -110874 -200881 116665 -345357 -219593 200773 -152991 -14346 -117393 -93531 213189
8572 -233917 -47136 -76045 -163485 -229654 -9080 296221 19019 -257415 -198677 141192 -258050
8560 55719 195308 39429 -126601 -99578 -138526 -156052 -93289 -39589 -76177 93221 -2376 1650
8547 -192755 124979 119495 -125160 -179412 -243095 -122320 -304961 197948 70654 102634 122030
8536 122030 -93821 -75338 -11249 -97719 12761 4305 -133881 231296 -353818 -190835 70138
8524 -104183 22657 -63774 -99068 -248279 -132554 241817 269362 -118397 -352762 193166
8513 -259281 -225814 90391 -43072 96309 -367988 321810 -125350 -61636 -54281 92573 -96170
8501 -323380 132762 30421 281540 404543 80227 -81003 -66946 -77114 4278 -134386 -207681
8490 -207681 -244047 215371 -231902 125552 49658 69844 -92719 143367 -6046 -16777 145648
8478 151217 95696 -180878 56755 -178974 -117796 -133664 -168285 -227776 197568 -314091 70972
8466 -40005 176941 223991 -96737 126592 -253553 408746 -74870 -198717 78770 294221 242444
8455 242444 -224817 -458641 -101651 21971 -112152 224914 -27944 -266515 -13846 118431
8444 -238051 234385 -165845 -406282 58072 -296108 -68599 -126980 -123004 -106061 213475 142660
8433 142660 -120934 -43945 -280546 -383981 -56412 -214109 200821 25132 51720 -233417
8422 113702 -210856 -100215 89592 -169231 68178 -32991 -97688 -44249 -199326 -88846 -116444
8411 -116444 -62663 -186080 -43871 222248 183448 150 -297396 -189781 -114686 153612 -673625
8399 -27980 40582 -131913 51407 -34802 -210080 -79389 -84763 19951 -286102 283800 131174
8387 -358065 200839 -229559 -366925 143238 113451 101740 -112335 -166669 286351 -51789
8376 94606 -280452 270289 157767 -67519 -123311 -91611 -13442 74937 -221118 186138 -58566
8364 -50023 -8400 -249466 216317 241777 96959 -65328 60757 -215779 107018 -91103 -203537
8353 -203537 -188688 -133381 305976 -140214 -101307 84113 113412 306332 -66515 -324704 -302376
8342 -302376 -411511 -16931 225107 -16107 -306506 82712 -205357 -103347 -72372 22638 167862
8331 167862 207500 145247 308103 104672 -403159 236876 395973 -44075 -156882 12014
8320 100110 -43283 332669 -461477 210193 -348131 25987 -11830 -39811 113183 -64075 37624
8308 255520 42137 119471 -53568 -202132 91633 157449 -6299 -87209 -445263 -72272 -45452
8297 -45452 -408672 17453 -210399 132382 -472298 50771 -157702 -35531 -77273 -45644 -71615
8286 -71615 667 -242912 76616 178217 -84602 -57767 202979 269157 153498 51859 -165812
8274 -462617 187223 -76527 -408789 1454 -210332 144082 -220091 -181835 -203076 22075 -30627
8262 214244 -171047 197936 87943 -68956 128903 -115271 187027 -87732 -106809 127179
8251 182996 -75321 112781 93664 -200049 -98948 -243137 280547 -76995 55418 21779 -246162
8239 137312 129540 -182626 56947 242857 -71867 -1784 -139239 -21845 -81171 -159839 -97142
8228 -97142 159228 -111902 302585 -159103 -61264 226639 -119889 134081 -3311 190495
8217 -81512 -166281 -40409 -19322 -273979 41465 176446 -247556 -68421 263877 16963 -61986
8205 -278362 -66566 139008 -5085 -35630 396996 -119205 -29202 59484 336693 218106 -60304
8193 -195277 -67482 -10250 81216 110271 24146 -90384 184678 230442 -30952 -37246 -58728 -192196
8181 -192196 -275503 -580709 -20251 28924 -102427 -391269 -24307 -51363 131825 56932 -120296
8169 -19781 -225376 -194395 -59302 -15637 -78827 -193309 -31728 184339 -80474 56012 52266
8158 52266 137659 -93728 36753 6156 155764 103981 -240061 117055 -347988 22088 -458 50331
8145 -332477 -264455 227993 -36520 -11060 137516 -58043 102407 242577 9254 -196790 296765
8133 426 44719 31860 -108982 -23242 -36105 -193154 170518 160149 67526 -34594 158924
8121 -141469 -89963 92580 -19761 229077 162887 -283789 34011 96547 64993 -300570 -111357
8109 -107757 -139249 -91773 -365620 -321780 -17842 -165293 -214917 -141661 84708 207042 209062
8098 209062 -258161 -2770 -224035 89134 -398343 25516 -93259 -81824 19436 42300 -140078
8086 -273139 62013 -336397 -170158 146347 -16595 94700 47971 -116927 51891 82783 -287405
8074 190798 -112254 51068 172933 130460 72952 -35694 -284736 128753 25251 18735 233025
8063 233025 10901 -361308 -459372 -166017 -183621 -239929 55226 76696 -8942 -233462 130718
8051 134438 -111517 181098 39307 -14600 -51100 117530 20538 -158315 -207577 42969 -157281
8039 54945 -8805 45756 -63070 232820 7262 -55604 68861 -163589 -111432 -172474 244528 17078
8026 -281206 -220737 -285908 218942 -328597 164833 26890 -317294 -149980 -66889 130966
8015 130869 -5685 416716 39720 -71482 -235782 -195286 62951 -82484 -185766 180120 -86027
8003 180265 108765 -50789 68011 -290615 -39473 -478647 187008 -136900 -367355 -13544 152555
7991 52140 86924 215210 2039 -115514 -195491 -148427 60338 -194000 52128 -101173 -30190
7979 195027 307504 157122 -36247 -146309 -74634 -22766 -50185 -14523 -388063 29243 79016
7968 79016 -97654 220422 -718 -206779 38239 121960 -308210 -167961 94202 -21938 207903
7956 -114095 -238791 -18747 152732 -161329 -40305 15423 -44028 20847 250805 192739 38784
7944 -60549 -219984 -74545 197732 -439759 -6314 -224372 -30188 -207742 -315648 -4708 -316109
7933 -316109 171396 -92073 -54541 -162068 225649 -66619 -161552 50516 -95610 -262914 -66708
7921 62565 -813 -123101 19284 -92738 -49244 -53071 -270665 -18035 17317 -68641 -170593 -237764
7909 -237764 -91451 -232825 -102002 -194700 -82410 -118357 -131282 -188745 68309 -217994 -29926
7897 24978 30742 126594 19890 77335 -5718 -110298 -101347 163883 24052 194700 102159 172207
7885 172207 44875 68299 -79706 -117495 19594 49294 163579 176788 -24218 -259624 190372
7873 -24365 -224496 -314439 9361 87590 -91528 -236227 129273 -47027 -222137 142812 -145210
7861 143245 -34756 -83191 -159079 -68244 -209971 -116614 -323770 -112739 -35552 -86953 -83265
7850 -83265 91943 -416485 -229031 -14529 -51896 103483 -11261 259581 165881 -43075 -107199
7839 -107199 -26098 81172 -254966 13990 21767 -60140 262135 -232727 -64067 131592 -325498
7827 -134418 302808 -272636 -286305 -12583 -236424 -7164 149484 56518 -188164 -399151 99130
7815 42819 218531 130086 -55892 70951 191681 -16564 -163389 233703 -250102 66485 -235672
7803 -167362 -25706 158667 -160911 160981 85566 -189550 280572 -76836 -315233 -62479
7792 182234 63788 -5204 -19886 174492 -67807 -44642 -56806 -48489 36928 164784 -136331
7780 87354 32966 23537 -22051 -87202 -138531 213906 -78551 86185 104624 -233532 -33288 190583
7767 57784 57772 144979 760 -106119 -173512 -116190 -164954 -39028 -329779 -81863 -143580 -21873
7754 22749 -93266 17796 -53 -70200 19331 199926 132832 -121907 13437 94684 -149682 278453
7741 -10302 -62865 352025 402350 130246 -78985 -112126 -197532 -32152 -268015 -261488 -114450
7729 263547 -198575 103452 95062 -66939 -108019 176235 -188318 37093 106336 125057 -106223
7717 -205868 -69241 -215263 35617 37607 -124183 388798 -331047 196699 -154539 103608
7706 114885 112321 218575 -251392 -129548 -60520 -336572 -161557 108256 -76809 -73908 358435
7694 154001 -221056 -238924 -334898 -208872 32599 316049 70025 -11297 11113 107085 123990
7683 123990 235286 -132520 231191 -200377 -72365 -68646 132205 136178 -217047 176864 -548793
7671 -74410 85484 -52118 -293471 -278236 100076 167230 -59984 268698 -11995 -64735 79072
7659 292996 91242 72873 -108571 -175643 -133986 1884 -127830 -129298 10323 -111591 -240049
7648 -240049 305568 136332 126152 75648 -160011 -338503 -15981 -345484 232147 -106078
7637 -244825 272405 -154714 -415260 -279318 -243726 -162530 -142494 442171 161684 172482
7627 172482 276080 -71535 -185509 -354017 94681 110485 316983 326037 46736 11180 -79403
7615 -201631 -17710 -41994 12717 171434 -119357 127639 -86883 155396 23011 76923 -410361
7603 -37055 50724 95748 -302010 44541 -95056 -157756 339008 -175568 442753 69834 15307
7591 80021 158921 113651 126409 -65658 -253002 276163 5587 -53971 -336075 37740 -21720
7579 -104460 196210 79064 -7762 130279 -93741 -360552 213363 -109580 -287556 -312905 41751
7567 -75354 -49440 -34507 -28288 -246686 71612 -147223 -120064 39687 -73237 -214622 -165673
7556 -165673 136479 -103942 282710 242097 41703 -177647 -247666 -23347 -272013 -9370 -2785
7544 -289133 47682 -134926 180276 120799 -90945 -55934 28248 109015 349716 -98807 -63068
7533 -63068 198816 -82196 76076 -40628 -215282 53708 23014 -202599 182507 27248 63665
7522 63665 40083 -257610 80636 -19822 -170997 113260 -149797 -198773 -96810 -335516 -94876
7510 -178943 180614 -73976 -58213 -107331 190097 -43020 104934 -130151 184216 -95859 -4545
7498 -246958 -136449 -153961 -107302 -74696 -41771 50068 5293 -211527 175053 28283 33967
7487 33967 -32098 84195 6650 73258 250580 -78785 185100 -55848 -48658 -113144 124632 -43066
7474 263095 -3606 57398 -83252 -56683 10404 -838 84465 2643 -128800 -68217 -7214 -177164
7462 -177164 -1951 -93975 117040 -121455 22437 380292 43604 190133 1669 -91954 -95382
7451 -95382 -61564 -522556 -73057 288825 -15646 20955 -2803 178452 132427 -137194 230344
7439 -45946 92901 -93325 -125610 -128879 11657 -248370 136421 208551 -113185 -92825 -122461
7428 -122461 -115464 93527 -50043 -39500 -127102 -437746 6539 -102729 -158254 122507 -47375
7416 -124412 -20902 172801 -128743 -258463 -298540 59952 -110938 -125695 75815 -34913 -111614
7405 -111614 -199217 -168927 -160028 -32569 -11402 -22053 115253 165922 37029 -73422 149463
7393 202072 -233423 -153523 -58759 78164 10015 -183783 199049 -127560 -196739 146227 -98505
7381 48149 60880 -8140 -264258 -222198 -189374 181563 -264569 371340 -75921 -107747 -81836
7370 -81836 41636 34622 103441 1161 99549 -138992 -270592 211860 -62872 9776 113204 79344
7358 79344 19311 40202 157431 -2362 68051 -85996 -100748 190769 254189 -120603 -230273
7347 -230273 -38825 -201034 85042 -147897 -18591 193540 184646 -141470 -464336 -167171 -215965
7336 -215965 88568 -24836 -57021 104012 44217 -302869 -105458 93325 117797 440059 91031
7324 -10171 82776 265624 3138 -15113 -175566 -191202 59547 -73956 -20316 68208 -141626
7312 177534 -111794 -242277 -103531 52252 -58406 -84632 77061 -131869 -996 -197520 184671
7300 -51184 35998 48880 -206110 -190772 -157899 13880 135116 -104038 -24079 -82537 -316077
7289 -316077 -209712 -53341 105271 202372 -206156 160772 -31965 509039 -4763 24517 216278
7278 216278 -99113 64461 -228267 -347376 -214682 -24945 -32986 203285 -80714 -222669 -228156
7267 -228156 -226775 86947 -128557 84209 -90245 126637 -188526 -187351 325797 -46517 270873
7255 -211805 -38675 -15692 -257983 -105554 -82839 -44886 -140054 -12756 -142960 208407 17207
7243 -281302 366828 -3556 -340974 -85126 240920 158983 -36873 31011 15253 44301 -61359
7231 -86538 -53948 116111 76415 164432 -225125 -40396 -40405 174779 -96656 164743 -9133 281360
7218 92035 -97787 -164591 244114 -152227 97594 93444 39037 4114 -21142 33745 52069 85512
7206 85512 94777 -52659 2967 183403 -88338 -33542 -250362 15317 -254836 -281862 -93921 -87680
7194 -87680 -60434 -17467 21786 164249 69192 105842 253910 -22993 -123870 -118135 -297545
7183 -297545 -315945 -135600 138615 -34231 34291 78015 160315 -427980 100592 -64330 27881
7171 -311302 -27894 -48349 -172514 51426 -27218 -392603 210937 15019 -110062 -58142 48375
7159 82334 -43916 102104 8797 5889 80657 -125449 46241 113053 -299987 189594 19128
7147 -302289 -215636 -11547 -291106 -267753 122854 12231 -157136 -16041 -199905 18199 -11911
7135 74206 15059 -108930 -90602 135667 9806 117332 322932 114012 -87148 -29739 151838
7123 -269253 -114254 121753 -19466 -62192 150193 -14036 -188668 -289116 150269 14182
7112 -152781 47675 63891 -113118 294983 183223 266541 -118634 -224829 516277 -293607
7101 99296 34411 -383316 -248770 114865 -175277 143892 -138469 -47044 -156812 18917
7090 63710 72894 -157097 114017 238964 36416 -123535 331656 222059 239203 53316 236322
7079 236322 -230780 -203480 211913 -124139 109389 -180842 -85930 -180921 106096 -52862
7068 -160290 -173317 12933 33587 87885 -84357 -140074 -83391 -110332 59810 -211768 -248247
7057 -248247 -235491 -179227 -68394 -49744 -306713 -174480 -37304 -115868 -44030 -35550 -98942
7046 -98942 158415 71533 -32218 187577 -76839 41372 113717 -103268 118278 -49599 86566
7034 -235314 225405 -243027 -128007 9798 281085 77828 -2633 -264185 40356 54946 151191
7023 151191 -141428 85705 -20815 -34026 -3036 -195299 -272634 67894 -122706 18348 148272
7012 148272 104984 55132 29149 228635 241769 14867 292057 103581 -211198 4434 187029
7001 187029 -178952 14601 -93792 -106985 88124 52781 -72358 -178740 -10345 -240856 22403
6989 -63140 -379889 -12598 -342356 -82995 -150849 -105075 -53583 -126997 193592 91296 -95693
6977 65000 291442 59382 156705 -305838 286339 282258 158174 -70343 -95218 -150265 24607
6965 6126 77887 -107306 54862 -25687 -95465 125610 -15470 101764 247835 -31005 -189168
6954 -189168 -419914 -232442 -258556 160097 -22338 -212776 66847 136333 61057 -89356 367655
6942 240467 -90950 -401109 -15239 159242 -80098 -160295 76508 198588 -370594 201678 271542
6931 271542 -221203 -164546 43040 -11362 -14175 154862 -14033 -181794 20585 -64470 126060
6919 -126517 69756 -108193 -44089 -384779 -88550 -187948 -162987 182766 219481 -105 114601
6907 -290325 -21531 80777 -224353 -15042 4835 -36265 -40828 102666 -122818 348154 -117006
6895 84070 -421423 153537 -179527 -173992 -118033 309855 -193131 2650 69342 -142721 -131518
6884 -131518 84462 211215 150454 -14337 102462 -68878 32585 26219 -265714 179636 28538
6872 225818 70614 147110 141098 181831 -192639 2754 -194480 26547 181256 54798 -33643
6860 -173572 -155949 -101448 -118018 31941 340804 84936 -48686 200010 -143813 139089 -164835
6848 178399 151175 -122215 -50667 112931 31563 -179689 135141 76679 -30696 5321 -104879
6836 -25976 -52916 -24113 279380 -2572 -207001 -24704 285324 -298451 -161686 29858 -10350
6824 -1925 131530 -168614 -318591 130034 87262 65442 -382361 10222 -231969 -270704 -84675
6812 -107073 71405 120626 -132798 271891 -204335 -190345 -424684 -12712 187189 82838 251963
6801 251963 76750 23725 -318463 -211708 204859 -171347 252365 -113155 80098 192765
6791 192765 206906 283330 76766 -209006 -58624 -135346 114026 -358171 197020 -175914 -48203
6779 -54519 -65324 -4119 -3294 -236790 36590 -22162 -29861 247614 105842 49389 -87485 169902
6766 65907 63319 -112309 117166 -68955 203778 160468 -84877 -45573 138787 -33463 27748
6754 163892 205610 -51975 -152984 -156822 85711 -190665 -272582 24445 110547 -173716 79948
6742 37460 33181 262026 57387 -20387 367588 -97751 93097 -163326 -65374 -46004 -202454
6731 -202454 98539 141241 -202515 -107621 28393 -132546 -103519 60392 217833 -244934 44372
6719 29529 203812 333219 135130 157700 -75718 172546 -128673 313348 -170655 -409495
6709 -409495 -16441 -188048 -174004 87929 -205957 -106999 -140998 -72515 116133 -349028 -40806
6697 -86798 -28803 -112091 118889 -22302 117392 -309299 -119704 -97355 -242123 -211372 -123227
6686 -123227 39466 -139640 -186451 -53605 -144273 166759 -80735 2444 -277708 253423 -110827
6674 -238445 -224160 2556 -34794 76562 68966 326347 -596790 -274243 -460253 -132390 -5974
6662 -211518 -122545 34700 -400784 -84401 71647 21051 -75480 -159346 -88142 276322 -90743
6650 138131 8615 1717 -112606 63924 103217 -159679 -12071 -167673 -109085 313775 70357
6638 -187876 -98617 118423 -49049 -310023 -37310 11716 167564 254896 -16263 111191 202006
6627 202006 -112099 119846 253542 112618 -168963 88850 -43275 176148 77249 28838
6616 -97222 -152030 -82114 103966 -132258 -101311 170876 -9191 59743 -12949 203638 -1006
6604 -37256 55803 229217 -135774 -59666 174424 -25051 38520 -230134 -67789 -340124 -200300
6593 -200300 141612 -45972 -47557 -118479 15983 225018 38369 -502204 76129 -136891 44008
6581 -18053 -42415 234034 182620 -96736 86145 -236596 101334 50523 205294 45704 -252335
6569 281487 27431 22007 -188752 -4291 -7480 88894 132034 -46754 18841 -16912 -63605 7099
6556 -96110 94693 88218 -22361 62706 194702 -77575 -96491 -285620 53317 -223649 -133189
6545 -133189 -259364 156749 -19451 -18672 -149965 -191294 -205586 -75059 126834 -95987 102085
6533 220347 52948 -158056 171967 -34985 88637 133617 39892 148632 235496 -178783 -138246
6522 -138246 -222893 -203612 61794 146840 13283 31139 -29681 5302 -207196 193848 -28958
6510 56341 487428 295397 26691 130648 140608 -217698 330365 113945 184973 -339055 3150
6498 116776 -451058 -122372 117710 -17972 -80390 -131373 -76908 323325 -68886 292121 140480
6486 120452 34762 55972 113363 118319 88401 -102287 59565 15626 99722 -193546 -187570 103604
6473 357783 -57715 -33462 -185921 22080 187400 -66038 45266 331589 -172296 163578 91840
6462 91840 -192550 152621 70905 -84884 224602 -210461 -94418 -194480 237394 96854 -56024
6450 -149752 -182202 -80706 -367919 -180790 231567 396014 257618 -41930 -333276 -242041
6440 -242041 69507 204834 -212876 -47303 140615 169142 -289639 -35118 -14079 -55011 98301
6428 26038 -188893 -158112 -159513 40492 228405 276749 -88276 28938 -19685 63561 50972 16865
6415 89130 233640 35542 233096 -416931 136439 158868 53854 -199900 -149560 148831 -161660
6403 -6045 -114611 157974 -169439 -71757 -43131 79948 -4201 -246827 -41595 -97034 -233230
6392 -233230 -145867 -167036 -323010 389123 -314156 135107 -214214 230721 216831 143201
6382 143201 125426 -276270 155931 64920 -204364 506244 -69034 69459 -116835 -333041
6372 -333041 -189860 13309 -77531 -266940 -1833 31458 -191015 -51744 -4454 -191356 -93328
6360 219621 73651 -322043 -237055 9389 -25934 -99259 69753 357718 60630 -99643 21959
6348 -1950 -96497 29078 -48779 -44664 -37871 -37933 20786 185393 33854 55476 -37259 -10199 50011
6334 -144582 -375553 -375086 -108606 -5282 -148504 -414584 -43394 94530 248498 -67644 -2790
6322 90991 -349203 48835 21422 -52010 -151676 2885 118828 -96618 165918 -25604 351416
6310 -58190 148381 352590 -181985 -167478 52087 -257942 -43367 28884 -39608 -8161 -9605
6299 -9605 258002 94348 50493 57667 220717 15341 173735 322521 214110 -134762 118580
6287 -54250 40934 -81452 -27462 36837 -20904 -116132 34018 113550 -169158 -142679 -279912
6276 -279912 -68513 -349789 -102237 -161750 98408 55199 17096 -14084 121970 63841 -132316
6264 -97724 133376 -144290 165521 -2453 -18285 212272 -115732 98122 -75233 -14227 78010
6252 42655 120485 23434 -135948 -217945 109963 -7920 -145605 -118110 172428 132746 151364
6241 151364 -240654 73294 -149646 -108742 -149957 24052 77702 81482 -221466 -214933 116822
6229 -295395 143544 -106671 -155578 -50461 61321 -41278 -214754 -261296 144767 -41984 109908
6217 206529 -50858 -89487 -236674 1483 34441 -93168 -78393 33715 -234864 154397 125114
6206 125114 -55624 -335493 -19214 58936 -114608 164517 129884 -84784 43366 2193 135299
6195 135299 188027 -61812 52886 103367 -6733 -268858 76886 110977 227734 55456 203539
6184 203539 30029 -197277 107051 -122290 50936 243277 -131446 87122 2438 71784 -195211
6172 158490 -26590 9055 -276802 -291546 254347 74895 -44176 16903 220003 101649 22642
6160 -16326 -352063 -192057 -18292 -117387 51896 84867 135725 -99448 -66161 -2565 -146361
6149 -146361 -154587 16260 -97873 -91451 -64210 96899 -91416 -205694 96226 -55820 -4262 165425
6136 -187386 -23747 222838 -236069 30645 -77678 -114318 -126328 323678 3239 -316371 182189
6124 -343565 -161303 10025 -348012 59584 -220842 -17751 -109979 161074 -245467 188318
6113 -177390 -277286 234131 180038 -55713 310033 67361 133535 -126669 -36035 119337 -8841
6101 121183 241451 -224678 -353271 -10175 116877 54111 -280517 160382 118989 103912
6091 103912 -43062 113107 -19935 10556 177967 89621 -332375 187508 -45510 47001 -119286
6079 -210862 139481 71847 -88961 -152126 47127 -115827 -164348 108663 -57730 9927 -24960
6067 37890 -44075 9170 -85031 -122686 225296 41311 -265844 -180353 -66078 -5630 -38235 254338
6054 74297 -208401 -192707 -126015 -220067 197395 -22350 -249156 -62853 2173 321203 -147140
6042 -57282 30647 -218863 -15380 19685 90082 -278898 -213680 -13141 -177935 -14762 140055
6030 341648 -324517 97490 129747 -43245 7546 -81255 -131268 248697 305483 59849 158282
6019 158282 12986 130630 -113212 3115 169213 -173256 77063 17030 -298083 71586 147465
6008 147465 52702 -66878 -196252 221488 -140360 -138695 -178781 -43879 -229406 -193544 270296
5996 192688 -161836 -66733 -37913 -139733 359502 32557 231492 -167061 88964 23951 7629
5984 -23660 84679 207857 -246929 -319549 147759 263763 -2581 16084 -143827 117225 -70956
5972 -44704 -272683 -101537 63041 208122 -132489 -52344 -88732 -145279 -113462 95106 289246
5961 289246 235616 83353 35962 -34271 20616 120348 37158 -62126 70025 -19934 -113106 70228
5948 -163356 -54289 -22005 128502 81218 -400834 -510842 70491 25191 23979 145659 -115598
5936 71323 13306 225066 -85006 26251 92394 90363 -262237 148241 -65830 -105322 -81885
5925 -81885 -222577 -104658 -156276 -128333 -140964 218689 12808 36525 -180410 134087 132539
5914 132539 -13725 1915 144424 123093 -168396 -201018 -39599 59905 8457 -187029 -131635
5903 -131635 93987 -15908 84082 29628 267398 102253 2760 130732 -129127 177567 142911
5892 142911 179389 -79009 117041 -328847 -202481 -255374 122739 -82153 -207181 -266287 -22045
5880 -128954 36733 100544 -97003 -20388 126485 77767 244287 -110984 -288912 100793 -115008
5868 -111744 -10842 -20089 306009 202224 -14336 198014 36849 -36985 -233272 -56861 21492
5856 284101 332363 -36751 80942 -375707 -65763 57210 322975 79052 199438 -17177 -309078
5845 -309078 -177634 -96793 132915 -60024 224009 73144 -489908 -177970 -249453 375850
5834 379943 -12594 22996 -89184 12388 179170 -192658 207686 145561 -79031 -119584 -36672
5822 229120 -78002 22888 -65948 -165153 75574 -55825 -135167 266871 36524 263270 95596
5810 -233281 17532 164921 47265 410155 2330 -111751 38578 -232477 23364 -25991 -144055
5799 -144055 205230 168087 -5957 312735 -129724 -137849 -181560 -85673 -227195 -108331 93569
5787 -145116 213730 -261915 48444 45186 -245342 49833 -135946 -32582 -83384 5919 -182681
5775 -57561 149310 -12761 -111960 111741 -119412 267165 101008 -198246 86805 310171
5765 310171 -117202 -86807 223384 123279 -252945 -262412 -57938 -98770 -250966 24322 62226
5754 62226 -38414 -2400 -64535 -75333 328177 111264 -207917 -136730 195988 52865 -15380
5742 -123796 -47065 71408 185513 271483 -127558 44688 287118 258823 -32401 -190477 -5376
5730 -69257 31666 245381 191187 -430372 -108873 -1855 223037 -236500 -127044 83903 135741
5719 135741 -466752 -482158 -134003 -25568 106072 -9376 118661 -131553 -165767 -317240 -251451
5708 -251451 96109 256916 14040 199179 328506 -405685 127833 483 -184427 -56730 -48644
5697 -48644 207229 -13896 -133032 35029 470917 -17737 205705 106442 -42043 -346390 -92858
5685 -129069 255596 -153363 -87825 -317677 -394490 -144969 -83071 -45437 69535 -167596 7817
5673 -77172 28397 -149006 -5939 -23602 -11064 -63424 -2520 -243860 582078 197321 224387
5662 224387 -47616 -279829 -127461 106037 207903 73444 -214019 83712 43252 -171287
5651 226848 196890 111915 204809 61284 -58750 -66636 -82469 72673 403343 47253 -16059 52177
5638 130800 -198146 198912 144161 -269552 -205482 -8934 -162080 -49702 -72812 -133076 152606
5626 70642 -94367 47719 319723 -188042 -9883 -26583 -190025 142173 -48233 279103 65214
5614 -219485 -110020 70357 168539 213266 -10114 17913 189615 -143561 -236904 52269 -201168
5602 211530 -35792 17586 309170 -57112 223164 -213361 -169801 -152685 117697 -353093 -30043
5590 -92567 -87493 -88202 -226184 -106562 70421 -161948 121293 -13862 -238737 -424815 -83961
5578 124500 17665 110479 -72758 -241894 128854 -150997 -65623 -39381 15983 -9419 -73352
5567 -73352 -199244 -93875 -138520 -19445 -115333 103015 37601 70385 67035 -171364 19988
5555 93622 156951 -1501 -211224 18665 -57566 23749 -82293 -74722 27889 35552 64591 84166
5543 84166 -84348 65659 202870 -97578 -327856 -97683 -111065 -96096 -214355 -108498 28053
5531 91254 210221 100873 -186121 -49666 -44323 -340319 100626 133122 -4411 -131023 86615
5519 5516 140336 -10590 -391240 -88253 -92911 -58939 160554 84725 -145837 -211196 -281752
5508 -281752 37935 107403 237453 352973 -65973 -288418 -75075 53284 -12650 76653 -156697
5496 36190 288641 7574 93609 -377930 -124538 120719 17758 223990 -382413 231430 -31960
5484 -125769 -37633 -145763 35296 -59683 -235999 18849 12375 -45707 128385 -374796 -87167
5472 -355667 -474693 -258252 -219817 -77727 -59835 -100675 -259710 -67823 201335 90361 -106036
5460 -33879 112396 -242803 -80579 123121 126221 41895 -96838 -199857 -116084 -195660 80180
5448 139007 480107 76744 121629 -26078 -185043 -73824 -126708 -225389 -64566 30951 -333106
5436 16549 92407 -57544 117228 -93876 -119549 60430 -5284 -141544 250578 -123912 -27680
5424 -109938 -139997 87452 -68067 -33268 -119944 -91596 -146289 -162331 -14024 430800 84537
5412 -158888 -75444 171337 38033 -45984 -117169 250562 147167 153941 270141 73514 -83370
5400 204480 -90361 -158047 224136 36312 111884 -138275 332313 -69089 207709 81396 287343
5389 287343 50558 -119510 427728 65761 -18922 -225285 192663 6678 -232206 -68754 25177
5377 -43672 177188 -136443 -214108 -20674 404747 149861 49339 -184569 -4582 336475 119104
5365 -106229 190819 -253189 -113550 -38794 -21833 -11859 -28855 77725 89084 -225923 39230
5353 126694 82480 -92202 187626 227188 -31324 -74477 -75946 8233 2607 -350943 5701 -174167
5340 220364 122176 -52944 -179278 -252601 127461 -140713 -193400 -217243 52442 119417 -243359
5328 -63466 -309520 -149563 -73373 124836 -26796 -40983 -208927 -49160 109554 -188728 65954
5316 -221943 203516 -22889 -79226 -17109 -99472 -39419 -218565 209531 -213114 -20711 -219755
5305 -219755 204715 -144302 -155000 -43022 88621 -93634 114971 114999 -45207 -219091 368927
5293 -63782 -109103 82219 109103 -19596 -194782 -18273 315871 88991 101038 -134436 -352572
5282 -352572 -99852 -93946 139216 -142076 -344876 132332 79243 -14778 -198108 300063 97492
5270 145288 -304829 23919 148818 67938 57648 32235 4919 -285724 47996 98402 -146225
5258 94181 60787 312772 28310 124477 172631 -332722 183396 212935 141230 116280 142911
5247 142911 -107295 39375 172269 -46565 79334 30809 -199577 104224 324611 -225050
5236 123571 334784 -237140 -52632 64372 185950 73553 -70229 -224029 -105948 88329 83578
5225 83578 90852 76959 134940 -222101 213521 -192291 179786 137490 -34557 8507 -108784
5213 27926 -16638 114160 -157598 -101940 2553 -3612 297997 -76298 65847 384749 138305
5201 -147869 -442 42412 -83850 -57231 -68931 157247 174862 158664 55066 95822 204793 138136
5189 138136 -17852 -151353 403479 -156954 288784 200413 -112302 103554 -79402 -7030 -219673
5178 -219673 160184 -133386 60413 378459 -193585 186260 3293 -83220 -10824 -41991 -127023
5167 -127023 58585 52805 43004 143640 119513 -145274 -187522 272016 -289767 -67996 -161437
5156 -161437 -321610 -159395 -100613 17621 -22811 63054 29204 318760 -345440 88727 130213
5145 130213 87520 -270539 316117 192852 -148809 -133580 -615324 3565 69014 364643 385127
5134 385127 -162890 119291 -106561 57407 -281703 -46976 373267 -14693 -132344 135213
5123 56961 125022 214108 205157 123774 -7523 26018 -36826 -166679 -137907 9984 -38808 109389
5110 -91138 232725 -120740 98717 -359950 -500805 -112772 -103509 -105058 27620 -170775 -16645
5098 182881 189061 -49759 -139216 33269 199232 21571 -63733 134241 12610 218426 115989
5087 115989 -59350 -211350 49963 13253 378295 109755 79657 -43557 154030 -157013 237483
5075 38991 95065 -38298 -99405 -109522 -212901 146164 -68775 188083 -180491 38472 -243402
5063 -162946 -430689 5836 171064 -235848 -75623 64615 -33581 -45688 -15482 -249873 -125890
5052 -125890 58148 112311 -45630 179345 19285 -146775 25813 121408 -421056 -63748 231687
5040 167791 188254 -77094 155468 -304989 -154259 12782 91038 364873 10742 -112469 23154
5028 -32352 -161196 2863 261111 -318816 -121816 19553 367296 24609 29597 239587 147360
5017 147360 -119166 -118217 -59213 -204647 127134 -150760 140204 58470 -169546 -71602 94488
5005 37364 -110390 10504 309705 37961 44943 31353 -233043 -535232 309357 21230 -63733
4993 -30140 123975 263691 97451 -151771 175901 -4014 43277 39107 -150515 52044 -115663
4981 212011 106835 292327 92959 280433 1227 25345 -80360 -60084 -122802 -158625 -386156
4970 -386156 -15224 -74302 57603 -24536 -132886 102811 1682 4743 260015 -106180 86091
4958 205289 268039 -79266 126458 -192810 7950 343143 -374318 -306262 -176819 201195 301764
4947 301764 -7799 -218430 -134014 -57289 242922 461181 56157 -80875 -86677 -353288 -82631
4935 123838 -81377 28976 -77918 359067 -217978 369636 -240581 101392 -121972 -42133
4924 -37885 429245 -75940 140923 -51728 -28138 97893 -160922 -34050 -73843 244129 24726
4912 53034 56440 99700 -167987 274550 261523 143079 88726 -69542 122253 -61758 -81277
4901 -81277 7582 22076 -127675 86921 89879 68749 399295 55584 4857 -5981 150595 -207055
4888 -150585 -57385 8030 -4289 80584 31123 125522 -131015 107719 -110857 -237049 384553
4876 190300 -5193 26422 15748 7123 -125450 181855 -188867 -83135 -302823 141431 136873
4865 136873 -84009 99275 -187528 117450 192826 -40336 90020 111560 163818 -58287 132296
4853 190847 -368092 -131355 -117819 -19052 -262743 123819 69904 -242233 -59365 -80070 199817
4841 -139535 334849 46320 -249338 -56353 -41675 -164083 149124 -140850 94574 -154394
4830 145384 161038 324245 -66549 -55231 67135 42706 -105658 -340907 109397 -219035 -428962
4819 -428962 49386 -234145 -236616 63643 -42522 10396 341507 -119491 48699 108113 -43621
4807 131427 -273565 -172552 -110252 206041 -56414 138182 -16090 -310686 -17587 -247055
4797 -247055 64740 -103771 -180438 50483 -219825 -182130 33858 83288 -215381 -187557 -388282
4786 -388282 -160436 -38746 -157483 -13492 134898 281954 108586 -90997 -217755 75611
4775 -51897 121604 120757 347668 144732 114688 -86364 -40082 -9894 -6320 133255 -98610 164561
4762 -28621 169525 142816 81437 103425 -208217 -167531 -3060 102343 -35168 -27823 47723 -210186
4749 4987 -134351 -63886 132070 23664 60590 102503 106110 172161 -183799 -188576 -67943 -114870
4737 -114870 -164315 -43337 297060 330440 252256 -325574 170112 -112131 -478830 66542 -73683
4725 85801 203591 -158325 -244795 -41720 11348 157724 -58698 -55947 97816 135495 48886
4713 391622 -84267 51138 44081 251483 137540 -24357 -98074 155353 313732 -207807 -128468
4702 -128468 -211468 100424 -77402 -123829 205535 236953 -132874 -168350 90507 94411 45395
4690 -295888 200840 98204 150109 -178774 56570 29700 -105608 33172 192592 191532 121898
4679 121898 -11973 -13286 -78716 99316 -54037 -105284 -293440 132483 -19913 12614 295406
4668 295406 31172 -94201 19347 531379 -72708 -187430 182318 46802 -387069 210018 -409762
4656 -179874 -168040 95099 -152466 -46498 -67345 17493 -16268 373833 -49326 132524 158279
4645 158279 471185 32457 -249693 49470 188996 99293 137982 300823 127583 -62294 -370294
4634 -370294 -108357 -140488 28435 103723 370155 -170615 37018 63143 -195363 167734 306430
4623 306430 -166065 -201942 -69231 94240 -45134 -354481 -75638 231098 -195297 231757 101009
4611 -169789 -189429 -121445 -82405 35321 169128 83858 120733 187334 -118046 85832 69358
4600 69358 -60855 -26298 -2140 -96462 113222 187911 136285 -245393 -122179 -214738 -82727
4588 9572 -91045 87267 -63509 -442778 270064 -318530 -141864 -47801 153022 -8072 -279553
4577 -279553 -92425 -181459 42496 240018 -90806 -112550 132975 -49902 -14245 79410 71174
4566 71174 245398 261363 36712 4266 -209013 232397 -327703 -117888 -76781 141715 168729
4555 168729 247948 -138144 -16513 108744 -191235 75708 79884 115952 -13232 130862 178373
4544 178373 -301292 43899 96948 291476 -39324 91699 38373 390791 51879 -34283 -266873
4533 -266873 117011 68791 290996 -209135 -148878 233694 46485 139772 43281 -73057 176539
4521 -273156 -35673 -3791 276666 -227252 64728 -82322 -280127 -39987 423601 48130 -48072
4509 -55764 70488 -446848 378880 -50745 96046 -296744 327147 960 241791 -148613 87803
4497 21129 -278083 -74315 -208843 -604599 89663 -68689 94944 -276069 -66992 -141708 -142555
4486 -142555 8826 191824 112198 -71785 -35493 -245913 -118088 33155 416686 125627 161599
4475 161599 71738 -125980 102060 -105908 76888 16588 -168529 -111910 -370057 117563
$$ [...]
##END NTUPLES=NMR SPECTRUM
##END=
