
##TITLE=AC1350_CHIRS12168_7160055_efMWbtibv7
##JCAMPDX= 6.0         $$ Bruker NMR JCAMP-DX V2.0
##DATA TYPE= NMR SPECTRUM
##DATA CLASS= NTUPLES
##ORIGIN= BRUKER
##OWNER= Administrator
$$ 1.72 TOPSPIN		Version 2.1
$$ 2013-01-30 01:55:32.425 -0500  Administrator@X
$$ Compression mode = diff/dup
##.OBSERVE FREQUENCY= 400.02188249412
##.OBSERVE NUCLEUS= ^1H
##.ACQUISITION MODE= SIMULTANEOUS (DQD)
##.ACQUISITION SCHEME= undefined
##.AVERAGES= 64
##.DIGITISER RES= 22
##SPECTROMETER/DATA SYSTEM= spect
##.PULSE SEQUENCE= noesygpps1d.comp
##.SOLVENT NAME= COFFEE_meoh
##.SHIFT REFERENCE= INTERNAL, COFFEE_meoh, 1, 14.96103
##AUDIT TRAIL= $$ (NUMBER, WHEN, WHO, WHERE, PROCESS, VERSION, WHAT)
$$ ##TITLE= Audit trail, TOPSPIN		Version 2.1
$$ ##JCAMPDX= 5.01
$$ ##ORIGIN= Bruker BioSpin GmbH
$$ ##OWNER= Administrator
$$ $$ E:\/data/COFFEE/nmr/AC1350_CHIRS12168_7160055_efMWbtibv7/22/pdata/1/auditp.txt
$$ ##AUDIT TRAIL=  $$ (NUMBER, WHEN, WHO, WHERE, PROCESS, VERSION, WHAT)
(   1,<2013-01-30 01:55:26.581 -0500>,<Administrator>,<X>,<go>,<TOPSPIN 2.1>,
      <created by zg
	started at 2013-01-30 01:43:56.800 -0500,
	POWCHK enabled, PULCHK disabled,
       configuration hash MD5:
       86 BA 57 50 F2 9D 5C 9B 26 00 A9 28 5F 66 2E 89
       data hash MD5: 64K
       BE AE 77 1E 18 D8 6A 14 78 7F 43 08 AC 11 5F A8>)
(   2,<2013-01-30 01:55:29.596 -0500>,<Administrator>,<X>,<proc1d>,<TOPSPIN 2.1>,
      <Start of raw data processing
       efp LB = 0.3 FT_mod = 6 PKNL = 1 PHC0 = 0 PHC1 = 0 SI = 128K 
       data hash MD5: 128K
       8E 17 54 05 E8 2C DD CF ED 64 F5 AB 85 BB B4 8C>)
(   3,<2013-01-30 01:55:30.628 -0500>,<Administrator>,<X>,<proc1d>,<TOPSPIN 2.1>,
      <pk PHC0 = -80.79895 PHC1 = 0 
       data hash MD5: 128K
       96 AE 61 22 E4 13 F1 3A 07 A5 3E DF 14 73 C2 2A>)
(   4,<2013-01-30 01:55:31.331 -0500>,<Administrator>,<X>,<proc1d>,<TOPSPIN 2.1>,
      <abs ABSG = 1 
       data hash MD5: 128K
       9B 90 B4 FC E0 F9 09 26 B6 2E B5 D5 A7 F2 B1 25>)
(   5,<2013-01-30 01:55:31.534 -0500>,<Administrator>,<X>,<proc1d>,<TOPSPIN 2.1>,
      <abs ABSG = 2 
       data hash MD5: 128K
       48 A1 39 C2 D7 20 66 D6 72 E7 77 91 C9 56 28 0D>)
(   6,<2013-01-30 01:55:31.706 -0500>,<Administrator>,<X>,<proc1d>,<TOPSPIN 2.1>,
      <abs ABSG = 3 
       data hash MD5: 128K
       81 AD AF 29 E5 F7 BF 1D 99 63 FA A6 D9 1B DE A7>)
(   7,<2013-01-30 01:55:31.909 -0500>,<Administrator>,<X>,<proc1d>,<TOPSPIN 2.1>,
      <abs ABSG = 4 
       data hash MD5: 128K
       39 70 55 9F A7 44 E8 E5 BA AF C0 95 0E F5 0E 8F>)
(   8,<2013-01-30 01:55:32.096 -0500>,<Administrator>,<X>,<proc1d>,<TOPSPIN 2.1>,
      <abs ABSG = 5 
       data hash MD5: 128K
       DE 88 F1 E1 02 E0 A8 90 24 F7 98 E6 89 4F 7F 47>)
$$ ##END=
$$ 
$$ $$ hash MD5
$$ $$ D1 A6 E0 01 A6 26 DC B6 EC AD ED 71 E6 C0 60 4A
##$RELAX= 
##$RELAX= 
##$RELAX= 
##$RELAX= 
##$RELAX= 
##$RELAX= 
##$RELAX= 
##$RELAX= 
$$ Bruker specific parameters
$$ --------------------------
##$DU= <E:\>
##$EXPNO= 22
$$ [...]
##$TP07= 0
##$TPNAME0= <>
##$TPNAME1= <>
##$TPNAME2= <>
##$TPNAME3= <>
##$TPNAME4= <>
##$TPNAME5= <>
##$TPNAME6= <>
##$TPNAME7= <>
##$TPOAL= (0..7)
0.5 0.5 0.5 0.5 0.5 0.5 0.5 0.5
##$TPOFFS= (0..7)
0 0 0 0 0 0 0 0
##$TUNHIN= 0
##$TUNHOUT= 0
##$TUNXOUT= 0
##$USERA1= <user>
##$USERA2= <user>
##$USERA3= <user>
##$USERA4= <user>
##$USERA5= <user>
##$V9= 5
##$VALIST= <valist>
##$VCLIST= <CCCCCCCCCCCCCCC>
##$VD= 0
##$VDLIST= <DDDDDDDDDDDDDDD>
##$VPLIST= <PPPPPPPPPPPPPPP>
##$VTLIST= <TTTTTTTTTTTTTTT>
##$WBST= 1024
##$WBSW= 4
##$XGAIN= (0..3)
0 0 0 0
##$XL= 0
##$YL= 0
##$YMAX_a= 6703329
##$YMIN_a= -13090517
##$ZGOPTNS= <>
##$ZL1= 120
##$ZL2= 120
##$ZL3= 120
##$ZL4= 120
##$ABSF1= 14.96103
##$ABSF2= -5.597152
##$ABSG= 5
##$ABSL= 3
##$ALPHA= 0
##$AQORDER= 0
##$ASSFAC= 0
##$ASSFACI= 0
##$ASSFACX= 0
##$ASSWID= 0
##$AUNMP= <proc_prof1d_extract.lims>
##$AXLEFT= 0
##$AXNAME= <>
##$AXNUC= <1H>
##$AXRIGHT= 0
##$AXTYPE= 0
##$AXUNIT= <>
##$AZFE= 0.1
##$AZFW= 0.1
##$BCFW= 0
##$BC_mod= 0
##$BYTORDP= 0
##$COROFFS= 0
##$CY= 15
##$DATMOD= 1
##$DC= 0
##$DFILT= <>
##$DTYPP= 0
##$F1P= 0
##$F2P= 0
##$FCOR= 0.5
##$FTSIZE= 131072
##$FT_mod= 6
##$GAMMA= 0
##$GB= 0
##$INTBC= 1
##$INTSCL= 1
##$ISEN= 128
##$LB= 0.3
##$LEV0= 0
##$LPBIN= 0
##$MAXI= 10000
##$MC2= 0
##$MEAN= 0
##$ME_mod= 0
##$MI= 0
##$NCOEF= 0
##$NC_proc= -2
##$NLEV= 6
##$NOISF1= 0
##$NOISF2= 0
##$NSP= 0
##$NTH_PI= 0
##$NZP= 0
##$OFFSET= 14.96103
##$PC= 1
##$PHC0= -80.79895
##$PHC1= 0
##$PH_mod= 1
##$PKNL= yes
##$PPARMOD= 0
##$PPDIAG= 0
##$PPIPTYP= 0
##$PPMPNUM= 2147483647
##$PPRESOL= 1
##$PSCAL= 4
##$PSIGN= 0
##$PYNMP= <proc.py>
##$REVERSE= no
##$SF= 400.020009623989
##$SI= 131072
##$SIGF1= 0
##$SIGF2= 0
##$SINO= 400
##$SIOLD= 131072
##$SPECTYP= <>
##$SREGLST= <1H.CDCl3>
##$SSB= 0
##$STSI= 131072
##$STSR= 0
##$SW_p= 8223.68421052631
##$SYMM= 0
##$S_DEV= 0
##$TDeff= 65536
##$TDoff= 0
##$TI= <>
##$TILT= no
##$TM1= 0
##$TM2= 0
##$TOPLEV= 0
##$USERP1= <user>
##$USERP2= <user>
##$USERP3= <user>
##$USERP4= <user>
##$USERP5= <user>
##$WDW= 1
##$XDIM= 131072
##$YMAX_p= 431010496
##$YMIN_p= -53511
##$CURPLOT= <Network HP LaserJet P1505>
##$CURPRIN= <$Network HP LaserJet P1505>
##$DFORMAT= <normdp>
##$LAYOUT= <+/1D_H.xwp>
##$LFORMAT= <normlp>
##$PFORMAT= <normpl>
##$SURQMSG= 1
$$ End of Bruker specific parameters
$$ ---------------------------------
##NTUPLES= NMR SPECTRUM
##VAR_NAME=  FREQUENCY,     SPECTRUM/REAL,   SPECTRUM/IMAG
##SYMBOL=    X,             R,               I
##VAR_TYPE=  INDEPENDENT,   DEPENDENT,       DEPENDENT
##VAR_FORM=  AFFN,          ASDF,            ASDF
##VAR_DIM=   131072,        131072,          131072
##UNITS=     HZ,            ARBITRARY UNITS, ARBITRARY UNITS
##FACTOR=    0.0627417313425164, 1,          1
##FIRST=     8223.62146879497, -78,          -65349
##LAST=      0,             1278,            -66087
##MIN=       0,             -53511,          0
##MAX=       8223.62146879497, 431010496,    0
$$ Real data points
##PAGE= N=1
##DATA TABLE= (X++(R..R)), XYDATA
$$ [...]
65180 127499 127588 127716 127995 127895 127126 126323 126274 126829 127261 127420 127687 127903 127329 125891 124579 124193 124349 124237 123819
65161 123819 123744 124442 125758 127238 128429 129121 129620 130445 131535 132118 131771 131167 131310 132323 133578 134794 136388
65144 136388 138779 141923 145608 149762 154349 159309 164666 170346 175834 180432 184021 187226 190589 193893
65130 193893 196620 198842 201240 204236 207444 210135 212082 213788 215960 218857 222067 224698 225853 225128
65116 225128 222827 219646 216105 212330 208365 204375 200381 195974 190604 184197 177318 170782 165262 161108
65102 161108 158209 155987 153778 151352 148873 146369 143547 140306 137206 135111 134379 134544 134860 135027 135307
65087 135307 135939 136640 136889 136613 136236 136021 135715 135070 134343 133913 133736 133612 133731 134432 135549 136607 137585 138894
65069 138894 140571 142171 143598 145312 147366 148876 148994 147978 146753 145693 144487 143100 142258 142719 144329
65054 144329 146025 146737 146255 145233 144358 143678 142839 141850 141159 140975 140914 140520 139759 138789 137609 136338 135522 135649
65036 135649 136410 136863 136431 135440 134589 134127 133760 133165 132338 131351 129971 127861 125184 122724 121139 120309 119721
65019 119721 119307 119460 120269 121263 122070 122892 124088 125675 127514 129690 132346 135230 137730 139402 140387 141349
65003 141349 142955 145292 147773 149775 151320 152869 154537 155904 156622 156827 156838 156777 156662 156547 156427 156319 156557
64986 156557 157727 160100 163389 167137 171079 175043 178826 182225 184955 186569 186834 186082 184701 182383 178638
64971 178638 174007 169891 166905 164363 161699 159383 157786 156130 153590 150731 148763 147828 147100 146311 146018
64956 146018 146381 146688 146310 145422 144588 144216 144469 145161 145659 145353 144261 142759 140949 138877 137114 136330 136265
64939 136265 135937 134956 133899 133321 133204 133533 134564 136136 137416 137850 137772 137683 137460 136773 135810 135013 134409 133743
64921 133743 133091 132892 133461 134778 136614 138574 140161 141107 141540 141642 141249 140059 138188 136327 135337 135705
64905 135705 137270 139407 141596 143866 146651 150269 154660 159475 164195 168311 171741 175028 178785 183053
64891 183053 187602 192705 199008 206599 214801 223035 231249 239267 246322 251655 255080 256609 256013 253181
64877 253181 248534 242590 235512 227565 219672 212910 207608 203419 200095 197726 196332 195693 195520 195437 194977
64862 194977 193966 192706 191331 189202 185555 180619 175519 171045 167137 163559 160404 157723 155270 152944
64848 152944 150997 149538 148257 146937 145788 144964 144225 143549 143587 144837 146639 147679 147473 146702 146040 145338
64832 145338 144211 142879 141913 141495 141359 141314 141457 141963 142993 144728 147185 149983 152583 154715 156339 157306
64816 157306 157523 157558 158541 161120 164744 168324 171396 174292 177388 180720 184336 188453 192960 197147 200251
64801 200251 202112 202943 202585 200449 196336 191060 186003 182086 179302 177121 175159 173362 171784 170456 169540
64786 169540 169368 170120 171526 173019 174234 175240 176276 177376 178335 178925 179063 178841 178484 178276 178391 178818 179515
64769 179515 180615 182402 185029 188344 192040 195920 199943 204077 208229 212285 216148 219746 223148 226709
64755 226709 230985 236364 242725 249462 255831 261396 266318 271150 276149 280723 283768 284550 283055 279484
64741 279484 273891 266538 258202 249717 241400 233319 225833 219405 214092 209678 206198 203792 202243 201276
64727 201276 201139 202098 203389 203704 203007 202877 204535 207361 210101 212716 216101 220486 225270 230275 236035
64712 236035 242661 249244 254718 258777 261640 263365 263649 261995 257945 251479 243354 234769 226598 219074
64698 219074 212170 205917 200304 195253 190772 186887 183401 180075 177071 174868 173609 172832 171984 170987 170219
64683 170219 170119 170887 172344 174054 175698 177335 179138 181060 183029 185357 188569 192841 197860 203154 208214
64668 208214 212475 215593 217694 218921 218938 217385 214703 211766 208713 204993 200710 197051 194923 193925 193196
64653 193196 192661 192707 193200 193646 194122 195235 197191 199550 201890 204116 206021 207216 207791 208621 210621 213843
64637 213843 217599 221400 225494 230433 236280 242456 248409 254175 260027 265608 269830 271850 271847 270600 268465
64622 268465 265161 260425 254527 248026 241322 234600 228027 221827 216168 211134 206884 203763 202089 201730
64608 201730 201975 202040 201703 201323 201194 201146 200800 200025 198915 197523 195880 194245 193045 192515 192532 192928 193853 195720
64590 195720 198744 202669 206998 211449 216134 221324 227241 234062 241992 251179 261589 272999 285064
64577 285064 297420 309801 321958 333286 342741 349554 354052 357240 359420 359735 357323 352366 345577
64564 345577 337229 327291 316133 304406 292479 280655 269668 260147 251774 243762 236152 229824 225224
64551 225224 221904 219375 217550 216162 214709 213342 212986 214048 215705 216964 217850 218996 220653 222654 224850
64536 224850 226961 228365 228556 227555 225510 222348 218256 214008 210250 206837 203385 200075 197337 195147
64522 195147 193287 191978 191597 191955 192504 193050 193683 194183 194179 193772 193420 193245 193001 192621 192301 192109 192062 192480 193735
64503 193735 195799 198552 202330 207431 213142 218131 221971 225549 229680 233939 237246 239080 239691 239451 238478
64488 238478 236830 234808 232991 231981 232016 232939 234706 237668 241970 246835 250964 253661 255089 255497 254740
64473 254740 252723 249712 245982 241663 237210 233558 231379 230450 230078 229964 230325 231392 233113 235334 237953
64458 237953 240842 243661 245821 246726 246225 244802 243077 241135 238595 235396 232240 230067 229261 229445 229908
64443 229908 230192 230478 231490 233874 237574 241890 246128 250058 253885 258154 263679 271144 280547 291287
64429 291287 302947 315852 330772 348385 369199 393704 422337 455376 493130 536246 585840
64418 585840 643379 710211 786702 871441 961319 1052537 1141598 1225746 1303200 1373333 1436257
64407 1436257 1491641 1537902 1572666 1593843 1600133 1591013 1567110 1530721 1485158 1432754 1373324 1304863
64395 1304863 1225963 1137794 1044134 949850 859193 774941 698545 630772 572054 522197 480062
64384 480062 444061 413161 387147 365740 347882 332383 318968 308068 299674 293044 287606 283452
64372 283452 280651 278701 277039 275493 273782 271104 266911 261713 256389 251000 245040 238748 233290 229503
64358 229503 227092 225280 223625 221952 220016 217644 215003 212473 210489 209567 210114 211936 214155 215825 216556
64343 216556 216508 216031 215366 214421 212755 210070 206778 203790 201579 199732 197611 195196 193134 192109 192334 193481
64327 193481 194970 196434 197956 199788 201893 203959 205795 207480 209181 211163 213831 217381 221336 224865
64313 224865 227589 229698 231239 231810 231101 229272 226575 223096 219067 214977 210979 206642 201731 196843 192788
64298 192788 189581 186574 183435 180490 178089 176085 174053 171809 169675 168288 168007 168387 168487 167913 167292
64283 167292 167431 168383 169751 171570 174189 177406 180510 183374 186790 191364 196565 201373 205438 209077 212396
64268 212396 215144 217376 219537 221568 222500 221495 219077 216838 215923 216241 217111 218171 219400 220673 221709
64253 221709 222307 222296 221344 219139 215764 211712 207574 203859 200978 199030 197619 196173 194552 193179 192524
64238 192524 192661 193327 194229 195229 196393 197913 199849 202005 204239 206847 210338 214744 219430 223696 227436
64223 227436 231119 235262 240064 245437 251297 257751 264949 272753 280690 288341 295603 302528 309180 315803
64209 315803 322708 329634 335561 339664 342162 343648 343849 341862 337544 331795 325311 317870 309240 300032
64195 300032 291140 282888 275205 268188 261965 256447 251784 248735 247966 249185 251512 254461 257977 261655
64181 261655 264656 266496 267351 267372 266151 263150 258393 252473 246029 239422 232852 226616 221141 216731 213245
64166 213245 210114 206757 202971 198959 195053 191478 188292 185459 183027 181151 179876 179016 178440 178364 179010
64151 179010 180065 180929 181588 182768 185016 188027 191158 194196 197256 200219 202733 204616 205900 206536 206386
64136 206386 205466 203970 202127 200156 198223 196242 193973 191518 189485 188363 187874 187325 186470 185754 185760 186727
64120 186727 188498 190660 192757 194594 196383 198464 200981 203946 207402 211282 215318 219332 223478 227876
64106 227876 232198 235943 239028 241716 244020 245578 246173 246101 245949 246251 247355 249351 251969 254650 256803
64091 256803 257939 257658 255738 252326 247958 243311 238895 234842 230882 226586 221752 216525 211242 206375
64077 206375 202549 200251 199325 198986 198568 198030 197645 197554 197911 199098 201371 204348 207159 209005 209483 208668 207218
64060 207218 206110 205890 206307 206955 207962 209605 211502 212776 213001 212583 212171 212109 212455 213138 214005 214961 216099
64043 216099 217535 219209 221034 223075 225359 227709 230083 232767 235815 238574 240328 241212 241905 242562 242723
64028 242723 242230 241545 241131 241176 242037 244187 247478 251120 254694 258540 262694 266092 267450 266607 264497 262109
64012 262109 259977 258355 257234 256229 254927 253375 251890 250506 249026 247591 246682 246463 246490 246288 245950 245945
63996 245945 246576 247849 249776 252413 255578 258752 261484 263793 266021 268393 270924 273737 277161 281403
63982 281403 286339 291745 297483 303316 308910 314326 320235 327164 334707 341974 348777 355895 364105 373439
63968 373439 383561 394362 405893 418074 430835 444387 459059 474967 492043 510321 530095
63957 530095 551877 576258 603646 634056 667429 704336 746195 794671 851042 916220 991172
63946 991172 1077054 1175141 1286817 1413413 1555678 1713352 1885405 2070598 2267633 2474891
63936 2474891 2690422 2912088 3137189 3361626 3579735 3785370 3973158 4138582 4277253
63927 4277253 4385002 4459102 4499007 4505376 4478492 4417957 4323834 4197677 4042657 3863318 3665267
63916 3665267 3454412 3235927 3014019 2792561 2575287 2365126 2163996 1973771 1796894
63907 1796894 1635375 1489550 1358578 1241960 1139861 1051983 976867 912453 856859 808587
63897 808587 766589 730323 699369 672863 649647 628885 610122 592816 576442 561085 547325
63886 547325 535415 525085 516215 509008 503296 498396 494018 490721 489129 489237 490894 494307 499488 505785
63872 505785 512718 521046 532272 547194 565448 586364 609682 635416 663607 694407 728041 764400
63860 764400 802750 841855 880414 917577 953230 987701 1021042 1052745 1082215 1109189 1133412
63849 1133412 1154224 1170854 1182969 1190544 1193302 1190747 1182782 1169936 1152863 1131820 1106717 1077588
63837 1077588 1044990 1009981 973587 936192 897591 857748 817321 777290 738300 700642 664666
63826 664666 630890 599710 571182 544928 520169 496097 472612 450538 430811 413570 398313
63815 398313 384644 372413 361291 350866 341236 332966 326248 320512 315103 309907 305004 300063 294621
63802 294621 288839 283431 278764 274385 269750 265080 261039 257630 253989 249607 245266 242114 239988 237496
63788 237496 233937 230329 227956 226525 224631 221813 219178 217888 217809 218012 217961 217656 217038 215923 214478 213234
63772 213234 212523 212183 211888 211478 210866 209863 208372 206714 205523 205229 205699 206413 206903 206929 206400 205396 204307
63755 204307 203671 203706 204106 204449 204699 205145 205946 206981 208097 209246 210396 211522 212796 214531 216769 219084
63739 219084 221010 222661 224736 227874 232045 236575 240705 244119 247071 250121 253755 258190 263519 269949
63725 269949 277706 286608 295934 305059 314269 324546 336318 348616 359819 369078 376636 382832 387319
63712 387319 389435 388900 385736 379844 371232 360742 350058 340638 332732 325639 318869 312760 307932 304487
63698 304487 302042 300423 299845 300328 301386 302556 303892 305530 307061 307929 308295 308904 310008 311060 311681 312307
63682 312307 313408 314576 314973 314497 313991 314380 316017 318824 322588 327048 332058 337795 344534 352137 360036
63667 360036 367917 376161 385319 395187 404654 412526 418329 422118 423650 422150 417121 409089 399168 388037
63653 388037 375825 362972 350590 339597 329926 321010 312806 305880 300593 296709 293831 291806 290586
63640 290586 289984 289779 289932 290534 291566 292795 293995 295284 297187 300121 303812 307490 310808 314335 318926
63625 318926 324889 331997 340035 348859 358135 367611 377740 389566 403780 420171 438138 457334 477611
63612 477611 498729 520614 543799 569249 597653 629002 662706 697746 732593 765318 794112
63601 794112 817766 835599 847070 851782 849995 843002 832822 821449 810253 799855 790309 781355
63589 781355 772551 763201 752262 738661 721971 702722 681889 660218 638302 617131 597978 581571
63577 581571 567684 555760 545641 537484 531330 527113 524923 524847 526551 529322 532633 536483 541074 546372
63563 546372 552087 558039 564309 570959 577786 584638 591969 600650 610997 622397 634311 647387 662981
63550 662981 681773 703609 728713 758145 792714 832185 875926 923265 972053 1017324 1052764
63539 1052764 1074199 1081520 1077598 1066112 1050467 1033709 1018472 1006702 999329 995982 995121 994918 994180
63526 994180 992132 987359 977635 961272 938398 910593 879476 846001 810934 775397 740676 707716
63514 707716 677002 648814 623372 600773 580981 563960 549588 537340 526247 515503 505128
63503 505128 495807 488034 481649 476219 471539 467544 463988 460507 456987 453659 450848 448707 447157 445990
63489 445990 445026 444165 443302 442379 441673 441854 443456 446476 450787 456716 464589 473806 483164 492220 501574 511448
63473 511448 520809 528396 533894 537401 538428 536423 531877 525779 518024 507437 493599 477857 462129
63460 462129 447319 433293 419941 407730 397354 389164 382977 378347 374997 372895 371938 371878 372770 375142
63446 375142 379258 384425 389506 394071 398683 404187 411167 419963 430702 443315 457919 475222 496259
63433 496259 521804 552143 586744 623330 657645 685343 704559 716222 722119 723610 722371 721172
63421 721172 723040 729948 742683 761462 786190 816493 851887 891523 933418 974392 1011247 1041832
63409 1041832 1064768 1078838 1083476 1079716 1069982 1056795 1041908 1026529 1011741 998337 986282 974450
63397 974450 960983 944174 923259 898537 870826 840947 809660 777857 746693 717550 691615
63386 691615 669194 649560 631844 616072 602890 592396 583845 576726 571568 569279 569999 572892 576805
63373 576805 580879 584837 589080 594429 601534 610516 621165 633308 646938 662193 679217 697870 717664
63360 717664 738347 760545 785429 813693 845190 879407 915720 953046 989805 1024423 1055487
63349 1055487 1081355 1100246 1111041 1113702 1108942 1098120 1083543 1067986 1053276 1039650 1026696 1014190
63337 1014190 1001614 987523 970182 948682 923135 894257 863241 831593 800533 770700 742601
63326 742601 716861 693773 673267 655689 641919 632230 625948 622915 624212 630007 637084 639995 634920
63313 634920 621813 603179 582017 560904 541568 524490 509339 496017 484804 475477 467102 458951
63301 458951 450973 443217 435501 427878 420749 414148 407559 400776 394353 388805 383912 379167 374434 369744
63287 369744 364966 360153 355794 352203 348993 345656 342335 339439 336747 333591 329948 326748 324881 324306
63273 324306 324301 324290 324097 323599 322538 320820 318763 316792 314886 312617 309797 306809 304132 301828 299806 298311
63257 298311 297645 297495 297108 296231 295429 295310 295796 296316 296423 296034 295397 295024 295389 296446 297607 298313 298414 297983
63239 297983 297161 296382 296361 297432 299117 300630 301712 302695 303953 305634 307790 310385 313099 315429 317132
63224 317132 318500 320161 322658 326152 330352 334663 338514 341674 344398 347298 350942 355328 359692 363023
63210 363023 364909 365836 366644 367813 369259 370572 371326 371331 370759 369956 369069 367951 366518 365056 364066 363916 364752
63193 364752 366615 369488 373188 377314 381366 385052 388585 392630 397795 404204 411684 420184 429644 439553
63179 439553 449191 458522 468350 479183 490308 500423 509090 517058 525276 534035 543057 551908 560049
63166 560049 566856 571949 575491 577961 579666 580475 579866 577109 571548 563000 551946 539308 525921 512175
63152 512175 498096 483732 469483 456091 444310 434456 426132 418399 410430 402340 395314 390594 388128
63139 388128 386494 384377 381878 380058 379484 379830 380809 382678 385429 388133 389828 390870 392662 395955 399974
63124 399974 403459 406211 409248 413669 419611 426217 432408 437667 442194 446360 450195 453614 456988 460978
63110 460978 465686 470416 474565 478379 482470 486933 491454 495955 500539 504936 508730 512245 516525 522150
63096 522150 528572 534939 541125 547535 554257 560980 567585 574344 581453 588656 595333 600757 604296 605598
63082 605598 604645 601557 596438 589545 581465 572829 563851 554336 544223 533936 524157 515378 507712 501007
63068 501007 495025 489566 484500 479769 475381 471450 468257 466224 465687 466562 468314 470488 473264 477196 482301
63053 482301 487810 493172 498987 506394 515687 526087 536823 547785 559002 570185 581135 592055
63041 592055 603016 613507 622965 631457 639462 647353 655469 664227 673569 682504 689881 695585 700400 704702
63027 704702 707867 709057 708087 705296 700959 695142 687894 679309 669493 658603 646925 634899 623118
63014 623118 612271 602892 595135 588804 583563 579112 575344 572486 570988 571176 573105 576806 582465 590189
63000 590189 599839 611196 624097 638207 653011 668303 684325 701025 717427 732331 745613 758444
62988 758444 772211 787461 803743 820043 835339 849060 861105 871353 879365 884784 887652 887886
62976 887886 884686 877058 864927 849247 831000 810615 788390 764990 741303 718083 695836 674814
62964 674814 655029 636480 619304 603456 588444 573764 559558 546403 534529 523643 513453
62953 513453 503899 494859 486042 477208 468182 458836 449463 440918 433747 427302 420474 413154 406111 399492
62939 399492 392602 385432 379228 374864 371540 367933 363931 360355 357509 355022 352868 351502 350930 350423 349328
62924 349328 347611 345512 343258 341333 340511 341127 342420 342957 341923 339965 338581 338553 339143 339052 338008 336889
62908 336889 336431 336504 336877 337910 339922 342476 344973 347658 351290 356012 361196 366408 371924 378212 385385
62893 385385 393254 401544 409975 418348 426575 434352 440963 445798 449034 451426 453448 455016 455957 456244 455679
62878 455679 453850 450556 445889 439824 432244 423604 415072 407552 400900 394467 388067 381889 375791 369392
62864 369392 362881 356951 351716 346361 340422 334887 331308 329941 329478 328659 327448 326359 325371 324102 322592
62849 322592 321166 319717 317850 315744 314210 313768 314192 315141 316642 318603 320332 321046 320640 319625 318489
62834 318489 317468 316739 316505 316900 317958 319537 321127 322036 322047 321695 321605 321784 321839 321673 321490 321241 320587 319490
62816 319490 318474 318115 318503 319301 320141 320886 321621 322492 323444 324146 324338 324238 324426 325235 326399 327357 327823 327988
62798 327988 328244 328818 329654 330596 331587 332646 333703 334600 335290 335946 336816 338117 340056 342792 346292 350366
62782 350366 354996 360496 367186 374978 383451 392350 401865 412331 423677 435244 446219 456284 465718
62769 465718 474837 483486 491189 497615 502693 506443 508980 510531 511081 510110 507084 502163 495954 488645 479905
62754 479905 469713 458684 447378 435920 424602 414249 405408 397577 389809 381855 374215 367278 360899
62741 360899 354709 348436 342018 335805 330547 326752 324083 321761 319558 318042 317761 318463 319217 319208 318434 317691
62725 317691 317789 318774 320102 321513 323253 325309 327046 328080 329041 330928 334030 338059 342918 348584 354442
62710 354442 359713 364682 370700 378651 388051 397974 408335 419848 433126 448236 464882 482646 501210
62697 501210 520678 541581 564381 589062 615336 643038 672082 702106 732348 761891 789926
62686 789926 815837 839057 858820 874065 883750 887290 884598 875770 860959 840649 815852 787907
62674 787907 758099 727458 696704 666264 636421 607574 580328 555296 532770 512563 494141
62663 494141 477010 461060 446509 433474 421712 410851 400784 391716 383891 377374 371972 367315
62651 367315 363093 359262 355838 352549 349056 345628 343138 341983 341395 340322 338738 337542 337283 337614 338026
62636 338026 338479 339092 339667 339856 339546 338862 337968 337007 336026 334859 333313 331638 330558 330571 331287 331678 330986 329361
62618 329361 327646 326647 326581 327107 327752 328198 328257 327857 327173 326542 326076 325499 324548 323350 322222 321259 320342 319438
62600 319438 318698 318410 318998 320813 323634 326631 329145 331365 333973 337405 341777 347130 353160 358948 363693
62585 363693 367671 371870 376635 381287 385033 387595 388835 388564 387046 385088 383192 381088 378391 375229
62571 375229 371833 367962 363296 358081 352939 348181 343752 339644 335948 332594 329404 326423 323956 322296
62557 322296 321517 321416 321518 321309 320644 319745 318710 317309 315517 313888 313020 312832 312811 312886 313600 315372 317955
62540 317955 320693 323088 324992 326530 327961 329481 331029 332368 333376 334187 335026 336072 337516 339596 342393
62525 342393 345656 349019 352433 356251 360815 366087 371861 378256 385751 394639 404691 415514 427109
62512 427109 439835 453884 469022 484860 501145 517741 534487 551259 568096 585084 601892
62501 601892 617398 630013 638706 643706 645956 645953 643547 638916 633097 627132 621202 615203 609838 606411
62487 606411 605637 607321 611237 617640 626708 638105 651444 666706 683759 701696 718970 734060 745842
62474 745842 753585 757014 756476 752810 746745 738214 726206 709566 688211 663428 636808 609194 581007
62461 581007 553190 527074 503296 481531 461477 443545 428339 415929 405860 397454 389872 382411
62449 382411 375152 368987 364653 361975 360273 359132 358429 357916 357325 356766 356611 356964 357492 357831 357952 358178 358896
62432 358896 360145 361414 361913 361194 359484 357513 356089 355649 355861 355716 354390 352083 349727 347923 346624
62417 346624 345742 345403 345391 345048 344147 343343 343240 343388 342800 341281 339784 339453 340604 342487 343803 343625 342205
62400 342205 340867 340913 342693 345720 349354 353174 357053 361195 365924 371145 376276 380987 385716 391136 397386
62385 397386 404208 411586 419804 428977 438939 449487 460366 471071 481040 490149 498845 507817 517615
62372 517615 528460 540204 552586 565569 579259 593479 607910 622852 639442 658799 681387
62361 681387 707527 737964 773220 812853 856223 903849 957068 1016180 1079651 1145345 1211764
62350 1211764 1277579 1340467 1397129 1444447 1480449 1504477 1517023 1519524 1513857 1501543 1483226 1458877
62338 1458877 1428520 1392732 1352535 1308994 1263134 1216118 1169217 1123457 1079425 1037428 997657
62327 997657 960151 924864 891807 860891 831649 803487 776291 750426 725991 702521 679626
62316 679626 657432 636122 615578 595927 578007 562664 549790 538506 528045 518038 508311 499072
62304 499072 491043 484759 479855 475682 472428 470858 470961 471726 472485 473686 475972 479116 482381 485514 488908
62289 488908 492999 497851 503125 508216 512636 516509 520448 524664 528458 530995 532452 533993 536498 539667
62275 539667 542533 544704 546845 549946 554383 559972 566811 575603 586982 600880 616941 635339 656694
62262 656694 681313 709015 739878 774622 813973 857953 906237 959028 1017089 1080756 1149101
62251 1149101 1220085 1291148 1359363 1421344 1473775 1514429 1542432 1557435 1559084 1547914 1526262
62240 1526262 1497243 1462548 1421905 1374845 1322201 1265628 1206579 1146470 1087095 1029889 975124
62229 975124 922678 873371 828639 789031 753837 722264 694184 669663 648488 630387 615054
62218 615054 601755 589465 577642 566366 555661 545321 535607 527331 520797 515300 510217 506078 503871
62205 503871 503562 503960 504025 503783 503972 505237 507852 511936 517706 525448 535236 546747 559515 573440 588860
62190 588860 606067 624951 645196 666584 688951 712094 735989 760944 787177 814187 840689
62179 840689 865278 887153 906282 922899 936901 947860 955718 961415 966622 972846 980955 991584
62167 991584 1005670 1024333 1048224 1077160 1110420 1147330 1187403 1229748 1272366 1312299 1346661
62156 1346661 1373501 1391778 1400973 1401192 1393394 1379081 1359589 1335730 1307845 1275840 1239377 1198552
62144 1198552 1154429 1108616 1062345 1016415 971961 930632 893627 860863 831379 804392 779818
62133 779818 758054 739497 724177 711521 700456 689987 679861 670748 663616 658731 655290 652276
62121 652276 649655 648371 649136 651772 656030 662347 671231 682355 695111 709783 727250 747394 768458
62108 768458 787964 803689 813936 818067 817244 814004 810536 807637 805294 803328 801027 796919 789754 779506
62094 779506 767059 753395 739620 727314 718062 712643 711043 713072 718537 727082 738454 752907 770944
62081 770944 792625 817369 844336 872712 901786 931197 961121 991979 1023910 1056706 1090035
62070 1090035 1123394 1155872 1186321 1213948 1238770 1261624 1283814 1306526 1330239 1354667 1379237
62059 1379237 1403454 1426652 1447681 1465072 1477398 1483404 1482217 1473927 1459846 1441758 1420790 1397054
62047 1397054 1370097 1339305 1304058 1264161 1220411 1174553 1128425 1083195 1039355 997133 956800
62036 956800 918770 883683 852291 825044 801769 781921 765193 751733 741694 734715 730078 727246
62024 727246 725985 725959 726606 727479 728294 728296 726051 720391 711468 700446 688317 675509 662478 649982 638611
62009 638611 628581 620168 613888 610056 608648 609827 614165 622054 633219 647080 663237 681229 700018
61996 700018 718013 733517 745122 752056 754441 753019 748459 741081 731252 719506 706050 690540 672730
61983 672730 653079 632457 611599 591147 571903 554567 539339 526067 514632 504958 496844 490081
61971 490081 484540 479944 475788 471846 468567 466640 466223 466803 467701 468551 469495 471095 473947 478217 483738
61956 483738 490526 498810 508450 518876 529930 542346 557035 574217 593652 615330 639517 666403
61944 666403 696256 729763 767833 811139 860136 915186 976249 1042591 1113099 1186683 1262111
61933 1262111 1337914 1412916 1486572 1558334 1627062 1691559 1751282 1805762 1853576 1892630 1921399
61922 1921399 1939250 1945738 1940570 1924513 1899693 1868696 1833812 1797341 1762105 1731290 1707883 1694155
61910 1694155 1691346 1699677 1718851 1748345 1786938 1832322 1881764 1932944 1983409 2029384 2066196 2090384
61898 2090384 2100827 2097640 2080777 2050372 2007854 1955885 1897169 1833707 1767052 1698845 1630944
61887 1630944 1565103 1502479 1443420 1387890 1336042 1288210 1244357 1203938 1166341 1131154 1097914
61876 1097914 1066099 1035554 1006639 979844 955680 935096 919342 908841 902475 898521 896193 895963
61864 895963 898634 904654 914295 927922 945874 968372 995754 1028638 1067772 1113862 1167610 1229699
61852 1229699 1300618 1380574 1469608 1567600 1673919 1787115 1905138 2025789 2146767 2265225
61842 2265225 2377656 2480488 2570683 2645493 2701877 2736872 2748949 2738973 2709841 2665594 2611024
61831 2611024 2551555 2492748 2439672 2396794 2367973 2355902 2361306 2382883 2417925 2462728 2512625
61820 2512625 2562314 2606527 2640386 2659337 2659401 2637944 2594277 2529519 2446119 2347448 2237412 2120077
61808 2120077 1999449 1879269 1762527 1651068 1545934 1448078 1358438 1277339 1204282 1138525
61798 1138525 1079571 1026960 979964 937813 900071 866591 837250 811756 789515 769616 751279
61787 751279 734377 719136 705239 691814 678624 666688 657057 649365 642302 635351 629157 624136 619591
61774 619591 614693 609630 605162 601379 597595 593358 588952 584868 581284 578186 575543 573176 570858 568806
61760 568806 567708 567942 568964 569810 570018 569747 569193 568285 566926 565181 563211 561207 559298 557283 554707 551582
61744 551582 548784 547158 546384 545421 544026 543030 542921 543068 542755 542265 542297 542933 543801 544889 546491 548639 551191
61727 551191 554260 558014 562318 567136 572913 579851 587100 593556 599341 605557 612519 619171 624562 629040
61713 629040 633420 637544 640276 640638 638419 633839 627080 618235 607510 595396 582643 570012 558067
61700 558067 547223 537730 529387 521506 513585 505922 499141 493225 487567 482003 477208 473847 471779 470386
61686 470386 469298 468455 467725 466833 465661 464399 463399 462871 462664 462464 462309 462701 463875 465141 465445 464575 463393
61669 463393 462783 462774 462801 462389 461408 460045 458753 458001 457851 457980 458197 458785 460189 462520 465343 467922 469868
61652 469868 471769 474903 479932 486172 492628 499434 507581 517438 528444 540197 552889 566428 580082
61639 580082 593310 606027 617553 626193 630550 630671 627284 620667 611075 599689 588061 576844 565899
61626 565899 555476 546398 539086 533169 528181 524052 520864 518725 517986 519014 521552 524715 527736 530328
61612 530328 532176 532547 530687 526311 519509 510378 499019 485825 471590 457295 443650 430729 418151
61599 418151 405867 394680 385653 378913 373338 367618 361477 355742 351268 348046 345376 342733 340179 337865
61585 337865 335496 332667 329629 327196 325812 325066 324303 323255 321815 319694 316833 313893 311755 310599 309895
61570 309895 309202 308551 308049 307610 307186 306890 306746 306607 306464 306513 306774 306900 306600 306017 305468 304937 304171 303241 302739
61551 302739 303285 304914 307040 308952 310293 311183 312076 313509 315767 318603 321428 323898 326252 328947 332051
61536 332051 335221 338235 341328 345014 349689 355350 361478 367271 372208 376277 379427 380947 379841 375883
61522 375883 369937 363192 356410 349909 343819 338145 332931 328502 325227 322954 321065 319213 317621 316501
61508 316501 315668 314897 314202 313482 312405 311022 310033 309998 310592 311008 310778 309821 308186 306265 304918 304705 305175
61491 305175 305405 305125 304834 304988 305598 306494 307443 308102 308343 308552 309150 309934 310423 310738 311522 312946 314371 315138
61473 315138 315218 314961 314659 314512 314647 314978 315314 315641 316045 316470 316896 317687 319161 320832 321708 321511 321007 320874
61455 320874 320814 320212 319191 318468 318453 318993 319875 321078 322607 324534 327234 331161 336187 341421 345959 349755
61439 349755 353594 358288 364106 371054 379328 389117 399996 410938 421115 430351 438675 445873 451880
61426 451880 457267 462827 468819 475101 481761 489028 496656 504125 511499 519351 527564 534899 540149 543157
61412 543157 544230 543098 539208 532744 524672 515790 506342 496541 486903 477822 469149 460399 451183 441482
61398 441482 431810 423139 416321 411408 407773 404951 403013 401964 401264 400406 399760 400279 402262 404826 406745
61383 406745 407550 407616 407528 407708 408486 410054 412212 414490 416700 419187 422331 425952 429505 432832 436404 440603
61367 440603 444905 448156 449787 450622 452199 455333 459551 463996 468532 473706 479905 487037 495046 504252
61353 504252 515030 527435 541360 556761 573550 591613 611216 633068 657464 683450 709273
61342 709273 733708 756592 778085 798013 816190 832913 848468 862194 872593 878570 880210 878075
61330 878075 872160 862056 848018 831249 813020 794051 775036 757188 741582 728206 716268 705322
61318 705322 695480 686596 678086 669788 662288 655987 650363 644648 638835 633506 629039 625536 623291 622726
61304 622726 623944 626824 631439 637837 645367 652699 658613 662375 663412 661241 656041 648920 641232 633705
61290 633705 626398 619277 612597 606847 602527 599918 598843 598718 598965 599499 600768 603363 607636 613640 621267
61275 621267 630269 640211 650629 661397 672804 685093 697988 710860 723339 735548 747796 760328
61263 760328 773396 787318 802449 819421 839445 863873 893145 926410 962321 999826 1037861
61252 1037861 1074669 1107970 1135755 1156596 1169438 1173626 1169224 1156983 1137921 1113125 1083894 1051722
61240 1051722 1018019 983917 950323 917979 887485 859336 833894 811253 791242 773607 758081
61229 758081 744322 732117 721667 713300 706721 701028 695751 691401 688542 686708 684799 682265 679314
61216 679314 676174 672878 669795 667688 667013 667491 668491 669508 670264 670723 671051 671259 670938 669747 668212 667607
61200 667607 668941 672380 677674 684766 693884 705410 719770 737126 757059 778871 802232 827159
61188 827159 853141 878648 901791 921413 937526 950970 962753 973488 983245 991999 1000086 1007914
61176 1007914 1015366 1021927 1027541 1032859 1038378 1043668 1047756 1050060 1050621 1049576 1046683 1041343 1032848 1020599
61162 1020599 1004261 983872 959908 933331 905483 877741 851158 826476 804323 785158 768996
61151 768996 755438 744084 734821 727688 722649 719525 717902 716921 715291 711774 705748 697346 687075 675427
61137 675427 662812 649771 636957 624826 613532 603350 595025 589313 586225 585202 586083 589372 595345
61124 595345 603437 612964 624016 637100 652198 668752 686407 705228 725227 746190 767937 790398
61112 790398 813470 837191 861919 887756 913780 938330 960281 979743 997492 1014065 1029452
61101 1029452 1043244 1054877 1063862 1069841 1072301 1070414 1063513 1051726 1035875 1016892 995633 973092
61089 973092 950216 927410 904577 881739 859314 837740 817215 797946 780339 764777 751235
61078 751235 739107 727354 715094 702364 690215 679743 671128 663813 657328 651529 646274 641418 637104
61065 637104 633596 630941 629245 629046 630804 634095 637987 642187 647113 652803 658627 664360 670737 678480
61051 678480 687449 697354 708743 722473 738438 755634 773523 792682 813869 836961 861212 886310
61039 886310 912644 940532 969559 998869 1027834 1056269 1084352 1112689 1142184 1173320 1205694
61028 1205694 1238717 1272592 1308079 1345550 1385169 1427863 1474983 1526631 1581184 1636828 1692757
61017 1692757 1748771 1805110 1863510 1927432 2000433 2085028 2183500 2298346 2430866 2580640 2747790
61006 2747790 2935148 3147598 3391011 3673341 4005449 4399478 4868177 5427975 6101668
60997 6101668 6917392 7908827 9120275 10608983 12438084 14666735 17338141 20440245
60989 20440245 23824971 27144510 29910394 31700651 32383606 32178349 31513399 30823394 30432580
60980 30432580 30524809 31104043 31929436 32533597 32403589 31234292 29064017 26201654 23037121
60971 23037121 19891250 16970841 14386772 12178596 10334161 8813127 7568540 6555530
60963 6555530 5731735 5059932 4511638 4064790 3698457 3392621 3132060 2907164 2710887
60954 2710887 2537166 2381851 2242509 2116871 2002985 1900625 1810649 1732781 1665248 1606199
60944 1606199 1553812 1505178 1456820 1406613 1354181 1299715 1243789 1188070 1134626 1084338 1037058
60933 1037058 993172 953596 918354 886563 857880 832611 810269 789458 769573 751465 736013
60922 736013 722988 711616 701333 691712 682456 673758 666017 659106 652531 646279 640707 635709 630828
60909 630828 626104 621968 618403 615133 612452 610787 609455 606992 602881 598010 593273 588664 583810 578418
60895 578418 572051 564446 556247 548540 541521 534601 527885 522407 518589 515598 512698 510271 508915 508325
60881 508325 507706 506660 505200 503432 501641 500276 499579 499635 500844 503663 507755 512058 515887 519364 522730
60866 522730 525977 529383 533569 538643 543955 548978 553865 558846 563759 568483 573334 578696 584656 591113
60852 591113 597708 603546 607651 609984 611556 613387 615786 618609 621604 624412 626841 629210 631890 634593
60838 634593 636764 638571 640718 643339 646043 649109 653672 660513 669535 680560 693687 708581 724343
60825 724343 740475 757155 774251 790924 806485 820678 832737 841166 845090 845096 842208 836752 828648
60812 828648 818027 804958 789380 771881 753929 736723 720365 704551 689305 674519 659636
60801 659636 644606 630544 618704 609171 601140 593945 587207 580567 574030 568197 563479 559389 555161
60788 555161 550702 546346 542066 537599 533078 528905 525153 521575 518084 514768 511558 508213 504496 500125
60774 500125 494800 488559 481928 475491 469445 463581 457468 450778 443849 437791 433384 429959 426107 421476
60760 421476 416985 413236 409797 406354 403359 400982 398493 395479 392748 391160 390361 389560 388859 388832 389410 390175
60744 390175 391336 393322 395681 397318 397780 397526 397008 396174 394861 393153 391450 390491 390988 392771 394711 396004
60728 396004 397144 399071 401791 404526 406792 408479 409166 408215 405537 401600 396755 391234 385683 380955 377153
60713 377153 373454 369064 364030 359067 354834 351373 348102 344418 340421 336753 333665 330702 327566 324684
60699 324684 322485 320648 318699 316946 316119 316287 316801 317150 317368 317687 318265 319184 320344 321483 322554 323810
60683 323810 325213 326220 326605 327074 328514 330920 333648 336450 339678 343594 348024 352528 356534 359513 361474
60668 361474 363049 364713 366251 367392 368510 370105 371985 373699 375487 378049 381491 385197 388777 392564
60654 392564 397140 402764 409236 415948 422165 427576 432407 436768 440253 442508 443747 444228 443605 441289 437106
60639 437106 431174 423633 415102 406880 399930 394040 388643 383927 380289 377207 373808 370335 367915 366891
60625 366891 366406 365721 364926 364194 363330 362427 362183 363043 364506 365643 365954 365555 364915 364494 364327 363920 362938 361867
60607 361867 361578 362347 363821 365735 367962 370020 371306 371956 372724 373887 374906 375376 375634 376167 376954 377693
60591 377693 378259 378747 379368 380481 382335 384703 387131 389551 392188 394840 396867 398095 399278 401327 404354
60576 404354 407684 410620 413089 415733 419475 424857 431784 439919 449092 459212 470296 483005 498736
60563 498736 518498 541877 567648 595030 623550 651787 677226 697620 711945 719930 721349 716122
60551 716122 704767 688587 669676 650634 633678 619831 609224 602004 598496 598691 602332 609574 620905
60538 620905 636334 655311 677730 704451 736593 774558 817688 864195 911179 955172 993086
60527 993086 1022626 1042058 1050313 1047601 1035641 1017080 994751 971116 947804 925527 904753 886302
60515 886302 870835 857939 846426 835669 826185 818943 814628 813513 815442 819817 826162 834665 845704
60502 845704 858989 873975 891193 912391 939189 972328 1012477 1061007 1119468 1188677 1268500
60491 1268500 1357960 1455249 1557921 1663155 1767410 1865985 1953852 2027446 2085270 2126627 2150402
60480 2150402 2155263 2140425 2105834 2052184 1981166 1895367 1797626 1690818 1578338 1464218 1352433
60469 1352433 1246331 1148610 1060988 983564 915108 854459 801248 755181 715311 680462 649876
60458 649876 623026 599309 578332 560065 544311 530461 518119 507471 498646 491175 484519 478671
60446 478671 473686 469022 464004 458715 453860 449823 446370 443225 440525 438554 437283 436289 435153 433961
60432 433961 433282 433478 434169 434674 434822 434838 434558 433406 431252 428587 425612 421822 416972 411895 407826 405182
60416 405182 403474 402191 401373 401381 402331 403730 404672 404652 404160 404153 404958 406129 407289 408436 409394 409730 409491 409326
60398 409326 409509 409520 408997 408425 408292 408177 407415 406225 405475 405593 406410 407844 409994 412610 415044 416876 418115
60381 418115 418739 418478 417304 415895 415289 416014 417626 419246 420569 422063 424003 425715 426364 426239 426499 427647
60365 427647 429091 430375 431953 434239 436648 438275 439058 439643 440387 441072 441385 441205 440651 440221 440602 441915
60349 441915 443423 444443 445234 446489 448247 449904 451231 452736 455010 458107 461635 465047 467733 469200
60335 469200 469475 469218 469209 469611 469783 469027 467564 466496 466518 466957 466568 465161 463806 463449 463979 464820 465764 466875
60317 466875 468121 469505 471136 472866 474297 475500 477321 480570 485257 490892 497125 503789 510879 519021
60303 519021 529536 543519 561190 582630 608667 640125 676016 713009 746819 774009 792675
60292 792675 801931 801187 790064 769135 740610 707895 674347 642500 614099 590082 570278 553799
60280 553799 540098 529224 520882 513934 507265 500620 494179 487928 482043 477289 474266 472475 470829 468926
60266 468926 467290 466497 466610 467383 468522 469706 470741 471667 472607 473588 474639 475758 476603 476588 475560 473998
60250 473998 472305 470310 467791 465053 462531 460264 458198 456604 455653 454901 453840 452751 452472 453400 455163
60235 455163 457162 459026 460630 462051 463528 465300 467542 470421 473854 477202 479786 481889 484543 487970
60221 487970 490966 492381 492540 492497 492526 492320 492252 493349 495940 499174 502003 504103 505732 507206 508698 510255
60205 510255 511932 513986 516679 519669 521984 522985 523042 522940 523005 523282 524065 525553 527224 528225 528269 527605 526370
60188 526370 524583 522623 521004 519689 518129 516012 513511 510851 508100 505388 503013 501344 500764 501421 502754
60173 502754 503670 503647 503346 503729 504966 506655 508623 510827 512796 513943 514264 514135 513730 513283 513617 515518 518660
60156 518660 521899 524587 526900 528980 530631 531998 533738 536239 539285 542744 547056 552768 559972 568469
60142 568469 578135 588887 600455 612341 623928 634708 644533 653629 662280 670624 678792 686824 694237
60129 694237 700089 703721 705083 704079 700170 693057 683341 672109 660350 649100 639393 631416 624424
60116 624424 618185 613779 611971 611521 610355 608067 606001 605120 605102 605570 606821 608943 611228 612920 613841 613996
60100 613996 613241 611631 609490 606935 603851 600418 597135 594309 592121 591122 591908 594245 597211 600320 603843
60085 603843 607963 612367 616902 622011 628220 635520 643340 650743 656778 661077 663947 665412 664532 660388
60071 660388 653468 645265 636738 628047 619519 611726 604610 597575 590529 583823 577197 569965 562389 555600
60057 555600 549860 544080 537544 530963 525236 520232 515507 511274 507868 505053 502653 501192 501090 501857 502905
60042 502905 504650 507879 512290 516512 519494 521290 522504 523451 523855 523066 520613 516724 512203 507627 502909
60027 502909 497779 492368 487017 481668 475692 468400 459822 451087 443772 438531 434523 430517 426305 422575
60013 422575 419773 417781 416472 415743 415100 414002 412668 411787 411490 411391 411551 412456 414006 415521 416864 418548
59997 418548 420577 422287 423626 425448 428144 431076 433889 437233 441468 445629 448577 450436 452139 454232
59983 454232 456913 460571 465419 470968 476505 481661 486029 488939 490321 491246 492802 494911 496888 498681
59969 498681 500766 503287 506141 509627 514153 519425 524579 529058 532884 536245 539359 542526 545813 548778
59955 548778 550944 552418 553677 554812 555219 553965 550428 544930 538767 533114 527844 522032 515719 510200
59941 510200 506230 502923 499129 494997 491276 487758 483544 478553 473784 470187 468035 467201 467311 467753 468238
59926 468238 469271 471446 474453 477459 480365 483951 488722 494224 499633 504546 509085 513679 518829 524745
59912 524745 531085 537250 542943 548368 554004 560339 567516 574948 581514 586492 590128 593010 595107 595788
59898 595788 594612 591706 587534 582736 578162 574642 572495 571323 570360 569068 567536 566350 566013 566556 567817
59883 567817 569878 572853 576454 580195 583924 587654 591053 593806 596415 599848 604184 608343 611313 612964
59869 612964 613479 612827 611215 609359 607785 606384 604970 603692 602623 601587 600776 600801 601705 602503 602179 600595
59853 600595 598122 595036 591728 588878 586948 586024 586343 588287 591656 595861 601238 609125 620052 632757
59839 632757 645526 657401 667410 673925 676113 675284 673696 672640 672654 674665 679334 685497 690432 691657
59825 691657 687831 678631 665044 649551 634788 621834 610360 600032 590877 582670 575032 568107 562333
59812 562333 557661 553645 550013 546506 542608 538195 534013 530731 528005 525272 522879 521373 520257 518575
59798 518575 516186 513201 508772 502009 493883 486625 481155 476570 472233 468810 466805 465450 463740 461627
59784 461627 459652 458166 457235 456577 455352 452854 449609 446959 445320 443775 441567 439098 437071 435670 435037
59769 435037 435665 437622 440008 441853 443175 444580 446190 447478 448074 448417 449506 451895 454877 456981 457606
59754 457606 457815 459063 461644 465036 469232 474641 480941 487221 493276 499675 506392 512479 517374 521491
59740 521491 525058 527288 527339 525500 522921 520599 518918 517650 516088 513647 510625 508054 506674 506449 506923
59725 506923 507429 506973 504777 501165 497257 493630 489927 485881 481908 478406 475234 472262 469802 468117 467120
59710 467120 466875 467790 469889 472403 474551 476348 478267 480459 482669 484669 486418 487914 489029 489434 488836
59695 488836 487491 486309 486083 486784 487923 489230 490482 491055 490448 489021 487462 485779 483628 481364 479736
59680 479736 478745 477839 477140 477208 477594 476950 474959 472888 471779 471204 470302 468916 467107 464627 461683 459262
59664 459262 457844 456527 454319 451615 449524 448315 447460 446793 446692 447247 448023 448666 449305 450411 452478 455577
59648 455577 458940 461363 462299 462221 461648 460319 457715 453974 449861 446181 443520 442122 441560 440893 439610 438226
59632 438226 437682 438413 440233 442696 445180 446927 447464 446923 445848 444857 444500 445030 446114 447114 447805 448452
59616 448452 449151 449531 449207 448137 446501 444744 443694 443988 445239 446470 447495 449119 451663 454092 455116
59601 455116 454556 453114 451300 449211 447045 445264 444229 443841 443483 442464 440823 439571 439643 440754 441850
59586 441850 442500 442994 443254 442694 441356 440080 439169 437869 435671 433214 431322 429892 428367 426592 424613
59571 424613 422217 419317 416326 413633 411192 409007 407497 406949 407168 407986 409468 411239 412356 412366 411908 411789
59555 411789 412160 413035 414836 417726 421051 424131 427069 430189 433281 436106 439134 442991 447528 452082 456501
59540 456501 461445 467972 477055 489155 504137 522040 543702 569271 595670 616916 628206 629295
59528 629295 623523 614689 605705 598873 595509 595321 597233 600694 605447 610547 614773 617776 619797 620435 618703
59513 618703 614224 607474 598877 588498 576688 564289 552142 540861 530989 522746 515654 508944 502306
59500 502306 495968 490201 485133 480789 476959 473357 470157 467891 466472 465010 463071 461411 460752 460528 459731
59485 459731 458367 457163 456316 455617 455398 456322 458356 460919 463905 467667 472129 476820 481740 487385 493890
59470 493890 500800 507619 513876 518820 521788 522920 522956 522483 521898 521809 522777 524844 527920 532356 538477 545954
59454 545954 554399 564228 575968 588898 601396 612594 622929 633108 643361 653568 663195 670933
59442 670933 675139 674847 669977 660842 648072 632885 616729 600706 585792 573082 563073 555095 548297
59429 548297 542849 539266 537089 535410 534408 535049 537434 540730 544793 550589 558880 569659 582942 598799
59415 598799 616426 634476 652835 673075 696875 724771 756001 787538 812876 824138 817522 796342
59403 796342 767993 738830 712486 691303 677137 671000 673220 683497 699133 713437 718034 708252
59391 708252 686047 657483 628027 600445 575846 555022 538335 525212 514625 506137 500068 496617
59379 496617 495249 495244 496435 498961 502503 506304 509950 513602 517416 521178 524738 528411 532693 537758 543362
59364 543362 549055 554452 559460 564298 569119 573734 578007 582411 587780 594479 602192 610583 619821 630394
59350 630394 642728 657067 673335 690956 709089 727224 745375 763643 781730 798935 814462
59339 814462 827708 838378 846370 851502 853491 852223 847770 840006 828589 813623 796088 777300 758209
59326 758209 739432 721513 704688 688681 673335 659221 647120 637115 628700 621576 615792 611205
59314 611205 607361 603882 600673 597901 596142 596125 597834 600132 601884 603131 604618 606580 608832 611697 615830
59299 615830 621186 627069 633321 640668 649813 660892 673967 689440 707902 729990 755970 784354
59287 784354 810716 828938 834353 825841 805561 777738 747558 719637 696428 678150 664222 654215
59275 654215 647590 643715 642618 644985 650988 659766 670396 682627 696127 709694 721826 731734 739321
59262 739321 744515 746973 746163 741478 732675 720507 706476 691688 676325 660468 644896 630600 617882
59249 617882 606422 596051 587053 579800 574437 570895 569023 568694 569824 572282 575883 580570 586448 593435
59235 593435 601076 608908 616738 624250 630680 635465 638944 641802 643847 644001 641507 636627 630176 622904
59221 622904 615302 607532 599501 591400 584036 578164 573706 570169 567569 566254 565994 566074 566198 566575 567239 568121
59205 568121 569648 572340 575753 578801 581217 583767 586858 589916 592439 594728 597157 599514 601498 603188
59191 603188 604702 606025 607467 609568 612273 614809 616661 618020 619097 619818 620440 621548 623026 623909 623838
59176 623838 623858 625115 627383 629576 631236 632883 635238 638719 643450 649320 656139 664010 673282 683883
59162 683883 694992 705534 714733 722159 727685 731542 734067 735228 734689 732211 727595 720553 711287 701047
59148 701047 691312 682484 674144 666371 659748 654181 648907 643830 639616 636206 632491 628000 623706 620512
59134 620512 618021 615554 613377 612059 611445 611184 611655 613485 616615 620618 625557 631916 639999 649889 661627
59119 661627 675076 690032 706774 725857 747078 769348 791973 815323 839735 864528 888679
59108 888679 911837 934161 955836 977240 998810 1020133 1039774 1056606 1070676 1082333 1091265 1096899
59096 1096899 1098995 1097345 1091855 1083640 1075053 1067705 1061235 1054818 1048883 1044161 1039837 1034082 1025975 1015618
59082 1015618 1002697 986278 966092 942960 917804 891070 863254 835286 808232 783010 760248
59071 760248 739924 721353 704039 688348 674908 663591 653661 644692 636845 630429 625592 622146 619351
59058 619351 616238 612544 608856 605497 601886 597602 593403 590411 588717 587554 586442 585418 584463 583574 583257
59043 583257 584254 586805 590577 595099 599884 604522 609170 614614 621290 628607 635801 643032 651101 660493
59029 660493 671333 683946 698743 715811 735170 757224 782489 811146 843156 878225 915041
59018 915041 951016 983417 1010447 1030870 1043400 1047368 1043626 1034066 1020614 1005222 990091 976828
59006 976828 965678 956466 949997 947675 950014 956365 965842 977537 989955 1001247 1010195 1016370 1019323
58993 1019323 1018308 1012885 1003275 990026 973755 955206 935150 914139 892443 870121 847212 824260
58981 824260 802625 783631 767258 752502 739268 728897 722268 718392 715743 714119 714247 716294 719875
58968 719875 725023 731985 740345 749321 758739 768902 779757 790921 802171 813134 822796 830086 834673
58955 834673 836556 835300 830480 822478 812169 800184 787188 774342 762689 752533 744146 738490 736364
58942 736364 737488 741511 749338 762243 779891 800236 820913 839628 853614 860233 858462 849073 833518
58929 833518 813435 790890 767936 745775 724914 705858 688845 673323 658616 644910 632809
58918 632809 622306 613054 605228 599145 594451 590660 588116 587282 587530 587795 588147 589531 592242 595923 600822
58903 600822 607714 616562 626552 637536 650278 665039 680865 696437 710917 724115 736644 749741
58891 749741 764121 779309 794944 812202 832676 856183 880874 905179 928267 948905 965469
58880 965469 977348 985065 988900 988496 983843 975399 963173 946922 927381 906233 884741 863500 843417
58867 843417 825678 810655 797917 787267 778536 770557 761866 752498 743651 735428 726469 716104 705227
58854 705227 694613 683919 673136 663611 656687 652291 649559 647935 646893 645413 642525 637918 631654
58841 631654 623875 615093 606094 597200 588171 578922 569787 561078 553098 546493 541710 538209 535102 532404
58827 532404 530705 529774 528736 527548 527009 527236 527467 527494 527948 528899 529516 529477 529541 530247 531215 532121 533293 534892
58809 534892 536482 537801 539094 540432 541545 542406 543049 542866 541266 539021 537745 537969 538933 540111 541353
58794 541353 541626 539510 535402 531467 528850 526566 523752 521303 520461 521303 523537 527392 532719 538445 543768
58779 543768 548877 553863 558217 562058 566472 571787 576818 580578 583328 585063 584613 581480 577200 573422
58765 573422 569796 565189 559927 555218 551185 547171 543565 541701 541983 543453 545347 548125 552659 559008
58751 559008 566183 572898 578565 583605 588607 593389 597434 601081 605442 611218 618475 627537 638912 652129
58737 652129 665842 679499 693905 709939 727737 747304 768534 790272 810710 829212 846443
58726 846443 862145 874254 881015 882801 881166 877365 872603 868434 865880 864999 865966 869490 875486 882494
58712 882494 889181 895315 900519 903345 902592 898547 892042 883190 871779 857934 841557 822056 799347
58699 799347 774219 747310 718880 690132 663282 639527 618240 598871 582163 568615 557294
58688 557294 547291 538920 532293 526151 519488 513050 507862 503386 498587 493790 490096 487829 486860 487605
58674 487605 490393 494569 499326 504640 510514 516349 522080 528828 537314 546801 556765 568326 582487 598006
58660 598006 612454 624479 633704 639514 641615 641028 638964 635337 629724 622973 616345 609746 602267 593979
58646 593979 585803 578162 570968 564443 558746 553376 548035 543457 540289 537872 535228 532517 530439 528994
58632 528994 527919 527472 527633 527451 526385 525379 525375 525757 525581 525374 526298 528437 531354 535457 541306 548402 556192
58615 556192 565480 577212 590475 603162 614008 622588 628099 629797 628229 624723 620081 614804 609720
58602 609720 605166 600391 595046 590258 586883 583799 579523 574520 570291 567168 564768 563684 564801 567690
58588 567690 571591 577250 585876 596901 608686 620934 634502 649215 663689 677034 689061 699210
58576 699210 706957 712914 717963 721791 723893 725507 728827 734700 742731 753220 767251 785119 806220
58563 806220 830217 856943 885545 915007 944970 974872 1003137 1028652 1052023 1073777 1092437
58552 1092437 1106226 1115603 1121986 1124710 1121457 1111145 1094485 1072347 1045717 1016694 987410 958243
58540 958243 928799 899912 872767 846906 821330 796894 775390 756891 740233 725470 713556
58529 713556 704212 696527 691069 688852 688671 688107 686960 687133 689371 692633 696546 701852 708322 714638 720413
58514 720413 726117 731148 734288 735878 737134 737549 735537 731440 727193 723005 717256 709918 703285 698834
58500 698834 695810 693293 691182 688722 684625 679176 674051 669714 665314 661309 659563 660381 661990 663544
58486 663544 666233 670853 676769 683943 693663 706446 721260 737462 755408 774638 793475 810899
58474 810899 826776 839912 848234 851407 851092 848132 841522 830654 816485 800134 782416 764974 749671
58461 749671 736553 724506 713930 706422 701866 698581 696500 697325 701093 705519 709348 713569 718511 722529
58447 722529 724467 724873 723883 720434 714572 708205 702696 697880 694076 692639 693787 696199 699443 704474 711219
58432 711219 718134 724718 732035 740301 748535 757071 767692 780795 795132 810734 829080 849821 870362
58419 870362 889354 907597 925047 940226 953150 965030 974049 975328 966825 951897 934439 914895
58407 914895 892942 870685 850767 833829 819843 809536 802711 797578 793463 791957 793995 798152 803042
58394 803042 808861 815352 820924 825010 828587 831282 830816 826532 820500 814037 806365 797930 791458 788063
58380 788063 785669 783106 782369 784882 788790 792108 795453 799584 803303 806069 809770 815720 822542 828975
58366 828975 836063 844701 853772 862466 871605 881120 889291 896091 903934 913381 921616 927121 932244 938983
58352 938983 945794 950881 955137 959498 962897 965370 969693 977305 985856 993298 1001100 1010970 1021825 1032653
58338 1032653 1045038 1060215 1076730 1093297 1110623 1128256 1143379 1155128 1166263 1178114 1187951
58327 1187951 1193936 1198349 1203013 1205832 1205169 1203467 1203172 1203123 1202284 1202918 1206588 1211152 1215143 1220908 1229901
58312 1229901 1239285 1247039 1255997 1268908 1283912 1298947 1316045 1336875 1358494 1378126 1397785 1419453
58300 1419453 1440039 1456057 1469182 1482308 1494299 1503596 1512771 1524274 1535717 1544551 1553340 1565229
58288 1565229 1578361 1590166 1603015 1620073 1639572 1658783 1679612 1704677 1731861 1758395 1786261
58277 1786261 1817901 1850776 1881947 1913757 1949196 1986050 2021669 2058951 2101443 2147066 2192932
58266 2192932 2241656 2296466 2354938 2414073 2476523 2545014 2615745 2684246 2752272 2821673 2887285
58255 2887285 2943819 2994298 3043834 3091002 3133687 3177209 3227497 3282044 3336889 3396590 3467573
58244 3467573 3547483 3631049 3720571 3820444 3927362 4036595 4151986 4278996 4414154 4552485
58234 4552485 4698684 4859300 5030655 5206711 5391930 5593670 5809094 6032920 6270731
58225 6270731 6530805 6810416 7104595 7420359 7767272 8142587 8541698 8974248 9453112
58216 9453112 9977098 10542421 11161089 11849112 12607778 13437367 14357993 15395596 16560742
58207 16560742 17865723 19349909 21064408 23049113 25354087 28065462 31276552 35051305
58199 35051305 39453796 44598894 50643738 57765456 66207706 76339331 88633032 103631418
58191 103631418 121996415 144541257 172111071 205382098 244574060 288715602 334409668
58184 334409668 375219507 403197776 412363071 401650679 374968158 338647612 298686807
58177 298686807 259503080 223947092 193602176 169051227 150194568 136426083 126517819
58170 126517819 118616713 110804362 101922608 91907972 81403073 71149850 61671703
58163 61671703 53251788 45985621 39830874 34675620 30391256 26839297 23875167 21377427
58155 21377427 19262005 17461183 15910508 14563721 13397136 12387828 11503323 10717277
58147 10717277 10016584 9387148 8809259 8271473 7773158 7309715 6870550 6454180 6069749
58138 6069749 5720338 5398993 5103229 4838614 4605157 4394179 4201652 4031400 3882052
58129 3882052 3743213 3607462 3474829 3343511 3208139 3069947 2937591 2815087 2698634
58120 2698634 2586916 2484147 2390989 2302517 2217378 2139631 2069675 2002452 1936370 1875188 1819574
58109 1819574 1765474 1712259 1663862 1620430 1577220 1533096 1491936 1454383 1416412 1377333 1341128
58098 1341128 1308483 1275527 1241853 1211899 1186839 1162818 1138723 1118036 1101407 1085000 1068047
58087 1068047 1054693 1046375 1039366 1031685 1025489 1020649 1012773 999786 984120 966597 944599 918233
58075 918233 891923 867653 842696 816047 791085 769718 749680 729835 712547 698643 685395
58064 685395 671678 659932 651034 642411 633137 625773 621143 616227 609202 601755 594648 585906 575288
58051 575288 565662 558006 549738 539851 531022 524741 519018 512814 508070 505319 501824 496187 490529 486104
58037 486104 481057 474527 468664 464521 460035 454081 448402 443550 437049 427778 418207 410165 402222 393344
58023 393344 385262 379028 372919 365994 360204 356765 353864 350048 346563 344390 342260 339509 337580 336822
58009 336822 335193 332002 329620 329548 330160 330184 330966 333247 335161 335699 336890 340223 344020 346636 349301 353467
57993 353467 358143 362149 366378 371691 377098 381991 387533 393834 398419 399553 398604 397112 394028 387959
57979 387959 379846 371381 362862 354288 346424 339207 331299 322661 315270 310053 305648 301438 298941 298698
57965 298698 298622 297195 295612 295095 294845 294414 295351 298545 302399 305381 307910 310179 310912 310025 309707 311000
57949 311000 312106 311962 312550 315472 319119 321619 323921 327542 331766 335585 340014 346002 352290 357784 363907
57934 363907 372173 381495 390190 398536 407019 414171 418683 421694 424583 426397 425805 423637 421027 416911
57920 416911 409906 400958 391721 381928 370834 359580 349677 340575 331109 321967 314467 308268 302470 297614
57906 297614 294486 292393 290652 290203 291607 293038 292476 290472 288577 286602 283723 280841 279436 279242 279285
57891 279285 280023 282326 285501 288283 290660 292916 294288 294448 294823 296512 298391 299115 299227 299311 297992 294166
57875 294166 289359 285310 280939 274422 266679 259923 254145 247971 241783 236941 232887 228038 222786 218781
57861 218781 215900 212768 209787 208863 210412 213148 216552 221100 226359 231206 235743 240852 246138 250391
57847 250391 253777 257505 261669 265337 268363 271189 273346 274089 274031 274201 274074 272408 269404 266106 262420
57832 262420 257859 253514 251040 250236 249778 249731 251055 253271 255075 256907 260479 265914 271678 277130 282849
57817 282849 288455 292444 294403 295413 296085 296002 295113 293920 292256 289518 285982 282272 277823 271614 264104
57802 264104 256692 249586 242007 234119 226837 220103 213277 206927 202195 198630 194695 190261 186609 184126
57788 184126 182022 180285 179864 180891 182628 185197 189430 194981 200397 205228 210332 216132 222282 228985
57774 228985 236837 245439 253828 262142 271080 279957 287183 292494 296738 299622 299770 297001 292517 286812
57760 286812 279378 270544 261498 252351 242191 231206 220760 211216 201774 192706 185644 181196 178187
57747 178187 175643 173732 172474 171473 171229 172755 175479 177438 177925 178001 178001 176631 173272 169179 165543 162107
57731 162107 158503 155424 153628 153037 153339 154206 154657 153717 151980 150991 150955 150713 150088 150286 151619 152869 153401
57714 153401 153893 154359 153532 151100 148637 147368 146665 145618 144368 143027 140991 138348 136376 135604 134931 133586
57698 133586 132379 131967 131519 130387 129644 130519 132459 134068 135053 136029 137234 138547 140130 142134 144339 146748
57682 146748 149881 153966 158652 163988 170794 179604 190260 203021 219075 239413 264321 294635 332583
57669 332583 380744 441053 515215 604753 709071 822786 934279 1026552 1081488 1087260 1044325
57658 1044325 964523 864195 757832 655822 564191 484757 416981 360746 316589 283324 257559
57647 257559 236369 218959 205089 193576 183293 174126 165961 158110 150608 144699 141016 138460 135782
57634 135782 133121 131170 129981 129397 129510 129938 129755 128799 127941 127529 126888 125831 125151 124917 123900 121564 119116
57617 119116 117606 116466 114905 113278 112043 110727 108973 107281 105706 103298 99973 97521 97475 99215 101294
57602 101294 103238 104784 104843 102860 100175 98554 98221 98481 99167 100145 100480 99480 97724 95844 93355 89928
57586 89928 86688 84738 83411 81439 78983 77012 75518 73871 72211 70999 69776 67791 65349 63266
57572 63266 61533 59780 58468 58324 59073 59887 60536 61080 61072 60205 59099 58381 57662 56551 55848 56443 57740 58459
57554 58459 58400 58130 57677 56880 56483 57432 59437 61469 63260 65145 66905 68022 68723 69628 70753 71883 73424
57537 73424 75754 78251 80089 81503 83108 84503 84780 84052 83253 82641 81581 79575 76659 73186 69959
57522 69959 67990 67266 66448 64668 62762 61696 60779 58806 56115 53954 52469 50932 49499 49107 49820 50693
57506 50693 51126 51115 50418 48803 47026 46319 46925 48019 48823 48934 48073 46565 45609 45923 46576 46250 45129 44289
57488 44289 43826 42987 41734 40682 39775 38440 36938 36190 36241 36089 35053 33361 31538 30100 29567 29908 30274
57471 30274 30122 29988 30283 30118 28589 26481 25310 25255 25494 25952 27181 28925 30422 31779 33565 35352
57455 35352 36206 36358 36861 37868 38699 39282 39943 40177 39310 38098 37927 38663 39038 38908 39138 39443 38519 36470
57437 36470 34972 34605 34107 32817 31805 31727 31451 29969 28149 27374 27556 27640 27324 27309 28284 30167 31975 32323
57419 32323 30742 28484 27250 27203 27195 26677 26112 25583 24509 23017 22187 22527 23324 23811 23906 23521 22348 20693
57401 20693 19479 19114 19272 19861 21066 22401 22892 22379 21471 20292 18568 16955 16618 17308 17426 16425 15559
57384 15559 15795 16539 17070 17681 18538 18821 17977 16823 16512 17244 18575 20033 20903 20417 18854 17570 17407
57367 17407 17841 17984 17491 16201 14075 11848 10594 10216 9539 8251 7427 7634 8004 7880 7987 9057 10513
57350 10513 11525 12309 13372 14427 15049 15595 16530 17470 17689 17018 15640 13704 11692 10386 9884 9358 8302
57333 8302 7249 6766 6637 6559 6736 7156 7232 6789 6558 7020 7573 7487 6860 6001 4759 3148 1816 1146 580
57314 580 -538 -2139 -3944 -5978 -7977 -9136 -9163 -8840 -8856 -8812 -8020 -6597 -5129 -3900 -3055 -2827 -3041 -3033 -2582
57295 -2582 -2287 -2553 -2966 -3106 -3239 -3712 -4444 -5484 -7259 -9714 -11942 -13151 -13331 -12709 -11360 -9686 -8376
57278 -8376 -7427 -6072 -4014 -1849 13 1833 3654 5101 6389 8349 11004 13289 14634 15583 16436 16690
57262 16690 16305 16068 16025 15102 13037 11133 10229 9468 8068 6732 6129 5530 4278 3212 3152 3234 2281 692
57243 -526 -1555 -3045 -4543 -5234 -5379 -5581 -5447 -4439 -3285 -2998 -3216 -3015 -2675 -3098 -4002 -4226 -3392 -1945
57225 -1945 -11 2453 4826 6454 7646 8890 9691 9476 8973 9312 10289 10925 11209 11784 12339 11854 10194 8113
57207 8113 5872 3142 40 -2963 -5983 -9485 -13423 -17592 -22320 -27792 -33219 -37849 -42142 -46732 -50884
57192 -50884 -53270 -53511 -51431 -45560 -34312 -18390 -315 18249 37070 55586 72409 86810 99225
57179 99225 110114 119584 128095 136279 144086 151253 158376 166246 174467 182198 190018 199414 210481 221816
57165 221816 232826 244599 258252 273742 290543 308225 326215 344172 362713 382647 403533
57154 403533 424192 444486 465228 486460 507352 527804 548570 569622 589947 609280 628659
57143 628659 648959 670189 692476 716422 742190 769368 797963 828270 859688 891044 922366
57132 922366 955048 990034 1027128 1066241 1107937 1152480 1199640 1249706 1303437 1360867 1421506
57121 1421506 1485882 1555443 1630827 1711725 1798660 1893305 1996832 2109622 2232930 2369148
57111 2369148 2520106 2687056 2872990 3083246 3323166 3596999 3909888 4269284 4683741
57102 4683741 5162385 5717179 6364933 7127169 8030446 9107983 10399054 11945523 13790493
57093 13790493 15980687 18566767 21598075 25116559 29153657 33726003 38827147 44420776
57085 44420776 50439157 56781174 63308550 69852626 76237354 82295308 87847989 92663586
57077 92663586 96446797 98895090 99789484 99053663 96750191 93039282 88141216 82316304
57069 82316304 75850792 69037905 62155415 55445226 49097874 43244340 37957681 33262981
57061 33262981 29149842 25583169 22512581 19881318 17632707 15712648 14070344 12660092
57053 12660092 11443363 10388762 9470308 8666412 7959852 7337201 6787678 6302620 5875181
57044 5875181 5499108 5167624 4874114 4613396 4381197 4172773 3983544 3810918 3653858
57035 3653858 3510443 3377486 3252914 3136873 3029796 2931042 2840237 2758387 2686424 2623973
57025 2623973 2570857 2528741 2500075 2486586 2490268 2514877 2565150 2645878 2762741 2919645 3107582
57014 3107582 3293444 3425631 3459316 3381586 3214553 2996664 2761934 2532319 2320710 2134310
57004 2134310 1975097 1840850 1728006 1633376 1553557 1484672 1423882 1370352 1323951 1283683 1248136
56993 1248136 1216635 1188991 1164608 1142788 1123483 1106818 1092343 1079870 1070725 1066886 1068698 1074074
56981 1074074 1079566 1081219 1074970 1058199 1031673 999074 964259 929672 897135 868409 844135 823328
56969 823328 804831 788610 775097 764140 755402 749196 746188 746713 750951 759378 772513 790501 813053
56956 813053 838992 865128 886064 896105 891899 873703 844890 810425 774976 741450 710927 683783
56944 683783 660525 641616 627097 616605 609481 604966 602819 603773 608980 619067 634281 655328 683206
56931 683206 717936 757680 798547 834397 857601 862116 846999 816492 776592 732173 686999 644455
56919 644455 606906 574922 547915 525217 506295 490624 477863 467658 459121 451116 443333 436347
56907 436347 430451 425172 420218 415960 412591 409616 406637 403995 402232 401452 401509 402254 403476 405298 408641
56892 408641 414507 422793 432767 444704 459924 479095 501745 527373 555210 582059 602113 610490
56880 610490 606473 592791 572846 549551 525710 503820 485433 471286 461697 456423 454776 456496
56868 456496 462085 471967 486087 504815 529481 561516 601727 650853 709764 777801 850630 919722
56856 919722 973998 1003306 1002809 975395 929448 873874 815438 759525 710619 670882 639862 616743
56844 616743 601846 595375 596372 604178 619761 644633 679687 726193 786617 863073 955624 1062280
56832 1062280 1178094 1291902 1385581 1440302 1445710 1403880 1326131 1227319 1121352 1018449 924439
56821 924439 842223 773381 718205 675543 644116 623593 613550 612307 618278 631991 655572 690664
56809 690664 738087 798848 873350 958377 1044952 1119295 1166701 1177005 1149044 1090755 1014408
56798 1014408 931130 848749 772319 704711 646979 599285 561476 532647 511204 496151 487544
56787 487544 485150 487914 495569 509479 530858 559353 594347 635631 680548 721492 748704 755874
56775 755874 742361 711384 668184 619142 570006 523997 482288 445713 414773 388634 365837
56764 365837 345883 328936 314518 301980 291711 284288 278822 273704 268615 264178 260102 255469 250643
56751 250643 247069 245126 243843 242714 242168 242169 242001 241578 241468 241462 240596 238788 237061 235905 234724 233091 231284
56734 231284 229441 227459 225875 225556 226287 226832 226547 225820 224952 223869 222986 222994 223585 223630 222833 222062 221889 221948 221965
56715 221965 222232 222832 223406 223897 224589 225395 226011 226660 227650 228367 227867 226342 224792 223452 221843 220193 219333
56698 219333 219151 218678 217874 217861 219080 220577 221446 221762 221793 221460 220956 220755 220709 220107 218795 217391 216349 215795
56680 215795 216096 217427 218914 219495 219531 220275 221784 222850 222947 222752 222620 222076 221056 220213 219730 219170 218688 218986
56662 218986 219899 220483 220670 221312 222356 222639 221801 220799 220072 218903 217231 216424 217337 218933 219713 219493 219022
56645 219022 218868 219260 220119 220739 220418 219695 220004 221797 224099 226031 227609 228867 229573 230064 231008 232045 232081
56628 232081 231169 230623 230941 231178 230800 230501 230660 230617 230105 229775 229612 228463 225982 223504 222085 221070 219583
56611 219583 218020 217150 216989 217493 219007 221091 222194 221578 220390 219875 219747 219319 218949 219158 219479 219404 219540
56594 219540 220544 221773 222215 222100 222385 223183 223678 223253 221937 220152 218629 218086 218517 219282 220160 221505 223175
56577 223175 224312 224598 224680 224983 225218 225524 226800 229234 231700 233362 234773 236644 238653 240344 242184 244868
56561 244868 248474 253050 259097 266650 274739 282422 289565 296066 301328 305105 307946 310261 311960 313474
56547 313474 315850 319183 322172 323959 325165 326384 326969 326266 324869 323590 322212 320235 317850 315272 312075
56532 312075 308104 304123 300619 296906 292283 287213 282506 278193 274012 270123 266628 263215 260003 257768
56518 257768 256621 255395 253134 250316 247969 246391 245230 243904 241620 238108 234634 232927 232744 232040 230046
56503 230046 228428 228625 229825 230592 230836 231006 230876 230476 230869 232731 235242 237371 239046 240152 239892 238255
56487 238255 236750 236515 237029 237666 238930 240970 242537 242856 243019 244034 244941 244448 243086 242126 241607 241009 240733
56470 240733 241270 242019 242428 243261 245231 247459 248739 249279 249826 250214 250151 250167 250378 249687 247773 246443 247281 249267
56452 249267 250513 251040 251895 252786 252745 252186 252183 252513 252313 251948 252355 253286 253953 254628 255872 256987 257055 256727 257210
56433 257210 258284 259052 259793 261276 262990 263909 264228 264636 264741 264053 263589 264568 266333 267503 268295 269675 271096
56416 271096 271292 270616 270413 270677 270497 270217 270913 272138 272411 271631 270902 270326 269067 267366 266352 266024 265390
56399 265390 264476 264244 264607 264351 262975 261003 258726 256311 254771 255090 256695 258435 260527 263781 267493
56384 267493 270139 271734 273451 275330 276473 277219 278966 281942 285195 288686 293297 298700 303176 305747
56370 305747 306858 306963 306100 304804 303790 302787 301179 299511 298787 298667 298055 297120 296877 297133 296711 295529
56354 295529 294644 294385 294131 293720 293527 293375 292891 292479 292461 291963 290265 288420 287747 287700 287221 287135 288838 291494
56336 291494 293122 293737 294739 295836 295489 294107 293851 295280 296945 298397 300813 304389 307743 310299 312858
56321 312858 315448 317023 317643 318727 320694 322491 323707 325091 326774 327996 328720 329499 329833 328876 327632
56306 327632 328061 330060 331800 333042 335389 339040 342060 343485 344615 346546 348721 350545 352304 353873
56292 353873 354528 354511 354883 355588 355678 355537 356647 358970 360853 361809 363086 365225 367353 369212 371606 374512
56276 374512 376948 378975 381549 384290 385760 386206 387564 390498 393832 397133 401287 406247 410784 414866
56262 414866 419769 425494 430690 435431 441449 449219 457461 465932 475954 487701 499761 512013 526249
56249 526249 543302 562248 582934 606454 632489 659004 685426 713261 742762 771777 798864
56238 798864 824819 850033 872892 891845 906735 917270 922578 922941 919606 912334 899760 882646
56226 882646 863987 845317 825648 804571 783295 761994 739323 715579 693267 673534 655029
56215 655029 637243 621824 609419 598252 587116 576986 568551 560942 553946 548640 544881 541075 537259
56202 537259 535295 535128 534210 531699 529817 529803 529944 529011 528284 528641 528914 528654 529337 531332 532857 533387 534811
56185 534811 537786 540349 541621 543362 546209 548031 547898 548112 550235 552546 553582 554816 557609 560695 562978
56170 562978 565758 569930 573937 576595 579172 582836 586899 591206 597115 604475 611023 616399 623196 632319
56156 632319 641159 648357 656407 667259 679304 691193 704778 721496 739556 757513 777160 800215
56144 800215 825699 853325 885918 925673 971542 1023128 1083650 1156201 1240579 1336550 1446440
56133 1446440 1571129 1706553 1846748 1986694 2119619 2236124 2330372 2404575 2464727 2515292
56123 2515292 2560351 2604796 2649665 2689254 2716522 2728744 2725745 2707364 2676613 2641242 2607412
56112 2607412 2574089 2536233 2489500 2428787 2347354 2242825 2121378 1992281 1861496 1733664
56102 1733664 1615534 1512263 1423456 1347004 1283581 1233539 1193318 1159350 1132158 1112546 1097545
56091 1097545 1084327 1074258 1068731 1064908 1060031 1055976 1054996 1055002 1053738 1053421 1056253 1059520 1060371 1061466 1066444
56076 1066444 1073610 1079527 1085114 1092826 1101487 1109411 1118934 1132472 1147698 1161883 1177112 1195820 1215368
56063 1215368 1232621 1249691 1269324 1288946 1305309 1320674 1338062 1354741 1366949 1376883 1388357
56052 1388357 1399753 1408082 1415872 1427012 1439836 1451261 1463642 1480369 1498876 1515403 1532487 1554314
56040 1554314 1578795 1601828 1625213 1652629 1681976 1709544 1737476 1769221 1802124 1832671 1864370
56029 1864370 1901933 1942324 1980274 2017875 2059701 2103415 2144714 2186692 2234462 2285242 2333723
56018 2333723 2382440 2436561 2493368 2547577 2602224 2663298 2728482 2792470 2858471 2932764 3012743
56007 3012743 3092362 3174446 3265330 3362382 3459597 3560443 3671951 3791235 3911517 4036324
55997 4036324 4173642 4321258 4472454 4630879 4804682 4991271 5183316 5384156 5601171
55988 5601171 5829917 6061737 6301038 6557676 6829065 7108527 7404491 7731626 8089773
55979 8089773 8472205 8887361 9350429 9860984 10412385 11015737 11690189 12437976 13255622
55970 13255622 14161523 15184923 16337376 17625992 19086052 20769891 22716934 24972006
55962 24972006 27620698 30765055 34475962 38814931 43893532 49870502 56918536 65266186
55954 65266186 75273216 87418682 102249627 120421531 142757744 170159151 203415806
55947 203415806 242977919 288327573 336690256 382005414 415893752 431010496 424612426
55940 424612426 399516699 361964283 318535052 274324900 232674913 195488887 163531329
55933 163531329 136757956 114704983 96746653 82186564 70341935 60651757 52693670
55926 52693670 46116139 40615449 35971246 32038393 28689510 25801599 23291342 21113972
55918 21113972 19221046 17553970 16076877 14777846 13635036 12613213 11693638 10875931
55910 10875931 10148931 9487976 8881753 8334741 7841766 7385232 6958633 6568915 6214236
55901 6214236 5881762 5568583 5283302 5025506 4783778 4555121 4346941 4158716 3980479
55892 3980479 3810709 3657808 3522551 3396299 3277800 3174936 3088397 3009874 2938129 2881373
55882 2881373 2842098 2814627 2799444 2805357 2835245 2883140 2946761 3028830 3123284 3212681 3281438
55871 3281438 3320506 3319219 3266854 3165621 3030821 2875854 2707148 2533657 2368144 2216202
55861 2216202 2074987 1944944 1832054 1736711 1651427 1572226 1502296 1442302 1387225 1335257 1290201
55850 1290201 1252644 1217751 1183775 1153746 1127007 1098296 1067114 1039010 1015588 992148 967077
55839 967077 944610 926139 907628 887952 871122 857867 843481 826515 811260 799049 785380
55828 785380 768553 753130 741673 730630 717543 705086 694853 684049 671357 659468 649063
55817 649063 636856 622317 609841 601519 594172 586064 580106 577631 575415 571832 569932 571523 574104
55804 574104 576451 581437 590466 600695 610531 622276 636537 649519 658627 665456 670486 670231 662661
55791 662661 650476 636283 619396 600014 581512 565789 551079 537013 526991 522691 520709 517292
55779 517292 512104 505165 494907 481958 470333 462188 455666 450149 448895 453942 463081 474523 489634
55766 489634 507706 522496 527719 522767 510402 492606 471563 450954 432907 416357 400552 387048
55754 387048 376404 366608 356863 349233 344389 339513 332650 325416 319257 312950 306075 300919 298350 295638
55740 295638 291029 286803 285163 284759 283948 283769 284885 285121 282993 280380 278926 277129 273762 270752 269597
55725 269597 268092 263758 257652 251893 246260 240172 235217 232686 231070 228818 227127 227428 228657 229606 231410
55710 231410 235128 239452 243391 248477 255589 262166 265543 266613 267309 266752 262928 256184 248184 239139 228743
55695 228743 218234 209095 201169 194006 188351 184476 181072 177630 175727 176081 176700 175996 175341 176413 178421
55680 178421 180186 182592 186543 190654 193363 195191 196766 196884 194839 192338 190690 188353 183811 178712
55666 178712 175532 174147 173224 172981 173974 175088 175427 176452 179717 184180 188174 192284 197839 204234 210245
55651 210245 216291 222982 229063 233189 236084 238613 239436 237021 232374 227363 221941 215370 208579 202820
55637 202820 197498 191688 186212 181896 177477 171733 166071 162374 159841 156619 153125 150976 149898 148442
55623 148442 146739 145893 145520 144348 142499 140942 139556 137822 136432 136227 136489 136205 135892 136285 136567 135800
55607 135800 134763 134392 133889 132428 131134 131127 131143 129481 126863 124987 123734 122235 121212 121575 122062 120951
55591 120951 118942 117730 116984 115472 113925 113890 114732 114685 114023 114265 115046 114732 113586 113419 114409 115038 114898 114981
55573 114981 115416 115444 115465 116666 118696 119968 120229 120777 122222 123965 125661 127351 128499 128698 128859 129945
55557 129945 131130 131010 129863 128766 127366 124722 121588 119584 118690 117787 116950 116893 116865 115598 113837 113419
55541 113419 114209 114432 113697 113182 113020 112073 110368 109369 109650 110352 110994 111772 112124 111131 109315 108093 107518 106508
55523 106508 105073 104154 103396 101366 98065 95071 93031 91045 88703 86740 85535 84869 85271 87648 91403
55508 91403 94843 97582 100723 104555 108030 110734 113452 116436 118861 120382 121562 122458 122343 121135 119640
55493 119640 118199 116451 114484 112807 111276 109493 108099 108087 108991 109432 109252 109345 109576 108856 107369 106690 107328
55476 107328 107944 107411 106073 104620 103174 101852 100949 100263 99404 98756 98982 99724 100092 100155 100588 101212 101368 101358
55458 101358 101879 102466 102248 101831 102488 103776 104088 103403 103305 104227 104892 104731 104769 105699 107051 108609 110767 113034
55440 113034 114001 113305 112011 110707 108966 106971 105828 105773 105782 105454 105583 106402 106930 106648 106300 106463 106804 107165
55422 107165 107911 108745 108708 107851 107490 108397 110079 112190 115084 118564 121581 123606 124901 125097 123191 119539
55406 119539 116298 115094 115427 115883 115734 114842 113205 111185 109276 107381 105220 103363 102690 102951 103164 103284
55390 103284 103945 104704 104289 102676 101186 100386 99618 98761 98634 99362 100116 100724 101759 102789 102515 101035 100048
55373 100048 100291 100705 100672 101056 102285 103358 103627 103765 104089 103723 102400 101406 101677 102496 103070 103827 105108 106011
55355 106011 105674 104512 103307 102224 101472 101617 102474 102952 102703 102576 102861 102643 101633 100984 101347 101721 101274
55338 101274 100772 101032 101378 100911 100106 99902 100253 100659 101173 101887 102338 102316 102368 102753 102948 102838 103214 104389 105532
55319 105532 106097 106632 107426 107750 107259 106745 106523 105560 103325 101138 100411 100708 100767 100374 100028 99776 99539 99724
55301 99724 100460 101070 101205 101570 102643 103726 104166 104413 104949 105264 104897 104397 104276 104157 103905 104386 105952 107395
55283 107395 107635 107289 107330 107355 106626 105744 105753 106346 106457 106021 105841 106285 107235 108669 110239 110970 110466 109684 109515
55264 109515 109466 108828 108139 108190 108519 108269 107768 107816 108116 107901 107581 108216 109708 110877 111105 110737 110143 109537 109418
55245 109418 110090 110934 111148 110917 111017 111573 112106 112393 112419 111916 110827 109821 109524 109649 109636 109593 109847 110183 110341
55226 110341 110612 111127 111212 110337 109061 108203 107778 107574 107852 108550 108703 107830 107007 107326 108116 108060 107307 106928 106936 106466
55206 106466 105609 105437 106298 107407 108111 108392 108275 107846 107737 108510 109674 110245 110025 109405 108367 106808 105459
55189 105459 105201 105675 105778 105404 105439 106106 106588 106372 105891 105714 106054 107094 108797 110341 110698 109919 109069 108858
55171 108858 109119 109608 110420 111472 112389 113097 113922 114994 116064 116939 117626 118110 118426 118890 119792 121050 122425
55154 122425 123783 124818 125016 124328 123373 122518 121449 120169 119575 120124 120647 119582 116969 114219 112258 110846
55138 110846 109489 108106 106921 106422 107152 108907 110555 111297 111605 112244 112997 113234 113064 112865 112286 110883 109332
55121 109332 108801 109372 110168 110735 111175 111218 110381 109021 108146 108149 108635 109352 110327 111225 111535 111373 111295 111395 111417 111584
55101 111584 112387 113616 114457 114527 114162 113823 113901 114823 116620 118619 120208 121557 122900 123704 123424 122569 122012
55084 122012 121716 121147 120488 120286 120269 119716 118784 118272 118298 118275 118026 117849 117690 117329 117135 117520 117967 117784 117513 118224
55064 118224 119593 120109 119186 117769 116740 116009 115310 114722 114212 113697 113628 114501 115795 116440 116303 116103 116032 115750
55046 115750 115623 116471 117951 118638 118037 117204 117043 117305 117678 118543 120071 121682 122944 124036 124878 124884 124047 123304
55028 123304 123304 123673 123852 123749 123175 121685 119500 117647 116675 116094 115531 115481 116330 117542 118475 119262 120291 121456
55010 121456 122504 123505 124432 124882 124702 124373 124354 124530 124672 124845 125021 124920 124581 124557 125127 125874 126392 126872 127581
54991 127581 128270 128496 128164 127465 126680 126222 126425 127104 127740 128221 128941 130087 131328 132264 132694 132463 131693 131127
54973 131127 131517 132582 133279 133207 133013 133304 133971 134785 135836 137040 137856 137869 137223 136309 135488 135179 135606 136413
54955 136413 137104 137855 139195 140962 142380 143191 143818 144341 144264 143507 142767 142503 142329 141742 140766 139647 138584
54938 138584 138005 138400 139573 140672 141178 141371 141737 142582 144205 146737 149759 152806 156233 160805 166502 172681
54922 172681 179389 187474 197230 207976 219110 230477 241406 250453 256475 259136 258212 253493 245648
54909 245648 236097 225688 214548 203423 193814 186231 179600 173108 167472 163594 161005 158610 156164
54896 156164 154177 152993 152696 153238 154067 154284 153782 153566 154492 156432 159038 162303 165775 168357 169792 171540
54880 171540 175292 181292 188815 197450 207003 216922 226734 236447 245624 252653 255855 254877 250360 242958
54866 242958 233529 223542 214102 204894 195074 184909 175694 168317 162719 158534 155472 153253 151766 151081
54852 151081 150799 149818 147389 144114 141253 139380 138263 137605 137140 136335 134793 132869 131393 130843 131133 131869
54836 131869 132508 132634 132436 132469 132680 132375 131499 131064 131694 132609 132893 132968 133766 135047 135706 135411 134868 134663 134780
54817 134780 135117 135555 135579 134697 133222 131940 131103 130405 129785 129474 129381 129238 129299 130139 131698 133199 134090 134487
54799 134487 134645 134623 134543 134649 134983 135440 136179 137470 139054 140124 140104 139136 137726 136265 135000 134184 134075 134837
54781 134837 136455 138681 141147 143571 145766 147576 149110 151032 154110 158390 163251 168425 174331 181187
54767 181187 188472 195798 203791 213453 224840 236772 247595 255934 261075 263097 262471 259320 253405 244970
54753 244970 235078 224765 214386 204209 195077 187880 182715 179037 176307 174091 171954 169828 168202
54740 168202 167488 167443 167561 167746 168206 169005 170085 171403 172747 173779 174545 175620 177523 180407 184383 189503
54724 189503 195292 201163 207530 215578 225437 235570 244478 251911 257583 259931 257518 251040 242657 233798
54710 233798 224705 215609 207000 198904 191085 183908 178046 173444 169527 166315 164292 163159 161799 159670
54696 159670 157434 155942 155253 154783 153896 152338 150556 149498 149563 149912 149423 148163 147169 146995 147207 147307 147305 147310
54678 147310 147269 147208 147189 146926 146013 144617 143450 142983 143076 143325 143382 143016 142349 141950 142308 143244 144180 144757 144848 144339
54658 144339 143386 142632 142629 143264 144187 145367 146667 147306 146642 145272 144557 145096 146249 147029 146912 145940 144668 143872
54640 143872 143816 144055 144336 145148 146758 148320 148905 148904 149325 150025 149823 148277 146218 144542 143570 143639 145158 147694
54622 147694 149928 150931 150898 150436 149844 149264 148858 148603 148426 148588 149362 150422 151216 151855 152840 154004 154634 154684
54604 154684 154905 155591 156139 156133 155962 156030 156161 156216 156596 157689 159310 161029 162559 163626 164001 163896 163817 163885 163838
54585 163838 163780 164270 165500 167056 168634 170288 171814 172711 173097 173849 175400 177072 178136 178859 179903 181175
54569 181175 181954 181858 181121 180113 179081 178286 178030 178496 179647 181268 183070 184909 186729 188136 188367 187220
54553 187220 185785 185572 186941 189024 191087 193128 195024 196049 195788 194883 194422 194988 196550 198787 201150
54538 201150 203100 204670 206431 208664 210919 212696 214047 215177 215892 215859 215111 213928 212472 210897 209580
54523 209580 208886 208774 208842 208661 208002 206945 205917 205389 205344 205168 204232 202555 200928 200393 201379 203136 204251
54506 204251 203982 202879 201833 200905 199623 198099 197114 197140 197857 198666 199193 199380 199596 200535 202436 204516 205825
54489 205825 206506 207506 209212 211206 213321 215908 218938 221800 224309 227074 230434 233768 236234 237642
54475 237642 238310 238757 239812 242215 245648 248842 251112 253114 255593 258127 259798 260574 261231 262149 262915 262985
54459 262985 262280 261217 260484 260573 261180 261307 260346 258846 257850 257659 257587 256838 255235 253143 251000 249062 247435
54442 247435 246184 245225 244149 242364 239674 236595 233895 232024 231063 230850 230770 229864 227781 225344 223588 222483
54426 222483 221341 220173 219719 220179 220896 221417 221953 222620 223110 223395 223888 224556 224700 224022 223116 222405 221376 219481
54408 219481 217170 215381 214444 214066 214010 214245 214722 215499 216830 218692 220460 221421 221528 221428 221886 223199 224866
54391 224866 225833 225456 224332 223744 224233 225168 225743 225762 225381 224713 223960 223335 222655 221563 220334 219877 220659 222200
54373 222200 223785 225067 225797 225740 225237 225158 225838 226631 226901 226906 227304 228296 229647 231060 232085 232171 231254 229932
54355 229932 228736 227548 225980 223931 221594 219349 217719 216901 216285 214990 212982 211032 209600 208502 207652
54340 207652 207124 206417 204775 202504 200811 199984 198941 197152 195635 195278 195407 195082 194739 195242 196116 196045 194719
54323 194719 193065 191908 191335 191099 190857 190250 189470 189387 190460 191946 192809 192945 192808 192445 191710 191022 191018 191709
54305 191709 192708 193876 195143 196088 196393 196286 195934 194902 192943 190761 189243 188456 188078 188136 188440 188018 186179
54288 186179 183585 181232 179006 176390 173990 172903 172875 172553 171480 170515 170248 170303 170379 170752 171510 172260 172869
54271 172869 173599 174378 174847 175208 176094 177426 178315 178314 177904 177564 177262 177096 177560 178816 180374 181795 183103 184284
54253 184284 185045 185310 185349 185248 184809 184066 183286 182381 180978 179177 177555 176366 175438 174898 175151 175939 176262 175585
54235 175585 174442 173568 173067 172741 172579 172564 172571 172756 173432 174260 174202 172705 170406 168316 166807 165751 165105 164889
54217 164889 165016 165600 167053 169408 171803 173116 172995 172034 171064 170490 170192 169879 169576 169708 170514 171527 172091
54200 172091 172228 172517 173090 173441 173347 173276 173483 173340 172150 170340 169194 169440 170456 170949 170221 168765 167731
54183 167731 167782 168501 168996 168913 168623 168502 168440 168173 167738 167364 167096 166773 166337 166004 166006 166142 165730 164260 162103 160260
54163 160260 159316 158985 158836 158974 159649 160582 161209 161335 161081 160468 159543 158759 158711 159522 160854 162309 163451 163753
54145 163753 163139 162409 162518 163505 164618 165356 165907 166617 167642 169068 170840 172585 173945 175024 176100 176993
54129 176993 177200 176576 175477 174389 173743 173829 174353 174441 173658 172694 172406 172548 172260 171460 170881 170939 171467 172401 173731
54110 173731 174886 175227 175123 175527 176387 176612 175756 174616 173862 173183 172250 171517 171443 171734 171947 172186 172691 173345
54092 173345 173976 174579 174970 174890 174710 175232 176375 176928 176078 174438 173085 172386 172343 173210 174961 176741 177690 177863
54074 177863 177728 177311 176540 175908 175976 176623 177429 178445 179811 181012 181386 181150 181142 181606 181995 181904 181511 181065 180529
54055 180529 179873 179300 179092 179604 181304 184378 188227 191750 194259 195960 197565 199594 202036 204507 206780
54040 206780 209235 212607 217216 222731 228858 235914 244485 254873 267231 281767 298094 314405 327901
54027 327901 336360 339254 337494 332489 325536 317726 309978 302963 296934 291743 287158 283188 280002 277559
54013 277559 275453 273179 270499 267609 264975 262821 260646 257614 253687 250020 247674 246230 244322 241338
53999 241338 237811 234238 230504 226716 223645 221806 220722 219622 218337 217049 215742 214434 213504 213132 212762
53984 212762 211700 210020 208386 207163 206213 205416 204895 204739 204860 205070 205057 204452 203208 201816 200861 200460 200300
53967 200300 200108 199861 199708 199849 200394 201186 201938 202612 203451 204572 205796 206946 207980 208722 208925 208782 209001
53950 209001 210050 211685 213466 215409 217846 220884 224288 227673 230636 233060 235445 238582 242660 247059
53936 247059 251303 255745 260968 266891 272899 278513 283478 287391 289730 290238 289047 286584 283554 280748
53922 280748 278575 276904 275583 274873 275177 276583 278918 282023 285757 289933 294460 299348 304464 309613 315009
53907 315009 321282 328759 337019 345327 353134 360026 365620 369868 373024 375017 375215 373181 369371 364789
53893 364789 360236 356077 352278 348303 343428 337608 331744 326725 322486 318351 313968 309471 305053 300904
53879 300904 297415 295020 293920 294166 295828 298885 303212 308930 316410 325604 335544 344606 351014 353065
53865 353065 349617 340933 328787 315399 302385 290675 280695 272245 264726 257931 252174 247393 242860
53852 242860 238245 234252 231566 229774 228088 226525 225509 224773 223646 222234 221347 221281 221432 221194 220609 220068
53836 220068 219848 219955 220024 219482 218181 216744 215889 215680 215827 216321 217234 218172 218652 218754 218842 218795 218214 217215 216376
53817 216376 215968 215802 215734 215741 215653 215378 215270 215693 216325 216497 216111 215720 215860 216862 219076 222492 226303 229605
53799 229605 232574 236246 241127 246677 252156 257264 261873 265860 269406 272910 276432 279677 282534 285099
53785 285099 287134 288143 288099 287577 287068 286657 286432 286598 287019 287132 286485 285050 283025 280762 278755 277180 275553
53768 275553 273409 271159 269564 268496 267153 265508 264505 264527 264657 263950 262604 261245 259834 257973 255787
53753 255787 253680 251586 249141 246462 244093 242248 240637 239021 237451 235922 234232 232375 230859 230379
53739 230379 231191 232867 234689 236178 237202 237673 237481 236824 236208 235857 235450 234807 234517 235271 236745 237851 238123
53722 238123 238219 238860 239879 240608 240760 240548 240221 239843 239447 239197 239448 240575 242597 245041 247440 249879 252736
53705 252736 255930 258865 261152 262998 264805 266728 268725 270735 272758 274991 277871 281611 285707 289293
53691 289293 292019 294210 296197 297975 299573 301222 303010 304750 306349 307912 309343 310269 310546 310496 310469 310519
53675 310519 310645 310939 311279 311264 310738 310075 309730 309760 309983 310333 310804 311260 311550 311665 311624 311310 310560 309292 307531
53656 307531 305469 303499 302014 301155 300895 301141 301478 301011 299050 295986 293016 290921 289548 288555 288038 288126
53640 288126 288425 288301 287577 286657 286098 286199 286834 287578 288087 288351 288506 288568 288690 289474 291433 294101 296251 297213
53622 297213 297539 298166 299368 300879 302583 304648 307106 309746 312397 315138 318185 321637 325337 329002 332557
53607 332557 336199 340042 343892 347624 351508 355752 359957 363549 366667 370005 373745 377298 380204 382682
53593 382682 384993 386865 387962 388542 389187 390076 390867 391164 390857 390099 389167 388274 387432 386590 385860 385403 385062 384382
53575 384382 383086 381413 379972 379377 379959 381584 383776 386069 388098 389385 389547 389093 389476 391672 394980
53560 394980 397898 399928 401692 403416 404331 403744 401884 399438 396946 394974 394132 394473 395346 396208 397175 398513
53544 398513 400093 401673 403317 405161 407120 409136 411436 414341 418017 422540 427930 434110 441135 449381
53530 449381 459107 469932 481235 492916 505220 518053 531316 545759 562411 581009 600001 618405
53518 618405 636694 655578 675034 695151 716902 741254 768264 797699 829758 864332 900286
53507 900286 936381 972429 1008748 1045021 1080616 1115655 1150753 1185962 1220911 1255891 1291986
53496 1291986 1330029 1370053 1411715 1454654 1498365 1542190 1585554 1627876 1668381 1706317 1741344
53485 1741344 1773466 1802777 1829524 1854135 1876957 1898278 1918925 1940376 1963789 1989172 2015789
53474 2015789 2042953 2069966 2095771 2119337 2140190 2158092 2172566 2183282 2190524 2194530 2194494 2188890
53462 2188890 2176822 2158642 2135480 2108722 2079855 2050121 2019968 1988959 1956165 1920653 1881988
53451 1881988 1840625 1797633 1753852 1709703 1665902 1623631 1583425 1544429 1505334 1465587 1425197
53440 1425197 1384143 1342929 1303236 1266864 1234146 1204264 1176954 1152907 1132597 1115774 1102258
53429 1102258 1092257 1085642 1081768 1080459 1082508 1088788 1099346 1113626 1131077 1151208 1173537 1197887
53417 1197887 1224514 1253674 1285268 1318991 1354533 1391587 1429977 1469972 1512170 1556910 1603915
53406 1603915 1652602 1702636 1754309 1808590 1866695 1929274 1996045 2066460 2140534 2218716 2301092
53395 2301092 2387108 2475950 2566783 2658710 2751067 2843862 2937657 3032980 3130014 3228602 3328059
53384 3328059 3426920 3523199 3614996 3700872 3780165 3853475 3922637 3989499 4054624 4117376 4177050
53373 4177050 4233509 4287036 4338175 4387538 4434989 4478899 4516607 4545399 4562445 4564111 4546563
53362 4546563 4507723 4448339 4371163 4279711 4177867 4069595 3958041 3844830 3730380 3614744
53352 3614744 3498159 3381264 3265083 3150627 3038409 2928511 2820992 2715770 2612117
53343 2612117 2508848 2405300 2301866 2199599 2099694 2003332 1911462 1824427 1742142 1664767
53333 1664767 1592862 1526824 1466620 1412202 1363719 1321185 1284384 1253258 1227875 1207732 1191505
53322 1191505 1177840 1166172 1156534 1148955 1143329 1139564 1137513 1136898 1137553 1139669 1143621 1149643 1157660 1167292
53308 1167292 1178062 1189861 1203136 1218256 1234816 1252154 1270588 1291499 1315852 1343219 1372612
53297 1372612 1403841 1437480 1473809 1512376 1552568 1594199 1637498 1682758 1730001 1778833 1828658
53286 1828658 1879004 1929448 1979160 2026878 2071673 2113650 2153745 2193029 2232320 2272087 2312217
53275 2312217 2351743 2389058 2422513 2450851 2473334 2489794 2500590 2506247 2506912 2502085 2490868 2472505
53263 2472505 2446664 2413306 2372416 2324141 2269302 2209523 2146551 2081380 2014166 1944979 1874461
53252 1874461 1803846 1734573 1667926 1604754 1545369 1489685 1437411 1387960 1340255 1292865 1244525
53241 1244525 1194577 1143028 1090286 1036726 982433 927497 872709 819729 770284 725234 684617
53230 684617 648394 616766 589789 566979 547465 530373 515170 501826 490602 481463 473715 466379
53218 466379 458843 451043 443164 435426 428027 421025 414312 407865 401857 396355 391142 386084 381375 377105
53204 377105 372813 367917 362426 356858 351628 346887 342709 338900 334821 329999 324852 320317 316784 313892
53190 313892 311263 308869 306691 304671 302983 301805 300703 298887 296275 293727 292011 290987 289995 288604
53176 288604 286772 284741 283028 282182 282250 282708 282963 282649 281463 279284 276637 274542 273605 273529 273663 273658 273440 272974
53158 272974 272377 271940 271804 271774 271515 270742 269219 266968 264517 262502 260928 259224 257173 255257 253911 252968
53142 252968 252171 251764 252118 253011 253757 253949 253795 253757 254096 254764 255636 256734 258124 259538 260383 260405 260158 260428
53124 260428 261300 262220 262866 263492 264416 265641 267018 268371 269398 269815 269595 268787 267268 265109 262955 261370
53108 261370 260017 258219 256184 254765 253919 252415 249406 245541 242154 240081 239573 240480 241938 242581 241795
53093 241795 240386 239558 239592 239903 239926 239486 238693 237915 237566 237589 237460 236975 236594 236771 237427 238394 239811 241686 243515
53074 243515 244767 245352 245363 244854 244208 244143 244859 245672 245913 245699 245417 245027 244409 243897 243820 243938 243859 243635 243463 243158
53054 243158 242457 241465 240345 239014 237627 236852 237067 237721 238014 237780 237078 235519 232835 229750 227396 225987
53038 225987 224773 223156 221200 219233 217577 216547 216144 215899 215475 215147 215094 214651 213005 210429 208115 206889
53022 206889 206704 207164 207803 208009 207477 206725 206527 206937 207449 207913 208547 209157 209142 208298 206983 205586 204464 204212
53004 204212 205139 206526 207251 207164 207013 207052 206709 205754 204823 204426 204351 204421 204960 206041 207072 207732 208552 209857 210776
52985 210776 210200 208428 207032 207153 208542 210204 211446 212143 212469 212605 212611 212511 212466 212704 213212 213692 213963 214251
52967 214251 214925 216107 217647 219338 220952 222232 223075 223668 224256 224787 224900 224335 223233 221979 220820 219750
52951 219750 218779 218078 217621 216904 215419 213480 212094 211785 211889 211325 209797 207912 206444 205819 206023 206580 206758
52934 206758 206292 205739 205721 205924 205407 203860 202053 200964 200887 201444 202064 202286 201943 201304 200872 200889 201111 201112 200776
52915 200776 200464 200726 201748 203094 204196 205004 205862 206728 207079 206775 206441 206588 206848 206577 205779 204874 203951 202886
52897 202886 201946 201621 202027 202955 204286 205847 207170 208001 208750 209776 210626 210777 210773 211558 212813 213050 211512
52880 211512 209014 206705 204944 203713 203253 203724 204754 205768 206403 206509 206220 206134 206817 208012 208931 209381 209869
52863 209869 210554 211039 211463 212784 215392 218276 220282 221515 222741 223915 224171 223026 220900 218531 216402
52848 216402 214695 213326 211978 210287 208003 204988 201377 197807 195139 193813 193774 194927 197073 199323 200396
52833 200396 199880 198658 197680 196942 196079 195273 194977 195255 196057 197624 199852 201684 201985 200947 199896 199774 200427
52816 200427 201277 201999 202487 202846 203607 205481 208627 212461 216379 220402 224891 229679 233640 235202 233491
52801 233491 229107 223652 218487 214088 210513 207902 206221 204978 203765 202787 202401 202315 201820 200740 199644
52786 199644 199002 198599 197921 196867 195869 195458 195857 196899 198262 199690 200926 201599 201530 201215 201571 202929 204547
52769 204547 205414 205255 204478 203492 202518 201815 201521 201297 200653 199652 198916 198851 199250 199747 200301 201004 201685 202006 201862
52750 201862 201513 201261 201121 200890 200535 200347 200566 200939 200909 200317 199665 199589 200230 201209 202056 202493 202560 202586 202911 203506
52730 203506 204043 204377 204676 204968 204990 204764 204927 205988 207408 207938 206894 204809 202782 201508 200991 200923 201112
52713 201112 201539 202100 202404 202006 200864 199390 198023 196949 196248 196001 196068 196103 196061 196418 197537 198971 199798 199624
52695 199624 198990 198761 199343 200481 201650 202520 203065 203265 202925 202019 201121 201029 201860 202896 203511 203893 204611 205848
52677 205848 207361 208842 209933 210235 209741 209086 208966 209422 210008 210404 210514 210246 209698 209318 209360 209395 208966 208552
52659 208552 209099 210579 211854 212208 212271 212938 214024 214700 214921 215618 217430 219785 221510 221997 221514 220583 219412
52642 219412 217977 216357 214758 213263 211816 210515 209672 209422 209421 209185 208623 208076 207921 208380 209670 212000 215198
52625 215198 218498 220917 221900 221552 220331 218641 216773 215083 213970 213578 213667 213906 214160 214362 214335 214073 214034
52608 214034 214680 215702 216110 215297 213662 212068 211068 210843 211420 212565 213729 214511 215029 215572 216126 216529 216828
52591 216828 217097 217107 216667 216157 216216 216872 217398 217143 216250 215422 215153 215294 215266 214773 214311 214778 216449 218584 220272
52572 220272 221353 222143 222632 222547 222065 221768 221741 221334 220170 218912 218599 219408 220527 221249 221789 222824 224394
52555 224394 225662 225862 225253 224716 224522 223972 222442 220333 218613 217783 217717 218250 219297 220449 221015 220685 219875
52538 219875 219259 219160 219382 219444 218953 218007 217192 217020 217414 217936 218381 218813 219221 219536 219972 220822 221888 222519 222343
52519 222343 221643 220943 220579 220810 221838 223465 225063 226210 227184 228566 230495 232534 234147 235141 235692 236079
52503 236079 236319 236069 234993 233299 231699 230755 230411 230222 229813 229068 228091 227135 226407 225837 225249 224829 225145 226469
52485 226469 228349 230102 231536 232805 233724 233789 233042 232495 233300 235589 238427 240878 242755 244265 245293 245492
52469 245492 244955 244360 244283 244652 245113 245703 246859 248869 251519 254290 256666 258326 259279 259826 260221 260288 259559
52452 259559 257823 255458 253159 251399 250144 249045 247862 246759 246098 245951 245931 245574 244743 243590 242336 241261
52436 241261 240734 240968 241742 242568 243036 242894 241978 240369 238580 237255 236612 236391 236348 236558 237147 237925 238426 238289
52418 238289 237610 236905 236652 236810 236950 236875 236935 237631 239177 241617 244954 248858 252597 255796 259083 263473 269244
52401 269244 275957 283379 291574 299903 306689 310370 310647 308159 303478 296884 288923 280686 273435 268074
52387 268074 264808 263127 262185 261417 260756 260268 259784 259098 258379 258125 258677 259876 261171 262096 262730 263648 265297
52370 265297 267428 269326 270536 271110 271231 270996 270665 270689 271156 271568 271441 270943 270644 270808 271246 271733 272215 272662
52352 272662 273006 273266 273525 273771 273949 274082 274139 273883 273196 272570 272832 274177 275736 276474 276348 276274 277010 278493
52334 278493 280351 282591 285417 288622 291702 294609 297959 302255 307237 312269 317173 322315 327961 333902
52320 333902 339794 345541 351178 356498 361046 364526 367114 369294 371375 373295 374982 376763 379154 382218
52306 382218 385390 388065 390185 392192 394667 398125 402768 408127 413201 417323 420784 424315 428135 431820
52292 431820 434860 436887 437615 437145 436337 436240 436995 437749 437833 437522 437458 437767 438102 438173 437879 437211 436427 436179 437093
52273 437093 439262 442285 445634 448732 451018 452356 453377 455027 457776 461502 465998 471071 476059 479817
52259 479817 481715 482472 483596 485977 489294 492731 495899 498973 502314 506190 510569 514948 518609 521331
52245 521331 523603 525843 527791 529148 530413 532286 534425 535834 536578 537977 540601 543192 544493 545250 547213
52230 547213 550665 554270 557150 559745 562487 564916 566665 568289 570385 572632 574431 576062 578490 582257
52216 582257 587000 591908 596263 599800 602947 606533 610913 615539 619719 623530 627633 632314 637110 641363
52202 641363 644842 647805 650668 653665 656738 659746 662728 665781 668780 671563 674485 678336 683370 688726
52188 688726 693194 696416 698959 701314 703255 704251 704096 702931 700786 697476 693092 688439 684662 682239 680481
52173 680481 678252 675151 671818 669168 667590 666862 666533 666267 666034 666029 666297 666547 666611 666910 668074 670086 672195
52156 672195 673689 674371 674274 673472 672298 671320 670849 670918 671811 674034 677490 681244 684556 687654 690978 694170
52140 694170 696408 697462 697743 697460 696379 694404 691863 689161 686595 684555 683501 683594 684730 687012 690815
52125 690815 696270 702966 710425 718635 727898 738238 749171 760058 770460 780013 788078 793865 797125
52112 797125 798524 798960 798633 797179 794695 791966 789431 786542 782757 778770 776087 775511 776661 778960 782424
52097 782424 787227 793050 799234 805236 810549 814328 815577 813803 809328 802948 795525 787946 781161 775880
52083 775880 772169 769574 767762 766899 767299 768870 771068 773286 775019 775836 775524 774361 773024 772087 771689 771609
52067 771609 771527 771262 771006 771297 772479 774217 775766 776714 777238 777743 778549 779838 781469 782909 783800 784525 785664
52050 785664 786853 786892 785144 782192 778806 774972 770445 765704 761635 758560 756118 753910 751795 749823 748374
52035 748374 748153 749520 751888 754219 756008 757393 758422 758785 758253 756976 755278 753452 751729 750085 748047
52020 748047 745070 741228 737365 734467 732983 732705 733175 734159 735778 738063 740465 742055 742303 741338 739322
52005 739322 735975 730994 724466 716454 706523 694330 680613 667027 654889 644335 634772 625811 617643
51992 617643 610557 604233 597684 590202 582281 575140 569234 563701 557439 550208 542390 534366 526591 519610
51978 519610 513220 506050 496882 486209 475808 466956 459811 454290 450583 448668 448214 449220 452194 457409
51964 457409 464441 472576 481247 489993 498500 506839 515139 522869 528856 532153 532571 530372 526022 520349
51950 520349 514380 508730 503471 498683 494649 491486 489245 488628 491015 497237 506666 517900 530098 543259
51936 543259 557408 571951 585782 597810 607369 614276 618534 620082 618932 615355 609640 601752 591528
51923 591528 579100 564826 549005 532241 515871 501254 488507 476663 465275 455109 446934 440392
51911 440392 434638 429509 425404 422540 421053 421482 424310 429103 434856 441204 448664 457488 466863 475507
51897 475507 482711 488457 492775 495339 495762 494200 491597 489356 488786 490927 496794 507375 523068 543067
51883 543067 565339 586976 604555 614801 615920 608739 596368 582448 569594 559170 551828 547693
51871 547693 546091 545585 544599 542017 537234 529894 519895 507683 494373 481319 469448 458875 449156
51858 449156 439965 431637 425026 420751 418661 418102 418559 419692 420857 421080 419772 417186 413888 410034 405439
51843 405439 400182 394743 389539 384625 379914 375527 371809 369059 367284 366299 366137 367212 369771 373243 376613
51828 376613 379535 382554 385944 388860 390151 389693 388397 387127 386116 385304 384710 384444 384682 385612 387171 389110
51812 389110 391537 394973 399369 403435 405590 405369 403332 399947 395417 390388 385857 382194 378991 375974
51798 375974 373325 371056 368887 367004 366078 366170 366333 365747 364664 363795 363349 363148 363214 363690 364462 365189 365485 364923
51780 364923 363311 361178 359470 358472 357600 356531 355910 356434 357843 359471 361316 363960 367761 372738 378941
51765 378941 386242 393937 401185 407634 413070 416611 417079 414284 409370 403744 398066 392344 386518 380701
51751 380701 375181 370420 366848 364473 362784 361162 359390 357750 356733 356620 357325 358620 360506 363289 367279
51736 367279 372490 378611 385186 391925 398987 406739 414867 421934 426437 428414 429473 431108 433556 436515
51722 436515 440168 444764 449564 452940 453560 451203 446557 440681 434601 429068 424590 421583 420141 419517 418309
51707 418309 415612 411821 408069 405221 403809 404456 407584 412533 417465 420421 420537 418414 415488 412933 411037
51692 411037 409702 409404 411103 414975 419733 423552 425304 424612 421346 415835 409239 402949 397578 393066 389661
51677 389661 388146 388967 391570 394759 397466 399193 400016 400236 399917 398913 397508 396714 397652 400813 406151 413407
51661 413407 421819 429830 435793 438935 439327 437212 432975 427537 422011 416998 412805 410229 410321 413318 418496
51646 418496 425135 432793 440346 445607 446596 442873 435373 425357 413924 402125 390917 380981 372754
51633 372754 366459 361895 358480 355767 353771 352628 352162 351992 351962 352269 353269 355220 358042 361259 364363
51618 364363 367252 370056 372500 373810 373419 371483 368515 364894 360955 357217 354073 351335 348468 345329
51604 345329 342429 340425 339499 339267 339220 339226 339640 340973 343504 347250 352170 358316 365890 375312 386957 400383
51588 400383 413827 424938 432204 435511 435487 432960 429158 425691 423628 422927 423324 425415 430230 437964 447989
51573 447989 460034 474378 490511 506689 521729 536681 553658 573109 593154 611668 628127
51562 628127 643269 658132 674336 694554 721422 755800 796665 842393 891178 940058 984664
51551 984664 1020818 1046280 1060702 1064354 1057357 1039930 1012864 977655 936314 890932 843265 794754
51539 794754 746840 700961 658186 619182 584560 554824 529818 508708 490831 476165 464685
51528 464685 455695 448255 441983 436977 433184 430235 427767 425496 423121 420477 417702 415013 412517 410351
51514 410351 408679 407242 405312 402479 399172 396012 393053 390075 387192 384545 381750 378349 374562 370925
51500 370925 367434 363793 360395 358166 357420 357589 358119 358904 359776 360379 360822 361744 363465 365722 368468 372234
51484 372234 377229 382618 387202 390444 392409 393133 392593 391077 389076 386839 384271 381220 377623 373494 368950
51469 368950 364281 359924 356328 353663 351501 348998 345760 342425 339976 338566 337504 336358 335507 335432 336003
51454 336003 336688 337105 337181 337108 337339 338326 340123 342524 345588 349707 355225 362495 372206 384965 400249 416277
51438 416277 431066 443206 451718 456143 457236 456954 457165 458654 461397 464855 467484 466875 461506 452181
51424 452181 441177 430264 420052 410707 402364 395038 388834 384133 380940 378286 375079 371470 368601
51411 368601 367030 366180 365452 365043 365319 366058 366782 367433 368289 369570 371452 374225 378018 382466 386912 390901
51395 390901 394365 397500 400637 404156 408414 413760 420607 429306 439867 451977 465474 480753 498682
51382 498682 520197 545973 576329 611274 650686 694520 742908 796013 853675 914899 977428
51371 977428 1037825 1092211 1137166 1170214 1189822 1195313 1186862 1165485 1132819 1090695 1040737 984399
51359 984399 923576 861063 799934 742226 688571 639292 595426 558112 527318 501852 480575
51348 480575 462935 448324 435766 424698 415437 408251 402386 396711 391103 386440 383185 380702 378205
51335 378205 375741 373716 371930 369742 367120 364940 364101 364635 365814 366838 367324 367367 367280 367110 366413 364690
51319 364690 362073 359266 356745 354391 352063 350053 348602 347333 345701 343859 342575 342382 343196 344748 346816
51304 346816 349010 350767 351798 352203 352074 351342 350121 348786 347495 345980 344109 342306 341069 340294 339508
51289 339508 338695 338476 339431 341542 344426 347884 351982 356648 361376 365413 368243 369845 370582 370915 371166 371361
51273 371361 371153 370010 367632 364226 360426 357055 354849 354080 354329 354922 355742 357193 359175 360617 360563 359379
51257 359379 358209 357447 356449 354761 352841 351335 350270 349325 348447 347785 347333 347009 346898 347173 347836 348745 349804
51240 349804 351049 352556 354250 355726 356468 356478 356451 357002 357907 358576 359011 359700 360708 361642 362547 364039 366365
51223 366365 369007 371467 373801 376098 378157 380029 382173 384608 386496 387098 386638 385745 384583 383090 381580
51208 381580 380515 380061 380341 381649 383801 385790 386860 387562 389023 391374 393706 395320 396297 396931 397365 397797
51192 397797 398394 398992 399403 399919 400888 401941 402390 402343 402621 403507 404363 404705 404817 404972 404776 403812 402332 400723
51174 400723 398743 395914 392399 388903 385846 383136 380725 378818 377448 376237 374831 373281 371812 370424
51160 370424 368987 367643 366830 366877 367776 369433 371821 374702 377430 379402 380628 381602 382633 383632 384482 385205
51144 385205 385703 385735 385269 384483 383335 381530 379076 376438 373993 371805 370130 369510 369946 370520 370523 370543 371832
51127 371832 374797 378682 382573 386052 388987 391345 393351 395365 397439 399228 400397 400890 400894 400822 401230 402459
51111 402459 404432 406971 410089 413699 417272 420190 422235 423483 424066 424519 425927 429007 433143 436973 439884
51096 439884 442270 444379 445686 445717 444908 444215 444085 444142 443774 442834 441699 440636 439236 436805 433328 429651
51080 429651 426517 423925 421618 419534 417341 414374 410819 408324 408301 410004 411381 411626 411721 412519 413630 414499
51064 414499 415400 416815 418717 421077 424412 429285 435741 443603 452681 462255 470903 477408 481624 484314
51050 484314 486645 490045 495855 504555 515547 527844 540580 552882 564146 574739 585621 596674
51038 596674 605988 611420 612456 610234 606381 602304 598821 595485 590518 582155 570040 555112 538694
51025 538694 522237 507386 495325 486177 479571 475496 473935 474023 474527 475209 476888 480059 484126 488253
51011 488253 492310 496649 501386 506293 511214 516276 521705 527540 533574 539629 545979 553264 561812 571155
50997 571155 580412 589028 596998 604591 612130 619851 627711 635411 642776 649872 656512 661966 665552 667377
50983 667377 668177 668618 669060 669743 670741 671783 672474 672522 671395 668031 661479 651895 640482 628511 616856
50968 616856 606348 597890 591940 588357 586936 587633 590079 593406 597073 601581 607871 616135 625617 635618
50954 635618 646211 657826 670442 683526 696653 709874 723408 737276 751449 766207 782039
50943 782039 799216 817832 838378 862017 889896 921873 955685 987250 1012233 1028142 1035451 1036725
50931 1036725 1034531 1030232 1024422 1017777 1010978 1004073 996383 987104 975878 962898 948541 932822 915236
50918 915236 895451 874224 853233 833764 815826 798766 782359 767020 753273 741408 731389
50907 731389 722671 714342 705870 697611 690260 683971 678334 672971 667735 662481 657117 651836 646936 642470
50893 642470 638394 634859 631945 629253 626279 623097 620188 617707 615416 613305 611674 610488 609297 607991
50879 607991 607120 607158 607882 608772 609669 610756 612175 613978 616228 618853 621561 624152 626696 629214 631431 633242
50863 633242 635305 638758 644210 651233 658918 666777 674961 683719 692875 701953 710771 719799 729953 742043
50849 742043 756289 772160 788732 805488 822860 841786 862667 885032 908249 932078 956321
50838 956321 980460 1004181 1027865 1052014 1076449 1100696 1124924 1149686 1174788 1199321 1223008
50827 1223008 1246759 1271591 1297730 1325284 1355088 1388097 1424269 1462705 1502689 1543943 1585837
50816 1585837 1626937 1665462 1699889 1729040 1751890 1767514 1775270 1775185 1768200 1755732 1738632 1716809
50804 1716809 1690224 1660090 1628702 1598237 1570180 1545761 1526192 1512194 1503852 1501390 1505745 1517905
50792 1517905 1537887 1564874 1598370 1638812 1686939 1742738 1804976 1871398 1939272 2006028 2069680
50781 2069680 2128619 2181091 2225258 2260119 2286208 2305068 2318085 2325977 2329126 2327737 2321394 2308914
50769 2308914 2289043 2261161 2224942 2179557 2123789 2057347 1981904 1900608 1816570 1731837 1647742
50758 1647742 1565842 1488183 1416464 1351140 1291640 1237507 1189064 1146916 1111160 1081350 1056969
50747 1056969 1037512 1022210 1010158 1000844 994230 990230 988471 988725 991237 996357 1004129 1014601 1028319
50734 1028319 1046041 1067932 1093354 1121392 1151208 1181863 1212357 1242134 1271152 1299013 1324366
50723 1324366 1345772 1363178 1377992 1391554 1403975 1414650 1423343 1430342 1435884 1440018 1442840 1444384
50711 1444384 1444387 1442788 1440584 1439632 1441362 1446026 1453424 1463901 1478176 1496498 1518392 1543113 1569938
50698 1569938 1598044 1626442 1654106 1680025 1703286 1723421 1740677 1755667 1768762 1780174 1790685
50687 1790685 1801934 1815709 1833045 1854106 1878741 1906859 1938302 1972692 2009765 2049969 2094676
50676 2094676 2145729 2204871 2273706 2354076 2448045 2557135 2681450 2819351 2967632 3121811
50666 3121811 3276603 3426697 3567527 3695659 3808973 3906958 3990843 4063080 4126298 4182337
50656 4182337 4231768 4273893 4307188 4329924 4340441 4336896 4317199 4279752 4224501 4153200 4068789
50645 4068789 3974734 3874827 3773114 3673635 3580095 3495628 3422482 3361808 3313863 3278417 3254727
50634 3254727 3241096 3234792 3232667 3231871 3230167 3226169 3219654 3211414 3202354 3192837 3183139 3174024 3165648 3155218
50620 3155218 3136397 3102448 3050955 2985889 2915457 2848178 2790397 2745743 2715348 2698227 2692171
50609 2692171 2694818 2704003 2717402 2732507 2747140 2759610 2768122 2770316 2763626 2745937 2715920 2673206
50597 2673206 2618641 2554171 2482121 2404574 2323402 2240479 2157525 2076021 1997551 1923936 1856691
50586 1856691 1796512 1743448 1697261 1657260 1622372 1592055 1566953 1547996 1534924 1526334 1521098 1518965
50574 1518965 1519778 1522948 1528077 1535396 1545016 1556223 1568080 1580485 1594091 1609326 1625924 1643399
50562 1643399 1661659 1681224 1703217 1729216 1760887 1799569 1846242 1901885 1967699 2044877 2134032
50551 2134032 2234703 2345218 2462914 2584418 2705816 2822972 2932262 3031388 3119716 3198140
50541 3198140 3268866 3335053 3400033 3466438 3535873 3608997 3685273 3762503 3837182 3905915 3966747
50530 3966747 4019420 4065027 4105804 4144927 4185933 4232006 4285559 4347955 4419220 4498185 4583190
50519 4583190 4672550 4764140 4854695 4939894 5015152 5076246 5119488 5141896 5141393 5116813 5067773 4994817
50507 4994817 4899620 4784770 4653296 4508689 4355376 4198787 4044646 3898212 3764110 3646366
50497 3646366 3548125 3471361 3417140 3386109 3378340 3392444 3425059 3471436 3526458 3584878 3640688
50486 3640688 3686827 3716079 3722594 3702890 3655975 3583096 3487450 3373633 3246772 3111710 2972552
50475 2972552 2832457 2693645 2557791 2426587 2301753 2184298 2074079 1970577 1874095 1785803
50465 1785803 1706434 1635365 1571308 1513592 1462288 1417184 1377290 1341663 1310346 1284061 1263079
50454 1263079 1246676 1233587 1222680 1213212 1204877 1197819 1192376 1188545 1185826 1183749 1182423 1182350 1183789 1186616
50440 1186616 1190921 1197460 1207216 1220451 1236364 1253779 1272124 1291664 1312942 1336225 1361501 1388724
50428 1388724 1417916 1449282 1483386 1520900 1561790 1604932 1648962 1693501 1739137 1786366 1835134
50417 1835134 1885486 1938058 1993659 2052794 2115866 2183234 2254611 2328810 2404627 2481657 2559670
50406 2559670 2637388 2712508 2782961 2847674 2906168 2958045 3003076 3041339 3072797 3096716 3111461
50395 3111461 3114777 3104290 3078103 3035230 2975792 2901162 2814050 2718126 2617150 2514436 2413145
50384 2413145 2316564 2227626 2148318 2079890 2023290 1978879 1946058 1923980 1912586 1912169 1921784 1938702
50372 1938702 1959583 1981479 2001505 2016385 2023109 2019814 2005625 1979972 1942706 1894820 1838628 1777153
50360 1777153 1713400 1649894 1588390 1529830 1474662 1423109 1375027 1329779 1286625 1245292 1205976
50349 1205976 1168837 1133762 1100659 1069717 1041206 1015170 991512 970329 951899 936168 922408
50338 922408 909639 897474 886362 876956 869327 862843 856647 850224 843764 838056 833803 830897 828624
50325 828624 826680 825627 826139 828257 831712 836634 843455 852474 864010 878718 897085 918712 942581
50312 942581 967731 992960 1016076 1034525 1047222 1055359 1061283 1066983 1073602 1081471 1090141 1098719 1106438
50299 1106438 1112704 1116869 1118749 1119459 1120895 1123942 1127759 1130971 1132786 1132520 1129009 1121353 1109859 1095604
50285 1095604 1079438 1062038 1044499 1028076 1013446 1000723 989861 980379 970973 960356 948697 937716
50273 937716 929170 923582 920461 919289 920043 922980 928098 934856 942499 950671 959390 968389 976953 984799
50259 984799 992707 1001756 1012197 1023535 1035382 1047512 1059183 1069210 1076957 1082819 1087677 1092341 1097589
50246 1097589 1104118 1112061 1121024 1130930 1142533 1156754 1173828 1193555 1216209 1242715 1273964 1310489
50234 1310489 1352998 1402837 1461598 1530511 1610606 1703366 1810735 1934325 2074759 2231516
50224 2231516 2402561 2583489 2767305 2945601 3110247 3254454 3373678 3467097 3538475 3594716
50214 3594716 3642926 3688435 3734213 3779982 3820875 3847922 3851060 3822122 3755686 3649173 3504008
50203 3504008 3326654 3127373 2917341 2706625 2503604 2314595 2143414 1991746 1860154
50194 1860154 1748393 1654921 1576815 1510460 1452105 1398092 1345518 1293280 1242249 1194162 1150345
50183 1150345 1111324 1077053 1047164 1021215 998939 980169 964524 951391 940330 931297 924296 919032
50171 919032 915116 912482 911300 911368 911861 912008 912034 913084 915933 920032 924196 928027 932140 937033 942414 947922
50155 947922 953907 961076 969777 980058 992053 1005752 1020526 1035298 1049132 1061476 1072160 1081564
50143 1081564 1090501 1099463 1108072 1115761 1122843 1130485 1139640 1150438 1162649 1176345 1192021 1210312 1231669
50130 1231669 1256119 1283274 1312589 1343552 1375727 1408982 1443921 1481783 1523713 1570361 1622408
50119 1622408 1681123 1748119 1824965 1913430 2015800 2134534 2271889 2430326 2612986 2823132
50109 2823132 3063063 3333389 3632193 3953416 4285734 4614033 4923212 5202001 5445177
50100 5445177 5654139 5835921 6000500 6157248 6312033 6465514 6612342 6741480 6838132 6886840
50090 6886840 6874643 6793706 6643111 6428947 6162320 5856455 5524478 5178093 4826872 4478469
50080 4478469 4139702 3816970 3515218 3237055 2983626 2755989 2554876 2379578 2228063
50071 2228063 2098073 1987249 1892452 1810154 1737824 1674240 1618389 1568882 1524475 1484344 1447717
50060 1447717 1414045 1383654 1357376 1335205 1315931 1298147 1280876 1263225 1244481 1224955 1205813
50049 1205813 1187663 1169999 1152369 1135208 1119031 1103643 1088858 1075393 1064366 1056273 1050873 1047619
50037 1047619 1045768 1044523 1043604 1043375 1044185 1045960 1048643 1052369 1056919 1061713 1066737 1072731 1079936 1087247 1093267
50022 1093267 1097637 1100795 1103050 1104584 1105833 1107052 1107826 1107716 1107001 1106208 1105377 1104644 1105148 1108390 1114730 1123320
50006 1123320 1133451 1145223 1158981 1175040 1194197 1217811 1247029 1282358 1324253 1373735 1432205
49995 1432205 1500937 1580835 1672416 1775995 1892320 2023210 2171192 2337954 2522684 2721325
49985 2721325 2926786 3129765 3319931 3487573 3625656 3731851 3809415 3865981 3910862 3952600
49975 3952600 3997410 4047590 4099570 4143408 4165355 4152124 4094050 3986251 3829054 3628450 3395623
49964 3395623 3144799 2890208 2643584 2412998 2203014 2015696 1851699 1710788 1591820
49955 1591820 1492708 1410733 1343152 1287788 1243203 1208237 1181386 1160681 1144067 1129691 1115923
49944 1115923 1101536 1086059 1069757 1053128 1036577 1020458 1004909 989431 973000 954817 934757
49933 934757 913041 889953 866089 842447 819967 799189 780503 764248 750276 737888 726588
49922 726588 716562 708118 701098 695302 691092 689036 689114 690670 692876 694903 696017 696141 696165 697225 699669
49907 699669 703040 706866 711133 716198 722640 731015 741425 753450 766708 781037 795799 809465 820508
49894 820508 828485 833765 836614 837127 835656 832436 826925 818268 806388 792031 775943 758818 741874
49881 741874 726435 712631 699344 685735 672133 659152 646840 635264 625196 617356 611284 605793
49869 605793 600516 596378 594427 594681 596290 598438 600774 603192 605663 608442 612214 617753 625454 635335
49855 635335 647381 661494 677125 693321 709322 724766 739080 751101 759781 765084 767901 769162
49843 769162 769314 768353 765945 761595 755104 746784 737012 725808 713277 700243 687958 677276 668518
49830 668518 661932 657628 655010 652954 650794 648846 647885 648481 650864 654914 660090 665829 672326 680662 691819
49815 691819 705666 720998 736355 750608 762972 772872 780129 785287 789504 793693 797616 800010 799711
49802 799711 796389 790189 781279 770191 758113 746158 734541 723046 712033 702267 693831 686007 678417
49789 678417 671627 666279 662153 658408 654534 650826 648083 646894 646984 647274 646842 645753 644675 643892 643233 642881
49773 642881 643567 645904 650086 656338 664986 675781 687679 699607 710911 720820 728178 732398 734404
49760 734404 735965 738073 740308 741664 741523 739715 736001 729852 720876 709375 696354 682882 669552
49747 669552 656727 645019 635149 627342 621185 616128 611884 608415 605864 604475 604250 604625 604778 604247 603066
49732 603066 601531 600258 600149 601637 603969 605972 607567 609832 613483 618192 623689 630621 639661 650385
49718 650385 661747 673210 684758 696128 706784 716406 724800 731474 735911 738203 738851 737974 735266
49705 735266 730726 724825 717842 709574 700010 689946 680616 672836 666727 662077 658697 656426 654999 654114
49691 654114 653703 654005 655265 657369 659931 662751 665977 669764 674002 678502 683265 688386 693909 699942 706857
49676 706857 715137 725097 736844 750327 765113 780128 793882 805057 812912 817222 818115 816126 812322
49663 812322 808102 804620 802277 800750 799528 798279 796666 794007 789324 781679 770430 755502 737811
49650 737811 719367 702483 688620 677983 669969 663690 658254 653159 648709 645683 644406 644351 644741 645239
49636 645239 645937 646989 648433 650109 651552 652127 651457 649576 646682 642970 638725 634243 629610 624883 620506
49621 620506 617117 614748 612699 610459 608367 607020 606449 606313 606609 607661 609486 611592 613474 615025 616458
49606 616458 617997 619662 621279 622723 624146 625761 627441 628826 629940 631342 633492 636251 639151 641829
49592 641829 643998 645462 646532 648048 650560 653674 656590 659036 661240 663233 664750 665746 666500 667196 667865
49577 667865 668795 670557 673437 677133 681130 685174 689323 693772 698812 704819 712131 720846 730627 740673
49563 740673 750169 758975 767651 776467 784513 790205 792700 792531 790861 788408 785173 780873 775486 769531
49549 769531 763889 759253 755690 752849 750525 748813 747720 746918 745971 744609 742737 740371 737709 735115 732897
49534 732897 731234 730354 730612 732278 735363 739802 745693 753152 761999 771839 782589 794781 809118 825659
49520 825659 843414 860718 875924 887876 896072 900654 902251 901711 900001 898294 897821 899232 902117 905420
49506 905420 908354 910627 911727 910396 905184 895524 882177 866715 850657 834964 820130 806572 794792
49493 794792 785097 777351 771173 766257 762242 758528 754722 751245 748975 748128 747967 747789 747714 748171 749106 750133
49477 750133 751074 751775 751735 750592 748926 747950 748295 749641 751542 754016 757112 760512 764054 768175 773180 778275
49461 778275 782035 783986 785104 786434 787655 787526 785515 782334 778822 774895 769923 763761 757027 750538
49447 750538 744794 739806 735133 730226 725058 720249 716254 712682 708947 705421 703235 702796 703176 703276 703126
49432 703126 703642 705487 708555 712352 716476 720855 725799 731822 739162 747500 756346 765701 776217 788437
49418 788437 801643 813320 820223 820643 815816 808829 802214 796834 792824 790667 790995 794010 799567 807492
49404 807492 817402 828586 840464 852916 865802 878510 890433 901666 912858 924507 936749 949592
49392 949592 962892 976171 988786 1000189 1009748 1016473 1019353 1018031 1013011 1005254 995691 984934 973215
49379 973215 960680 947825 935517 924487 915045 907362 901612 897701 895274 894286 895155 898057 902452 907670
49365 907670 913501 919726 925496 929850 932648 934384 935258 935015 933656 931645 929351 926693 923471 919703 915652
49350 915652 911825 908876 907193 906609 906798 907788 909756 912519 915676 919142 923007 926890 929880 931169 930412
49335 930412 927621 923259 918437 914414 911526 908955 905795 902111 898768 896356 894533 892413 889523 886327
49321 886327 883685 881875 880464 879142 878234 878112 878603 879379 880530 882154 883716 884569 885022 886165 888545 891627
49305 891627 894705 897737 900987 904382 907637 910843 914575 919434 925598 932780 940588 948894 957800 967261
49291 967261 977001 986885 997030 1007396 1017642 1027628 1037641 1047676 1056992 1065004 1072371 1080528 1090242
49278 1090242 1101065 1111767 1120474 1124661 1122265 1113351 1100199 1085483 1070767 1056689 1043686 1031993
49266 1031993 1021378 1011494 1002473 994931 989361 985514 982361 978991 975829 974768 977796 985797 998924
49253 998924 1017238 1039917 1064377 1087530 1107999 1125823 1139885 1147119 1145052 1134096 1116565 1094377
49241 1094377 1068689 1041064 1013666 988273 965728 946209 929496 915241 903606 895536 891832 892045
49229 892045 894611 897922 900882 902787 903387 903094 902657 902463 902408 902327 902229 902161 902144 902174 902054 901311 899615 897265 895013
49210 895013 893420 892520 892046 891832 892108 893530 896759 901881 908430 916150 925384 936392 948547 960665
49196 960665 972113 983179 994377 1005731 1016816 1027192 1036511 1044358 1050275 1054114 1056315 1057637 1058507
49183 1058507 1058780 1058234 1057099 1055877 1054926 1054657 1056021 1060192 1067622 1077946 1091085 1108102 1130756 1160457
49169 1160457 1197518 1240517 1285576 1326593 1357134 1372908 1373089 1360088 1338409 1313138 1288409 1266570
49157 1266570 1248370 1233542 1221174 1210092 1199507 1189308 1179569 1169977 1160067 1149809 1139696 1130369
49145 1130369 1122434 1116431 1112592 1110625 1109988 1110425 1112068 1115098 1119441 1124745 1130623 1137026 1144344 1152856
49131 1152856 1162037 1170851 1178890 1186787 1195182 1203776 1211844 1219289 1226593 1234049 1241809 1250511 1261042 1273475
49117 1273475 1286926 1300716 1315190 1331138 1349012 1369141 1392314 1419569 1451711 1489649 1535190
49106 1535190 1590648 1656738 1730381 1804767 1872610 1931081 1984601 2041744 2106805 2172583 2222110
49095 2222110 2239719 2222346 2180891 2130943 2081965 2033881 1981641 1921751 1855479 1787846 1724493
49084 1724493 1669028 1622443 1584376 1554337 1531692 1515234 1503540 1495640 1490799 1487848 1485354 1482375
49072 1482375 1478523 1473423 1466847 1459475 1452736 1447542 1443621 1440317 1437547 1435700 1435025 1435452 1436743 1438646
49058 1438646 1441187 1444878 1450277 1457265 1465180 1473760 1483388 1494250 1505868 1517785 1530259 1543815 1558507
49045 1558507 1573996 1590078 1606792 1624241 1642542 1661675 1681301 1701176 1721992 1745309 1772204
49034 1772204 1802229 1833821 1865329 1895421 1923133 1948172 1970955 1992079 2012010 2031449 2051362
49023 2051362 2072148 2093237 2113950 2134302 2154488 2174177 2193117 2212017 2232021 2253466 2275941
49012 2275941 2299426 2324536 2351568 2380047 2409516 2440222 2472691 2506928 2542277 2577943 2613559
49001 2613559 2649215 2684907 2719959 2753373 2784805 2814681 2843013 2868718 2890730 2909341 2925742
48990 2925742 2940574 2953807 2965856 2977785 2990226 3002831 3014960 3026073 3035218 3040950 3042416 3040086
48978 3040086 3034978 3027615 3018177 3007209 2995459 2983158 2970033 2955978 2941258 2926072 2910454 2894678
48966 2894678 2879321 2864687 2850542 2836709 2823653 2812128 2802478 2794705 2789046 2785912 2785142 2785934 2787838
48953 2787838 2791398 2797473 2806254 2817349 2830434 2845266 2861348 2878286 2896441 2916562 2938772 2962470
48941 2962470 2987258 3013404 3041376 3071588 3104633 3141024 3180479 3222175 3266016 3312944 3363606
48930 3363606 3417310 3472670 3528834 3585765 3643991 3704437 3767843 3833830 3901139 3969229 4039035
48919 4039035 4111619 4186835 4263988 4343040 4424134 4506444 4588684 4670610 4753066 4836605 4920877
48908 4920877 5005357 5089732 5173413 5255438 5335265 5413226 5489973 5565696 5639967 5712088 5781591
48897 5781591 5848549 5913249 5975440 6034272 6089303 6141089 6190261 6236385 6278376 6315698 6348440
48886 6348440 6376297 6398148 6412637 6418703 6415734 6403829 6383950 6357401 6325235 6288359 6247768 6203927
48874 6203927 6156126 6103062 6043974 5978790 5907522 5830321 5748019 5661960 5573318 5483077 5392363
48863 5392363 5302078 5212398 5123382 5035954 4951397 4869947 4790668 4712810 4636577 4562525 4490958
48852 4490958 4421977 4355524 4291340 4229497 4170907 4116663 4066961 4021416 3980217 3943956 3912366
48841 3912366 3884363 3859576 3838799 3822591 3810413 3801577 3796171 3794558 3796799 3803207 3814686 3831789
48829 3831789 3853896 3879864 3909018 3941049 3975457 4011824 4050325 4091387 4134982 4180634 4227913
48818 4227913 4276616 4326739 4378569 4432496 4488359 4545186 4601962 4658539 4715632 4774011 4833777
48807 4833777 4894210 4954197 5012998 5070709 5127928 5185153 5242815 5301679 5362642 5426155 5492155
48796 5492155 5560395 5630227 5700155 5768322 5833569 5895596 5954289 6009714 6062675 6114264 6164441
48785 6164441 6211732 6254492 6291679 6322198 6344585 6358089 6363461 6362088 6354883 6342503 6326015 6306584
48773 6306584 6284756 6260560 6234008 6205133 6173846 6140042 6103377 6062554 6015366 5960011 5896107
48762 5896107 5824088 5744148 5656313 5561182 5460001 5354277 5245829 5136929 5029690 4925227
48752 4925227 4823714 4725200 4630077 4538808 4451397 4367066 4284422 4202241 4120318 4039410 3960412
48741 3960412 3883938 3810701 3741635 3677350 3617810 3562802 3512187 3465358 3420948 3377574 3334831
48730 3334831 3293362 3254320 3218912 3188027 3161813 3139729 3121197 3106022 3094238 3085951 3081405 3080654
48718 3080654 3082976 3087092 3092258 3098758 3107180 3117628 3129789 3143190 3157180 3171276 3185804 3201678
48706 3201678 3219243 3237823 3256644 3275600 3294840 3314321 3334205 3355070 3377234 3400357 3424055
48695 3424055 3448363 3473229 3498197 3523054 3548075 3573070 3596862 3618376 3637644 3655171 3671052
48684 3671052 3685562 3700004 3715932 3733815 3753319 3774535 3797865 3822736 3847400 3870180 3890304
48673 3890304 3907555 3921850 3933388 3942626 3949797 3954691 3957046 3956900 3954498 3950040 3943546 3934868 3923821
48660 3923821 3910239 3893669 3873081 3847271 3815584 3777895 3734006 3683827 3628350 3569654 3509630
48649 3509630 3449335 3389919 3333178 3280391 3231210 3184389 3139115 3094910 3050802 3005611 2958918
48638 2958918 2911097 2862629 2814042 2766270 2720329 2676552 2634451 2593237 2552232 2511233 2470820
48627 2470820 2431851 2394273 2356899 2318878 2280816 2243999 2209152 2176631 2147060 2120867 2097633
48616 2097633 2076929 2059483 2046651 2038973 2036058 2037472 2042717 2050486 2058937 2066803 2073594 2078910 2082427
48603 2082427 2084493 2085955 2087397 2089224 2092310 2097704 2105575 2115123 2125397 2135503 2144088 2149628 2151491
48590 2151491 2150179 2146492 2141090 2134881 2128987 2123973 2119564 2115295 2111027 2106798 2102671 2098946 2096079 2094235
48576 2094235 2093137 2092367 2091675 2091168 2091434 2093175 2096420 2100494 2105221 2111711 2121269 2133735 2147525 2161073
48562 2161073 2173473 2183806 2190619 2192299 2187766 2176964 2161041 2141873 2121065 2099663 2078935 2060602
48550 2060602 2045544 2032732 2020199 2006636 1991430 1973799 1953128 1929889 1905187 1879449 1852482
48539 1852482 1824741 1797597 1772283 1749285 1728750 1710711 1694850 1680656 1667854 1656223 1645241
48528 1645241 1634523 1624384 1615399 1607735 1601521 1597390 1595903 1596959 1600581 1607464 1617347 1627205 1632498
48515 1632498 1630359 1620813 1605479 1586595 1567059 1549642 1535646 1525229 1518942 1517670 1521124 1527889
48503 1527889 1537113 1548667 1561431 1573159 1582744 1591327 1600571 1611157 1623517 1638365 1655044 1670272
48491 1670272 1679873 1681601 1675820 1664192 1648592 1630717 1611768 1592449 1573574 1556276 1541316 1528606
48479 1528606 1517778 1508817 1501800 1496452 1492257 1488717 1485422 1482289 1479736 1478151 1477176 1476104 1474939 1474406
48465 1474406 1474984 1476636 1479444 1483667 1489218 1495959 1504473 1515479 1528342 1541153 1552492 1562130 1569836
48452 1569836 1574621 1575643 1573024 1567489 1560024 1552074 1544992 1538845 1532555 1525436 1517619 1508749 1497499 1483026
48438 1483026 1466002 1447704 1428865 1409880 1391286 1373427 1356296 1340008 1324829 1310472 1296194
48427 1296194 1281777 1267607 1253600 1239045 1223799 1208672 1194392 1181113 1169080 1158589 1148937
48416 1148937 1138577 1126851 1114652 1103070 1092452 1083012 1075091 1068303 1061636 1054861 1048718 1043288 1037469
48403 1037469 1030646 1023618 1017299 1011733 1006985 1003698 1001977 1000948 1000070 999688 999652 998810 996665 994157 991943
48388 991943 989307 985711 982048 979174 976487 973172 969722 966940 964480 961640 958713 956341 954311 952120
48374 952120 949886 947688 944818 940765 936176 931870 927640 922914 917795 912590 907144 901448 896028 890975
48360 890975 885589 879746 874566 870893 868168 865560 863008 860346 856710 851814 846622 841920 837455 833269
48346 833269 830332 828897 827756 826200 825111 825018 824752 823397 821888 821257 820947 820366 820466 822112 824365 826020
48330 826020 827380 828991 830249 830876 832120 834804 837922 840870 845224 852313 860923 869496 878797 890175
48316 890175 902976 915921 929096 942030 951663 955079 952920 947662 940221 930895 921851 915567 912014
48303 912014 909987 909826 912384 916994 923068 931861 944083 957915 972115 988687 1009455 1032723 1056672
48290 1056672 1083262 1115124 1151613 1191906 1238793 1295139 1360244 1434565 1524227 1635375 1768037
48279 1768037 1921463 2101229 2314915 2566573 2863943 3226362 3677781 4239720 4942396
48270 4942396 5835445 6976156 8417394 10213105 12386561 14811061 17100486 18694783
48262 18694783 19155405 18426520 16821629 14781368 12653727 10643592 8861728 7358416
48254 7358416 6131091 5145421 4363458 3750267 3267889 2881120 2568164 2316769 2113384
48245 2113384 1943919 1801038 1682292 1582983 1496939 1421832 1357884 1303134 1254747 1212829 1178404
48234 1178404 1149542 1123564 1100970 1083187 1068417 1053603 1038766 1025702 1014049 1002181 990517
48223 990517 980496 971511 962033 952545 944394 936913 928641 920267 913548 908376 903714 900524 900761 903900
48209 903900 906813 906649 901782 890912 873884 853142 832165 812453 793481 774993 757590 741638
48197 741638 727301 715169 705314 696383 687180 678485 671778 666870 662419 658074 654453 651548 648798 646279
48183 646279 644347 642560 640342 638226 637123 636891 636794 636642 636264 634748 631801 629043 628282 629071 629542 629069
48167 629069 628517 628388 628469 628908 629999 631048 631081 630509 630627 631587 632276 632124 631682 631465 631476 631798 632492 632945 632465
48148 632465 631483 631133 631769 632782 633675 634366 634720 634735 634834 635128 634877 633665 632424 632082 631869 630427 628035 626255
48130 626255 625741 625988 626834 628533 630475 631578 632058 633198 635217 636907 637526 637586 637477 636773 635372 634009
48114 634009 633202 632735 632489 632703 633201 633535 634070 635660 637984 639507 639494 638860 638628 638799 639168 639902 640709 640665
48096 640665 639640 638867 639346 640672 642135 643906 646315 648874 650991 652929 655238 657826 660342 662879 665541
48081 665541 667937 669881 672028 674991 678292 680994 682963 684732 686409 687647 688589 690118 693069 697544
48067 697544 702967 708550 713881 719351 725805 733557 741957 749972 756724 761384 763387 763285 762764 763054 763641
48052 763641 763066 760614 756538 751005 743706 734650 724660 714966 706618 700243 695839 692611 689342 685101
48038 685101 679580 672885 665387 657811 651120 645946 642081 638551 634348 629196 623617 618218 613146 608401
48024 608401 604358 601413 599117 596327 592433 587964 583727 579820 575894 571910 568123 564555 561024 557611
48010 557611 554666 552378 550684 549591 549198 549359 549592 549471 548962 548329 547860 547700 547867 548299 548874 549400 549613
47993 549613 549309 548511 547447 546325 545210 544164 543387 543054 543034 542917 542454 541941 541960 542655 543448 543727 543642 543797
47975 543797 544198 544118 543203 542101 541522 541135 539978 537764 535111 532640 530375 528016 525303 522121 518634 515296
47959 515296 512358 509490 506312 503124 500632 499080 498148 497594 497345 497122 496650 496204 496214 496375 495973 495201 495226
47942 495226 496603 498422 499520 499859 500227 501126 502495 504159 505994 507860 509694 511470 513000 514153 515372
47927 515372 517397 520246 523009 524890 525882 526202 525786 524776 523802 523243 522697 521746 520699 520035 519636 519201 518906
47910 518906 518965 518988 518526 517888 517641 517622 517237 516507 515951 515559 514761 513470 512353 511849 511544 510781 509454 508028
47892 508028 507111 507096 507933 509185 510556 512228 514366 516499 517853 518222 518037 517692 517275 516907 516799 516922 517064
47875 517064 517249 517734 518549 519492 520512 521713 522996 524105 524995 525653 525673 524600 522839 521612 521783 523073
47859 523073 524556 525616 526208 526594 526998 527400 527576 527543 527784 528676 529804 530276 529610 527895 525263 521899 518587
47842 518587 516451 515836 515992 516124 516250 516768 517676 518630 519375 519775 519741 519442 519334 519723 520532 521596 522885 524287
47824 524287 525633 527115 529268 532306 535922 539961 544764 550549 557001 563942 571926 581669 593285 606658
47810 606658 622200 640598 661951 685616 710712 736342 761711 786639 811641 836771 860536
47799 860536 880767 896520 908351 916601 920346 918430 910837 898511 882327 862870 840977 817969
47787 817969 795304 774160 755092 737849 721779 706828 694018 684623 678921 676032 674861 674834 675798
47774 675798 677628 680119 683012 685963 688685 691164 693533 695607 696787 696667 695529 693957 692067 689513
47760 689513 686258 682943 680209 677932 675513 672829 670499 669073 668190 666760 663848 659307 653695 647775
47746 647775 642004 636308 630278 623652 616554 609245 601746 593964 586122 578811 572466 566936 561708 556497
47732 556497 551487 547043 543356 540341 537699 535032 532115 529188 526899 525720 525446 525443 525361 525390 525711 525952 525406
47715 525406 523725 521228 518595 516468 515270 515061 515418 515611 515087 513785 512007 510115 508401 507047 505926
47700 505926 504588 502673 500440 498621 497702 497487 497540 497804 498528 499644 500630 501143 501539 502557 504637 507697
47684 507697 511406 515484 519933 525226 532015 540208 548450 555109 559913 564125 568980 574464 579844 584800
47670 584800 589438 593559 596535 597858 597462 595690 593261 590993 589041 586634 583083 578886 575179 572310
47656 572310 569685 567037 564891 563478 562034 559760 556907 554361 552598 551679 551948 553938 557572 561951 566087
47641 566087 569530 572368 574989 578022 582284 588529 597126 607835 619972 633086 647597 664473 684142
47628 684142 706117 729932 756014 785107 817190 851602 888053 926743 967300 1008273 1047937
47617 1047937 1085152 1119100 1148660 1172539 1189813 1199883 1202103 1195921 1181462 1159525 1130961 1096421
47605 1096421 1056877 1013998 969572 924733 880099 836556 795380 757419 722545 690235 660462
47594 660462 633790 610739 591344 575161 561408 549223 538216 528755 521379 515906 511349 506677
47582 506677 501387 495519 489583 484506 481092 479286 478326 477710 477592 478131 479053 480215 482082 485125 489111
47567 489111 493393 497637 501805 505698 509007 511698 513891 515552 516721 517910 519765 522418 525486 528501
47553 528501 530919 532026 531553 530324 529600 529710 529970 529990 530265 531122 531825 531386 529869 528229 527015 525790 523932
47536 523932 521538 519294 517619 516163 514168 511228 507634 503993 500689 497799 495349 493390 491833 490396
47522 490396 488781 486832 484584 482240 480023 477944 475853 473794 472036 470557 468801 466315 463407 460704
47508 460704 458293 455873 453597 452035 451161 450100 448194 445794 443610 441745 439822 437724 435683 433768
47494 433768 431715 429254 426402 423478 421008 419489 419029 419296 419898 420718 421778 422979 424128 425074 425770 426346
47478 426346 427178 428574 430323 431875 433064 434286 435760 437102 437996 438827 440134 441689 442825 443567 444761
47463 444761 446907 449376 451144 451957 452389 452952 453553 453894 454067 454490 455324 456349 457584 459713 463481 468681
47447 468681 474244 479513 485031 491808 500151 509645 520028 531570 544599 559117 574996 592165 610438
47434 610438 629367 648521 667746 686950 705668 722990 738014 750394 760366 768091 772992 773937
47422 773937 770348 763039 753794 744087 734287 723988 712816 700877 688689 676905 666082 656537 648340
47409 648340 641405 635569 630591 626125 621725 616949 611540 605580 599429 593452 587761 582262 576867 571609
47395 571609 566505 561379 555941 550130 544340 539118 534640 530662 527033 523991 521686 519691 517388 514788
47381 514788 512601 511426 511220 511616 512365 513300 514162 514772 515269 515983 517088 518401 519413 519583 518839 517786 517152
47364 517152 516977 516673 515853 514712 513472 511889 509614 506706 503505 500206 496838 493398 489722 485461 480519
47349 480519 475391 470782 466978 463805 461088 458909 457456 456662 455951 454401 451525 447899 444651 442226 440144
47334 440144 438079 436512 435921 435933 435829 435417 434779 433650 431839 429980 429032 429111 429488 429682 429813 429960 429942 429862
47316 429862 430177 431023 432011 432742 433037 432677 431620 430517 430244 430727 430931 430273 429254 428364 427215 425347 423165
47299 423165 421324 419693 417741 415624 414069 413296 412768 412028 411201 410546 410014 409383 408512 407421 406361 405773
47283 405773 405922 406548 407115 407307 407089 406495 405765 405488 406065 407053 407607 407644 408046 409450 411349 412742 413346 413740
47265 413740 414585 416140 418387 421096 423684 425391 425896 425591 425118 424784 424549 424349 424194 423952 423407 422633 422173
47248 422173 422607 423987 425799 427483 428927 430452 432478 435255 438807 442995 447658 452812 458782 466160
47234 466160 475543 487238 500969 515528 528610 537375 539911 536516 529446 521195 513114 505724 499751
47221 499751 496119 494993 495531 496874 498866 501543 504361 506507 507738 508472 509113 509701 510202 510715 511286 511705
47205 511705 511592 510655 509007 507325 506411 506302 505993 504394 501487 498208 495393 493223 491607 490534 489902 489460
47189 489460 489129 489076 489281 489327 488897 488251 487928 488039 488111 487748 487325 487838 489912 493114 496485 499758 503638 508766
47171 508766 514859 521168 527292 533089 538266 542787 547366 552745 558545 563623 567525 570710 573243 574264
47157 574264 573229 570929 568637 566770 564895 562593 559700 556087 551831 547517 543834 540897 538238 535344
47143 535344 531994 528308 524784 522050 520252 518854 517318 515738 514525 513778 513361 513357 513940 514894 515758 516434
47127 516434 517284 518549 519993 521175 521882 522205 522369 522504 522523 522220 521486 520276 518413 515756 512649 509863
47111 509863 507853 506350 504898 503464 502248 501204 500153 499111 498159 497121 495762 494145 492489 490812
47097 490812 489060 487474 486430 485938 485508 484519 482558 479632 476178 472706 469242 465473 461591 458566 457050
47082 457050 456382 455218 452991 450293 448008 446608 446163 446382 446575 446056 444717 442917 440902 438740 436659
47067 436659 434976 433684 432542 431503 430635 429690 428274 426425 424507 422595 420557 418733 417824 417896 418120 417796
47051 417796 417131 416725 416725 416898 417105 417332 417542 417850 418680 420435 423098 426291 429533 432333 434265 435193 435321
47034 435321 435063 435013 435910 438101 440993 443496 445177 446523 447931 449077 449628 450040 451066 452774 454555 455926
47018 455926 456860 457470 457831 458114 458513 459052 459679 460489 461583 462792 463754 464256 464322 464078 463705 463423 463304 463200
47000 463200 463018 462921 463102 463491 463871 464119 464158 463821 463038 462051 461198 460581 460165 460040 460306 460809 461271 461661 462218
46981 462218 463157 464552 466470 468952 471883 475018 478188 481328 484394 487328 490018 492258 493887 495110
46967 495110 496405 497966 499480 500722 501988 503566 505105 506121 506919 508282 510203 511682 512024 511670 511316
46952 511316 510808 509575 507845 506666 506643 507189 507243 506388 505014 503699 502728 502178 502149 502726 503837 505264 506837
46935 506837 508479 510041 511225 511866 512263 513025 514505 516467 518372 519905 521170 522440 523778 524850 525071
46920 525071 524102 522339 520810 520423 521297 522841 524361 525437 525840 525396 524118 522349 520683 519730 519905 521248
46904 521248 523312 525296 526499 526837 526956 527776 529728 532344 534701 536402 538020 540395 543574 546800 549583
46889 549583 552357 555857 560143 564667 569053 573397 577836 582270 586577 590729 594594 597929 600667 602902
46875 602902 604512 605183 605010 604678 604797 605343 605976 606565 607028 607106 606799 606834 608095 610588 613458 615976 618056
46858 618056 619855 621481 623209 625473 628409 631810 635680 640271 645293 649624 652348 653779 654946 656336
46844 656336 657670 658721 659660 660494 660773 660204 659240 658695 658916 659574 660168 660504 660725 661042 661491 661879 662003 661976
46826 661976 662326 663582 665731 668170 670284 672038 673916 676338 679297 682553 685993 689713 693873 698602
46812 698602 703877 709335 714332 718506 722276 726503 731563 736948 741892 746085 749573 752165 753387 753132
46798 753132 752077 751185 750815 750522 749762 748679 747991 748182 748997 749843 750526 751402 752818 754607 756149 756920 756966
46781 756966 756895 757366 758525 760011 761514 763171 765280 767805 770351 772529 774166 775305 776297 777700 779757
46766 779757 782045 784074 786237 789647 794866 801178 807429 813196 818767 824304 829596 834637 839959 846222
46752 846222 853667 862067 870990 879980 888670 896904 904711 912100 918962 925271 931263 937150 942627 946941
46738 946941 949691 951460 953312 955605 957598 958370 957892 957014 956625 957054 958101 959285 960119 960442 960509 960615 960726
46721 960726 960736 960917 961763 963391 965451 967573 969555 971152 972114 972526 972752 972893 972615 971565 969606 966547
46705 966547 962075 956121 948971 940895 932049 922812 913686 904609 894946 884459 873790 863545 853461
46692 853461 843103 832970 824111 816746 809911 802524 794334 785865 777884 770875 764643 758451 751960 745897
46678 745897 741248 737872 734586 730679 726601 722960 719541 715836 711998 708652 706001 703730 701626 699789
46664 699789 698165 696359 694044 691331 688605 686145 684006 682100 680385 679042 678433 678723 679493 679940 679493
46649 679493 678116 676028 673439 670781 668868 668351 668907 669324 668580 666683 664389 662377 660935 660206 660331 661337
46633 661337 663137 665679 668878 672469 676220 680311 685181 690972 697349 703906 710384 716434 721618 725902
46619 725902 729838 733906 737882 741139 743395 744910 746074 747102 748028 748688 748752 747970 746382 744210 741714
46604 741714 739296 737489 736490 735917 735392 735245 736196 738311 740662 742147 742406 741888 741296 741129 741570 742574 744033
46587 744033 745818 747695 749369 750723 751850 752637 752607 751588 750431 750500 752230 754576 756170 756776 757305 758568
46571 758568 760367 761903 762743 763175 763650 764142 764246 763882 763585 763982 765115 766500 767752 768854 769788 770217 769791
46554 769791 768711 767754 767632 768398 769599 770888 772274 773838 775613 777951 781553 786635 792271 797188 801128
46539 801128 804887 809056 813482 818039 822990 828186 832790 836521 840542 846253 853688 861920 870593 879998
46525 879998 889947 899809 909726 920699 933133 946218 959134 972062 985485 999184 1012499 1025093
46513 1025093 1037007 1048357 1059331 1069970 1079519 1086624 1090769 1093075 1094975 1096485 1096563 1094924 1092563
46500 1092563 1090432 1088466 1086254 1084008 1082334 1081339 1080482 1079218 1077424 1075212 1072612 1069592 1066187 1062466
46486 1062466 1058410 1053987 1049328 1044623 1039781 1034409 1028274 1021612 1014716 1007417 999257 990101 980279 970224
46472 970224 960353 951121 942676 934468 925838 917083 909333 903148 897907 892990 888849 886323 885429 885638 886951
46457 886951 889771 893848 898286 902763 907899 914118 920851 927312 933536 940109 947244 954613 961863 968706
46443 968706 974610 978960 981702 983505 985155 986893 988393 989073 988355 985946 982127 977618 972920 967869 962083
46428 962083 955809 949939 945073 940876 936569 931818 926802 921647 916349 911294 907288 904707 902921 900984
46414 900984 898717 896725 895478 894895 894899 895823 897887 900595 903149 905403 908072 911933 917122 923270 929957
46399 929957 936881 943885 951158 959200 968209 977598 986460 994426 1001591 1007671 1011874 1013912 1014586 1014951 1015258
46384 1015258 1015136 1014432 1013263 1011492 1008846 1005527 1002081 998572 994572 990168 986317 983819 982429 981411
46370 981411 980541 980053 979908 979815 979918 980954 983562 987796 993386 1000126 1007912 1016717 1026771 1038497 1052006
46355 1052006 1066765 1082076 1097876 1114771 1133156 1152612 1172438 1192596 1213657 1235735 1257872
46344 1257872 1278708 1297521 1314315 1329237 1342341 1353727 1363345 1370590 1374559 1374939 1372328 1367535 1360835
46331 1360835 1352045 1341092 1328315 1314413 1300236 1286412 1273083 1260103 1247470 1235281 1223383
46320 1223383 1211578 1200290 1190496 1182669 1176220 1170401 1165363 1161864 1160198 1159992 1160917 1163070 1166541 1171075
46306 1171075 1176308 1182109 1188603 1196055 1204714 1214527 1224974 1235494 1246170 1257788 1271029 1285683
46294 1285683 1300782 1315454 1329546 1343444 1357395 1371177 1384449 1397139 1409172 1419931 1428484
46283 1428484 1434531 1438773 1442031 1444258 1444670 1442646 1438182 1431652 1423605 1414769 1405811 1396925 1387816 1378204
46269 1378204 1368253 1358521 1349619 1341923 1335443 1329965 1325365 1321740 1319231 1317890 1317873 1319471 1322697 1326984
46255 1326984 1331718 1336990 1343414 1351105 1359239 1366822 1373642 1380171 1386729 1393175 1399458 1406042 1413365 1421019
46241 1421019 1427929 1433534 1438452 1443665 1449335 1454859 1459895 1464709 1469506 1474051 1478223 1482391 1486883 1491499
$$ [...]
##END NTUPLES=NMR SPECTRUM
##END=
