
##TITLE=AC1350_CHIRS12168_6647856_EPevJKYBGy
##JCAMPDX= 6.0         $$ Bruker NMR JCAMP-DX V2.0
##DATA TYPE= NMR SPECTRUM
##DATA CLASS= NTUPLES
##ORIGIN= BRUKER
##OWNER= Administrator
$$ 1.72 TOPSPIN		Version 2.1
$$ 2012-08-10 17:35:45.390 -0500  Administrator@TOPSPIN
$$ Compression mode = diff/dup
##.OBSERVE FREQUENCY= 400.02188249412
##.OBSERVE NUCLEUS= ^1H
##.ACQUISITION MODE= SIMULTANEOUS (DQD)
##.ACQUISITION SCHEME= undefined
##.AVERAGES= 8
##.DIGITISER RES= 22
##SPECTROMETER/DATA SYSTEM= spect
##.PULSE SEQUENCE= zg30
##.SOLVENT NAME= COFFEE_meoh
##.SHIFT REFERENCE= INTERNAL, COFFEE_meoh, 1, 14.98509
##AUDIT TRAIL= $$ (NUMBER, WHEN, WHO, WHERE, PROCESS, VERSION, WHAT)
$$ ##TITLE= Audit trail, TOPSPIN		Version 2.1
$$ ##JCAMPDX= 5.01
$$ ##ORIGIN= Bruker BioSpin GmbH
$$ ##OWNER= Administrator
$$ $$ C:\Bruker\TOPSPIN/data/COFFEE/nmr/AC1350_CHIRS12168_6647856_EPevJKYBGy/20/pdata/1/auditp.txt
$$ ##AUDIT TRAIL=  $$ (NUMBER, WHEN, WHO, WHERE, PROCESS, VERSION, WHAT)
(   1,<2012-08-10 17:35:37.109 -0500>,<Administrator>,<TOPSPIN>,<go>,<TOPSPIN 2.1>,
      <created by zg
	started at 2012-08-10 17:34:30.578 -0500,
	POWCHK enabled, PULCHK disabled,
       configuration hash MD5:
       6B 1B 68 BB D9 2E 58 E2 7F 35 AD 54 07 DF 0E 41
       data hash MD5: 64K
       CF 72 A3 5F 72 48 93 C1 4F 7E 69 4F CA 74 E3 5E>)
(   2,<2012-08-10 17:35:40.953 -0500>,<Administrator>,<TOPSPIN>,<proc1d>,<TOPSPIN 2.1>,
      <Start of raw data processing
       efp LB = 0 FT_mod = 6 PKNL = 1 PHC0 = 0 PHC1 = 0 SI = 32K 
       data hash MD5: 32K
       B0 46 2E EC FA 76 FE 6D B8 AF B4 4D B7 90 B7 BA>)
(   3,<2012-08-10 17:35:41.312 -0500>,<Administrator>,<TOPSPIN>,<proc1d>,<TOPSPIN 2.1>,
      <pk PHC0 = 181.7139 PHC1 = 0 
       data hash MD5: 32K
       51 CD 41 9E F1 7C 65 39 C1 40 4E 7C ED 97 12 D7>)
(   4,<2012-08-10 17:35:41.375 -0500>,<Administrator>,<TOPSPIN>,<proc1d>,<TOPSPIN 2.1>,
      <abs ABSG = 1 
       data hash MD5: 32K
       A6 69 72 E5 A3 1E 95 AC 72 9B 85 B2 59 3B F8 E4>)
(   5,<2012-08-10 17:35:41.421 -0500>,<Administrator>,<TOPSPIN>,<proc1d>,<TOPSPIN 2.1>,
      <abs ABSG = 2 
       data hash MD5: 32K
       F4 EE C7 17 24 77 37 6C F9 9C F9 54 4C C8 BB C4>)
(   6,<2012-08-10 17:35:41.453 -0500>,<Administrator>,<TOPSPIN>,<proc1d>,<TOPSPIN 2.1>,
      <abs ABSG = 3 
       data hash MD5: 32K
       1C 5E C7 E6 1F D4 27 9C 31 88 BC C9 23 D5 40 F9>)
(   7,<2012-08-10 17:35:41.484 -0500>,<Administrator>,<TOPSPIN>,<proc1d>,<TOPSPIN 2.1>,
      <abs ABSG = 4 
       data hash MD5: 32K
       18 17 42 34 12 70 0F E2 AB C4 5C C1 18 2F 0A 74>)
(   8,<2012-08-10 17:35:41.515 -0500>,<Administrator>,<TOPSPIN>,<proc1d>,<TOPSPIN 2.1>,
      <abs ABSG = 5 
       data hash MD5: 32K
       3F F6 A3 48 F6 37 2B 2F CC 1E BA C2 6B 79 9B 36>)
$$ ##END=
$$ 
$$ $$ hash MD5
$$ $$ E1 D6 A2 14 63 49 0E 73 91 E2 6E 9B FF 4B 87 AE
##$RELAX= 
##$RELAX= 
##$RELAX= 
##$RELAX= 
##$RELAX= 
##$RELAX= 
##$RELAX= 
$$ Bruker specific parameters
$$ --------------------------
$$ [...]
##$TP= (0..7)
150 150 150 150 150 150 150 150
##$TP07= 0
##$TPNAME0= <>
##$TPNAME1= <>
##$TPNAME2= <>
##$TPNAME3= <>
##$TPNAME4= <>
##$TPNAME5= <>
##$TPNAME6= <>
##$TPNAME7= <>
##$TPOAL= (0..7)
0.5 0.5 0.5 0.5 0.5 0.5 0.5 0.5
##$TPOFFS= (0..7)
0 0 0 0 0 0 0 0
##$TUNHIN= 0
##$TUNHOUT= 0
##$TUNXOUT= 0
##$USERA1= <user>
##$USERA2= <user>
##$USERA3= <user>
##$USERA4= <user>
##$USERA5= <user>
##$V9= 5
##$VALIST= <valist>
##$VCLIST= <CCCCCCCCCCCCCCC>
##$VD= 0
##$VDLIST= <DDDDDDDDDDDDDDD>
##$VPLIST= <PPPPPPPPPPPPPPP>
##$VTLIST= <TTTTTTTTTTTTTTT>
##$WBST= 1024
##$WBSW= 4
##$XGAIN= (0..3)
0 0 0 0
##$XL= 0
##$YL= 0
##$YMAX_a= 472835
##$YMIN_a= -606599
##$ZGOPTNS= <>
##$ZL1= 120
##$ZL2= 120
##$ZL3= 120
##$ZL4= 120
##$ABSF1= 14.98509
##$ABSF2= -5.573092
##$ABSG= 5
##$ABSL= 3
##$ALPHA= 0
##$AQORDER= 0
##$ASSFAC= 0
##$ASSFACI= 0
##$ASSFACX= 0
##$ASSWID= 0
##$AUNMP= <proc_prof1d_extract_pilot.lims>
##$AXLEFT= 0
##$AXNAME= <>
##$AXNUC= <1H>
##$AXRIGHT= 0
##$AXTYPE= 0
##$AXUNIT= <>
##$AZFE= 0.1
##$AZFW= 0.1
##$BCFW= 0
##$BC_mod= 0
##$BYTORDP= 0
##$COROFFS= 0
##$CY= 15
##$DATMOD= 1
##$DC= 0
##$DFILT= <>
##$DTYPP= 0
##$F1P= 0
##$F2P= 0
##$FCOR= 0.5
##$FTSIZE= 32768
##$FT_mod= 6
##$GAMMA= 0
##$GB= 0
##$INTBC= 1
##$INTSCL= 1
##$ISEN= 128
##$LB= 0
##$LEV0= 0
##$LPBIN= 0
##$MAXI= 10000
##$MC2= 0
##$MEAN= 0
##$ME_mod= 0
##$MI= 0
##$NCOEF= 0
##$NC_proc= -8
##$NLEV= 6
##$NOISF1= 0
##$NOISF2= 0
##$NSP= 0
##$NTH_PI= 0
##$NZP= 0
##$OFFSET= 14.98509
##$PC= 1
##$PHC0= 181.7139
##$PHC1= 0
##$PH_mod= 1
##$PKNL= yes
##$PPARMOD= 0
##$PPDIAG= 0
##$PPIPTYP= 0
##$PPMPNUM= 2147483647
##$PPRESOL= 1
##$PSCAL= 4
##$PSIGN= 0
##$PYNMP= <proc.py>
##$REVERSE= no
##$SF= 400.02
##$SI= 32768
##$SIGF1= 0
##$SIGF2= 0
##$SINO= 400
##$SIOLD= 32768
##$SPECTYP= <>
##$SREGLST= <1H.CDCl3>
##$SSB= 0
##$STSI= 32768
##$STSR= 0
##$SW_p= 8223.68421052631
##$SYMM= 0
##$S_DEV= 0
##$TDeff= 65536
##$TDoff= 0
##$TI= <>
##$TILT= no
##$TM1= 0
##$TM2= 0
##$TOPLEV= 0
##$USERP1= <user>
##$USERP2= <user>
##$USERP3= <user>
##$USERP4= <user>
##$USERP5= <user>
##$WDW= 1
##$XDIM= 32768
##$YMAX_p= 459923705
##$YMIN_p= -679919
##$CURPLOT= <Network HP LaserJet P1505>
##$CURPRIN= <$Network HP LaserJet P1505>
##$DFORMAT= <normdp>
##$LAYOUT= <+/1D_H.xwp>
##$LFORMAT= <normlp>
##$PFORMAT= <normpl>
##$SURQMSG= 1
$$ End of Bruker specific parameters
$$ ---------------------------------
##NTUPLES= NMR SPECTRUM
##VAR_NAME=  FREQUENCY,     SPECTRUM/REAL,   SPECTRUM/IMAG
##SYMBOL=    X,             R,               I
##VAR_TYPE=  INDEPENDENT,   DEPENDENT,       DEPENDENT
##VAR_FORM=  AFFN,          ASDF,            ASDF
##VAR_DIM=   32768,         32768,           32768
##UNITS=     HZ,            ARBITRARY UNITS, ARBITRARY UNITS
##FACTOR=    0.250966925370066, 1,           1
##FIRST=     8223.43324360094, 179856,       -32297
##LAST=      0,             -55396,          -48413
##MIN=       0,             -679919,         0
##MAX=       8223.43324360094, 459923705,    0
$$ Real data points
##PAGE= N=1
##DATA TABLE= (X++(R..R)), XYDATA
$$ [...]
$$ plain form
19536 -128202 -18557 -314598 -118950 -20561 -130065 -107063 -116306 -393150 89066 6768 -213370
19524 -15956 28195 -244388 -196406 -241967 69527 140598 -35231 -146476 -456085 -267241 156195
19512 -247422 46998 -278081 89232 -58593 -59278 -91153 -248501 -360176 -282689 -17431 -44076
19501 -44076 -235379 23920 -81778 -217743 -111147 53759 -148147 -55814 -178891 -161738 -112053
19490 -112053 106956 309721 -106683 96312 71234 -63053 -262553 75454 -171471 300122
19479 -89230 -426052 51553 -196470 -136666 50161 -195980 -55021 161999 184291 -254692 -149392
19468 -149392 25405 1499 47419 159310 188559 -245097 -114900 163930 -187600 182465
19457 22287 67415 29796 98694 -146057 9344 -104922 -245621 -99012 434001 -27302 58632
$$ packed form
19536a28202a8557k96041a18950b0561j09504K3002r243k76844H9066F768b13370
19524a5956B8195b44388M7982m5561F9527P1071c5231j11245l09609J88844A56195
19512b47422D6998b78081H9232e8593o85l1875j57348j11675P7487a7431k6645
19501d4076j91303B3920h1778j35965J06596E3759a48147e5814j23077J7153M9685
19490a12053A06956K02765a06683I6312k5078f3053j99500G5454a71471C00122
19479h9230l36822E1553a96470N9804E0161a95980e5021A61999K2292b54692J05300
19468a49392B5405A499M5920J11891K9249b45097a14900A63930a87600A82465
19457B2287M5128B9796O8898a46057I344a04922j40699i9012D34001b7302E8632
$$ plain form
19445 -214066 -124404 -43348 -262627 -40029 166321 123983 -314372 -176617 17457 -91472 -97389
19434 -97389 -82319 204150 -275310 181843 -261059 -519011 -8003 -251134 -248013 -2874 -90306
19423 -90306 -158183 18143 -3217 -290900 71836 66347 -350169 -63182 -143394 124336 -23387
19411 229535 -212478 -250209 233467 -268622 21575 -51431 101589 -101685 -52133 92128
19400 -70916 40082 49884 120960 -136692 32825 -80104 130327 16380 -221744 -138318 11054
19388 325462 -10954 -173898 332968 -316092 143367 -42455 -384277 -75102 -332191 90284
19377 78107 99576 -280426 -339501 -376633 -252382 264568 250500 -237598 25138 -128912 37737
19365 -405143 -39160 -371196 -198150 377925 -218472 -236394 -132375 353676 -34907 61756
$$ packed form
19445b14066Q9662d3348k19279d0029A66321m2338c14372J37755A7457i1472n917
19434i7389J5070B04150b75310A81843b61059k57952h003k43131L121b874q7432
19423i0306o7877A8143c217k87683G1836n489c50169f3182q0212A24336b3387
19411B29535b12478l7731B33467b68622B1575e1431A01589a01685M9552I2128
19400g0916D0082R802P1076a36692C2825h0104A30327A6380b21744Q3426A1054
19388C25462a0954j62944C32968c16092A43367d2455l41822g5102k57089I0284
19377G8107K1469b80426n9075l7132J24251B64568j4068b37598B5138a28912C7737
19365d05143c9160l32036J73046C77925b18472j7922J04019C53676c4907F1756
$$ plain form
19354 -217968 55104 -189343 -114193 58083 -311376 -183232 15358 -352471 91680 21554 85331
19343 85331 183470 -66828 -173813 90614 215393 44558 276347 249359 69222 128756 -27225
19331 65723 -94639 75237 195895 -184292 -215312 107647 -48468 -372692 -316492 -437854 -132551
19319 28432 -12133 -107624 -105974 -40910 -37591 -148705 -300615 -73828 -99973 -186734 -93124 -79994
19307 -79994 -330893 -14650 -216856 -75014 112192 -150261 -208852 -194357 29089 21752 -250577
19295 -225805 148031 -9476 -177138 -314471 10319 -215011 -111088 76432 79178 72611 133848
19284 133848 -32437 -83760 -305380 -29133 -127207 88940 -131764 -182748 -224840 -56124 -15713
19272 -273562 -20817 -87179 -301590 -52006 177102 -65860 -151824 422876 -182516 -111284 -9783
$$ packed form
19354b17968E5104a89343P5150E8083c11376J28144A5358c52471I1680B1554O3777
19343H5331R8139f6828j06985I0614J24779D4558K31789k6988F9222N9534b7225
19331F5723i4639G5237J20658a84292l1020A07647d8468l24224N6200j21362a32551
19319B8432a2133r5491J650d0910L319j11114j51910g3828k6145q6761i3124J3130
19307g9994k50899a4650k02206g5014A12192a50261n8591J4495B9089p337b50577
19295b25805A48031i476j67662j37333A0319b15011J03923G6432K746o567O1237
19284A33848c2437n1323k21620b9133r8074H8940a31764n0984m2092e6124a5713
19272b73562b0817o6362k14411e2006A77102f5860q5964D22876a82516P1232i783
$$ plain form
19260 105270 10405 -161936 -52758 66588 -139717 -159472 165320 24677 103957 -92314 -227786
19249 -227786 -170126 -107251 7059 348075 247080 -4746 -212627 -84871 119679 54601 62264
19238 62264 -66248 -438746 -173122 -344546 -106408 -58832 2972 -68584 -132922 -310754 -276268
19227 -276268 -116079 50818 15783 -93236 -194028 19103 -6430 -310691 93132 96908 41357
19215 -26892 -200958 -281054 -82688 -15974 -449488 341458 272829 -143645 -127301 -129596 -46796
19203 -107792 -122603 -187167 -297987 -201949 358760 104743 -254453 -311501 -143834 -398614
19193 -398614 45666 -311317 -26987 -133982 104412 55404 -200602 202102 164914 1634 174383
19182 174383 110447 -111721 -140031 176837 -111425 38107 -235841 -6988 -204005 -92791 -244526
$$ packed form
19260A05270A0405a61936e2758F6588a39717j9755A65320B4677P9280i2314j35472
19249b27786N7660O2875G059L41016j00995d746k07881h4871A19679E4601P663
19238F2264f6248l72498a73122j71424a06408M7576B972f8584o4338j77832L4486
19227b76268a16079E0818A5783i3236j00792A9103f430l04261I3132L776D1357
19215b6892j74066q0096h2688a5974m33514C41458o8629a43645J6344k295d6796
19203a07792j4811o4564j10820R6038C58760A04743b54453n7048a43834k54780
19193c98614D5666c11317b6987j06995A04412m9008b00602B02102l7188A634J72749
19182A74383o3936a11721k8310A76837a11425C8107b35841f988j97017i2791j51735
$$ plain form
19171 -244526 197229 99384 128424 5418 -2186 -6159 -250515 30258 -131846 -59714 -92081
19160 -92081 -19283 -106717 187771 167656 -221346 48084 -121018 -87215 -137561 2140 -24431
19148 80297 44765 33390 -228476 -157002 -422675 150352 23114 22554 -264569 -17688 47242
19136 275425 107223 211872 -706 60505 -211749 288416 -47489 -70284 15555 70999 -5364
19124 47309 -276516 -216710 -46549 55096 209452 -196070 -162401 -359396 -329268 -130864 -247761
19113 -247761 280129 -18336 -140259 23126 51889 -399373 250146 -13293 -145806 177704
19102 -46455 -194437 -154720 -93395 -21123 303334 208396 -184071 -83884 165290 -312026 -316860
19091 -316860 -4955 -161714 -333367 -311286 -83167 -139547 -390338 -176390 -71020 47901 -242579
$$ packed form
19171b44526A97229r7845K9040E418b186l973k44356C0258a31846e9714l2367
19160i2081a9283q7434A87771k0115b21346D8084a21018L3803n0346B140b4431
19148H0297l5532j1375b28476P1474k65673A50352B3114n60b64569a7688D7242
19136B75425A07223J04649g06F0505b11749B88416d7489k2795A5555N5444e364
19124D7309b76516N9806d6549E5096J54356a96070L3669j96995L0128a30864j16897
19113b47761B80129a8336j21923B3126K8763c99373B50146a3293j32513A77704
19102d6455j47982L9717O1325b1123C03334r4938a84071h3884A65290c12026m834
19091c16860d955j56759j71653K2081h3167n6380k50791a76390g1020D7901b42579
$$ plain form
19079 29939 -132466 -34495 206704 -233372 -90273 -325230 88752 188764 -52615 146159
19068 78759 183941 19245 37243 -121706 156310 -213275 255048 -52421 -89701 29985 110227
19057 110227 -174545 -225771 -104801 393037 40704 -84349 -119192 148840 -210781 -217528 121895
19045 -166371 135748 -140607 37854 -122579 -240356 -103778 -194469 -134043 159592 -115468
19034 88477 -34243 -80872 -316037 -207976 -294505 -186898 -264982 -145293 22192 129197 -151671
19022 -354756 -202484 195126 -291915 159592 -169919 -327774 56819 -19849 -67667 -307790
19012 -307790 24898 -26058 47021 -23599 156548 181670 283459 44575 -34739 1251 -218489
19000 -99581 -136367 181525 92629 -143878 -335570 206723 231195 -19440 61579 59201 -49377
$$ packed form
19079B9939a32466c4495B06704b33372i0273k34957H8752J00012e2615A46159
19068G8759J05182A9245J7998a21706A56310b13275B55048e2421l7280B9985Q0242
19057A10227a74545n1226a04801C93037D0704h4349l4843A48840b10781o747A21895
19045a66371A35748a40607C7854a22579j17777a03778r0691O0426A59592a15468
19034H8477c4243m6629k35165J08061q6529J07607p8084J19689B2192J07005a51671
19022c54756J52272A95126b91915A59592a69919j57855E6819a9849m7818k40123
19012c07790B4898b6058D7021b3599A56548K5122J01789D4575c4739A251b18489
19000i9581l6786A81525q8896a43878j91692B06723K4472a9440F1579k378d9377
$$ plain form
18988 -51206 335695 77158 229522 -227309 -205926 41698 -283195 165404 -276955 -170576
18978 -170576 -76788 43379 165265 -140544 4293 -1814 64192 -91889 -181603 161919 25322
18966 -23264 -184328 -429 18444 -67995 -251520 48026 155225 -57395 -243624 182744 -328798
18954 38093 -96716 130663 392365 -15314 44949 -255673 -195190 126590 -251429 -36024 -219920
18943 -219920 5074 75251 -11491 235245 -178701 -75370 141235 12677 -129339 -415868 -139294
18931 103147 -10988 -38187 -68205 -315570 -235722 -250190 -137839 -108634 -41662 90146 -47895
18919 -401645 -103191 -228083 -136032 13168 -122731 817 -35494 39533 150992 -113994 210955
18907 133973 35236 331680 118007 106027 105123 -203328 -117686 -116583 -10310 308357 12827
$$ packed form
18988e1206C35695G7158J52364b27309K1383D1698b83195A65404b76955J06379
18978a70576g6788D3379J21886a40544D293a814F4192i1889q9714A61919B5322
18966b3264j61064d29A8444f7995j83525D8026J07199e7395j86229A82744c28798
18954C8093i6716A30663K61702a5314D4949b55673O0483A26590b51429c6024j83896
18943b19920E074P0177a1491B35245a78701g5370A41235A2677a29339k86529a39294
18931A03147a0988k7199l0018k47365P9848j4468J12351K9205d1662I0146d7895
18919d01645a03191j24892R2051A3168a22731H17c5494C9533J11459a13994B10955
18907A33973C5236K96444A18007j1980r04b03328Q5642J103a0310C08357A2827
$$ plain form
18895 34503 -7747 159986 234816 -35095 -284316 -40298 115421 510099 -99959 196804 -183239
18883 -81949 261140 -139870 23632 -167048 50407 -465208 174479 185651 244296 -113973
18872 -17504 -19310 114647 -229066 -281486 -153191 -79158 -160967 -25411 -132675 146519 -178390
18860 -211833 350465 -316218 -150904 -4521 32703 149325 -43702 -130696 -150734 33838 85328
18849 85328 -34363 229171 -169586 115754 244301 -33084 31472 39469 -44096 -37845 176888
18837 101157 141871 101482 -119282 52611 133038 -93729 -188526 102481 -26009 -28959 5469
18825 -227569 -116892 -181030 -192850 -54857 40231 -12933 52295 -99476 -266837 16962 82446
18814 82446 -53947 -224651 169911 -155062 245749 74452 138084 35142 37765 -221157 -499296
$$ packed form
18895C4503g747A59986P4830c5095k49221d0298A15421L94678i9959A96804a83239
18883h1949B61140a39870B3632a67048E0407d65208A74479J1172N8645a13973
18872a7504j806A14647b29066n2420J28295P4033q1809b5411j07264A46519a78390
18860b11833C50465c16218a50904d521C2703J16622d3702q6994k0038C3838N1490
18849H5328c4363B29171a69586A15754J28547c3084C1472P997d4096O251A76888
18837A01157M0714m0389a19282E2611Q0427i3729r4797A02481b6009k950E469
18825b27569J10677o4138j1820e4857D0231a2933E2295i9476j67361A6962O5484
18814H2446e3947j70704A69911a55062B45749G4452O3632C5142K623b21157k78139
$$ plain form
18803 -499296 70547 43910 -218111 118417 -131181 -196474 -97236 -62393 -228313 -96631 303727
18791 -3590 -227488 -90783 -24251 -86467 -150258 -53927 -12244 -351640 10693 -185513 -236023
18780 -236023 -119858 -126640 194215 -122123 391741 -41683 267270 41357 -139823 22166
18769 131491 -263536 -95419 5355 -94667 -318073 -134963 -142101 -303969 29517 85900 -82379
18757 -30391 -2799 -133473 30622 15813 -230182 103848 -251009 262438 -73413 -16526 -136171
18746 -136171 -263548 -69027 -19803 -206915 -114820 18525 161572 22428 -38865 -61948 413587
18734 -37283 -363247 123602 -124275 -103783 -107807 -168050 127911 -112402 124562 -123630
18723 -131775 -288784 -120368 141480 77695 -92551 33305 -200019 -61480 -326044 56701
$$ packed form
18803d99296G0547k6637b18111A18417a31181o5293i7236L4843j65920i6631C03727
18791c590k23898i0783b4251o2216o3791e3927a2244l39396A0693a85513n0510
18780b36023J16165o782A94215a22123C91741d1683B67270D1357a39823B2166
18769A31491b63536i5419E355i4667k23406a34963p138j61868B9517N6383h2379
18757c0391b799j30674C0622j4809b30182A03848b51009B62438g3413a6526j19645
18746a36171j27377f9027a9803j87112R2095A8525J43047B2428c8865k3083D13587
18734c7283l25964A23602a24275K0492m024o0243A27911a12402A24562a23630
18723a31775j57009a20368A41480o3785i2551C3305b00019f1480k64564E6701
$$ plain form
18712 -93917 5206 -270069 -82414 -16734 4126 -55937 -116919 -77585 25049 51076 -280818 -124937
18699 -209912 40410 202748 -231061 -176705 193825 -118377 -137956 -258174 -104230 -118341
18689 -118341 -78123 62194 -399976 -87380 -199420 -194109 -143288 -40129 -23215 182936 -48631
18677 176773 33229 -83995 -67270 405995 -290615 -56864 -81193 -145368 142305 -105608 -74262
18666 -74262 153035 -73932 -148152 -31289 -50235 78973 80264 83918 -496705 -207070 69492
18654 -28278 -90353 -79624 -338291 -198569 -159167 -98012 -205693 -108072 -313636 94068 -45209
18642 -359189 -109512 -19513 -136065 -161832 64185 -94531 -187690 135551 -153175 -18560 105044
18630 58782 104566 -21004 246891 -57739 -91273 -14600 -146713 21724 -343559 50839 -57943
$$ packed form
18712i3917E206b70069h2414a6734D126e5937o0982L9334B5049K6027b80818a24937
18699b09912D0410J62338b31061N4356A93825a18377j9579j20218a04230j4111
18689a18341M0218F2194c99976h7380j12040N311N0821d0129J6914A82936d8631
18677A76773C3229h3995J6725D05995b90615e6864k4329o4175A42305a05608L1346
18666g4262A53035g3932p4220c1289j8946G8973J291L654d96705b07070F9492
18654b8278o2075J0729k58667J39722L9402O1155j07681R7621k05564I4068d5209
18642c59189a09512a9513j16552k5767F4185i4531r3159A35551a53175a8560A05044
18630E8782M5784b1004B46891e7739l3534a4600j32113B1724c43559E0839e7943
$$ plain form
18618 -222282 -42143 -215278 61445 8397 -65660 -221265 -48928 -54530 32093 -362745 -45828
18606 22408 290163 -64980 7536 95545 -124684 193657 -188945 117810 354799 -121358
18595 151321 -210466 -99557 331289 -22702 150909 -108061 -368586 192352 -144957 -80524
18585 -80524 106988 14005 166284 -491933 -360946 -229748 97059 -48250 196163 47938
18574 -140338 -42804 37466 73406 -60236 -172549 -286710 -288325 -387981 -238679 -12244 290455
18562 -494875 -185225 202433 -140466 -189852 -147227 211523 57062 -97126 33670 -165530
18551 -39292 -286952 -54062 -354340 78123 78764 -24787 27988 -190579 -140008 -65375 67574
18539 -284715 -33027 168862 12171 -174602 -417948 -52413 23419 -14527 284639 -101281
$$ packed form
18618b22282d2143j73135F1445H397f5660j55605d8928n602C2093c62745d5828
18606B2408K67755f4980G536Q8009a24684A93657a88945A17810K36989a21358
18595A51321b10466i9557C31289b2702A50909a08061k60525A92352a44957O4433
18585h0524A06988A4005J52279d91933J30987J31198I7059d8250A96163D7938
18574a40338d2804C7466L5940f0236j12313j14161j615r9656J49302a2244B90455
18562d94875a85225B02433a40466m9386M2625B11523E7062i7126C3670a65530
18551c9292k47660e4062l00278G8123O41b4787B7988a90579N0571f5375F7574
18539b84715c3027A68862A2171a74602k43346e2413B3419a4527B84639a01281
$$ plain form
18528 -149804 -592060 133393 64884 56298 -256276 32600 93231 -111535 112398 -132895
18517 38722 -153027 -366730 -250503 -35261 -83386 187821 -20293 -13624 -440068 70134 -39830
18505 106044 -135724 -9950 -117170 -115232 -123083 -26112 -138961 -81874 -70927 -91809 103334
18493 -46362 -36707 -16811 -418516 23618 122923 -125708 -44756 -21019 -104942 -150924 11826
18481 -134401 317361 262878 29888 -146112 -156320 176858 145706 -47267 -54471 -41153 -82880
18470 -82880 70877 13483 139322 -34931 -407433 -155146 -209455 -666322 153543 -86024 -262220
18459 -262220 -223597 -226599 136837 -296650 201007 -238294 -208338 -297418 23539 68336 -51142
18447 79614 -273181 100349 -309555 101362 31991 -206887 6481 314000 -102267 -203088
$$ packed form
18528a49804m42256A33393F4884q586b56276C2600O0631a11535A12398a32895
18517C8722a53027k13703J16227c5261m8125A87821b0293O669m26444G0134c9830
18505A06044a35724i950j07220J938p851b6112j12849N7087J0947k0882A03334
18493d6362R655a6811m01705B3618R9305a25708d4756b1019q3923m5982A1826
18481a34401C17361n4483B9888a46112j0208A76858l1152d7267p204J3318m1727
18470h2880G0877A3483J25839c4931l72502a55146n4309m56867A53543h6024j76196
18459b62220L8623l002A36837b96650B01007b38294K9956q9080B3539M4797e1142
18447G9614b73181A00349c09555A01362C1991b06887F481L07519a02267j00821
$$ plain form
18437 -203088 -127288 -4311 61685 46893 24906 -168535 -169435 -112439 139743 -121305 -342180
18426 -342180 17233 -19875 251238 172885 -82099 -351646 132070 -105525 -9588 46057 433635
18415 433635 -21802 8383 -21524 213652 -17700 -252788 64371 5622 -243936 22776 161309
18404 161309 17702 119087 98720 -191684 -55432 25860 151617 -86627 -115645 -136484 170922
18392 111031 108165 -284463 224316 161721 -164740 -315022 -260448 -22300 -20511 128725 47178
18380 6025 -72241 154280 146719 11124 36682 276746 50807 -183419 294468 -41960 -159578
18369 -159578 238516 81785 -266451 -253747 119708 -340673 -137506 -151874 -63343 -24989
18358 16687 401136 7311 -7488 39512 -96169 59506 30289 -178470 -2700 146225 116598 -85232
$$ packed form
18437b03088P5800d311F1685j4792k1987a68535r00N6996A39743a21305k20875
18426c42180A7233a9875B51238p8353h2099k69547A32070a05525i588D6057L87578
18415D33635b1802H383b1524B13652a7700k35088F4371E622b43936B2776J38533
18404A61309A7702J01385k0367a91684e5432B5860J25757h6627k9018k0839A70922
18392A11031k866b84463B24316o2595a64740j50282N4574b2300J789A28725D7178
18380F025g2241A54280p561A1124K5558K40064E0807a83419B94468d1960j17618
18369a59578B38516H1785b66451J2704A19708c40673a37506j4368f3343b4989
18358A6687L84449G311g488C9512i6169E9506k9217a78470b700A46225k9627h5232
$$ plain form
18345 -351004 -221340 -156393 -19010 -67144 -130573 -281455 -74019 35791 83327 -93783 80979
18333 -78189 21854 21737 -394564 -286654 -305146 44429 -56176 -109992 257992 222122 65465
18321 126220 52517 -83668 -395199 -165143 -163788 -89552 -113477 -45658 88251 41286 -96710
18309 -53434 -122430 270704 -11761 158506 -396097 43231 108549 -230509 -89147 434689 121955
18297 276254 -227869 -187441 360467 -89688 -168816 -126181 -55650 -62841 -213216 176696 30682
18285 -80434 -79716 135056 102499 20334 -35668 -143758 75162 -412491 -409042 184672 -150809
18273 -42372 136807 128181 223916 -72985 -16607 154322 -2812 -32406 185200 32085 -63944
18261 -120669 57062 -19101 175626 -53715 -234828 -162512 -93080 -61759 30794 -370865 143378
$$ packed form
18345c51004J29664O4947a9010m8134o3429j50882g4019C5791M7536i3783H0979
18333g8189B1854j17c94564J07910j8492D4429e6176n3816B57992l5870F5465
18321A26220E2517h3668l11531a65143J355P4236k3925d5658H8251D1286i6710
18309e3434o8996B70704a1761A58506c96097D3231O5318b30509h9147D34689A21955
18297B76254b27869M0428C60467h9688p9128M2635e5650p191j50375A76696C0682
18285h0434P18A35056l2557B0334c5668j08090G5162d12491L449A84672a50809
18273d2372A36807q626R5735g2985a6607A54322b812k9594A85200C2085f3944
18261a20669E7062a9101A75626e3715j81113P2316O9432L1321C0794c70865A43378
$$ plain form
18249 39867 394872 188456 -335600 -145791 187920 -311262 109412 -447212 182476 55021
18238 601 -517319 -174868 -183514 -58749 -29774 67247 -182397 -217979 121396 -271307 -235243
18227 -235243 -169590 1382 -74905 56854 174125 -329349 -151235 152604 -271468 -152829
18217 -152829 181549 -74758 129575 -205835 -116864 -234041 252957 41469 -40184 105848
18206 196653 -132048 -343634 5914 86546 287127 -157797 157415 -358604 -129000 53952
18195 -147778 110928 97422 -285550 -51267 -208754 -23542 -33513 -89596 -11590 -109444 -387578
18184 -387578 -156442 -62806 324636 -33129 13694 73876 -259586 -52049 -2377 267583 112151
18172 -70313 -220769 74692 -171669 -290017 -22213 220007 -166938 -97646 80437 214186
$$ packed form
18249C9867L55005A88456c35600a45791A87920c11262A09412d47212A82476E5021
18238F01e17319a74868q646e8749K8975F7247a82397l5582A21396b71307L6064
18227b35243O5653A382g4905E6854J17271c29349a51235A52604b71468J18639
18217a52829A81549g4758A29575b05835Q8971j17177B52957D1469d0184A05848
18206A96653a32048k11586E914Q0632K00581a57797A57415c58604a29000E3952
18195a47778A10928j3506b85550e1267j57487b3542r971n6083a1590r7854k78134
18184c87578a56442f2806C24636c3129A3694O0182b59586e2049b377B67583A12151
18172g0313j50456G4692a71669j18348b2213B20007a66938O9292H0437J33749
$$ plain form
18162 214186 -100416 -122263 126036 12158 -145843 224747 6712 -21705 -2886 194196 -32885
18150 25622 42535 153869 -35913 -92275 231105 115438 146020 171146 -196976 -59147 -33932
18139 -33932 -9804 -29418 146609 361729 148611 300817 70524 -145025 146817 229216 -3604
18127 65321 -204161 -8067 -48812 132374 143643 -164896 -10462 -193315 -126096 44790 79726
18116 79726 -46760 -111460 -121488 -76035 48666 272183 33943 -244673 60689 -133910 -51888
18104 -62039 18899 182395 -100952 -84358 -56183 79559 -220783 -57916 -120184 128220 -341338
18092 110744 32762 61737 154650 -273404 149914 208996 86391 -152774 67222 813 29422
18081 29422 -186713 -137139 -81895 -54549 227218 -314679 -71080 109769 -77145 210842 19919
$$ packed form
18162B14186a00416k1847A26036A2158a45843B24747F712b1705b886A94196c2885
18150B5622J6913J11334c5913n6362B31105A15438L0582K5126a96976e9147K5215
18139c3932i804j9614A46609K15120A48611J52206G0524a45025A46817Q2399c604
18127F5321b04161h067m0745A32374J1269a64896a0462j82853O7219D4790L4936
18116G9726d6760o4700j0028M5453D8666K23517C3943b44673F0689a33910e1888
18104f2039A8899J63496a00952J6594K8175G9559b20783e7916o2268A28220c41338
18092A10744C2762K8975R2913b73404A49914N9082H6391a52774F7222H13K8609
18081B9422a86713M9574N5244K7346B27218c14679g1080A09769g7145B10842A9919
$$ plain form
18069 -110345 -41632 167747 -19500 69242 156078 -216422 -163931 36457 -910 81100 -86269
18057 -121118 29198 426548 -44323 -62393 -242485 -179034 -328103 284617 256177 -28366 -90293
18046 -90293 -127794 -293472 250800 -195812 314967 142056 -156581 -500070 -302995 -72187
18035 -73655 22660 73074 62779 -125808 146804 230653 -345226 303866 -55452 -183772 -69843
18023 151934 -29400 428613 -113182 -157711 -81949 113988 182050 -355771 -196145 -194747 103363
18011 -50468 151478 -94047 213090 -37162 53617 17733 85555 -155248 167882 192784 -67024
17999 -135341 -52743 -190941 -140646 149927 -160374 43449 26429 -85085 67554 -23972 -48279
17988 -48279 119123 285681 -142446 -175683 -229351 -316118 -310914 179759 230566 40158 97561
$$ packed form
18069a10345d1632A67747a9500F9242Q6836b16422N2491C6457i10H1100h6269
18057a21118B9198L97350d4323j8070j80092O3451j49069B84617k8440b8366o1927
18046i0293l7501j65678B50800a95812C14967A42056a56581l43489J97075g2187
18035g3655B2660N0414j0295a25808A46804Q3849c45226C03866e5452j28320f9843
18023A51934b9400D28613a13182m4529P5762A13988O8062c55771J59626J398A03363
18011e0468A51478i4047B13090c7162E3617A7733O7822a55248A67882K4902f7024
17999a35341e2743j38198N0295A49927a60374D3449j7020h5085F7554b3972k4307
17988d8279A19123J66558a42446l3237n3668q6767N204A79759N0807D0158N7403
$$ plain form
17977 97561 -64412 62549 327310 -100537 -309419 191031 -32441 -108107 -16124 56994 134388
17966 134388 -10946 -14594 99985 -116965 17885 94719 -43007 75807 -49929 -113684 12473
17954 -432155 -11702 -193386 137280 -86930 -201383 -70993 65959 -401335 136423 -247571
17943 -39291 396135 -480664 194806 -23344 40748 77381 150630 -502869 -109312 131874
17932 -53524 -214472 88670 159494 238910 111100 -75808 52729 138674 91094 -136895 112411
17920 -158806 13990 38915 -94307 -215223 -224931 54818 -150187 80725 300776 109015 40635
17908 -60345 -104949 171339 -265622 266308 -136553 186745 76315 -55071 332687 95748
17897 -128432 43412 88112 -49634 -24119 -150973 -102916 15788 205287 -142444 204688 49513
$$ packed form
17977I7561f4412F2549K64761a00537k08882A91031c2441p5666a6124E6994P7394
17966A34388a0946l648I9985a16965A7885P6834d3007G5807d9929o3755A2473
17954d32155a1702j81684A37280h6930j14453g0993F5959d01335A36423b47571
17943c9291C96135d80664A94806b3344D0748L6633P3249e02869a09312A31874
17932e3524j60948H8670P0824P9416A11100g5808E2729Q5945m7580a36895A12411
17920a58806A3990K4925i4307j20916r708E4818a50187H0725K20051A09015D0635
17908f0345m4604A71339b65622B66308a36553A86745G6315e5071C32687I5748
17897a28432D3412M4700d9634b4119j26854M8057A5788J89499a42444B04688D9513
$$ plain form
17885 109955 -146972 85989 -333742 18084 105631 321547 63367 -119259 -73127 -88483 116555
17873 205012 201720 -79571 172009 169873 131768 227806 -312888 -223095 -48966 -96632 166892
17861 -184251 136810 -37449 298336 259887 30515 212044 -250414 57593 343457 -84877
17850 -88642 -1727 -266526 -193524 -361154 35193 -186428 187561 231353 -340486 -175528 -3938
17838 -85870 103513 246273 36461 70823 280451 -98187 -62413 -58406 49773 -240227 99143
17826 -8079 125590 -11287 -148811 25310 -190605 -143565 69370 -478527 42162 -87886 -62293
17815 -62293 135133 -93052 52238 93597 -59659 26569 -221229 65945 42511 -136855 -103114
17804 -103114 11964 -167807 -81422 176537 -84284 35539 -296555 159109 -407037 -33359
$$ packed form
17885A09955a46972H5989c33742A8084Q7547K15916F3367a19259M6132j5356A16555
17873B05012l292g9571A72009k136l8105R6038c12888Q9793d8966m7666A66892
17861a84251A36810c7449B98336l8449C0515J81529b50414E7593K85864h4877
17850h8642a727k64799P3002j67630C5193a86428A87561M3792c40486J64958c938
17838h5870A03513J42760C6461L4362K09628i8187L5774M007D9773b40227I9143
17826h079A25590a1287j37524B5310a90605M7040F9370d78527D2162h7886K5593
17815f2293A35133i3052E2238M1359e9659B6569b21229F5945k3434a36855L3741
17804a03114A1964a67807h1422A76537h4284C5539b96555A59109d07037c3359
$$ plain form
17793 198233 156396 -119028 -153183 -13414 51031 15986 216211 -133319 -162653 236560 60593
17781 212574 -223309 70994 34311 -44354 -447026 -316700 -4812 -96207 50390 91980 257196
17770 257196 277308 197888 -101331 681 442038 -153746 167026 -85511 189915 115841 207499
17759 207499 81573 114031 -69295 366605 141696 4015 132029 291418 -66868 -159448 -18095
17747 -44270 -144002 14372 355809 -8322 144634 39875 126943 -30295 166665 260854 -36897
17735 1845 62068 -299864 251980 -16421 -27781 -67637 38594 61020 79068 -122605 95347
17723 -182409 -53866 60899 154474 157984 198462 -30596 -205654 -350206 9721 310148 1130
17711 172443 224026 20243 50596 123401 19978 188993 315948 115458 -8653 139637 -37669
$$ packed form
17793A98233m1837a19028l4155a3414E1031A5986K00225a33319k9334B36560F0593
17781B12574b23309G0994C4311d4354m02672J30326d812r1395E0390M1590J65216
17770B57196K0112p9420a01331F81M41357a53746A67026h5511A89915p4074R1658
17759B07499H1573L2458f9295C66605A41696D015J28014J59389f6868r2580a8095
17747d4270r9732A4372L41437h322A44634C9875Q7068c0295A66665R4189c6897
17735A845O0223b99864B51980a6421j1360l9856C8594K2426J8048a22605I5347
17723a82409e3866F0899R3575L510M0478c0596j75058j44552I721L00427A130
17711A72443N1583B0243L0353P2805A9978J69015J26955A15458h653A39637c7669
$$ plain form
17699 109379 -109009 -18142 40026 245505 -206468 129580 185160 116153 242892 18305
17688 390058 91696 -376339 41146 -238854 -37201 -38710 -59405 -250630 70480 23369 -307822
17676 206222 -231536 24279 -56814 89007 -269119 -84371 164476 208235 83966 -45387 -66582
17665 -66582 238190 -186526 52245 80714 266013 236002 24965 67217 152435 168109 -218558
17653 133696 155341 -109079 11358 82585 241343 -34584 76889 175237 227707 -3079 167120
17641 -103450 234299 292699 170487 -38428 56053 238799 32781 93655 -93823 -25671 128000
17629 51311 -92823 232358 112565 77204 307001 245105 46549 59861 -145352 50291 178877
17618 178877 -26180 74499 69780 64822 64121 19485 268072 211434 -54994 -155845 324871 75276
$$ packed form
17699A09379a09009a8142D0026K05479b06468A29580N5580o9007J26739A8305
17688C90058I1696c76339D1146b38854c7201j509k0695j91225G0480B3369c07822
17676B06222b31536B4279e6814H9007b69119h4371A64476M3759H3966d5387k1195
17665f6582B38190a86526E2245K8469J85299l0011B4965M2252Q5218J5674b18558
17653A33696K1645a09079A1358P1227J58758c4584G6889R8348N2470c079A67120
17641a03450B34299N8400j22212c8428E6053J82746C2781O0874i3823b5671A28000
17629E1311i2823B32358A12565l5361K29797o1896D6549J3312a45352E0291J28586
17618A78877b6180G4499m719m958p01A9485K48587n6638e4994j00851C24871G5276
$$ plain form
17605 210989 21249 79002 22536 -73531 -57872 206009 -127108 273052 16143 17255 -228908
17593 195517 2861 51460 362077 144729 71747 176682 244233 233110 49638 192498 169029
17582 169029 4566 614270 135369 -22609 509205 6908 -42516 -72368 287002 -60316 24803
17570 425401 -108027 22522 157851 -13014 195999 101218 85768 482162 -57582 63541 -189395
17558 126507 204338 -112771 376497 -19966 18041 77713 159535 -157727 101408 -184453
17547 335249 -50960 -91298 39671 106602 230047 461466 107479 423845 72050 182192
17537 182192 221924 -20431 14173 23454 335435 124817 119253 78223 79497 63626 277767
17526 277767 237982 114320 455671 126732 448047 26860 278643 433931 277785 47069
$$ packed form
17605B10989B1249N7753B2536g3531J5659B06009a27108B73052A6143J112b28908
17593A95517B861M8599L10617A44729G1747J04935O7551j1123D9638J42860k3469
17582A69029D566O09704A35369b2609E09205F908d2516k9852B87002f0316B4803
17570D25401a08027B2522J35329a3014A95999r4781j5450L96394e7582F3541a89395
17558A26507P7831a12771C76497a9966A8041N9672Q1822a57727A01408a84453
17547C35249e0960m0338C9671O6931J23445K31419A07479L16366G2050J10142
17537A82192L9732b0431A4173R281L11981A24817n564m1030J274j5871K14141
17526B77767l9785A14320L41351A26732L21315B6860K51783J55288j56146D7069
$$ plain form
17515 14158 402881 209793 4272 187795 24137 330796 250113 1639 103330 154236 409470
17504 409470 379304 150328 118530 436248 239170 97684 -106115 33620 232893 351271
17494 351271 179207 304303 207059 -6383 286659 231668 278642 89372 -123494 102992 -48956
17482 192922 67547 222341 15552 57412 382455 31197 360518 462310 282833 352076
17472 352076 465006 -163936 267001 355830 364159 -188839 266964 -47386 82824 31429 -28373
17460 292424 348772 305519 102028 -42056 206811 19441 58582 269168 -3005 -54144 258185
17448 428272 265866 271406 242273 388206 535805 466341 371342 233472 563849 296354
17438 296354 234271 347496 251244 63892 107993 247210 200803 238502 406177 267309 106563
$$ packed form
17515A4158L88723j93088D272J83523B4137L06659q0683A639J01691N0906K55234
17504D09470l0166A50328l1798L17718j97078I7684a06115C3620J99273J18378
17494C51271j72064J25096r7244f383B86659n4991M6974H9372a23494A02992d8956
17482A92922F7547J54794A5552M1860L25043C1197L29321J01792j79477O9243
17472C52076J12930a63936B67001Q8829Q329a88839B66964d7386H2824C1429b8373
17460B92424N6348m3253A02028d2056B06811A9441L9141K10586c005n1139B58185
17448D28272j62406N540k9133J45933J47599o9464r4999j37870L30377k67495
17438B96354o2083J13225r6252F3892M4101J39217m6407L7699J67675j38868A06563
$$ plain form
17426 798804 16137 226951 439004 170146 505747 486991 456569 303430 429274 228679
17416 228679 438982 568358 431190 296767 276084 394888 204049 172787 173953 183136 -26015
17404 199175 23082 461218 -194781 267733 14291 113523 355415 271795 358964 333206 280698
17393 280698 159028 418524 17100 170290 502737 331802 258067 -13000 306222 15863
17382 199865 193172 434998 119555 -261034 649422 -120253 186420 342234 100862 158435
17372 158435 166960 57466 252704 280091 152643 450521 194850 77545 108773 387230 435706
17361 435706 183271 48182 138300 110309 113941 -98437 166929 -2777 209611 601293 352881
17350 352881 -91054 277188 365900 173362 600456 163370 175305 309919 111027 409146
$$ packed form
17426G98804A6137K10814K12053A70146L35601j8756l0422j53139J25844k00595
17416B28679K10303J29376j37168j34423k0683J18804j90839l1262J166R183b6015
17404A99175B3082M38136a94781B67733A4291R9232K41892q3620Q7169k5758n2508
17393B80698j21670K59496A7100J53190L32447j70935p3735a3000C06222A5863
17382A99865o693K41826A19555b61034F49422a20253A86420J55814A00862N7573
17372A58435Q525E7466J95238K7387j27448K97878A94850G7545L1228K78457M8476
17361D35706A83271D8182R0118k7991L632i8437A66929b777B09611L91682k48412
17350C52881i1054B77188Q8712A73362M27094A63370J1935J34614A11027K98119
$$ plain form
17340 409146 394390 80429 502767 53234 224368 172072 42549 306706 58592 263273 190984
17329 190984 236774 370300 403586 156028 201493 119064 206614 521959 115965 74045 166150
17318 166150 -41279 143851 387060 365752 220886 -159447 290553 -31271 -81615 53047
17307 314944 416252 424704 23961 -143008 304306 246202 357538 -60826 104703 385706
17297 385706 -14979 206369 251684 -28766 353423 177368 205230 245573 73266 2991 223927
17286 223927 242785 186822 287901 252004 214008 310101 -44923 205192 362218 259522 51338
17274 -19430 260578 -42016 279207 437512 108674 155090 118842 280571 -84227 69234 236257
17263 236257 381579 -286436 401349 17462 69990 231165 61628 9346 190626 170689 113503
$$ packed form
17340D09146j4756H0429M22338E3234J71134n2296D2549K64157E8592K04681p2289
17329A90984M5790J33526L3286A56028M5465q2429Q7550L15345A15965m1920R2105
17318A66150d1279A43851K43209k1308j44866a59447B90553c1271n0344E3047
17307C14944J01308Q452B3961a43008C04306n8104J11336f0826A04703K81003
17297C85706a4979B06369M5315b8766C53423j76055K7862M0343G3266B991K20936
17286B23927J8858n5963J01079l5897l7996R6093d4923B05192J57026j02696E1338
17274a9430B60578d2016B79207J58305A08674M6416l6248J61729h4227F9234J67023
17263B36257J45322b86436D01349A7462N2528J61175F1628I346J81280j9937n7186
$$ plain form
17252 113503 -16830 409421 231769 201337 207463 48491 206137 211066 -2079 209556 359238
17241 359238 282193 363087 411817 25077 217891 204034 302103 77354 144992 352007 140007
17229 167340 193895 67223 103754 297953 65091 72721 390978 -151398 -229175 417403 54987
17217 227780 378842 198539 152342 241009 372661 138078 461920 90406 292747 275443
17207 275443 19540 558880 365329 308428 334549 384224 157161 493613 243362 267927
17197 267927 349925 39830 254882 455628 61454 161368 114298 152964 447049 592490 290717
17185 429858 551145 314155 53312 93154 526688 145484 245123 161211 155807 106137 255693
17174 255693 577948 372870 478745 -83022 482569 322795 387450 277320 163998 257856
$$ packed form
17252A13503a6830D09421j77652l0432O126D8491J57646M929b079B09556J49682
17241C59238p7045Q0894M8730B5077J92814j3857R8069G7354O7638K07015A40007
17229A67340K6555F7223L6531J94199F5091P630L18257a51398p7777D17403E4987
17217B27780J51062j80303m6197Q8667J31652A38078L23842I0406K02341j7304
17207B75443A9540N39340j93551n6901K6121M9675A57161L36452B43362K4565
17197B67927Q1998C9830K15052K00746F1454R9914m7070L8666K94085J45441B90717
17185D29858J21287k36990E3312L9842M33534A45484R9639q3912n404m9670J49556
17174B55693L22255k05078J05875h3022D82569j59774O4655j10130j13322R3858
$$ plain form
17164 257856 142935 492670 327864 434148 412417 313808 335490 543532 271676 357053
17154 357053 410347 832952 446106 517174 614103 321020 157154 150190 551926 323843
17144 323843 764248 574500 295578 38396 210911 280274 88801 505584 261214 -47554
17133 474155 456998 590877 546816 203170 276323 247061 543177 386501 252603 515017
17123 515017 350907 136386 393391 304897 305569 430499 366554 489369 371505 545589
17113 545589 324550 434992 378617 334155 710839 234888 245493 632997 503315 355892
17103 355892 298906 618475 421735 462154 378451 451426 222037 200647 565982 623911 557572
17092 557572 457751 215013 246005 427444 244910 642216 510281 224884 404155 388513
$$ packed form
17164B57856j14921L49735j64806J06284k1731r8609K1682K08042B71676Q5377
17154C57053N3294M22605l86846P1068R6929k93083A57154o964M01736k28083
17144C23843M40405j89748k78922C8396J72515O9363H8801M16783k44370d7554
17133D74155j7157J33879m4061B03170P3153k9262K96116j56676j33898K62414
17123E15017j64110A36386K57005q8494O72J24930o3945J22815j17864J74084
17113E45589k21039J10442n6375m4462L76684B34888J0605L87504j29682j47423
17103C55892n6986L19569j96740M0419q3703P2975B22037k1390L65335N7929o6339
17092E57572r9821B15013L0992J81439j82534L97306j31935B24884J79271j5642
$$ plain form
17082 388513 601233 817601 187925 503221 567403 247331 570964 667771 735183 791928
17072 791928 697553 344631 753765 557038 757914 365954 841105 233406 623033 498410
17062 498410 689634 472350 664482 761275 583622 722232 487912 566815 671711 713101
17052 713101 738894 511390 640477 792139 678930 866138 720022 738247 958258 637929
17042 637929 450160 487842 748848 267626 1009145 313044 178021 599386 655170 389422
17032 389422 784709 877526 1251539 772536 961001 703320 809047 389713 903238 730587
17022 730587 468346 478733 712455 925982 672026 711580 856852 478796 736728 729249
17012 729249 525270 850856 664302 516273 875272 853847 1045365 662191 923291 669409
$$ packed form
17082C88513K12720K16368A87925L15296O4182B47331L23633R6807O7412N6745
17072G91928r4375C44631M09134j96727K00876C65954M75151B33406L89627j24623
17062D98410J91224k17284J92132R6793j77653J38610k34320P8903J04896M1390
17052G13101K5793k27504J29087J51662j13209J87208j46116J8225K20011l20329
17042F37929j87769L7682K61006B67626P41519C13044j35023M21365N5784k65748
17032C89422L95287R2817L74013m79003J88465k57681J05727C89713N13525j72651
17022G30587k62241J0387K33722K13527k53956L9554J45272l78056K57932p479
17012G29249k03979L25586j86554j48029L58999k1425J91518l83174K61100k53882
$$ plain form
17002 669409 908519 928023 959223 715912 893616 918471 738680 691800 770223 537195
16992 537195 1014408 1011981 1177499 776944 881970 648376 828737 943068 1220706 1298980
16982 1298980 1063042 737434 754149 1148272 1131259 1173040 1100178 1232003 1107985 981640
16972 981640 1232579 915772 1343507 1047743 711489 840955 1124068 922136 538910 1301225
16962 1301225 784529 1095088 892848 838055 1270679 889758 1044679 1156317 1150585 1138816
16952 1138816 1191056 1216744 1322755 1140491 1192010 1467393 1318204 1533463 1246307 1435491
16942 1435491 1173614 1385328 1441079 1568904 1437945 1393498 1551061 1336761 1653823 1505796
16932 1505796 1511768 1416631 1526002 1501580 1462329 1422789 1700585 1457434 1691842 1719257 1886608
$$ packed form
17002F69409K39110J9504L1200k43311J77704K4855j79791m6880P8423k33028
16992E37195M77213k427J65518m00555J05026k33594J80361J14331K77638P8274
16982A298980k35938l25608J6715L94123j7013M1781p2862J31825j24018j26345
16972I81640K50939l16807M27735k95764l36254J29466K83113k01932l83226P62315
16962A301225n16696L10559k02240n4793M32624l80921J54921J11638n732j1769
16952A138816N2240K5688J06011j82264N1519K75383j49189K15259k87156J89184
16942A435491k61877K11714N5751J27825j30959m4447J57563k14300L17062j48027
16932A505796N972r5137J09371k4422l9251l9540K77796k43151K34408K7415J67351
$$ plain form
16921 1886608 1763903 1736568 1660245 1678537 1814533 1700947 1647814 1685759 1906946 1869257
16911 1869257 1766150 1722340 1966999 1734388 2068928 1930449 1811828 2087425 1771464 2248993
16901 2248993 2141664 2232309 1968758 2611958 2045895 2520445 2057994 2120254 1752181 2317311
16891 2317311 2197500 2413965 2426167 2448142 2103581 2829082 2401720 2375073 2614671 2682003
16881 2682003 2594200 2729136 2726125 2769896 2705385 2703212 2536657 2786084 2854885 2869492 2949212
16870 2949212 3188924 2922811 3030757 2936818 3140045 3042647 3229206 3150496 3470785 3603633
16860 3603633 3392941 3273267 3269468 3460415 3429685 3797065 3949162 3425040 3901119 3670498
16850 3670498 3776865 3965573 4016900 4304565 4046304 4112571 4592039 4260524 4283791 4607360
$$ packed form
16921A886608j22705k7335p6323J8292J35996j13586n3133L7945K21187l7689
16911A869257j03107m3810K44659k32611L34540j38479j18621K75597l15961M77529
16901B248993j07329R0645k63551O43200n66063M74550m62451O2260l68073N65130
16891B317311j19811K16465J2202K1975l44561P25501m27362k6647K39598O7332
16881B682003q7803J34936l011M3771o4511k173j66555K49427O8801J4607P9720
16870B949212K39712k66113J07946r3939K03227r7398J86559p8710L20289J32848
16860C603633k10692j19674l799J90947l0730L67380J52097n24122M76079k30621
16850C670498J06367J88708N1327K87665k58261O6267M79468l31515K3267L23569
$$ plain form
16840 4607360 4621496 4759538 4798351 4917988 5115107 5018839 5027002 5126225 5335589 5568563
16830 5568563 5603952 5055936 5487384 5592119 6009009 6065239 5968849 5989930 6075868 6278736
16820 6278736 6570586 6854073 6835257 6607264 6803731 6938781 7528530 7368066 7474755 7351105
16810 7351105 7586874 7857521 8295119 8126605 8790028 8682233 8981636 9328254 9522035
16801 9522035 9564830 9643572 9904019 10447268 10563355 10744057 11063148 11150693 11949207 12098885
16791 12098885 12036468 12392931 12942748 13601196 13718220 14109697 14660798 14881381 14850667 15622643
16781 15622643 16114995 16656489 17131842 17341044 18097874 18921721 19394325 20127469 20483198
16772 20483198 21565729 21826276 22680630 23843403 24283096 25324070 25995824 27096450 27842577
$$ packed form
16840D607360J4136J38042L8813J19637J97119r6268Q163R9223K09364K32974
16830E568563L5389n48016M31448J04735M16890N6230r6390K1081Q5938K02868
16820F278736K91850K83487j8816k27993J96467J35050N89749j60464J06689j23650
16810G351105K35769K70647M37598j68514O63423j07795K99403L46618J93781
16801I522035M2795P8742K60447N43249J16087J80702L19091Q7545P98514J49678
16791A2098885o2417L56463N49817O58448J17024L91477N51101K20583l0714P71976
16781A5622643M92352N41494M75353K09202P56830Q23847M72604P33144L55729
16772B0483198J082531K60547Q54354J162773M39693J040974O71754J100626P46127
$$ plain form
16763 27842577 29421514 30270027 31301983 32896657 33935652 35223281 36748292 38066097
16755 38066097 39927257 41472956 43474349 45361100 47282222 49176845 51814022 54138528
16747 54138528 56767218 58809867 62241135 64815373 67829928 71363331 74671624 78244909
16739 78244909 82301843 86243726 90139688 93909580 98658368 102735390 107645236 112185346
16731 112185346 116527427 120941492 125426398 129531600 133638833 137052151 140300759 143101372
16723 143101372 145506075 147089590 147917291 148468472 148338797 147803044 146038245 144312314
16715 144312314 141548963 138311525 134858873 131078494 126798983 122510508 117774658 113427233
16707 113427233 108988778 104207980 99765678 95431039 90980585 86959691 82707050 78995496
$$ packed form
16763B7842577J578937Q48513J031956J594674J038995J287629J525011J317805
16755C8066097J861160J545699K001393J886751J921122J894623K637177K324506
16747E4138528K628690K042649L431268K574238L014555L533403L308293L573285
16739G8244909M056934L941883L895962L769892M748788M077022M909846M540110
16731A12185346M342081M414065M484906M105202M107233L413318L248608K800613
16723A43101372K404703J583515Q27701N51181j29675n35753j764799j725931
16715A44312314k763351l237438l452652l780379m279511m288475m735850m347425
16707A13427233m438455m780798m442302m334639m450454m020894m252641l711554
$$ plain form
16699 78995496 75643273 71613736 68689218 65406766 61949183 59508881 56933398 54060711
16691 54060711 51366995 49091028 47093466 45169587 43071052 41248117 39357467 37808165
16683 37808165 36128317 34787714 33479179 31938985 30637397 29603068 28738389 27181359
16675 27181359 26312683 25582091 24489139 23583297 22932543 22005909 21427143 20692867 19670153
16666 19670153 19319997 18556391 17900329 17219348 16964213 16419637 15777714 15248304 15087031
16657 15087031 14226553 14125618 13709431 13492871 12954777 12758450 12182193 11881353 11622696
16648 11622696 11308657 11078589 10997514 10471320 10113638 9790041 9732261 9411404 9222394 8881088
16638 8881088 8880997 8584509 8422904 8294586 8115941 7920262 7616279 7457308 7470803 7273844
$$ packed form
16699G8995496l352223m029537k924518l282452l457583k440302k575483k872687
16691E4060711k693716k275967j997562j923879k098535j822935j890650j549302
16683C7808165j679848j340603j308535j540194j301588j034329q64679j557030
16675B7181359q68676p30592j092952r05842o50754r26634n78766p34276j022714
16666A9670153l50156p63606o56062o80981k55135n44576o41923n29410j61273
16657A5087031q60478j00935m16187k16560n38094j96327n76257l00840k58657
16648A1622696l14039k30068q1075n26194l57682l23597n7780l20857j89010l41306
16638H881088r1k96488j61605j28318j78645j95679l03983j58971J3495j96959
$$ plain form
16628 7273844 7072888 6477082 6696494 6783510 6563725 6402781 6132758 5884794 6142960 5835013
16618 5835013 5613811 5413401 5297913 5396700 5038105 5080821 5121078 4746049 4788549 4968180
16608 4968180 4790052 4639048 4535136 4606265 4554585 4322670 4358277 4308549 4373117 3959417
16598 3959417 4011985 3973588 3861622 3659558 3581665 3593750 3464201 3808631 3601630 3425351
16588 3425351 3449760 3098014 3180311 3438715 3076958 3177986 2942864 2835951 2975179 3002639
16578 3002639 2725373 2931779 2820976 2730216 2545136 2557604 2621222 2890925 2336660 2580517
16568 2580517 2634594 2564173 2042380 2724651 2476582 2087058 2432136 2123184 2238203 2024127
16558 2024127 2349518 2131760 2175988 2089033 2256060 2291341 2057281 2103291 2019022 2178592
$$ packed form
16628G273844k00956n95806K19412Q7016k19785j60944k70023k47964K58166l07947
16618E835013k21202k00410j15488R8787l58595M2716M0257l75029M2500J79631
16608D968180j78128j51004j03912P1129n1680k31915L5607m9728O4568m13700
16598C959417N2568l8397j11966k02064p7893J2085j29549L44430k07001j76279
16588C425351K4409l51746Q2297K58404l61757J01028k35122j06913J39228K7460
16578C002639k77266K06406j10803r0760j85080J2468O3618K69703n54265K43857
16568B580517N4077p0421n21793O82271k48069l89524L45078l08952J15019k14076
16558B024127L25391k17758M4228q6955J67027L5281k34060M6010q4269J59570
$$ plain form
16548 2178592 2286945 1813575 2002031 2121897 2080533 1885942 1676273 1432002 1481680 1879419
16538 1879419 1756322 1526684 1605570 1994328 1531752 1642913 1536290 1396055 1501290 1621710
16528 1621710 1555117 1571888 1546181 1315628 1033141 1463908 1393297 1403031 1277373 1369598 1249589
16517 1249589 1373563 1423357 1281826 1300605 1373922 1341686 1429069 1270924 1303945 1334555 1274481
16506 1274481 1014415 1096496 1339830 1267859 936102 1084608 1171055 958077 1273009 1005838
16496 1005838 1241857 1267638 1112192 1027109 1194323 900880 832798 923262 1196928 875131
16486 875131 1102638 1164229 846002 1022946 968384 928185 724500 943722 656913 1271816
16476 1271816 942553 778617 727049 841062 849994 753393 822446 883799 848113 830943 721499
$$ packed form
16548B178592J08353m73370J88456J19866m1364j94591k09669k44271M9678L97739
16538A879419j23097k29638P8886L88758m62576J11161j06623j40235J05235J20420
16528A621710o6593J6771k5707k30553k82487M30767p0611R734j25658R2225j20009
16517A249589J23974M9794j41531J8779P3317l2236Q7383j58145L3021L0610o0074
16506A274481k60066Q2081K43334p1971l31757J48506Q6447k12978L14932k67171
16496A005838K36019K5781j55446q5083J67214k93443o8082R0464K73666l21797
16486H75131K27507O1591l18227J76944n4562m0199k03685K19222k86809O14903
16476A271816l29263j63936n1568J14013Q932r6601O9053O1353l5686j7170j09444
$$ plain form
16465 721499 917634 1006641 629784 435648 833686 824588 983716 825873 822969 895832 602490
16454 602490 640816 784658 514728 463956 612893 533115 665280 643937 444554 780372
16444 780372 631589 887681 698614 830716 710448 810001 903906 570275 854916 781921
16434 781921 585129 706529 541476 645077 316650 551201 659385 747771 678713 588228
16424 588228 266616 605785 627424 680204 651233 760600 533008 466689 593799 675023
16414 675023 303305 390167 334544 752356 911473 591747 213327 558301 572386 508081
16404 508081 598009 287037 541348 623721 516585 264708 687819 453469 661326 614075
16394 614075 674390 489503 471386 650237 121417 325348 571097 173366 633161 575357
$$ packed form
16465G21499J96135Q9007l76857j94136L98038r098J59128j57843k904P2863k93342
16454F02490L8326J43842k69930n0772J48937p9778J32165k1343j99383L35818
16444G80372j48783K56092j89067J32102j20268R9553R3905l33631K84641p2995
16434G81921j96792J21400j65053J03601C16650K34551J08184Q8386o9058r0485
16424E88228B66616L39169K1639N2780k8971J09367k27592o6319J27110Q1224
16414F75023C03305Q6862n5623M17812J59117l19726B13327L44974J4085o4305
16404E08081Q9928B87037K54311Q2373j07136k51877M23111k34350K07857m7251
16394F14075O0315j84887j8117J78851A21417K03931K45749A73366M59795n7804
$$ plain form
16384 575357 509873 585527 590362 286136 633779 366507 286821 407163 630065 243210
16373 478659 331340 300995 453028 417704 306567 323007 405982 205836 531199 324764
16363 324764 528302 534058 447638 305012 282548 354541 247966 478214 264734 18234 435273
16352 435273 531250 333131 363255 405198 413117 532910 350724 409808 473771 392753 347853
16341 347853 62704 580056 491420 629927 486422 268706 381667 173407 595112 327059
16331 327059 498016 90362 293049 222949 477814 426847 149781 318775 235336 98841
16320 141511 416350 273303 -40250 343615 379267 155124 277162 -85432 457489 227753
16309 237433 292804 63591 412013 213420 25025 10992 -262482 372804 334252 262572 161758
$$ packed form
16384E75357o5484P5654M835B86136L47643k67272p9686J20342K22902B43210
16373D78659j47319l0345J52033l5324j11137J6440Q2975k00146L25363k06435
16363C24764K03538N756q6420j42626k2464P1993j06575K30248k13480A8234M17039
16352D35273R5977j98119L0124M1943P919J19793j82186N9084O3963q1018m4900
16341C47853F2704N17352q8636J38507j43505k17716J12961A73407M21705k68053
16331C27059J70957I0362K02687p0100K54865n0967A49781J68994q3439I8841
16320A41511K74839j43047d0250C43615L5652A55124J22038h5432D57489B27753
16309B37433N5371F3591L48422j98593B5025A0992b62482C72804l8552p1680j00814
$$ plain form
16298 161758 558601 394019 382995 -60211 347367 425526 420154 140028 213330 -196603 329042
16286 391665 29642 387544 113642 244927 -102630 405786 308792 212868 182738 553785
16276 553785 -66636 147235 -76544 233322 170785 27388 232424 270434 -16989 53515 196880
16265 196880 183532 410086 1345 161330 -164669 -137112 107000 195484 76180 265288 133701
16254 133701 230025 -42543 54283 322532 98219 120239 -25422 283236 38535 140788 -15349
16242 196555 306730 141674 97961 168577 297961 216692 -338503 182200 57992 163925
16232 163925 354091 89513 185623 -26125 -90906 -300353 288194 -174865 307230 322071
16222 322071 92238 275755 -5784 306320 91899 303520 123059 146397 -149529 -4028 408025
$$ packed form
16298A61758L96843j64582j1024f0211C47367P8159n372A40028P3302a96603C29042
16286C91665B9642L57902A13642J31285a02630D05786r6994r5924l0130L71047
16276E53785f6636A47235g6544B33322o2537B7388K05036L8010a6989E3515J43365
16265A96880j3348K26554A345J59985a64669K7557A07000Q8484G6180J89108j31587
16254A33701R6324d2543E4283K68249I8219K2020b5422B83236C8535J02253a5349
16242A96555J10175A41674m3713P0616J29384q1269c38503A82200E7992J05933
16232A63925J90166H9513R6110b6125o4781k09447B88194a74865C07230J4841
16222C22071I2238J83517e784C06320I1899K11621A23059K3338a49529d028D08025
$$ plain form
16210 297739 46341 -322736 322247 122341 -201897 -57435 377839 70557 112538 -222035
16199 230394 18596 -196936 -15559 -148003 257244 168388 260293 -193268 180329 291239
16189 291239 -47489 76441 -143919 233315 170042 8380 60829 221314 252328 132755 -15178
16177 -26571 -49176 54687 319035 142211 -120412 61066 207420 181419 -79866 19795 44005
16166 44005 -77122 -61913 177418 -21196 -429063 -219603 -28837 10272 40970 107615 289625
16155 289625 -40281 252514 -50146 262881 -148994 71667 280239 -161551 -56078 -166723
16145 -166723 101743 -124979 145296 3739 48408 15693 -30786 169812 -358459 68660 158368
16134 158368 41319 -82859 -2268 262329 116837 33970 -225233 253378 -120014 -188113 -16387
$$ packed form
16210B97739D6341c22736C22247A22341b01897e7435C77839G0557M1981b22035
16199B30394A8596a96936a5559j32444B57244q8856R1905a93268A80329J10910
16189B91239d7489G6441a43919B33315o3273H380N2449J60485L1014j19573a5178
16177b6571k2605E4687K64348A42211a20412F1066J46354k6001g9866A9795K4210
16166D4005g7122J5209A77418b1196m07867K09460b8837A0272L0698O6645J82010
16155B89625d0281B52514e0146B62881a48994G1667K08572a61551e6078j10645
16145a66723A01743a24979A45296C739M4669A5693c0786A69812c58459F8660Q9708
16134A58368D1319h2859b268B62329A16837C3970b25233B53378a20014o8099a6387
$$ plain form
16122 111869 126105 305009 -72704 323844 210879 -18673 125148 215215 53324 177884
16112 177884 -125525 289012 213057 -136533 -19129 4605 465876 -196025 448014 63682
16101 -529483 -218246 106591 117710 203086 -29099 88974 189785 6677 -81863 245217 225431
16090 225431 -238817 -89518 -57491 316896 89448 -228847 259065 19893 -103754 32272
16079 -23318 -120558 -335074 123836 143430 -350553 -56157 74867 81690 -35038 179499 -93703
16067 -225753 145868 97924 134113 -63658 -11945 -56190 -49454 16509 209780 -7552 78774
16055 153913 -220131 273756 5377 -90008 77753 149974 -160819 41259 38743 648 -180490
16043 158510 27386 8317 -34898 61363 275825 236428 -127702 244919 105401 -173639 15589
$$ packed form
16122A11869J4236J78904g2704C23844j12965a8673A25148R0067E3324J24560
16112A77884a25525B89012p5955a36533a9129D605M61271a96025D48014F3682
16101e29483b18246A06591J1119Q5376b9099H8974J00811F677h1863B45217j9786
16090B25431b38817h9518L2027C16896H9448b28847B59065A9893a03754C2272
16079b3318r7240k14516A23836J9594c50553e6157G4867O823c5038A79499i3703
16067b25753A45868m7944L6189f3658a1945m4245O736A6509J93271g552G8774
16055A53913b20131B73756E377i0008G7753P2221a60819D1259k516F48a80490
16043A58510B7386H317c4898F1363K14462l9397a27702B44919A05401a73639A5589
$$ plain form
16031 -70229 -32442 172362 -106851 114734 -8340 90207 45942 134668 -15011 120329 -166847
16019 -245874 -21561 171016 -66955 -59482 -83135 228227 145100 -37879 31068 354409 24156
16007 -260598 -190426 16195 -164547 -344545 181955 -155192 -62374 -110731 266867 160978
15997 160978 272875 423923 -193737 124313 -311672 -64019 -68635 93791 -60436 210232
15986 -287859 80656 195096 276222 -71833 322842 507145 941087 808358 793003 323282
15975 297138 191776 -115996 92344 -47303 -198142 31610 205509 230691 -283968 -30500
15964 -328668 -136600 -149471 -67949 -14727 181782 -213171 -345053 192198 -26179 69287
15953 218787 2381 -8080 -34865 29859 -91276 5703 344417 14563 212524 211730 21177 -32476
$$ packed form
16031g0229c2442A72362a06851A14734h340I0207m4265Q8726a5011A20329a66847
16019b45874b1561A71016f6955P473k3653B28227q3127c7879C1068L23341B4156
16007b60598P0172A6195a64547j79998A81955a55192f2374m8357B66867j05889
15997A60978J11897J51048a93737A24313c11672f4019m616I3791f0436B10232
15986b87859H0656J14440Q1126g1833C22842J84303M33942j32729j5355C23282
15975B97138j05362a15996I2344d7303j50839C1610J73899K5182b83968c0500
15964c28668a36600j2871f7949a4727A81782b13171j31882A92198b6179F9287
15953B18787B381h080k6785B9859i1276E703L38714A4563J97961p94B1177c2476
$$ plain form
15940 512531 -312301 -37102 -65550 -102079 74085 110565 -109718 -105871 -278876 36781 117356
15929 117356 -178698 -173920 4022 -178656 -75376 -7772 -10867 -4313 -108214 97758 -168521 144415
15916 -157572 -38469 16397 78213 56142 375301 278740 138343 233347 -31110 -3308 -127653
15905 -127653 217471 31898 57828 -155788 143616 -169138 194808 -204064 121217 -94798
15894 49823 -236018 -196274 76285 220592 73900 13620 -62511 10403 -134477 -118198 -99389
15883 -99389 -67719 -16959 -273258 206874 -202198 -116835 -236493 -185625 -372570 127610
15872 -50683 274603 79567 -158056 -146789 -377154 319294 190593 -411905 93388 173182
15862 173182 55177 87116 -53850 160405 96646 -45328 -35547 -119817 -110385 -43680 45062 -311460
$$ packed form
15940E12531c12301c7102k8448l6529G4085L6480a09718L847j73005C6781Q0575
15929A17356a78698M778D022a78656g5376g772l095d313j03901I7758a68521A44415
15916a57572c8469A6397O1816k2071L19159r6561A38343R5004c1110c308j24345
15905a27653B17471C1898K5930a55788A43616a69138A94808b04064A21217i4798
15894D9823b36018L9744G6285J44307G3900A3620f2511A0403a34477J6279J8809
15883i9389L1670a6959k56299B06874b02198Q5363j19658N0868j86945A27610
15872e0683B74603G9567a58056J1267k30365C19294j28701d11905I3388P9794
15862A73182E5177L1939e3850A60405o3759d5328R781q4270R432d3680D5062c11460
$$ plain form
15849 -340158 -131009 7397 114691 118082 70954 78458 -130139 -58496 264202 -199605 253393
15837 225376 122998 -142825 -209331 10539 -48221 -189936 -121693 -385273 -89099 -200051
15827 -200051 104848 27616 -153932 -13529 -133345 -204689 255485 191291 -20583 -8585 -131233
15816 -131233 -85485 -132179 -79551 -116946 774 -94522 63101 -77709 26205 24754 116153 170294
15804 170294 111466 -9347 -53018 139939 -255080 235200 -88177 -179545 37698 -12451 31689
15792 -119598 66784 -221931 -163199 137947 -268275 -109719 -91402 118531 21901 -125523
15781 251228 -609 219263 113048 -43908 -185783 122564 -60341 40553 -145238 -44723 235958
15769 -101537 -182015 -231509 -180921 -94669 -112653 -69297 119527 -339418 75749 202372 132025
$$ packed form
15849c40158a31009G397J07294L391m7128P504a30139e8496B64202a99605B53393
15837B25376j02378a42825o6506A0539d8221j41715O8243k63580h9099j10952
15827b00051A04848B7616a53932a3529j19816p1344B55485o4194b0583h585j22648
15816a31233M5748m6694N2628l7395G74i4522F3101g7709B6205j451R1399N4141
15804A70294n8828i347m3671A39939b55080B35200h8177r1368C7698a2451C1689
15792a19598F6784b21931N8732A37947b68275a09719J8317A18531B1901a25523
15781B51228f09B19263j06215d3908j41875A22564f0341D0553a45238d4723B35958
15769a01537q0478m9494N0588Q6252j7984M3356A19527c39418G5749J26623p0347
$$ plain form
15758 132025 130784 -252628 -183962 -106926 140191 250459 -11921 17025 -300010 -276236 -20506
15746 -16570 5048 288602 -157313 66892 316611 -281408 -99387 -38421 -161381 84923 67662
15735 67662 -263308 -538349 262648 173176 8954 -209470 -260689 23860 -159331 -315748 44276
15723 -83817 -83809 -211432 -40685 -116166 91182 -4951 282344 135890 -166277 94546 -315914 -12137
15710 -468967 123574 -137705 -141215 15234 -164430 -16379 -352342 24501 -232088 -128054
15700 -128054 230453 -23011 -62848 110518 -61118 -28349 -98785 -224151 148072 247876 -130347
15688 -233420 -237171 -468098 -79436 -25391 -18964 102641 -177717 217776 -522731 100511 55375
15677 55375 -105676 -123219 -124850 -24521 -139738 -118040 -29066 -50568 50179 -173951 -95221
$$ packed form
15758A32025j241b52628O8666P7036A40191J10268a1921A7025c00010K3774b0506
15746a6570E048K83554a57313F6892K49719b81408i9387c8421j22960H4923j7261
15735F7662b63308k75041B62648q9472H954b09470n1219B3860a59331j56417D4276
15723h3817Qj27623d0685p5481I1182d951B82344A35890a66277I4546c15914a2137
15710d68967A23574a37705l510A5234a64430a6379l35963B4501b32088J04034
15700a28054B30453b3011l9837A10518f1118b8349p0436j25366A48072R9804a30347
15688b33420l751k30927g9436b5391O427A02641a77717B17776e22731A00511m5136
15677E5375a05676j7543j631b4521j15217K1698b9066k1502E0179a73951P8730
$$ plain form
15666 -95221 -256073 -440 182835 331612 -380677 -157797 58156 -124015 3779 -287596 181496
15654 121066 13922 -297906 -453907 -11441 -83696 383578 19599 -79519 -38178 219271 326377
15643 326377 -123570 -150105 -67334 96802 274516 244425 -70627 -307522 -444009 -258861
15633 -258861 -72430 213765 -33683 -2395 -24599 -66425 -90630 -197214 106412 -134689 -390430
15622 -390430 -94335 -5065 12278 -21915 -33050 28480 282584 192111 152735 -34016 -252914
15611 -252914 233354 60890 71065 57659 169785 199628 -254487 -170415 -151945 284686 -167362
15599 -206004 17618 189035 -335019 -121754 163280 -39776 65545 -65741 -82385 136064
15588 -59437 559171 9352 206858 12789 255517 -73833 39706 415296 -218851 141777 -91828
$$ packed form
15666i5221j60852d40A82835J48777c80677a57797E8156a24015C779b87596A81496
15654A21066A3922b97906j56001a1441p2255C83578A9599g9519c8178B19271J07106
15643C26377a23570k6535f7334I6802J77714l0091g0627k36895j36487J85148
15633b58861g2430B13765c3683b395k2204m1826k4205j06584A06412a34689k55741
15622c90430i4335e065A2278b1915j1135B8480K54104r0473l9376c4016k18898
15611b52914B33354F0890J0175j3406J12126K9843b54487Q4072J8470B84686a67362
15599b06004A7618J71417c35019a21754A63280c9776F5545f5741j6644A36064
15588e9437E59171I352J97506A2789K42728g3833C9706L75590b18851A41777i1828
$$ plain form
15576 49061 289876 151786 -20462 -57192 100876 -97969 364562 -117467 -18003 276776
15565 187669 20593 21218 2328 48172 254826 178503 -97395 -135877 -202423 -160363 76432 -164199
15552 -98341 -4167 -166672 167537 194296 -9461 325528 -259199 75792 -160264 438560 -285184
15540 22732 -189042 -140573 93801 -302979 514042 289798 49682 193372 373234 -174767
15529 -9168 2721 142705 -360962 31384 -142860 -226225 127331 -131334 78757 414862 -196991
15517 187423 148334 -244784 196840 176973 9947 168118 156085 24415 434106 157727 58501
15505 -135710 60920 -209117 -102553 -149653 22104 65925 208360 -131329 17403 -407866
15494 -113637 35470 -330213 54985 -300605 -232757 64340 -433902 73288 122203 -154172 92542
$$ packed form
15576D9061K40815j38090b0462l6730A00876i7969C64562a17467a8003B76776
15565A87669B0593O25B328M5844K06654p6323i7395l8482o6546M2060G6432a64199
15552i8341d167j62505A67537K6759i461C25528b59199G5792a60264D38560b85184
15540B2732a89042M8469I3801c02979E14042k24244D9682J43690J79862a74767
15529i168B721J39984c60962C1384a42860q3365A27331a31334G8757L36105a96991
15517A87423l9089b44784A96840j9867I947J58171j2033B4415M09691A57727E8501
15505a35710F0920b09117a02553m7100B2104M3821J42435a31329A7403d07866
15494a13637C5470c30213E4985c00605O7848F4340d33902G3288M8915a54172I2542
$$ plain form
15482 -142053 -117275 227871 67852 446878 -96682 633 449061 84682 -80583 154303 117917
15471 117917 295887 -264843 -37163 -136852 71988 331489 165972 149049 -277684 -233837
15461 -233837 313923 153312 77413 10833 -35116 210838 149977 109954 22484 -147734 159862
15449 -227908 -2601 38102 25258 -201042 94342 85555 115813 481201 74823 -54122 98953
15437 269417 338330 78818 -512 173151 -89083 85751 -43614 192999 177986 -26103 -23361 -3652
15424 38551 97259 146841 -183433 -257137 175192 -12587 -457407 -148603 -113127 -240524 -48675
15412 360488 -200329 62664 -21982 -173797 -136838 -131081 276 7727 19987 138761 19789 -255754
15399 184336 270361 -192297 -60307 -278548 -129858 -148365 -132534 -89208 269333 -76971 -56595
$$ packed form
15482a42053K4778B27871F7852L79026i6682F33M48428H4682h0583A54303l6386
15471A17917J77970b64843c7163r9689G1988K59501j65517j6923b77684M3847
15461b33837C13923A53312p5899A0833c5116B10838o0861m0023B2484a47734A59862
15449b27908b601C8102j2844b01042I4342q787L0258L65388G4823e4122I8953
15437B69417O8913G8818e12A73151h9083H5751d3614A92999j5013b6103K742c652
15424C8551N8708M9582a83433p3704A75192a2587m44820a48603L5476j27397d8675
15412C60488b00329F2664b1982j51815L6959N757B76P451J2260J18774A9789b55754
15399A84336Q6025a92297f0307k18241a29858j8507J5831M3326B69333g6971K0376
$$ plain form
15388 -56595 -47076 -133856 240978 -71947 82574 -73367 306144 -22821 121966 38677 25009
15377 25009 309372 228080 280462 70534 22986 68449 139493 -143179 -26124 -159511 89721
15365 224136 -29547 -86439 -41133 365750 -102866 174202 -105307 74064 73131 -115130 252848
15353 48717 65800 140469 454743 -70670 157516 140824 163204 16047 224811 149767 211504
15342 211504 233030 85317 -44735 102550 -58457 158968 403360 384776 -66538 167883 -14467
15330 123696 157248 -140075 316001 -6817 -262482 -69059 -172020 -15937 -71971 112695 134450
15319 134450 51104 -71758 1855 -201313 -119024 151423 -237620 25413 -90221 89818 -58006
15307 78070 -90052 -25188 169000 9231 138202 6651 72298 -169193 1381 94521 -76199 92695
$$ packed form
15388e6595R519q6780B40978g1947H2574g3367C06144b2821A21966C8677j3668
15377B5009K84363q1292N2382G0534B2986M5463P1044a43179b6124j33387H9721
15365B24136b9547n6892d1133C65750a02866A74202a05307G4064r33a15130B52848
15353D8717J7083P4669L14274g0670A57516j6692K2380A6047K08764p5044O1737
15342B11504K1526H5317d4735A02550e8457A58968K44392j8584f6538A67883a4467
15330A23696L3552a40075C16001f817k55665f9059j02961a5937n6034A12695K1755
15319A34450E1104g1758A855b01313Q2289A51423b37620B5413i0221H9818e8006
15307G8070i0052b5188A69000I231J28971F651O5647a69193A381R3140g6199I2695
$$ plain form
15294 220320 25916 -276678 -46062 -139015 522962 196879 79972 70867 36182 76708 -148420
15282 209424 394549 -168578 -12146 -89495 -211211 292996 -1737 100625 -120313 -26426
15271 12898 365619 -19187 295555 -145748 164710 148596 66883 -13132 -302763 -96641 -150272
15260 -150272 -120893 -504635 55516 218654 144122 -344331 -100849 -67204 163433 -241465
15249 272374 120634 72429 447771 490798 32796 42088 106276 338903 395349 1097237 2420300
15238 2420300 2746977 2009211 3322416 1462347 478283 -18522 233759 162595 119658 -77965
15227 -160889 7655 -45951 104867 228546 -229412 142945 -53344 -66355 170532 111030 365446
15216 365446 308197 -67700 396655 5366 185124 182935 402020 139220 112770 53585 -8003
$$ packed form
15294B20320B5916b76678d6062r2953E22962A96879G9972r105l4685M0526a48420
15282B09424J85125a68578a2146p7349j21716B92996a737A00625a20313b6426
15271A2898L52721a9187B95555a45748A64710j6114F6883a3132k89631i6641n3631
15260a50272K9379l83742E5516J63138p4532c44331a00849L3645A63433b41465
15249B72374A20634m8205L75342M3027C2796R292O4188K32627N6446P01888J323063
15238B420300L26677p37766J313205A462347D78283a8522B33759p1164m2937g7965
15227a60889G655d5951A04867J23679b29412A42945e3344j3011A70532n9502K54416
15216C65446n7249f7700C96655E366J79758k189K19085A39220k6450E3585h003
$$ plain form
15204 -85695 271380 -92753 -281389 312360 -47007 201375 351282 187305 -22878 -53674
15194 -53674 -220519 -108616 242707 15440 -92031 207093 228113 -33719 -50633 17170 96989
15183 96989 161807 -273963 23956 55105 294562 140566 -258068 -115493 49447 -68726 -145975
15172 -145975 217777 6497 -168194 407959 152774 270362 -202249 148961 -42669 118410
15161 200040 -45825 126749 -100046 -217614 130458 168735 60646 384774 341002 204073
15151 204073 -183846 167773 -70996 196011 85272 44293 83524 63774 201576 103651 -84498
15139 -21990 30784 263597 121789 -257016 133426 -42461 224655 85252 218929 103923
15128 40576 28357 371020 478953 53507 196861 16064 284781 20716 335354 278126 -20510
$$ packed form
15204h5695B71380i2753j88636C12360d7007B01375J49907j63977b2878l0796
15194e3674j66845a08616B42707A5440i2031B07093K1020c3719j6914A7170P9819
15183I6989O4818b73963B3956L1149K39457A40566b58068a15493D9447f8726p7249
15172a45975B17777F497a68194D07959A52774J17588b02249A48961d2669A18410
15161B00040d5825A26749a00046j17568A30458L8277F0646L24128m3772j36929
15151B04073a83846A67773g0996A96011H5272m0979L9231j9750J37802r7925h4498
15139b1990C0784K32813A21789b57016A33426d2461B24655H5252J33677A03923
15128D0576j2219L42663J07933E3507J43354A6064K68717B0716L14638n7228b0510
$$ plain form
15116 220092 239925 31701 319682 411577 149536 542889 383078 68153 -67655 354383
15105 -79442 -51728 323283 758430 673462 387734 169870 347580 166219 36004 192935
15095 192935 34847 353154 101918 134990 -129360 -72 75976 242143 181944 338234 86751
15083 99047 270181 306113 -206731 149164 -133587 32176 140595 278171 34743 316111
15073 316111 164253 -25082 348468 285187 212710 -128898 144009 29441 74095 260831
15063 260831 -20947 31300 103065 277311 135104 -138677 8854 204800 105460 288581 -58678
15051 -51942 427483 257282 279672 410531 -47778 349386 230193 398668 104991 395618
15041 395618 -34097 169954 -83690 91701 216425 190859 260190 118263 196754 376361 321543
$$ packed form
15116B20092J9833C1701K87981R1895A49536L93353j59811F8153f7655C54383
15105g9442K7714C23283M35147q4968k85728A69870J77710A66219C6004J56931
15095A92935C4847L18307A01918L3072a29360g2G5976J66167o0199J56290H6751
15083I9047J71134L5932b06731A49164a33587C2176J08419J37576C4743K81368
15073C16111j51858b5082C48468o3281p2477a28898A44009B9441M4654J86736
15063B60831b0947C1300P1765J74246A35104a38677H854J95946r9340J83121e8678
15051e1942D27483j70201K2390J30859d7778C49386j19193J68475A04991K90627
15041C95618c4097A69954h3690I1701J24724k5566O9331A18263P8491J79607n4818
$$ plain form
15030 321543 243798 53723 228164 200936 121453 154145 68597 274101 218107 237495 334883
15019 334883 459355 381595 123673 138389 347989 229112 -6169 233539 62489 219907
15009 219907 519553 312472 389436 464131 90057 409302 174825 108133 327396 20726
14998 126099 212325 45463 229529 56325 -218850 217107 281938 431793 113201 255239
14988 255239 41724 267236 436514 307095 452445 84673 373276 226898 125922 386197
14978 386197 49349 197528 240504 360556 754038 223650 418513 23448 179876 76165
14967 213888 340150 388250 465814 437238 181399 -55980 74940 -176637 616620 362446
14957 362446 121329 536512 500684 532867 128477 206212 366464 314826 20030 398009
$$ packed form
15030C21543p7745E3723J74441k7228p9483L2692F8597K05504n5994J9388R7388
15019C34883J24472p7760A23673J4716K09600j18877f169B33539F2489J57418
15009B19907K99646k07081P6964P4695I0057L19245A74825o6692K19263B0726
14998A26099Q6226D5463J84066E6325b18850B17107O4831J49855A13201J42038
14988B55239D1724K25512J69278j29419J45350H4673K88603j46378j00976K60275
14978C86197D9349J48179M2976J20052L93482B23650J94863B3448J56428G6165
14967B13888J26262M8100P7564k8576A81399e5980G4940a76637F16620k54174
14957C62446A21329M15183l5828L2183A28477P7735J60252n1638B0030L77979
$$ plain form
14947 398009 147625 289293 249684 -7720 201012 401407 131222 258272 372314 297845
14937 297845 394364 15126 334057 384357 201937 422015 -111030 246769 555623 126273
14926 304212 427891 413900 378519 340970 430544 345636 756984 662046 365329 588386 158557
14914 500371 640682 659924 104647 720649 372746 163821 598956 155414 448558 528006
14904 528006 218453 94798 93023 145292 325430 403413 418752 113673 523250 70532 340278
14893 340278 317530 308000 388793 330329 486878 214953 309800 180637 711631 508806 284925
14882 284925 419396 365584 502478 165001 364725 404881 135233 338974 151855 277345
14872 277345 434583 304276 406205 610661 539158 618577 341180 59472 253485 288838
$$ packed form
14947C98009A47625J41668l9609g720B01012K00395A31222J27050J14042p4469
14937B97845R6519A5126L18931N0300j82420K20078a11030B46769L08854A26273
14926C04212J23679j3991l5381l7549Q9574q4908M11348r4938k96717K23057A58557
14914E00371J40311J9242A04647O16002l47903A63821M35135A55414K93144P9448
14904E28006B18453I4798j775N2269J80138P7983J5339A13673M09577G0532K69746
14893C40278k2748r530Q0793n8464J56549B14953R4847j29163N30994k02825k23881
14882B84925J34471n3812J36894A65001J99724M0156A35233K03741A51855J25490
14872B77345J57238j30307J01929K04456p1503P9419k77397E9472J94013L5353
$$ plain form
14862 288838 316683 292128 370305 437686 331165 221 477756 451600 758500 543470 356560
14851 356560 737625 603203 433402 784362 645763 423324 139208 685704 690752 640443
14841 640443 634669 414912 366280 567858 387848 611631 531133 657673 763522 630389
14831 630389 386835 439914 562716 459422 171358 304200 327231 385192 234164 463470
14821 463470 400402 160699 483691 544891 714329 421514 459981 615514 469622 257953
14811 257953 581523 525539 389840 335927 567235 692367 463583 464602 534068 558851 570184
14800 570184 683878 614809 652161 725258 507775 395009 692426 689949 334099 502890
14790 502890 490583 410915 693177 441370 403272 453553 586739 120742 1029573 229119
$$ packed form
14862B88838K7845k4555P8177O7381j06521B21M77535k6156L06900k15030j86910
14851C56560L81065j34422j69801L50960j38599k22439A39208N46496N048n0309
14841F40443n774k19757m8632K01578j80010K23783q0498J26540J05849j33133
14831F30389k43554N3079J22802j03294A71358J32842K3031N7961j51028K29306
14821D63470o3068A60699L22992O1200J69438k92815L8467J55533j45892k11669
14811B57953L23570n5984j35699n3913K31308J25132k28784J019O9466K4783J1333
14800E70184J13694o9069L7352P3097k17483j12766K97417k477C34099J68791
14790E02890j2307p9668K82262k51807l8098N0281J33186A20742R08831B29119
$$ plain form
14779 439199 552975 411500 442893 711040 776149 389736 770679 487960 529695 400512
14769 400512 582521 410686 216476 362574 488620 636901 562934 400739 632266 785337
14759 785337 665032 270491 445784 731187 230008 413902 305856 476760 301336 936594
14749 936594 662664 645880 518272 393633 665086 898136 779078 393692 467278 473778
14739 473778 532819 813341 703683 644057 583515 633265 649697 451042 823615 787349 481850
14728 481850 767824 863619 875714 1013402 798832 1112067 736425 678071 1013281 909196
14718 909196 915022 1060824 655614 980233 700842 936262 842912 722772 885565 673813
14708 673813 750367 955839 984453 924975 633791 871531 793753 828562 942213 824447
$$ packed form
14779D39199J13776j41475L1393K68147O5109l86413L80943k82719M1735j29183
14769D00512J82009j71835j94210J46098J26046J48281p3967j62195K31527J53071
14759G85337j20305B70491J75293K85403B30008J83894j08046J70904j75424O35258
14749I36594k73930j6784j27608j24639K71453K33050j19058l85386P3586O500
14739D73778N9041K80522j09658n9626o0542M9750J6432j98655L72573l6266l05499
14728D81850K85974R5795J2095J37688k14570L13235l75642n8354L35210j04085
14718I09196N826J45802m05210L24619k79391K35420r3350j20140J62793k11752
14708F73813P6554K05472K8614n9478k91184K37740p7778L4809J13651j17766
$$ plain form
14698 824447 562338 642302 718621 646698 642456 962830 975369 999791 973992 633372 791500
14687 791500 1024763 857908 1026794 1070212 861631 1078702 909736 716089 1006990 641118
14677 641118 718865 844675 773339 826081 700712 752264 810848 958469 697482 1187671
14667 1187671 812998 656440 1000618 872607 1190075 1137533 913888 1081822 719177 924208
14657 924208 923382 1156041 660554 1151622 639670 938535 704284 928334 1003243 1070558
14647 1070558 930842 1183718 1220707 986132 808559 1513870 863942 1444481 1193888 1049849
14637 1049849 1189597 1037398 1020810 1111406 1181517 1213065 1220336 1212674 1229121 1297512 1048499
14626 1048499 1028738 1337291 1423419 1156737 878573 1142975 1337329 1041699 1197600 1037815
$$ packed form
14698H24447k62109P9964P6319p1923m242L20374J2539K4422k5799l40620J58128
14687G91500K33263j66855J68886M3418k08581K17071j68966j93647K90901l65872
14677F41118P7747J25810p1336N2742j25369N1552N8584J47621k60987M90189
14667A187671l74673j56558L44178j28011L17468n2542k23645J67934l62645K05031
14657I24208q26K32659m95487M91068n11952K98865k34251K24050P4909O7315
14647A070558j39716K52876L6989k34575j77573P05311o49928N80539k50593j44039
14637A049849J39748j52199j6588R0596P0111L1548P271p662J6447O8391k49013
14626A048499j9761L08553Q6128k66682k78164K64402J94354k95630J55901j59785
$$ plain form
14616 1037815 1430891 1102195 1274584 1266016 1036964 1337293 1348121 1142853 1423600 1436043
14606 1436043 1675984 1298203 1287473 1456475 1319122 1549776 1631891 1540691 1422600 1176711
14596 1176711 1784586 1477031 1746135 1792218 1424340 1379740 1699193 1552026 1742889 1593949
14586 1593949 1607191 1601810 1836853 1910390 1792100 1614782 2022183 1671044 1843107 2032236
14576 2032236 1928145 1254384 1779025 1989744 2383331 1994575 2159150 1898899 2472554
14567 2472554 2135379 2252509 2423673 2281000 2407946 2368327 2009854 2313672 2638072 2670871
14557 2670871 2791946 2817374 2641161 3015846 3359033 3488514 4087407 4889608 6490434
14548 6490434 9839570 16476314 35903368 47235372 21118389 7325203 3760043 2768302
$$ packed form
14616A037815L93076l28696J72389q568k29052L00329J0828k05268K80747J2443
14606A436043K39941l77781j0730J69002j37353K30654Q2115r1200j18091k45889
14596A176711O07875l07555K69104M6083l67878m4600L19453j47167J90863j48940
14586A593949J3242n381K35043P3537j18290j77318M07401l51139J72063J89129
14576B032236j04091o73761N24641K10719L93587l88756J64575k60251N73655
14567B472554l37175J17130J71164j42673J26946l9619l58473L03818L24400L2799
14557B670871J21075K5428j76213L74685L43187J29481N98893Q02201J600826
14548F490434L349136O636744J9427054J1332004B1118389G325203l565160r91741
$$ plain form
14540 2768302 2336250 2039363 2441292 2360758 2621908 3870804 7794469 5723744 2652950
14530 1860930 1902481 2015631 2069190 1772769 2372299 2089397 1740603 2358682 2352180 2657490
14520 2657490 2112293 2275793 2225282 2468517 2094966 2306924 2384771 2209129 2472506 2588222
14510 2588222 2515809 2504840 2491799 2195550 2524513 2906474 2710655 2584600 3138114 2621316
14500 2621316 2905553 3130614 2814505 2984063 2844037 2875703 2544825 3047012 3219023 2944749
14490 2944749 3472700 3010279 3153127 3251633 3485660 3061071 3225445 3225585 3183913 3391343
14480 3391343 3653710 3613674 3806745 3869370 3701299 3766210 3933235 3425203 3707000 3934601
14470 3934601 3970032 3961489 3532876 3991797 4015323 3887128 4093687 4161996 4322323 4080736
$$ packed form
14540B768302m32052k96887M01929q0534K61150J248896L923665k070725B652950
14530A860930M1551J13150N3559k96421N99530k82902l48794O18079o502L05310
14520B657490n45197J63500n0511K43235l73551K11958P7847j75642K63377J15716
14510B588222p2413j0969j3041k96249L28963L81961j95819j26055N53514n16798
14500B621316K84237K25061l16109J69558j40026L1666l30878N02187J72011k74274
14490B944749N27951m62421J42848R8506K34027m24589J64374J40m1672K07430
14480C391343K62367m0036J93071O2625j68071O4911J67025n08032K81797K27601
14470C934601L5431q543m28613M58921K3526j28195K06559O8309J60327k41587
$$ plain form
14460 4080736 4335423 4302036 4062936 4953228 4541962 4629355 4535609 4677710 4894143 5191344
14450 5191344 4768236 5030004 5217280 5101754 4824654 5165430 5380863 5047993 5169216
14441 5169216 5434195 5349512 5427704 5329033 6001055 5736264 5766384 5991883 5901208 6240649
14431 6240649 6367072 6399214 6137110 6013388 6521541 6651866 6176669 6493140 6724570 6490666
14421 6490666 6951690 6974980 7082227 7144552 7351089 7389663 7737741 7912985 8002818 7749667
14411 7749667 8175721 8454728 8195110 8386831 8497568 8635588 8642782 9006193 8996973 9302106
14401 9302106 9208387 9637577 9574520 10110337 10028552 10487049 10303917 10838281 10847529 11094394
14391 11094394 10886095 11165709 11348847 11367782 11920651 12038187 12500664 12383960 12836615
$$ packed form
14460D080736K54687l3387k39100Q90292m11266Q7393r3746J42101K16433K97201
14450E191344m23108K61768J87276j15526k77100L40776K15433l32870J21223
14441E169216K64979q4683P8192r8671O72022k64791L0120K25499r0675L39441
14431F240649J26423L2142k62104j23722N08153J30325m75197L16471K31430k33904
14421F490666M61024K3290J07247O2325K06537L8574L48078J75244Q9833k53151
14411G749667M26054K79007k59618J91721J10737J38020P194L63411r220L05133
14401I302106r3719M29190o3057N35817q1785M58497j83132N34364R248K46865
14391A1094394k08299K79614J83138J8935N52869J17536M62477j16704M52655
$$ plain form
14382 12836615 12983067 13181396 13002702 13498079 13796146 14076898 14445048 14818432 15297213
14373 15297213 14894810 15295914 15832604 15744782 16020388 16736136 16971683 17362923 17682060
14364 17682060 17921941 18508144 18731887 19062477 19698347 20099716 20713371 20887526 21538000
14355 21538000 21892408 22311669 22887832 23701888 23925964 24694125 25412899 26010699 26733375
14346 26733375 27135483 27816093 28633252 29162412 30258620 31047964 31841831 32705170 33715568
14337 33715568 34300948 35451947 36470248 37731693 38881594 39582011 40761637 42071619
14329 42071619 43699752 45048268 46464472 47952951 49359409 51343340 52873648 54980062
14321 54980062 56802520 58718293 60819421 63085063 65629275 67830590 70758267 73370548
$$ packed form
14382A2836615J46452J98329j78694M95377K98067K80752L68150L73384M78781
14373A5297213m02403M01104N36690q7822K75606P15748K35547L91240L19137
14364A7682060K39881N86203K23743L30590O35870M01369O13655J74155O50474
14355B1538000L54408M19261N76163Q14056K24076P68161P18774N97800P22676
14346B6733375M02108O80610Q17159N29160J096208P89344P93867Q63339J010398
14337C3715568N85380J150999J018301J261445J149901P00417J179626J309982
14329D2071619J628133J348516J416204J488479J406458J983931J530308K106414
14321E4980062J822458J915773K101128K265642K544212K201315K927677K612281
$$ plain form
14313 73370548 75805927 79268738 82368842 85874320 89334562 93196958 97488128 101679918
14305 101679918 106066234 111334243 116233089 122110482 127759467 133640905 140418802 147855453
14297 147855453 155250815 162954943 171715662 180528297 190056643 200124733 210561951 222085459
14289 222085459 233900100 246574244 259523390 273404431 287543120 302781749 318156265
14282 318156265 333470510 349660632 365163272 380573767 396050058 410467156 423860751
14275 423860751 436284455 446173637 452218036 455850703 458571800 459923705 459656446 455956915
14267 455956915 454423017 447981817 438379194 427089884 414113087 400423955 385273195
14260 385273195 369381006 352762786 336409962 320448440 304668175 289399292 274501663
$$ packed form
14313G3370548K435379L462811L100104L505478L460242L862396M291170M191790
14305A01679918M386316N268009M898846N877393N648985N881438O777897P436651
14297A47855453P395362P704128Q760719Q812635R528346J0068090J0437218J1523508
14289B22085459J1814641J2674144J2949146J3881041J4138689J5238629J5374516
14282C18156265J5314245J6190122J5502640J5410495J5476291J4417098J3393595
14275D23860751J2423704R889182O044399L632667K721097J351905k67259l699531
14267D55956915j533898o441200r602623j1289310j2976797j3689132j5150760
14260C85273195j5892189j6618220j6352824j5961522j5780265j5268883j4897629
$$ plain form
14253 274501663 260383862 246960661 233866467 221721719 210202826 199220968 188577074
14246 188577074 178579810 172556277 165099776 156384193 148066176 140999047 134085321 127876816
14238 127876816 122280880 116614086 111121054 106256804 101671521 97148163 92887926 89969451
14230 89969451 86165107 82407241 79006752 75980024 72956470 70238575 67895680 65109514
14222 65109514 62680811 60518664 58324054 56792343 54783431 52987395 50950941 49104543
14214 49104543 47924026 46790242 45278839 43235277 42350279 40793809 40066337 39451297
14206 39451297 37919665 36670451 35868922 34475472 33547393 32932368 32596374 31387439 30124058
14197 30124058 29472062 28566035 27748741 27225772 26698677 26275044 25693064 25200010 24036706
$$ packed form
14253B74501663j4117801j3423201j3094194j2144748j1518893j0981858j0643894
14246A88577074r997264o023533p456501q715583q318017p067129o913726o208505
14238A27876816n595936n666794n493032m864250m585283m523358m260237k918475
14230H9969451l804344l757866l400489l026728l023554k717895k342895k786166
14222F5109514k428703k162147k194610j531711k008912j796036k036454j846398
14214D9104543j180517j133784j511403k043562q84998j556470p27472o15040
14206C9451297j531632j249214q01529j393450r28079o15025l35994j208935j263381
14197C0124058o51996r06027q17294n22969n27095m23633n81980m93054j163304
$$ plain form
14188 24036706 23632288 23134677 22406701 21923908 21477446 20750821 20573786 20113529 19379124
14179 19379124 19409188 18838547 18335918 18123857 17511746 17166649 16879074 16528202 16315879
14170 16315879 15957217 15516881 15541883 14715824 14545868 14155388 14228947 14086364 13537471 13402159
14160 13402159 12865206 12958007 12962588 12601023 12250421 11972013 11894647 11882753 11483585 11301940
14150 11301940 10854119 10570254 10610183 10454586 10486562 10324283 10137071 9790832 9556937 9818361
14140 9818361 9289773 9390914 9108156 8864518 8932615 8781462 8622770 8591275 8481715 8282556
14130 8282556 8252854 8275444 7930009 7873263 7708527 7668428 7490251 7390931 7441857 7453365 7397883
14119 7397883 7211325 6840941 7359521 6652760 7096236 6927226 6495113 6345869 6409655 6610308
$$ packed form
14188B4036706m04418m97611p27976m82793m46462p26625j77035m60257p34405
14179A9379124L0064n70641n02629k12061o12111l45097k87575l50872k12323
14170A6315879l58662m40336K5002q26059j69956l90480P3559j42583n48893j35312
14160A3402159n36953R2801M581l61565l50602k78408p7366j1894l99168j81645
14150A1301940m47821k83865L9929j55597L1976j62279j87212l46239k33895K61424
14140I818361n28588J01141k82758k43638O8097j51153j58692l1495j09560j99159
14130H282556k9702K2590l45435n6746j64736m0099j78177r9320N0926J1508n5482
14119G397883j86558l70384N18580p06761M43476j69010m32113j49244O3786K00653
$$ plain form
14109 6610308 6309179 6115010 6262320 6085040 5963655 6036161 6014756 5859747 5507906 5502102
14099 5502102 5593551 5499595 5152281 5579437 5327635 5164260 4873737 5041211 4970796 5153657
14089 5153657 4931373 5245053 4730216 4564740 5002598 4522078 4676435 4559653 4557270 4487717
14079 4487717 4255914 4380671 4068639 4142353 3956732 4084427 3951192 3832260 4122417 3970383
14069 3970383 4258849 3921029 3856765 3971910 3716397 3784321 3645351 3520243 3719006 3731257
14059 3731257 3830017 3607447 3668075 3362102 3609838 3195596 3183324 3305127 3269423 3401310
14049 3401310 2672431 3126715 3345009 3340013 2786060 3069216 3217409 2912114 3042822 2799273
14039 2799273 2996009 3026210 2955819 2730146 2797021 2596459 2541060 2698406 2806549 2977248
$$ packed form
14109F610308l01129j94169J47310j77280j21385P2506k1405j55009l51841n804
14099E502102R1449r3956l47314M27156k51802j63375k90523J67474p0415J82861
14089E153657k22284L13680n14837j65476M37858m80520J54357j16782k383o9553
14079D487717k31803J24757l12032P3714j85621J27695j33235j18932K90157j52034
14069C970383K88466l37820o4264J15145k55513O7924j38970j25108J98763J2251
14059C731257R8760k22570O0628l05973K47736m14242j2272J21803l5704J31887
14049C401310p28879M54284K18294m996n53953K83156J48193l05295J30708k43549
14039B799273J96736L0201p0391k25673O6875k00562n5399J57346J08143J70699
$$ plain form
14029 2977248 2792217 3067391 3087179 2911617 2978296 2863801 2303232 2431624 2489317 2561158
14019 2561158 2626980 2371845 2221963 2041272 2251354 2404570 2094850 2015057 2330200 2181311
14009 2181311 2235868 1972391 2042397 1881991 2118530 2275327 1780556 1999444 1810026 2043251
13999 2043251 1738776 1940663 1988708 1735963 1974195 1651602 1701297 1977975 1969364 2196752
13989 2196752 3265886 5365083 10259968 27393658 49316461 28794760 12983342 7371374
13981 7371374 5411674 4498795 3613113 3316208 3195167 2758778 2716469 2519949 2612982 2577462
13971 2577462 2222785 2172888 2075489 2545484 2066070 2115314 2014255 2434402 2070883 2528340
13961 2528340 1973647 2122631 1876666 2232719 1976996 1794385 1828157 1938444 1697961 2007677
$$ packed form
14029B977248j85031K75174J9788j75562O6679j14495n60569J28392N7693P1841
14019B561158O5822k55135j49882j80691K10082J53216l09720p9793L15143j48889
14009B181311N4557k63477P0006j60406K36539J56797m94771K18888j89418K33225
13999B043251l04475K01887M8045k52745K38232l22593M9695K76678q611K27388
13989B196752J069134K099197M894885J7133690K1922803k0521701A2983342n611968
13981G371374j959700r12879q85682k96905j21041m36389m2309j96520R3033l5520
13971B577462l54677m9897r7399M69995m79414M9244j01059M20147l63519M57457
13961B528340n54693J48984k45965L56053k55723j82611L3772J10287k40483L09716
$$ plain form
13951 2007677 1714692 1824880 1929989 1573764 1572483 1297260 1935576 1554850 1160882 1648396
13941 1648396 1444309 1635313 1692650 1643930 1791531 1596590 1017671 1473576 1080954 1452283
13931 1452283 1229792 1445668 1218300 1396170 1315757 1731224 1677430 1544349 1233332 1409880
13921 1409880 1512998 1107635 1090354 1368269 1055394 1476286 1441450 1162602 1222103 1621991
13911 1621991 1369443 1186576 1299285 1067758 1216954 1613163 1055956 1115508 1434034 857227
13901 857227 1232480 1225337 1396558 1374508 1330758 1326437 1307157 969523 1383839 1117354 1293401
13890 1293401 1052284 1334883 1576118 1357998 1087073 1120019 925378 1326865 968308 1281597
13880 1281597 1015233 1083389 932095 981374 1321515 1279829 725171 865703 997740 1303946
$$ packed form
13951B007677k92985J10188J05109l56225j281k75223O38316l80726l93968M87514
13941A648396k04087J91004N7337m8720J47601j94941n78919M55905l92622L71329
13931A452283k22491K15876k27368J77870q0413M15467n3794j33081l11017J76548
13921A409880J03118m05363j7281K77915l12875M20892l4836k78848N9501L99888
13911A621991k52548j82867J12709k31527J49196L96209n57207N9552L18526n76807
13901H57227L75253p143J71221k2050m3750m321j9280l37634M14316k66485J76047
13890A293401k41117K82599K41235k18120k70925L2946j94641M01487l58557L13289
13880A281597k66364O8156j51294M9279L40141m1686n54658J40532J32037L06206
$$ plain form
13870 1303946 1183759 778318 1067719 1101940 1259641 1444130 957681 1083439 1165131 985984
13860 985984 686435 828116 809140 1135480 1109170 1052575 859026 1065010 1164071 1381822
13850 1381822 1062962 687011 876176 1122952 1024124 721629 955690 964806 647227 1015272
13840 1015272 691009 590485 774371 1024292 893779 876989 699640 934142 691362 906517
13830 906517 972990 1061264 975017 760845 730260 841340 814902 599908 820849 651219
13820 651219 943217 949901 904463 856680 832156 636992 807277 976692 773525 666797
13810 666797 797714 837849 544595 513102 760830 926297 590217 453448 710818 722102
13800 722102 992423 632285 170823 569106 866854 635321 954595 431322 664348 855361
$$ packed form
13870A303946j20187m05441K89401L4221J57701J84489m86449J25758Q1692j79147
13860I85984k99549J41681j8976L26340k6310n6595j93549K05984R9061K17751
13850A381822l18860l75951J89165K46776r8828l02495K34061R116l17579L68045
13840A015272l24263j00524J83886K49921j30513j6790j77349K34502k42780K15155
13830I06517O6473Q8274q6247k14172l0585J11080k6438k14994K20941j69630
13820F51219K91998O684m5438m7783k4524j95164J70285J69415k03167j06728
13810F66797J30917M0135k93254l1493K47728J65467l36080j36769K57370J1284
13800G22102K70321l60138A70823L98283K97748k31533L19274D31322K33026J91013
$$ plain form
13790 855361 775724 643409 780644 583495 516193 689123 677562 612146 621560 598641 454437
13779 454437 813628 585179 695084 683741 653337 352043 916768 509964 808040 456283
13769 456283 661892 901525 668639 602425 1082752 422007 848314 559185 761695 646043
13759 646043 464448 573949 724004 297129 806493 916871 822489 702731 657580 501748
13749 501748 455362 807016 829144 595986 351935 66687 434937 344802 545915 673937
13739 673937 320321 812863 769561 231375 594027 442564 163202 503018 517533 551026
13729 551026 560907 615739 613946 345362 668134 611241 410509 397532 512067 321113 735315
13718 735315 580611 259875 661129 272464 385658 554416 610599 325535 471581 341014
$$ packed form
13790H55361p9637j32315J37235j97149o7302J72930j1561o5416R414k2919j44204
13779D54437L59191k28449J09905j1343l0404l01294N64725m06804K98076l51757
13769D56283K05609K39633k32886o6214M80327D22007M26307k89129K02510j15652
13759F46043j81595J09501J50055B97129N09364J10378r4382j19758m5151j55832
13749E01748m6386L51654K2128k33158k44051F6687L68250r0135K01113J28022
13739F73937C20321M92542m3302B31375L62652j51463A63202L39816J4515L3493
13729E51026R881N4832j793k68584L22772n6893k00732j2977J14535j90954M14202
13718G35315j54704B59875M01254B72464J13194J68758N6183k85064J46046j30567
$$ plain form
13708 341014 367186 217498 651990 583758 276532 335416 744090 637567 354037 487660
13698 487660 583990 562409 905075 739935 548421 335964 673697 312103 513330 317780
13688 317780 818532 461657 489260 444284 598773 537419 341943 460441 243517 255894
13678 255894 357911 127002 561151 493611 267783 524389 133512 445244 717185 555566
13668 555566 441798 503042 580690 373276 550164 278068 617710 503686 217719 508747
13658 508747 238309 372173 315447 461951 582109 107122 482781 355139 760877 570082
13648 570082 91930 367668 564664 585580 657019 373960 330747 322187 418073 518333 717067
13637 717067 608594 371578 172662 50477 197272 80300 446072 228256 58277 387252
$$ packed form
13708C41014K6172j49688M34492o8232B76532N8884M08674j06523k83530J33623
13698D87660R6330k1581L42666j65140j91514k12457L37733C12103K01227j95550
13688C17780N00752l56875K7603m4976J54489o1354j95476J18498k16924J2377
13678B55894J02017A27002M34149o7540k25828K56606A33512L11732K71941j61619
13668E55566j13768O1244P7648k07414J76888k72096L39642j14024B17719K91028
13658E08747B38309J33864n6726J46504J20158A07122L75659j27642M05738j90795
13648E70082I1930K75738J96996K0916P1439k83059m3213q560R5886J00260J98734
13637G17067j08473k37016A72662E0477J46795H0300L65772k17816E8277L28975
$$ plain form
13627 387252 473072 425090 181303 726355 561572 412441 581201 405663 333181 14428
13616 -53445 289752 146096 513035 196327 133719 346718 419231 314694 331957 23798
13605 480259 352595 636381 252952 311709 321917 379761 248205 449435 229410 63402
13594 49806 305914 321002 450589 386327 74134 437390 327051 325909 648785 259312 158222
13583 158222 163731 71404 494602 103040 376269 453571 617960 -13942 54578 219442 145978
13572 145978 353444 294682 397406 457801 247718 238894 40398 152706 442950 408521 322734
13561 322734 285521 217986 601835 684708 363450 268187 451398 250995 318000 482481
13551 482481 198634 81253 57506 -40410 -287899 274768 258244 604825 202588 67373
$$ packed form
13627C87252Q5820m7982A81303N45052j64783j49131J68760j75538p2482A4428
13616e3445B89752j43656L66939A96327o2608K12999P2513j04537J7263B3798
13605D80259j27664K83786B52952N8757J0208N7844j31556K01230k20025F3402
13594D9806K56108J5088J29587o4262G4134L63256j10339j142L22876B59312j01090
13583A58222N509G1404M23198A03040K73229P7302J64389a3942E4578J64864p3464
13572A45978K07466n8762J02724O0395k10083q824D0398J12308K90244l4429q5787
13561C22734l7213o7535L83849Q2873l21258r5263J83211k00403O7005J64481
13551D82481A98634H1253k3747d0410k47489B74768j6524L46581B02588F7373
$$ plain form
13540 104347 149816 479200 30279 284733 31075 405251 196795 113139 332334 298405
13530 298405 60472 283054 182886 566419 258527 252090 482365 97471 248424 308227
13520 308227 406399 364706 404582 133631 254535 400652 465840 158355 434387 22460
13509 625765 499785 -196457 322064 298215 278789 264114 -191625 49627 334379 -78163
13498 546091 169945 466429 289525 294138 423182 94168 122846 256369 40244 207028
13488 207028 209186 288605 -67891 388173 59924 -99364 546304 -110308 469724 300738 195832
13477 195832 4906 29262 116815 -64850 234973 383990 103503 189979 40985 62687 84313
13466 84313 410786 402145 277346 128520 342580 223154 697653 395665 324763 335452
$$ packed form
13540A04347M5469L29384C0279K54454C1075L74176A96795q3656K19195l3929
13530B98405F0472K22582j00168L83533B58527o437K30275I7471J50953N9803
13520C08227R8172m1693L9876A33631J20904J46117O5188A58355K76032B2460
13509F25765j25980a96457C22064k3849j9426j4675a91625D9627K84752g8163
13498E46091A69945K96484j76904M613J29044I4168K8678J33523D0244J66784
13488B07028K158P9419f7891C88173E9924i9364E46304a10308D69724j68986j04906
13477A95832D906K4356Q7553f4850B34973J49017A03503Q6476D0985K1702K1626
13466H4313L26473q641j24799A28520K14060j19426M74499l01988p0902J0689
$$ plain form
13456 335452 351261 172767 349494 99753 81133 151041 204269 189073 -86374 -124676 168232
13444 518165 486828 365161 360919 506835 97310 201683 -126346 144285 504947 237323
13433 -107012 164995 295649 53768 556039 208725 -113535 142102 469296 123976 -44446
13422 175092 118331 272469 10177 445098 230568 -235989 475743 59410 220708 389842
13412 389842 199325 304955 177268 -19450 193231 171092 -3195 424536 266546 25864
13401 57499 185473 392689 -463944 257550 9527 324983 154229 150956 132920 343062 254302
13390 254302 196310 127654 410228 2127 74337 234868 101024 255297 -107404 -31952 258101
13378 341146 146538 166826 310042 366597 97605 256909 126363 -87820 267117 709808
$$ packed form
13456C35452J5809A72767J76727I9753j8620O9908N3228j5196h6374l8302A68232
13444E18165l1337j21667m242J45916I7310J04373a26346A44285L60662B37323
13433a07012A64995J30654E3768N02271B08725a13535A42102L27194A23976d4446
13422A75092n6761J54138A0177M34921k14530b35989D75743E9410J61298J69134
13412C89842j90517J05630j27687a9450A93231k2139c195D24536j57990B5864
13401E7499J27974K07216d63944B57550I527L15456A54229l273j8036K10142q8760
13390B54302n7992o8656K82574B127P2210J60531A01024J54273a07404c1952B58101
13378C41146A46538K0288J43216N6555I7605J59304A26363h7820B67117M42691
$$ plain form
13368 709808 69691 394857 -209765 352486 27576 170233 138979 116071 -38375 303486
13357 -167643 -150099 113739 214037 177096 28813 -229710 115105 420365 320556 292385
13347 292385 184365 51860 187490 263550 507246 293610 70854 192099 762331 708486
13337 708486 488987 219924 465096 -98948 -85737 -214439 56078 49351 196845 226960 207651
13326 207651 502775 191165 165340 -4887 126499 722004 -21905 161744 -61508 209854
13315 -1443 323699 177203 122074 560090 -65128 350935 32594 -88764 183767 147183 314830
13304 314830 194243 207864 76923 -7419 89020 250986 120893 186739 296745 287540 302201
13293 302201 155872 102616 49750 239795 28787 -98791 -11417 144877 126183 366270 150812
$$ packed form
13368G09808F9691L25166b09765C52486B7576J42657l1254k2908c8375C03486
13357a67643J7544A13739J00298l6941B8813b29710A15105L05260r9809k8171
13347B92385j08020E1860J35630P6060K43696k13636G0854J21245N70232n3845
13337G08486k19499B19924K45172i8948J3211j28702E6078o727J47494L0115j9309
13326B07651K95124A91165k5825d887A26499N95505b1905A61744f1508B09854
13315a443C23699j46496n5129M38016f5128C50935C2594h8764A83767l6584J67647
13304C14830j20587J3621G6923g419H9020J61966A20893O5846J10006r205J4661
13293C02201j46329n3256D9750J90045B8787i8791a1417A44877j8694K40087A50812
$$ plain form
13281 9811 305100 -97260 220125 298585 207985 150819 40702 -275327 122423 -244623 2455
13269 186786 353915 98175 -109963 58623 208832 260105 95964 91233 153902 400189 -201307
13257 147275 41345 250902 -328517 -163605 341526 131808 -6995 284071 -13215 134831
13246 107307 45546 158926 246332 81282 -2732 282077 63604 364337 68586 65210 79770
13235 79770 1085 120100 -209133 -20538 145998 -35323 256785 -133640 -78446 172949 35296
13223 143552 199285 -171687 312363 -96574 57763 31825 524091 248381 -42741 121563
13212 153839 13542 -401367 -18270 188288 10162 360636 -77632 -259429 -88180 250422
13201 214817 -3381 319146 -17564 292076 -54596 -78503 -93616 186912 -78554 894 62158
$$ packed form
13281I811K95289i7260B20125P8460r0600n7166D0702b75327A22423b44623B455
13269A86786J67129I8175a09963E8623J50209N1273I5964m731O2669K46287b01307
13257A47275D1345K09557c28517a63605C41526A31808f995B84071a3215A34831
13246A07307D5546J13380Q7406H1282b732B82077F3604L00733F8586l376J4560
13235G9770A085J19015b09133b0538A45998c5323B56785a33640N5194A72949C5296
13223A43552N5733a71687C12363i6574E7763k5938M92266B48381d2741A21563
13212A53839A3542d01367a8270A88288A0162L50474g7632j81797h8180B50422
13201B14817c381C19146a7564B92076e4596k3907j5113A86912g8554H94O1264
$$ plain form
13190 62158 311058 207469 71981 186270 32198 44451 100804 126387 286534 366088 242986
13179 242986 130853 120307 47664 98489 21116 75116 137002 137590 36306 287852 -46595
13167 262642 192038 244728 93082 237550 11163 -276021 -219634 5414 -51025 9892 -8137 -81997
13155 -81997 -47316 507431 -157845 157449 55268 222008 -61129 118291 61203 26702 -139535
13143 224834 170276 -204154 308299 -63253 163793 279724 -27804 -89062 -5980 706 -252781
13131 -87199 -157699 297118 7507 179667 434220 155807 204649 -209027 224004 91661 274595
13120 274595 48907 -106196 273741 11632 307048 41077 181818 -188472 -82746 -126850
13110 -126850 105002 -220393 -80109 93172 30932 -264407 -15124 81235 -34920 -34672 -93496
$$ packed form
13190F2158K48900j03589G1981J14289C2198J2253N6353K5583J60147P9554j23102
13179B42986j12133j0546D7664N0825B1116N4000O1886N88C6306K51546d6595
13167B62642p0604N2690I3082J44468A1163b76021N6387E414e1025I892h137p3860
13155h1997L4681E07431a57845A57449E5268J66740f1129A18291n7088B6702a39535
13143B24834n4558b04154C08299f3253A63793J15931b7804o1258e980G06b52781
13131h7199p0500B97118G507J72160K54553A55807M8842b09027B24004I1661J82934
13120B74595D8907a06196B73741A1632K95416D1077J40741a88472h2746m4104
13110a26850A05002b20393h0109I3172C0932b64407a5124H1235c4920K48n8824
$$ plain form
13099 -93496 -179114 576778 -17718 149541 170134 347157 -71708 91887 345853 -24178 172287
13087 22902 -68132 -113094 301110 24990 -184829 345972 498073 407645 26693 64337 -144382
13075 392515 121984 95737 -123546 -155093 58397 101049 -265702 -443867 -245676 51509
13064 145761 112067 -129460 145205 -145126 68563 -25504 88128 -8688 -164057 304948 -85683
13052 -169909 227259 85738 229116 -132624 136227 66520 -125745 109446 -138197 -27777
13041 -12086 75362 148930 -151131 164284 -11024 323496 -333923 -158737 -361402 257475
13030 250503 182971 87989 -348760 227299 -139215 418360 38331 118997 523081 -146804
13019 18071 40848 216347 -146892 59617 -189222 54491 60418 118725 12771 48469 156468
$$ packed form
13099i3496q5618E76778a7718A49541K0593J77023g1708I1887K53966b4178A72287
13087B2902f8132m4962C01110B4990a84829C45972J52101r0428B6693L7644a44382
13075C92515A21984k6247a23546l1547E8397M2652b65702j78165J98191E1509
13064A45761l3694a29460A45205a45126F8563b5504H8128h688j55369C04948h5683
13052a69909B27259H5738J43378a32624A36227F6520a25745A09446a38197b7777
13041a2086G5362P3568a51131A64284a1024C23496c33923a58737k02665B57475
13030B50503o7532H7989c48760B27299a39215D18360C8331Q0666M04084a46804
13019A8071K2777J75499a46892E9617a89222E4491N927N8307A2771L5698J07999
$$ plain form
13008 156468 -147612 234848 -294408 -257749 -175166 -138421 -201554 -58822 -70387 42588 -33364
12996 88494 -36781 -41444 -152996 114194 -82443 -106535 -53191 -11763 -9865 22879 244744
12985 244744 -2685 85278 -108808 98736 249656 230233 -10554 -122320 61018 65713 -92900
12973 -65438 251072 -60236 -164304 213349 -140916 -48986 238516 164888 -64893 108324
12962 -131640 -182921 48209 -120817 -99784 145991 200055 100793 -31190 79207 68033 456
12950 88014 -178450 -62589 163857 -119113 149953 -136708 -24796 229449 171112 149915
12940 149915 -143890 50416 107302 -35307 -87346 27836 -227141 68620 -103016 41249 -45610
12928 -58256 -144228 199240 21878 -245710 -218350 -13383 -105120 210397 -31625 215708 113306
$$ packed form
13008A56468a47612B34848b94408L6659Q2583L6745o3133e8822j1565D2588c3364
12996H8494c6781m663j11552A14194h2443k4092e3191a1763J898B2879K21865
12985B44744b685H5278a08808I8736J50920j9423a0554j11766F1018M695i2900
12973f5438B51072f0236j04068B13349a40916d8986B38516p3628f4893A08324
12962a31640n1281D8209a20817K1033A45991N4064r9262c1190G9207j1174D56
12950H8014a78450f2589A63857a19113A49953a36708b4796B29449n8337k1197
12940A49915a43890E0416N6886c5307n2039B7836b27141F8620a03016D1249d5610
12928e8256q5972A99240B1878b45710K7360a3383r1737B10397c1625B15708j02402
$$ plain form
12917 113306 -130451 73520 -245321 -4312 93484 320565 -154814 -40296 -120738 9553 76580
12906 76580 265689 -55688 -203089 -159454 -195011 -232591 -86721 214123 -126885 -51980 -195189
12895 -195189 96606 48800 48229 77121 -29293 102955 100484 -97112 -243700 326736 4962 -68366
12882 -184675 148623 156498 -254746 255211 -213154 -149939 458340 -169749 146140 89155
12872 89155 105145 -148945 114504 209578 254448 50486 166544 365241 -11323 38248 -295806
12860 -11975 225776 -137294 -168290 97237 22582 -152356 -206578 134580 135366 129943 246243
12849 246243 -14599 403235 380770 -87819 142865 -73488 -23761 -256009 -111531 -109595 -342716
12838 -342716 240622 25861 121060 -153057 -49350 335544 98267 231700 189933 -107694
$$ packed form
12917A13306a30451G3520b45321d312I3484K27081a54814d0296q0442I553O7027
12906G6580J89109e5688j47401M3635l5557l7580h6721B14123a26885e1980j43209
12895a95189I6606m7806n71K8892b9293A02955k471i7112j46588C26736D962f8366
12882a84675A48623P875b54746B55211b13154O3215D58340a69749A46140n6985
12872H9155J5990a48945A14504R5074M4870E0486J16058J98697a1323C8248b95806
12860a1975B25776a37294l0996I7237B2582a52356n4222A34580P86n423J16300
12849B46243a4599D03235k2465h7819A42865g3488b3761k32248a11531J936k33121
12838c42716B40622B5861R5199a53057d9350C35544I8267J33433m1767a07694
$$ plain form
12827 -53423 231677 -208294 236488 -199328 -215847 85586 -85364 -8992 183970 -110282 -380219
12816 -380219 -197438 285324 41089 430963 14027 196930 191032 193416 4599 170368 -123704
12804 246334 -80772 355831 -14566 -42376 145054 -18841 101764 -45949 -226207 53264 60446
12793 60446 26225 358229 18039 -137666 38657 -134156 -386681 -173925 41495 -32705 -64519
12782 -64519 70222 224721 -297671 24700 18352 -163142 111312 207485 225412 -422601 108112
12770 116029 47430 237424 40727 -161664 156234 -73013 -332979 -383901 92038 246138
12760 246138 -5959 -53567 -104738 -175284 -228700 -215861 -135268 128634 65542 113881 207045
12749 207045 -64771 -14941 -3035 -444712 78645 -57881 -137105 104251 64136 178920 15703
$$ packed form
12827e3423B31677b08294B36488a99328j6519H5586h5364h992A83970a10282k69937
12816c80219J82781B85324D1089L89874A4027J82903n898K384D599J65769a23704
12804B46334h0772C55831a4566k7810A45054a8841A01764d5949j80258E3264P182
12793F0446B6225L32004A8039a37666C8657a34156k52525a73925D1495c2705l1814
12782f4519G0222J54499b97671B4700o348a63142A11312R6173J7927d22601A08112
12770A16029D7430J89994D0727a61664A56234g3013k59966n0922I2038J54100
12760B46138e959m7608n1171p0546n3416J2839Q0593A28634o3092M8339R3164
12749B07045f4771a4941c035m41677G8645e7881p9224A04251m0115J14784A5703
$$ plain form
12737 272797 204390 331485 -177917 -320593 429954 335253 162587 220553 -25554 70157
12726 34112 85170 -98323 -297989 -208211 93566 -316761 74202 45488 66331 -162367 3440
12714 -52182 -82810 -22966 126245 -90836 -149620 138846 9740 23602 -106723 88829 200665
12703 200665 89405 -20809 3451 29195 -320861 4296 4900 311690 67041 -71462 -37380 81430
12690 -11519 265012 217210 -130234 -36098 108390 -86895 -24563 -47708 -358726 217237 175271
12679 175271 -208665 -160980 -176860 -237052 -47568 51842 -58172 237269 116251 356155 90474
12667 398204 59693 288627 -7956 60356 327737 366905 245728 -96778 149821 505896 144619
12655 -172413 60750 60764 27936 80541 86951 250895 -129518 174487 -1389 334851 -234836
$$ packed form
12737B72797o8407J27095a77917j42676D29954r4701A62587N7966b5554G0157
12726C4112N1058i8323j99666Q9778I3566c16761G4202k8714K0843a62367C440
12714e2182l0628b2966A26245i0836n8784A38846I740J3862a06723H8829J11836
12703B00665H9405b0809C451K5744c20861D296O04L06790F7041g1462L4082H1430
12690a1519B65012m7802a30234c6098A08390h6895b4563k3145l11018B17237m1966
12679A75271b08665M7685j5880o0192d7568E1842e8172B37269A16251K39904I0474
12667C98204E9693K28934g956F0356K67381L9168j21177i6778A49821L56075A44619
12655a72413F0750J4B7936N2605O410J63944a29518A74487a389C34851b34836
$$ plain form
12643 145413 -17268 -97929 186326 -16699 156063 91564 212283 173094 304050 223924 232728
12632 232728 196949 130124 158498 495588 -51882 362396 421811 37680 150230 -58527 -37951
12621 -37951 155571 -63914 164588 91259 108524 -138777 17524 385083 88904 -3477 87605
12609 292643 177878 -57929 81058 -31686 -169434 -160195 -165125 225791 312128 305080 54562
12597 171485 229251 65362 381056 277786 188387 -181807 -76812 -15918 175339 -90627 -226925
12586 -226925 -127808 -182923 381093 -146118 47157 134200 254581 216091 -79494 425582 165391
12574 105391 -112933 214406 73651 89467 -387146 -308354 233694 53255 -77320 -133719 64016
12562 46857 79526 -164724 94809 167553 321488 -137894 119686 56730 297888 -101461
$$ packed form
12643A45413a7268q0661A86326a6699A56063o4499J20719l9189J30956q0126Q804
12632B32728l5779o6825K8374L37090e1882C62396N9415C7680J12550e8527K0576
12621c7951A55571f3914A64588p3329J7265a38777A7524L67559H8904c477H7605
12609B92643j14765e7929H1058c1686j37748R239m930B25791Q6337p048E4562
12597A71485N7766F5362L15694j03270q9399a81807g6812a5918A75339i0627j36298
12586b26925R9117n5115C81093a46118D7157Q7043J20381l8490g9494D25582A65391
12574A05391a12933B14406G3651J5816c87146P8792B33694E3255g7320n6399F4016
12562D6857L2669a64724I4809P2744J53935a37894A19686E6730K41158a01461
$$ plain form
12551 390102 -344409 227331 26761 299370 77924 286822 27889 27094 -119333 -58696 286954
12539 15300 -231508 -347335 -360179 -214904 2504 -4842 -5028 192816 -104154 -202738 110378
12527 614169 -163203 55232 572079 85431 723941 468896 962325 674584 592725 288333
12516 4798 154263 -163283 285076 -37666 65361 -19250 133108 32545 362364 112482 49338
12504 -199258 -66317 3753 112246 80882 -95212 -319788 -12004 -66856 385623 62483 285322
12493 285322 476879 308429 485271 372745 124203 -136921 128731 -257752 217977 -82287
12482 125518 13082 -211527 -9424 219574 -175638 -115431 70360 167681 2691 308698 -59764
12470 -79656 305086 -65895 -183357 -258229 92308 73851 -54742 -166401 -118397 -11565 90286
$$ packed form
12551C90102c44409B27331B6761K72609G7924K08898B7889p95a19333e8696B86954
12539A5300b31508j15827j2844J45275B504d842j86A92816a04154r8584A10378
12527F14169a63203E5232N16847H5431O38510k55045M93429k87741q1859B88333
12516D798J49465a63283B85076c7666F5361a9250A33108C2545L29819A12482D9338
12504a99258f6317C753J08493l1364i5212k24576a2004n4852C85623F2483K22839
12493B85322J91557j68450J76842j12526A24203a36921A28731b57752B17977h2287
12482A25518A3082b11527i424B19574a75638O0207G0360R7321B691L06007e9764
12470g9656C05086f5895j17462p4872I2308j8457e4742j11659M8004a1565I0286
$$ plain form
12458 223862 255806 41649 -37236 -102741 311035 -141760 -50984 7438 140118 -55635 -242056
12447 -242056 16468 146766 -309407 21790 -78573 -370537 210903 148902 95702 -137323
12436 96609 244471 89934 -60667 -93322 -37545 40520 256228 -168713 181806 37420 -78670
12424 -39792 434492 62003 -213937 211526 169340 -4345 -187289 -453949 -35403 24399 525412
12413 525412 63871 309170 212049 79104 -42519 -86601 21527 -173514 -74021 58658 155133
12402 155133 -210412 286452 83124 -235502 -286841 -24908 -150419 -276003 44874 68019
12392 68019 -137215 -207335 264538 65828 102875 11243 1438 169639 8413 389287 81836
12380 100959 417735 -164607 84814 -34683 84860 -10990 -207989 -216575 -62555 -331246 -107902
$$ packed form
12458B23862L1944D1649c7236o5505C11035a41760e0984G438J32680e5635j86421
12447b42056A6468J30298c09407B1790g8573k91964B10903o2001n3200a37323
12436I6609J47862H9934f0667l2655c7545D0520K15708a68713A81806C7420g8670
12424c9792D34492F2003b13937B11526m2186d345j82944k66660c5403B4399N01013
12413E25412F3871K45299r7121G9104d2519m4082B1527a73514g4021E8658R6475
12402A55133b10412B86452H3124b35502n1339b4908j25511j25584D4874K3145
12392F8019a37215p0120B64538F5828L7047A1243A438J68201H413L80874H1836
12380A00959L16776a64607H4814c4683H4860a0990j96999q586f2555k68691a07902
$$ plain form
12368 -78285 69842 214048 97034 -299917 -145386 -32200 -285104 -13954 56678 -165059 288566
12356 -315783 216744 36110 101837 -45443 -95711 -41235 -72970 86624 -70949 83328 -66578
12344 -80461 28773 209767 56100 19808 157803 -124861 316054 74390 44365 21205 -40522
12332 -12201 164180 -34735 275324 8384 3683 10277 235348 7908 192130 -43542 35483 79121
12320 79121 -195457 -73391 81797 73612 -422391 224216 -114145 300244 -216005 123170
12309 144437 -71707 59885 -157833 109844 82595 92585 -98261 44843 8496 -132168 283386
12297 -178561 -2308 123418 115633 -80532 -96512 72802 181622 -251989 203385 117692 -68470
12285 15422 -128352 105411 -180334 162936 109403 156261 156315 1942 115120 144914 -85735
$$ packed form
12368g8285F9842J44206I7034b99917a45386c2200k52904a3954E6678a65059B88566
12356c15783B16744C6110O5727d5443n0268d1235l1735H6624g0949H3328f6578
12344h0461B8773J80994E6100A9808J37995a24861C16054G4390l0025B1205d0522
12332a2201A64180c4735B75324H384C683O594K25071G908J84222d3542C5483M3638
12320G9121a95457g3391H1797q185d22391B24216a14145C00244b16005A23170
12309A44437g1707E9885a57833A09844k7249R990i8261D4843H496a32168B83386
12297a78561b308A23418p785h0532j5980G2802J08820b51989B03385q5693f8470
12285A5422a28352A05411a80334A62936n3533M6858N4A942J13178K9794h5735
$$ plain form
12273 140174 -68762 -241223 -36266 295801 -107094 -132356 248056 -68465 -56997 -159500
12263 -159500 317557 145663 341063 -109603 329254 8107 217288 68521 146442 -12764
12252 -123785 146713 188705 110173 61420 72396 130749 81730 286699 36873 122511 -152292
12240 116581 254362 119623 160273 -90659 121530 225411 -102019 124999 82660 134877
12230 134877 19247 189513 41671 471605 42037 207105 218554 33609 342743 2567 557383
12219 557383 454188 399347 465540 353649 523338 372030 130353 126373 205916 163312 402913
12208 402913 127716 -67669 379047 23340 -30873 103759 242407 244878 -19764 366162 59411
12196 -39345 424173 689796 493089 262037 139566 358638 184667 390844 356058 428250
$$ packed form
12273A40174f8762j72461c6266B95801a07094k5262B48056f8465J1468j02503
12263a59500C17557A45663J95400a09603C29254H107K09181F8521P7921a2764
12252a23785A46713M1992p8532m8753J0976N8353m9019K04969C6873Q5638a52292
12240A16581J37781A19623M0650i0659A21530J03881a02019A24999m2339N2217
12230A34877A9247J70266D1671M29934D2037J65068J1449C3609L09134B567N54816
12219E57383j03195n4841O6193j11891J69689j51308A30353l980P9543m2604K39601
12208D02913A27716f7669C79047B3340c0873A03759J38648K471a9764C66162E9411
12196c9345D24173K65623j96707k31052j22471K19072j73971K06177l4786P2192
$$ plain form
12186 428250 89187 341005 124937 238722 223306 12086 350266 5885 183670 308152
12176 308152 198027 -116272 265448 120033 -93708 260850 129274 -125956 144904 210207
12166 210207 131567 453176 169670 375956 16312 267034 110256 17529 46829 344807
12156 344807 57431 320806 -103401 423150 111872 -62896 4063 385955 260673 241897
12146 241897 186436 -37096 -47130 83234 47232 129873 213646 -262549 -55305 -115016 12788
12134 238604 -121907 206900 -76092 28881 -38285 -83578 -20857 -66104 353982 -7000 134050
12122 359189 -148190 58387 -38390 206319 127029 -49989 299567 201411 261594 -142758 269089
12110 -326742 52242 -132137 -70317 118023 -378813 123729 -65368 248341 -133642 195620
$$ packed form
12186D28250H9187K51818A24937J13785j5416A2086L38180E885J77785J24482
12176C08152j10125a16272B65448A20033i3708B60850A29274a25956A44904O5303
12166B10207p8640L21609A69670K06286A6312K50722A10256A7529K9300K97978
12156C44807E7431K63375a03401D23150A11872f2896D063L81892j25282j8776
12146B41897n5461c7096j0034H3234l6002Q2641Q3773b62549e5305n9711A2788
12134B38604a21907B06900g6092B8881c8285m5293b0857m5247C53982g000A34050
12122C59189a48190E8387c8390B06319p9290d9989B99567r8156O0183a42758B69089
12110c26742E2242a32137O1820A18023c78813A23729f5368B48341a33642A95620
$$ plain form
12099 -37653 259264 33274 333995 -12426 -143076 1117 62570 -35549 295365 57407 3621
12087 -154054 -250784 52504 -65113 39918 -127134 -29487 125411 -277134 281727 100634
12076 -24552 -33085 186876 -411858 -82166 389707 -229057 -59295 -25224 -24536 195365 76493
12064 147701 273205 218823 -174319 207305 -20618 -196748 186634 -174881 -155314 -6747
12053 55319 -92511 114177 53729 -147548 -299366 -68181 -70861 -228956 31017 62171 -407602
12041 -304842 -228361 -94333 -53420 -84976 268258 155491 218048 -3749 55910 -109245 -321348
12030 -321348 -191548 392481 31682 -44294 -198189 -51515 -63294 -146121 409689 -345713
12019 230642 -174694 210200 208166 -76475 -38086 131297 55518 51224 -58046 -11663 -114158
$$ packed form
12099c7653B59264C3274L00721a2426j30650A117O1453c5549B95365E7407C621
12087a54054r6730E2504f5113C9918a27134b9487A25411b77134B81727A00634
12076b4552q533A86876d11858h2166C89707b29057e9295b5224O88A95365G6493
12064A47701J25504n4382a74319B07305b0618j76130A86634a74881J9567f747
12053E5319i2511A14177E3729a47548j51818f8181k680j58095C1017L1154d07602
12041c04842P6481i4333M0913l1556B68258j12767O2557c749E5910a09245k12103
12030c21348J29800C92481C1682d4294j53895e1515j1779q2827D09689c45713
12019B30642a74694B10200k034g6475c8086A31297E5518m294e8046a1663j02495
$$ plain form
12008 -114158 144337 -106143 -6649 -156192 -21910 -179303 -182308 175121 -196268 -31618 13422
11996 -270605 -65505 -133011 -120516 -81745 101108 -554704 290357 61199 -188185 155303
11985 -14800 130709 36774 147423 -165080 146323 -8766 -99820 132374 -67830 -413482 195526
11973 115763 -98818 -266300 -193651 161331 -152374 -150727 -93593 -187561 143832 34332 7984
11961 152141 -181396 571289 3650 -159752 -112548 43990 -98558 -99709 -53112 -16961 -316729
11950 -316729 -221530 83288 206008 98111 149316 -351068 2077 -208953 116770 -168753 23937
11938 -101501 -153349 16917 73282 -38710 -66214 -201907 -237600 -345189 31634 -219869 -18569
11926 134937 22529 -199552 40513 -115208 189655 154317 -53177 224235 221533 258975 47963
$$ packed form
12008a14158A44337a06143f649j49543b1910j57393l005A75121a96268c1618A3422
11996b70605f5505o7506J2495L8771A01108e54704B90357F1199a88185A55303
11985a4800A30709C6774J10649a65080A46323h766r1054A32374f7830l45652A95526
11973A15763i8818j67482P2649A61331a52374J647N7134r3968A43832C4332G984
11961A52141a81396E71289C650a59752M7204D3990i8558j151M6597a6961k99768
11950c16729R5199H3288J22720I8111N1205c51068B077b08953A16770a68753B3937
11938a01501n1848A6917N6365c8710k7504j35693l5693j07589C1634b19869a8569
11926A34937B2529a99552D0513a15208A89655l5338e3177B24235k702L7442D7963
$$ plain form
11914 -99764 -178692 -181443 192726 -116086 315403 292952 97408 -209641 -158523 163872 -348101
11902 -115729 -252995 -267197 -120616 -52297 159008 -170182 -106309 -206561 -194764 -32595
11891 119919 -22338 139535 -242532 -214808 -9018 -359125 279419 -178203 -137962 -96914 -222350
11880 -222350 70728 -97833 -235814 -215453 -105437 -338815 43662 -67464 150325 -126419
11869 136135 253905 -20875 -138954 194232 34364 -12687 -76422 -183882 -401563 -58323
11858 103194 163484 -28864 224720 -51131 17516 -67097 -115657 317692 55381 -92921 -5438
11846 32154 33889 2168 85330 -300712 -390745 -66723 -99937 -449092 211465 228437 -341437
11834 170184 159233 71200 -111456 -217955 -141902 -373384 67424 18014 -158451 -112985 -186964
$$ packed form
11914i9764p8928k751A92726a16086C15403k2451I7408b09641N1118A63872c48101
11902a15729j37266j4202a20616e2297A59008a70182O3873j00252J1797c2595
11891A19919b2338A39535b42532K7724i018l50107B79419a78203M0241M1048j25436
11880b22350G0728i7833j37981K0361a05437k33378D3662f7464A50325a26419
11869A36135J17770b0875j18079A94232C4364a2687o3735j07460k17681e8323
11858A03194O0290b8864B24720e1131A7516f7097m8560C17692E5381i2921e438
11846C2154J735B168Q3162c00712r0033f6723l3214l49155B11465J6972c41437
11834A70184j0951G1200a11456j06499P6053k31482F7424A8014a58451M5466p3979
$$ plain form
11823 -186964 -86516 -117296 -84068 -182979 -245897 -325175 -90441 -182417 779 134701 -137157
11811 -73236 -252354 292275 -382497 -137308 -281487 45447 -73533 -85620 -134392 20010 -13498
11799 -26558 -51351 4054 -273637 -181690 -172242 -169089 70591 -142233 -286623 25961 212496
11788 212496 -211441 373327 102218 -264961 91925 230236 66010 133775 -11198 -111166
11778 -111166 196988 120029 -171034 -363994 54834 -76187 167099 -379907 -449750 -14331
11767 92984 -61220 -80810 -204641 -78941 -149956 132489 24386 -90374 -74248 111187 -156895
11755 8135 9039 -230501 49614 -8969 -26943 -161371 201176 50862 -22699 -48061 -50171 -67036
11743 -67036 -204666 143759 106341 -68638 -227833 32294 178085 3127 -260414 -289750 -91697
$$ packed form
11823a86964h6516l0780L3228r8911o2918p9278i0441r1976G79J33922a37157
11811g3236j79118B92275c82497a37308j44179D5447g3533j2087m8772B0010a3498
11799b6558k4793D054b73637R1947R448L153G0591a42233j44390B5961J86535
11788B12496b11441C73327A02218b64961I1925J38311F6010O7765a1198r9968
11778a11166A96988p6959a71034j92960E4834g6187A67099c79907o9843a4331
11767I2984f1220j9590j23831g8941p1015A32489B4386i0374J6126A11187a56895
11755H135R04b30501D9614h969j7974j34428B01176E0862b2699k5362k110j6865
11743f7036j37630A43759l7418f8638j59195C2294J45791C127b60414k9336i1697
$$ plain form
11731 -393664 -155225 -180463 -88118 263812 -50500 -130304 -412838 -172825 -238972 -106731
11720 19799 208618 -294231 -66016 -179982 19948 -49813 -347091 105726 235190 -152827
11709 310638 -2396 -269129 -332722 114609 -61384 88913 -237098 -54103 -47852 -204083 -381170
11698 -381170 157350 -93688 -128301 166077 -118646 -442319 63833 -14359 37804 195796
11688 195796 108994 376206 73769 -386900 94971 -90212 237948 -187123 495202 192388
11677 -248259 -226388 -157240 -293922 213060 -18033 -118259 -105888 -110285 177473 196183 -261818
11665 -69538 126828 -44962 163817 -145400 -288235 58020 -35992 -174973 -123980 310899
11654 115806 -156860 -244556 -271125 -348164 125103 -111288 130297 -405299 193654 336718
$$ packed form
11731c93664a55225k5238h8118B63812e0500p9804k82534a72825o6147a06731
11720A9799J88819b94231f6016j13966A9948d9813k97278A05726J29464a52827
11709C10638b396k66733o3593A14609f1384H8913b37098e4103O251j56231j77087
11698c81170A57350i3688l4613A66077a18646l23673F3833a4359C7804J57992
11688A95796q6802K67212G3769c86900I4971i0212B37948a87123D95202A92388
11677b48259K1871O9148j36682B13060a8033j00226J2371m397A77473J8710b61818
11665f9538A26828d4962A63817a45400j42835E8020c5992j38981N0993C10899
11654A15806a56860q7696k6569p7039A25103a11288A30297d05299A93654J43064
$$ plain form
11644 336718 111816 146348 109665 -120216 -8046 49153 -198947 -126711 -153464 -97095 -225287
11633 -225287 -139870 33555 -175753 -38565 69593 -75246 256551 14551 -1195 4843 -264302
11621 84581 -155845 -93434 -27692 -84165 162430 -90350 -43787 93317 178359 -81469 -174424
11610 -174424 -243519 68827 30957 -116664 -371287 131299 125629 21971 230915 -183035 -68037
11598 4429 -80428 -237694 -406287 82536 -38808 -111819 -237618 -109318 -195937 -343441 172568
11586 40371 -126804 -27377 80440 -151594 82245 -185563 -196748 -70242 -141840 -117912 187453
11574 179700 61684 139219 -145758 -124998 -188233 -32568 -258892 264842 -16419 161069 -126887
11562 193757 1893 -179198 1659 -63306 -17687 -94568 133406 -138726 -63498 -115044 -31272
$$ packed form
11644C36718A11816L4532l6683a20216h046D9153a98947P2236k6753N6369j28192
11633b25287Q5417C3555a75753c8565F9593g5246B56551A4551a195D843b64302
11621H4581a55845O2411b7692n6473A62430i0350d3787I3317Q5042h1469r2955
11610a74424o9095F8827C0957a16664k54623A31299n670B1971K08944a83035f8037
11598D429h0428j57266j68593H2536c8808p3011j25799a09318q6619j47504A72568
11586D0371a26804b7377H0440a51594H2245a85563j1185g0242p1598K3928A87453
11574A79700F1684P7535a45758K0760o3235c2568k26324B64842a6419A61069a26887
11562A93757A893a79198A659f3306a7687p6881A33406a38726f3498n1546c1272
$$ plain form
11550 -28517 75761 58293 -98226 99883 94308 227917 -101117 -102135 -60180 -41039 27740 -26760
11537 -138172 338175 211691 -138071 -98660 305204 247435 -208403 -64543 -102091 -226890
11527 -226890 41478 -274143 -101363 -96092 -292682 -107489 -6218 -187827 -35031 111169 -203365
11515 174967 133544 7875 185122 154223 -217561 230363 43710 73422 220497 115947 -51157
11503 67128 -75065 -8205 -65328 464412 123737 481267 288755 509618 -31997 179376 479171
11492 479171 -25745 -34511 421796 107318 203498 397681 235898 168524 339890 206913
11482 206913 297388 263684 326509 22680 137963 560502 375746 55688 634319 225998
11471 -206396 150169 215518 175407 -8288 -99019 204108 426334 262746 207245 162703 335318
$$ packed form
11550b8517G5761j7468i8226I9883n575J33609a01117j018M1955J9141B7740b6760
11537a38172C38175j26484a38071L9411C05204n7769b08403f4543l7548j24799
11527b26890D1478b74143a01363N271j96590a07489f218j81609c5031A11169b03365
11515A74967m1423G875J77247l0899b17561B30363D3710K9712J47075j04550e1157
11503F7128g5065h205n7123D64412A23737L57530j92512K20863c1997A79376K99795
11492D79171b5745q766D21796A07318R6180J94183j61783o7374J71366j32977
11482B06913R0475l3704O2825B2680J15283M22539j84756E5688N78631B25998
11471b06396A50169O5349m0111h288r0731B04108K22226j63588n5501m4542J72615
$$ plain form
11460 335318 -51072 203062 641833 -153444 22395 181091 182183 71779 -53636 245725 209791
11449 209791 22265 -80262 122892 168699 198835 231479 -173090 122026 -90926 354531 19799
11437 131646 3896 368961 129632 -249623 -79193 188412 365028 122158 -136639 113799
11426 99814 308572 -9193 -159555 345899 88175 181168 -320555 -35373 92698 153716 186460
11415 186460 178534 -786 188491 271661 25940 -232191 234048 186623 -34383 -242299 -30338
11403 128801 25710 460346 -168004 -52100 76061 -344424 -198348 -1933 126952 84422 76020
11392 76020 37199 195348 256970 363043 92214 -146792 95786 -150928 424282 -89501 -48513
11381 -48513 169718 -185764 -23434 -156558 266149 -139158 487672 -201289 182857 199887
$$ packed form
11460C35318e1072B03062M38771a53444B2395J58696J092G1779e3636B45725l5934
11449B09791B2265h0262A22892M5807L0136L2644a73090A22026i0926C54531A9799
11437A31646C896L65065A29632b49623g9193A88412J76616A22158a36639A13799
11426I9814K08758i193j50362C45899H8175R2993c20555c5373I2698O1018L2744
11415A86460p926g86A88491Q3170B5940b32191B34048m7425c4383k07916c0338
11403A28801B5710M34636a68004e2100G6061c44424J46076a933A26952m2530q402
11392G6020C7199J58149O1622J06073I2214a46792I5786a50928D24282h9501M0988
11381d8513A69718a85764b3434j33124B66149a39158D87672b01289A82857J7030
$$ plain form
11371 199887 -111052 25717 74487 259518 50067 423441 -325707 43823 -209755 61856
11360 109515 -153368 -23654 -313673 -106683 -10543 -89164 -244159 -27364 -31333 -441759 -123932
11348 -14119 -475936 242149 -206559 -32590 339405 -11264 65200 -80812 134088 -123994
11337 -242005 23000 -102403 38141 -51167 -102502 -102899 163975 73571 161611 -59978 2866 63087
11325 63087 77211 93688 34242 -84204 78314 186947 -190953 231342 42027 312030 -20552
11313 -211982 28412 -258152 -434078 192340 -172189 52182 -55678 -22236 -115444 -244582
11303 -244582 -170783 48170 -318119 -40972 -165929 11689 -245496 -84122 -44080 -304272 -58614
11291 110060 53730 -178619 -157652 21454 227960 78319 80407 -30604 70498 -7704 80293
$$ packed form
11371A99887a11052B5717M8770J85031E0067L73374c25707D3823b09755F1856
11360A09515a53368b3654k90019a06683a0543p8621j54995b7364l969m10426a23932
11348a4119m61817B42149b06559c2590C39405a1264F5200h0812A34088a23994
11337b42005B3000a02403C8141e1167n1335l97A63975G3571Q8040e9978B866O0221
11325F3087J4124J6477C4242h4204G8314J08633a90953B31342D2027K70003b0552
11313b11982B8412b58152j75926A92340a72189E2182e5678b2236r3208j29138
11303b44582P3799D8170c18119d0972j24957A1689b45496h4122M0042k60192e8614
11291A10060E3730a78619K0967B1454K06506G8319K088c0604G0498g704H0293
$$ plain form
11279 151834 -83365 -191093 -86559 147057 200727 179617 -526878 -288505 -230769 73375 -381815
11267 4873 130498 82107 -201913 -114814 -69441 -185274 -35089 -236254 82628 -169575 -152904
11256 -152904 285176 -156989 -10563 5363 139552 103149 -19013 -143339 106603 29014 95628
11245 95628 -40099 159142 -49828 -78810 102229 -142458 -209580 28049 360489 -53315 148250
11233 247166 57077 -108622 -68006 156671 81007 -51917 313529 32344 -132857 -262371
11223 -262371 -29858 -426142 -130980 -211071 372705 -335784 -123117 158283 -18661 -52165
11213 -52165 -197435 140976 72880 75941 -72943 -193563 62005 -10283 149057 -277497 -216642
11202 -216642 -33277 -316756 288451 401640 -201034 18094 274965 -200293 -72609 -186598
$$ packed form
11279A51834h3365j07728h6559A47057N3670k1110e26878K38373N7736G3375c81815
11267D873J25625m8391b01913Q7099M5373j15833c5089k01165H2628a69575J6671
11256a52904B85176a56989a0563E363J34189l6403a9013j24326A06603B9014O6614
11245I5628d0099A59142d9828k8982A02229a42458o7122B8049L32440e3315A48250
11233B47166E7077a08622M0616A56671p5664e1917C13529C2344a32857j29514
11223b62371b9858l96284a30980q0091C72705c35784a23117A58283a8661l3504
11213e2165j45270A40976o8096L061g2943j20620F2005a0283A49057b77497O0855
11202b16642c3277k83479B88451J13189b01034A8094K56871b00293g2609j13989
$$ plain form
11192 -186598 -177953 162256 -56700 -171698 150389 -179032 -49654 37250 35495 198199 -252184
11180 -21015 141103 -16112 -39711 108923 233411 -143067 29529 41410 54242 -5224 1468
11168 -235245 4141 -138408 -213185 228029 119658 -21907 39824 -96842 -374297 -289039 -338003
11157 -338003 -311573 -330838 -45213 100583 72512 138138 76132 -209313 -142204 175185 123013
11146 123013 -105249 38663 43636 -128731 37874 160772 72977 -210143 252310 137398
11136 137398 -74503 244009 75125 -218815 -44912 105493 97252 -101848 99903 -170349 397542
11124 204214 61980 336354 182997 187770 130932 308636 -116530 253348 -156111 -208844
11114 -208844 206170 402904 437 -91471 333391 190550 150937 180168 -207620 17581 317174
$$ packed form
11192a86598Q645A62256e6700j14998A50389a79032d9654C7250j755J62704b52184
11180b1015A41103a6112k3599A08923J24488a43067B9529J1881J2832e224A468
11168b35245D141a38408p4777B28029j08371b1907C9824i6842k77455Q5258m8964
11157c38003K6430j9265d5213A00583k8071O5626o2006b09313O7109A75185n2172
11146A23013a05249C8663M973a28731C7874J22898G2977b10143B52310j14912
11136A37398g4503B44009G5125b18815d4912A05493q241a01848I9903a70349C97542
11124B04214F1980K74374j53357M773n6838J77704a16530B53348a56111n2733
11114b08844B06170J96734D37i1471C33391j42841l9613K9231b07620A7581K99593
$$ plain form
11103 317174 130048 254087 554118 207583 521373 135471 24728 494676 206519 283758
11093 283758 250304 338630 446713 290311 161463 52348 119999 -20618 284215 189384 481290
11082 481290 313498 203339 274214 325079 345941 392227 909762 325451 367528 573569
11072 573569 241442 598762 886513 469566 510969 647268 255187 567287 569005 391083
11062 391083 419211 969963 543817 703181 1041997 763124 659637 765848 734144 684382
11052 684382 1076774 899126 1053261 1270707 848712 1203050 1140229 1071203 1063786 1414115
11042 1414115 1011021 936264 1171654 1644333 1077734 1202293 1276178 1230671 1087157 1189231
11032 1189231 1125480 1085125 896402 1297508 762091 992661 1083268 689714 1031562 1014141
$$ packed form
11103C17174A30048J24039L00031B07583L13790A35471B4728M69948B06519P7239
11093B83758l3454Q8326J08083j56402j28848E2348O7651b0618B84215r4831K91906
11082D81290j67792j10159P0875N0865K0862M6286N17535C25451M2077K06041
11072E73569B41442L57320K87751m16947M1403J36299B55187L12100J718j77922
11062C91083K8128N50752m26146J59364L38816k78873j03487J06211l1704m9762
11052F84382L92392j77648J54135K17446m21995L54338o2821o9026p417L50329
11042A414115m03094p4757K35390M72679n66599J24559P3885m5507j43514J02074
11032A189231o3751m0355j88723M01106n35417K30570R0607l93554L41848j7421
$$ plain form
11022 1014141 1318919 1084837 763593 1063406 967701 889388 825406 879886 807478 802890 793866
11011 793866 497831 769113 1063193 920865 950500 1274993 697900 1055497 1100203 784619
11001 784619 687465 813264 908886 763501 506458 927286 819306 980348 898245 550259
10991 550259 680295 577361 829075 820983 1123403 1248534 1221968 1397737 872356 1012922
10981 1012922 1133651 1430790 1021074 1785802 1634989 1909003 2123965 2352904 2910888
10972 2910888 3238490 3631958 4461281 4226961 4558616 5112770 5421630 4886304 4256302
10963 4256302 3168701 2418416 2060265 1716576 1651108 1430413 1220241 1101307 1051641 949447
10953 949447 716026 1012479 532343 612161 385501 474023 377131 428932 161718 266176
$$ packed form
11022A014141L04778k34082l21244K99813r5705p8313o3982N4480p2408m588r024
11011G93866k96035K71282K94080j42328K9635L24493n77093L57597M4706l15584
11001G84619r7154J25799R5622j45385k57043M20828j07980J61042q2103l47986
10991E50259J30036j02934K51714q092L02420J25131k6566J75769n25381J40566
10981A012922J20729K97139m09716P64728j50813K74014K14962K28939N57984
10972B910888L27602L93468Q29323k34320L31655N54154L08860n35326o30002
10963D256302j087601p50285l58151l43689o5468k20695k10172j18934m9666j02194
10953I49447k33421K96453m80136P9818k26660Q8522r6892N1801A61718J04458
$$ plain form
10943 266176 201810 187529 152751 -2162 290502 31428 142877 9442 -95090 164253 79355
10931 -135699 251691 213312 167684 -81212 -75005 -269588 204608 101702 229401 -208772
10920 11931 82916 -43962 116658 -248871 -178315 284851 -68046 -363578 111322 85241 68551
10909 68551 262545 -191935 142627 -24389 -167159 -206682 42509 -68401 -121973 325922 353714
10898 353714 -2504 130995 77166 -160665 -42494 -153343 -239505 330949 86068 36028 -84037
10886 -216363 46549 -91449 -103992 47718 133478 -41895 -59704 186092 102711 33146 56052
10875 56052 -69793 56575 125418 -158069 -222183 45032 510 -82183 -74395 -69057 -10620 -261200
10863 -261200 27982 161307 167316 -117542 -29828 -52359 4736 107284 49482 107411 -6892
$$ packed form
10943B66176o4366j4281l4778b162B90502C1428J11449I442i5090A64253G9355
10931a35699B51691l8379m5628h1212O207j94583B04608A01702J27699b08772
10920A1931P0985d3962A16658b48871P0556B84851f8046k95532A11322k6081j6690
10909F8551J93994a91935A42627b4389j42770l9523D2509f8401n3572C25922K7792
10898C53714b504A30995n3829a60665d2494j10849q6162C30949H6068C6028h4037
10886b16363D6549i1449j2543D7718Q5760d1895j7809A86092q3381C3146K2906
10875E6052f9793E6575O8843a58069o4114D5032E10h2183P788N338a0620k50580
10863b61200B7982J33325O009a17542b9828k2531D736J02548D9482N7929f892
$$ plain form
10851 159384 -74359 -8774 71336 -53282 63855 -82155 -76405 -26633 -119077 -25042 375232 -103969
10838 -269915 207337 -238257 -116638 288215 -27950 168023 179891 181373 187419 -153280 -18410
10826 1826 -68811 -53218 106628 124736 292932 28569 110945 -83773 -55244 -233047 -275798
10815 -275798 -141876 -125826 -101424 205735 -5942 49413 -105526 -48444 -30158 -330757 11896
10803 -272323 -231148 69381 118885 -19056 -28131 34475 -19001 -122236 -114832 104117 -100379
10791 -203246 -210832 131607 -285384 -285030 -92239 -222393 117649 25458 -223487 -293146 -153440
10780 -153440 9274 133805 -92422 -240231 81942 -312432 -245125 -254184 -56667 31414 87536
10769 87536 -225702 -179673 188541 -252718 90895 -221863 193731 -129398 -193156 -169988
$$ packed form
10851A59384g4359h774G1336e3282F3855h2155N750b6633r2444b5042C75232a03969
10838b69915B07337b38257a16638B88215b7950A68023J1868J482O046a53280a8410
10826A826f8811J5593A06628J8108J68196B8569Q2376h3773K8529j77803m2751
10815b75798J33922J6050K4402B05735e942D9413a05526d8444J8286l00599A1896
10803b72323M1175F9381M9504a9056r075C4475a9001j03235P404A04117a00379
10791b03246p586A31607b85384L54i2239j30154A17649B5458b23487o9659J39706
10780a53440I274J24531i2422j47809H1942c12432O7307r059e6667C1414N6122
10769H7536b25702M6029A88541b52718I0895b21863A93731a29398o3758K3168
$$ plain form
10759 -169988 246673 59626 -188482 53388 -193607 21474 -178370 38950 -249198 110783
10748 -301497 144378 -121458 -129286 126157 133384 -94138 -26350 -17057 -260089 -39958 -43619
10737 -43619 145573 178163 29342 -125154 174764 169334 -85857 -18281 -209391 61935 -149203
10725 -152904 -30288 145374 -10899 57836 57843 220376 -167499 -208044 -189724 -172503 -69474 -198333
10713 -198333 -347490 173040 -1183 24253 -63766 -18444 -93456 -41612 57825 2734 -107192
10701 97915 -220228 -169158 66208 186667 -24212 -59475 -159063 -40662 -400054 -41107 -210120
10690 -210120 271385 -10100 106024 -261795 121268 -220540 -229278 226613 -84717 4776 23127
10679 23127 92293 -270699 375229 214265 252413 -337179 -23719 -281524 -118415 -11888
$$ packed form
10759a69988B46673E9626a88482E3388a93607B1474a78370C8950b49198A10783
10748c01497A44378a21458p828A26157P227i4138b6350R293k43032c9958l661
10737d3619A45573L2590B9342a25154A74764n430h5857a8281j91110F1935a49203
10725a52904c0288A45374a0899E7836PJ62533a67499m0545J8320J7221f9474j28859
10713a98333j49157A73040a183B4253f3766a8444p5012d1612E7825B734a07192
10701I7915b20228N1070F6208J20459b4212l5263r9588d0662l59392d1107j69013
10690b10120B71385a0100A06024b61795A21268b20540q738B26613h4717D776J8351
10679B3127O9166b70699C75229j60964L8148c37179b3719k57805a18415a1888
$$ plain form
10668 -64527 -30926 137428 53052 -45691 -172032 -99961 -205338 -206624 -11431 49690 -156732
10656 -115760 -182218 -57849 -97901 -254929 -197819 -36640 -133286 -49819 111020 3311 -308087
10644 -171136 138167 216612 10091 61008 112388 40037 -187548 -112211 -165330 -299679 -182269
10633 -182269 -79709 -30137 40214 -274771 -32258 -297956 -95673 120376 -129671 -62626 -75978
10622 -75978 -44101 -136672 -136048 -94309 36418 75396 -152571 -50303 -171053 -246112 17838 -274378
10609 19653 -7083 -39537 -112717 107522 -283020 -19215 54314 -86644 -99594 -143675 -99164
10598 -99164 -203084 -139494 338359 -7503 -252710 -190765 -136357 -366606 -12722 -38145 -172743
10587 -172743 16275 -165422 -187876 -211931 -157560 214808 -400768 -163078 -87955 -64627 -60286
$$ packed form
10668f4527c0926A37428E3052d5691j26341P2071j05377j286a1431D9690a56732
10656a15760o6458e7849m0052j57028N7110c6640r6646d9819A11020C311c08087
10644a71136A38167P8445A0091N0917N1380D0037a87548P5337n3119j34349J17410
10633a82269g9709c0137D0214b74771c2258k65698i5673A20376a29671f2626j3352
10622g5978L1877r2571O24M1739C6418L8978a52571e0303j20750p5059A7838b74378
10609A9653g083l2454p3180A07522b83020a9215E4314h6644j2950m4081M4511
10598i9164j03920O3590C38359g503k45207O1945N4408k30249a2722k5423j34598
10587a72743A6275a65422k2454k4055N4371B14808d00768a63078P5123K3328M341
$$ plain form
10576 -60286 167972 -3243 -48241 4090 52715 -90030 93680 -450736 -88307 269362 -118549
10564 -214320 -73302 -64926 -500175 -85999 -84009 -238390 94474 163743 -89433 20988 127883
10553 127883 -30150 -55956 165453 -102570 -234521 -233330 -127608 -278309 -164085 194105
10542 -89025 -226930 -21743 -194201 71649 48857 10104 -107380 20035 -231153 -201078 30428
10530 56284 -128941 75627 159679 -127138 -203768 124731 -418984 23901 268734 -143873
10519 -167109 -176343 -213186 -76802 -325533 -355033 -36253 -189735 -141016 73405 -56398 82132
10507 167108 127808 -358625 -19031 -22784 246014 638 -75855 -181205 70754 44964 156585
10496 156585 -290383 68086 40506 -48098 -60922 -109664 -284373 -71509 -132283 148533 -32011
$$ packed form
10576f0286A67972c243m4998D090M8625i0030I3680d50736h8307B69362a18549
10564b14320g3302Q376m35249h5999J990j54381I4474O9269h9433B0988J06895
10553A27883c0150k5806A65453a02570j31951J191J05722j50701J14224A94105
10542h9025j37905b1743j72458G1649k2792A0104a07380B0035b31153L0075C0428
10530E6284a28941G5627Q4052a27138p6630A24731d18984B3901K44833a43873
10519a67109r234l6843g6802k48731k9500c6253j53482M8719G3405e6398H2132
10507A67108l9300c58625a9031l753B46014F38g5855j05350G0754k5790J11621
10496A56585b90383F8086k7580d8098j2824m8742j74709g1509o0774A48533c2011
$$ plain form
10484 109347 183314 -13968 128363 -288181 -232382 -58631 140599 9529 -54680 -97912 -352453
10473 -352453 77877 -42133 76708 -307496 -266211 101914 -224740 -60668 -77085 90163 -138949
10461 153981 -117040 -3421 -49085 -75949 -97809 -204764 -33312 175640 -193601 -335873 -134903
10449 -168293 63457 110397 117737 66012 -203820 -117746 -224835 -213681 462287 -208819 -216382
10438 -216382 -24989 67419 -205085 3236 -172756 101852 63713 306403 -140592 -271480
10428 -271480 29112 -108011 -486319 -43050 153790 217453 177179 313069 -281471 -55030
10417 -173763 -36623 -293558 21934 141611 314316 -190912 -124369 17962 244802 -6601 -49367
10406 -49367 -364020 25617 566125 417359 114580 -57080 102355 49913 101762 241160
$$ packed form
10484A09347P3967a3968A28363b88181N5799e8631A40599I529e4680m3232k54541
10473c52453G7877d2133G6708c07496M1285A01914b24740f0668j6417I0163a38949
10461A53981a17040c421m5664k6864k1860j06955c3312A75640a93601j42272a34903
10449a68293F3457M6940P340n1725b03820Q6074j07089J1154D62287b08819p563
10438b16382b4989F7419b05085C236a72756A01852l8139K42690a40592j30888
10428b71480B9112a08011l78308d3050A53790O3663m0274J35890b81471e5030
10417a73763c6623k56935B1934J19677J72705a90912O6543A7962K26840f601m2766
10406d9367l14653B5617N40508j48766A14580e7080A02355D9913N1849J39398
$$ plain form
10396 241160 250480 210082 -827 218784 465566 52241 320279 16579 24207 -1649 186954 198888
10384 198888 235920 139614 142300 83632 344926 120978 488511 200756 348054 425965 344869
10373 344869 326645 639231 329507 362617 42021 286572 501869 385879 537089 612172
10363 612172 671190 548487 483712 608971 179912 44392 8269 440151 240593 72983 414508
10352 414508 36043 406958 908886 1334382 904599 529237 322132 -1219 318657 320013
10342 320013 283247 182689 22682 60863 144296 191446 227424 154884 103338 157260 147144
10331 147144 114917 24681 23043 129685 -278786 176394 117727 338056 147707 129085 621970
10320 621970 337969 336503 29981 257252 -142640 309720 101582 194254 371393 -104219
$$ packed form
10396B41160R320m0398h27B18784K46782E2241K68038A6579P628a649A86954J1934
10384A98888L7032r6306K686n8668K61294A20978L67533B00756J47298P7911q1096
10373C44869j8224L12586l09724L3110D2021K44551K15297j15990J51210P5083
10363F12172N9018j22703o4775J25259A79912D4392H269M31882j99558G2983L41525
10352D14508C6043L70915N01928M25496m29783l75362k07105a219C18657J356
10342C20013l6766j00558B2682L8181Q3433M7150L5978p2540n1546N3922j0116
10331A47144l2227B4681j638J06642b78786A76394n8667K20329A47707j8622M92885
10320F21970k84001j466B9981K27271a42640C09720A01582R2672J77139a04219
$$ plain form
10309 -48766 -16321 79770 762 380591 31253 -53572 167058 -105992 -361518 247377 7261
10297 -214725 -127625 18901 -96513 109153 -205242 -269958 85709 68129 -166046 -234269 -86889
10285 -152602 -229117 -29250 -225192 88451 3 174113 205212 76596 -210894 322540 -386634
10273 -165868 -247891 -325983 -148455 -8146 -182297 -193373 230916 -122237 263699 -205568
10262 167991 192784 -286415 90903 64922 -48191 -315692 47980 40908 -111334 -79684 -110423
10251 -110423 159596 -49726 58199 53442 1386 215935 68924 -117440 -98275 -212831 8785
10239 188581 46675 -189912 398961 185064 94128 235300 35624 -22080 -188442 76864
10228 -72790 -368187 -157989 17164 -368455 -256425 -193432 -12021 66586 -297656 17705 87271
$$ packed form
10309d8766a6321G9770G62L79829C1253e3572A67058a05992k55526B47377G261
10297b14725Q7100A8901i6513A09153b05242o4716H5709j7580a66046o8223h6889
10285a52602p6515b9250j95942H8451CJ74110L1099G6596b10894C22540c86634
10273a65868q2023p8092a48455h146j74151j1076B30916a22237B63699b05568
10262A67991K4793b86415I0903k5981d8191k67501D7980p072a11334L1650l0739
10251a10423A59596d9726E8199m757A386K14549F8924a17440J9165j14556H785
10239A88581D6675a89912C98961A85064r0936J41172C5624b2080j66362G6864
10228g2790k95397a57989A7164c68455J12030O2993a2021F6586b97656A7705O9566
$$ plain form
10217 87271 167925 -295045 -108055 -46014 137670 119992 21149 -256150 -172238 36489 162044
10206 162044 162362 -145667 -140235 -297467 -194537 69837 -220253 -50050 153034 -337482 37819
10194 13596 34348 -71733 -162682 -216055 128312 -72001 -293361 17909 -131786 10010 -115223
10182 -5859 93543 84447 -249489 107761 -296035 -61191 60750 173822 58000 -309158 121227
10170 -106271 47426 31811 -72194 151764 155172 -6276 -78578 -152009 163441 26313 -52272
10158 -21033 114434 111820 -2361 -144163 28730 83386 -41957 345575 27829 109091 -9366 -431614
10146 -431614 15938 191975 38625 -288041 -80043 84252 19311 74703 -337214 -190188 -247100
10135 -247100 92061 127575 -85159 -44601 96800 -316287 37517 27005 441386 263858 231193
$$ packed form
10217H7271Q0654b95045a08055d6014A37670j7678B1149b56150Q3912C6489J25555
10206A62044L18a45667N432j57232J02930F9837b20253e0050A53034c37482C7819
10194A3596K0752g1733r0949n3373A28312g2001k21360A7909a31786A0010a15223
10182e859I3543r096b49489A07761b96035f1191F0750J13072E8000c09158A21227
10170a06271D7426j5615g2194A51764L408f276p2302p3431A63441B6313e2272
10158b1033A14434k614b361j41802B8730N4656d1957C45575B7829Q1262i366m22248
10146d31614A5938J76037C8625b88041h0043H4252A9311N5392c37214J47026n6912
10135b47100I2061L5514h5159M0558I6800c16287C7517j0512M14381j77528l2665
$$ plain form
10124 231193 -197612 -172566 -71235 -267325 -239282 31639 -169930 15108 -224110 35748 142753
10113 142753 94465 209772 -107006 -167999 -124736 57739 -3117 -478475 -19973 -32895 75940
10101 -184158 -120081 10090 -203209 -169251 156210 -111990 -146676 -183293 -221012 98394 -97826
10089 -20675 163173 143848 -115585 83144 -342829 -131641 -300544 40244 -22042 89870 -14306
10077 -212915 105028 -64894 -176632 150351 -157769 -117 -15382 -60184 -38895 64286 -206624
10065 -321274 10891 -274667 16688 1186 41830 -176912 -21243 166579 -26964 184322 73029
10053 -206757 -53293 -192932 303819 -191199 -1807 -37915 134649 14479 14181 59247 120970
10042 120970 -141728 90923 -49823 -62146 -349142 -325606 -147353 227067 -193247 189691
$$ packed form
10124B31193a97612K5046g1235j96090K8043C1639a69930A5108b24110C5748J07005
10113A42753m8288J15307a07006o0993M3263E7739c117m75358a9973j2922G5940
10101a84158O4077A0090b03209L3958A56210a11990l4686l6617l7719I8394i7826
10089b0675A63173j9325a15585H3144c42829a31641j68903D0244b2042H9870a4306
10077b12915A05028f4894j11738A50351a57769a17j5265m4802K1289F4286b06624
10065c21274A0891b74667A6688A186M0644a76912b1243A66579b6964A84322G3029
10053b06757e3293j39639C03819a91199a807l6108A34649A4479k98M5066O1723
10042A20970a41728I0923d9823j2323k86996K3536a47353B27067a93247A89691
$$ plain form
10031 -115422 -79885 -29563 -324571 56501 -205143 75921 98473 235641 -404962 2661 61314
10020 61314 -105927 -173781 -62250 88821 -32897 140985 -264672 -70741 108792 -126613 -125701
10009 -125701 -205244 72700 -94518 -6722 -182922 -19643 -43851 -103003 183700 -123605 -148279
9998 -148279 -253050 25387 22001 -32089 -147401 122116 -158713 37136 -93511 -171274 -118842
9987 -118842 -5812 145547 126819 -1004 30161 -82827 29906 -252986 -329970 -230388 -226303 -16475
9974 -212947 -262856 -67067 10147 72910 -192306 53681 172541 23084 -90730 47613 263988
9963 263988 14262 -344689 -229877 -94647 -174062 -34449 -132033 -11372 28727 -39595 -17954
9951 -4413 -127202 -431044 -54326 -45330 -135792 130175 -5197 -125190 -74919 99694 -141273
$$ packed form
10031a15422L5537b9563k95008E6501b05143G5921K2552J37168d04962B661N8653
10020F1314a05927o7854f2250H8821c2897A40985b64672g0741A08792a26613R12
10009a25701p9543G2700i4518f722j76200a9643k4208n9152A83700a23605k4674
9998a48279j04771B5387l386c2089j15312A22116a58713C7136i3511p7763N2432
9987a18842e812A45547j8728a004C0161h2827B9906b52986p6984R9582M085a6475
9974b12947m9909f7067A0147O2763a92306E3681J18860B3084i0730D7613K16375
9963B63988A4262c44689J14812i4647p9415c4449r7584a1372B8727c9595a7954
9951d413j22789l03842e4326Q996r0462A30175e197j19993N0271I9694a41273
$$ plain form
9939 -230355 -93328 178063 -83957 12713 -297719 -217041 77054 46405 -253899 -324364 -36585
9927 -151761 159288 289864 -239968 3745 51413 -180066 129898 -449 -112451 -40471 -205106
9916 -205106 -163147 -151137 136175 -159728 219833 -24131 -80825 -418855 109303 -228071
9905 -73658 -287727 -405942 -11403 -125116 -146251 309066 -299423 21222 73179 -73578 -286317
9894 -286317 245282 -344033 -43771 -190768 -239563 -248358 10932 197132 -155384 49904 146308
9883 146308 -16745 153981 -58965 -113516 17700 -61778 125297 70272 44685 -139021 116857
9871 -57798 -42710 134458 221826 -244238 -91749 -483938 -243245 -29967 -141965 152948 47421
9859 186519 -190196 63873 -298033 -186417 -454666 436347 -361883 -504147 64042 67739
$$ packed form
9939b30355i3328A78063h3957A2713b97719Q0678G7054l0649b53899p0465c6585
9927a51761A59288J30576b39968C745M7668a80066A29898d49j12002d0471j64635
9916b05106M1959J2010A36175a59728B19833b4131n6694l38030A09303b28071
9905g3658k14069j18215a1403j13713k1135C09066b99423B1222N1957g3578k12739
9894b86317B45282c44033d3771j46997m8795q795A0932J86200a55384D9904R6404
9883A46308a6745A53981e8965n4551A7700f1778A25297n5025k5587a39021A16857
9871e7798J5088A34458Q7368b44238i1749l92189K40693b9967j11998A52948D7421
9859A86519a90196F3873b98033J11616k68249D36347c61883j42264F4042L697
$$ plain form
9849 67739 -55197 49121 11648 22468 209764 -121375 -233154 147069 -259225 -114514 -66102
9838 -66102 -126002 -146769 -329625 -8729 164992 34140 61406 134580 80694 158285 89374 -283540
9825 -171245 64830 35674 -70918 -190156 395661 -97505 74059 95080 -205380 -252503 -47393
9813 331985 -322307 223348 159629 -274233 -7306 -166652 -223127 -187439 75385 -115754 -176421
9802 -176421 -150375 280031 -19741 -174886 -224245 -95182 -110749 -186975 65344 -303237 72390
9790 -59717 -349817 -256634 26127 68168 -221389 -209572 -51199 178409 -36594 -152740 -53756
9778 8567 -204444 -79971 -80592 -366517 191707 94558 -48631 -188252 67462 -86924 -152165 -152718
9766 -152718 47225 -356385 252261 -21328 -16769 -65927 49247 227393 -146591 -222932 29190
$$ packed form
9849F7739e5197D9121A1648J0820J87296a21375j11779A47069b59225a14514M8412
9838f6102n9900k0767j82856h729A64992C4140K7266P3174n3886P7591o8911b83540
9825a71245F4830k9156g0918j19238C95661i7505G4059K1021b05380m7123d7393
9813C31985c22307B23348o3719b74233g306j59346n6475L5688G5385a15754o0667
9802a76421K6046B80031a9741j55145m9359i5182j5567p6226F5344c03237G2390
9790e9717k90100R3183B6127M2041b21389J1817e1199A78409c6594j16146e3756
9778H567b04444g9971o21k85925A91707I4558d8631j39621F7462h6924o5241n53
9766a52718D7225c56385B52261b1328M559m9158D9247J78146a46591p6341B9190
$$ plain form
9754 -623763 -163417 -219531 -64628 -77027 158018 -75156 -261280 -273467 89931 -204121 86563
9742 -14826 -161378 14582 55562 195176 -26794 404164 -162992 156310 -154115 -1173 -69027
9731 -69027 390060 -124021 53172 -179876 -82381 -237130 55817 19231 -40551 -442609 293574
9719 -180013 100852 -47426 24593 -163458 203753 28874 -13193 -264178 -228571 -215223 -218881
9708 -218881 -54169 26668 127106 -72214 77112 -284485 -139923 -116099 -6662 -122161 -94966
9697 -94966 -321182 164093 -372126 5215 -79964 -376868 -143151 -7921 -268700 -444648 42569
9685 -116413 106400 51093 28487 -235946 -8637 155046 8065 -173892 -59842 -274475 -118138
9673 -168955 477415 -62313 92719 -34870 -26308 -137877 85373 -165011 -317471 122023 183279
$$ packed form
9754f23763a63417n6114f4628j2399A58018g5156j86124j2187H9931b04121H6563
9742a4826j46552A4582M0980J39614b6794D04164a62992A56310a54115a173o7854
9731f9027C90060a24021E3172a79876h2381j54749E5817A9231d0551m02058B93574
9719a80013A00852d7426B4593a63458B03753B8874a3193k50985L5607J3348l658
9708b18881e4169B6668J00438g2214G7112b84485a39923K3824f662j15499K7195
9697i4966k26216A64093c72126E215g9964k96904a43151g921k60779j75948D2569
9685a16413A06400E1093k2606b35946h637A55046H065a73892e9842k14633a18138
9673a68955D77415f2313I2719c4870Q562j11569H5373a65011j52460A22023O1256
$$ plain form
9662 183279 -276921 16224 65483 154719 -18028 136326 -339615 57389 27078 27207 91481
9651 91481 394755 -225369 -259515 13030 -230506 87741 19800 -400460 71885 -325013 -24736
9639 25404 -62343 -257122 266056 80762 107823 227341 -194838 316569 -19598 -46887 -60257
9628 -60257 47050 -277590 -257396 113309 -222124 -156055 45605 -200423 -227997 -89014 95364
9616 355276 -82549 69862 -89714 -102559 -182709 238476 -262283 169187 -52976 -137995 124874
9604 154606 -15837 -436237 -171258 -448281 -92594 183742 27208 -76790 -420853 -122924
9593 46349 119009 -1141 160454 -140615 284787 -24690 -262870 -141123 -389259 383896 -23866
9581 -54338 148573 -88225 -578817 -285005 179933 -83707 -168049 74305 180817 -56723 -335882
$$ packed form
9662A83279b76921A6224M9259Q9236a8028A36326c39615E7389B7078J29O4274
9651I1481L03274b25369l4146A3030b30506H7741A9800d00460G1885c25013b4736
9639B5404f2343j94779B66056H0762K7061J19518a94838C16569a9598k7289j3370
9628f0257D7050b77590K0194A13309b22124O6069D5605b00423k7574h9014I5364
9616C55276h2549F9862h9714j2845q0150B38476b62283A69187e2976q5019A24874
9604A54606a5837m20400a71258k77023i2594A83742B7208g6790l44063a22924
9593D6349P2660a141A60454a40615B84787b4690k38180J21747k48136C83896b3866
9581e4338A48573h8225m90592b85005A79933h3707q4342G4305J06512e6723k79159
$$ plain form
9570 -335882 -252521 -310839 208529 147917 -109965 72892 -23666 -12474 170017 -3433 195899
9558 77258 -190625 50571 -66720 -374535 -138023 9105 -110978 -92422 -89469 64280 -237128
9546 8131 -23531 -316847 -60641 -95098 7882 154810 -49021 24606 -16571 -63069 354508 22817
9533 -185605 -268902 10552 -225029 -391294 -149138 60570 -19616 142085 66128 38159 55097
9522 55097 -6861 -94409 -57119 -147753 -150559 62476 86335 -121191 -100015 -127068 -195888 70488
9509 -97495 191215 -41102 -249720 -250068 -97525 -134055 318912 62817 3314 -182883 226125
9497 -395119 -70347 -126337 57620 -4395 407035 212486 -197186 -707 -29683 -72029 349741
9485 -98818 -14224 -322837 -69339 -31142 -70499 -121868 -64283 -67714 -63797 -31676 74861 -196901
$$ packed form
9570c35882Q3361n8318B08529o0612a09965G2892b3666J1192A70017c433A95899
9558G7258a90625E0571f6720l07815a38023I105a10978J8556K953F4280b37128
9546H131b3531k93316f0641l4457G882J46928d9021B4606a6571m6498C54508B2817
9533a85605q3297A0552b25029j66265a49138F0570a9616A42085F6128k7969J6938
9522E5097f861q7548L7290r0634k806F2476K3859a21191K1176k7053o8820G0488
9509i7495A91215d1102k08618l48i7525l6530C18912F2817C314a82883B26125
9497c95119g0347n5990E7620d395D07035j94549a97186g07k8976m2346C49741
9485i8818a4224l08613f9339c1142l9357n1369N7585l431L917c1676G4861a96901
$$ plain form
9472 -349839 -271391 -430537 -53247 -89477 -148030 48747 -50259 -178221 -66527 -142203 -87291
9461 -87291 -232431 -25058 81457 -296547 -26536 -175131 70944 -98123 137465 -235196 20718
9449 -92125 -127088 -390897 140598 -326679 -23804 -163340 51345 -214949 34307 222139 -173651
9437 131834 22687 -68008 164093 -188743 -175058 -117106 -162612 -169439 -108899 25922 206617
9426 206617 -102120 -273730 -329141 221329 80502 -56698 -49919 8210 -130631 -157396 200142
9414 -555877 198053 -60301 -135050 -37582 -21827 -523806 -190338 -60251 138648 -259769 -178158
9403 -178158 227460 15028 -286772 -221041 -10333 233886 16600 -42240 305355 -51270 -74187
9392 -74187 169358 -118754 195028 -35927 -111611 -111512 -116681 102897 -589906 319120 155642
$$ packed form
9472c49839P8448j59146e3247l6230n8553D8747e0259j27962f6527p5676N4912
9461h7291j45140b5058H1457b96547b6536j48595G0944i8123A37465b35196B0718
9449i2125l4963k63809A40598c26679b3804j39536E1345b14949C4307J87832a73651
9437A31834B2687f8008A64093a88743J3685N7952m5506o827O0540B5922J80695
9426B06617a02120j71610n5411B21329H0502e6698O779H210a30631k6765B00142
9414e55877A98053f0301p4749c7582J5755n01979a90338f0251A38648b59769Q1611
9403a78158B27460A5028b86772O5731a0333B33886A6600d2240C05355e1270k2917
9392g4187A69358a18754A95028c5927p5684R9n169A02897e89906C19120A55642
$$ plain form
9380 184797 -299550 -27688 115319 -2671 -128551 54309 1292 55515 122829 -204770 293058
9368 -79405 -122988 -285342 -306027 -235620 214461 154715 50642 134666 117739 174670 -114661
9356 -73656 -154412 -102567 -19707 111829 -47910 -1087 35005 206450 -268121 -31108 -246129
9345 -246129 -163332 -76542 -207037 -91803 -130207 203068 -268900 2287 -145478 111332 -81882
9333 9106 -121688 -25976 -150480 3906 -40329 -212043 -129401 -294393 -422900 -299175 53959
9321 -6401 83201 -123825 95194 -34056 82431 -158599 -243464 -266396 -145830 -101263 81610
9309 -147832 -51458 -200576 -68607 -490800 128859 -126891 91685 -108082 -222176 -63073
9298 -17788 12175 -197516 262246 54502 -8146 209250 -300295 51727 74515 -78822 -128213
$$ packed form
9380A84797b99550b7688A15319b671j25880E4309A292N4223O7314b04770B93058
9368g9405m3583j62354k0685P0407B14461n9746E0642Q4024j6927N6931a14661
9356g3656q0756N1845a9707A11829d7910a087C5005J71445b68121c1108k15021
9345b46129Q2797g6542j30495i1803l8404B03068b68900B287a45478A11332h1882
9333I106a21688b5976j24504C906d0329j71714Q2642j64992j28507J23725E3959
9321f401H3201a23825I5194c4056H2431a58599q4865k2932J20566M4567H1610
9309a47832e1458j49118f8607m22193A28859a26891I1685a08082j14094f3073
9298a7788A2175a97516B62246E4502h146B09250c00295E1727K2788g8822m9391
$$ plain form
9287 -128213 -245245 212549 -206669 -165208 -103775 36536 114554 -58689 -210322 -84325 75972
9275 -127361 17437 -202918 1269 376080 -63557 -310432 -11596 -4002 23303 -100229 103176
9263 -241454 100 172756 425758 79953 -153608 -40675 149036 -34921 -133234 -197116 -86515
9251 134976 37661 -214670 -207911 55167 168812 -270123 26863 -253264 68869 -60862 139988
9239 -357455 -229022 276757 -204750 -291750 105114 -293834 32643 -46697 -120575 306536
9228 107321 240111 55055 -56543 25236 32474 -4541 107567 -52867 31009 -275210 -395252
9217 -395252 95780 11527 -79731 -251023 321245 -227888 -117909 -99373 -156319 -125226 -89647
9206 -89647 -54345 176091 -227586 238922 145683 -388880 -56244 175979 -274712 447108
$$ packed form
9287a28213j17032B12549b06669M1461O1433C6536P8018e8689j51633h4325G5972
9275a27361A7437b02918A269L74811f3557k46875a1596d002B3303a00229A03176
9263b41454A00J72656K53002G9953a53608d0675A49036c4921r8313o3882h6515
9251A34976C7661b14670O759E5167J13645b70123B6863b53264F8869f0862A39988
9239c57455J28433B76757b04750q7000A05114b93834C2643d6697p3878C06536
9228A07321J32790E5055e6543B5236P238d541A07567e2867C1009b75210j20042
9217c95252I5780A1527g9731j71292C21245b27888J09979J8536n6946L1093L5579
9206h9647L5302A76091b27586B38922r3239c88880e6244A75979b74712D47108
$$ plain form
9195 -61669 -121363 92102 68896 -350761 -72392 153831 245294 145558 -200107 -47885 48073
9183 78475 -99822 275500 -121603 -191029 -175659 234494 84987 -357786 -446960 153313 79993
9172 79993 110219 -172110 118891 -224950 -167855 62412 -275865 -153690 -128204 136309 -62102
9160 17787 261584 -247163 46637 36514 61536 -38122 -107218 171909 -73895 -10663 -280238
9149 -280238 133367 -337838 -108829 -46298 -279175 -178626 -305153 41690 3346 -193324
9138 -201217 -43430 78099 -70848 136312 -335338 -187627 75649 -233565 -10420 313848 -60151
9126 36652 -133229 -22348 10142 100209 19943 108741 50389 -52327 -363669 206319 -64190
9114 -109410 -15975 -211334 -60367 -173294 452129 48384 21613 80687 -189267 121268 -23201
$$ packed form
9195f1669n9694I2102k3206c50761g2392A53831R1463r9736b00107d7885D8073
9183G8475i9822B75500a21603o9426J5370B34494H4987c57786q9174A53313p3320
9172G9993L0226a72110A18891b24950N7095F2412b75865J22175K5486A36309f2102
9160A7787K43797b47163D6637j0123K5022c8122o9096A71909g3895a0663k69575
9149b80238A33367c37838a08829d6298k32877J00549j26527D1690C346a93324
9138b01217d3430G8099g0848A36312c35338J47711G5649b33565a0420C13848f0151
9126C6652a33229b2348A0142R0067A9943Q8798E0389e2327l11342B06319f4190
9114a09410a5975j95359f0367j12927D52129D8384B1613N9074a89267A21268b3201
$$ plain form
9102 102399 -156541 -258095 -7372 -167647 -111398 -208827 82229 -521614 -79049 -168447 -270204
9091 -270204 -114553 -156513 -212664 -211199 14247 -272895 -34230 214076 -293966 -157757 170059
9079 -80506 36967 -191247 -384200 -179514 -264562 -22439 -109116 -44156 -210972 -171071 -56924
9067 67161 161039 -106576 160904 -41985 -19417 -238958 13873 235326 -251168 39149 -208933
9055 -41978 -41604 -178204 -250016 78923 -14950 -296900 -210194 145889 122308 -400392 -13356
9043 -109308 -167059 -402508 -101535 -11082 -91752 -155235 -139906 -57978 -29724 11668 216395
9032 216395 267524 -131156 -222930 -7773 -128894 180038 -138606 -110229 -297753 -43586 -86457
9021 -86457 -54445 -295790 -96120 225127 83279 -108351 -79988 -278042 -85188 -28538 -175848
$$ packed form
9102A02399a56541j01554g372j60275N6249r7429H2229e21614g9049q9398j01757
9091b70204a14553m1960n6151J465A4247b72895c4230B14076b93966J36209A70059
9079h0506C6967a91247j92953a79514q5048b2439q6677d4156j66816L9901e6924
9067F7161R3878a06576A60904d1985a9417k19541A3873K21453b51168C9149b08933
9055d1978L74j36600p1812G8923a4950k81950Q6706A45889k3581d00392a3356
9043a09308n7751k35449a01535a1082q0670o3483J5329e7978K8254A1668K04727
9032B16395N1129a31156r1774g773j21121A80038a38606K8377j87524d3586m2871
9021h6457L2012k41345i6120B25127H3279a08351K8363j98054h5188b8538j47310
$$ plain form
9010 -175848 427276 49216 71211 -372167 -231100 -542559 -224715 -180304 59091 -128067
8999 -82267 42217 5568 72549 296993 -150806 73189 234353 -16618 8724 81890 46367 -15688
8986 -89582 265410 175562 212335 -105297 120878 -94687 -477045 -47228 -191025 -108583 -20908
8974 -75421 -104841 -97947 -198881 -373266 -105835 23545 -182694 -299719 228353 15589 -6729
8962 65900 96079 166973 23024 131764 57348 -169870 -160073 -202631 -212119 -258821 -49339 -14380
8949 348990 -192670 10412 -294997 -133230 -142556 -116499 -32214 132873 -151199 -60949 -102798
8938 -102798 170324 148936 235604 270033 61504 404235 60392 19762 293318 -171862 31782
8926 30650 58394 121565 518862 471045 1449139 4319077 18141872 6620126 1505322 767235
$$ packed form
9010a75848D27276D9216K1995c72167J41067l11459b24715M4411E9091a28067
8999h2267D2217E568O6981K24444a50806G3189J61164a6618H724P3166l5523a5688
8986h9582B65410q9848L6773a05297A20878i4687l82358d7228j43797Q2442b0908
8974g5421k9420O894j00934j74385a05835B3545a82694j17025B28353A5589f729
8962F5900L0179P0894B3024J08740E7348a69870R797m2558r488m6702d9339a4380
8949C48990a92670A0412b94997a33230r326K6057c2214A32873a51199f0949m1849
8938a02798A70324k1388Q6668L4429F1504L42731F0392A9762K73556a71862C1782
8926C0650K7744O3171L97297m7817R78094K869938J3822795F620126A505322p38087
$$ plain form
8916 767235 222541 551401 271415 258234 -89937 -43881 179116 -140041 181516 477507
8906 477507 238035 105863 -495297 -99862 30665 38507 4865 -224446 15086 181853 200937
8895 200937 12708 -30206 -62126 -15210 -285581 -191083 19657 93755 -202274 -257808 -267715
8884 -267715 -59925 -104771 -126846 260650 -325397 -125402 19128 371282 -450988 -59348 252917
8872 -308095 -184686 43329 -161938 108780 -121522 15698 121819 -216409 140921 -101597
$$ packed form
8916G67235B22541L28860B71415j3181h9937d3881A79116a40041A81516K95991
8906D77507B38035A05863d95297i9862C0665P842D865b24446A5086J66767J9084
8895B00937A2708c0206l1920a5210k70371R4498A9657P4098b02274n5534r907
8884b67715e9925m4846k2075B60650c25397a25402A9128L52154d50988e9348B52917
8872c08095J23409D3329a61938A08780a21522A5698J06121b16409A40921a01597
$$ [...]
##END NTUPLES=NMR SPECTRUM
##END=
