
##TITLE=AC1350_CHIRS12168_6647856_EPevJKYBGy
##JCAMPDX= 6.0         $$ Bruker NMR JCAMP-DX V2.0
##DATA TYPE= NMR SPECTRUM
##DATA CLASS= NTUPLES
##ORIGIN= BRUKER
##OWNER= Administrator
$$ 1.72 TOPSPIN		Version 2.1
$$ 2012-08-10 17:48:48.718 -0500  Administrator@TOPSPIN
$$ Compression mode = diff/dup
##.OBSERVE FREQUENCY= 400.02188249412
##.OBSERVE NUCLEUS= ^1H
##.ACQUISITION MODE= SIMULTANEOUS (DQD)
##.ACQUISITION SCHEME= undefined
##.AVERAGES= 64
##.DIGITISER RES= 22
##SPECTROMETER/DATA SYSTEM= spect
##.PULSE SEQUENCE= noesygpps1d.comp
##.SOLVENT NAME= COFFEE_meoh
##.SHIFT REFERENCE= INTERNAL, COFFEE_meoh, 1, 14.96187
##AUDIT TRAIL= $$ (NUMBER, WHEN, WHO, WHERE, PROCESS, VERSION, WHAT)
$$ ##TITLE= Audit trail, TOPSPIN		Version 2.1
$$ ##JCAMPDX= 5.01
$$ ##ORIGIN= Bruker BioSpin GmbH
$$ ##OWNER= Administrator
$$ $$ C:\Bruker\TOPSPIN/data/COFFEE/nmr/AC1350_CHIRS12168_6647856_EPevJKYBGy/22/pdata/1/auditp.txt
$$ ##AUDIT TRAIL=  $$ (NUMBER, WHEN, WHO, WHERE, PROCESS, VERSION, WHAT)
(   1,<2012-08-10 17:48:43.812 -0500>,<Administrator>,<TOPSPIN>,<go>,<TOPSPIN 2.1>,
      <created by zg
	started at 2012-08-10 17:37:13.515 -0500,
	POWCHK enabled, PULCHK disabled,
       configuration hash MD5:
       6B 1B 68 BB D9 2E 58 E2 7F 35 AD 54 07 DF 0E 41
       data hash MD5: 64K
       00 DD F2 40 76 05 CE F3 9B F8 94 46 F2 3D C3 B1>)
(   2,<2012-08-10 17:48:46.656 -0500>,<Administrator>,<TOPSPIN>,<proc1d>,<TOPSPIN 2.1>,
      <Start of raw data processing
       efp LB = 0.3 FT_mod = 6 PKNL = 1 PHC0 = 0 PHC1 = 0 SI = 128K 
       data hash MD5: 128K
       29 1C FF 0B E8 9B 4A 0A 09 38 BD 67 17 8E 38 F8>)
(   3,<2012-08-10 17:48:47.875 -0500>,<Administrator>,<TOPSPIN>,<proc1d>,<TOPSPIN 2.1>,
      <pk PHC0 = 4.11438 PHC1 = 0 
       data hash MD5: 128K
       87 E4 92 C3 68 4B 18 5E B0 B8 7A B3 C0 19 66 67>)
(   4,<2012-08-10 17:48:48.406 -0500>,<Administrator>,<TOPSPIN>,<proc1d>,<TOPSPIN 2.1>,
      <abs ABSG = 1 
       data hash MD5: 128K
       D9 FE 98 39 0B 11 DD D5 1C 5A 98 B0 47 98 2D 1D>)
(   5,<2012-08-10 17:48:48.468 -0500>,<Administrator>,<TOPSPIN>,<proc1d>,<TOPSPIN 2.1>,
      <abs ABSG = 2 
       data hash MD5: 128K
       32 0A DB 97 4D BD E8 AA 09 80 6A AB 32 3E B6 50>)
(   6,<2012-08-10 17:48:48.531 -0500>,<Administrator>,<TOPSPIN>,<proc1d>,<TOPSPIN 2.1>,
      <abs ABSG = 3 
       data hash MD5: 128K
       43 94 B4 E9 23 CF DC 93 8A 20 CD D9 87 CA C2 93>)
(   7,<2012-08-10 17:48:48.578 -0500>,<Administrator>,<TOPSPIN>,<proc1d>,<TOPSPIN 2.1>,
      <abs ABSG = 4 
       data hash MD5: 128K
       C1 BF 79 A6 35 7C 04 C4 F0 85 2B 0B 56 A7 CC C3>)
(   8,<2012-08-10 17:48:48.640 -0500>,<Administrator>,<TOPSPIN>,<proc1d>,<TOPSPIN 2.1>,
      <abs ABSG = 5 
       data hash MD5: 128K
       5B AE 88 C4 0E 17 4D F3 86 9A 7A 86 E6 9C FE FD>)
$$ ##END=
$$ 
$$ $$ hash MD5
$$ $$ 5D C2 A7 AB 2A 65 87 C6 B9 36 4D 7F 4C F7 06 D5
##$RELAX= 
##$RELAX= 
##$RELAX= 
##$RELAX= 
##$RELAX= 
##$RELAX= 
##$RELAX= 
##$RELAX= 
$$ Bruker specific parameters
$$ [...]
150 150 150 150 150 150 150 150
##$TP07= 0
##$TPNAME0= <>
##$TPNAME1= <>
##$TPNAME2= <>
##$TPNAME3= <>
##$TPNAME4= <>
##$TPNAME5= <>
##$TPNAME6= <>
##$TPNAME7= <>
##$TPOAL= (0..7)
0.5 0.5 0.5 0.5 0.5 0.5 0.5 0.5
##$TPOFFS= (0..7)
0 0 0 0 0 0 0 0
##$TUNHIN= 0
##$TUNHOUT= 0
##$TUNXOUT= 0
##$USERA1= <user>
##$USERA2= <user>
##$USERA3= <user>
##$USERA4= <user>
##$USERA5= <user>
##$V9= 5
##$VALIST= <valist>
##$VCLIST= <CCCCCCCCCCCCCCC>
##$VD= 0
##$VDLIST= <DDDDDDDDDDDDDDD>
##$VPLIST= <PPPPPPPPPPPPPPP>
##$VTLIST= <TTTTTTTTTTTTTTT>
##$WBST= 1024
##$WBSW= 4
##$XGAIN= (0..3)
0 0 0 0
##$XL= 0
##$YL= 0
##$YMAX_a= 13635913
##$YMIN_a= -9023112
##$ZGOPTNS= <>
##$ZL1= 120
##$ZL2= 120
##$ZL3= 120
##$ZL4= 120
##$ABSF1= 14.96187
##$ABSF2= -5.596312
##$ABSG= 5
##$ABSL= 3
##$ALPHA= 0
##$AQORDER= 0
##$ASSFAC= 0
##$ASSFACI= 0
##$ASSFACX= 0
##$ASSWID= 0
##$AUNMP= <proc_prof1d_extract.lims>
##$AXLEFT= 0
##$AXNAME= <>
##$AXNUC= <1H>
##$AXRIGHT= 0
##$AXTYPE= 0
##$AXUNIT= <>
##$AZFE= 0.1
##$AZFW= 0.1
##$BCFW= 0
##$BC_mod= 0
##$BYTORDP= 0
##$COROFFS= 0
##$CY= 15
##$DATMOD= 1
##$DC= 0
##$DFILT= <>
##$DTYPP= 0
##$F1P= 0
##$F2P= 0
##$FCOR= 0.5
##$FTSIZE= 131072
##$FT_mod= 6
##$GAMMA= 0
##$GB= 0
##$INTBC= 1
##$INTSCL= 1
##$ISEN= 128
##$LB= 0.3
##$LEV0= 0
##$LPBIN= 0
##$MAXI= 10000
##$MC2= 0
##$MEAN= 0
##$ME_mod= 0
##$MI= 0
##$NCOEF= 0
##$NC_proc= -2
##$NLEV= 6
##$NOISF1= 0
##$NOISF2= 0
##$NSP= 0
##$NTH_PI= 0
##$NZP= 0
##$OFFSET= 14.96187
##$PC= 1
##$PHC0= 4.11438
##$PHC1= 0
##$PH_mod= 1
##$PKNL= yes
##$PPARMOD= 0
##$PPDIAG= 0
##$PPIPTYP= 0
##$PPMPNUM= 2147483647
##$PPRESOL= 1
##$PSCAL= 4
##$PSIGN= 0
##$PYNMP= <proc.py>
##$REVERSE= no
##$SF= 400.020009289204
##$SI= 131072
##$SIGF1= 0
##$SIGF2= 0
##$SINO= 400
##$SIOLD= 131072
##$SPECTYP= <>
##$SREGLST= <1H.CDCl3>
##$SSB= 0
##$STSI= 131072
##$STSR= 0
##$SW_p= 8223.68421052631
##$SYMM= 0
##$S_DEV= 0
##$TDeff= 65536
##$TDoff= 0
##$TI= <>
##$TILT= no
##$TM1= 0
##$TM2= 0
##$TOPLEV= 0
##$USERP1= <user>
##$USERP2= <user>
##$USERP3= <user>
##$USERP4= <user>
##$USERP5= <user>
##$WDW= 1
##$XDIM= 131072
##$YMAX_p= 435776142
##$YMIN_p= -21390
##$CURPLOT= <Network HP LaserJet P1505>
##$CURPRIN= <$Network HP LaserJet P1505>
##$DFORMAT= <normdp>
##$LAYOUT= <+/1D_H.xwp>
##$LFORMAT= <normlp>
##$PFORMAT= <normpl>
##$SURQMSG= 1
$$ End of Bruker specific parameters
$$ ---------------------------------
##NTUPLES= NMR SPECTRUM
##VAR_NAME=  FREQUENCY,     SPECTRUM/REAL,   SPECTRUM/IMAG
##SYMBOL=    X,             R,               I
##VAR_TYPE=  INDEPENDENT,   DEPENDENT,       DEPENDENT
##VAR_FORM=  AFFN,          ASDF,            ASDF
##VAR_DIM=   131072,        131072,          131072
##UNITS=     HZ,            ARBITRARY UNITS, ARBITRARY UNITS
##FACTOR=    0.0627417313425164, 1,          1
##FIRST=     8223.62146879497, 4762,         -63610
##LAST=      0,             5362,            -62696
##MIN=       0,             -21390,          0
##MAX=       8223.62146879497, 435776142,    0
$$ Real data points
##PAGE= N=1
##DATA TABLE= (X++(R..R)), XYDATA
$$ [...]
63555E46882Q877J0533J2551J4326J5793J7481J9657K1974K3985K5676K7316K8914
63543G73965K9886K9282K6511K1957J6796J2098Q202N075K935K273L257N378P737
63530I45352R568J0536J0587R597P188L010k813r549j6189k1831k5964k8614l0198
63517H60680l0975l0756k9356k7179k4911k2711k0244j7533j5142j3388j1907
63506F16578j0187q106n785l490j870j604k418l137l081k750k680k483j756j172
63492E66059j576k493k602j514j09Q55J494K137K862L817N256P040Q691J0068
63478E99985J1378J2517J3086J3103J2957J2452J0697P272K948j141m533p441
63466F83280j0129j2674j4892j6333j6642j6100j5424j4930j4303j3219j1762
$$ plain form
63555 546882 555759 566292 578843 593169 608962 626443 646100 668074 692059 717735 745051 773965
63543 773965 803851 833133 859644 881601 898397 910495 918697 923772 926707 928980 932237 937615 945352
63530 945352 954920 965456 976043 985640 992828 995838 993025 983476 967287 945456 919492 890878 860680
63517 860680 829705 798949 769593 742414 717503 694792 674548 657015 641873 628485 616578
63506 616578 606391 598285 592500 589010 587140 585536 583118 579981 576900 574150 571470 568987 567231 566059
63492 566059 564483 561990 559388 557874 557765 558620 560114 562251 565113 568930 574186 581226 589917 599985
63478 599985 611363 623880 636966 650069 663026 675478 686175 693447 696395 695254 690721 683280
63466 683280 673151 660477 645585 629252 612610 596510 581086 566156 551853 538634 526872
63455E26872j0068q169o314m935m060l236k277j531j252j176j076j167j620k104
63441D77887k185j840j267n24L65J322K458M013N845P348Q182Q690R374J0331
63427E29999J1430J2577J3596J4287J4900J6041J7838J9779K1654K3991K7134
63416G23226L0441L2991L4501L4950L3827L0492K4943J7676R287Q46n876r616
63404I57688j0875j1168j1187j0588r388q528q891j0527j3140j6455j9924k2673
63392H04344k4226k4803k4764k4173k3088k1694j9937j7551j4721j2208j0491
63381E86688r272q093o937n801m250k045J55J431J808K244L420N056O494P494
63367E78392Q222Q904R740J0925J2481J4176J5743J7122J8375J9660K1344K3874
$$ plain form
63455 526872 516804 508635 502321 497386 493326 490090 487813 486282 485030 483854 482778 481611 479991 477887
63441 477887 475702 473862 472595 472071 472436 473758 476216 480229 486074 493422 501604 510294 519668 529999
63427 529999 541429 554006 567602 581889 596789 612830 630668 650447 672101 696092 723226
63416 723226 753667 786658 821159 856109 889936 920428 945371 963047 972334 973180 967304 957688
63404 957688 946813 935645 924458 913870 904482 895954 887063 876536 863396 846941 827017 804344
63392 804344 780118 755315 730551 706378 683290 661596 641659 624108 609387 597179 586688
63381 586688 577416 569323 562386 556585 552335 550290 550445 551876 553684 555928 559348 564404 570898 578392
63367 578392 586614 595518 605258 616183 628664 642840 658583 675705 694080 713740 735084 758958
63355G58958K7162L0193L1683L1107K8773K4947J9443J2381M872j608o372r666
63343I51873j1840j2864j2744j1875j0850j0194j0394j1784j4248j7266k0290
63332H07524k2864k4471k4807k4306k3797k3400k2378k0407j8341j7146j6566
63321E69041j5598j3933j2175j0801r646q469p301o164n016m097l759l836l718
63308D64528l260l040l471m129m335m060l810l936m379m930n356n395m967m332
63294D05128l887l774l845l877l750l476l134k785k395k004j806j885j965j754
63280C64791j461j547j886j782j034l91n65j261j694j712j711j804j707j401j273
63265C43562j482j799k096k516l006l146k682j868j086m45R4N23P70O80L3j020
$$ plain form
63355 758958 786120 816313 847996 879103 907876 932823 952266 964647 969519 967911 961539 951873
63343 951873 940033 927169 914425 902550 891700 881506 871112 859328 845080 827814 807524
63332 807524 784660 760189 735382 711076 687279 663879 641501 621094 602753 585607 569041
63321 569041 553443 539510 527335 516534 506888 498419 491118 484954 479938 475841 472082 468246 464528
63308 464528 461268 458228 454757 450628 446293 442233 438423 434487 430108 425178 419822 414427 409460 405128
63294 405128 401241 397467 393622 389745 385995 382519 379385 376600 374205 372201 370395 368510 366545 364791
63280 364791 363330 361783 359897 358115 357081 356690 356125 354864 353170 351458 349747 347943 346236 344835 343562
63265 343562 342080 340281 338185 335669 332663 329517 326835 324967 323881 323436 323530 324053 324823 325503 325536 324516
63249C24516j618r42N96J618J499J087J307J822J749J116P54J040J593J970J991
63234C40098J506O26%J70P52R46P30O78Q00N34p8k66J36L11k54j011j277j069
63216C43332n67K77J059Q53m14j453j294o42n71p15j5J346K116J850J266Q38K94
63199C47560l83o17j96M01Q58J378J965K112J607R94R55J622K644L485L671L281
63183C71337L063L533M200M379M403N058O088O518O318O425O990P073O471O316
63169D48172P154P807P098N580M547M256M199M221M286L833K509R50k28j562l747
63154D99075o136p533q062q826r936j0360r769r126r161r446r378r030q592p822
63140C75898o620n375m385l482k646k306k624l058l112k978l001l033k849k737
$$ plain form
63249 324516 322898 321956 322552 324170 325669 326756 328063 329885 331634 332750 333504 334544 336137 338107 340098
63234 340098 341604 342230 342230 342400 343152 344098 344828 345506 346306 346840 346762 346496 346632 346943 346689 345678 344401 343332
63216 343332 342765 343042 344101 344954 344540 343087 341793 341151 340580 339865 339850 341196 343312 345162 346428 347266 347560
63199 347560 347177 346560 346364 346765 347623 349001 350966 353078 354685 355679 356634 358256 360900 364385 368056 371337
63183 371337 374400 377933 382133 386512 390915 395973 402061 408579 414897 421322 428312 435385 441856 448172
63169 448172 455326 463133 470231 475811 480358 484614 488813 493034 497320 501153 503662 504612 504384 502822 499075
63154 499075 492939 485406 477344 468518 458582 448222 438453 429327 420166 410720 401342 392312 383720 375898
63140 375898 369278 363903 359518 356036 353390 351084 348460 345402 342290 339312 336311 333278 330429 327692
63126C27692l061l490l353k570j722j190q01l99k33n07r37j081r39q43q99r39
63110C04728j045j544k314k600k048j418j618k267k141j006J2J70J52P98J720
63095B89579K003J679J495J667J874K213L132M441N348N613N855O534P421Q278
63081C47132R282J0385J1004J0787J0238J0092J0386J0522R942Q457O193L581
63069D58001J155r34k995n216p260q778r961j1212j2404j3009j2931j2748j2915
63056C48793j3050j2401j0854r118p839p000o365o111o450o810o173m434k816
63043B49372k466l068l342k669j669j218j408j609j261m68J62K38M7J41N55Q42
63027B32179Q98J141J697K006J715J353J525J905J780J215Q96J034J220J284J484
$$ plain form
63126 327692 324631 321141 317788 315218 313496 312306 311505 311106 310873 310366 309429 308348 307409 306566 305667 304728
63110 304728 303683 302139 299825 297225 295177 293759 292141 289874 287733 286727 286739 286909 287061 287859 289579
63095 289579 291582 293261 294756 296423 298297 300510 303642 308083 313431 319044 324899 331433 338854 347132
63081 347132 356414 366799 377803 388590 398828 408920 419306 429828 439770 448227 454420 458001
63069 458001 459156 458222 455227 450011 442751 433973 424012 412800 400396 387387 374456 361708 348793
63056 348793 335743 323342 312488 303370 295531 288531 282166 276055 269605 262795 256622 252188 249372
63043 249372 246906 243838 240496 237827 236158 234940 233532 231923 230662 230194 230356 230594 230641 230782 231337 232179
63027 232179 233077 234218 235915 237921 239636 240989 242514 244419 246199 247414 248310 249344 250564 251848 253332
63012B53332J799J819J506J401J903K833L875M958O003O776P144P135O794O406
62998C13684O689Q180J0307J1800J2167J2162J2572J3207J3464J3281J3013J2806
62986D53332J2572J2398J2471J2682J2635J2049J0985R671Q243O662M774K562
62974E71036K21k095m489p112r834j2348j4492j6302j7797j8928j9619j9680j8964
62961D09597j7767j6701j5901j4809j3199j1776j1109j0541r066p028n754n660
62949B70286n756n183m144l139k311j926k518l973n198n268m334l072j929j288
62935B20247j584k595l232k711j537p75p38r12q13m23l7j24r26j904j992q11P44
62918A99877J550J489J231J193J209R36K11p73j419j245o26m94j078j554j275
$$ plain form
63012 253332 255131 256950 258456 259857 261760 264593 268468 273426 279429 286205 293349 300484 307278 313684
62998 313684 320373 328553 338860 350660 362827 374989 387561 400768 414232 427513 440526 453332
62986 453332 465904 478302 490773 503455 516090 528139 539124 548795 557038 563700 568474 571036
62974 571036 571257 569162 564673 557561 547727 535379 520887 504585 486788 467860 448241 428561 409597
62961 409597 391830 375129 359228 344419 331220 319444 308335 297794 288728 281700 275946 270286
62949 270286 264530 259347 255203 252064 249753 247827 245309 241336 236138 230870 226536 223464 221535 220247
62935 220247 218663 216068 212836 210125 208588 207813 207075 206163 205350 204927 204890 204766 203840 201936 199944 199133 199877
62918 199877 201427 202916 204147 205340 206549 207485 207696 206923 205504 204259 203633 203139 202061 200507 199232
62903A99232o00j5O81J607K030J365L96L60J235J927J995K023K368K690K831L189
62887B23314L913M599N053N620O478P294P888Q569R462J0183J0546J0883J1195
62874C24997J0676Q794O358M700M050L414J961k26k672n058p057q314q888r262
62860C23473r620r615r126q726q844q985q402p268o398n963n423m688m344m450
62846B21621m159l122k328k683l517l489k462j436r20o05m96j067k150k699k117
62831A88371r58OO32J032J154J113J255J502J290N34l5R7N36O68M19n0p00j212
62813A95654r80k7O70L90m31r91j178j277j308j276j464j823j694q62k02n35j385
62796A81281j804j742j677j445o27L18N16J14R8P40J316J341J065O51m9p66p91
$$ plain form
62903 199232 198632 198617 199298 200905 202935 204300 204696 205056 206291 208218 210213 212236 214604 217294 220125 223314
62887 223314 227227 231826 236879 242499 248977 256271 264159 272728 282190 292373 302919 313802 324997
62874 324997 335673 344467 350825 355525 359575 362989 364950 364724 362052 356994 349937 341623 332735 323473
62860 323473 313853 304238 295112 286386 277542 268557 260155 252887 246489 240526 235103 230415 226071 221621
62846 221621 217462 214340 212012 209329 205812 202323 199861 198425 197505 196900 196404 195337 193187 190488 188371
62831 188371 187413 187419 188051 189083 190237 191350 192605 194107 195397 195931 195896 195993 196529 197197 197616 197566 196866 195654
62813 195654 194674 194647 195317 195707 195276 194285 193107 191830 190522 189246 187782 185959 184265 183403 183201 182666 181281
62796 181281 179477 177735 176058 174613 173986 174304 174820 174934 175032 175772 177088 178429 179494 180145 180096 179330 178539
62779A78539l0P35R00O79N19N44Q00J323J847K028K031K235K363J850J109J359
62763A98831K817M113M078L220K737K849K977K945L041L174K905K231J668J514
62749B39100J574J544J221L73j021k436l138l061k923l322m029m351l971l187
62735B12373k510k256k428k821l147l212l035k715k289j732j160p76n72k71J98
62720A83647M60K17j44P5Q90J543J484R89O57P73J400K590M076N147N292M799
62704B13895M352M314M621N136N676O034O289O878Q023R424J0785J2276J4025
62691C11728J5664J6863J7926J9218K0459K1211K1703K2354K2785K2183K0498
62680E32592J8455J6414J4035J1054P577L595j021n913j0367j4153j7473k0057
$$ plain form
62779 178539 178509 179244 180144 180823 181342 181886 182686 184009 185856 187884 189915 192150 194513 196363 197472 198831
62763 198831 201648 205761 209839 213059 215796 218645 221622 224567 227608 230782 233687 235918 237586 239100
62749 239100 240674 242218 243439 243812 242791 240355 237217 234156 231233 227911 223882 219531 215560 212373
62735 212373 209863 207607 205179 202358 199211 195999 192964 190249 187960 186228 185068 184292 183720 183449 183647
62720 183647 184107 184324 184180 184255 185145 186688 188172 189161 189818 190591 191991 194581 198657 203804 209096 213895
62704 213895 218247 222561 227182 232318 237994 244028 250317 257195 265218 274642 285427 297703 311728
62691 311728 327392 344255 362181 381399 401858 423069 444772 467126 489911 512094 532592
62680 532592 551047 567461 581496 592550 600127 603722 602701 596788 586421 572268 554795 534738
62668E34738k1230k1136k0962k1463k2008k1557k0012j8083j6353j4976j3882
62657C23076j2827j1580j0328r568r252q582p109n577n045n410n453m314k474
62644B25557j147r58j374j449r58o08r81j631j630q72k12k45o33p96p45q31j076
62627B09411j205j080q45p40r44j371j567j072m7Q00R67O30K07j53m79p28q11
62610B00973o99l84M6K88J45o4J58O84Q37L89m2J00N51P17N24L25L03M10O78J184
62590B07123J787K167K177J978J869K027K261K081J182r3j010j128n44L59J043
62575B23279R35j7r68r57q8P20J043J253J434J003j47j082r88k55K44L22K33j03
62557B25861p89j330j167o67o74j230j508j020j65N46J121J718K157K114J568
$$ plain form
62668 534738 513508 492372 471410 449947 427939 406382 386370 368287 351934 336958 323076
62657 323076 310249 298669 288341 278773 269521 260939 253830 248253 243208 237798 232345 228031 225557
62644 225557 224410 223452 222078 220629 219671 219063 218082 216451 214821 213949 213737 213492 212859 212063 211318 210487 209411
62627 209411 208206 207126 206281 205541 204597 203226 201659 200587 200540 201340 202307 202937 203144 202991 202512 201784 200973
62610 200973 200274 199890 199936 200224 200369 200305 200463 201147 201984 202373 202331 202431 202982 203699 204223 204548 204851 205261 205939 207123
62590 207123 208910 211077 213254 215232 217101 219128 221389 223470 224652 224559 223549 222421 221877 222236 223279
62575 223279 224214 224197 223229 222272 222184 222904 223947 225200 226634 227637 227490 226408 225420 225165 225409 225731 225964 225861
62557 225861 225072 223742 222575 221908 221234 220004 218496 217476 217311 217857 218978 220696 222853 224967 226535
62542B26535Q58M43O20J233J670J397N92J1J86R10J530J675J563J672K124K576
62526B45595K772K948L353L669L408K889L012L924M616M345L759L935M813N402
62512B98440N304N214N891P292Q823R941J0388J0355J0542J1588J3226J4378J4319
62499D25701J3452J2673J2255J1669J0397Q514O403M161J585j345m228o579q230
62486D86428r227r639r710r962j0625j1081j0317q145n576l851l387l752m238
62473C86918m304l856l270k936k716k216j564j340j546j410n19M58P58O81J053
62458C64191J922K553K559K330K310K457K525K400K085J620J193J065J360K028
62444C92598K891L594L742L362L062L362M005M221L672K842K513L017L953M513
$$ plain form
62542 226535 227393 227836 228456 229689 231359 232756 233348 233359 233545 234455 235985 237660 239223 240895 243019 245595
62526 245595 248367 251315 254668 258337 261745 264634 267646 271570 276186 280531 284290 288225 293038 298440
62512 298440 303744 308958 314849 322141 330964 340905 351293 361648 372190 383778 397004 411382 425701
62499 425701 439153 451826 464081 475750 486147 494661 501064 505225 506810 505465 501237 494658 486428
62486 486428 477201 467562 457852 447890 437265 426184 415867 407722 402146 398295 394908 391156 386918
62473 386918 382614 378758 375488 372552 369836 367620 366056 364716 363170 361760 361241 361699 362457 363138 364191
62458 364191 366113 368666 371225 373555 375865 378322 380847 383247 385332 386952 388145 389210 390570 392598
62444 392598 395489 399083 402825 406187 409249 412611 416616 420837 424509 427351 429864 432881 436834 441347
62430D41347M196L305K593K404K469K618L104L964M636M672M466M647N118N279
62416D94818N026M804M854M999N221N757O564P242P607P876Q145Q213Q089Q164
62402E87379Q603Q980Q914Q780R347J0785J2424J3529J4075J4584J5362J6133
62390G28895J6494J6421J6153J5776J5280J4976J5282J6067J6575J6375J5899
62379I04193J5772J5943J5905J5505J5019J4716J4763J5423J6797J8402J9519
62368A081957K0055K0728K2304K4854K7867L0755L3245L5501L8039M1411M5795
62357A422511N0818N5746N9978O3535O6979P0582P3604P4741P3256O9271O2994
62346B144015N4489M4483L4581K5985J8390J0807L097l996j0071j5564k1042k6616
$$ plain form
62430 441347 445543 448848 451441 453845 456314 458932 462036 466000 470636 475308 479774 484421 489539 494818
62416 494818 499844 504648 509502 514501 519722 525479 532043 539285 546892 554768 562913 571126 579215 587379
62402 587379 595982 604962 613876 622656 632003 642788 655212 668741 682816 697400 712762 728895
62390 728895 745389 761810 777963 793739 809019 823995 839277 855344 871919 888294 904193
62379 904193 919965 935908 951813 967318 982337 997053 1011816 1027239 1044036 1062438 1081957
62368 1081957 1102012 1122740 1145044 1169898 1197765 1228520 1261765 1297266 1335305 1376716 1422511
62357 1422511 1473329 1529075 1589053 1652588 1719567 1790149 1863753 1938494 2011750 2081021 2144015
62346 2144015 2198504 2242987 2277568 2303553 2321943 2332750 2335847 2331851 2321780 2306216 2285174 2258558
62334B258558l2013l6692l9897m1110m0567l9063l7223l5260l3166l0789k7880
62323A864898k4579k1641j9636j8106j6084j3328j0426p783n256k801p39Q54K399
62310A727772M132N730O907P936R240J0774J2118J2975J3365J3494J3630J3924
62298A851997J4317J4749J5306J5940J6262J5972J5362J4828J4087J2560J0550
62287B011930R182Q889Q774Q000P086P046P774Q142P623O907O805P269P857Q527
62273B121811R464J0482J1212J1754J2562J3659J4573J5299J6645J9125K1921
62262B278507K3801K4823K6337K9136L2512L5530L8495M2477M7734N3244N7634
62251B690230O0058O0286N8272N3814M6453L5943K2879Q668n244j7849k8347l6206
$$ plain form
62334 2258558 2226545 2189853 2149956 2108846 2068279 2029216 1991993 1956733 1923567 1892778 1864898
62323 1864898 1840319 1818678 1799042 1780936 1764852 1751524 1741098 1733315 1728059 1725258 1724519 1725373 1727772
62310 1727772 1731904 1737634 1744541 1752477 1761717 1772491 1784609 1797584 1810949 1824443 1838073 1851997
62298 1851997 1866314 1881063 1896369 1912309 1928571 1944543 1959905 1974733 1988820 2001380 2011930
62287 2011930 2021112 2030001 2038775 2046775 2053861 2060907 2068681 2076823 2084446 2091353 2098158 2105427 2113284 2121811
62273 2121811 2131275 2141757 2152969 2164723 2177285 2190944 2205517 2220816 2237461 2256586 2278507
62262 2278507 2302308 2327131 2353468 2382604 2415116 2450646 2489141 2531618 2579352 2632596 2690230
62251 2690230 2750288 2810574 2868846 2922660 2969113 3005056 3027935 3036603 3031359 3013510 2985163 2948957
62239B948957m1756m6216n0607n4964n8816o1849o3676o3767o2186n9907n7681
62228B327532n5152n1763m7855m4103m0522l7048l4446l3404l3068l1829k9463
62217A888879k7207k5810k4816k3810k2980k2237k1030j9481j8457j8138j7649
62206A647264j6653j5992j6092j5914j4478j2418j0974j0160r078p445n708m012
62194A508340k154l80P63J485K728M934P467R493J0913J2173J3476J4569J5166
62181A598973J5232J4684J2901Q984K830m284j0694j5770j9790k2638k3481k1989
62169A534958j8995j5421j1204n857M01O697J2429J7551K2132K5947K8394K8567
62157A625599K5721J9941J2184L589m978j2667j8775k3503k7950l2861l7781m1897
$$ plain form
62239 2948957 2907201 2860985 2810378 2755414 2696598 2634749 2571073 2507306 2445120 2385213 2327532
62228 2327532 2272380 2220617 2172762 2128659 2088137 2051089 2016643 1983239 1950171 1918342 1888879
62217 1888879 1861672 1835862 1811046 1787236 1764256 1742019 1720989 1701508 1683051 1664913 1647264
62206 1647264 1630611 1614619 1598527 1582613 1568135 1555717 1544743 1534583 1525505 1518060 1512352 1508340
62194 1508340 1506186 1505806 1506569 1508054 1510782 1515716 1523183 1532676 1543589 1555762 1569238 1583807 1598973
62181 1598973 1614205 1628889 1641790 1650774 1653604 1649320 1638626 1622856 1603066 1580428 1556947 1534958
62169 1534958 1515963 1500542 1489338 1483481 1483882 1490579 1503008 1520559 1542691 1568638 1597032 1625599
62157 1625599 1651320 1671261 1683445 1687034 1682056 1669389 1650614 1627111 1599161 1566300 1528519 1486622
62145A486622m5162m7930n0009n0820n0328m9093m7469m5374m2716l9589l6102
62134I82030l2487k9302k6962k5179k3342k1364j9662j8354j7052j5560j4230
62123G38536j3399j2877j2207j1155r710p851n701l756k626k361k208j384m6P61
62109F54016L10r59k081k693l114l544l921m414n323o253o258n118l783l054k456
62094F01355j100R55K950M704O727R220J1750J4051J6495J9589K3440K7834L2486
62081G70456L7147M1700M6045M9445N0216M6954M0420L3652K9594K8768K9675
62070A204072L0998L2530L3794L2757K7121J6952N308m147r792j2199j2456j1236
62058A333702r186p325o605p511j0128j4145j8713k2780k5856k8213l0330l2537
$$ plain form
62145 1486622 1441460 1393530 1343521 1292701 1242373 1193280 1145811 1100437 1057721 1018132 982030
62134 982030 949543 920241 893279 868100 844758 823394 803732 785378 768326 752766 738536
62123 738536 725137 712260 700053 688898 679188 671337 665636 661880 659254 656893 654685 653301 653255 654016
62109 654016 654326 653367 651286 648593 645479 641935 638014 633600 628277 622024 615766 610648 606865 603811 601355
62094 601355 600255 601210 604160 608864 615591 624811 636561 650612 667107 686696 710136 737970 770456
62081 770456 807603 849303 895348 944793 995009 1041963 1082383 1116035 1145629 1174397 1204072
62070 1204072 1235070 1267600 1301394 1334151 1361272 1378224 1383532 1379385 1369593 1357394 1344938 1333702
62058 1333702 1324516 1317191 1310586 1303075 1292947 1278802 1260089 1237309 1211453 1183240 1152910 1120373
62046A120373l5135l8180m1039m2758m3081m2535m1362l9089l5546l1595k8263
62035G01790k5639k3125k0354j7327j4088j0783p770n272l167j430l20K43Q07
62022E73565J333P09j821n261p851r131r968j0735j0713r561q170p418o812n098
62008D83068j899J936N430Q480J1711J5620J9983K4020K7100K9181L0425L0541
61996F85596K8797K4793J8996J2402N817m22o258j1638j6487k0754k4388k7240
61984F69214k9089k9818k9452k8044k5732k3014k0590j8633j6440j3304r578o439
61972D19081m607l764l172k353j141K86J345J580J367J569K409L355M190N421
61958D25566P234Q916R868J0505J1580J3065J4405J5524J6883J8784K1117K3734
$$ plain form
62046 1120373 1085238 1047058 1006019 963261 920180 877645 836283 797194 761648 730053 701790
62035 701790 676151 653026 632672 615345 601257 590474 582704 577432 574265 572835 572515 572758 573565
62022 573565 574898 575607 573786 568525 560674 551543 541575 530840 520127 510566 502396 494978 488166 483068
62008 483068 481169 483105 488535 497015 508726 524346 544329 568349 595449 624630 655055 685596
61996 685596 714393 739186 758182 770584 776401 775979 769721 758083 741596 720842 696454 669214
61984 669214 640125 610307 580855 552811 527079 504065 483475 464842 448402 435098 425520 419081
61972 419081 414474 410710 407538 405185 404044 404330 405675 407255 408622 410191 412600 415955 420145 425566
61958 425566 432800 441716 451584 462089 473669 486734 501139 516663 533546 552330 573447 597181
61946E97181K6686L0130L4173L8640M2986M6841N0623N4967N9539O3155O5220
61935A110141O6198O6405O5475O3526O1707O0655N9369N6552N2210M6949M0505
61924A749692L2273K2707J2942L462n589j3164j7799j9218j8180j4905q875l25
61912A723021R464J9587L0148M1193N2087O2212P1298P8627Q2886Q3375Q0760
61901B334658P6264P0809O5273O0804N8302N7894N9208O1715O4528O6335O5830
61890C041620O1984N3793M0226K0743m154l2699o1942q8547j10302j26918j38926
61879B654878j46172j48083j45124j38930j30890j21516j11153j00391q9539p8644
61869A444436o8261n9271n1563m3828l5210k6470j8853j2383n969J130Q610J5755
$$ plain form
61946 597181 623867 653997 688170 726810 769796 816637 867260 922227 981766 1044921 1110141
61935 1110141 1176339 1242744 1308219 1371745 1433452 1494107 1553476 1610028 1662238 1709187 1749692
61924 1749692 1781965 1804672 1817614 1821076 1815487 1802323 1784524 1765306 1747126 1732221 1723346 1723021
61912 1723021 1732485 1752072 1782220 1823413 1875500 1937712 2009010 2087637 2170523 2253898 2334658
61901 2334658 2410922 2481731 2547004 2607808 2666110 2724004 2783212 2844927 2909455 2975790 3041620
61890 3041620 3103604 3157397 3197623 3218366 3214212 3181513 3119571 3031024 2920722 2793804 2654878
61879 2654878 2508706 2360623 2215499 2076569 1945679 1824163 1713010 1612619 1523080 1444436
61869 1444436 1376175 1316904 1265341 1221513 1186303 1159833 1140980 1128597 1122628 1123758 1132368 1148123
61857A148123K2367K8961L6220M4311N2840O1473P0152P8489Q5551R0891R5204
61846A814582R9054J01360J00280R5329Q7413P6881O3067M6086K7671R613p421
61835B513915k2802l4879m2096m4389m2622l7225k8405j7188n247O179J6523K5147
61823B286911L1015L3040L0492K3215J1818k565j8838l6063n3019o8240q0789
61812B156977r0505r7302j00838j01170r9022r5021q9269q2152p4828o8263o2274
61801A196333n6181m9972m4218l9176l4601l0184k5732k1175j6803j3174j0384
61790H54733p817m969k045O72L485O730J0094J3160J6266K0019K4280K8403L2392
61777I95403L7062M2988M9944N7482O5558P4432Q4336R5370J07535J20755J34954
$$ plain form
61857 1148123 1170490 1199451 1235671 1279982 1332822 1394295 1464447 1542936 1628487 1719378 1814582
61846 1814582 1913636 2014996 2115276 2210605 2298018 2374899 2437966 2484052 2511723 2521336 2513915
61835 2513915 2491113 2456234 2414138 2369749 2327127 2289902 2261497 2244309 2239062 2245241 2261764 2286911
61823 2286911 2317926 2350966 2381458 2404673 2416491 2413926 2395088 2359025 2306006 2237766 2156977
61812 2156977 2066472 1969170 1868332 1767162 1668140 1573119 1483850 1401698 1326870 1258607 1196333
61801 1196333 1140152 1090180 1045962 1006786 972185 942001 916269 895094 878291 865117 854733
61790 854733 846916 841947 839902 840574 844059 850789 860883 874043 890309 910328 934608 963011 995403
61777 995403 1032465 1075453 1125397 1182879 1248437 1322869 1407205 1502575 1610110 1730865 1865819
61766A865819J50037J65739J81546J96631K09488K17611K18054K08517J87765
61757C601207J55262J11423N8660J545n4731j05910j48835j81264k02385k13168
61747C021804k15451k10890k01046j87892j73377j58592j43867j29446j15718
61738A485525j03035r1743q2026p3478o5229n6969m9319m2835l7277l2309k8184
61727H23121k5019k2025j8400j4413j0759p372l961j123K86O44J074J527P38j793
61713G22525n128q573j2705j7941k3099k6445k7601k7615k7393k6829k5394k2955
61701D70847j9964j7092j4786j3029j1530j0128q879p801o832n992n399n007m561
61688C39847l820k714j372k41P2n85j577k151k390k977m091n046n185m656m063
$$ plain form
61766 1865819 2015856 2181595 2363141 2559772 2769260 2986871 3204925 3413442 3601207
61757 3601207 3756469 3867892 3926552 3928097 3873366 3767456 3618621 3437357 3234972 3021804
61747 3021804 2806353 2595463 2394417 2206525 2033148 1874556 1730689 1601243 1485525
61738 1485525 1382490 1290747 1208721 1135243 1070014 1013045 963726 920891 883614 851305 823121
61727 823121 798102 776077 757677 743264 732505 725133 721172 720049 720335 720979 722053 723580 724318 722525
61713 722525 717397 708824 696119 678178 655079 628634 601033 573418 546025 519196 493802 470847
61701 470847 450883 433791 419005 405976 394446 384318 375439 367638 360806 354814 349415 344408 339847
61688 339847 336027 333313 331941 331700 331772 331187 329610 327459 325069 322092 318001 312955 307770 303114 299051
61673B99051l783l819m002m049l620k635j450n52j12M1O8j21o02r55l31J598L896
61656B78623N079M779M199M589N798O833P397Q066R154J0270J1091J1885J2956
61643C80719J4116J4947J5201J4689J3109J0396P041L811J159j004k992m863o255
61630D60074o740o371n647m800l444j190J623M327O825R519J2340J4417J5015
61617D95948J4320J3031J1372Q858M906m92o675j2670j7584k0841k2235k1996
61605D45942k0793j9368j8007j6503j4684j2791j1134r629p982o103m208k577
61593C02163j454r74r17p32p6P85J367J579J701J940K300K745L220L641M093M798
61577C26179N672O199O131O021O618P969R575J1204J2956J4696J6071J7139J8343
$$ plain form
61673 299051 295268 291449 287447 283398 279778 277143 275693 275141 275029 275070 275138 275017 274415 273460 273129 274727 278623
61656 278623 283702 288481 292680 297269 303067 309900 317297 325363 334517 344787 355878 367763 380719
61643 380719 394835 409782 424983 439672 452781 463177 470218 474029 475188 474184 471192 466329 460074
61630 460074 453334 446963 441316 436516 433072 431882 433505 437832 444657 454176 466516 480933 495948
61617 495948 510268 523299 534671 543529 548435 547943 541268 528598 511014 490173 467938 445942
61605 445942 425149 405781 387774 371271 356587 343796 332662 323033 315051 308948 304740 302163
61593 302163 300709 299735 298818 298086 298010 298795 300162 301741 303442 305382 307682 310427 313647 317288 321381 326179
61577 326179 331851 338050 344181 350202 356820 364789 374364 385568 398524 413220 429291 446430 464773
61564D64773J9668K0294J9365J6823J3312R548N894K439o63k982m034l892l310
61551E57235l044l163l244k986k387j556p43l42m78p67p94o22m08J64J499L260
61535E41624M500M611L660J915l63k788m994o946q646r630r341p983o388m999
61521D94232l500j582N92K718M685O409P928R728J2374J5618J8483K0586K2787
61508F11058K6117L0515L5023L8938M2280M5429M8728N2372N6241N9852O2573
61497A109126O3778O2806N9019N2256M3121L2634K1571J0194j505j3304k4403
61486A415293l3490l9323m1428m0261l6723l1659k5673j9190j2513n819P84P108
61474A137106J2670J6685J8531J8283J6464J3177P868L16q427j6507k2587k6372
$$ plain form
61564 464773 484441 504735 524100 540923 554235 563783 569677 572116 571453 568471 564437 560545 557235
61551 557235 554191 551028 547784 544798 542411 540855 540112 539770 539292 538525 537731 537109 536701 536865 538364 541624
61535 541624 546124 550735 554395 556310 555947 553159 548165 541219 532573 522943 513602 505619 499231 494232
61521 494232 490732 489150 489742 492460 497145 503554 511482 521210 533584 549202 567685 588271 611058
61508 611058 637175 667690 702713 741651 783931 829360 878088 930460 986701 1046553 1109126
61497 1109126 1172904 1235710 1294729 1346985 1390106 1422740 1444311 1454505 1453000 1439696 1415293
61486 1415293 1381803 1342480 1301052 1260791 1224068 1192409 1166736 1147546 1135033 1129214 1129998 1137106
61474 1137106 1149776 1166461 1184992 1203275 1219739 1232916 1240784 1241100 1232673 1216166 1193579 1167207
61462A167207k8045k7738k5713k2619j9288j6167j3047r423n301j565Q16J950
61450A001067L014M998P937J1453J5395J9638K3842K7827L1680L5086L7070L6849
61438A255856L4366K9673K2691J4206O127k11n311j0046j3765j5176j4465j2924
61426A291021j0848p476k986J243M612Q000J1852J4952J5704J3546Q522P14r060
61413A339796j8878k6929l2598l5945l7038l6356l4940l3379l1266k8353k5454
61402I98660k3433k1947k0081j7672j5183j2698r949p072m479k058P98M282P878
61389H77046J1020J3772J6740K0530K5188L0129L4705L8884M3073M7384N1448
61378A209919N4908N7466N8458N7040N3071M7198L9887L1061K0908J0337K50r028
$$ plain form
61462 1167207 1139162 1111424 1085711 1063092 1043804 1027637 1014590 1005167 999866 998301 999117 1001067
61450 1001067 1004081 1009079 1017016 1028469 1043864 1063502 1087344 1115171 1146851 1181937 1219007 1255856
61438 1255856 1290222 1319895 1342586 1356792 1362919 1362708 1357397 1347351 1333586 1318410 1303945 1291021
61426 1291021 1280173 1272697 1269711 1270954 1275566 1283566 1295418 1310370 1326074 1339620 1348142 1348856 1339796
61413 1339796 1320918 1293989 1261391 1225446 1188408 1152052 1117112 1083733 1052467 1024114 998660
61402 998660 975227 953280 933199 915527 900344 887646 877697 870625 866146 864088 864886 869168 877046
61389 877046 888066 901838 918578 939108 964296 994425 1029130 1068014 1111087 1158471 1209919
61378 1209919 1264827 1322293 1380751 1437791 1490862 1538060 1577947 1609008 1629916 1640253 1640503 1631475
61366A631475j7226k3830k8790l2841l6553l9589m1403m2100m1961m0721l8112
61355A248349l4682l1291k7972k3982j8900j3195p765l199N76M210Q198J2126
61343A112473J4803J5284J3430R590M462p14m728p618j0511j3798j6301j6777
61331A099595j5465j3448j1217q774o478m817l691k723j894j235l77P40J201J44
61317A031561j877l477m141m421m690m760m636m662m732m292l261k150j077N48
61303I83933L020N748Q018R795J1257J1952J0918P635K570l146q457j2783j5889
61290A014571j7559j7694j6619j5007j3254j1258q894o346l805j226J312L315
61278I07536M322M434M200M201M885O407Q472J0618J2819J5311J7806J9548K0437
$$ plain form
61366 1631475 1614249 1590419 1561629 1528788 1492235 1452646 1411243 1369143 1327182 1286461 1248349
61355 1248349 1213667 1182376 1154404 1130422 1111522 1098327 1090562 1087363 1087939 1092149 1100347 1112473
61343 1112473 1127276 1142560 1155990 1165580 1170042 1169328 1164600 1156982 1146471 1132673 1116372 1099595
61331 1099595 1084130 1070682 1059465 1050691 1044213 1039396 1035705 1032982 1031088 1029853 1029476 1030216 1031417 1031561
61317 1031561 1029684 1026207 1022066 1017645 1012955 1008195 1003559 998897 994165 989873 986612 984462 983385 983933
61303 983933 986953 992701 1000719 1010514 1021771 1033723 1044641 1052276 1054846 1051700 1043243 1030460 1014571
61290 1014571 997012 979318 962699 947692 934438 923180 914286 907940 904135 902909 904221 907536
61278 907536 911858 916292 920492 924693 929578 935985 944457 955075 967894 983205 1001011 1020559 1040996
61265A040996K1309K2676K4058K5114K6674K9698L3838L7952M1657M5323M8645
61254A397940N0273M9105M5251L9646L3176K6417J9919J4542J1253J0238J0097
61243A707857Q521L972l675j4049k6683m0034n1249n8080o0546n9975n7176n2465
61231A296418m6815m1463l6548l1181k4880j8036j1061m018K811Q676J2580J3334
61219A119817R772J788q975k0050k9531l6138l8782l7336l3410k9087k5003k0663
61207H52402j6374j3442j2354j2124j1722j1082j0326r071p071m732k498k85K115
61194G43436M672P383J0365J3503J6512J9444K2503K5143K5995K3956J9070J2373
61182I44355N420j10l148l918l617l304l431m193n707p789j0030j2127j3879j5143
$$ plain form
61265 1040996 1062305 1084981 1109039 1134153 1160827 1190525 1224363 1262315 1303972 1349295 1397940
61254 1397940 1448213 1497318 1542569 1582215 1615391 1641808 1661727 1676269 1687522 1697760 1707857
61243 1707857 1716378 1720350 1716675 1702626 1675943 1635909 1584660 1526580 1466034 1406059 1348883 1296418
61231 1296418 1249603 1208140 1171592 1140411 1115531 1097495 1086434 1082416 1085227 1093903 1106483 1119817
61219 1119817 1129589 1131377 1122402 1102352 1072821 1036683 997901 960565 927155 898068 873065 852402
61207 852402 836028 822586 810232 798108 786386 775304 764978 755907 748836 744104 741606 741321 743436
61194 743436 748108 755491 765856 779359 795871 815315 837818 862961 888956 912912 931982 944355
61182 944355 949775 949665 946517 942599 938982 935678 932247 928054 922347 914558 904528 892401 878522 863379
61168H63379j6213j7818k0105k2074k2683k2145k1343k0530j9559j8801j8573
61157F43535j8059j6218j3611j1754j0755r161o465m071l071k519q28K180N550
61144E54753Q558J0770J1330R302M624j768q586j4642j9003k1259k1591k0527
61132D91961j8680j6576j4375j1904r325p385o486n839m366k179l83L87L53j60
61118C95043q39r08K85K140L287L264K762K378K181K413L365M444M674M260M384
61103D33133N365O365P110Q367J0239J1470J1089R493P201L943j53l740n712o619
61089D97551p601q582q620p485n965m793m001l294k645k453l057l999m217l361
61075D27478k406k240k341j830j131j145j407p50N47J183J162J698K821L202K638
$$ plain form
61168 863379 847166 829348 809243 787169 764486 742341 720998 700468 680909 662108 643535
61157 643535 625476 609258 595647 583893 573138 563977 557512 553441 550370 547851 547023 549203 554753
61144 554753 563311 574081 585411 594713 599337 597569 588983 574341 555338 534079 512488 491961
61132 491961 473281 456705 442330 430426 421101 413716 407230 401391 397025 394846 394463 394850 395203 395043
61118 395043 394204 393296 393581 395721 399008 402272 405034 407412 409593 412006 415371 419815 424489 428749 433133
61103 433133 438498 444863 451973 460340 470579 482049 493138 502631 509832 513775 513622 509882 504170 497551
61089 497551 489950 481368 472748 465263 459298 454505 450504 447210 444565 442112 439055 435056 430839 427478
61075 427478 425072 422832 420491 418661 417530 416385 414978 414228 414775 415958 417120 418818 421639 424841 427479
61060D27479K461L056L201K493K202K795K875J775J052J991L473L888L519L466
61046D65726L592L150K331J786J582J624K203L232M078M702N684O623O342N213
61032E17868N204O765P909P462O912P625Q647Q845R020J0024J0943J1061J1544
61019F29829J3161J4486J4458J4680J6837J9780K1530K2276K3074K3542K3262
61008H36915K3521K5104K6383K6099K5898K7309K8610K7872K6799K7963L0376
60997A132849L1645L2660L6021M1477M7059N3182O1316O9885P5834P9180Q1858
60986A742966Q3654Q3925Q5842R3687J07049J22687J40652J62812J86780K07929
60976C017983K26911K48853K76210L09412L53187M13668M90054N78762O85390
$$ plain form
61060 427479 429940 432996 436197 438690 440892 443687 446562 448337 449389 451380 454853 458741 462260 465726
61046 465726 469318 472468 474799 476585 478167 479791 481994 485226 489304 494006 499690 506313 512655 517868
61032 517868 523072 529837 537746 545208 552120 559745 568392 577237 586257 596281 607224 618285 629829
61019 629829 642990 657476 671934 686614 703451 723231 744761 767037 790111 813653 836915
61008 836915 860436 885540 911923 938022 963920 991229 1019839 1047711 1074510 1102473 1132849
60997 1132849 1164494 1197154 1233175 1274652 1321711 1374893 1436209 1506094 1581928 1661108 1742966
60986 1742966 1826620 1910545 1996387 2090074 2197123 2319810 2460462 2623274 2810054 3017983
60976 3017983 3244894 3493747 3769957 4079369 4432556 4846224 5336278 5915040 6600430
60967F600430Q21903R93376J202948J471336J832760K306731K894251L598385
60959B1722120M386950N076392N291684M668135L189378J314683k92159j190295
60951D4166888j334002q99315p5169R09918J655409J674476P31848r13023k653322
60942D3263708l943749m581757m667233m396911l931650l386016k845003k356888
60934A3154501j933461j573320j276978j039604q46930o87451n59999m64537l94020
60925D378201l40079k99209k68633k42530k17130j94372j76148j59461j40927
60916B339712j21776j04676q9628p6549o8222o6751o9792p3447p6263p7840p6567
60905A438201p1917o6397o2201n8158n2687m7201m3704m1256l7974l4479l2393
$$ plain form
60967 6600430 7422333 8415709 9618657 11089993 12922753 15229484 18123735 21722120
60959 21722120 26109070 31185462 36477146 41145281 44334659 45649342 45357183 44166888
60951 44166888 42832886 41933571 41858402 42768320 44423729 46098205 46830053 45917030 43263708
60942 43263708 39319959 34738202 30070969 25674058 21742408 18356392 15511389 13154501
60934 13154501 11221040 9647720 8370742 7331138 6484208 5796757 5236758 4772221 4378201
60925 4378201 4038122 3738913 3470280 3227750 3010620 2816248 2640100 2480639 2339712
60916 2339712 2217936 2113260 2023632 1947083 1878861 1812110 1742318 1668871 1592608 1514768 1438201
60905 1438201 1366284 1299887 1237686 1179528 1126841 1079640 1035936 994680 956706 922227 889834
60894H89834l1015k8562k5340k2950k1464j9854j8164j6936j5591j3588j2010
60883F64360j1862j1953j0725q973q436q724q158o798o196o565o592n790n049
60870E58539m853m756m485m194l811l346l373m033m228l118j645j114j134m88
60856E13961P01J317J204J099J102Q11M89O45Q46L67m19p09p80j352k050k024
60840E15208j631j975l076m111n015o276p455p565o723o014n848n924o431p683
60826D39481q796q437o871n566m907l957k547j789k190k871l124l284l590l506
60812C78046k764j905j330p31P5P39J066J300J500J512J567K013K408J994J037
60797C86527N35N59J57r00j648j554j322j608k136k613l279m032m112l376k872
$$ plain form
60894 889834 858819 830257 804917 781967 760503 740649 722485 705549 689958 676370 664360
60883 664360 652498 640545 629820 620847 612411 603687 595529 588731 582535 575970 569378 563588 558539
60870 558539 553686 548930 544445 540251 536440 533094 529721 525688 521460 518342 516697 515583 514449 513961
60856 513961 514662 515979 517183 518282 519384 520195 520684 521329 522175 522542 522123 521414 520634 519282 517232 515208
60840 515208 513577 511602 508526 504415 499400 493124 485669 478104 471381 465367 459519 453595 447164 439481
60826 439481 430685 422248 415377 409811 404904 400947 398400 396611 394421 391550 388426 385142 381552 378046
60812 378046 375282 373377 372047 371316 371391 372130 373196 374496 375996 377508 379075 381088 383496 385490 386527
60797 386527 387062 387621 387778 386878 385230 383676 382354 380746 378610 375997 372718 368686 364574 361198 358326
60782C58326l373m241m486m139l883l952m148m343m408m133l718l703m055m000
60768C01744l226k463k309k253j591o37j91k79l10j25j09l51m42o4O39J308J670
60751B91011J720J833K433L374L971L927L778M082M552M462L669K657J753Q15
60737C34037l29j530k487k971k878k279j505r93r42j110j041m87L58J090J520
60722C18453J759J911J908J764J707J913K316K844L576M373M763M495L931L512
60708C59225L227K927K756K713K231R37m99j098r31r58j663k678l694m783n657
60693C52055n583m376k876k009j983k538l418m276m641m408l962l616l238k598
60679C02533j779j051o68p95j345j859j892j467q60j48O48J276J677K365L644
$$ plain form
60782 358326 354953 350712 346226 342087 338204 334252 330104 325761 321353 317220 313502 309799 305744 301744
60768 301744 298518 296055 293746 291493 289902 289265 289074 288795 288485 288360 288251 287900 287458 287394 288033 289341 291011
60751 291011 292731 294564 296997 300371 304342 308269 312047 316129 320681 325143 328812 331469 333222 334037
60737 334037 333708 332178 329691 326720 323842 321563 320058 319065 318123 317013 315972 315485 315843 316933 318453
60722 318453 320212 322123 324031 325795 327502 329415 331731 334575 338151 342524 347287 351782 355713 359225
60708 359225 362452 365379 368135 370848 373079 374016 373517 372419 371488 370530 368867 366189 362495 357712 352055
60693 352055 346472 342096 339220 337211 335228 332690 329272 324996 320355 315947 311985 308369 305131 302533
60679 302533 300754 299703 299035 298240 296895 295036 293144 291677 290817 290669 291317 292593 294270 296635 300279
60664C00279M731M576L411K540K640L225L795M415M976M971M425M067M152M031
60650C56234L324K589K300K048J404P44N36M44r4j002j932l007m430n739o236
60635C47183n987n773o161o972p585p466o548n310m241l263k066r55o77j260j743
60620B81176j423o62j29J03K27J41k40n46m01J7K72K26K9r6J05O51J070R76Q65
60601B82361J571K885L736L879M326N611O864P282P369P872Q520Q854R409J0896
60587C71435J2782J3760J3176J1203Q233M959K385O49j470m818q263j0138j0568
60574D03325j0906j1279j0513q409o385n371m670l459k249j950k413k731k400
60561C30590j571n70K18M05O6l1Q53K503L839M014L300K821L346M446N006M541
$$ plain form
60664 300279 305010 309586 312997 315537 318177 321402 325197 329612 334588 339559 343984 348051 352203 356234
60650 356234 359558 362147 364447 366495 367899 368643 369179 369623 369529 368527 366595 363588 359158 353419 347183
60635 347183 341196 335423 329262 322290 314705 307239 300691 295381 291140 287877 285811 284856 284179 282919 281176
60620 281176 279753 279091 278962 279065 279292 279433 279193 278647 278246 278263 278535 278761 278790 278694 278799 279450 280520 281496 282361
60601 282361 283932 286817 290553 294432 298758 304369 311233 318515 325884 333756 342276 351130 360539 371435
60587 371435 384217 397977 411153 422356 430589 435548 437933 438582 437112 432294 424031 413893 403325
60574 403325 392419 381140 370627 362218 355833 350462 345792 342333 340084 338134 335721 332990 330590
60561 330590 329019 328449 328667 329072 329138 329107 329960 332463 336302 340316 343616 346437 349783 354229 359235 363776
60545C63776L643L043K797K628K534K628K787K955L406M296N335O308P364Q402
60531D21902Q804Q440Q193Q732R370R120Q367Q359R430J0876J2359J4180J6226
60518E54358J7859J9058K0664K3314K6949L1485L7013M3215M9533N6120O3722
60507I43290P2306Q0705Q7865R3641R7998J00289R9852R6620R0630Q1520O8994
60496A913710N3380L5349J5439n757k7157m7175o3926p5568q1038q0620p5419
60485A561218o6316n3854l8967k3046p090Q485K2994L5070M3341M6982M5400L8033
60473A612250K4980P493j2401l2541n0924o5874p6261q1499q1569p7403p0871
60462A095380o3589n5873m7544l9391l2754k7638k2586j6771j1122o745l292K91
$$ plain form
60545 363776 367419 370462 373259 375887 378421 381049 383836 386791 390197 394493 399828 406136 413500 421902
60531 421902 430706 439146 447339 456071 465441 474561 482928 491287 500717 511593 523952 538132 554358
60518 554358 572217 591275 611939 635253 662202 693687 730700 773915 823448 879568 943290
60507 943290 1015596 1096301 1184166 1277807 1375805 1476094 1575946 1672566 1763196 1844716 1913710
60496 1913710 1967090 2002439 2017878 2012121 1984964 1937789 1873863 1798295 1717257 1636637 1561218
60485 1561218 1494902 1441048 1402081 1379035 1371945 1380430 1403424 1438494 1481835 1528817 1574217 1612250
60473 1612250 1637230 1644723 1632322 1599781 1548857 1482983 1406722 1325223 1243654 1166251 1095380
60462 1095380 1031791 975918 928374 888983 856229 828591 806005 789234 778112 771367 768075 768366
60450G68366M149P576J0201J2317J4270J6185J8162K0261K2405K4615K7186L0356
60438I76049L4070L8274M3150M8896N5604O3512P2924Q3710R5399J08066J22647
60427A742301J39937J59877J82222K07546K36915K70754L08508L49189L91609
60418C988858M33687M71561M99238N09195M94010M48549L71788K67412J42977
60409G627275Q202j26543k50939l55267m32070m78535m97077m93070m72092m39215
60399D090669l99522l57597l16399k77513k42220k11357j84501j60588j39443
60390A801529j21571j06535r3014q0724p0796o3696n8046n2315m6497m1355l7028
60379A029952l3297l0329k8257k6613k5023k3796k3139k2424k1010j9211j7743
$$ plain form
60450 768366 772515 780091 790292 802609 816879 833064 851226 871487 893892 918507 945693 976049
60438 976049 1010119 1048393 1091543 1140439 1196043 1259555 1332479 1416189 1511588 1619654 1742301
60427 1742301 1882238 2042115 2224337 2431883 2668798 2939552 3248060 3597249 3988858
60418 3988858 4422545 4894106 5393344 5902539 6396549 6845098 7216886 7484298 7627275
60409 7627275 7635477 7508934 7257995 6902728 6470658 5992123 5495046 5001976 4529884 4090669
60399 4090669 3691147 3333550 3017151 2739638 2497418 2286061 2101560 1940972 1801529
60390 1801529 1679958 1573423 1480409 1399685 1328889 1265193 1207147 1154832 1108335 1066980 1029952
60379 1029952 996655 966326 938069 911456 886433 862637 839498 817074 796064 776853 759110
60368G59110j6685j5657j4493j3202j1816j0744j0610j1166j1177j0031q606p835
60356F17088p398o801o702p846r336r478q095o643o187o415o592o402n749m704
60342E18740l771l479l645l640l295k893k470j919j516j551j598j001N3Q16J193
60327D90024J755K560K943K646K265K394K989L766M561N200N674O481Q178J0513
60313E51949J2723J4593J6404J7787J7612J5356J1737P600K945k432q035j2996
60301F45243j6828j9311k0140j9322j7695j6347j5508j4526j2879j0810q844p122
60289D65911n513m181l563l694l944l704l124k679k259j330K6R62J061Q83R22
60274D35774P96J47l52K43J679K752K812K248J531O82k38q64r80p14k50L16P81
$$ plain form
60368 759110 742425 726768 712275 699073 687257 676513 665903 654737 643560 633529 624923 617088
60356 617088 609690 602889 596187 588341 579005 569527 561432 554789 548602 542187 535595 529193 523444 518740
60342 518740 514969 511490 507845 504205 500910 498017 495547 493628 492112 490561 488963 487962 488015 488831 490024
60327 490024 491779 494339 497282 499928 502193 504587 507576 511342 515903 521103 526777 533258 541436 551949
60313 551949 564672 579265 595669 613456 631068 646424 658161 665761 668706 666274 658239 645243
60301 645243 628415 609104 588964 569642 551947 535600 520092 505566 492687 481877 473033 465911
60289 465911 460398 456217 452654 448960 445016 441312 438188 435509 433250 431920 431946 432908 433969 434852 435774
60274 435774 436570 436717 436365 436608 438287 441039 443851 446099 447630 448312 448074 447210 446230 445516 445266 445582 446363
60257D46363R93J194J739K478K888K849K817L255M268N660O893P189O314N184
60243E00084N018N835O504O359O039O500P858R619J1545J3746J6222J8717K0958
60230F35004K2814K4246K5277K5933K6249K6384K6536K6608K6101K4662K2577
60219I12391K0409J8279J5881J3157J0482Q150N990L657J124j148k469k495j640
60206A001768p33j56M73J658L431N536P736R667J0953J1845J3240J5526J7902
60193A098846J9389K0100K0901K2266K4089K6133K7906K8610K7988K6833K5732
60182A368793K3876K0218J5426J1326Q444N495J455l179p547j1580j5326j8151
60170A399250j9457j9607j9418j9089j8218j6549j4260j1632q750n478j725K153
$$ plain form
60257 446363 447356 448550 450289 452767 455655 458504 461321 464576 468844 474504 481397 488586 494900 500084
60243 500084 505102 510937 517441 523800 529839 536339 544197 553816 565361 579107 595329 614046 635004
60230 635004 657818 682064 707341 733274 759523 785907 812443 839051 865152 889814 912391
60219 912391 932800 951079 966960 980117 990599 998749 1004739 1008396 1009520 1008372 1005903 1003408 1001768
60206 1001768 1001035 1000879 1001352 1003010 1006441 1011977 1019713 1029380 1040333 1052178 1065418 1080944 1098846
60193 1098846 1118235 1138335 1159236 1181502 1205591 1231724 1259630 1288240 1316228 1343061 1368793
60182 1368793 1392669 1412887 1428313 1439639 1448083 1453578 1455033 1451854 1444307 1432727 1417401 1399250
60170 1399250 1379793 1360186 1340768 1321679 1303461 1286912 1272652 1261020 1252270 1246792 1245067 1247220
60158A247220N405P695R571J1718J4067J6203J8238K0366K1812K1374J9014J5947
60146A428630J3074J0273P453N117L515K237J121P90J776L892O835J0655J5211
60133A510579J9911K4461K9097L3579L6800L7964L7319L5176L1080K4824J7566
60122A838356J1020O078L099K971O538J3135K0807K8191L5359M2645M9417N4486
60110B112102N7206N7806N6834N4604N1128M6291M0047L2494K3787J3955K803
60099B549057r961k4248l9131n3052o4689p3516p9443q2335q2255p9827p5771
60088A884829p0239o3115n4791m6073l7466k9231k1890j5899j0813n650j72M960
60076A534450R383J3475J7320K0061K0782J9504J6947J3845J0605P201L214j461
$$ plain form
60158 1247220 1252625 1260320 1269891 1281609 1295676 1311879 1330117 1350483 1372295 1393669 1412683 1428630
60146 1428630 1441704 1451977 1459430 1464547 1468062 1470299 1471420 1472210 1473986 1477878 1484713 1495368 1510579
60133 1510579 1530490 1554951 1584048 1617627 1654427 1692391 1729710 1764886 1795966 1820790 1838356
60122 1838356 1849376 1855454 1858553 1861524 1868062 1881197 1902004 1930195 1965554 2008199 2057616 2112102
60110 2112102 2169308 2227114 2283948 2338552 2389680 2435971 2476018 2508512 2532299 2546254 2549057
60099 2549057 2539096 2514848 2475717 2422665 2357976 2284460 2205017 2122682 2040427 1960600 1884829
60088 1884829 1814590 1751475 1696684 1650611 1613145 1583914 1562024 1546125 1535312 1529662 1529490 1534450
60076 1534450 1543833 1557308 1574628 1594689 1615471 1634975 1651922 1665767 1676372 1683573 1686787 1685326
60064A685326n931r029j0819j2525j4824j7145j8882k0317k1758k2757k2854k2405
60052A486080k2007k1739k1513k1520k1637k1044j9123j6255j3100r593n351o11
60040A292587L987Q271J2526J6831K0991K4945K8814L2631L6373M0024M3404M6194
60028A607578M8239M9526M9838M8954M7220M5183M2595L8595L2979K6264J8207
60017B055178P648n493j9215l1379m1630n0386n6995o0411o1003o0139n8248n4685
60005A563242m9416m3516l7743l1797k5339j8866j3076p988l030K285P993J3734
59993A356483J9074K3896K8366L2392L5425L7024L7186L5869L2704K7692K1674
59982A687785J5560R431K960l735j0258j6490k2290k7038l0242l2291l3809l4583
$$ plain form
60064 1685326 1679395 1670366 1659547 1647022 1632198 1615053 1596171 1575854 1554096 1531339 1508485 1486080
60052 1486080 1464073 1442334 1420821 1399301 1377664 1356620 1337497 1321242 1308142 1298549 1293198 1292587
60040 1292587 1296574 1304845 1317371 1334202 1355193 1380138 1408952 1441583 1477956 1517980 1561384 1607578
60028 1607578 1655817 1705343 1755181 1804135 1851355 1896538 1939133 1977728 2010707 2036971 2055178
60017 2055178 2062826 2057333 2038118 2006739 1965109 1914723 1857728 1797317 1736314 1676175 1617927 1563242
60005 1563242 1513826 1470310 1432567 1400770 1375431 1356565 1343489 1335501 1332471 1334756 1342749 1356483
59993 1356483 1375557 1399453 1427819 1460211 1495636 1532660 1569846 1605715 1638419 1666111 1687785
59982 1687785 1703345 1712776 1715736 1712001 1701743 1685253 1662963 1635925 1605683 1573392 1539583 1505000
59970A505000l3864l1547k8296k4641k0722j6830j3357j0193o782k871J251N166
59958A322314Q581J1293J3453J5669J8320K0960K2837K3766K3924K3126K1047
59947A525290J7989J4724J1611Q482N233J938j464m859p472q517q267p769p388
59934A539531o341l849j02M190Q683J3622J9408K6191L3708M1479M9211N6863
59922A782594O4316P1292P7745Q3735Q8598R0881Q9637Q5190P7999O7462N2780
59911B632229L4595J4748n310k4875m2936n7983o9127p6649q1183q3003q2212
59900B158294p9039p3802o6989n9350n1457m3317l4850k6492j8732j1376l991
59889A688899L196R661J5584K1582K7565L2818L7159M0995M4198M5954M6007M4935
$$ plain form
59970 1505000 1471136 1439589 1411293 1386652 1365930 1349100 1335743 1325550 1318768 1315897 1317148 1322314
59958 1322314 1330895 1342188 1355641 1371310 1389630 1410590 1433427 1457193 1481117 1504243 1525290
59947 1525290 1543279 1558003 1569614 1578096 1583329 1585267 1583803 1578944 1571472 1562955 1554688 1546919 1539531
59934 1539531 1533190 1529341 1529239 1533429 1542112 1555734 1575142 1601333 1635041 1676520 1725731 1782594
59922 1782594 1846910 1918202 1995947 2079682 2168280 2259161 2348798 2433988 2511987 2579449 2632229
59911 2632229 2666824 2681572 2676262 2651387 2608451 2550468 2481341 2404692 2323509 2240506 2158294
59900 2158294 2079255 2005453 1938464 1879114 1827657 1784340 1749490 1722998 1704266 1692890 1688899
59889 1688899 1692095 1701756 1717340 1738922 1766487 1799305 1836464 1877459 1921657 1967611 2013618 2058553
59877B058553M2848L8795L2059K3330J4025M984l631j1549j8175k2912k5451k5903
59865B106973k4884k3348k2333k2998k6544l3337m2109n0589n7145o1331o2946
59854A679409o1490n6975n0506m3457l6345k9037k1832j5667j1191p968m936j652
59842A338353J193K701L046L371M466O189Q444J1821J6667K2146K7109L1611L6702
59829A513819M2923M9732N6286O1833O5358O5545O1347N2244L8354K0993K962
59818B031396j2701k4416l2092l5860l5852l3183k9939k7592k6127k5159k5291
59807A723184k7845l3457m1119m8321n2183n1071m5463l7212k8093j9429j2661
59796A326330r308r930j3564j8267k2143k4103k4264k3641k3045k2327k0971j9066
$$ plain form
59877 2058553 2101401 2140196 2172255 2195585 2209610 2214594 2210963 2199414 2181239 2158327 2132876 2106973
59865 2106973 2082089 2058741 2036408 2013410 1986866 1953529 1911420 1860831 1803686 1742355 1679409
59854 1679409 1617919 1560944 1510438 1466981 1430636 1401599 1379767 1364100 1352909 1344941 1340005 1338353
59842 1338353 1339546 1342247 1345293 1348664 1353130 1359319 1367763 1379584 1396251 1418397 1445506 1477117 1513819
59829 1513819 1556742 1606474 1662760 1724593 1789951 1855496 1916843 1969087 2007441 2028434 2031396
59818 2031396 2018695 1994279 1962187 1926327 1890475 1857292 1827353 1799761 1773634 1748475 1723184
59807 1723184 1695339 1661882 1620763 1572442 1520259 1469188 1423725 1386513 1358420 1338991 1326330
59796 1326330 1317022 1307092 1293528 1275261 1253118 1229015 1204751 1181110 1158065 1135738 1114767 1095701
59784A095701j7113j5237j3264j1304r435p068l459J104N540R332J2938J6792
59772A064527K0739K4590K8485L2550L6789M1465M7026N3529O0604O7921P5280
59761A553505Q2211Q7777R0413Q7712P7130N8050L2976O045j9330m0916n6936
59750A958637o6538p0683p1225o9201o5016n9759n4682m9573m3341l6286l0118
59739A342215k5563k1531j7080j2618q652m922j387J368L382N641Q453J0809J2170
59726A292285J3658J6593K0856K5563L0366L5300M0315M5733N2296O0027O7927
59715A700919P5529Q3759R3517J04319J15159J25698J35723J44280J50375J53835
59705B883113J54670J52285J46308J37618J27785J17971J09015J01850R7005R4162
$$ plain form
59784 1095701 1078588 1063351 1050087 1038783 1029348 1022280 1018821 1019925 1025465 1034797 1047735 1064527
59772 1064527 1085266 1109856 1138341 1170891 1207680 1249145 1296171 1349700 1410304 1478225 1553505
59761 1553505 1635716 1723493 1813906 1901618 1978748 2036798 2069774 2075819 2056489 2015573 1958637
59750 1958637 1892099 1821416 1750191 1680990 1615974 1556215 1501533 1451960 1408619 1372333 1342215
59739 1342215 1316652 1295121 1278041 1265423 1256771 1251849 1250462 1251830 1255212 1260853 1269306 1280115 1292285
59726 1292285 1305943 1322536 1343392 1368955 1399321 1434621 1474936 1520669 1572965 1632992 1700919
59715 1700919 1776448 1860207 1953724 2058043 2173202 2298900 2434623 2578903 2729278 2883113
59705 2883113 3037783 3190068 3336376 3473994 3601779 3719750 3828765 3930615 4027620 4121782
59695D121782R2763R2402R2168R0449Q6138P9309P0256N8736M4900K9925J4774
59684D873602p71j6864l2197m4917n4232o0110o2124n9880n4166m6465l7442k6817
59672D377617j4513j045J3176K8253M4486O2035Q0670R9624J18057J35743J52618
59661E096721J67578J78661J84698J85588J80490J67080J43585J10522O9672K2573
59651F507168k8750q0588j28615j69797k02511k25717k39162k43693k40285k29465
59641D718585k12505j92111j70681j48871j27252j08456r5943r1302r4141j03752
59631C373571j18774j35769j50311j59792j63803j62224j54923j43399j30605
59622B053971j18379j06384r4001q1811p0661o0567n1340m3297l6703l1290k6860
$$ plain form
59695 4121782 4214545 4306947 4399115 4489564 4575702 4655011 4725267 4784003 4828903 4858828 4873602
59684 4873602 4872831 4855967 4823770 4778853 4724621 4664511 4602387 4542507 4488341 4441876 4404434 4377617
59672 4377617 4363104 4362059 4375235 4403488 4447974 4510009 4590679 4690303 4808360 4944103 5096721
59661 5096721 5264299 5442960 5627658 5813246 5993736 6160816 6304401 6414923 6484595 6507168
59651 6507168 6478418 6397830 6269215 6099418 5896907 5671190 5432028 5188335 4948050 4718585
59641 4718585 4506080 4313969 4143288 3994417 3867165 3758709 3662766 3571464 3477323 3373571
59631 3373571 3254797 3119028 2968717 2808925 2645122 2482898 2327975 2184576 2053971
59622 2053971 1935592 1829208 1735207 1653396 1582735 1522168 1470828 1427531 1390828 1359538 1332678
59611A332678k3675k1754k0416j8913j7099j5210j3428j1858j0547r462q702q500
59599A153114q721q782q528q671r618j0620j0942j1192j2273j3606j3887j3216
59587A023058j2910j3260j3185j2280j1588j1853j2392j2335j1785j1114j0185
59576H90171q914p662o409m427j478J394K943L122K809K724L058L742M560N340
59562H90973O312P897J0010J2079J3882J5748J7775J9533K0846K2143K3615K4777
59550A085590K5320K5851K7067K8731L0071L1045L2464L4985L8467M2378M6399
59539A448368N0379N4000N6940N9408O2107O5399O8666P0849P1137O8445O0727
59528B136425M6414K7203Q130o227j5137k0721k4802k7951l0730l3939l7473m0284
$$ plain form
59611 1332678 1309003 1287249 1266833 1247920 1230821 1215611 1202183 1190325 1179778 1170316 1161614 1153114
59599 1153114 1144393 1135611 1127083 1118412 1108794 1098174 1087232 1076040 1063767 1050161 1036274 1023058
59587 1023058 1010148 996888 983703 971423 959835 947982 935590 923255 911470 900356 890171
59576 890171 881257 873595 867186 862759 861281 862675 865618 868740 871549 874273 877331 881073 885633 890973
59562 890973 897285 905182 915192 927271 941153 956901 974676 994209 1015055 1037198 1060813 1085590
59550 1085590 1110910 1136761 1163828 1192559 1222630 1253675 1286139 1321124 1359591 1401969 1448368
59539 1448368 1498747 1552747 1609687 1669095 1731202 1796601 1865267 1936116 2007253 2075698 2136425
59528 2136425 2182839 2210042 2218172 2211945 2196808 2176087 2151285 2123334 2092604 2058665 2021192 1980908
59516A980908m1707m1891m0959l8770l5544l1735k7111k1026j3693o180J076Q783
59504A692151J7516K6873L6316M5887N5433O3821O9535P1732P0373O5687N7813
59493B273137M6688L2125J4381n188k4426m1516n5686o6935p5344q0691q2555
59482A933990q0931p6767p1484o5653n8800n0861m2975l6114k9737k2865j5772
59471A382031r402l662K321Q568J4263J9347K4637L0377L5972M1238M6580N1783
59459A644053N5951N8960O1603O3902O4559O2584N8387N2647M5242L5952K5325
59448B229165J4246L373o569j4734k0986k6019l0213l3063l4081l3528l1828k9065
59436A986698k5487k1790j8336j4812j0990p213l714k34L301O392Q793J0947J3183
$$ plain form
59516 1980908 1939201 1897310 1856351 1817581 1782037 1750302 1723191 1702165 1688472 1682292 1683368 1692151
59504 1692151 1709667 1736540 1772856 1818743 1874176 1937997 2007532 2079264 2149637 2215324 2273137
59493 2273137 2319825 2351950 2366331 2361143 2336717 2295201 2239515 2172580 2097236 2016545 1933990
59482 1933990 1853059 1776292 1704808 1639155 1580355 1529494 1486519 1450405 1420668 1397803 1382031
59471 1382031 1372629 1368967 1371288 1379856 1394119 1413466 1438103 1468480 1504452 1545690 1592270 1644053
59459 1644053 1700004 1758964 1820567 1884469 1949028 2011612 2069999 2122646 2167888 2203840 2229165
59448 2229165 2243411 2246784 2240215 2225481 2204495 2178476 2148263 2115200 2081119 2047591 2015763 1986698
59436 1986698 1961211 1939421 1921085 1906273 1895283 1888070 1884356 1884122 1887423 1893815 1902608 1913555 1926738
59423A926738J5089J6204J6737J7084J7123J6534J5388J3961J2276J0268Q221
59412B085623O739O390P366R447J2314J5762J8940J9335J3920K562j0503j9979
59400B167916k3991k4189k2285j8281j1800l184O754J6131K1180J8474Q886k310
59388B133301j0198j3521j3089r427l437K684P355J1342J6026K0943K4645K7092
59376B193716K9502L2332L5019L7364L9667M1628M2335M1417L9375L6837L4260
59365B603452L2254L1503L2476L5579M1176M8977N7862O6843P5685Q4116R1086
59354C201009R5431R6800R5412R1520Q5682P8929P1940O4613N7004M9934M4091
59343D032365L9132L4351K9439K3865J6331N692q075k4564m3820o5699q8862j11291
$$ plain form
59423 1926738 1941827 1958031 1974768 1991852 2008975 2025509 2040897 2054858 2067134 2077402 2085623
59412 2085623 2092362 2098752 2106118 2115565 2127879 2143641 2162581 2181916 2195836 2198398 2187895 2167916
59400 2167916 2143925 2119736 2097451 2079170 2067370 2064186 2070940 2087071 2108251 2126725 2135611 2133301
59388 2133301 2123103 2109582 2096493 2087066 2083629 2086313 2093668 2105010 2121036 2141979 2166624 2193716
59376 2193716 2223218 2255550 2290569 2327933 2367600 2409228 2451563 2492980 2532355 2569192 2603452
59365 2603452 2635706 2667209 2699685 2735264 2776440 2825417 2883279 2950122 3025807 3109923 3201009
59354 3201009 3296440 3393240 3488652 3580172 3665854 3744783 3816723 3881336 3938340 3988274 4032365
59343 4032365 4071497 4105848 4135287 4159152 4175483 4181175 4173100 4148536 4104716 4039017 3950155 3838864
59331C838864j31313j47522j58547j63887j64417j61164j54191j43608j30938
59322B483277j18324j06682r5681q5205p5868o8243o2423n8139n4650n0875m6350
59311A660837m1688l7535l3652k9572k5520k1785j7912j3499r172n737k795O74
59299A422644M788Q797J2280J5231J7344J8356J8833J9560K0281K0153J9211J8407
59287A615885J8255J8464J8818J9447K0327K1427K3286K6494L0597L4473L7676
59276A885149M0641M3612M6378M9077N2194N5612N8462O0161O0866O0772N9718
59265B472642N7570N4344M9811M3704L6449K9144K2639J7223J3178J0595Q122
59254B815421K519r441k8065m9580o8147p9510q3235q1690p7291p1171o4016n6765
$$ plain form
59331 3838864 3707551 3560029 3401482 3237595 3073178 2912014 2757823 2614215 2483277
59322 2483277 2364953 2258271 2162590 2077385 2001517 1933274 1870851 1812712 1758062 1707187 1660837
59311 1660837 1619149 1581614 1547962 1518390 1492870 1471085 1453173 1439674 1430502 1424765 1421970 1422644
59299 1422644 1427432 1436229 1448509 1463740 1481084 1499440 1518273 1537833 1558114 1578267 1597478 1615885
59287 1615885 1634140 1652604 1671422 1690869 1711196 1732623 1755909 1782403 1813000 1847473 1885149
59276 1885149 1925790 1969402 2015780 2064857 2117051 2172663 2231125 2291286 2352152 2412924 2472642
59265 2472642 2530212 2584556 2634367 2678071 2714520 2743664 2766303 2783526 2796704 2807299 2815421
59254 2815421 2817940 2808499 2780434 2730854 2662707 2583197 2499962 2418272 2340981 2269810 2205794 2149029
59242B149029m9954m3285l6683l1013k7021k4158k1353j8368j5606j3019j0244
59231A858325p458n191l451j851k85J301L402O279R118J0856J1600J2316J3323
59218A908284J4119J4554J5057J5714J6142J6443J7368J9261K1637K4058K6751
59207B109388L0206L4597L9845M5703N1794N7853O3832O9235P2598P2229O7458
59196B714738N8609M6092L0217J1759q095k8452m8787o8298q5780j00195j10913
59185B410895j17507j19882j18666j14975j09632j02838r4548q4962p4782o5085
59175A408018n6617m9087m1616l4032k7039k0902j4829q218j733L533P307R825
59163A174610J0870R840O395N71p071j5026k1545k6332l0529l4447l6615l6070
$$ plain form
59242 2149029 2099075 2055790 2019107 1988094 1961073 1936915 1915562 1897194 1881588 1868569 1858325
59231 1858325 1850867 1845676 1842225 1840374 1840089 1841390 1844792 1851071 1860189 1871045 1882645 1894961 1908284
59218 1908284 1922403 1936957 1952014 1967728 1983870 2000313 2017681 2036942 2058579 2082637 2109388
59207 2109388 2139594 2174191 2214036 2259739 2311533 2369386 2433218 2502453 2575051 2647280 2714738
59196 2714738 2773347 2819439 2849656 2861415 2853320 2824868 2776081 2707783 2622003 2521808 2410895
59185 2410895 2293388 2173506 2054840 1939865 1830233 1727395 1632847 1547885 1473103 1408018
59175 1408018 1351401 1302314 1260698 1226666 1199627 1178725 1163896 1155678 1153945 1157478 1164785 1174610
59163 1174610 1185480 1195320 1201715 1202286 1195215 1180189 1158644 1132312 1101783 1067336 1030721 994651
59151I94651l4053l2084k9723k5957k1583j8150j5490j2446r369p548o592m767
59139G76889j901M26J794L647O620R359J0872J2085J4027J6119J7317J7625J7552
59126I02431J7236J6992J7585J9148K0734K1727K2704K4270K6025K7377K8460
59115A144689K9511L0187L0176K9734K9125K8232K7186K6525K6337K6096K5642
59104A453440K5305K4697K2562J8434J3272P890K060m001q599j0263r503p667
59092A527627m865m57M936R427J1814J2457J2098J0762Q080M123l65m268o709
59079A584660p637p886q530j0266j3347j7591k2366k6955l1167l5234l8995m1761
59067A322925m3201m3758m3866m3257m1523l8924l6187l3737l1395k8668k5139
$$ plain form
59151 994651 960598 928514 898791 872834 851251 833101 817611 805165 795796 788248 781656 776889
59139 776889 774988 775414 777208 780855 787475 796834 807706 819791 833818 849937 867254 884879 902431
59126 902431 919667 936659 954244 973392 994126 1015853 1038557 1062827 1088852 1116229 1144689
59115 1144689 1174200 1204387 1234563 1264297 1293422 1321654 1348840 1375365 1401702 1427798 1453440
59104 1453440 1478745 1503442 1526004 1544438 1557710 1565600 1567660 1563659 1555060 1544797 1535294 1527627
59092 1527627 1522762 1522305 1527241 1536668 1548482 1560939 1573037 1583799 1591879 1596002 1595637 1591369 1584660
59079 1584660 1577023 1569137 1560607 1550341 1536994 1519403 1497037 1470082 1438915 1403681 1364686 1322925
59067 1322925 1279724 1235966 1192100 1148843 1107320 1068396 1032209 998472 967077 938409 913270
59056I13270k0900j6730j3553j1537r985q186o056l926k066n68O31J711K714L397
59042H28216L543L299K979K822L245M852P648J0742J3463J6322K0075K4324K8103
59029I69633L1422L4996L8587M0758M0467L7817L3221K6960J9710J2526N987J67
59017A292251m581p824r957j1794j3197j3207j1628r208o142j780L714Q762J2028
59004A227437J3661J4461J4871J5200J5693J5789J4373J1300P738M597J755o76
58992A356199j711q23J138L184N176O867P100N009J087l878r943j7115k4258l0045
58978A297987l4324l7439l8996l8433l6305l3717l0835k7078k2505j7957j3980
58967I66418j0493p418m772k221O49L506N440N969N428M367L068J568j54k132
$$ plain form
59056 913270 892370 875640 862087 850550 840565 832379 826323 822397 820331 819763 820394 822105 824819 828216
59042 828216 831759 835058 838037 840859 844104 848956 856604 867346 880809 897131 917206 941530 969633
59029 969633 1001055 1036051 1074638 1115396 1155863 1193680 1226901 1253861 1273571 1286097 1292084 1292251
59017 1292251 1287670 1279846 1269889 1258095 1244898 1231691 1220063 1210855 1204713 1202933 1206647 1215409 1227437
59004 1227437 1241098 1255559 1270430 1285630 1301323 1317112 1331485 1342785 1350523 1355120 1356875 1356199
58992 1356199 1354488 1353665 1354803 1357987 1363163 1370030 1377130 1382139 1383226 1379348 1369405 1352290 1328032 1297987
58978 1297987 1263663 1226224 1187228 1148795 1112490 1078773 1047938 1020860 998355 980398 966418
58967 966418 955925 948507 943735 941514 942163 945669 951109 957078 962506 966873 969941 971509 971355 969223
58953I69223m268o268p727q168p044m204m08L213O397R935J4374J9168K3493K7288
58939A035004L0940L4258L6346L6293L3699K8705K1781J3478M370m654j2247j7206
58927A240767j9147j8363j5283j0593n433o43L980Q975J4104J8802K3368K8480
58915A269014L3683L7692M0135M1646M2140M0517L6505L1423K6692K2850K0445
58904A642742K0442K2962K6950L1860L8526M7490N7612O7274P6045Q4264R1912
58893B208079R8872J05477J11864J17333J21213J23782J25698J27144J27984J27843
58883C395289J25301J18037J04704Q6206O4379M0103J3483j4761m2932o9109r1714
58872C728986j09834j23465j33055j38705j40441j39234j36647j33179j28075
$$ plain form
58953 969223 964955 958687 950960 942792 935748 931544 931136 934349 940746 950681 965055 984223 1007716 1035004
58939 1035004 1065944 1100202 1136548 1172841 1206540 1235245 1257026 1270504 1274874 1270220 1257973 1240767
58927 1240767 1221620 1203257 1187974 1177381 1171948 1171305 1175285 1184260 1198364 1217166 1240534 1269014
58915 1269014 1302697 1340389 1380524 1422170 1464310 1504827 1541332 1572755 1599447 1622297 1642742
58904 1642742 1663184 1686146 1713096 1744956 1783482 1830972 1888584 1955858 2031903 2116167 2208079
58893 2208079 2306951 2412428 2524292 2641625 2762838 2886620 3012318 3139462 3267446 3395289
58883 3395289 3520590 3638627 3743331 3829537 3893916 3934019 3947502 3932741 3889809 3820700 3728986
58872 3728986 3619152 3495687 3362632 3223927 3083486 2944252 2807605 2674426 2546351
58863B546351j21125j13376j05523r7032q7668p8673p1410o5870o1452n8178n6223
58852A629821n5082n4248n3818n3678n2878n0769m7907m5008m1899l8262l4459
58841A101813l0791k6870k2625j8915j6215j3745j0861q280o794n742l985j553
58829I35437Q45L090N269O813P373P924R702J2494J4993J6451J7120J7585J8456
58816A073552K0161K2303K3857K4552K5101K5588K4894K2693K0633K0235K0819
58805A324388K0888K0542K1103K3110K6218L0317L5447M1110M6838N2887N9497
58794A702345O6361P3666Q2372R2331J01507J08529J14621J21260J27211J29988
58784B720191J29139J25796J19665J09011R3421P4415N3246L0064N351j9497m3259
$$ plain form
58863 2546351 2425226 2311850 2206327 2109295 2021627 1942954 1871544 1805674 1744222 1686044 1629821
58852 1629821 1574739 1520491 1466673 1412995 1360117 1309348 1261441 1216433 1174534 1136272 1101813
58841 1101813 1071022 1044152 1021527 1002612 986397 972652 961791 953511 946717 940975 936990 935437
58829 935437 936282 939372 944641 951454 958827 966751 976453 988947 1003940 1020391 1037511 1055096 1073552
58816 1073552 1093713 1116016 1139873 1164425 1189526 1215114 1240008 1262701 1283334 1303569 1324388
58805 1324388 1345276 1365818 1386921 1410031 1436249 1466566 1502013 1543123 1589961 1642848 1702345
58794 1702345 1768706 1842372 1924744 2017075 2118582 2227111 2341732 2462992 2590203 2720191
58784 2720191 2849330 2975126 3094791 3203802 3297223 3371638 3424884 3454948 3460299 3440802 3397543
58773C397543o5128q3927r8602j09554j18043j24235j27078j26119j22195j16335
58763B306327j09125j01126r2802q4166p5409o7589o1543n6545n1275m5819m1496
58752A519432l8878l7190l5401l2883k9291k4844k0404j6383j2064o923j772K544
58740A265943O717J1829J7404K2192K6143K9980L3238L4415L2661K7930K0082
58729A528534R564j436j0289j6145j9514k0309j8113j3941r678n909j946K117
58717A422935N056O055M965J248n740j5432k6474l8020m9220n8014o2518o3285
58705A121556o2361o0356n6387n0621m4666l9270l3717k7760k2327j7993j4322
58694F91776j1025q260n655k526Q82L799O430R556J2824J5056J6007J6070J4616
$$ plain form
58773 3397543 3332415 3248488 3149886 3040332 2922289 2798054 2670976 2544857 2422662 2306327
58763 2306327 2197202 2096076 2003274 1919108 1843699 1776110 1714567 1658022 1606747 1560928 1519432
58752 1519432 1480554 1443364 1407963 1375080 1345789 1320945 1300541 1284158 1272094 1265171 1263399 1265943
58740 1265943 1272660 1284489 1301893 1324085 1350228 1380208 1413446 1447861 1480522 1508452 1528534
58729 1528534 1538098 1536662 1526373 1510228 1490714 1470405 1452292 1438351 1428673 1422764 1420818 1422935
58717 1422935 1427991 1434046 1439011 1440259 1434519 1419087 1392613 1354593 1305373 1247359 1184841 1121556
58705 1121556 1059195 998839 942452 891831 847165 807895 774178 746418 724091 706098 691776
58694 691776 680751 672491 666836 664310 665192 668991 675421 684977 697801 712857 728864 744934 759550
58681G59550J0580M632j121n602r158j1693j2473j1794j0874r954q402o553n404
58668F81734m480k249J238M279O224P928R290Q781O066K770nk799n736p561p702
58653F97778p423p943r019j0124j1405j2784j3623j3861j4049j3904j2479j0055
58641E61109q104p031n836m263l321l207k833j880j364j527j274l01K72M5O7O32
58625E21184N80l86p83J88J285J441J393K008K713K825K812L144L388L465M255
58610E49512O079Q008R528J1328J3730J5858J7126J8011J8793J9186J9713K1582
58598G28454K4637K7378K9599L2845L7536M1894M4622M6410M7787M7823M6181
58587A155166M4194M2384L9042L2785K4694J6431Q155j76p325j2262j5543j7754
$$ plain form
58681 759550 770130 774762 773641 768039 758881 747188 734715 722921 712047 702093 693691 687138 681734
58668 681734 677254 675005 676243 680522 686746 694674 703964 712745 718811 721581 721576 718777 713041 705480 697778
58653 697778 690355 682412 673393 663269 651864 639080 625457 611596 597547 583643 571164 561109
58641 561109 553005 545974 540138 535875 532554 529347 526514 524634 523270 521743 520469 520168 520440 520485 520552 521184
58625 521184 521764 521378 520595 520783 522068 523509 524902 526910 529623 532448 535260 538404 541792 545257 549512
58610 549512 555591 563599 573127 584455 598185 614043 631169 649180 667973 687159 706872 728454
58598 728454 753091 780469 810068 842913 880449 922343 966965 1013375 1061162 1108985 1155166
58587 1155166 1199360 1241744 1280786 1313571 1338265 1354696 1362851 1362675 1355350 1343088 1327545 1309791
58575A309791j8179j6496j4160j2484j0854q342n665l969k915j428P60L559P364
58562A226982J2345J7977K4008L0592L6732M0242L9916L6085K8466J5677k084
58551A506938k1904m0703n6978o9289p5730p6337p3679o9545o3366n5264m7848
58540H56295m2934l8975l3994k8842k5159k2265j8773j5455j3759j2958j1424
58529E91757r517q687q681q056o612n233m047k730j805j819k067j734j354j611
58515E27804j820j292q60j396j964j300Q5J021J781L284N133O304O894P666Q777
58500E60117J0181J2245J4683J6142J6088J5672J5603J4927J3212J2015J2486
58489G13371J3471J3893J5069J8498K3028K6460K8453K9682K9541K7007K2670
$$ plain form
58575 1309791 1291612 1275116 1260956 1248472 1237618 1229276 1223611 1219642 1216727 1215299 1216059 1219618 1226982
58562 1226982 1239327 1257304 1281312 1311904 1348636 1388878 1428794 1464879 1493345 1509022 1506938
58551 1506938 1485034 1444331 1387353 1318064 1242334 1165997 1092318 1022773 959407 904143 856295
58540 856295 813361 774386 740392 711550 686391 664126 645353 629898 616139 603181 591757
58529 591757 582240 573553 564872 556816 550204 544971 540924 538194 536389 534570 532503 530769 529415 527804
58515 527804 525984 524692 523832 522436 520472 519172 519257 520278 522059 525343 530476 536780 543674 551340 560117
58500 560117 570298 582543 597226 613368 629456 645128 660731 675658 688870 700885 713371
58489 713371 726842 740735 755804 774302 797330 823790 852243 881925 911466 938473 961143
58478I61143J7878J2910P711K994j190o495j3980k2089k8772l3989l8308m0719
58466H17094m0070l7198l3636k9562k4885k0713j7731j4845j1385q825q219p854
58454E62171n858l211j813j364o86k11n16k44J704L679L788L200M052N729O262
58439E76682N910O202O844O715O720Q530J1501J3807J5615J8271K1367K3448K4500
58426G46112K5047K3917J9729J3511P227J005n604j1140j3964j5039j6108j6487
58414G58206j4659j1537r128p285m845k450j144K83L407P163R839J2359J6213
58401G56422J9948K1380K1538K2592K3504K1746J7861J4204J0630N686Q27j013
58389I35325l07l32k449n886j0870j7673k3541k5042k2931k0625j8791j5645j1589
$$ plain form
58478 961143 979021 991931 999642 1002636 1001446 994951 980971 958882 930110 896121 857813 817094
58466 817094 777024 739826 706190 676628 651743 631030 613299 598454 587069 578244 570025 562171
58454 562171 556313 553102 551289 549925 549239 549028 548512 548268 549972 553651 557439 560639 564691 570420 576682
58439 576682 582592 588794 595638 602353 609073 617603 629104 642911 658526 676797 698164 721612 746112
58426 746112 771159 795076 814805 828316 835543 836548 830944 819804 805840 790801 774693 758206
58414 758206 743547 732010 722882 715597 710752 708302 707158 707441 710848 718011 727850 740209 756422
58401 756422 776370 797750 819288 841880 865384 887130 904991 919195 929825 935511 936338 935325
58389 935325 935018 934686 932237 926351 915481 897808 874267 849225 826294 805669 786878 771233 759644
58376G59644q891p402n055k088m66L03K313M861N432M517M903O557O798N273M338
58361G81037M703N006N286O640P931P273O049P072R535J0482J0295J1711J4265
58348H87285J5184J5106J7340K1623K4216K4189K4140K4660K3467K0224J6902
58337A114336J3307P578J064k725l918n538p331o274l008j512k006o01L511O747
58323A113630P752R094J1602J3068J3494J5528J8877K0278J9794K1035K4419K6520
58311A315091K6741K8197L1135L2086L0478K9441K9175K6291K0681J6104J2992
58300A598412P839Q63l130k927k524l258j833K294N250O150Q582J2999J5459J5540
58286A659716J7501K1876K4125K3520K4820K9086L1590L1109L2413L7017M0524
$$ plain form
58376 759644 750753 743351 738296 736208 735742 736045 738358 743219 748651 753168 758071 764628 771426 776699 781037
58361 781037 785740 790746 796032 802672 810603 817876 823925 830997 840532 851014 861309 873020 887285
58348 887285 902469 917575 934915 956538 980754 1004943 1029083 1053743 1077210 1097434 1114336
58337 1114336 1127643 1135221 1136285 1133560 1129642 1124104 1116773 1110499 1107491 1105979 1103973 1103372 1106883 1113630
58323 1113630 1121382 1130476 1142078 1155146 1168640 1184168 1203045 1223323 1243117 1264152 1288571 1315091
58311 1315091 1341832 1370029 1401164 1433250 1463728 1493169 1522344 1548635 1569316 1585420 1598412
58300 1598412 1606251 1607114 1603984 1601057 1598533 1595275 1593442 1595736 1600986 1607136 1615718 1628717 1644176 1659716
58286 1659716 1677217 1699093 1723218 1746738 1771558 1800644 1832234 1863343 1895756 1932773 1973297
58275A973297M1713M5145N1943N7430O0748O7176P7740Q6362R0546R4782R9877
58264B746759R9426R0899P9879O9355N5426L7832K3670J6115J0237M439M552J1985
58252C250574J9536K4058L1291M3163N2852N7718O4245P4682Q2208Q4981R0791
58241C876099J01697J08997J10007J14137J25215J34223J37451J44541J59715
58232E012082J72863J79003J88228K05876K21865K31083K44607K68333K90788
58223G014728L05522L24476L54973L85363M08708M37681M79725N21690N56679
58214A0789545O00618O63457P31126P96270Q77559R86414J106333J229714J381402
58205A9162438J579649J812256K081234K427673K875633L396522L969781M630711
$$ plain form
58275 1973297 2015010 2060155 2112098 2169528 2230276 2297452 2375192 2461554 2552100 2646882 2746759
58264 2746759 2846185 2937084 3016963 3086318 3141744 3179576 3203246 3219361 3229598 3234037 3238589 3250574
58252 3250574 3270110 3294168 3325459 3368622 3421474 3479192 3543437 3618119 3700327 3785308 3876099
58241 3876099 3977796 4086793 4196800 4310937 4436152 4570375 4707826 4852367 5012082
58232 5012082 5184945 5363948 5552176 5758052 5979917 6211000 6455607 6723940 7014728
58223 7014728 7320250 7644726 7999699 8385062 8793770 9231451 9711176 10232866 10789545
58214 10789545 11390163 12053620 12784746 13581016 14458575 15444989 16551322 17781036 19162438
58205 19162438 20742087 22554343 24635577 27063250 29938883 33335405 37305186 41935897
58197D1935897N417166O331869P414602Q787159J0566627J2818292J5672565J9381234
58189A28325411K4137637K9923617L6555012M3461539M8911192M9671462M2467139
58182D03453009K6675278N647855j5019336l0775603m0003675m3465714m2772116
58175B63739698l9471694l4855467k9873499k5065219k0691172j6918376j3820669
58168H3043602j1319252r275764p620905o321027n288830m426117l709386l148363
58160C1933958k702160k314002j984540j730887j512288j274035j028139q13429
58152A8574478o12034l83190j42003P9901L17569O29420J007634J429559J963172
58143B2864506K710851L682866M848639O236768P725812Q681883Q110018N478468
$$ plain form
58197 41935897 47353063 53684932 61099534 69886693 80453320 93271612 108944177 128325411
58189 128325411 152463048 182386665 218941677 262403216 311314408 360985870 403453009
58182 403453009 430128287 435776142 420756806 389981203 349977528 306511814 263739698
58175 263739698 224268004 189412537 159539038 134473819 113782647 96864271 83043602
58168 83043602 71724350 62448586 54827681 48506654 43217824 38791707 35082321 31933958
58160 31933958 29231798 26917796 24933256 23202369 21690081 20416046 19387907 18574478
58152 18574478 17962444 17579254 17437251 17517152 17834721 18464141 19471775 20901334 22864506
58143 22864506 25575357 29258223 34106862 40343630 48069442 56751325 64861343 70339811
58135G0339811J384268k768617n778866p298915p647912p277866o509551n568472
58127B8873880m628873l783016l049720k434676j948760j578687j287237j049405
58119I113506q61375p15222n92654m86806m07073l56688l22876k94056k71857
58110D804899k60256k54801k48697k40433k29742k13334j90001j64428j41199
58101B862008j19333r6575p5273o0169n3393n4587o2673p4062q2012q1814p5205
58090B026912o6852n8378m8962l9862l4296l3498l6169m1241m8165n4891n8849
58079A505749n9988o0135n9530n6858n2503m8585m5542m1813l7302l3908l1936
58068I77649k9230k5016k1447j9989j9232j7844j6828j6969j6681j4562j2020
$$ plain form
58135 70339811 71724079 68955462 63176596 55877681 48229769 40951903 34442352 28873880
58127 28873880 24245007 20461991 17412271 14977595 13028835 11450148 10162911 9113506
58119 9113506 8252131 7536909 6944255 6457449 6050376 5693688 5370812 5076756 4804899
58110 4804899 4544643 4289842 4041145 3800712 3570970 3357636 3167635 3003207 2862008
58101 2862008 2742675 2646100 2570827 2510658 2457265 2402678 2340005 2265943 2183931 2102117 2026912
58090 2026912 1960060 1901682 1852720 1812858 1778562 1745064 1708895 1667654 1619489 1564598 1505749
58079 1505749 1445761 1385626 1326096 1269238 1216735 1168150 1122608 1080795 1043493 1009585 977649
58068 977649 948419 923403 901956 881967 862735 844891 828063 811094 794413 779851 767831
58057G67831j1175j1907j2934j4071j5573j6734j6956j6826j6621j5364j2820
58046F06850j0731j0348j0406r312p708p036p046o689o186o191o095n014l559
58033E10529k903k952k985l161l959m984n658o224o942p310p137p197p751p783
58019D33583o719n541n096m803m153l836m196m264l601l294l725l320j098J433
58005C81370K682L507N377P764R429J0776J2909J5592J8095K0764K3943K6618
57993E38826K7911K8411K8328K6024K0545J4047R454P033N453M754N799P929R688
57980G34202J1019J2525J3504J2863J1066R132O759L554R30N57J938L772O437
57967H28258J0619J4594J5618J3254Q761K152p222j7803k6555l2479l6825m0038
$$ plain form
58057 767831 756656 744749 731815 717744 702171 685437 668481 651655 635034 619670 606850
58046 606850 596119 585771 575365 566053 558345 551309 544263 537574 531388 525197 519102 514088 510529
58033 510529 507626 504674 501689 498528 494569 489585 483927 477703 470761 463451 456314 449117 441366 433583
58019 433583 426864 421323 416227 411424 407271 403435 399239 394975 391374 388080 384355 381035 379937 381370
58005 381370 384052 387559 392936 400700 410129 420905 433814 449406 467501 488265 512208 538826
57993 538826 566737 595148 623476 649500 670045 684092 693546 700579 706032 710786 716585 724514 734202
57980 734202 745221 757746 771250 784113 795179 804311 811070 814624 815554 816111 818049 821821 828258
57967 828258 838877 853471 869089 882343 891104 893256 886034 868231 841676 809197 772372 732334
57955G32334m1073l9798l7528l5033l2071k8946k6383k3911k0428j6319j3025
57944D17819j0652q027n024k742j396K6J936L868N891Q504J1269J3367J5270J7992
57930D68101K1004K2801K3171K2992K2176K0115J7785J7019J7727J8090J7471
57919F88452J6900J6647J5646J3362J0052N088k499j1611j9561k5276k9830l3579
57907F43791l5335l4820l3432l1790k8999k5226k2609k2304k2697k1863k0006
57896C44710j8189j6238j3456j0148p199m925l211j962q08P27K374L379L851M684
57882B83589N923O523N973M858L618K114N50o34j971m428p456r251r279q791q482
57867B62856p587n846m387l838l258j892l86O66J830L568N261O421P490Q608Q999
$$ plain form
57955 732334 691261 651463 613935 578902 546831 517885 491502 467591 447163 430844 417819
57944 417819 407167 399140 394116 391374 389978 390004 391940 395808 401699 410203 421472 434839 450109 468101
57930 468101 489105 511906 535077 558069 580245 600360 618145 635164 652891 670981 688452
57919 688452 705352 721999 737645 751007 761059 766147 763648 752037 732476 707200 677370 643791
57907 643791 608456 573636 540204 508414 479415 454189 431580 409276 386579 364716 344710
57896 344710 326521 310283 296827 286679 279480 274555 271344 269382 268574 269301 271675 275054 278905 283589
57882 283589 289512 296035 302008 306866 310484 312598 313148 312514 310543 306115 298659 289408 280129 271338 262856
57867 262856 255269 249423 245036 241198 237940 236048 235662 236328 238158 241726 246987 253408 260898 269506 278505
57852B78505Q576Q656J0066J1741J2298J1806J0963R729P818N570L357J020j331
57839C78774k970l828m878o491p574p359o862p329q282q367p345n975m616l132
57825B93766j729p47O2J176K398L096L125K996L241L888M297L536J455p18j676
57810C18166j821k686m559o003n995n188m498l743k439q38N77J777K858L951N795
57795B95354R303J4049J8423K1736K4850K8172L0494L0685K8936K5396J9165J0143
57783E56706N89o829j1784j5592j8649k0135j9779j8280j6044j2853q883n089
57771D03378k335q04j98n9QJ6l60j267k542m193o381q759j0550j1564j2347j3101
57755C28942j3416j3368j3785j4823j5429j4829j3486j1870r475o002k564n05
$$ plain form
57852 278505 287081 295737 305803 317544 329842 341648 352611 362340 370158 375728 379085 380105 378774
57839 378774 375804 371976 367098 360607 353033 345674 338812 331483 323201 314834 307489 301514 296898 293766
57825 293766 292037 291290 291352 292528 294926 298022 301147 304143 307384 311272 315569 319105 320560 319842 318166
57810 318166 316345 313659 309100 303097 297102 291914 287416 283673 281234 280396 280973 282750 285608 289559 295354
57795 295354 304657 318706 337129 358865 383715 411887 442381 473066 502002 527398 546563 556706
57783 556706 557295 550466 538682 523090 504441 484306 464527 446247 430203 417350 408467 403378
57771 403378 401043 400239 400041 399982 399990 400006 399646 398379 395837 391644 385263 376504 365954 354390 342043 328942
57755 328942 315526 302158 288373 273550 258121 243292 229806 217936 208461 202459 199895 199390
57743A99390K42O26J006J171J244J514J837J973K135K493K682K475K344K654K904
57728B26690K441J414L92l89q53q29n09m76p59o49J13Q13R30Q11O92K62k26J89
57710B30057J401J777N93n51q7J124J340O63M29Q60J223J634K742M154M974N641
57694B57974P444J0299J2633J3372J2634J0649P584M381K197Q72o80k589l773
57681C32997l543k153K66L793P755J1068J3774J6961K1075K5653L0874L7883M7237
57668E43640N8441P1605Q8177J09424J35166J64062J92879K13921K15024J85775
57658A978114J26027M8610k6886q4305j17516j29817j28664j20797j10592j00541
57648A333633r1708q4060p7390p1988o8031o4714o0831n6066n0992m6045m1274
$$ plain form
57743 199390 199632 200258 201264 202435 203679 205193 207030 209003 211138 213631 216313 218788 221132 223786 226690
57728 226690 229131 230545 230937 230548 229695 228866 228357 227881 227122 226473 226586 227399 228329 229140 229832 230094 229868 230057
57710 230057 231458 233235 233828 233277 233190 234314 235654 236317 236746 237606 238829 240463 243205 247359 252333 257974
57694 257974 265418 275717 288350 301722 314356 325005 332589 336970 339167 340039 339359 336770 332997
57681 332997 329454 327301 327567 331360 339115 350183 363957 380918 401993 427646 458520 496403 543640
57668 543640 602081 673686 761863 871287 1006453 1170515 1363394 1577315 1792339 1978114
57658 1978114 2104141 2152751 2125865 2041560 1924044 1794227 1665563 1544766 1434174 1333633
57648 1333633 1241925 1157865 1080475 1008487 940456 875742 814911 758845 707853 661808 620534
57637F20534l6938l3347l0124k6530k2671j9537j7577j6059j4081j1585r145p238
57625C75702o046n486n180m713m025l332k707k096j542j083n39K21J019J781K845
57610C44819M445O172P526Q658J0052J1824J3948J6685J9996K3017K4926K6194
57598E18262K7990L0519L2795L3865L3416L1263K7206K1566J5088Q189P56p298
57586G73617j5627k3449k9607l3161l4435l4891l5396l5207l3506l0996k8891
57575D38451k7062k4617k1765j9593j8262j6950j5399j4030j2628j0559q299p140
57563B42147p195p195o565n989n676m722k880j378j135j477j493j390j553j495
57549A92004p68N9L06L10O55J019P74J33k08q2K54P45J307J473J015N91J073K439
$$ plain form
57637 620534 583596 550249 520125 493595 470924 451387 433810 417751 403670 392085 382940 375702
57625 375702 369656 364170 358990 354277 350252 346920 344213 342117 340575 339492 338953 339174 340193 341974 344819
57610 344819 349264 355436 362962 371620 381672 393496 407444 424129 444125 467142 492068 518262
57598 518262 546252 576771 609566 643431 676847 708110 735316 756882 771970 780159 780915 773617
57586 773617 757990 734541 704934 671773 637338 602447 567051 531844 498338 467342 438451
57575 438451 411389 386772 365007 345414 327152 310202 294803 280773 268145 257586 249287 242147
57563 242147 234952 227757 221192 215203 209527 204805 201925 200547 199412 197935 196442 195052 193499 192004
57549 192004 191236 191295 191601 191911 192566 193585 194359 194492 194284 194202 194456 195201 196508 197981 198996 199587 200660 203099
57531B03099L857M558M315L404K559K542L407M478N265N890O442O591O203N727
57517B68337N577N709O161P349R376J1557J3119J3976J4533J5242J6554J8612
57505D06102K0743K1979K2361K2949K4150K4943K4300K2471K0139J7083J2511
57494F39731O208j250q904j5434j9582k1351k2258k3638k5117k5502k4574k3119
57482D35210k1660k0143j8619j7292j5952j4234j2442j1377j1202j1167j0551
57471B70571r449q418p719p077o091m743l520k896k741k545k128j647r15N44K538
57456B13764M030M472M673N702P426Q858R659J0522J2086J4128J6060J7752J9619
57443C48751K1960K4387K6019K6301K5455K3933K1713J8479J4261R287L448l344
$$ plain form
57531 203099 206956 211514 215829 219233 221792 224334 227741 232219 237484 243374 249816 256407 262610 268337
57517 268337 273914 279623 285784 293133 302509 314066 327185 341161 355694 370936 387490 406102
57505 406102 426845 448824 471185 494134 518284 543227 567527 589998 610137 627220 639731
57494 639731 645939 644689 635785 620351 600769 579418 557160 533522 508405 482903 458329 435210
57482 435210 413550 393407 374788 357496 341544 327310 314868 303491 292289 281122 270571
57471 270571 261122 252704 244985 237908 231817 227074 223554 220658 217917 215372 213244 211597 210682 211226 213764
57456 213764 217794 222266 226939 232641 240067 248925 258584 269106 281192 295320 311380 329132 348751
57443 348751 370711 395098 421117 447418 472873 496806 518519 536998 551259 560546 563994 560650
57431E60650j0327j6240k0565k3678k5732k6356k5687k4625k3684k2464k0726
57420C20566j9040j7779j6436j4629j2975j2072j1375r997q117o655n960n671
57408A79860n536n568n583n341m943m616m245l634k929k306j627q08k08j15k27
57393A32174j65p5k39m95o27q60j403j907j969j761j526r02M12J747K127J650
57377A26181J340J710K233K363K274K366K552K480K158K011K248K429J931Q55
57363A55131N5l7r3p12j151l31J147J456J51j150j188o84p41j032p74l93p57j520
57345A47377j634j064o70o78m71J72P63J054J359J836K139J853Q74n66j837k186
57329A48321j567q05o02p80r08r96j061p67j67l4o04q44P4J324J625J191J221
$$ plain form
57431 560650 550323 534083 513518 489840 464108 437752 412065 387440 363756 341292 320566
57420 320566 301526 283747 267311 252682 239707 227635 216260 206263 198146 191491 185531 179860
57408 179860 174324 168756 163173 157832 152889 148273 144028 140394 137465 135159 133532 132724 132516 132401 132174
57393 132174 132009 131934 131695 131200 130573 129713 128310 126403 124434 122673 121147 120245 120657 122404 124531 126181
57377 126181 127521 129231 131464 133827 136101 138467 141019 143499 145657 147668 149916 152345 154276 155131
57363 155131 155186 155149 155056 154344 153193 152862 154009 155465 155616 154466 153278 152594 151853 150821 150047 149654 148897 147377
57345 147377 145743 144679 144009 143331 142860 143032 143795 144849 146208 148044 150183 152036 152910 152344 150507 148321
57329 148321 146754 145949 145347 144567 143659 142663 141602 140835 140668 140634 140030 139186 139260 140584 142209 143400 144621
57312A44621J930K451K389K203K083J749J330J391J974K528K801K963K943K572
57298A75928K285K814M154N563O516O991O993O658O564P140P933Q235Q180Q425
57284B64379Q999R385R449R439R249Q608P721O921N970M507K713P23k014n684
57270C40365r048j0737j1146j1668j2523j2898j2861j3358j4358j4710j3989j2980
57258A90089j2037j0567q476o633n453m389l242k617k631k414j478l93M12J344
57244A31515K581L428L420L089L069L290L514L808L990L529K522J923K310L202
57230A75190L948M460M743M633M412M710N382N425M528L769M210N591O998Q068
57216B46067Q974R922J1105J2575J3812J4067J3461J2908J2814J2609J1948J1412
$$ plain form
57312 144621 146551 149002 151391 153594 155677 157426 158756 160147 162121 164649 167450 170413 173356 175928
57298 175928 178213 181027 185181 190744 197260 204251 211244 217902 224466 231606 239539 247774 255954 264379
57284 264379 273378 282763 292212 301651 310900 319508 327229 334150 340120 344627 347340 348063 346049 340365
57270 340365 331317 320580 309434 297766 285243 272345 259484 246126 231768 217058 203069 190089
57258 190089 178052 167485 159009 152376 146923 142534 139292 136675 134044 131630 130152 129759 130171 131515
57244 131515 134096 137524 140944 144033 147102 150392 153906 157714 161704 165233 167755 169678 171988 175190
57230 175190 179138 183598 188341 192974 197386 202096 207478 212903 217431 221200 225410 231001 237999 246067
57216 246067 255041 264963 276068 288643 302455 316522 329983 342891 355705 368314 380262 391674
57204C91674J1590J2326J3269J4426J5726J6837J7768J8931K0260K1102K1276
57193E75185K1389K1760K1934K1619K1214K0916K0300J9288J8656J9008J9934
57182H01203K0719K1202K1563K1946K2657K4015K5727K7114K8127K9256L0309
57171A073838L0411K9483K8571K8254K7902K7013K6130K5710K5227K4209K3234
57160A369982K3035K3420K3925K4730K6126K7661K8594K8773K8519K8061K7578
57149A660404K7266K7074K6784K6550K6686K6894K6525K5712K5284K5414K5378
57138A949971K4913K4609K4707K4671K4340K4221K4340K4033K3376K3480K4689
57127B217350K5864K6096K5891K5946K6097K6337K7567L0306L3669L6559L8975
$$ plain form
57204 391674 403264 415590 428859 443285 459011 475848 493616 512547 532807 553909 575185
57193 575185 596574 618334 640268 661887 683101 704017 724317 743605 762261 781269 801203
57182 801203 821922 843124 864687 886633 909290 933305 959032 986146 1014273 1043529 1073838
57171 1073838 1104249 1133732 1162303 1190557 1218459 1245472 1271602 1297312 1322539 1346748 1369982
57160 1369982 1393017 1416437 1440362 1465092 1491218 1518879 1547473 1576246 1604765 1632826 1660404
57149 1660404 1687670 1714744 1741528 1768078 1794764 1821658 1848183 1873895 1899179 1924593 1949971
57138 1949971 1974884 1999493 2024200 2048871 2073211 2097432 2121772 2145805 2169181 2192661 2217350
57127 2217350 2243214 2269310 2295201 2321147 2347244 2373581 2401148 2431454 2465123 2501682 2540657
57116B540657M1438M4095M7138N1051N5735O0505O5552P2207Q1161R1775J03932
57105C255246J19108J38728J62887J91837K27487K72319L28057L96363M79512
57096E571544N79303O96649Q33606R94665J184860J407260J662574J948951K260112
57087A7139524K584109K904143L199220L444542L615241L691950L659775L499825
57079D3738329L187187K705975K070244J328783N47689k14561r22521j564032
57071E0877093k138562k641388l054750l353329l518789l550177l463362l284016
57063B5872720l040718k760267k464983k172085j894103j638941j410213j209019
57055I282391j035577q88816p65591o62037n75410n03687m44156l93879l50960
$$ plain form
57116 2540657 2582095 2626190 2673328 2724379 2780114 2840619 2906171 2978378 3059539 3151314 3255246
57105 3255246 3374354 3513082 3675969 3867806 4095293 4367612 4695669 5092032 5571544
57096 5571544 6150847 6847496 7681102 8675767 9860627 11267887 12930461 14879412 17139524
57087 17139524 19723633 22627776 25826996 29271538 32886779 36578729 40238504 43738329
57079 43738329 46925516 49631491 51701735 53030518 53578207 53363646 52441125 50877093
57071 50877093 48738531 46097143 43042393 39689064 36170275 32620098 29156736 25872720
57063 25872720 22832002 20071735 17606752 15434667 13540564 11901623 10491410 9282391
57055 9282391 8246814 7357998 6592407 5930370 5354960 4851273 4407117 4013238 3662278
57046C662278l13950k80674k49232k19684j93278j70355j50318j32983j18415
57037A833389j05884r4548q4641p6637o9831o3310n7504n3161m9407m4828l9881
57026A093757l6233l4031l1783k8859k6205k4510k3274k1886k0215j8209j6004
57015H12548j4298j3534j3093j2243j1160j0058q310n693l336k063r69Q87K777
57002G21455L920N244P802J1056J4574J9596K6883L5110M3644N4617O9791Q8486
56990A102178J11471J43383J87749K44075L13546L98080M81133N14672M45700
56981C941987K66627L2102j80889l25547l98478m16961l98436l57826l08646k59488
56971A594445k13270j71784j37558j10989q9616p1424n6270m3881l3208k3982
$$ plain form
57046 3662278 3348328 3067654 2818422 2598738 2405460 2235105 2084787 1951804 1833389
57037 1833389 1727505 1632957 1548316 1471679 1401848 1338538 1281034 1227873 1178466 1133638 1093757
57026 1093757 1057524 1023493 991710 962851 936646 912136 888862 866976 846761 828552 812548
57015 812548 798250 784716 771623 759380 748220 738162 729852 724159 720823 718760 717791 718678 721455
57002 721455 725375 730619 738421 749477 764051 783647 810530 845640 889284 943901 1013692 1102178
56990 1102178 1213649 1357032 1544781 1788856 2102402 2500482 2981615 3496287 3941987
56981 3941987 4208614 4240716 4059827 3734280 3335802 2918841 2520405 2162579 1853933 1594445
56971 1594445 1381175 1209391 1071833 960844 871228 799804 743534 699653 666445 642463
56961F42463j6599j0465m492J109N585R421J2932J3818Q960j289j2993k2740k9588
56948E96122l3227l3040k9684k5391k1740j8508j5116j1759q670n621k564K28
56936C91030K992O425J0691J5329K0179K5510L0986L5145L5875L1185K0253M653
56924F30253j1792k5179l3614l7124l6606l3501k9520k5519k1204j6597j2844
56913C46753j0739r465p964o520n829n422m424l206k781l117l322l063k599j911
56899B76391r57l14l96n63l6Q78J528K172L285M332M648M971O680R816J3094J5444
56883C40973J6192J4127Q124j076j0777j8241k2160k2683k0980j8503j5749j1986
56871B37261o749j080L611P274J0876J4891J9243K4236L0356L7444M5085N3508
$$ plain form
56961 642463 625864 615399 610907 612016 617601 627022 639954 653772 662732 661443 648450 625710 596122
56948 596122 562895 529855 500171 474780 453040 434532 419416 407657 398987 393366 390802 391030
56936 391030 394022 400447 411138 426467 446646 472156 503142 538287 574162 605347 625600 630253
56924 630253 618461 593282 559668 522544 485938 452437 422917 397398 376194 359597 346753
56913 346753 336014 326549 318585 312065 306236 300814 296390 293184 290403 287286 283964 280901 278302 276391
56899 276391 275434 275120 274724 274161 274125 275003 276531 278703 281988 286320 290968 295939 302619 312435 325529 340973
56883 340973 357165 371292 379416 378340 367563 349322 327162 304479 283499 264996 249247 237261
56871 237261 230512 229432 233043 240317 251193 266084 285327 309563 339919 377363 422448 475956
56859D75956O2851P1342P4961O9322N2356K6277k561k6864m2666n0401n2112m9101
56847F09360m2735l5310k8372k1303j3112m588K899R693J7256K6090L5946M7404
56835F03228O1474P7971R5360J11026J19961J14642Q9663M7513j556m5906p8196
56824A195180r6354j01990r8726r0316p9116o6379n3491m1784l1397k1677j2506
56813E01444m048M511J4505K6137L8607N1733O5846P9510Q8386Q7012P1706M2861
56801A068210N855l0536n8434p4719q0862p9857p4156o5712n6170m6568l7581
56790D69470k9812k3255j7074j0720m633J039P451J5509K4226L2055L8772M4124
56778E47152M5407L8938K4144M554j5254l2034m3648m8969m8864m5762m1537l6687
$$ plain form
56859 475956 538807 610149 685110 754432 806788 833065 830504 803640 760974 710573 658461 609360
56847 609360 566625 531315 502943 481640 468528 463940 466839 476532 493788 519878 555824 603228
56835 603228 664702 742673 838033 949059 1069020 1183662 1273325 1320838 1319282 1273376 1195180
56824 1195180 1098826 996836 898110 807794 728678 662299 608808 567024 535627 513950 501444
56813 501444 497396 501907 516412 542549 581156 632889 698735 778245 866631 953643 1025349 1068210
56801 1068210 1074065 1043529 985095 910376 829514 749657 675501 609789 553619 507051 469470
56790 469470 439658 416403 399329 388609 383976 385015 392466 407975 432201 464256 503028 547152
56778 547152 592559 631497 655641 660195 644941 612907 569259 520290 471426 425664 384127 347440
56766C47440l1599k7103k3486k0207j7014j4300j2149j0142q245o875o013n213
56754A65094m492m203m093l595k868k485k301j813j389j731k370k140j086m00
56740A30128m96n70k15Jk21l90k63k14l84m99n92q96j075o28R7M00M07N84N14
56721A25688l93j362j124o1L32r2q7N55O53ko5J021J973J746R67N01J69k31p2
56702A30116R20J760J489M47m35p67o07k2O79J039J083J182J249R03M52O26J356
56685A41470J929K325L095L963L980L218K860L336L901M218M808N510N184L550
56671A93347J904J227R52K89m79q39j003j193r92j16R21J537J693J399N28n02
56655A98673q00j79N51P57N58K2j153k821m220m978n388n553n174m324l464k684
$$ plain form
56766 347440 315841 288738 265252 245045 228031 213731 201582 191440 183195 176320 170307 165094
56754 165094 160602 156399 152306 148711 145843 143358 141057 139244 137855 136124 133754 131614 130528 130128
56740 130128 129632 129062 128847 128848 128627 128237 127974 127760 127376 126877 126285 125389 124314 123686 123783 124183 124590 125174 125688
56721 125688 125295 123933 122809 122748 123080 122988 122901 123456 124109 124107 124042 125063 127036 128782 129749 130250 130419 130188 130116
56702 130116 131036 132796 134285 134732 134297 133530 132923 132901 133580 134619 135702 136884 138133 139036 139488 140114 141470
56685 141470 143399 145724 148819 152782 156762 159980 162840 166176 170077 174295 179103 184613 189797 193347
56671 193347 195251 196478 197430 197719 197240 196401 195398 194205 193213 193097 194018 195555 197248 198647 199175 198673
56655 198673 197873 197694 198245 199002 199560 199582 198429 195608 191388 186410 181022 175469 170295 165971 162507 159823
56639A59823j856j458j942k480j769l2J265J776K571L864M318L192J569P06O02
56624A70149Q74J625K673L197K889K397K093J561Q68R18J906K588J902K42j435
56609A94447k746l564l691l475l738m531m875m167k905j743q42l80n52q91o86
56594A55661k38m18r54o58N01J209R88Q77J499K119K246K432K893K844K005J247
56578A74253J083R13M61M39J093J538J320J176J557J816J554J341J430J257Q88
56563A92119J386K963M316M585M468M538M189L231K890L927N232N516N189N372
56549B49921O097O603O542N944M867L793L383L400K850J588N15j25j053k267k785
56534B89273k584k919m071m671m147l789m425n016m703m403n007n743n677n217
$$ plain form
56639 159823 157967 156509 154567 152087 150318 150286 151551 153327 155898 159762 164080 167272 168841 169547 170149
56624 170149 171023 172648 175321 178518 181407 183804 185897 187458 188326 189244 191150 193738 195640 195882 194447
56609 194447 191701 188137 184446 180971 177233 172702 167827 163660 160755 159012 158170 157790 157238 156347 155661
56594 155661 155423 155005 154051 153393 153894 155103 156091 156968 158467 160586 162832 165264 168157 171001 173006 174253
56578 174253 175336 176249 176710 177149 178242 179780 181100 182276 183833 185649 187203 188544 189974 191231 192119
56563 192119 193505 196468 200784 205369 209837 214375 218564 221795 224685 228612 233844 239360 244549 249921
56549 249921 256018 262621 269163 275107 279974 283767 287150 290550 293400 294988 295503 295378 294325 292058 289273
56534 289273 286689 283770 279699 275028 270881 267092 262667 257651 252948 248545 243538 237795 232118 226901
56520B26901m881m183l057k679l494m095l492k788l142l670l158k241k097k288
56506A81636j794j021r63j284j017l77k69p00r96j011r03m78J90L62k42q22q96
56489A69415j145j959k413j760o88p2K51N21J66r28j668j335o55k48M74J792K588
56472A62336K100J218Q87O38j6l52P2K89l37p67j49N96M75J42L93N67K4l24L92
56453A68184J372J659J750K182K096R31j18mM16K21K80J413K454K211J730K404
56437A89181L379L091K023J683K023K102K098K506K561J565O81J213K192J874
56423B18172N97n0R1K4k85j22L56O18R48J545J458J53j058r63m87r64j788j730
56405B16515j230j301j518j122q03j227j341k26Q00L02o49m38Q9p51k261k575
$$ plain form
56520 226901 222020 217837 214780 212101 208607 204512 201020 198232 195090 191420 188262 186021 183924 181636
56506 181636 179842 178821 177858 176574 175557 175180 174911 174211 173215 172204 171301 170823 171013 171375 171133 170311 169415
56489 169415 168270 166311 163898 162138 161450 161378 161629 162150 162316 161388 159720 158385 157730 157482 157956 159748 162336
56472 162336 164436 165654 166541 167179 167163 166811 166883 167172 166835 166068 165919 166515 166990 167132 167525 168092 168116 167792 168184
56453 168184 169556 171215 172965 175147 177243 178174 178056 178052 178468 178689 178969 180382 182836 185047 186777 189181
56437 189181 192560 195651 197674 199357 201380 203482 205580 208086 210647 212212 212893 214106 216298 218172
56423 218172 218769 218719 218810 218834 218549 218427 218783 219401 220349 221894 223352 223505 222447 221484 220997 220033 218245 216515
56405 216515 215285 213984 212466 211344 210541 209314 207973 207747 208547 208849 208200 207762 207851 207100 204839 202264
56389B02264j891j689j828j260n81j030j845j467l93j26k30O24J587P32j425k539
56373A88903k112j709j876j698j069p24k87J078K523K555J822K195L542M018L187
56358B00348K309J856J336J118J861K537J535n48j774j982k533l472l572k838
56344A96181k345j922o11R63J286P05Q88J896K333K041K052K212J470K60M7P62
56328B08218J042O87N18L49l90o97P26K829L449K674K240K358J894J184J679L128
56312B31888L881L676L486L192K060R92J458K741K991K310K052J969J030J97J074
56297B64997K610K463R73L82Q08M47p44j220j132j857k703j782K31Q94K31M54
56281B65052J685J885Q80O17J350J350M90L93R75N52n82m72O67O88l63k98R69
$$ plain form
56389 202264 200373 198684 196856 195596 195015 193985 192140 190673 190280 190154 189924 190548 192135 192867 191442 188903
56373 188903 186791 185082 183206 181508 180439 179715 179428 180506 183029 185584 187406 189601 193143 197161 200348
56358 200348 202657 204513 205849 206967 208828 211365 212900 212352 210578 208596 206063 202591 199019 196181
56344 196181 193836 191914 191303 192266 193552 194257 195145 197041 199374 201415 203467 205679 207149 207409 207456 208218
56328 208218 209260 209947 210465 210814 210424 209727 210453 213282 216731 219405 221645 224003 225897 227081 228760 231888
56312 231888 235769 239445 242931 246123 248183 249175 250633 253374 256365 258675 260727 262696 263726 263923 264997
56297 264997 267607 270070 271043 271425 272233 272680 271936 270716 269584 267727 265024 263242 263473 264367 264598 265052
56281 265052 266737 268622 269502 270119 271469 272819 273309 273702 274677 275229 274647 274175 274842 275530 275167 274869 275838
56264B75838J261M21O59K305L127K450K020K383K210J575K111L478L546K433K460
56249C08277L767L996K687J928K276K125J541K431M377M607K752J466J821K245
56235C46296K423L738N418M866K485J486K249J769n41j684o95k85j437j623J9
56220C64484P27o60j553n80kr93j206O75K344K113J557J788J350q5j22K024L608
56203C75469K908J823J949K110J737K580M951O247N278M220M466M468L405K958
56189D24569L597L328J747J205K293K642J728K123M280N014L148J735K460K908
56175D62777J668J116K560L543K651K138L218L543K082J541L148M065K840K414
56161D99304M598O534N955N170O457Q110Q395Q889J0662J1617J0820J0918J3230
$$ plain form
56264 275838 277099 277520 278179 280484 283611 286061 288081 290464 292674 294249 296360 299838 303384 305817 308277
56249 308277 312044 316040 318727 320655 322931 325056 326597 329028 333405 338012 340764 342230 344051 346296
56235 346296 348719 352457 357875 362741 365226 366712 368961 370730 370189 368505 367810 367525 366088 364465 364484
56220 364484 365211 364551 362998 362418 362416 361423 360217 360892 363236 365349 366906 368694 370044 369959 369837 371861 375469
56203 375469 378377 380200 382149 384259 385996 388576 393527 399774 405052 409272 413738 418206 421611 424569
56189 424569 428166 431494 433241 434446 436739 439381 441109 443232 447512 452526 455674 457409 459869 462777
56175 462777 464445 465561 468121 471664 474315 476453 479671 483214 485296 486837 489985 494050 496890 499304
56161 499304 503902 510436 516391 521561 528018 536128 544523 553412 564074 575691 586511 597429 610659
56148F10659J5033J4768J5124J7866K0575K1732K3955K8798L3424L6038L9616
56137H77588M6626N5096O3675P5554R3344J14864J37762J63330J91754K18213
56127B037806K37487K47804K46997K30821J99713J62503J29138J03806Q7716Q1928
56117C765719Q2765Q0282O6925M3956J6420j2405l7893n2714n4711n1485n2584
56106C794275o1962q1222j12680j53254j91594k17739k31071k34413k26914k08536
56096B074890j85157j62345j39182j14084r1111p4330o1375m8740l8201l1868
56086A128497k6475j8873j1947q918p064l090Q31K304M125Q366J1117R385P087
56073A095345P752P790L723n47q67n89l713o861n755l339l625l795l27L441L842
$$ plain form
56148 610659 625692 640460 655584 673450 694025 715757 739712 768510 801934 837972 877588
56137 877588 924214 979310 1042985 1118539 1211883 1326747 1464509 1627839 1819593 2037806
56127 2037806 2275293 2523097 2770094 3000915 3200628 3363131 3492269 3596075 3683791 3765719
56117 3765719 3848484 3928766 3995691 4039647 4056067 4043662 4005769 3953055 3898344 3846859 3794275
56106 3794275 3732313 3651091 3538411 3385157 3193563 2975824 2744753 2510340 2283426 2074890
56096 2074890 1889733 1727388 1588206 1474122 1383011 1308681 1247306 1198566 1160365 1128497
56086 1128497 1102022 1083149 1071202 1062284 1055220 1052130 1052961 1055265 1059390 1067756 1078873 1088258 1095345
56073 1095345 1103097 1110887 1114610 1114063 1113196 1112607 1108894 1102033 1096278 1092939 1089314 1085519 1085192 1088633 1092475
56058A092475M387Q614J2212J0750Q446J0577J3864J3470J2613J5865J9615J8830
56046A241718J6768J8363K0609J9155J7644K0527K3521K1434J8459K0255K2944
56035A461397K0834J7868K0218K4580K5146K5110K9643L4780L5018L4529L8924
56024A768047M3554M2325M0119M3633M8147M6763M4364M8425N4303N4253N2595
56013B286528N6955O2917O2911O1823O7773P5831P7413P7196Q3736R2123R3510
56002C098716R2990R9781J08739J10403J10196J18211J29378J33844J37217J49722
55992D289197J65324J73366J80434J97966K19154K31868K43161K65803K92254
55983F258527L08346L20592L42277L65482L76672L86709M13859M50647M80813
$$ plain form
56058 1092475 1096862 1105476 1117688 1128438 1136884 1147461 1161325 1174795 1187408 1203273 1222888 1241718
56046 1241718 1258486 1276849 1297458 1316613 1334257 1354784 1378305 1399739 1418198 1438453 1461397
56035 1461397 1482231 1500099 1520317 1544897 1570043 1595153 1624796 1659576 1694594 1729123 1768047
56024 1768047 1811601 1853926 1894045 1937678 1985825 2032588 2076952 2125377 2179680 2233933 2286528
56013 2286528 2343483 2406400 2469311 2531134 2598907 2674738 2752151 2829347 2913083 3005206 3098716
56002 3098716 3191706 3291487 3400226 3510629 3620825 3739036 3868414 4002258 4139475 4289197
55992 4289197 4454521 4627887 4808321 5006287 5225441 5457309 5700470 5966273 6258527
55983 6258527 6566873 6887465 7229742 7595224 7971896 8358605 8772464 9223111 9703924
55974I703924N14555N71040O41089P05670P75921Q73752R89496J103383J231854
55965A7110684J404883J616880J853201K144094K531810L004177L526320M117396
55957C7309445M826590N662572O633682P832636R388579J1372361J3865837J7080655
55949A13972357K1252973K6440310L2526911L9173041M5198689M7931051M3966935
55942C70462267L1591338J2762526p593066k4521860l5497600m0600354m1197397
55935B65405854l8821315l4796315l0144958k5506475k1203557j7420416j4261012
55928H3251806j1698763r616908p927008o588048n535416m679459l972166l406737
55920B9827301k955575k569357k231545j956331j735563j538180j357490j210657
$$ plain form
55974 9703924 10218479 10789519 11430608 12136278 12912199 13785951 14775447 15878830 17110684
55965 17110684 18515567 20132447 21985648 24129742 26661552 29665729 33192049 37309445
55957 37309445 42136035 47798607 54432289 62264925 71653504 83025865 96891702 113972357
55949 113972357 135225330 161665640 194192551 233365592 278564281 326495332 370462267
55942 370462267 402053605 414816131 407223065 382701205 347203605 306603251 265405854
55935 265405854 226584539 191788224 161643266 136136791 114933234 97512818 83251806
55928 83251806 71553043 61936135 54009127 47421079 41885663 37206204 33234038 29827301
55920 29827301 26871726 24302369 22070824 20114493 18378930 16840750 15483260 14272603
55912A4272603j094113r83558q75337p86572p16654o46954n76331n20694m79412
55903G592978m36227l91123l58733l37308l10560k78357k55582k42406k24664
55894D758018k02194j88543j83486j73052j56384j46410j44025j36748j23216
55885C303960j14711j11854j03249q8178p7996p3805o4478m8358l5982k9440j8959
55874B536950j902J3878K7364M6605P1664R2684J06056J15437J15943R5444N4195
55863C274318O887l6806p8227j15456j40003j50676j55498j57091j50314j36228
55853B160906j23828j15406j04160q8642p6052o8696o0538m9598m0925l4757k4527
55842A373777r670J318L347o16q758k2702l8738m8326m9814m9320m8770m3875
$$ plain form
55912 14272603 13178490 12194932 11319595 10533023 9816369 9169415 8593084 8072390 7592978
55903 7592978 7156751 6765628 6406895 6069587 5759027 5480670 5225088 4982682 4758018
55894 4758018 4555824 4367281 4183795 4010743 3854359 3707949 3563924 3427176 3303960
55885 3303960 3189249 3077395 2974146 2885968 2807972 2734167 2669689 2621331 2585349 2555909 2536950
55874 2536950 2535048 2548926 2576290 2622895 2694559 2787243 2893299 3008736 3124679 3220123 3274318
55863 3274318 3281205 3244399 3166172 3050716 2910713 2760037 2604539 2447448 2297134 2160906
55853 2160906 2037078 1921672 1817512 1728870 1652818 1584122 1523584 1473986 1433061 1398304 1373777
55842 1373777 1364107 1365425 1368772 1368156 1359398 1336696 1297958 1249632 1199818 1150498 1101728 1057853
55830A057853l4976k8346k4947j9200j0663n729n708m518m98N14l427o610o117
55817I07628n863p430o835l339j909m093n586n329p686j3211j6561j6237j7103
55804G96446k0620k1803j8700j5912j5628j3982r433o226o430o636n565o804j1047
55791F37660j3570j2421j1420j2212j1212p180l993l059o09M490P975Q219R381
55778E92049J3332J5838J3983J0289O347l42r823j7065j9403k0074k1197j9952
55766E43982j4961r775o512k376M013Q854R162O809L764r10o486r142q122p619
55752E10681r774j1633j1514j2138j4636j5768j4187j3283j4665j5024j2700j1140
55740C54219j2356j2972j0620q326q629q886o498l554k311j021J759L498K202
$$ plain form
55830 1057853 1022877 994531 969584 950384 939721 933992 928284 923766 923268 923782 920355 913745 907628
55817 907628 901765 894335 887500 884161 882252 878159 872573 867244 859558 846347 829786 813549 796446
55804 796446 775826 754023 735323 719411 703783 689801 680368 674142 667712 661076 655511 648707 637660
55791 637660 624090 611669 600249 588037 576825 569645 565652 562593 561984 566474 574449 582668 592049
55778 592049 605381 621219 635202 645491 651838 651496 641673 624608 605205 585131 563934 543982
55766 543982 529021 519246 512734 510358 514371 523225 532387 539196 542960 542050 535564 526422 518300 510681
55752 510681 500907 489274 477760 465622 450986 435218 421031 407748 393083 378059 365359 354219
55740 354219 341863 328891 318271 309945 301316 292430 285932 282378 280067 279046 280805 284303 286505
55727B86505J63m85j479m261o548o546o293p474q128o842n845o684p042n182l377
55712B10482l583l838k173j79M92J259L221M608M559N388Q044R381P031L154L29
55697B48175k275n618p785p543p105q139q625o799m591m062l945k710j604j698
55683A75676j343N50K115K056K107L445M293L633L501M973N688M181K787L398
55669B17060M204L585L301M716N672M359K604K140J217j827n247p245r081j1642
55655B13816j2681j0781q418p673o556l143K68R57L41Q76J659R40P4R27K191K043
55639A74840J886L668O022O718O572P356Q106P046M909L158J097k077m701n237
55625B19363n117o017o734n667l885k796j369J241L093K632J794K686L829K948
$$ plain form
55727 286505 286668 286183 284704 280443 273895 267349 261056 253582 245454 238612 232767 226083 219041 213859 210482
55712 210482 206899 203061 200888 200709 201201 202460 205681 210289 214848 220236 228280 237661 244692 247846 248175
55697 248175 245900 240282 232497 224954 217849 209710 201085 194286 189695 185633 181688 178978 177374 175676
55683 175676 174333 174883 176998 179054 181161 184606 188899 192532 196033 201006 206694 210875 213662 217060
55669 217060 221264 224849 228150 232866 238538 242897 245501 247641 248858 247031 241784 234539 225458 213816
55655 213816 201135 190354 181936 174263 167707 164564 164832 165789 166130 167006 168665 169605 169679 170606 172797 174840
55639 174840 176726 180394 186416 193134 199706 207062 215168 222214 227123 230281 231378 229301 224600 219363
55625 219363 214246 208229 201495 195828 191943 189147 187778 189019 192112 194744 196538 199224 203053 206001
55611B06001R04n23k097m919p307p423o650p022p640p000o333p082p618o044l947
55596A25300l634m027k956j342j242j934j693j380k445l409k205j30L73n1N24
55581I9749J280M71n77M82K562K985K311L099N056N747N294O028Q095R388R564
55566A61534J0424J2432J4230J5327J6157J5790J2628P170J438l856r068j3366
55554B40840j5446j5828j5897j5481j3774j1577j0164r016p198n726n858o436
55542A08439n618m037l527l991m276m739o079o997o017m309l768l685k320l32
55528D8744N48Q92K285L993M234L591L818M383L605K123J781K105J370J61K34
55513H3867P72n04l128m390l583k258r35R79K526K142Q90J200K715K930J693J374
$$ plain form
55611 206001 206905 206382 204285 199366 192059 184636 177986 170964 163324 156324 149991 142909 135291 129247 125300
55596 125300 121666 117639 114683 113341 112099 110165 108472 107092 104647 101238 99033 98903 99276 99225 99749
55581 99749 101029 101500 100923 101405 103967 106952 109263 112362 117418 123165 128459 134487 142582 151970 161534
55566 161534 171958 184390 198620 213947 230104 245894 258522 265692 267130 263274 254206 240840
55554 240840 225394 209566 193669 178188 164414 152837 142673 133657 126459 120733 114875 108439
55542 108439 102821 98784 95257 91266 86990 82251 76172 69175 63158 58849 55081 51396 49076 48744
55528 48744 49292 50184 52469 56462 60696 64287 68105 72488 76093 78216 79997 82102 83472 83633 83867
55513 83867 84639 84135 81007 76617 73034 70776 69841 70820 73346 75488 76378 77578 80293 83223 84916 86290
55497H6290K620L593L569L814M590M573L639L142L099K067O5j345k077l642o017
55482A07980p322o986o417o199n397l944l043k856k277j329j265k056k262j515
55468E5112q51n35J1K88o78j890j373M82J350P44M74J101J045k73j215o92L68
55451E3468R85J276J151J27j073r22L84J025M56P6N87R35L85m07q53j080q72J82
55433E5830J267J037j62o38K7O74P68R19J193R73M96N60Q03K74n85n92j26n06
55415F2212j377j223j79J65l22j79R32J898K489L431M224L618K266K147L115K906
55399H6123Q80r89j372j153j186j108r85j611k602k526j464j096j762j987j344
55384F5818j171j829j909r78n04j112j439p16k06q65j758j887j659j557j190o31
$$ plain form
55497 86290 88910 92503 96072 99886 104476 109049 112688 115830 118929 120996 121061 119716 117639 113997 107980
55482 107980 100658 93672 87255 81056 75659 71715 68672 65816 63539 62210 60945 58889 56627 55112
55468 55112 54261 53726 53737 54025 53347 51457 50084 50566 51916 52660 53134 54235 55280 55007 53792 53100 53468
55451 53468 54453 55729 56880 57007 55934 55012 55396 56421 56877 56953 57540 58475 58860 58453 57600 56520 55648 55830
55433 55830 57097 58134 57972 57334 57361 58035 58803 59722 60915 61888 62384 62944 63747 64021 63436 62844 62718 62212
55415 62212 60835 59612 59433 59598 59276 59097 60029 61927 64416 67847 72071 75689 77955 80102 83217 86123
55399 86123 87003 86014 84642 83489 82303 81195 80210 78599 75997 73471 72007 70911 69149 67162 65818
55384 65818 64647 62818 60909 59931 59427 58315 56876 56160 55954 55089 53331 51444 49785 48228 47038 46407
55368D6407p71j584j777r24j84k03j76L73P00M03J50K71K71J31L54M73m90j867
55350D1557j769n8J272J156O42N66L49k05k06M62O69J45K5O21P70J03j83M13Q15
55331D7144M82K56L80j34j314j609m67O64Q12Q60J388J314p9j652k212k096j921
55314D1816j429o28l39o83n99J76L75o50j725j643p02L42J228J533P47l67k67
55297C7185R82J651J111O19P98O58j52m08M13J057P42L68N03L40l08j92J004J622
55279D7993O34o80r47o93p90q55m87l38o61n28L56Q40L99J36O13P41ll65L19O27
55259D6311m85j760j770j108q38n48L13R14N85K84Q95J541J308R60J355J652Q28
55242E0437m26j046j367j940k012j005j29o58j753j782p79J03N25P41M52m69r95
$$ plain form
55368 46407 45636 44052 42275 41351 41167 40964 40788 41161 41861 42264 42414 42685 42956 43087 43441 43914 43424 41557
55350 41557 39788 39730 41002 42158 42800 43366 43715 43510 43304 43766 44435 44580 44605 45226 45996 46099 45916 46329 47144
55331 47144 47626 47882 48262 48128 46814 45205 44738 45402 46214 47074 48462 49776 49697 48045 45833 43737 41816
55314 41816 40387 39759 39420 38737 38138 38314 38689 38039 36314 34671 33969 34311 35539 37072 37819 37452 37185
55297 37185 38167 39818 40929 41548 42346 43004 42852 42444 42857 43914 44656 45024 45527 45867 45559 45367 46371 47993
55279 47993 48627 47947 47000 46307 45517 44662 44175 43837 43176 42648 43004 43844 44243 44379 44992 45733 45730 45365 45684 46311
55259 46311 45826 44066 42296 41188 40350 39802 40115 41029 41614 41898 42793 44334 45642 46602 47957 49609 50437
55242 50437 50011 48965 47598 45658 43646 42641 42512 41854 40101 38319 37540 37643 38168 38909 39361 38892 37897
55225C7897k60R76J509J418J301Q67k18j074p12L36Q37O00K58O2o3KJ04k96j019
55206D2525j042j70M11K5m40k20Q4n6j8N23O16k59j038q52m15l59R6J382K129
55187D2922J171m36j077r18r47j005m91J60L55N90J225J326K82o51j33J092J546
55170D5011J324J322J257L84p83j235j150j147p95M03J466J123k02j214j702k118
55154D1944k048r03N41R93N43J98J86J64M24J347K220K031R91J2o88j344j726
55137D4885j683j742k051j672j29J329J418O89M02N37L81J59M59R28R36Q03R91
55120D6640J015M58Q5N50J107R21N48O71O28k07q35j86Q52Q45J71Q4L76oq35r79
55100E1903l48K42N36O46K55n60p19R1K80j253k936k730j232m08l77O8P35M72
$$ plain form
55225 37897 37637 38613 40122 41540 42841 43708 43490 42416 41704 42040 42877 43477 43735 43797 43734 43736 43840 43544 42525
55206 42525 41483 41313 41724 41749 41309 41089 41173 41117 41099 41622 42238 41979 40941 40089 39674 39315 39411 40793 42922
55187 42922 44093 43657 42580 41662 40715 39710 39219 39379 39734 40324 41549 42875 43157 42506 42373 43465 45011
55170 45011 46335 47657 48914 49298 48515 47280 46130 44983 44188 44591 46057 47180 46978 45764 44062 41944
55154 41944 39896 38993 39534 40527 41070 41268 41454 41618 42042 43389 45609 47640 48631 48643 47955 46611 44885
55137 44885 43202 41460 39409 37737 37608 38937 40355 41044 41446 41983 42364 42523 42982 43910 44846 45649 46640
55120 46640 47655 48113 48198 48748 49855 50776 51324 51995 52623 52416 51581 51395 52247 53092 53263 53347 53723 53717 52882 51903
55100 51903 51555 51797 52333 52979 53234 52674 51955 52046 52326 51073 48137 45407 44175 43767 43390 43458 44193 44665
55082D4665l80m58J05P1m53l42K15N0o27n72O1J4n66l48N44O11k32m04M77Q99
55062D3330J67l99K35J240J454R68M04o6l84l36n6Rk49o82j302j807j324K21J293
55043D2716P45k44P9J172J123j78r94o33j20o0R2M98O21O05J139J817J461K36
55025E0075l52K38R83J126R94Q13L83O7N00J226J168N27N68J425J879J359N43
55008F3522j23q01j018J17K226L778M146M036L816L070J958J323J160O46k24n92
54992H7040l98m28o13r9Q42Q50l07j356j630j789k096j866j103q35j278j398q63
54975G2673o42j093j183l99K50m5o62q23p29n82J28J473K432K290J666J441J503
54958G7698J215M07n65j065n14Q49J678J011k00k85P61J563J697J985K488K250
$$ plain form
55082 44665 44285 43827 43932 44003 43550 43208 43423 43473 42846 42274 42335 42349 41783 41435 41979 42590 42358 41954 42431 43330
55062 43330 43497 43098 43333 44573 46027 46995 47399 47333 46949 46613 46557 46566 46317 45635 44333 42526 41202 41423 42716
55043 42716 43461 43217 43296 44468 45591 45413 44419 43786 43666 43606 43698 44196 44817 45422 46561 48378 49839 50075
55025 50075 49723 49961 50944 52070 53064 53877 54260 54327 54827 56053 57221 57748 58316 59741 61620 62979 63522
55008 63522 63399 62598 61580 61697 63923 67701 71847 75883 79699 82769 84727 86050 87210 87856 87632 87040
54992 87040 86642 86214 85601 85502 86344 87194 86887 85531 83901 82112 80016 78150 77047 76212 74934 73536 72673
54975 72673 72031 70938 69755 69356 69606 69561 68899 68076 67347 66765 66893 68366 70798 73088 74754 76195 77698
54958 77698 78913 79320 78755 77690 77176 78025 79703 80714 80514 80229 80990 82553 84250 86235 88723 90973
54942I0973J243P02J069J387J211J351K181K927L318M259O122P857Q653R141J0193
54927A52587J1734J3340J4770J5305J3821J0136N270J24m938r151j1557j2462
54915A98979j3202j4105j4208j3261j2168j1099r094o184m055l671l920l493k565
54902H7954j716p39L95Q87M14j07N3M79P85J432K555L375L613M224N852P850R614
54885A26920J1549J3850J5607J6047J5443J3990J1078O571J588k891p007j0824
54873B11921j3452j4285j3992j3357j2271j0637r095q017o980n899n394n343m557
54860H8642k715j113n64j66Q44J607J351R96J552K216J676K53p84j107j203j192
54844I0293j056j318k225l076l324l447l703l248j676k62k51r97j228j103j433
$$ plain form
54942 90973 92216 92918 93987 95374 96585 97936 100117 103044 106362 110621 116743 124600 133253 142394 152587
54927 152587 164321 177661 192431 207736 221557 231693 236963 237087 232149 222998 211441 198979
54915 198979 185777 171672 157464 144203 132035 120936 111842 105658 101603 97932 94012 90519 87954
54902 87954 86238 85499 85894 86781 87195 87088 87141 87620 88405 89837 92392 95767 99380 103604 109456 117306 126920
54885 126920 138469 152319 167926 183973 199416 213406 224484 231055 232643 229752 222745 211921
54873 211921 198469 184184 170192 156835 144564 133927 124832 116815 109835 103936 98542 93199 88642
54860 88642 85927 84814 84250 84084 84928 86535 87886 88882 90434 92650 94326 94579 93795 92688 91485 90293
54844 90293 89237 87919 85694 82618 79294 75847 72144 68896 67220 66958 66707 65710 64482 63379 61946
54829F1946j818j445q77j242k035j713j83J014R76L65o3l29m72k18K46K49k40
54812E4161l74L06J150J314Q34L53K02J85J65M28J239K105K041Q91j45O4J024
54795F5943J363P87K36K18L09L94J076K486L849M627N071N375N370N344N960P068
54779A15476P868Q493R948J2207J4003J5001J6367J8343J9166J7551J4576J1685
54767B80684Q363L402k640p967j1671j3971j5069j5080j4589j4097j3378j2150
54755A71837j0674r110p166n194m370m866n073l772j910j011j007r37p00o42l44
54740A15061O12J490J489J295K048L487M581N381O748Q663J0348J1669J3009J3940
54726A99821J3398J1084P662L674p48n243r161j2047j3685j4029j3589j3192j2828
$$ plain form
54829 61946 60128 58683 57806 56564 54529 52816 52633 53647 54623 54988 54925 54596 54124 53906 54152 54401 54161
54812 54161 53787 54093 55243 56557 57391 57744 57946 58131 58296 58724 59963 62068 64109 65000 64855 64919 65943
54795 65943 67306 68093 68329 68547 68856 69250 70326 72812 76661 81288 86359 91734 97104 102448 108408 115476
54779 115476 123344 131837 141785 153992 167995 182996 199363 217706 236872 254423 268999 280684
54767 280684 289047 292449 289809 281842 270171 256200 241131 226051 211462 197365 183987 171837
54755 171837 161163 152053 144887 139693 135323 130457 125384 121612 119702 118691 117684 116747 116047 115405 115061
54740 115061 115673 117163 118652 119947 121995 125482 130063 135444 142192 150855 161203 172872 185881 199821
54726 199821 213219 224303 231965 235639 234891 229648 220487 208440 194755 180726 167137 153945 141117
54713A41117j1601r369p321o158m983l107j633j812k889l207k595k014j650j004
54699H1774l25l00o10l54M03R25J259J964K695K554J669J091J171J282J051P53
54683I7002O08O48J138K121K842K595J781J292J237J268J516K200K840K959L023
54668A25070L594M214M323M520N527O578O412N268M320L573K085p2j817k937m258
54653A66400n929p054p205o865o331n406m321l606l157k541k125k509l025k365
54639A03961p63P2n17j214p88L39J158J479J610J608J530J692K118K288J864J179
54623A17616Q08R35J272J201K12j326k152j441J1O58j0j226k154k566k549k293
54607A06996k115k120k062j892j919j985j356j2Q62O12K97J002K000J993J263
$$ plain form
54713 141117 129516 120147 112826 106668 101685 98578 96945 95133 92244 89037 86442 84428 82778 81774
54699 81774 81449 81149 80539 80185 80588 81513 82772 84736 87431 89985 91654 92745 93916 95198 96249 97002
54683 97002 97610 98258 99396 101517 104359 106954 108735 110027 111264 112532 114048 116248 119088 122047 125070
54668 125070 128664 132878 137201 141721 147248 153826 160238 165506 169826 173399 175484 175412 173595 170658 166400
54653 166400 160471 153417 146212 139347 133016 127610 123289 119683 116526 113985 111860 109351 106326 103961
54639 103961 103198 103270 102753 101539 100751 101090 102248 103727 105337 106945 108475 110167 112285 114573 116437 117616
54623 117616 118424 119359 120631 121832 122044 120718 118566 117125 117136 117794 117784 116558 114404 111838 109289 106996
54607 106996 104881 102761 100699 98807 96888 94903 93547 93535 94397 95009 95306 96308 98308 100301 101564
54592A01564J033J334J274R14J117J786J985J630J482J563J188M82L22P56R88
54577A19418R32J252J829J749R79N44Q28J139J151J331J746J829J601J798K525
54562A40651L060L212L561M156M313L996L980M416M550M235M313N040N485N002
54548A99970M082L188J923Rj889k982l183k801k205j999k661l701m099l676l143
54533A76833k807k301j674j494j690j529r53p28r52p53J94J031J145R73R78Q58
54517A67131L51k07o30j181j738j613o47M49J178J727K077J727Q06L27P62J316
54501A71835J200P51P40J246J836K258K545K828L276L813M050L954M247N259N968
54486B15806N256L753K975L004K667J814J647K478L098K791K257J976J370K83
$$ plain form
54592 101564 102597 103931 105205 106119 107236 109022 111007 112637 114119 115682 116870 117352 117674 118430 119418
54577 119418 120350 121602 123431 125180 126159 126703 127531 128670 129821 131152 132898 134727 136328 138126 140651
54562 140651 143711 146923 150484 154640 158953 162949 166929 171345 175895 180130 184443 189483 194968 199970
54548 199970 204052 207240 209163 209172 207283 204301 201118 198317 196112 194113 191452 187751 183652 179976 176833
54533 176833 174026 171725 170051 168557 166867 165338 164385 163657 162705 161952 162146 163177 164322 165295 166273 167131
54517 167131 167482 167275 166645 165464 163726 162113 161466 161915 163093 164820 166897 168624 169430 169757 170519 171835
54501 171835 173035 173786 174526 175772 177608 179866 182411 185239 188515 192328 196378 200332 204579 209838 215806
54486 215806 221062 224815 227790 230794 233461 235275 236922 239400 242498 245289 247546 249522 250892 251175
54472B51175l04J08O36N51L34M48L85j59m87k09l4l26j65J038K152J853N77k23
54454B57350p1L94O19M50j72r89j415j417j753k740l633l863l974m470m690l855
54438B25771k520j954k513l509m203m212l376j998q65m72n30n60m52j31N64J323
54422B00363J435P95Q2l58p92j082n73M86P62j27p86k04N15p6j393j705p29K83
54404A96896O34R09J620K292K189J205j15j041j227j083j311j876j977j301o16
54389A95198o52j071j116o95k24Q8K16J07j00j27j96r13k166k944k685j976j445
54372A79299r09k54p6n71p73Q2J170J198K54n26o72o23n63j19P79J636K002J836
54354A83170J302O44J11l70j125k119k780k784k509k375k343k370k765l582m276
$$ plain form
54472 251175 250871 250979 251615 252166 252500 252948 253333 253174 252687 252478 252444 252118 251953 252991 255143 256996 257573 257350
54454 257350 257279 257673 258292 258742 258570 257581 256166 254749 252996 250256 246623 242760 238786 234316 229626 225771
54438 225771 223251 221297 218784 215275 211072 206860 203484 201486 200621 200149 199619 199059 198607 198476 199040 200363
54422 200363 201798 202593 202675 202317 201525 200443 199870 200356 201118 200991 200205 200001 200516 200440 199047 197342 196613 196896
54404 196896 197530 198439 200059 202351 204540 205745 205630 204589 203362 202279 200968 199092 197115 195814 195198
54389 195198 194546 193475 192359 191664 191440 191528 191744 191851 191751 191624 191428 190515 188349 185405 182720 180744 179299
54372 179299 178390 178136 178060 177489 176716 176798 177968 179166 179420 178894 178222 177599 177036 176917 177696 179332 181334 183170
54354 183170 184472 185116 185227 184857 183732 181613 178833 176049 173540 171165 168822 166452 163687 160105 155829
54339A55829m418m219l921l295k231j253r14j108j429j652j596j113n28m15o66
54324A27071n47O5L71j03q53j357j691j849j528j014j168j977k344j813j253j192
54308A08818r25j28J65p07j676j558q11l68J5P84J147L22p54p01L3l6j001j673
54290A00946j714j866k281k278j756j411j457j404j115r29q15n06l42q49j605
54275H0618j655r77m27l81m58m78n55m35J49O71N25K64Q53J852J783M43n96j76
54257H1020J002J600J272N74N4n6J19M5o73j562j696r28n1L05K37K0k57l48P0
54238H0747Q05J227J078O91K82l04r87j248q29j08L98N67N31L43k7n19r05r06
54220H0836n42l14p17j408j490p85j82l08o12l92j0k56j045j659j879j998j967
$$ plain form
54339 155829 151411 147192 143271 139976 137745 136492 135578 134470 133041 131389 129793 128680 128152 127737 127071
54324 127071 126524 126589 126960 126857 126004 124647 122956 121107 119579 118565 117397 115420 113076 111263 110010 108818
54308 108818 107893 107765 107930 107223 105547 103989 103178 102810 102825 103609 104756 105078 104324 103623 103656 103620 102619 100946
54290 100946 99232 97366 95085 92807 91051 89640 88183 86779 85664 84735 83920 83414 83072 82223 80618
54275 80618 78963 77986 77559 77178 76720 76242 75687 75252 75401 76072 76597 76861 77714 79566 81349 81792 81196 81020
54257 81020 82022 83622 84894 85468 85522 85466 85585 85630 84957 83395 81699 80771 80720 81025 81262 81282 81025 80677 80747
54238 80747 81552 82779 83857 84548 84830 84526 83539 82291 81462 81354 81752 82319 82850 83193 83166 82647 81742 80836
54220 80836 80294 79980 79263 77855 76365 75580 75398 75090 74478 74086 74076 73820 72775 71116 69237 67239 65272
54203F5272j424m22N97J366J766J490M75o07r74o72l07j51j56m55j099j536j161
54186F2002j87O44R31O91J9p12p92n6O02L61m00q64j061j462j825j606j072q72
54168E4341q48l96K63L73N6J49O88P99K28k07J3L21Q5m32n73j70M26Q19Q41O38
54148E7414N24N43M12J12J02N23P48L32j75n2M42N69K58m9k15k27K84J387K193
54129F5125J849Q38K24J02j55n65o10l65k95k33K53O92J97j000j731j543r81l87
54111F1415L84J077J112O13K56J13k22n26k35J99l22j693k475j925r06m31m75
54094E5959n47m93l24j50l72j125j562p62P08J357R31O43J107J483J079M88N30
54077E8950J121J743K069J771O37o83j085n05l7k36l84J00P04Q12O83P78R86J051
$$ plain form
54203 65272 63848 63426 64023 65389 67155 68645 69120 68513 67539 66867 66560 66409 66253 65798 64699 63163 62002
54186 62002 61815 62459 63390 64081 64100 63388 62596 62540 63142 63503 63103 62239 61178 59716 57891 56285 55213 54341
54168 54341 53493 53097 53360 53733 53789 53938 54626 55425 55653 55446 55459 55780 55865 55433 54860 54690 55116 55935 56776 57414
54148 57414 57938 58481 58893 59005 59107 59630 60378 60710 60535 60483 60925 61494 61752 61703 61488 61261 61545 62932 65125
54129 65125 66974 67812 68036 68138 67983 67418 66808 66443 66148 65915 66168 66860 67057 66057 64326 62783 61802 61415
54111 61415 61799 62876 63988 64601 64857 64970 64748 64222 63987 64186 63864 62171 59696 57771 56865 56434 55959
54094 55959 55412 54919 54595 54445 54073 52948 51386 50624 51332 52689 53620 54263 55370 56853 57932 58420 58950
54077 58950 60071 61814 63883 65654 66291 65608 64523 64018 63981 63745 63361 63461 64165 64977 65660 66438 67424 68475
54059F8475J087J126Q95M02R6O3j10m65m93p6K46K51L48O78Q15O97Q31J269J408
54040G7543J149J218J896K477K497K391K462K321J922K020K819L298K744K015
54026A08772K301L457M552N304N916O140N581M626M091M081L998L524K910K383
54012A67636J844J207O43M37O57R31O19m99j785k423k392k253k183k039k139l006
53996A55255m274m852m412l728l329k863k086j450j285j311j374j690k006j572
53982A19023m61J62k79q72p55m62q86j713j973j479p70j68K40J61n10j178j192
53965A06888p43m41l47m6N54J134J483J600J459J085O73M29L83N47R02J204J141
53948A17905Q73R31J540K435L339M080M351M022L661L959M686N110N333O118P352
$$ plain form
54059 68475 69562 70688 71583 71985 72081 72144 72034 71569 71076 71000 71246 71497 71845 72523 73338 74035 74866 76135 77543
54040 77543 78692 79910 81806 84283 86780 89171 91633 93954 95876 97896 100715 104013 106757 108772
54026 108772 111073 114530 119082 124386 130302 136442 142023 146649 150740 154821 158819 162343 165253 167636
54012 167636 169480 170687 171330 171767 172424 173355 173974 173475 171690 169267 166875 164622 162439 160400 158261 155255
53996 155255 150981 146129 141717 137989 134660 131797 129711 128261 126976 125665 124291 122601 120595 119023
53982 119023 118562 118724 118445 117573 116818 116356 115470 113757 111784 110305 109535 109367 109607 109768 109258 108080 106888
53965 106888 106145 105704 105357 105311 105865 106999 108482 110082 111541 112626 113299 113728 114111 114658 115560 116764 117905
53948 117905 118778 119709 121249 123684 127023 131103 135454 139476 143137 147096 151782 156892 162225 168343 175695
53933A75695P956P531O855O340N275L208Q85q72k143l146l554l369l378l927m165
53918A89191l335j913o45N85J998K971K907K388K348K746K990L159L751M711N580
53903B19432O236O685O587N760M821M453M443M067L101J860O73j72m08k61l38
53888B66939o87p25n71j367l539n641o057m999l850l248k992l178m072n145n448
53873B15420m882m121l559l192l305m224n425n820m994l603k558k303k710l193
53859A61531l116k539k192k396k576k257j848j805j781j372j010j250j751j902
53845A33736j951k468l143l157k453j685j184q71q64j257j547j204n60k82k70
53830A10840m4J78j64p75q20l23j29m10l48M63J280J295O67R0j21j19r2n6J00
$$ plain form
53933 175695 183651 191182 198037 204377 209652 212860 213745 212873 210730 207584 204030 200661 197283 193356 189191
53918 189191 185856 183943 183298 183883 185881 188852 191759 194147 196495 199241 202231 205390 209141 213852 219432
53903 219432 225668 232353 238940 244700 249521 253974 258417 262484 265585 267445 268118 267946 267538 267277 266939
53888 266939 266252 265527 264956 263589 260050 254409 248352 243353 239503 236255 233263 230085 226013 220868 215420
53873 215420 210538 206417 202858 199666 196361 192137 186712 180892 175898 172295 169737 167434 164724 161531
53859 161531 158415 155876 153684 151288 148712 146455 144607 142802 141021 139649 138639 137389 135638 133736
53845 133736 131785 129317 126174 123017 120564 118879 117695 116824 115960 114703 113156 111952 111392 111110 110840
53830 110840 110796 110974 110810 110035 109215 108892 108763 108353 108005 108468 109748 111043 111710 111800 111679 111560 111468 111412 111512
53811A11512M15O77N98L36M36J007J408J206R44J310K009K248K003J999K589L386
53795A34083L933M103L846L232K737K962L968N178N915N835M985L856L053K695
53781A90381K341J752J300J267J277Q45J34l43m27l72n26j130k033k527k088j356
53765A88495j462k240k264j114k14o79j675j948j769j953k117j458n48n79j329
53750A67146j515r46p50j467k381k881l165l404l337k960k660k528k225j672j132
53735A34123o86k91j96n36p88m31J29J30k92m49l59o19j167j271p27j09J91K94
53717A26946K77J32J96P20J206R76K66j99m02q24j259j063l92l2KM69J424J965
53699A30408J624J030R13J406K385L565M209L737K756K449K851K849J959J006
$$ plain form
53811 111512 111927 112604 113202 113538 113974 114981 116389 117595 118539 119849 121858 124106 126109 128108 130697 134083
53795 134083 138016 142119 145965 149197 151934 154896 158864 164042 169957 175792 180777 184633 187686 190381
53781 190381 192722 194474 195774 197041 198318 199163 199297 198954 198527 198155 197629 196499 194466 191939 189851 188495
53765 188495 187033 184793 182529 181415 181201 180522 178847 176899 175130 173177 171060 169602 169054 168475 167146
53750 167146 165631 164685 163935 162468 160087 157206 154041 150637 147300 144340 141680 139152 136927 135255 134123
53735 134123 133437 133146 132950 132414 131626 131195 131324 131454 131162 130713 130354 129735 128568 127297 126570 126461 126652 126946
53717 126946 127223 127355 127551 128271 129477 130453 130719 130520 130118 129294 128035 126972 126580 126548 126550 127019 128443 130408
53699 130408 132032 133062 133975 135381 137766 141331 145540 149277 152033 154482 157333 160182 162141 163147
53685A63147O68N87L57L55R68J780K129J934J580J441J725K295K522J920R25M41
53669A84774O16Q27Q21R70J355J495J251J149J520J974J974J435O28M3J96R86
53653B02014J462R26K4j66J65o2r46j443j160r53j425k048k239k170k049j617
53637A88313r42p37j279j787j524p94l85n24r35j310j369r54m09l55p77q99j74
53620A73159J009J836J831J097L44N35J867L225L343K429J805K092K767L380L961
53605B04680M226L595K387J768K161K759K963L173L660L879L565L428L921M236
53591B50401L399J754M91K53Q16J750K659L135L010K451J655P00j43n11m89m75
53575B70856m88j96K67L16j70o83r76j256j363p95K10O35J30m71n14l73m56l94
$$ plain form
53685 163147 163815 164402 164759 165114 166082 167862 169991 171925 173505 174946 176671 178966 181488 183408 184333 184774
53669 184774 185390 186217 187038 188008 189363 190858 192109 193258 194778 196752 198726 200161 200789 200832 201028 202014
53653 202014 203476 204402 204426 204260 204425 204363 203417 201974 200814 199861 198436 196388 194149 191979 189930 188313
53637 188313 187371 186634 185355 183568 182044 181250 180865 180341 179406 178096 176727 175773 175364 175009 174232 173333 173159
53620 173159 174168 176004 177835 178932 179276 179811 181678 184903 188246 190675 192480 194572 197339 200719 204680
53605 204680 208906 212501 214888 216656 218817 221576 224539 227712 231372 235251 238816 242244 246165 250401
53591 250401 253800 255554 256045 256298 257114 258864 261523 264658 267668 270119 271774 272474 272331 271820 271331 270856
53575 270856 270368 270172 270439 270755 270585 269902 268926 267670 266307 265512 265722 266357 266487 266016 265502 265129 264673 264279
53557B64279P9L91K7n17m97JL98N57O57O93O42P70J227J696J892J985K208K494
53539B78982K730K921K888K407J801J723K187K556K736L413M786N963O231O039
53525C27363O187O777P555Q573R860J1052J1936J2833J3927J4809J5176J5424
53513D61472J6057J6987J7896J8744J9603K0459K1518K3106K5128K7186K9328
53502F97484L1848L4210L5271L4889L4205L3946L3539L2532L1633L1619L2214
53491A063390L2992L4443L7072M0260M2954M4960M6667M8024M8626M8367M7351
53480A535106M5632M3440M1045L7986L3423K7826K3181K0745J9650J8704J8383
53469A865121J9749K2314K4532K5787K6455K6403K4986K2374J9580J7079J4457
$$ plain form
53557 264279 264358 264749 264776 264259 263762 263763 264161 264718 265375 266068 266710 267480 268707 270403 272295 274280 276488 278982
53539 278982 281712 284633 287521 289928 291729 293452 295639 298195 300931 304344 309130 315093 321324 327363
53525 327363 333550 340327 347882 356455 366315 377367 389303 402136 416063 430872 446048 461472
53513 461472 477529 494516 512412 531156 550759 571218 592736 615842 640970 668156 697484
53502 697484 729332 763542 798813 833702 867907 901853 935392 967924 999557 1031176 1063390
53491 1063390 1096382 1130825 1167897 1208157 1251111 1296071 1342738 1390762 1439388 1487755 1535106
53480 1535106 1580738 1624178 1665223 1703209 1736632 1764458 1787639 1808384 1828034 1846738 1865121
53469 1865121 1884870 1907184 1931716 1957503 1983958 2010361 2035347 2057721 2077301 2094380 2108837
53458B108837J1333P674L211k397q737j4757j9757k3667k6506k8359k9843l1793
53446A945239l4424l7318m0172m2900m5165m6447m6555m5669m4027m2065m0655
53435A479842m0537m1575m2926m3744m3404m1566l8602l5574l3129l0732k7526
53424A060527k3561j9537j5740j1987q300m865j414K573P145J1839J6192J9862
53412A032734K2580K4574K6633K9165L1559L3163L4446L6290L8473L9966M0716
53401A390299M1988M4589M7684M9937N1272N2903N5817N9804O4075O8420P3306
53390B000094P8771Q3822Q7337Q9345R0754R2060R3132R4154R5791R8114J00258
53379C003632J01536J02062J01809R9994R6045R0498Q4376P8242P2520O7971O5066
$$ plain form
53458 2108837 2120170 2127844 2131055 2128658 2119921 2105164 2085407 2061740 2035234 2006875 1977032 1945239
53446 1945239 1910815 1873497 1833325 1790425 1745260 1698813 1652258 1606589 1562562 1520497 1479842
53435 1479842 1439305 1397730 1354804 1311060 1267656 1226090 1187488 1151914 1118785 1088053 1060527
53424 1060527 1036966 1017429 1001689 989702 981402 976537 975123 977696 984841 996680 1012872 1032734
53412 1032734 1055314 1079888 1106521 1135686 1167245 1200408 1234854 1271144 1309617 1349583 1390299
53401 1390299 1432287 1476876 1524560 1574497 1625769 1678672 1734489 1794293 1858368 1926788 2000094
53390 2000094 2078865 2162687 2250024 2339369 2430123 2522183 2615315 2709469 2805260 2903374 3003632
53379 3003632 3105168 3207230 3309039 3409033 3505078 3595576 3679952 3758194 3830714 3898685 3963751
53368C963751O3320O1902O0502N9170N7910N6880N6317N5627N3248M7904L9326
53357D575857K7211J0651j0335l3438n5364p4139q9298j00630j08012j12283j15009
53346C915211j17208j18951j20093j20659j20645j20016j18921j17583j16159
53337B844976j14880j13879j12762j10983j08827j07107j05570j02719r7826r2002
53327A778421q6607q1654p6633p1630o6617o0745n3608m6201l9542l3305k7091
53316A134788k1827j8322j5515j1987q361o192n140l337l55K340L808M716N793
53303A060409O979Q347J0287J2498J4187J5451J7102J9071K0466K1383K3047K5902
53291A255129K8993L1581L3892L5956L7195L7785L8921M1114M3386M4878M6022
$$ plain form
53368 3963751 4027071 4088973 4149475 4208645 4266555 4323435 4379752 4435379 4488627 4536531 4575857
53357 4575857 4603068 4613719 4603384 4569946 4514582 4440443 4351145 4250515 4142503 4030220 3915211
53346 3915211 3798003 3679052 3558959 3438300 3317655 3197639 3078718 2961135 2844976
53337 2844976 2730096 2616217 2503455 2392472 2283645 2176538 2070968 1968249 1870423 1778421
53327 1778421 1691814 1610160 1533527 1461897 1395280 1334535 1280927 1234726 1195184 1161879 1134788
53316 1134788 1112961 1094639 1079124 1067137 1058776 1052584 1047444 1044107 1043752 1046092 1049900 1054616 1060409
53303 1060409 1067388 1075735 1086022 1098520 1112707 1128158 1145260 1164331 1184797 1206180 1229227 1255129
53291 1255129 1284122 1315703 1349595 1385551 1422746 1460531 1499452 1540566 1583952 1628830 1674852
53280A674852M7451M8763M9189M8682M7550M5823M3546M1186L9259L8150L8360
53269B162811M0125M2441M3463M2229L9229L5054K9603K3085J6653J1120N770
53258B491583p24q741j7677k6867l5883m4251n1575n7796o2968o7072p0278p3023
53246A974728p5356p6508p5552p2417o8070o3672n9704n5911n2147m9081m7722
53235A278588m8246m9850n1893n4462n7435n9844o0820o0484n9202n6693n2801
53224F66858m8352m4188l9981l5176l0415k6758k3965k1048j8086j5936j4458
53213C48495j2617j0302q425p274o318n645n928o813p020o340n887o034n816m860
53199B49216m211m461m707m197l618l788m313m500m506m674m716m405m135m047
$$ plain form
53280 1674852 1722303 1771066 1820255 1868937 1916487 1962310 2005856 2047042 2086301 2124451 2162811
53269 2162811 2202936 2245377 2288840 2331069 2370298 2405352 2434955 2458040 2474693 2485813 2491583
53258 2491583 2490859 2482118 2464441 2437574 2401691 2357440 2305865 2248069 2185101 2118029 2047751 1974728
53246 1974728 1899372 1822864 1747312 1674895 1606825 1543153 1483449 1427538 1375391 1326310 1278588
53235 1278588 1230342 1180492 1128599 1074137 1016702 956858 896038 835554 776352 719659 666858
53224 666858 618506 574318 534337 499161 468746 441988 418023 396975 378889 362953 348495
53213 348495 335878 325576 317151 309877 303559 297914 291986 285173 278153 271813 265926 259892 254076 249216
53199 249216 245005 240544 235837 231640 228022 224234 219921 215421 210915 206241 201525 197120 192985 188938
53185A88938l538k410j453j253j360j388j851l003l941l813l059k521k140j479
53171A55729p19k59n5j45r55k240k649j515j42j21j036j263m92L2m06j076j137
53154A41551p37m46l79k74pK63K73m7m03m40k45k62n68p36o18o58j073j353r55
53135A32886o7P52J222J333J089O89M34K73q7m10o0Q36J156L37p23q85k82K04
53117A38697L31N60J081J541J592J189M56l04o82n61k83k37n80j404k629l680
53101A35087l866l234k461j808j048n33j174k916m248l947k511j184l96Q8K47
53086A06096k5l15j41K60L53J23k7L2J40J61Nk80k32O20J790K069J155K40M11
53067A12435J201J466R35J70m56q90r84o56k40r4j71k89l96k81L32J068J049J88
$$ plain form
53185 188938 185400 182990 181537 180284 178924 177536 175685 172682 168741 164928 161869 159348 157208 155729
53171 155729 155010 154751 154696 154551 153596 151356 148707 147192 147050 146929 145893 144630 144138 144170 143764 142688 141551
53154 141551 140814 140368 139989 139715 139708 139971 140244 140197 139794 139354 139109 138847 138279 137543 136925 136267 135194 133841 132886
53135 132886 132819 133571 134793 136126 137215 137904 138338 138611 138524 138114 138054 138890 140046 140383 139660 138775 138493 138697
53117 138697 139028 139588 140669 142210 143802 144991 145447 145143 144461 143900 143617 143380 142800 141396 138767 135087
53101 135087 131221 127987 125526 123718 122670 122137 120963 118047 113799 109852 107341 106157 105761 105849 106096
53086 106096 106071 105756 105615 105875 106228 106351 106324 106356 106496 106657 106662 106382 106150 106770 108560 110629 111784 112024 112435
53067 112435 113636 115102 116037 116207 115751 114861 113877 113221 112981 112887 112716 112427 112031 111750 112082 113150 114199 114387
53049A14387n39n45l96n82n51J74R23R43O14O54Q34O19L11L48J60j029k638l306
53031A10381k769k013j689j536j272j051r60q55p84q89j034j065j173j472j551
53016I0268j092n82o68j225j679j873j910j642j074p70r87r91j36Q90J011M51
53000G7991K50M19oj168j976j730r78m62k18l7k7k36l17nN32R37J057R67Q43P71
52980G6607M99l13j369j763j129k07K18L55O85Q79L86m29o83k83J36L05M40M96
52962G4830K45p8k8K01N3m74r52j312j636j515o15L77M25k81n68m7M96N24M68
52943G0113O95Q18M46j87o89r33q18k07O71J309J576J755J859J559Q35J57j15
52926G8844L0N03J084J246O82o0j61K83M16r2p02r49r37q19m69Q6N45P48P49M92
$$ plain form
53049 114387 113848 113303 112907 112325 111774 111948 112871 113814 114428 115082 115916 116535 116846 117194 117354 116325 113687 110381
53031 110381 107612 105599 103910 102374 101102 100051 99091 98236 97452 96563 95529 94464 93291 91819 90268
53016 90268 89176 88594 87926 86701 85022 83149 81239 79597 78523 77753 76766 75775 75639 76529 77540 77991
53000 77991 78241 78660 78654 77486 75510 73780 72802 72340 72122 72085 72058 71822 71505 71500 72032 72969 74026 74993 75836 76607
52980 76607 77106 76793 75424 73661 72532 72325 72543 72898 73583 74462 74848 74419 73736 73453 73589 73894 74334 74830
52962 74830 75075 74997 74969 75170 75223 74749 73797 72485 70849 69334 68719 69096 69521 69240 68672 68625 69121 69645 70113
52943 70113 70808 71626 72072 71885 71196 70263 69445 69238 69909 71218 72794 74549 76408 77967 78802 78959 78844
52926 78844 78874 79377 80461 81707 82389 82329 82168 82451 82867 82775 82073 81124 80187 79368 78899 78985 79530 80278 81027 81519
52906H1519l8m56l38J38N27Q72J455K018K069J821J892K204K115J565J157R88
52890I9508N23l04p91o35m09n68p49n47k00j52m90j065j627j724j089l05l44j295
52872H7737k206k384j997j365m80L85N64q1p62q05m35j41J01M66P80Q73R96J368
52854H2614J728J734J435R89L32n71j444k022k295k191j463k67N89L98o09j481
52838G7476j552r92m82m83q37j031q56n59l28pM14N50K98K70Q51J269N26j007
52820G3520j846j274qR61J324J132M54l30o05k85J16L12N52R52J194J130J048
52803G8347J133J157R36N79J01o20j425j864j767j278m79M73R28L24p89j145l80
52786G4231N93R31P24L33k01o46m13N55J417J454R19M45K29K20N47J223J860K090
$$ plain form
52906 81519 81481 81025 80687 80825 81352 82224 83679 85697 87766 89587 91479 93683 95798 97363 98520 99508
52890 99508 100031 99727 98936 98301 97892 97324 96575 96028 95828 95676 95186 94121 92494 90770 89681 89376 89032 87737
52872 87737 85531 83147 81150 79785 79305 79690 80254 80173 79411 78606 78171 78030 78131 78597 79377 80250 81246 82614
52854 82614 84342 86076 87511 88500 88832 88261 86817 84795 82500 80309 78846 78579 79168 79566 78957 77476
52838 77476 75924 74932 74450 73967 73130 72099 71243 70684 70356 70349 70763 71313 71611 71881 72732 74001 74527 73520
52820 73520 71674 70400 70392 71353 72677 73809 74263 73933 73328 73043 73159 73471 74023 74975 76169 77299 78347
52803 78347 79480 80637 81573 82152 82253 81633 80208 78344 76577 75299 74820 75293 76221 76545 75756 74611 74231
52786 74231 74824 75755 76479 76812 76611 75965 75552 76107 77524 78978 79897 80342 80571 80791 81338 82561 84421 86511
52768H6511J894J310L21p31j209j010p80j004j390j468j238r21n47j42R4J16P5
52751G9881j39q20j727k062j519p37l86l36j58O8m8n45j070j284j082o13k10o9
52733F7144l0M3p9m91n93J34J044R99K9o87n65j38K75J092K196K528J676P22O89
52714G5988J028O94j58o26n49m92o23o04m13l99o50q49p28j92P01J580J878J479
52696G7065Q58L52j82o89o72p9K81j00n81m26l7k48q79j016m34K06M51M94N33
52677G4897M67L04K55L18L03K35L24N23N63M11K81K25N0k84n41n66m56l49j40
52658G6820L84J113J369M55j352k658k303o82P59J183Q87L83j32l89j15K50j76
52641G5796j363k073j404J68J624K469K502J538Q2n37L65J821K462K206J938K018
$$ plain form
52768 86511 88405 89715 90036 89305 88096 87086 86306 85302 83912 82444 81206 80285 79738 79596 79690 79806 79881
52751 79881 79742 78922 77195 75133 73614 72877 72491 72155 71997 72065 72017 71472 70402 69118 68036 67423 67213 67144
52733 67144 67114 67157 67078 66587 65994 66128 67172 68171 68200 67513 66948 66810 67085 68177 70373 72901 74577 75299 75988
52714 75988 77016 77710 77552 76926 76377 75885 75262 74658 74245 73846 73196 72347 71619 71427 72128 73708 75586 77065
52696 77065 77923 78275 78093 77404 76732 76653 76934 76834 76253 75827 75790 75542 74663 73647 73213 73419 73870 74364 74897
52677 74897 75364 75668 75923 76241 76544 76779 77103 77626 78189 78600 78881 79106 79156 78872 78331 77765 77309 76960 76820
52658 76820 77204 78317 79686 80141 78789 76131 73828 73146 73905 75088 75975 76358 76226 75837 75722 75972 75796
52641 75796 74433 72360 70956 71124 72748 75217 77719 79257 79339 78802 79167 80988 83450 85656 87594 89612
52625H9612K105K068K115K157J862J303Q91P06M25j44q51j450j703j533j277j412
52609I4874j757j474l79M30j18j619k736k786k094j137k03L51K67j33k36R3M46
52592H1789M78J57l85r14j156j152j267j588j637j040p4P93J440J745J336K55
52576G8780n78l56M90Q64M14k44n19m23k43j36k8L83J280K255K527J963J254R00
52558H8583O29K16K5R1l68j671k673k119m82P22R09O16J40o94j484j360k66Q14
52540H1628J166R57M68l15j126j290n96K77N60J91l57o35m64l8K23J83K42P32
52522H1806J281J318R35P05P57O88K89k33o82r73r34n73l66o38q97m90L09O14
52504H2916K43j74l58o86j185j162k38Q91J285Q80L34N9k03q40j619j663m06J431
$$ plain form
52625 89612 91717 93785 95900 98057 99919 101222 102113 102819 103244 103100 102249 100799 99096 97563 96286 94874
52609 94874 93117 91643 91264 91694 91576 89957 87221 84435 82341 81204 81001 81352 81619 81486 81250 81343 81789
52592 81789 82267 82424 82039 81125 79969 78817 77550 75962 74325 73285 73211 74004 75444 77189 78525 78780
52576 78780 78202 77846 78336 79200 79614 79370 78851 78428 78185 78049 78021 78404 79684 81939 84466 86429 87683 88583
52558 88583 89212 89428 89453 89544 89176 87505 84832 82713 82231 82953 83862 84478 84618 83924 82440 81080 80814 81628
52540 81628 82794 83751 84219 83904 82778 81488 80892 81169 81729 81920 81563 80928 80464 80426 80649 80832 81074 81806
52522 81806 83087 84405 85340 86045 86802 87490 87779 87546 86864 85891 84957 84384 84018 83380 82483 81993 82302 82916
52504 82916 83159 82985 82627 81941 80756 79594 79356 80247 81532 82412 82746 82805 82602 81762 80143 78480 78074 79505
52486G9505K304J540J47m44l2N45P72Q84J133J374J350R07L2q65j081n26r4m69
52468H6982j023o84M03J162J252J305J576J471O71k24n76m45j54J70K78j75r60
52451I1029j189l88P79J242O84k25n89j18N88P19L09K89J127J906J460L6j017
52434I6642r97l98K15Q11J315J351Q82L75J07j0R5N51Q25R3j406k323j924r99
52416I5205n71n77l80R5N24Q58J137J015K09q58j447j363r37l63L88J111J381
52399I5427J060M89K6k73n13o55n45k08M0o3l61m04m3M26P85J169J610J686J111
52380A00764L23K1K68N59O26O06N50L00j37n16o39m13J89R00J132O84J08m5Oj14
52360A05172o3O23J438J484R46Q89J582K151K047J700J425Q19k15q78o02l6r6
$$ plain form
52486 79505 81809 83349 83496 83052 83020 83565 84337 85221 86354 87728 89078 89985 90017 89152 88071 87545 87451 86982
52468 86982 85959 85275 85678 86840 88092 89397 90973 92444 93115 92891 92315 91870 91716 91886 92164 91989 91029
52451 91029 89840 89452 90231 91473 92157 91932 91343 91225 91813 92532 92841 93130 94257 96163 97623 97659 96642
52434 96642 95645 95247 95462 96273 97588 98939 99821 100196 100303 100293 100388 100939 101764 101857 100451 98128 96204 95205
52416 95205 94634 94057 93677 93772 94296 95154 96291 97306 97515 96657 95210 93847 92910 92547 92935 94046 95427
52399 95427 96487 96976 97002 96729 96216 95561 95016 94808 94848 94785 94424 94020 93977 94403 95188 96357 97967 99653 100764
52380 100764 101087 101108 101376 101935 102561 103167 103717 104017 103880 103364 102725 102312 102501 103401 104533 105217 105325 105280 105286 105172
52360 105172 105109 105732 107170 108654 109600 110489 112071 114222 116269 117969 119394 120213 119998 119120 118518 118482 118386
52343A18386o30p86k83L43N71L85j5m33o87o31k69K20N52N09K60L29R15J375R49
52324A21060j41q64o71n6L37N78J121K017K772K851K242J569J500J942K134J846
52308A40237J835K589L294K997K261K374L187L209K009J084J737L344M423M489
52294A79069L972L124K007J115J058J719K293K191J522P99M61O00R43J172J254
52279B03299J260J119Q11N98N52J53r01j757j230L52J293P15l30m15M70J321J564
52262B08874J453J425J702K206K549K372J885J668J804J768J400J287J812K467
52248B34672K527J969J285Q67R56J737K952L821L799L187K714K684K797K569J828
52233B70364R80P88J552K563K806K157J441J314J659K044K155J847J351J333K161
$$ plain form
52343 118386 117756 116970 116687 117030 117601 117986 117971 117538 116851 116220 115951 116171 116723 117232 117492 117821 118736 120111 121060
52324 121060 120919 120055 119384 119328 119665 120243 121364 123381 126153 129004 131246 132815 134315 136257 138391 140237
52308 140237 142072 144661 147955 150952 153213 155587 158774 161983 163992 165076 166813 170157 174580 179069
52294 179069 183041 186165 188172 189287 190345 192064 194357 196548 198070 198869 199330 199930 200873 202045 203299
52279 203299 204559 205678 206489 207087 207639 207792 206891 205134 203904 204256 205549 206264 205934 205519 205989 207310 208874
52262 208874 210327 211752 213454 215660 218209 220581 222466 224134 225938 227706 229106 230393 232205 234672
52248 234672 237199 239168 240453 241320 242276 244013 246965 250786 254585 257772 260486 263170 265967 268536 270364
52233 270364 271344 272132 273684 276247 279053 281210 282651 283965 285624 287668 289823 291670 293021 294354 296515
52218B96515L186L501L191L032L138L013K784L179M125M602M159L448L000K696
52204C43569K679L442M583M843M026L498M032M563M038L151L081L606L786L599
52190C96496L576L507K831J861J448J752K294K813L180K920J821N91K4n8k74n58
52174D24224n57n31r31j373j105k26M28M13j08r37j779j948j030L43J133J084
52158D17100O02j39j132j936k014j558j197j141j251j649k441l160l267l001k935
52143C90881l006k730k178j898k035k276k488k708k693k202j512j054p64m68n01
52128C62368j209k116k455k240k070k163k301k430k539k249j401p16r69j805k238
52113C33467k058j811j660j333r52q72p94j27Q36J175P86N67J030J731K189K441
$$ plain form
52218 296515 299701 303202 306393 309425 312563 315576 318360 321539 325664 330266 334425 337873 340873 343569
52204 343569 346248 349690 354273 359116 363142 366640 370672 375235 379273 382424 385505 389111 392897 396496
52190 396496 400072 403579 406410 408271 409719 411471 413765 416578 419758 422678 424499 425090 425114 425056 424782 424224
52174 424224 423667 423136 422205 420832 419727 419501 419929 420342 420234 419297 417518 415570 414540 414883 416016 417100
52158 417100 417702 417563 416431 414495 412481 410923 409726 408585 407334 405685 403244 400084 396817 393816 390881
52143 390881 387875 385145 382967 381069 379034 376758 374270 371562 368869 366667 365155 364101 363337 362869 362368
52128 362368 361159 359043 356588 354348 352278 350115 347814 345384 342845 340596 339195 338479 337510 335705 333467
52113 333467 331409 329598 327938 326605 325653 324781 323987 323860 324696 325871 326657 327224 328254 329985 332174 334615
52097C34615K568K471K325K456K668K420J764J313J253J248J368K174L656M914
52083C67213N199M643L799L093K812K938K919K257J344J032J409J769J776J744
52069D03947J707J242M50K20J087K519L646M094L886L202K449K064J990J851J659
52054D36013J731J902J613P89q8p53j275j377p09J95K52o39j441j639j829k312
52038D30433k318j458q11j491k858l327k457j322r73j488k400l239l598l242k382
52023C97069j562j169j184j362j464j434j395j429j398j201j094j400j981k355
$$ plain form
52097 334615 337183 339654 341979 344435 347103 349523 351287 352600 353853 355101 356469 358643 362299 367213
52083 367213 372412 377055 380854 383947 386759 389697 392616 394873 396217 397249 398658 400427 402203 403947
52069 403947 405654 406896 407346 407566 408653 411172 414818 418912 422798 426000 428449 430513 432503 434354 436013
52054 436013 437744 439646 441259 442048 441960 441207 439932 438555 437846 438041 438293 437654 436213 434574 432745 430433
52038 430433 428115 426657 425846 424355 421497 418170 415713 414391 413418 411930 409530 406291 402693 399451 397069
52023 397069 395507 394338 393154 391792 390328 388894 387499 386070 384672 383471 382377 380977 378996 376641
$$ [...]
##END NTUPLES=NMR SPECTRUM
##END=
