
##TITLE=AC1351_CHIRS12169_6647909_QA816MgoxS
##JCAMPDX= 6.0         $$ Bruker NMR JCAMP-DX V2.0
##DATA TYPE= NMR SPECTRUM
##DATA CLASS= NTUPLES
##ORIGIN= BRUKER
##OWNER= Administrator
$$ 1.72 TOPSPIN		Version 2.1
$$ 2012-08-09 16:54:24.312 -0500  Administrator@TOPSPIN
$$ Compression mode = diff/dup
##.OBSERVE FREQUENCY= 400.02188249412
##.OBSERVE NUCLEUS= ^1H
##.ACQUISITION MODE= SIMULTANEOUS (DQD)
##.ACQUISITION SCHEME= undefined
##.AVERAGES= 8
##.DIGITISER RES= 22
##SPECTROMETER/DATA SYSTEM= spect
##.PULSE SEQUENCE= zg30
##.SOLVENT NAME= COFFEE_meoh
##.SHIFT REFERENCE= INTERNAL, COFFEE_meoh, 1, 14.98509
##AUDIT TRAIL= $$ (NUMBER, WHEN, WHO, WHERE, PROCESS, VERSION, WHAT)
$$ ##TITLE= Audit trail, TOPSPIN		Version 2.1
$$ ##JCAMPDX= 5.01
$$ ##ORIGIN= Bruker BioSpin GmbH
$$ ##OWNER= Administrator
$$ $$ C:\Bruker\TOPSPIN/data/COFFEE/nmr/AC1351_CHIRS12169_6647909_QA816MgoxS/10/pdata/1/auditp.txt
$$ ##AUDIT TRAIL=  $$ (NUMBER, WHEN, WHO, WHERE, PROCESS, VERSION, WHAT)
(   1,<2012-08-09 16:54:17.078 -0500>,<Administrator>,<TOPSPIN>,<go>,<TOPSPIN 2.1>,
      <created by zg
	started at 2012-08-09 16:53:10.515 -0500,
	POWCHK enabled, PULCHK disabled,
       configuration hash MD5:
       6B 1B 68 BB D9 2E 58 E2 7F 35 AD 54 07 DF 0E 41
       data hash MD5: 64K
       E2 FA C8 35 40 CD AE C2 8D 13 A0 0E 6B 17 96 EB>)
(   2,<2012-08-09 16:54:20.140 -0500>,<Administrator>,<TOPSPIN>,<proc1d>,<TOPSPIN 2.1>,
      <Start of raw data processing
       efp LB = 0 FT_mod = 6 PKNL = 1 PHC0 = 0 PHC1 = 0 SI = 32K 
       data hash MD5: 32K
       F9 8D D0 58 75 1C C4 67 35 14 06 BB FE 12 C5 AF>)
(   3,<2012-08-09 16:54:20.437 -0500>,<Administrator>,<TOPSPIN>,<proc1d>,<TOPSPIN 2.1>,
      <pk PHC0 = 174.9188 PHC1 = 0 
       data hash MD5: 32K
       9D 15 CF 29 5B 2F 95 FA 1C 20 48 5F 6F 85 58 D1>)
(   4,<2012-08-09 16:54:20.531 -0500>,<Administrator>,<TOPSPIN>,<proc1d>,<TOPSPIN 2.1>,
      <abs ABSG = 1 
       data hash MD5: 32K
       BE F3 AB EF 5C AC AC AF A1 BF AA 6D BD 05 BA 76>)
(   5,<2012-08-09 16:54:20.562 -0500>,<Administrator>,<TOPSPIN>,<proc1d>,<TOPSPIN 2.1>,
      <abs ABSG = 2 
       data hash MD5: 32K
       42 4A BA B7 0B D5 FD 92 13 F9 13 29 9C 23 70 22>)
(   6,<2012-08-09 16:54:20.593 -0500>,<Administrator>,<TOPSPIN>,<proc1d>,<TOPSPIN 2.1>,
      <abs ABSG = 3 
       data hash MD5: 32K
       6A FF E0 6D 26 9F 80 DD 6C D9 E6 D8 88 F1 2F 06>)
(   7,<2012-08-09 16:54:20.625 -0500>,<Administrator>,<TOPSPIN>,<proc1d>,<TOPSPIN 2.1>,
      <abs ABSG = 4 
       data hash MD5: 32K
       3A 9B 48 29 EE 92 A1 22 16 E7 D8 3C 06 E3 92 86>)
(   8,<2012-08-09 16:54:20.656 -0500>,<Administrator>,<TOPSPIN>,<proc1d>,<TOPSPIN 2.1>,
      <abs ABSG = 5 
       data hash MD5: 32K
       40 6F 1F DC 8F 8C 95 3B 0E E8 27 7B 47 45 07 0B>)
$$ ##END=
$$ 
$$ $$ hash MD5
$$ $$ 6E EF F2 2C 5D D2 4C 4E 12 FA 45 30 35 DD DC 86
##$RELAX= 
##$RELAX= 
##$RELAX= 
##$RELAX= 
##$RELAX= 
##$RELAX= 
##$RELAX= 
$$ Bruker specific parameters
$$ --------------------------
$$ [...]
##$TP= (0..7)
150 150 150 150 150 150 150 150
##$TP07= 0
##$TPNAME0= <>
##$TPNAME1= <>
##$TPNAME2= <>
##$TPNAME3= <>
##$TPNAME4= <>
##$TPNAME5= <>
##$TPNAME6= <>
##$TPNAME7= <>
##$TPOAL= (0..7)
0.5 0.5 0.5 0.5 0.5 0.5 0.5 0.5
##$TPOFFS= (0..7)
0 0 0 0 0 0 0 0
##$TUNHIN= 0
##$TUNHOUT= 0
##$TUNXOUT= 0
##$USERA1= <user>
##$USERA2= <user>
##$USERA3= <user>
##$USERA4= <user>
##$USERA5= <user>
##$V9= 5
##$VALIST= <valist>
##$VCLIST= <CCCCCCCCCCCCCCC>
##$VD= 0
##$VDLIST= <DDDDDDDDDDDDDDD>
##$VPLIST= <PPPPPPPPPPPPPPP>
##$VTLIST= <TTTTTTTTTTTTTTT>
##$WBST= 1024
##$WBSW= 4
##$XGAIN= (0..3)
0 0 0 0
##$XL= 0
##$YL= 0
##$YMAX_a= 476239
##$YMIN_a= -621975
##$ZGOPTNS= <>
##$ZL1= 120
##$ZL2= 120
##$ZL3= 120
##$ZL4= 120
##$ABSF1= 14.98509
##$ABSF2= -5.573092
##$ABSG= 5
##$ABSL= 3
##$ALPHA= 0
##$AQORDER= 0
##$ASSFAC= 0
##$ASSFACI= 0
##$ASSFACX= 0
##$ASSWID= 0
##$AUNMP= <proc_prof1d_extract_pilot.lims>
##$AXLEFT= 0
##$AXNAME= <>
##$AXNUC= <1H>
##$AXRIGHT= 0
##$AXTYPE= 0
##$AXUNIT= <>
##$AZFE= 0.1
##$AZFW= 0.1
##$BCFW= 0
##$BC_mod= 0
##$BYTORDP= 0
##$COROFFS= 0
##$CY= 15
##$DATMOD= 1
##$DC= 0
##$DFILT= <>
##$DTYPP= 0
##$F1P= 0
##$F2P= 0
##$FCOR= 0.5
##$FTSIZE= 32768
##$FT_mod= 6
##$GAMMA= 0
##$GB= 0
##$INTBC= 1
##$INTSCL= 1
##$ISEN= 128
##$LB= 0
##$LEV0= 0
##$LPBIN= 0
##$MAXI= 10000
##$MC2= 0
##$MEAN= 0
##$ME_mod= 0
##$MI= 0
##$NCOEF= 0
##$NC_proc= -8
##$NLEV= 6
##$NOISF1= 0
##$NOISF2= 0
##$NSP= 0
##$NTH_PI= 0
##$NZP= 0
##$OFFSET= 14.98509
##$PC= 1
##$PHC0= 174.9188
##$PHC1= 0
##$PH_mod= 1
##$PKNL= yes
##$PPARMOD= 0
##$PPDIAG= 0
##$PPIPTYP= 0
##$PPMPNUM= 2147483647
##$PPRESOL= 1
##$PSCAL= 4
##$PSIGN= 0
##$PYNMP= <proc.py>
##$REVERSE= no
##$SF= 400.02
##$SI= 32768
##$SIGF1= 0
##$SIGF2= 0
##$SINO= 400
##$SIOLD= 32768
##$SPECTYP= <>
##$SREGLST= <1H.CDCl3>
##$SSB= 0
##$STSI= 32768
##$STSR= 0
##$SW_p= 8223.68421052631
##$SYMM= 0
##$S_DEV= 0
##$TDeff= 65536
##$TDoff= 0
##$TI= <>
##$TILT= no
##$TM1= 0
##$TM2= 0
##$TOPLEV= 0
##$USERP1= <user>
##$USERP2= <user>
##$USERP3= <user>
##$USERP4= <user>
##$USERP5= <user>
##$WDW= 1
##$XDIM= 32768
##$YMAX_p= 460757703
##$YMIN_p= -706892
##$CURPLOT= <Network HP LaserJet P1505>
##$CURPRIN= <$Network HP LaserJet P1505>
##$DFORMAT= <normdp>
##$LAYOUT= <+/1D_H.xwp>
##$LFORMAT= <normlp>
##$PFORMAT= <normpl>
##$SURQMSG= 1
$$ End of Bruker specific parameters
$$ ---------------------------------
##NTUPLES= NMR SPECTRUM
##VAR_NAME=  FREQUENCY,     SPECTRUM/REAL,   SPECTRUM/IMAG
##SYMBOL=    X,             R,               I
##VAR_TYPE=  INDEPENDENT,   DEPENDENT,       DEPENDENT
##VAR_FORM=  AFFN,          ASDF,            ASDF
##VAR_DIM=   32768,         32768,           32768
##UNITS=     HZ,            ARBITRARY UNITS, ARBITRARY UNITS
##FACTOR=    0.250966925370066, 1,           1
##FIRST=     8223.43324360094, -48533,       13458
##LAST=      0,             -62542,          -172519
##MIN=       0,             -706892,         0
##MAX=       8223.43324360094, 460757703,    0
$$ Real data points
##PAGE= N=1
##DATA TABLE= (X++(R..R)), XYDATA
$$ [...]
19470b08889B0163K82646C746K34447a27749A96070b22296B70944a72771H0853
19459a31079E7051b32315E9361c55545d8683p7264L6729B7432K09073A10953c8940
19447A0699b6419I1749a85747b9505B79741e2173D1864i05A22641m5426d30929
19435d8544k88619a65881p2269d1628F9572a18270m0737B75652g5858b5964j69243
19424a95207f1150n8054r2562B39403e54704B4456J41655f8768I9705g3205p2043
19413a45248k3723O6608k24933M8051A08254d3379a5651B51535j09684a65043
19402e2994d398k18292q0458A9027b19091N9145M6214I3776a20622n7718p2447
19391b50787b5133D4440K9594D494a94806k0926B5961b88023J19226B66107d01818
$$ y = [-208889, 20163, 302809, 3746, 238193, -127749, 196070, -222296, 270944, -172771, 80853, -131079, 57051, -232315, 59361, -355545, -48683, -125947, -89218, 27432, 236505, 110953, -38940, 10699, -26419, 91749, -185747, -29505, 279741, -52173, 41864, -905, 122641, 77215, -430929, -48544, -337163, -165881, -238150, -41628, 69572, -118270, -159007, 275652, -75858, -25964, -195207, -61150, -119204, -211766, 239403, -554704, 24456, 166111, -68768, 99705, -73205, -145248, -168971, -102363, -327296, -279245, 108254, -43379, -15651, 251535, 141851, -165043, -52994, -4398, -222690, -303148, 19027, -219091, -159946, -113732, 93776, -120622, -178340, -250787, -25133, 44440, 74034, 4494, -194806, -215732, 25961, -288023, -168797, 266107, -401818]
19379a1378j6624l2984K5786J3753B39190c67560i2246j45396K8761j28953F497
19367b78379k1185N9174a0541k62481f5059o6902r5637j43156f8172B79932b7081
19355c5527q5993K3754d8778l6336o5089A16029M976i4268c5270G1711a82890
19343e02112B5232b38276l9704b5874C7855c09207A27657b17680j32682D2757
19332A44555a78669k24258J75331A03594a37530l7325A2757a32599C62611f0142
19321D7278a0572k04555B49758b21508K4568a9897m5822l09223a58801b0503A20899
19309b32623P9949j82596j5410J0311A44350d5606A9454c68701D3253a79496j80212
19298c59708h2060k66057A10933L2263b4948q9390b2814p3670A55759f1744o683
$$ y = [-11378, -28002, -60986, -35200, -21447, 239190, -367560, -92246, -237642, -208881, -337834, 6497, -278379, -299564, -240390, -10541, -273022, -65059, -131961, -227598, -370754, -68172, 279932, -27081, -35527, -121520, -97766, -48778, -85114, -150203, 116029, 121005, -94268, -35270, 71711, -182890, -502112, 25232, -238276, -277980, -25874, 37855, -309207, 127657, -217680, -350362, 42757, 144555, -178669, -402927, -227596, 103594, -137530, -174855, 12757, -132599, 362611, -60142, 47278, -10572, -215127, 249758, -221508, -196940, -19897, -65719, -374942, -158801, -20503, 120899, -232623, -152674, -335270, -350680, -340369, 144350, -45606, 19454, -368701, 43253, -179496, -359708, -82060, -348117, 110933, 143196, -24948, -114338, -22814, -96484, 155759, -61744, -68427]
19287f8427I8864c28898H8873J1043B1194b16612i3900A39573a55661N0044l00618
19276d06235A73355d13645A47994P3776E4237a35502n4138c3491j01952l8066
19266a73509B63576A23143d13017a30365D01739a31834E431J25670A536c4732
19255a599k68997c5555r5534A90573b25230M9592n2419C5211b09663D6652a42022
19243H3389d51015h7462B8410K15497c15576J26538b9034A9248d19026a49223
19232e4117E2994f64k15593Q4587K8955E6286h4172a7778B46399f2308j13866
19221a76174B1054J25016a87686I6498d12930C8100M2378M1963J447a28286j73265
19210c01551e4666F1499K10995a24477R029j62141O9215A50492k8747b06869l5337
$$ y = [-68427, 98864, -328898, 88873, 99916, 21194, -216612, -93900, 139573, -155661, -105617, -406235, 173355, -413645, 147994, 221770, 54237, -135502, -189640, -33491, -135443, -173509, 263576, 123143, -413017, -130365, 401739, -131834, 5431, 131101, 1536, -34732, -1599, -270596, -35555, -131089, 190573, -225230, -175638, -228057, 35211, -209663, 46652, -142022, 83389, -451015, -87462, 28410, 243907, -315576, -189038, -29034, 19248, -419026, -149223, -54117, 52994, -664, -216257, -131670, -102715, 56286, -84172, -17778, 246399, -62308, -176174, 21054, 146070, -187686, 96498, -412930, 38100, 80478, 122441, 123888, -128286, -301551, -54666, 61499, 272494, -124477, -115448, -277589, -208374, 150492, 121745, -206869, -242206]
19199b42206g2082r9053h941J299o5619B4298b06605f2296A9843a87411k1160
19188b08571A30621a76020A6872K2605a26197B4822b75261A50965c75792F8580
19177c88397a91736k35241Q2390E9443g3368j50328k44501J22182a354m8562q0629
19166a30545B0457d6890m8238J0208j928I3065h6942K0187k27429c8836k00114
19155b38950b8291B01122a10609j27759A21635i9443B36179j06859J3799R7749
19145B40868r8299k9006m7616g4274j41723i1881F641b20336a1278p1753j46275
19134b29306H3643O5505a73746k62191G4420M329d6058l6983q1987A19329c0174
19122D7260B2010J66456d1954I470a50210f0677j54553f6748j65015H8105c1369
$$ y = [-242206, -72082, -171135, -8941, -7642, -73261, 24298, -206605, -62296, 19843, -187411, -208571, 130621, -176020, 16872, 39477, -126197, 24822, -275261, 150965, -375792, 68580, -388397, -191736, -426977, -344587, 59443, -73368, -223696, -468197, -346015, -1354, -49916, -130545, 20457, -46890, -95128, -84920, -86848, 93065, -86942, -66755, -294184, -38836, -238950, -28291, 201122, -110609, -238368, 121635, -99443, 236179, 129320, 143119, 240868, 142569, 113563, 65947, -74274, -215997, -91881, 6641, -220336, -11278, -83031, -229306, 83643, 149148, -173746, -435937, 74420, 78749, -46058, -83041, -165028, 119329, -30174, 47260, 22010, 188466, -41954, 9470, -150210, -60677, -215230, -66748, -231763, 88105, -31369]
19110e3252L833k88522j74889b52478A89007r808A0541d412A429a44845D2971
19098d9576A47361b26240J7449M2891E1967j6915i5547B09866M18499A48681a2684
19086A60882a46695B0945b44043J18987D0759b84571B87999H86a14560c8111k08481
19075b46592E6085a29666k84079a4157r1630d3085j94820a06572H3646b00074
19064A85097a43287d8244C8077J33360b53532I108K4874b4452j10471I8800P5010
19053A73810a27271k39008J21526D2377h145E4898b36734k0719O7077b9283j9809
19042d9092D858L9441b47533A07796i478B48597a74787M6193j02419i6437D8684
19030A16570a08431C8299a71049M8151B18508c4052B3423N8382a25504C52194
$$ y = [-53252, -49419, -337941, -512830, -252478, 189007, 179199, 10541, -4412, 1429, -144845, 42971, -49576, 147361, -226240, -208791, -165900, 51967, 35052, -95547, 209866, 628365, 148681, -12684, 160882, -146695, 20945, -244043, -125056, 40759, -284571, 287999, 886, -114560, -38111, -246592, 56085, -129666, -413745, -14157, -105787, -43085, -237905, -106572, 83646, -200074, 185097, -143287, -48244, 38077, 171437, -253532, 9108, 33982, -24452, -134923, 98800, 173810, -127271, -366279, -244753, 42377, -8145, 54898, -236734, -257453, -190376, -29283, -49092, 4858, 44299, -247533, 107796, -9478, 248597, -174787, -128594, -231013, -96437, 48684, 116570, -108431, 38299, -171049, -122898, 218508, -34052, 23423, 81805, -125504, 352194]
19019a28426M4027A11429J91287R249e5395q953A44427p1212a55748k1898j43181
19008c20827A72228b49047o7278R7047A90020q6794O7256a17301A77980a26270
18997A66171b57201L9625a8428B3374g9281A00413g5406r111m7000j19898F7245
18985a43030d0787k14069C3644q091J2104b19843g5368l4200I711a13963j16046
18974b30009g7757j54839e2326A64804M42275k19663j25144F0275L39258e0201
18963A35000a29698j97875a56896d8181o07q5242B750K615N6238b74219B01664
18951C31090a20264j92169H7555e11476B55698b92064d4186j32710P805B4074
18940b18759G2879a53177I0374A2124d4252G1273a62311f4352l90904I6402a57550
$$ y = [-128426, -84399, 111429, 302716, 311965, -55395, -64348, 144427, 73215, -155748, -177646, -320827, 172228, -249047, -316325, -219278, 190020, 103226, 170482, -117301, 177980, -126270, 166171, -257201, -217576, -18428, 23374, -79281, 100413, -75406, -84517, -131517, -251415, 67245, -143030, -40787, -254856, 33644, 25553, 37657, -219843, -75368, -109568, 9711, -113963, -230009, -77757, -232596, -52326, 164804, 607079, 387416, 262272, 60275, 399533, -50201, 135000, -129698, -327573, -156896, -48181, -48788, -134030, 2750, 5365, 61603, -274219, 201664, 331090, -120264, -312433, 87555, -511476, 255698, -292064, -44186, -176896, -169091, 24074, -218759, 72879, -153177, 90374, 12124, -44252, 71273, -162311, -64352, -455256, 96402, -157550]
18928G5283M1487a4484I9374i2327B4866J91039b81189f0544j92671C22523F2176
18916d5567r2164A02493J6791b60403J10360G6273P6082J27035K7449A44923L33200
18905D78123l5385C7087J33721a85992b9738m3109j05238A60768a35474G5697
18894e0359k0971C31627a91884l2441Q7474j97533G6128K31a28851E6404a93723
18882c29438F8449f00441h2889F0599a21682J5583A36158o1817b1734k22065G9058
18870E8646i2870A67806H0905C569a43871A7064Q3797K74963f8772C5969J415
18859C7384j7509e238j23795E0621g0111B49384a04929l3527A26180b60149D81671
18847b54559G8560A387b03535J7525e6282j10312O6171n1776A53971R5765J84496
$$ y = [75283, 116770, -14484, 99374, -92327, 24866, 215905, -281189, -60544, -253215, 322523, 62176, -45567, -137731, 102493, 119284, -260403, -150043, 76273, 152355, 279390, 306839, 144923, 478123, 442738, 37087, 170808, -185992, -29738, -72847, -178085, 160768, -135474, 75697, -50359, -71330, 331627, -191884, -224325, -136851, -334384, 76128, 76359, -128851, 56404, -193723, -329438, 68449, -600441, -82889, 60599, -121682, -106099, 136158, 74341, -21734, -243799, 79058, 58646, -92870, 167806, 80905, 3569, -143871, 17064, 100861, 375824, -68772, 35969, 37384, 19875, -5238, -129033, 50621, -70111, 249384, -104929, -138456, 126180, -260149, 481671, -254559, 78560, 1387, -203535, -186010, -56282, -166594, -100423, -152199, 153971, 249736, 434232]
18836D34232c6446F4784b17096A42420E9707b07940B1260L5711O6426K34960d17952
18824b06275F4088K7703m824g06892J50835G8077b52030B1430K8945d4356q6321
18813a30677j55236d4188D77067B3686K99496G2223K75437H5555K555C931a63492
18801B2240K56205m7620E2103D557a18201r1318B3426e7482A72041d32538b9687
18789a61575f136j56842j4652Q3710k6815b1247o757m7936c5325j54621A85636
18777B62824b49298B71532G4125a40781k21L305B13141c072B28155h1251d0418
18765a08935L842B09654a20384e4188J8991j17715m3711a4496j23528I429a54874
18753A11737K1905F0169K0189b71267a19075B31845G8949K47628a85881B112a16548
$$ y = [434232, -36446, 64784, -217096, 142420, 59707, -207940, 21260, 56971, 123397, 358357, -417952, -206275, 64088, 91791, 86967, -706892, -556057, 78077, -252030, 21430, 50375, -44356, -130677, -285913, -44188, 477067, 23686, 323182, 72223, 347660, 85555, 88110, 3931, -163492, 22240, 278445, 230825, 52103, 4557, -118201, -209519, 23426, -57482, 172041, -432538, -29687, -161575, -6136, -162978, -177630, -93920, -120735, -21247, -28004, -75940, -35325, -189946, 185636, 262824, -249298, 271532, 74125, -140781, -141002, -137697, 213141, -3072, 228155, -81251, -40418, -108935, -105093, 209654, -120384, -54188, -35197, -152912, -196623, -14496, -138024, 9429, -154874, 111737, 133642, 60169, 80358, -271267, -119075, 231845, 78949, 326577, -185881, 2112, -116548]
18741A97449L5453C8096a30488j17479a3314o1943j722j18333E1492l251b03354
18729G2373c34083M0337c948D5967M0845c12412f9243B4834a80322h8994B52884
18717a76168l0829o3281l5460I1596D0024L40196a71283A06622E3293L7500c7086
18705A63986b18724A46542d9745C5630c67665A9375i1841d2485l7630n3849b9523
18693f4100k50667a17909E2348c06987a05758B09469J9053c06614H0805c10872
18682a71838n2283d5721F4842c93399B2928N485c4450j02847A48592a66041C650
18670a952o1042k19506f7531F105i2429m01344b00499e6567A78625f2464l4193
18659i6657j92697h8803m31621b19742f2995c0708C5096a30597A88423b58250
$$ y = [197449, 232902, 38096, -130488, -247967, -13314, -75257, -76979, -195312, 51492, 48241, -203354, 72373, -334083, -293746, -3948, 45967, 86812, -312412, -69243, 24834, -180322, -88994, 252884, -176168, -206997, -270278, -305738, 91596, 40024, 380220, -171283, 106622, 53293, 90793, -37086, 163986, -218724, 146542, -49745, 35630, -367665, 19375, -91841, -42485, -80115, -133964, -29523, -64100, -314767, -117909, 52348, -306987, -105758, 209469, 228522, -306614, 80805, -310872, -171838, -224121, -45721, 64842, -393399, 22928, 28413, -34450, -137297, 148592, -166041, 3650, -1952, -62994, -282500, -67531, 6105, -92429, -493773, -200499, -56567, 178625, -62464, -96657, -289354, -88803, -520424, -219742, -62995, -30708, 35096, -130597, 188423, -258250]
18648A20756d31659a20888C77073C8357J66087B0039N8275L0240b32003B06033
18637C070b42307d3311A04124b09495n1520g2096J7429A15440N8a59950Q93A23506
18624d1129n6749n5705j29093D90221a61969j6982d075C2179b46531o7460J01490
18613b12501A3782d26010H2596a60j14419k35785a34811j29331g8166l18046J79131
18602b17081R0757m8372E8948b49510B56304I9325A6467j690O1698N3745p184
18591A23036B3083J36468b01054a4167o1879A60261F445a10979b3476n2654A84047
18579a62542A98455b96390A99547a83016A27054E3332c52022A12439L3423a00143
18568a38060c1901A98967f5417q0120m0693n1804n0165F8773a4467B61572A0195
$$ y = [120756, -431659, -120888, 377073, 38357, 204444, 20039, 78314, 108554, -232003, 206033, 3070, -242307, -43311, 104124, -209495, -261015, -72096, -54667, 115440, 115498, -159950, -159057, 123506, -41129, -97878, -153583, -282676, 490221, -161969, -178951, -4075, 32179, -246531, -313991, -212501, 13782, -426010, 82596, -160, -114579, -350364, -134811, -264142, -78166, -396212, -217081, -126324, -174696, 58948, -249510, 256304, 99325, 16467, 14777, 76475, 130220, 123036, 23083, 159551, -201054, -14167, -76046, 160261, 6445, -110979, -23476, -76130, 184047, -162542, 198455, -296390, 199547, -183016, 127054, 53332, -352022, 112439, 145862, -100143, -138060, -31901, 198967, -65417, -145537, -186230, -238034, -288199, 68773, -14467, 261572, 10195]
18556f4106o6116B27762F159J5960b1443m14943b9098j67007j28160F077a97058
18544A18073a28182B03659J22463d18093A25070i9527A27797O6703a46615K4739
18534a21876j37205J12058k3132A38599J47439b39422A219a19216m01762b55986
18523a58025b3643j52175a9583C733h770j45953O0889A25773C1335i748l38020
18512c47768h4540a1897j67792B16159d5186l4691C9639J12451E9802K73350B274
18500H49a12303K2664A49198c60107A81082K37884G6829C5453N2837b6369k4052
18489e0421a0747l46693a22528E7264K47397a20352D759b43026d6558I1381J6694
18478A08075f0636j52284O1078O084j27748a3631B43418G9607g4401o0961n9750
$$ y = [-64106, -130222, 227762, 6159, 22119, -21443, -436386, -29098, -196105, -324265, 6077, -197058, 118073, -128182, 203659, 326122, -418093, 125070, -99527, 127797, 194500, -146615, -121876, -259081, -147023, -170155, 138599, 286038, -239422, 1219, -119216, -520978, -255986, -158025, -23643, -175818, -19583, 3733, -8770, -154723, -93834, 125773, 31335, -9748, -347768, -84540, -11897, -179689, 216159, -45186, -79877, 39639, 152090, 59802, 333152, 2274, 849, -112303, -89639, 149198, -360107, 181082, 418966, 76829, 35453, 88290, -26369, -50421, -10747, -357440, -122528, 57264, 304661, -120352, 4759, -243026, -46558, 91381, 108075, -60636, -212920, -151842, -145758, -273506, -13631, 243418, 79607, -74401, -135362, -195112]
18467a95112C2876a26600c9764j06125p029B74212a89979R1273m4401q6877J03798
18456a26186d0091A19465b296D1765b79782J21521A45881F2710e2587a7990A60545
18444A28870a87875n8993a00989D9158j4763a10661o4856C9465c6144k3163I8805
18432I8489g2710l67258C15924n1006I4123h506m0042B67727a04707j53690Q152
18421b50245H6657j7288j4228B1213I063N5086c16677a03189A9990d9155r2430
18410a41585H0120c40582g2143n3800A31035m2355O1768M7117a64288A65014F5974
18398F7212M7380J73948F492J00104k54a32030B7421K3322L97127E8398j4382
18387D4016a09947j57056h5642A13375h2446A11032C0973J19887B610e688j68605
$$ y = [-195112, 32876, -126600, -39764, -145889, -152918, 274212, -189979, -98706, -143107, -229984, -126186, -40091, 119465, -2296, 41765, -279782, -158261, 145881, 62710, -52587, -17990, 160545, 128870, -187875, -246868, -100989, 49158, 34395, -110661, -175517, 39465, -36144, -59307, 98805, 98489, -72710, -439968, 315924, 264918, 94123, -8506, -48548, 267727, -104707, -258397, -250245, 86657, 69369, 55141, 21213, 9063, 64149, -316677, -103189, 19990, -49155, -141585, 80120, -340582, -72143, -125943, 131035, 88680, 150448, 197565, -164288, 165014, 65974, 67212, 114592, 288540, 6492, 106596, 106342, -132030, 27421, 50743, 447870, 58398, 44016, -109947, -267003, -85642, 113375, -82446, 111032, 30973, 150860, 2610, -5688, -174293]
18376a74293l2715j3034n9492L9742J7440a3781k81834R9402Q7922B38710J29217
18365C67927k6234e0938G5703b9565A07320C2910J481G779f4110k28791g3374
18353H6116i5033j55506A98680b3840r6892A06452h7779B2555a41330k04398b3960
18341B0488b7223A52781A4190P3618b7408j89209i4507A81736P7423f1830B3766
18329A39720E8031a59293A08761k2204j0540N2369B9134a51064C0817J28924J994
18318A61735d34891J74378O4342k504I2534N6006K84929b79367I9982b65882A70310
18306g1316n4957c9506a8434r208A8456j155M5469l354M3293N4355J26697j07439
18294A76322D1348C449K25224b66942A71962D2425f6404n9611j25839A43030a46219
$$ y = [-174293, -207008, -220042, -279534, -239792, -222352, -13781, -295615, -196213, -108291, 238710, 367927, 341693, -50938, 75703, -29565, 107320, 32910, 34391, 7779, -64110, -292901, -73374, 86116, -95033, -250539, 198680, -23840, -120732, 106452, -87779, 22555, -141330, -345728, -23960, 20488, -27223, 152781, 14190, 87808, -27408, -216617, -94507, 181736, 259159, -61830, 23766, 139720, 58031, -159293, 108761, 86557, 76017, 128386, 29134, -151064, 30817, 159741, 161735, -434891, -260513, -196171, -198675, 92534, 148540, 433469, -279367, 99982, -265882, 170310, -71316, -126273, -39506, -18434, -27642, 18456, 17301, 62770, 59416, 102709, 157064, 283761, 176322, 41348, 3449, 228673, -266942, 171962, 42425, -66404, -126015, -251854, 143030, -146219]
18282A55159c23316A63686a8153j5544A02278c67641e4752m04746h1905B6859
18271a88809N1098P771C1971h0621F9667a55228B19956C3511M6660J9237k4153
18260G5255K8904c0616k36450A00505b70732O8045D119J28088D8751K18364q9208
18249A77907q7796b14366C9546c21453f2958j29509f0593A27912E7169N4753b90
18237F830b70539g272A80068M446a0301B19405b02362g3794j11564P8069C24607
18225a6530j56954D76128B34600R0864b01209B74376o0517a50324p2777l4656
18215b57757K2431A15780f7443K6717j6262A53259b9676o811k44712A6189R7657
18204A13846d05404A27706k296M6944a123B974a14190b0808j78305h4049j12772
$$ y = [155159, -323316, 163686, -18153, -33697, 102278, -367641, -54752, -459498, -81905, 26859, -188809, -137711, -129940, 31971, -80621, 69667, -155228, 219956, 33511, 80171, 99408, 75255, 104159, -30616, -267066, 100505, -270732, -202687, 4119, 132207, 48751, 267115, 177907, 90111, -214366, 39546, -321453, -62958, -192467, -60593, 127912, 57169, 111922, -290, 6830, -270539, -7272, 180068, 184514, -10301, 219405, -202362, -73794, -185358, -107289, 324607, -16530, -173484, 476128, 234600, 325464, -201209, 274376, 213859, -150324, -223101, -257757, -235326, 115780, -67443, -40726, -56988, 153259, -29676, -36487, -281199, 16189, 113846, -405404, 127706, 125410, 172354, -1123, 2974, -114190, -20808, -199113, -84049, -196821]
18193a96821O1877n2687c8597p3989A25537h7607K8091J5355A98515B7332M25707
18182D53039A50634d22899G5118B379E81K38746f0717B78694i3773o4246m7589
18171b05608a8022j71441g0115B90036b15343j2938A02584J21673F2750h4623
18160a55853j5714D0910J05319J4767b60609D9490J6255J75772c7573q1240b5456
18148H0540J65870j20067b43513B2045a70762J7370c5405N596C2514l741a35332
18136D8197A3432a82994r0467c4560A41133f331m3123I7489g5940k32564B1839
18124F3726j6651c45863C36499b9269k71127A04610b8324G7650a05359B02583
18113F98419a77778j97981c4608n7931E8938L0292P4992F0548Q866j2541A2377
$$ y = [-196821, -134944, -187631, -38597, -112586, 125537, -87607, -59516, -44161, 198515, 27332, 453039, 150634, -422899, 75118, 2379, 581, 239327, -60717, 278694, -93773, -158019, -205608, -18022, -189463, -70115, 290036, -215343, -228281, 102584, 224257, 62750, -84623, -155853, -171567, 40910, 146229, 160996, -260609, 49490, 65745, 241517, -37573, -118813, -25456, 80540, 246410, 126343, -243513, 22045, -170762, -153392, -35405, -29809, 32514, 28773, -135332, 48197, 13432, -182994, -273461, -34560, 141133, -6331, -49454, 97489, -75940, -308504, 21839, 63726, 47075, -345863, 336499, -29269, -300396, 104610, -28324, 77650, -105359, 202583, 698419, -177778, -375759, -34608, -92539, 58938, 89230, 164222, 60548, 69414, 56873, 12377]
18101b12593A03538l3574N3154L0607n4150c0697q0449H0055J64249i3620a0262
18089D5207P4401f3360a0962l99185A11961K46662a52757C17251d0259E3824c5783
18077b6139F6744k4689j0525O8021J23720P110a91988H6654O1155d4403D03071
18065a14866c2477A28444j7340b9372A48840H485J46247L08281A83304q1390a03717
18053c7818k5755n9704E7480c5078F9287f8521A45790Q5110J90048a45416L5434
18042a09982j8861m7973B968M8504d7724o2073C02643a13763p0299A27924l1133
18031I6791i6473j06487C975K81462a41733k5295p9929J9770B7733J57073E7082
18019A68927C1084L76959A6738g6655B03049I5468R3748a30445E9034a11254a3432
$$ y = [-212593, 103538, 69964, 123118, 153725, 99575, -30697, -111146, 80055, 244304, -93620, -10262, 45207, 119608, -63360, -10962, -410147, 111961, 358623, -152757, 317251, -40259, 53824, -35783, -26139, 66744, 42055, 31530, 99551, 223271, 230381, -191988, 86654, 147809, -44403, 403071, -114866, -32477, 128444, 111104, -29372, 148840, 8485, 154732, 463013, 183304, 101914, -103717, -37818, -63573, -123277, 57480, -35078, 69287, -68521, 145790, 230900, 420948, -145416, -109982, -128843, -176816, 2968, 51472, -47724, -109797, 302643, -113763, -184062, 127924, 96791, -96473, -202960, 3975, 285437, -141733, -167028, -246957, -227187, 27733, 184806, 57082, 168927, 31084, 408043, 16738, -76655, 203049, 95468, 189216, -130445, 59034, -111254, -13432]
18007B09154R246i6107A03042A2410a08020R714G0757K8702a82318e0339A03207
17995g404n8917l605c4727r6286N6961B97005f0617j25587e9386K0415A1679P0647
17983H2326k1768K73907j36703l6461c43611A16842c0143A53992a19023B2744
17972d1943B7867O196a51086l0056A54628M1142f9528A1739J6959a87742B61670
17960a49120o1845A52303c0134j64275A72443j9682b5297B53202p8224a97986
17949c8630A1314n045J62317P9051J75338i7275D8169a65279o1195f1220r1692
17938a52912A73600b63348B76527A03903O2602k4515o1151e8896A368a35367B12526
17926B8457b20926F4026l1335b78796Q4894J367M1248n8449A91948b17859O7352
$$ y = [209154, 218400, -96107, 103042, 12410, -108020, -98306, 70757, 99459, -182318, -50339, 103207, -7404, -66321, -69926, -34727, -131013, -74052, 297005, -60617, -186204, -59386, -38971, 11679, 82326, 60558, 334465, 197762, 161301, -343611, 116842, -30143, 153992, -119023, 22744, -41943, 27867, 34063, -151086, -181142, 154628, 195770, -69528, 11739, 28698, -187742, 261670, -149120, -210965, 152303, -30134, -194409, 172443, 152761, -25297, 253202, 174978, -197986, -38630, 11314, 6269, 168586, 247637, 422975, -97275, 48169, -165279, -226474, -61220, -152912, 173600, -263348, 276527, 103903, 166505, 141990, 80839, -58896, 1368, -135367, 212526, 28457, -220926, 64026, 32691, -278796, -193902, -192535, -151287, -209736, 191948, -217859, -150507]
17915a50507A42816a53329k5799C00502D4444J66346A02737b27866C3548a58998
17904A21269n1563d831F5802G825P0303a64157F8553D044b33335h3102q2821d357
17891E5933b20440m104B86724a35798b3791l18795a34400B92187L1668A15833
17880A84364H5549K43033m5300i4454B00989a38272C97223B5672K7087K9748C1965
17868A13565j4209n841a4981A70680i7587E67430H6290J15401F3610L06704A7261
17856d00232a73447C7355p294J08444R326K7487g2190A14328c15895A60601d3576
17844A8476J1306R9065J37251H9571J49150O1856b8714C002O1531e3752A83313
17832f6252q8324C66597A01103R5359E5925a76546B23337c6121B57487e7644B45156
$$ y = [-150507, 142816, -153329, -179128, 300502, 44444, 210790, 102737, -227866, 33548, -158998, 121269, 69706, -4831, 65802, 7825, 78128, -164157, 68553, 4044, -233335, -83102, -165923, -4357, 55933, -220440, -224544, 286724, -135798, -23791, -342586, -134400, 292187, 323855, 115833, 184364, 85549, 328582, 283282, -94454, 200989, -138272, 397223, 25672, 52759, 82507, 31965, 113565, 99356, 93515, -14981, 170680, -97587, 567430, 86290, 201691, 63610, 370314, 17261, -400232, -173447, 37355, 30061, 138505, 147831, 175318, -72190, 114328, -315895, 160601, -43576, 18476, 29782, 128847, 266098, 89571, 238721, 300577, -28714, 3002, 64533, -53752, 183313, -66252, -154576, 366597, 101103, 196462, 55925, -176546, 223337, -36121, 257487, -57644, 245156]
17820F5873a01669k7320P188q2202B26784A07776j6751f3147A74901P8991M924
17809B58816b7387D8430J21121D2483J99204f9411B49708j13585l7673m6585A1669
17797f0681c0157F3615b41951h8012o1675A62893E6581J71114J15739a1771A38470
17785a65357A22575g3424j40604d2958A20140K8616n6617b56701B20582D9367
17774B8305i2099A47296k460J66549B7520J07946b29899A11847Q6037L5687a45904
17762A89434J05690a43428f559j03518L9512L4463B82045r1695b08766B51679
17751a33535B13048k0634M7761J42638B0857c4647A19850p924J81843F3076Q1059
17740A44135J04558i2189A75407b7735A46966a67414j66788B13423a29018d0042
$$ y = [65873, -101669, -128989, -121801, -204003, 226784, 107776, 91025, -63147, 174901, 253892, 258816, -27387, 48430, 169551, 42483, 241687, -69411, 249708, 136123, 98450, 51865, 11669, -60681, -30157, 63615, -241951, -88012, -149687, 162893, 56581, 227695, 343434, -11771, 138470, -165357, 122575, -73424, -214028, -42958, 120140, 148756, 92139, -256701, 220582, 49367, 28305, -92099, 147296, 144836, 311385, 27520, 135466, -229899, 111847, 197884, 233571, -145904, 189434, 295124, -143428, -6559, -110077, -70565, -36102, 282045, 190350, -208766, 251679, -133535, 213048, 192414, 240175, 382813, 20857, -34647, 119850, 111926, 293769, 63076, 144135, 248693, -92189, 175407, -27735, 146966, -167414, -334202, 213423, -129018, -40042]
17729A73549C6837J79547C1218P6250J71331D1777K38793l018j0953R7595a20357
17717D44324b48736e7241H1697b95440a40861A36721R9054a54676C9949j1074
17707B8875J40422a1670n2103A05880J3024A7272a4049A18582M8446f1690B67647
17695F1295i8448A24032N2303p1619a1126j33133B34875j15119J51790a13233
17684A95241i3373d4264C1389J45284i1932B3404K46071d6308L293B41858b3507
17672B61985a40356M2117j77495H1235J71804B9001R6537f0665R077A45644m8730
17661I6914K49046p8681K97616k79190K24111A2683J42804J44475b85678d4449
17650B56136A01964O5842n122a04530B49125P1050n9328b69052D44715A42319
$$ y = [173549, 36837, 216384, 31218, 107468, 278799, 41777, 280570, 277552, 266599, 364194, -120357, 444324, -248736, -57241, 81697, -295440, -140861, 136721, 235775, -154676, 39949, 28875, 169297, -11670, -63773, 105880, 118904, 17272, -14049, 118582, 167028, -61690, 267647, 61295, -98448, 124032, 176335, 104716, -11126, -144259, 234875, 119756, 271546, -113233, 195241, -93373, -44264, 31389, 176673, -91932, 23404, 269475, -46308, -43015, 241858, -23507, 261985, -140356, -98239, -275734, 81235, 253039, 29001, 125538, -60665, -51588, 145644, 96914, 345960, 267279, 564895, 285705, 509816, 12683, 155487, 299962, -285678, -44449, 256136, 101964, 167806, 162684, -104530, 249125, 320175, 260847, -269052, 444715, 142319]
17639F6830b70525A47642K41517F6467J18342a08457C88705A26224a6669A79219
17628C68947b7369C02160A31287R8094L12086j98020B9064O3062B9986L79127
17618D09113A5047L02015j18715m5520J6652a92598B58637p4551E9093a50085
17607A97852r2963a69391N4058A16873p736K92668h5645A73292b30874C06999
17596A69337a28142D67995A76519L43731G5315K99425j31558J09813K39125B93401
17585A09041m6688a60175D74916I3758d6043B9335L7545a8453B90911A8226e0037
17573b4983A33420a33497G4739K48700p2149K7157j23895P4430p6166J33832A01201
17561A12612a84475B57661K00804B374O9736J25345O2057A17427M4388J08822
$$ y = [66830, -270525, 147642, 389159, 66467, 184809, -108457, 388705, 126224, -16669, 179219, 368947, -27369, 302160, 131287, 229381, 541467, 343447, 29064, 92126, 29986, 409113, 15047, 317062, 198347, 152827, 169479, -192598, 258637, 184086, 59093, -150085, 197852, 104889, -169391, -115333, 116873, 109137, 401805, -85645, 173292, -230874, 306999, 169337, -128142, 467995, 176519, 520250, 75315, 374740, 243182, 352995, 592120, 293401, 109041, 62353, -160175, 474916, 93758, -46043, 29335, 66880, -18453, 290911, 18226, -50037, -24983, 133420, -133497, 74739, 323439, 251290, 278447, 154552, 228982, 152816, 286648, 101201, 112612, -184475, 257661, 458465, 2374, 72110, 197455, 259512, 117427, 161815, 270637]
17551B70637J369j17966o4342D542K19487M0843O5809G4255J08406p3139e0785
17539C23528A24529J28841J06551n3469j24444B0896K84331o7490Q7331O3030
17529C88098K22684A99926K48966O2085L85595L09427L17027o56731J53288E02635
17518H64226C87030M9307j1820q0163J86575o5589L39735J04645l4701N4378J40730
17507A070127L66k23955m15381N9608p665J3875A58686D4597K38939n2861o3149
17496A67526L3425p7719K37280j00015P4592J2514O1404F2985A8621L73094A82548
17484B11628J77835j25118P4262l009J56118r4416m6933D9656M26104k18708K6438
17473B83490J18579p7870p431J92916j39297j21861K32642J63745A87529J67655
$$ y = [270637, 272006, 154040, 89698, 4542, 224029, 264872, 330681, 74255, 182661, 109522, -50785, 323528, 124529, 253370, 359921, 306452, 182008, 20896, 305227, 237737, 325068, 388098, 610782, 199926, 448892, 510977, 896572, 1205999, 1523026, 866295, 1019583, 502635, 864226, 387030, 436337, 424517, 344354, 530929, 465340, 805075, 909720, 875019, 929397, 1070127, 1070493, 846538, 431157, 490765, 483100, 496975, 158686, 44597, 283536, 230675, 167526, 200951, 123232, 360512, 260497, 335089, 347603, 409007, 62985, 18621, 391715, 182548, 211628, 389463, 264345, 338607, 335598, 491716, 397300, 350367, 49656, 475760, 257052, 283490, 402069, 324199, 316768, 509684, 370387, 248526, 481168, 644913, 187529, 355184]
17463C55184j50795K00597c7187C23349k5718J35675A67546K69737j54523K08062
17453D90822B31667l025B7196L71112j43198J42858j4124A43244M47622B73837
17442D01478q2340K64754o8043B45690J04353J40297B40765J73229J09611N2147
17432E75752B11379K76476Q0254B33797J31313n4523J77446q5524p6725Q6346
17422D12130K4391p713j28241K6637P3334A77210Q3286p6265L60037P756A86757
17410C89213A86201G6694L01906k1184j27710a126E03783E2314J94260q7487J07423
17399B66510p7915J52948A48661J3770J80852P2235F9987L49048n4923I4913J11507
17388B06420J61607i168A82035K01587A53631L87439B21281K13397j65154j4491
$$ y = [355184, 204389, 404986, -37187, 323349, 297631, 433306, 167546, 437283, 282760, 490822, 231667, 228642, 27196, 398308, 255110, 397968, 383844, 143244, 590866, 273837, 401478, 319138, 583892, 515849, 245690, 350043, 490340, 240765, 413994, 523605, 575752, 211379, 487855, 568109, 233797, 365110, 310587, 488033, 402509, 325784, 412130, 436521, 428808, 300567, 327204, 400538, 177210, 260496, 184231, 544268, 552024, 186757, 389213, 186201, 76694, 378600, 357416, 229706, -1126, 503783, 52314, 246574, 159087, 266510, 188595, 341543, 148661, 162431, 343283, 415518, 69987, 419035, 364112, 94913, 206420, 368027, -9168, 182035, 383622, 153631, 541070, 221281, 434678, 269524, 255033]
17378B55033J8187a2275E03171B43380K61110B28301K98650j69371A61211R1421
17368B52632j22680O799J8719J87277A66591k2128J62701A2817R9824K88893a33359
17356B78058K07632h2043I9522L02909R3666G4997J15940L6915K85017B27312
17345B54737j07520l0539K12281j34770L41528B49858K36536q6451p4752J47608
17335D72799A14284L29860o9568J77738k34151I6399L80659A85827j5398K24762
17325C95191k1839A60134B6102M23487j40246I9914J20076O5169K04837k25438
17315B64558J4729k4729L14502n1913k21747h4970d555D99291B34254J96401k04931
17304B25724A06642L98848A72352K56083K39001B87989P0939M568J03315k07840
$$ y = [255033, 273220, -12275, 503171, 243380, 504490, 228301, 526951, 357580, 161211, 252632, 129952, 136751, 155470, 342747, 166591, 144463, 307164, 12817, 112641, 401534, -133359, 278058, 485690, -82043, 99522, 402431, 496097, 74997, 190937, 227852, 512869, 227312, 254737, 147217, 116678, 328959, 194189, 535717, 249858, 486394, 399943, 325191, 472799, 114284, 444144, 374576, 552314, 318163, 96399, 477058, 185827, 170429, 395191, 373352, 160134, 26102, 449589, 309343, 99914, 219990, 285159, 489996, 264558, 279287, 254558, 569060, 517147, 295400, -84970, -4555, 499291, 234254, 430655, 225724, 106642, 505490, 172352, 428435, 667436, 287989, 358928, 363496, 466811, 258971]
17294B58971J39810k7748j32208J28732J21828D4415N22324k57127J12871k7207
17284C95276J33383l427C1929J543M98514k04030P7915J11902K2265j8400j86196
17273C35442k7010J56251A93237r1797K37270j48732N09329k93211R2166M3375
17263E41637f3A35400K79573j0182A83732K69686B04221J67969A39850J24333
17253B64183K1263J75048L2771j34297J9402l3588M104K55168B94604A14727A5441
17241A45381M22525o6725p8960J29227R2784A67256N95301C9837O81936A46811
17230E65135k40986o194K09204K2195Q55A76495K05025K30228A78309J54597l1207
17219C01699J80821J7359B20359o5393L68519B33437L45931k51637P6464j3643
$$ y = [258971, 398781, 371033, 238825, 367557, 489385, 44415, 566739, 309612, 422483, 395276, 528659, 525232, 31929, 33472, 531986, 327956, 405871, 517773, 540038, 521638, 335442, 308432, 464683, 193237, 101440, 338710, 189978, 699307, 406096, 498262, 541637, -63, 135400, 414973, 404791, 183732, 453418, 204221, 372190, 139850, 264183, 285446, 460494, 493265, 358968, 378370, 344782, 348886, 604054, 294604, 114727, 15441, 145381, 567906, 501181, 422221, 551448, 644232, 167256, 762557, 39837, 721773, 146811, 565135, 324149, 317955, 527159, 549354, 550209, 176495, 381520, 611748, 178309, 332906, 301699, 482520, 499879, 220359, 154966, 523485, 233437, 579368, 327731, 404195, 390552]
17209C90552l799J85908B65893L26555B49083q1245J75211k5351J46081j20385
17199C43394L08944J39578l0987l04863P409j81598Q0452Q3439n8171m2631J44325
17188D89291N90A94202M44843n3816B11874L77873o2727q5876o6290J73016K02355
17177G50225j74402A86532M99098j93073j80295j22247K61141K91189l9409J3567
17167G16503C52810J53049n2731L4411K50726O1261k65858L35883l52855O461
17157E23157N30453m24639L462M9820l3536n1126j33062J11900K23634l46078
17147D53985K09043J04223j18885k43822p584L45934l64085N70681k86297l818
17137F59375B98717N09458k71568J94421J24677l14825J50235j13946K00599j58924
$$ y = [390552, 386753, 572661, 265893, 592448, 249083, 167838, 343049, 317698, 463779, 343394, 652338, 791916, 760929, 456066, 463475, 281877, 362329, 445768, 387597, 344966, 489291, 489881, 194202, 639045, 585229, 211874, 589747, 527020, 441144, 374854, 547870, 750225, 575823, 186532, 685630, 492557, 312262, 190015, 451156, 742345, 702936, 716503, 352810, 505859, 453128, 487539, 738265, 799526, 533668, 869551, 516696, 523157, 1053610, 628971, 632433, 682253, 648717, 597591, 464529, 576429, 800063, 453985, 663028, 767251, 648366, 404544, 396960, 742894, 378809, 949490, 663193, 659375, 298717, 808175, 536607, 731028, 855705, 540880, 691115, 577169, 777768, 618844]
17127F18844n1966k23865K37059J27853J28650j63667K16828B76007L59458l14743
17117C20722L52861B48151M34351j00756m6175J7055J85749n7367k48121K20073
17107F52960K8047L50833k30740j23120k57575j83340M71305O0802j05498j31316
17097E32358J94562R6483J04459n1649k51755L9928K00972k56275J01806L33295
17087A044184j54960k85540L17726p248N721m12399r519J61821K2756R2250K32498
17076A007290n5185j84855K70082k07710J34933j95669J0289K51983q8325J80550
17066A123383j48412J09193j76774m6322J02908k38093j31849K92537k73212K91054
17056I04413J90284O6337j53458N7668D06399L30663O9848K62682k04528K9455
$$ y = [618844, 566878, 343013, 580072, 707925, 836575, 672908, 889736, 276007, 635465, 320722, 673583, 248151, 682502, 581746, 535571, 552626, 738375, 681008, 432887, 652960, 681007, 1031840, 801100, 677980, 420405, 237065, 708370, 769172, 663674, 532358, 726920, 823403, 927862, 876213, 624458, 664386, 865358, 609083, 710889, 1044184, 889224, 603684, 921410, 914162, 919883, 507484, 497965, 659786, 682542, 774792, 1007290, 952105, 767250, 1037332, 829622, 964555, 768886, 779175, 1031158, 942833, 1123383, 974971, 1084164, 907390, 861068, 963976, 725883, 594034, 886571, 613359, 904413, 1094697, 1161034, 1007576, 1065244, 406399, 737062, 806910, 1069592, 865064, 894519]
17046H94519J00885K64581r0679j64838o989J60169n01595L07496J33967n5384
17036A042132J53813o9425P5344J18066n0683n1158P5360l50684L45655l19823
17026I68597J96844j38628J55302l8831R2041j34919k57958J36268J64391Q5303
17016A228410k06663M07009k41872j52800J23760K97720j070l10370K83870p0309
17006A357685j02295j13240K73717k1181k78372m9543M31617K28j62812o2286
16996A273518R698n1056L09408j48814J51905l00481K30433j52433K48505k42719
16986A327964j16766M15891n8927j16811P086N2875K25728J94427p37660N69636
16976A763443n9763m699k99534K86931j23280j32552J01666l9431K75386k70986
$$ y = [894519, 995404, 1259985, 1169306, 1004468, 997479, 1157648, 656053, 963549, 1097516, 1042132, 1195945, 1126520, 1201864, 1319930, 1269247, 1218089, 1293449, 942765, 1288420, 968597, 1165441, 1026813, 1182115, 1143284, 1235325, 1100406, 842448, 978716, 1143107, 1228410, 1021747, 1428756, 1186884, 1034084, 1157844, 1455564, 1454494, 1144124, 1427994, 1357685, 1255390, 1142150, 1415867, 1394686, 1116314, 1066771, 1498388, 1498616, 1335804, 1273518, 1283216, 1232160, 1541568, 1392754, 1544659, 1244178, 1474611, 1322178, 1570683, 1327964, 1211198, 1627089, 1568162, 1451351, 1458437, 1511312, 1737040, 1931467, 1193807, 1763443, 1703680, 1698981, 1399447, 1686378, 1563098, 1430546, 1532212, 1492781, 1768167, 1497181]
16966A497181O99593n17741j10655n9162K45616J17884j36768P4506k87641O5266
16956A588079J06478M04509k39002J53376L3064k75305k33535L71356J5696j13139
16946A811577J04193M55077l88140M63965n25012O1529j33998L11516k98973L77096
16936B238830k33158L26688r5640J06929k329j22987J84109q8770J70571l70473
16926B113770M28412k65684N14454j38495l41889P9384R5412j49998K95969J81993
16916B813328q7362O2938j1245J54158j72584M6876m0957r7002K66067k65763
16906B668454K67041J58529k76310K26719L15463M3672j66462R0891n8149r4742
16896C175106K45807j03684J19452m3308K76119J82217l08160j48294L30150j73612
$$ y = [1497181, 2196774, 1679033, 1568378, 1509216, 1754832, 1872716, 1735948, 1810454, 1522813, 1588079, 1694557, 2099066, 1860064, 2013440, 2046504, 1771199, 1537664, 1909020, 1924716, 1811577, 1915770, 2370847, 1982707, 2446672, 1921660, 1983189, 1849191, 2160707, 1861734, 2238830, 2005672, 2332360, 2236720, 2343649, 2341320, 2218333, 2402442, 2313672, 2484243, 2113770, 2542182, 2276498, 2790952, 2652457, 2310568, 2389952, 2485364, 2335366, 2631335, 2813328, 2725966, 2788904, 2777659, 2931817, 2759233, 2806109, 2765152, 2668150, 2934217, 2668454, 2935495, 3094024, 2817714, 3044433, 3359896, 3403568, 3237106, 3327997, 3269848, 3175106, 3420913, 3317229, 3436681, 3393373, 3669492, 3851709, 3543549, 3395255, 3725405, 3551793]
16886C551793L67357j05962J30039R1213m19751L43326J39302l8553j4836J15070
16876D158998J6179j52084L99317m20418L56171M04600J69832n47787L07529j82990
16866D509347P2367M97824l19318p244N68717l67487K8923J78306j08656L93756
16856E446535j58610L4661J64366J26536L6533J81301K57018R2640m48807N73964
16846F306137M6111M4301K04015k41179L02727J39613N97078k85567l7190J44539
16836G220585j65001O69501k52843J13684N02282l45341M52717J65500L30875
16827H691959k16183M42837j85260Q0221M50139q7325O66618J82265j22363N66459
16817A0469367j69960J94371L06517K77453p6017N86178J78319k5086P59576N6817
$$ y = [3551793, 3919150, 3813188, 3943227, 4034440, 3614689, 3958015, 4097317, 4058764, 4043928, 4158998, 4175177, 4023093, 4422410, 4001992, 4358163, 4762763, 4932595, 4384808, 4692337, 4509347, 4581714, 5079538, 4760220, 4752976, 5321693, 4954206, 4983129, 5161435, 5052779, 5446535, 5287925, 5322586, 5486952, 5613488, 5650021, 5831322, 6088340, 6180980, 5732173, 6306137, 6352248, 6396549, 6600564, 6359385, 6662112, 6801725, 7398803, 7113236, 7076046, 7220585, 7055584, 7725085, 7472242, 7585926, 8088208, 7742867, 8195584, 8361084, 8691959, 8475776, 8918613, 8733353, 8813574, 9263713, 9176388, 9843006, 10025271, 9902908, 10469367, 10299407, 10493778, 10800295, 11077748, 11001731, 11587909, 11766228, 11741142, 12500718, 12557535]
16807A2557535K61188K26017M18287J77510L32847N4402O02450K19981M68729
16798A5318946K36223L69168L64943K70187M18096N90980M34372K44907N81688
16789A8829510O14329O52381M15006K98288O52435N05429P84169O86278L02359
16780B3740184R22513N02572J124735N60414O82738O63353R14170Q21728R30434
16771C0862841J095115O38920J374202J007996J054208J168835J237546J058617
16763C9498280J364323J312537J369116J675134J298155J663712J361993J494303
16755E1037553J963713K046459J843068J880024K061075J991113K533846K107638
16747F7464489K188924K182668K417761K477361K254406K471236K760991K519263
$$ y = [12557535, 12818723, 13044740, 13463027, 13640537, 13973384, 14027786, 14630236, 14850217, 15318946, 15555169, 15924337, 16289280, 16559467, 16977563, 17568543, 18002915, 18247822, 18829510, 19443839, 20096220, 20511226, 20809514, 21461949, 21967378, 22751547, 23437825, 23740184, 24662697, 25165269, 26290004, 26850418, 27533156, 28196509, 29110679, 29932407, 30862841, 31957956, 32596876, 33971078, 34979074, 36033282, 37202117, 38439663, 39498280, 40862603, 42175140, 43544256, 45219390, 46517545, 48181257, 49543250, 51037553, 53001266, 55047725, 56890793, 58770817, 60831892, 62823005, 65356851, 67464489, 69653413, 71836081, 74253842, 76731203, 78985609, 81456845, 84217836, 86737099]
16739H6737099K633317K228024K738867K254568K459400K562697J811295J847815
16731A05273082K335359J483357J212640J444518J283328O79041P63833M13757
16723A14888915L3354m94502l14528p52396o98062j337713j225277k046186j690246
16714A06363359k067639j803135k590888k280780k372773k355109k831587k295561
16706H7765887k750375k655021k463217k584310k514917k154208k589291k291248
16698F7763300k249976k372905k033568k110730j732661k234655j868843j696483
16690E1463479j719654k155642j518488j678694j085663j581375r58236j715465
16682C9050262j408169j016237q42229j230247j264757r93559j045581j095466
$$ y = [86737099, 89370416, 91598440, 94337307, 96591875, 99051275, 101613972, 103425267, 105273082, 107608441, 109091798, 110304438, 111748956, 113032284, 113711325, 114475158, 114888915, 114922269, 114427767, 114113239, 113360843, 112662781, 111325068, 110099791, 108053605, 106363359, 104295720, 102492585, 99901697, 97620917, 95248144, 92893035, 90061448, 87765887, 85015512, 82360491, 79897274, 77312964, 74798047, 72643839, 70054548, 67763300, 65513324, 63140419, 61106851, 58996121, 57263460, 55028805, 53159962, 51463479, 49743825, 47588183, 46069695, 44391001, 43305338, 41723963, 40765727, 39050262, 37642093, 36625856, 35783627, 34553380, 33288623, 32295064, 31249483, 30154017]
16674C0154017o54436j158644m53256r99252p34267p83693q79907k71770p35002
16665B3483790o42406p30816p83491n04372o07447m27211o07933k02971p83656
16656A8193487l49112o05344k45351n70244m60232l67260l18498k07720j21042
16647A4948684q73036j29800l69346j88258j72167l75592k77991q0227n02841
16638A1979426k38049J6700n18885j97677M1870o21064k61088J00721k32535k85883
16628I783536m0947k02043m61613n86l9318J54762l64162j69955j18411l18434
16618H222829r1271p297m18983j62729j36790l19641M28j67421j57815M6318k45568
16607F562060R1891N4591k10360R1689m02476l3568j73740n3031j24341J61336
$$ y = [30154017, 29499581, 28340937, 27887681, 26888429, 26154162, 25370469, 24490562, 24218792, 23483790, 22841384, 22110568, 21327077, 20822705, 20215258, 19788047, 19180114, 18977143, 18193487, 17844375, 17239031, 16993680, 16423436, 15963204, 15595944, 15277446, 15069726, 14948684, 14075648, 13945848, 13576502, 13388244, 13216077, 12840485, 12562494, 12482267, 11979426, 11741377, 11758077, 11239192, 11041515, 11083385, 10462321, 10201233, 10301954, 10069419, 9783536, 9742589, 9540546, 9078933, 9078347, 9039029, 9193791, 8829629, 8659674, 8541263, 8222829, 8131558, 8124261, 7705278, 7542549, 7405759, 7086118, 7086546, 6919125, 6761310, 6807628, 6562060, 6653951, 6708542, 6498182, 6589871, 6187395, 6153827, 5980087, 5927056, 5802715, 5964051]
16597E964051l85077P044K07264j42588j63400k04034K31040k20246j25704k80333
16587D888017M0736l05767J72911j27864j63451L0201M7678k99106j04180K22632
16577D401807j77615O809k37087q9899O1961j47916P7443q0826M70265l15508
16567C969434j34344j62883j33512n0667N5175n8642P1001q0287j80773K05054
16557C499556j07331p19636Q53216k65741k80089L9357J0575K23779m28232M24718
16547C250172j60159M1528j92640j69994J27321k29106J7172l21139L02226Q72
16537B666253L06016l60005k78413l366J42175K37490n06119L33450K1848J50894
16527B710223l87625K2038O2721j30094O4272J85000k60420J89038k01703k470
$$ y = [5964051, 5578974, 5586018, 5793282, 5650694, 5487294, 5283260, 5514300, 5294054, 5168350, 4888017, 4928753, 4622986, 4795897, 4668033, 4504582, 4534783, 4582461, 4283355, 4179175, 4401807, 4224192, 4231001, 3993914, 3904015, 3965976, 3818060, 3895503, 3814677, 4284942, 3969434, 3835090, 3672207, 3538695, 3488028, 3543203, 3484561, 3555562, 3475275, 3294502, 3499556, 3392225, 2672589, 3525805, 3260064, 2979975, 3019332, 3029907, 3253686, 2825454, 3250172, 3090013, 3131541, 2938901, 2768907, 2896228, 2667122, 2684294, 2363155, 2665381, 2666253, 2972269, 2612264, 2333851, 2330485, 2472660, 2710150, 2204031, 2537481, 2559329, 2710223, 2322598, 2344636, 2407357, 2277263, 2341535, 2526535, 2266115, 2455153, 2253450, 2250980]
16517B250980k9038O1022l18758K57791k21427K64917k37609k66523N95736m40669
16507A916422m39p883L37806l20089L18175m54734p6222K62566j72577l5247L5796
16496A803574k8574l28162K67255n65717M83465P2932L8754M5213j80147K29892
16486A838485m46396J38140K09550J58601k32724l29208K04131K49928l50876
16477A439631L5569J52086M4648q5733j33311l15061J17257o4486K75004k06818
16467A258786r9177J45062K5204J7064j09753o3133n3989J97194j86914M74476
16457A604820l88007k905j80684K42999J60574q5393J14626n8035j81522L080
16447A229553p1352K3404k54661L53586p9898k03438L92706j76227j99698l57907
$$ y = [2250980, 2221942, 2282964, 1964206, 2221997, 2000570, 2265487, 2027878, 1761355, 2357091, 1916422, 1915983, 1908100, 2245906, 1925817, 2243992, 1789258, 1713036, 1975602, 1803025, 1767778, 1803574, 1775000, 1446838, 1714093, 1148376, 1631841, 1704773, 1743527, 1788740, 1608593, 1838485, 1392089, 1530229, 1739779, 1898380, 1665656, 1336448, 1540579, 1790507, 1439631, 1475200, 1627286, 1671934, 1586201, 1452890, 1137829, 1255086, 1190600, 1465604, 1258786, 1159609, 1304671, 1329875, 1346939, 1237186, 1174053, 1120064, 1317258, 1130344, 1604820, 1216813, 1213908, 1033224, 1276223, 1436797, 1351404, 1466030, 1407995, 1226473, 1229553, 1158201, 1181605, 926944, 1280530, 1200632, 997194, 1389900, 1213673, 1013975, 656068]
16437F56068K69793K49886r7311j17274R1169O1493k36431N55721j94671l02917
16427I35526J00441M39997m71634J0624l9272o1973l7654k42076M91352Q4049
16417A209380k01899K33175E85572P02649m71217J13684j60502J0849L32323o0575
16407A052783k04715m1291M1845R1999j70621K56509k09892j18064J36330n2985
16397G81898J07790P3397j59438J39947k35394J67597N3205k7191j69472J57627
16387H89966J7355l64441N60999l47132j44524B93819Q09748l16245l11721j14442
16377C61159K97304Q1422M16467m40923L06956l73478P45R5255J89932C58315
16366A042481E00782J09506o9491m6918L25784C98748J6030K72747l8537J23846
$$ y = [656068, 925861, 1175747, 1078436, 961162, 1052331, 1113824, 877393, 1433114, 1238443, 935526, 1035967, 1475964, 1004330, 1014954, 975682, 913709, 876055, 633979, 1125331, 1209380, 1007481, 1240656, 585572, 1288221, 817004, 930688, 770186, 781035, 1113358, 1052783, 848068, 806777, 848622, 940621, 770000, 1026509, 816617, 698553, 834883, 781898, 889688, 963085, 803647, 943594, 708200, 875797, 929002, 901811, 732339, 889966, 907321, 542880, 1103879, 756747, 612223, 293819, 1103567, 787322, 475601, 361159, 658463, 739885, 1156352, 715429, 1022385, 648907, 649652, 744907, 934839, 358315, 1042481, 500782, 610288, 540797, 493879, 819663, 398748, 414778, 687525, 648988, 772834]
16356G72834l71015N09125r3160j31393J7249j4130J218n6955j84384J00262o2759
16345D86892K15081k985k16954J03214J22368k64133q7962M21675l10673P0648
16335E37171P9090k51947K72530j19998P8438O9486q7675j46498L11948L6795
16325G79340J36866C15864J5119L39480j86209p6928J9659j3983R1541J72243
16315F76786j04503l095k10450j5088k7015L4002J32814J63356o3697A29174L17229
16304D46403A48486K35905K55450k71784P8985j41048J77738j53719L27486k58865
16294C98634j19593P0066j38822F4018L27097J488M20222k72435j36159K80993
16284F85224k33338j26192J62267K53430k72992J06848P5069p9434A7060N71345
$$ y = [772834, 401819, 910944, 817784, 686391, 703640, 689510, 690728, 633773, 449389, 549651, 486892, 701973, 698988, 482034, 585248, 707616, 443483, 355521, 777196, 466523, 537171, 616261, 364314, 636844, 516846, 595284, 664770, 577095, 430597, 742545, 779340, 916206, 315864, 330983, 670463, 484254, 407326, 426985, 413002, 504543, 676786, 572283, 569188, 358738, 343650, 316635, 350637, 483451, 646807, 583110, 129174, 446403, 148486, 384391, 639841, 368057, 447042, 305994, 483732, 330013, 657499, 398634, 279041, 349107, 210285, 64018, 391115, 392603, 812825, 540390, 404231, 685224, 451886, 325694, 487961, 741391, 468399, 575247, 650316, 570882, 17060, 588405]
16274E88405A93418L31136Q686j99222K53557B37662L89363j90796R2502j18610
16264D10121p3549J6320j21629q708J53177K64741j61547L2359A86004J47865
16254C33869H3871K20818j22561O2528m2273A8241M43347k5457j26212K69988
16244E79907k39223j53824M02946B73444O7440o9828n0553G5163N15649A38812
16233C06422A05964M14310k41958p2675P3015K26677q6591j88078l5921L05754
16223E00497k29116p0635L7144n2522M80959A20896E6362N34775B75757K80954
16213E56711B76207B1958J95752L1076k6589J22554q0536J11524j74037d2838
16202B24412I1106B8625J33297p3665O5432M9596o2081P9505l2141J12860A44778
$$ y = [588405, 193418, 524554, 533240, 334018, 587575, 237662, 627025, 436229, 528731, 410121, 336572, 352892, 231263, 222555, 375732, 640473, 478926, 511285, 186004, 333869, 83871, 304689, 182128, 244656, 202383, 18241, 461588, 436131, 309919, 579907, 340684, 186860, 589806, 273444, 340884, 271056, 220503, 75163, 590812, 138812, 306422, 105964, 520274, 278316, 205641, 278656, 505333, 418742, 230664, 194743, 500497, 271381, 200746, 237890, 185368, 666327, 120896, 56362, 591137, 275757, 556711, 276207, 21958, 217710, 248786, 222197, 344751, 264215, 375739, 201702, -42838, 224412, 91106, 28625, 161922, 88257, 153689, 203285, 141204, 220709, 188568, 301428, 144778]
16190B81261O2747A2412K66521A22228J58839a28272D67433A52790K3810H231
16179a44047B26749G5123J27443R405a23535b3356k571A86028n0666K5155k3789
16168A36728i7639E1463L29948a74465C71364q8624J31361D0157K66471j13337
16158A93291L31054j77323d7418B63985K73694j13848o5194j58509D0864D43K31991
16147B32434F3769R782l3290J25831a7348A77957b213A14365J34958N6844R8676
16136D04843j38436o0826I4046C7250L99001k14918J81811c1359H3507J55343
16126B38850l1560a80191B14608J30921C3949J351L56956D3999L0289B335e1454
16114a72788D92511A5111g550C74624p5415n7727l4098h9090B43178K4858J56431
$$ y = [281261, 344008, 12412, 278933, 122228, 281067, -128272, 467433, 152790, 176600, 8231, -144047, 226749, 75123, 202566, 211971, -123535, -23356, -25927, 186028, 135362, 160517, 136728, -97639, 51463, 381411, -174465, 371364, 282740, 414101, 40157, 306628, 193291, 524345, 347022, -47418, 263985, 537679, 423831, 358637, 200128, 40864, 443, 232434, 63769, 73551, 40261, 166092, -17348, 177957, -2213, 114365, 249323, 306167, 404843, 266407, 205581, 94046, 37250, 436251, 221333, 403144, -31359, 83507, 238850, 207290, -180191, 214608, 345529, 33949, 35300, 392256, 43999, 74288, 2335, -51454, -172788, 492511, 15111, -7550, 374624, 299209, 241482, 207384, -89090, 243178, 268036, 424467]
16103D24467A17229Q1295B6753K8630J21379J02826D8616L35366e3313A70127
16092B25630K28013A09797O4515K97653A75396o7371P2288H6076Q9470N7804k8216
16081B05134P8636g2768k5238C10610A54142a12820A17478K4895P035L0366L3403
16070B13177a62414A53194K5626G4053o804e1157k36217A53221d1893j38125G5683
16058C11660a54950k4732B33620E4523a42932k5400A8046a35055D30862A90094
16047D06345h3308b9287j95573a879l217D4127g4835I641k812J25367O4042f3674
16034a8064E854M4206J17433e1993n9879b01F1622L50853f7841B40138A11605
16022B65693A06691a11715A0550h3755F0537K32953c69912I3090M4242e5874j72346
$$ y = [424467, 117229, 198524, 26753, 55383, 176762, 279588, 48616, 383982, -53313, 170127, 225630, 453643, 109797, 174312, 471965, 175396, 108025, 180313, 86076, 175546, 233350, 205134, 283770, -72768, -98006, 310610, 154142, -112820, 117478, 142373, 149408, 179774, 213177, -162414, 153194, 178820, 74053, 67249, -51157, -287374, 153221, -41893, -180018, 75683, 311660, -154950, -179682, 233620, 54523, -142932, -168332, 18046, -135055, 430862, 190094, 406345, -83308, -29287, -224860, -1879, -5096, 44127, -74835, 9641, 6829, 132196, 196238, -63674, -18064, 5854, 50060, 167493, -51993, -111872, -201, 61622, 412475, -67841, 240138, 111605, 265693, 106691, -111715, 10550, -83755, 60537, 293490, -369912, 93090, 137332, -55874, -228220]
16011b28220B73406F1090R1169o3809K8835M41815j24343a09254C45135C9717
16000b62250i5492A86448L65990B9121O2008l4781J3688K89462A52263a47963
15989B43681j9464q5935K55153K45169L90263L24201j76789N4732m24171A87733
15978C14538A42451A2793M18812I5199d8648A91693p4525a7543B18524A2991P9501
15967I2492L0486a96155P7525A72928j6802o8876e1512B2498d8565A70364n9661
15956A10703j3167a85991C7776J22005b05589B27518b67272C1175A3798g9189
15945A04421a18423d4446a076j22178N5007j76560E497P7302I929f6052j54164
15934b20216D7011e9034C41814b06140B31558I677J4178a1350j51447i483k09120
$$ y = [-228220, 273406, 61090, 152259, 88450, 117285, 559100, 434757, -109254, 345135, 39717, -262250, -95492, 186448, 552438, 29121, 91129, 56348, 70036, 359498, 152263, -147963, 243681, 224217, 138282, 393435, 638604, 1028867, 1353068, 1176279, 1231011, 806840, 187733, 314538, 142451, 12793, 431605, 95199, -48648, 191693, 117168, -17543, 218524, 12991, 92492, 122978, -196155, -118630, 172928, 156126, 87250, -51512, 22498, -48565, 170364, 110703, 97536, -185991, 37776, 159781, -205589, 227518, -267272, 31175, 13798, -79189, 104421, -118423, -44446, -1076, -123254, -68247, -244807, 5497, 82799, 9929, -66052, -220216, 47011, -59034, 341814, -206140, 231558, 9677, 23855, -11350, -162797, -9483, -218603]
15923b18603B7773c01516C07750H6157b88562h9572n6951o2747P8923l6224A79419
15911a97051A7889J80332q1810F661K96158F2811r550A4035P4677i0861j55228
15900b46089B13583I59J36030b47449H953K12934k7450i2876n5607k3633E5122
15888b48543B1377b9726N743j42296F2196c40464e9812A28307A1314h317k4677
15877c2994n0957E9749h2258C3943Q1880N4426a85176N9685B93885e3818J6160
15866c7658l21562f0001j6720D6272b37502e9820k09726B05337a05536k19678
15856c25214A10623c21305K0231A41122d9662J4315o2716j24107A32622M5586
15846A78208a15153M1412K755F9912b02969A1661a83103B58455C9212G46K12627
$$ y = [-218603, 27773, -301516, 307750, 86157, -288562, -89572, -146523, -209270, -130347, -166571, 179419, -197051, 17889, 198221, 116411, 6661, 302819, 62811, 53261, 14035, 88712, -90861, -246089, 213583, 959, 136989, -247449, 8953, 221887, 194437, -92876, -148483, -172116, 55122, -248543, 21377, -29726, -23983, -166279, 62196, -340464, -59812, 128307, 11314, -8317, -32994, -83951, 59749, -82258, 33943, 115823, 170249, -185176, -125491, 293885, -53818, -37658, -359220, -60001, -76721, 46272, -237502, -59820, -269546, 205337, -105536, -325214, 110623, -321305, -301074, 141122, -49662, -35347, -98063, -222170, 132622, 178208, -115153, -73741, -70986, 69912, -202969, 11661, -183103, 258455, 39212, 746, 213373]
15835B13373d2245l50777e8204B18588h0982G4827L202A738d0031E4296R407e1478
15822b74332a17304d887A71548f0931p3080A10668c1943l4609a1227E6437a89941
15810A43640G0104k6380b51802k4300D9628h8551D2298J63505A2691L0636Q8090
15799A31417b83463A5920J82102c618j77184r2613A19388L8456e460k2773j18936
15788a47169A4666h5759A55402R176H1973a12850B30214a56498b8310A17103c80459
15776H2069G670f6245E6287J0326b09485B1135K888d01576A87846d0193p7154
15765a17347F5236J46347a24829E7818K07986g9159L8911A80559A7738a5437A29587
15753a4704C9018N1348a31656J8983I3884l5368i5865K9892l0825B34213E0170
$$ y = [213373, -42245, -393022, -58204, 218588, -80982, 74827, 78029, 1738, -40031, 54296, 63703, -51478, -274332, -117304, -4887, 171548, -60931, -134011, 110668, -31943, -66552, -11227, 56437, -189941, 143640, 70104, 43724, -251802, -276102, 49628, -88551, 42298, 205803, 12691, 43327, 131417, -283463, 15920, 198022, -3618, -180802, -273415, 119388, 157844, -5460, -28233, -147169, 14666, -85759, 155402, 164578, 81973, -112850, 230214, -156498, -28310, 117103, -380459, 82069, 7670, -66245, 56287, 66613, -209485, 21135, 24023, -401576, 187846, -40193, -117347, 65236, 211583, -124829, 57818, 265804, -79159, -40248, 180559, 17738, -15437, 129587, -14704, 39018, 90366, -131656, -112673, 93884, 58516, -95865, -65973, -96798, 234213, 50170]
15741B8877J16468a53973E6553c08325J04051B74807n1200n4403R9733G1507a8453
15729B142b19447J4758G8461R959a27393b4421j38551A0056J54486J0130b88822
15717A21198a07699k5591B43469A2710a56117A09856a04466A4848Q3527a68252
15706a85529B36985b45026E8311P4890D5531b4262A39795J04725b2031j05621
15696a27652B07J2231b63359D14647G355K53435a55752B70012b94758D3933M6833
15685I0766b38554A43974p640a75847H0401J28586a97454A27286p512j6807a8455
15673e7264j33005l6612N6053A52511n8254J54763a12749E3332b21368d8019N969
15662d2050m6760B02441b1085k94858A71899M1727K4274F1115d1738e872j87872
$$ y = [28877, 145345, -153973, 56553, -308325, -204274, 274807, 223607, 169204, 268937, 71507, -18453, 2142, -219447, -204689, 78461, 88420, -127393, -24421, -162972, 10056, 164542, 174672, -288822, 121198, -107699, -133290, 243469, 12710, -156117, 109856, -104466, 14848, 98375, -168252, -185529, 236985, -245026, 58311, 133201, 45531, -24262, 139795, 244520, -22031, -127652, 207, 12438, -263359, 414647, 7355, 260790, -155752, 270012, -294758, 43933, 90766, -238554, 143974, 136334, -175847, 80401, 208987, -197454, 127286, 119774, 102967, -18455, -57264, -190269, -226881, -170828, 152511, 94257, 249020, -112749, 53332, -221368, -48019, -42050, -88810, 202441, -21085, -315943, 171899, 213626, 237900, 61115, -41738, -5872, -193744]
15651a93744H3799P1421J00984j6131n9471j00b2182j39515C46707p8701g1180
15639a93208A3568F344b0751j38088M872j34077a6423E32751b12673B19084q9427
15628A29657K3962a47338j52982A856e9378c935D6525P332K0658K3785a86500
15616B6136g7069a3474A38846c26099d064I177g0358b6937j24115l4379b2699
15604A01152b64320J02002B14515a63342d4455A12919h4961J8288a9720A3483
15593A6119K48637F2633c36857Q3165A0443b4267D472c4462p9202n7771A90730
15581c3935A31145g6863b5190j90083C09956a52958A6997d7314A37724C682i1497
15569H6894g9363C8421a39742K9191M7963n1016A69870g017F5671c1993D8696
$$ y = [-193744, 83799, 155220, 256204, 240073, 180602, 180502, -22182, -161697, 346707, 268006, -71180, -193208, 13568, 6344, -20751, -158839, -153967, -288044, -16423, 532751, -212673, 219084, 129657, 153619, -147338, -300320, 1856, -59378, -3935, 46525, 53857, 74515, 98300, -186500, 26136, -77069, -13474, 138846, -326099, -4064, 9177, -70358, -26937, -151052, -185431, -22699, 101152, -264320, -162318, 214515, -163342, -44455, 112919, -84961, -66673, -19720, 13483, 16119, 264756, 62633, -336857, -253692, 10443, -24267, 4472, -34462, -113664, -171435, 190730, -33935, 131145, -76863, -25190, -215273, 309956, -152958, 16997, -47314, 137724, 3682, -91497, 86894, -79363, 38421, -139742, -110551, -62588, -113604, 169870, -7017, 65671, -31993, 48696]
15557F6949O1146B5591J12410b09347h065k64332G4791a50234k235P2555C05599
15545a65983D8513c48335N347A56879o82J28652j27347C5192K1113a7986D7850
15533c7093B53748q1707q2183K2966a67040K3269A17866i0834A07835K3009a84409
15521a0557D21378A26040j7920L5445h4068f035r2589F4192c4500D18660j19994
15510B98666k5804A15102h9038A20974J99724a34088B25136I9131C2774K34677
15500B67451q8479K51911D8781M05646A27410c4588o6450H9714J71526j10235
15490A51005a94026f5850a6805E6887a88437B470a96048d4470A89357P0585j26725
15479A33217Q4434i3575A87492M5254K8661L80276J66386k22177k19445m6087
$$ y = [66949, 128095, 25591, 138001, -209347, -8065, -272397, 74791, -150234, -152469, -79914, 305599, -165983, 48513, -348335, -342988, 156879, 156197, 284849, 157502, 35192, 56305, -17986, 47850, -37093, 253748, 172041, 89858, 112824, -167040, -143771, 117866, -90834, 107835, 130844, -184409, -10557, 421378, 126040, 108120, 143565, -84068, -6035, -98624, 64192, -34500, 418660, 298666, 272862, 115102, -89038, 120974, 320698, -134088, 225136, 99131, 32774, 267451, 178972, 430883, 48781, 454427, 127410, -34588, -101038, 89714, 261240, 151005, -194026, -65850, -16805, 56887, -188437, 2470, -196048, -44470, 189357, 259942, 133217, 217651, -93575, 187492, 232746, 261407, 641683, 808069, 585892, 366447, 320360]
15469C20360a7194B5700a05974j30760B9382K42873d68338A67536a16080I298
15458A02903J93941A09169O1770G1159a21224a6538H4801J00830a53379A71927
15447B15375n1694L85224k02266p6211J97970L43723M3266M16669l96330n3879
15437H21847C37735J29607j0364C0153a65558I3035A8012L3864J86022a33069
15426A20823A8154h4147C80659C7606b64431l7081h5460C9242K13359a82663O5602
15415a17061K3045A05077B3377g9509j06761A06118a28883o3586e0272r6159b0462
15403F6073B5013a08206B45882C4354Q1809a69343q0040E293L22224a48369d1007
15391A80830c830G2467b2545j7595A9549J01268i9871C22572i9018B58184K02530
$$ y = [320360, -17194, 25700, -105974, -236734, 29382, 272255, -468338, 167536, -116080, 9298, 102903, 296844, 109169, 170939, 71159, -121224, -16538, 84801, 185631, -153379, 171927, 215375, 163681, 548905, 346639, 270428, 468398, 812121, 855387, 1272056, 875726, 821847, 337735, 467342, 456978, 30153, -165558, 93035, 18012, 51876, 237898, -133069, 120823, 18154, -84147, 380659, 37606, -264431, -301512, -85460, 39242, 252601, -182663, -117061, -94016, 105077, 23377, -79509, -186270, 106118, -128883, -192469, -50272, -146431, -20462, 66073, 25013, -108206, 245882, 34354, 116163, -169343, -249383, 5293, 327517, -148369, -41007, 180830, -3830, 72467, -22545, -40140, 19549, 120817, -99871, 322572, -99018, 258184, 460714]
15380D60714A2340i8186A10089e0925I394L34531L6865c2044j03677l0820A15749
15368B92465A34977j7054k9607j0427K68901A02407O4012m4923O8626p5101J80255
15357B95276p3562J54897A2776L86070A85099a15297E5973c5775E9309Q4700K70043
15346D14052A70444C803K92386A30074L92356j60625J79467k27712o9139K36952
15336D81373D4864J00a25101A14335p389B1121h8048l8470B92626j10855j9297
15325A62474e4835j04726B98878l9520D0994K23648o0250L6079j10573n1485J49521
15314B27934J820c7547q4183B45250J26713A73311k2782G0074c58390A54538J21589
15303B76127m5577R0120c3377A96269D7143N6274K6090a81330N9860A48935R2470
$$ y = [460714, 12340, -98186, 110089, -50925, 9394, 343925, 380790, -32044, -135721, -166541, 115749, 292465, 134977, 117923, 88316, 77889, 346790, 102407, 166419, 121496, 190122, 115021, 295276, 221714, 376611, 12776, 398846, 185099, -115297, 55973, -35775, 59309, 144009, 414052, 170444, 3803, 296189, 130074, 522430, 361805, 541272, 313560, 244421, 481373, 44864, 44964, -125101, 114335, 106946, 21121, -88048, -126518, 292626, 181771, 162474, -54835, -159561, 298878, 259358, 40994, 264642, 204392, 240471, 129898, 78413, 227934, 229754, -37547, -121730, 245250, 371963, 173311, 150529, 70074, -358390, 154538, 276127, 230550, 320670, -33377, 196269, 47143, 103417, 129507, -181330, -121470, 148935, 241405]
15292B41405e1733F9497Q9954b40143C20617K7765B7201K56446q3115L0806F6396
15280a27729k19379B25611j06292p928K5477K4440A8954a28970A62367a5799k6815
15269d2614a7140A10048d9740A7665L3287g4498j25006R5606C98562a11516L926
15258a07590A08740k4268b47831I7841L19069a03094A45502j5645M1078G2650
15247E9124k3627A5964K64574j26238K49167N17045Q92575j94807J47711L99733
15237B165724j013417B74780N058J48349j71940a04234A25459n7819K05182I0995
15226C1568J53162o9438R2397a00473C0725a45598A86979a62720C26901C3305
15215A06027D4437J27751p7713L40332A62611e3578H5708L828J28417b3382A12324
$$ y = [241405, -51733, 69497, 159451, -240143, 320617, 348382, 27201, 283647, 200532, 231338, 66396, -127729, -347108, 225611, 119319, 111391, 136868, 161308, 18954, -128970, 162367, -15799, -42614, -17140, 110048, -49740, 17665, 50952, -74498, -199504, -103898, 398562, -111516, -107590, 108740, 84472, -247831, 97841, 416910, -103094, 145502, 129857, 170935, 72650, 59124, 35497, 15964, 280538, 154300, 403467, 920512, 1813087, 1618280, 1765991, 2165724, 1152307, 274780, 279838, 428187, 256247, -104234, 125459, 67640, 272822, 90995, 31568, 184730, 115292, 207689, -100473, 30725, -145598, 186979, -162720, 326901, 33305, 106027, 44437, 172188, 94475, 434807, 162611, -53578, 85708, 89536, 217953, -23382, 112324]
15203a83355A90547O5694b9436C02545J12139A27730n3463a6290A36677N2579
15193A89256a37114B01060a43517d862C06870e4377C9227K20163H9767J28400
15183B18167a04908A19496c9032A42488a11864A22841B1062L14944A04946a09716
15172A15122K44973a77891C3018J62047J75357j50295J6227d7492B81489b3436
15161D33544q5561A41989B6978f970C08697q6859N5612c71H5960O2604m5741P4846
15149A77669K6031k6988K61148k8889L826F6241K36952J01172A83262H5635b5956
15137A14655C6218a3340C84341A41309J70023a29937C57672a32212E7859J52592
15127B10451N215D1139c4167n1368C84829A14459A1407K18968J05322k2450M8766
$$ y = [-183355, 190547, 256241, -29436, 302545, 414684, 127730, 74267, -16290, 136677, 189256, -137114, 201060, -143517, -4862, 306870, -54377, 39227, 259390, 89767, 218167, -104908, 119496, -39032, 142488, -111864, 122841, 21062, 336006, 104946, -109716, 115122, 360095, -177891, 33018, 195065, 370422, 220127, 236354, -47492, 281489, -23436, 433544, 347983, 141989, 26978, -6970, 308697, 221838, 277450, -371, 85960, 148564, 102823, 177669, 203700, 176712, 437860, 408971, 412797, 66241, 303193, 404365, 183262, 85635, -25956, 114655, 36218, -13340, 384341, 141309, 311332, -129937, 357672, -132212, 57859, 210451, 215666, 41139, -34167, -85535, 384829, 114459, 11407, 230375, 335697, 313247, 362013]
15116C62013K9031r9369l7000J01358j18284K92212b06533C01731K79700B5346
15105B36271H0879a32302A57904n8561B3755K63689A14444L18210A32707b1474
15094D82737b32786C17427F4726J61121E8385K67240l8059A20088J54441p0234
15084B04295J12179A53570N3059a823A17601K0939K8919L6397a23633c1675l3305
15073f4980A41357L9856m7742L4493J13026k3381J96607G2219o540K4208J07937
15062A97824J7748K40797A38471R3772b8871A74404L51769K2141k5610j87163
15052C35541G5289J62035M3897a45424C73706j14486K91602j80188j50745J2652
15042B32541N564A18401Q1129Q4671N1108K82610C8705L89798N098r6703J83714
$$ y = [362013, 391044, 291675, 254675, 356033, 237749, 529961, -206533, 301731, 581431, 25346, 236271, 80879, -132302, 157904, 99343, 23755, 287444, 114444, 432654, 132707, -21474, 482737, -232786, 317427, 64726, 225847, 58385, 325625, 287566, 120088, 274529, 204295, 316474, 153570, 206629, -1823, 117601, 138540, 167459, 203856, -123633, -31675, -64980, 141357, 181213, 133471, 167964, 280990, 257609, 454216, 72219, 65679, 89887, 197824, 215572, 456369, 138471, 232243, -28871, 174404, 526173, 548314, 522704, 335541, 75289, 237324, 281221, -145424, 373706, 259220, 550822, 370634, 219889, 232541, 238105, 118401, 199530, 284201, 335309, 617919, 38705, 428503, 433601, 336898, 520612]
15031E20612j39913K54845P5460o9838p626K20559B85410J42401j0380M38758
15021H56189k57041r8123j31537K60950r381C02483j38957K27549J31048c7200
15010A01929N36021B95305K66123J1105r0091r109l5555k12939A12127J52223
15000B64350K34041J48298n818n9251j21621j13273m2854n3939K62240j59336
14990C52837J24394Q6487A34706K89305R8338O4686p8153J70117J09012P2624
14980H60635n7519j6867q3352J18695B61413L00169R2878k95324J90016P9803
14970F28955L16447p1967m8842l85193j20752M74737k86963r4838A88274K47304
14960D35578K14691B77335M280k4875n7978L28050p6206P22I8657M83643B32693
$$ y = [520612, 380699, 635544, 711004, 641166, 633540, 854099, 285410, 427811, 417431, 856189, 599148, 501025, 369488, 630438, 621057, 302483, 163526, 391075, 522123, -37200, 101929, 637950, 295305, 561428, 572533, 482442, 473333, 437778, 224839, 112127, 264350, 498391, 646689, 640871, 581620, 459999, 346726, 303872, 249933, 512173, 352837, 477231, 563718, 134706, 424011, 522349, 587035, 508882, 678999, 788011, 860635, 803116, 786249, 702897, 821592, 261413, 561582, 654460, 359136, 549152, 628955, 945402, 873435, 824593, 439400, 318648, 793385, 506422, 411584, 188274, 435578, 650269, 277335, 281615, 256740, 198762, 526812, 450606, 451328, 98657, 582300, 232693]
14948E60035A97092K69795J14721k51113L98067j17105N91726n54840j39897j48589
14938C59857K30859P7615A96916L04786P3051j57894K5742O69581R689K41368
14928A363239J21783j25437J40124K71990P8186j77970R6384k81181Q9543J25010
14918A701671L48717N83464j40659k95270l97300q6302l29549j90029k87176K3733
14908I31300q7571D01222L15669k09351N9155J29390C28310M22728p8599A31862
14897E27098B60861K24910k3592j74152K71373j41142j04112J31071Q4847m5495
14887D84569K92023j19707J25425L18665k16256L48524E79970N41381m44435K32105
14877I09021J53562m43511J06219O1843p8716j68154q6570j20182L33878L39930
$$ y = [560035, 197092, 466887, 581608, 330495, 728562, 611457, 1203183, 648343, 508446, 359857, 590716, 668331, 196916, 501702, 574753, 416859, 442601, 1112182, 1121871, 1363239, 1485022, 1359585, 1499709, 1771699, 1849885, 1671915, 1768299, 1487118, 1576661, 1701671, 2050388, 2633852, 2493193, 2197923, 1800623, 1714321, 1384772, 1194743, 907567, 931300, 843729, 401222, 716891, 507540, 566695, 696085, 328310, 751038, 672439, 131862, 527098, 260861, 485771, 462179, 288027, 559400, 418258, 314146, 445217, 530064, 484569, 776592, 656885, 782310, 1100975, 884719, 1233243, 579970, 1121351, 676916, 909021, 1062583, 619072, 725291, 787134, 708418, 540264, 453694, 333512, 667390, 1007320]
14867A007320k84722p0157M29276j03993m67439J47851k62226q718k9993A74739
14856G30320k74687j89642N06562l54487J05147L70244j62754j93988J55664j61195
14846E31184n0960M97022J58822l54665N71162k88321K4736m41065L48245L38618
14836A334778m03842l06281L07932j53737K9878K449J35154q8188D18087R55551
14826A373638E34155j50476N1426N6472J59934L64128m09082L64041n1983k11529
14816G07086K87085o0561q2009n0332l10575j74834L19200r8029M28599k13977
14806G51653R5233K53657l70571m6257p187K02018k48724B64444J58356K83096
14796G05896l25411J99340J10245j3934j68460J67725M5624L1277k87866M47509
$$ y = [1007320, 722598, 652441, 1081717, 977724, 510285, 658136, 395910, 387192, 357199, 174739, 730320, 455633, 265991, 772553, 418066, 523213, 893457, 730703, 536715, 692379, 531184, 480224, 977246, 1136068, 781403, 1352565, 1064244, 1088980, 647915, 996160, 1334778, 930936, 624655, 932587, 778850, 808728, 811177, 946331, 858143, 418087, 1373638, 534155, 383679, 435105, 491577, 651511, 1015639, 606557, 970598, 918615, 707086, 994171, 933610, 851601, 801269, 490694, 315860, 635060, 537031, 965630, 751653, 846886, 1100543, 729972, 683715, 676528, 878546, 629822, 264444, 422800, 705896, 380485, 579825, 690070, 676136, 507676, 675401, 721025, 752302, 464436, 911945]
14786I11945j7882N2126m20889J90917l5823M55848k69346j4528q4769r70K12867
14775I79496l9962J36421k97809J08202m5263j35871j86525L88940j86720q6848
14765F34061J01404q8418M4862m5835K51629k02058n5060J93158k80649K15125
14755G68219Q8224D05391K23131J74713k12680j89991L22753q5859N9029J48834
14745H45321j56822L4392l00708K27934p2838M1812J67921j4345j73028K61049
14735H60688k12549k899J10533M79106j15889J21443K29261p3229M22986J06453
14725A925904q8360J34516l94747n81975K4052J25511j22813n5035J03562j66384
14715I04231j1566j45258J53738K24900o6080r0281J8270J49980j6781k56036
$$ y = [911945, 894063, 946189, 525300, 716217, 680394, 1136242, 866896, 852368, 767599, 766629, 979496, 939534, 1075955, 778146, 886348, 841085, 705214, 518689, 907629, 720909, 634061, 735465, 647047, 691909, 646074, 897703, 695645, 640585, 833743, 553094, 768219, 856443, 405391, 628522, 803235, 590555, 400564, 723317, 637458, 696487, 845321, 688499, 722891, 422183, 650117, 577279, 619091, 787012, 772667, 599639, 860688, 648139, 645240, 755773, 1234879, 1118990, 1240433, 1469694, 1396465, 1819451, 1925904, 1837544, 1972060, 1577313, 995338, 1019390, 1144901, 1022088, 967053, 1070615, 904231, 892665, 747407, 901145, 1126045, 1059965, 969684, 987954, 1137934, 1121153, 865117]
14705H65117M09571J09014j40225P9899N80334R0539j8951n92298p5098J24114
14695A432016m16838J04420k45219Q5879K90593m36603l5290M02529O6138k97619
14685I50006J78639j57346J84398l06749j44249J82716Q8998J35645L6673k5761
14675A122970j57614j0593P7650j05107O4971J42817m24946R169J65990J01232
14665I86539k9744k25768J71293K38050j92637L52470j4431p7190j08876M46L30791
14654A430943J68584j79428j66585j31894J42227j74470m3579M7969J65156R483
14644A268406F23470N25880M9636o7991J06401J9725K6026j29137L7006K65962
14634A456978l55216J5495M69700l55143j62130L36949O4095R4796p4152k04578
$$ y = [865117, 1274688, 1383702, 1243477, 1323376, 1903710, 1994249, 1975298, 1383000, 1307902, 1432016, 1015178, 1119598, 874379, 960258, 1250851, 814248, 778958, 1181487, 1247625, 950006, 1128645, 971299, 1155697, 848948, 704699, 887415, 976413, 1112058, 1148731, 1122970, 965356, 954763, 1032413, 927306, 992277, 1135094, 710148, 719317, 885307, 986539, 956795, 731027, 902320, 1140370, 947733, 1300203, 1285772, 1208582, 1099706, 1100152, 1430943, 1599527, 1420099, 1253514, 1121620, 1263847, 1089377, 1045798, 1093767, 1258923, 1268406, 623470, 1149350, 1198986, 1130995, 1237396, 1257121, 1283147, 1154010, 1191016, 1456978, 1101762, 1117257, 1586957, 1231814, 1069684, 1406633, 1470728, 1565524, 1491372, 1286794]
14624A286794r6095M85170j91138m5424K746j29841o7873j94468K69540L69489
14614A688900l10825K24329n7595k77066N58824j56052k60043K14446k98114J27163
14604A453967P3168p5245j15832K42616J82140Q2491m99466K85415l47210N94968
14594A877012M0577j28627K29253l7606L3941j15252l8068j03356k99264L24185
14584A782795k1152R1366M9580p0768L72609l96327L26234j75941l513k4061j66580
14573A764242M33063M7368l822q8351K07737J3748o3749j15241J20669R1706J16727
14562B524097K32005j64106L00172j09699L8613l30334L01848P74549r5891j6632
14552C454622P09098N24151P12187J845291L381093P898221J8758446O891357
$$ y = [1286794, 1190699, 1675869, 1484731, 1439307, 1442053, 1312212, 1244339, 1049871, 1319411, 1688900, 1378075, 1602404, 1544809, 1267743, 1826567, 1670515, 1410472, 1624918, 1326804, 1453967, 1527135, 1451890, 1336058, 1578674, 1760814, 1843305, 1343839, 1629254, 1282044, 1877012, 1917589, 1788962, 2018215, 1980609, 2014550, 1899298, 1861230, 1757874, 1458610, 1782795, 1761643, 1853009, 1902589, 1831821, 2204430, 1808103, 2134337, 1958396, 1954883, 1930822, 1764242, 2197305, 2244673, 2240851, 2152500, 2360237, 2373985, 2310236, 2194995, 2315664, 2407370, 2524097, 2756102, 2591996, 2892168, 2782469, 2821082, 2490748, 2792596, 3567145, 3471254, 3454622, 4163720, 4687871, 5400058, 7245349, 10626442, 18524663, 37283109, 44174466]
14544D4174466k1918007I883366m730815j367267j252450O3021K10147J117490
14536C923492J904927j870030j082618n70915k90517K67471j04310n8240J07459
14527B226719j16545K81722M8861m34710K35426L13095k78006o1108N03645k4873
14517B694226l4707P0159L3222q1689O9936k09669M07018k24299K89081m4494
14507B968784P0294l87144M1752O36854J49574m84282J61528j04207M03356k26325
14497C230184J97721j80014K3363J21912j59276K47453K89266j31409K00308j90409
14487C649099k0736K06004j45381K99566l61130J01835N00777n61685P8481j2405
14477C734425K63225K44164P497l7348K46811j43996L4352j03272L29225m37331
$$ y = [44174466, 22256459, 9883366, 5152551, 3785284, 2532834, 2595855, 2806002, 3923492, 5828419, 3958389, 2875771, 2304856, 2014339, 2281810, 2177500, 2119260, 2226719, 2110174, 2391896, 2440757, 2006047, 2241473, 2554568, 2276562, 2215454, 2719099, 2694226, 2659519, 2729678, 2762900, 2681211, 2751147, 2541478, 2948496, 2724197, 3013278, 2968784, 3039078, 2651934, 2693686, 3330540, 3480114, 2995832, 3157360, 3053153, 3456509, 3230184, 3427905, 3247891, 3271254, 3393166, 3233890, 3481343, 3770609, 3639200, 3839508, 3649099, 3628363, 3834367, 3688986, 3988552, 3627422, 3729257, 4230034, 3668349, 3746830, 3734425, 3997650, 4241814, 4249311, 4211963, 4458774, 4314778, 4349130, 4245858, 4575083, 4137752]
14467D137752L08882J02799P4609K65412J22350j48204l6453j48140J34673K33449
14457E047129r2831J55813J16010n2389J47820j01520O7202K56655K97830M98
14447E842217j79773K34227p730j85627O44861k18209p6326N4911K51780j68326
14437F192005M78968J44209j11047K82748l35509J70145r3651N47657n6011m4698
14427G174816K47556k98349M48656P3524O9739K67708M32568J24760J66132j26642
14417H580468p0534K48667K14813r4785k9990L77448J62383n0485Q5056J18238
14407I541279K84675K39117M78766k20703N18673p1000K8621j4981K65483K35121
14397A1285051r147J34594L75115k37799K64774K37424N50779N1737M07749J74194
$$ y = [4137752, 4446634, 4549433, 4624042, 4889454, 5011804, 4863600, 4827147, 4679007, 4813680, 5047129, 4954298, 5110111, 5226121, 5173732, 5321552, 5220032, 5287234, 5543889, 5841719, 5842217, 5662444, 5896671, 5888941, 5703314, 6348175, 6129966, 6053640, 6108551, 6360331, 6192005, 6670973, 6815182, 6704135, 6986883, 6651374, 6821519, 6727868, 7275525, 7219514, 7174816, 7422372, 7124023, 7572679, 7646203, 7715942, 7983650, 8416218, 8540978, 8707110, 8580468, 8509934, 8758601, 8973414, 8878629, 8848639, 9226087, 9388470, 9337985, 9423041, 9541279, 9825954, 10065071, 10543837, 10323134, 10841807, 10770807, 10799428, 10784447, 11049930, 11285051, 11275904, 11410498, 11785613, 11547814, 11812588, 12050012, 12600791, 12652528, 13060277, 13234471]
14387A3234471J93276K81695k10061M68133O50032K34389m866N16249L7730P1205
14377A5472253M88547K43379K30125N16813l5630M32417O55614O88299J82135
14368A8873952L21225N80879L56281M34972L70515L56671J86747J097740J43349
14359B2722331K04316P39158N96983P45140N06915L99452O76739P16792M53945
14350B7761771L76798J068931R28968N27660L88147J469336P49022O76616J032918
14341C4980167J216825N04712Q50185J534727J122584J015576J192043J416840
14333D3833659P96660J719874J364862J657487J364027J554504J835293J647884
14325E5774250J897731J882155K219666K009108K087305K842705K259061K593723
$$ y = [13234471, 13427747, 13709442, 13499381, 13967514, 14617546, 14851935, 14847069, 15363318, 15401048, 15472253, 15960800, 16204179, 16434304, 16951117, 16915487, 17347904, 18003518, 18691817, 18873952, 19195177, 19776056, 20132337, 20567309, 20937824, 21294495, 21481242, 22578982, 22722331, 22926647, 23665805, 24262788, 25007928, 25514843, 25914295, 26591034, 27307826, 27761771, 28138569, 29207500, 30136468, 30664128, 31052275, 32521611, 33270633, 33947249, 34980167, 36196992, 36701704, 37551889, 39086616, 40209200, 41224776, 42416819, 43833659, 44630319, 46350193, 47715055, 49372542, 50736569, 52291073, 54126366, 55774250, 57671981, 59554136, 61773802, 63782910, 65870215, 68712920, 70971981, 73565704]
14317G3565704K613340K813822K906512K970486L407140L635855L611669M107121
14309I9631649L839743M724980M472946M899182N205406N524978N672296O221451
14301A40192631O479922O800584P490053P680832Q135767Q578584R421258R414884
14293B04194515J0198088J0517378J1294627J1785201J2501398J2696764J3651060
14286B86839031J3574800J4198633J4619505J4474243J4517061J4793966J4418623
14279C87435862J3832085J3158537J2025754J1155324R210866P289560M605999
14272D58713987K043716q83459m275378l317244m957528l550977p127391r811478
14264D26834248j1294072j2632397j3956181j4554765j5433300j5497373j5748818
$$ y = [73565704, 76179044, 78992866, 81899378, 84869864, 88277004, 91912859, 95524528, 99631649, 103471392, 108196372, 112669318, 117568500, 122773906, 128298884, 133971180, 140192631, 146672553, 153473137, 160963190, 168644022, 176779789, 185358373, 194779631, 204194515, 214392603, 224909981, 236204608, 247989809, 260491207, 273187971, 286839031, 300413831, 314612464, 329231969, 343706212, 358223273, 373017239, 387435862, 401267947, 414426484, 426452238, 437607562, 446818428, 454107988, 458713987, 460757703, 459874244, 455598866, 452281622, 447324094, 443773117, 436645726, 426834248, 415540176, 402907779, 388951598, 374396833, 358963533, 343466160, 327717342]
14257C27717342j4978689j5202570j4293540j4056489j3499094j2918874j2050097
14250B30717989j1647746j0913215j0761860q437257q660710q610474p618272
14243A64068455q037210p476196o706607o386387o163119n721605n124725n311647
14235A13140959m919179m673344m100974l935292l305613l893047l453110l288019
14227H1572381l025421k904528k698937k489802k777081k370291j944004k102791
14219F1259526k116486k056848j997497j596872j746959j224807j353058j622748
14211D7544251j726595j217088j429236j061540q50787p98230j460586j151259
14203C7848930j336733o40184r42631n76366r38542j036381j167155o22161p52007
$$ y = [327717342, 312738653, 297536083, 283242543, 269186054, 255686960, 242768086, 230717989, 219070243, 208157028, 197395168, 188957911, 180297201, 171686727, 164068455, 156031245, 148555049, 141848442, 135462055, 129298936, 123577331, 118452606, 113140959, 108221780, 103548436, 99447462, 95512170, 92206557, 88313510, 84860400, 81572381, 78546960, 75642432, 72943495, 70453693, 67676612, 65306321, 63362317, 61259526, 59143040, 57086192, 55088695, 53491823, 51744864, 50520057, 49166999, 47544251, 45817656, 44600568, 43171332, 42109792, 41259005, 40460775, 39000189, 37848930, 36512197, 35872013, 34929382, 34353016, 33414474, 32378093, 31210938, 30588777, 29836770]
14194B9836770n50616p61976n87007p85616r04397n51228l03231n29474o08755
14185B4254470m85771o32947m55984o99653n75548m06539o8512o45466l28973
14176A9955077n42930o1433n91932n19910k21288o0048o81064j23432o10464n6642
14166A6485934j54663k69250n37823l82438k15394m4168j51818o09132P2133j53800
14156A4039581k61036m34015j23260j81883j49724k82491k31074k75811k98628
14147A1801659K24389m63290Q8012o55775k9366K45348m00635k95986j26673L6600
14137A0424283o09585J68259k35596j41009k53510K1912l81921l29465L95205
14128I058573k20549j20700j40562k02001k26069j21177p4564K1666k10252K74612
$$ y = [29836770, 29286154, 28524178, 27937171, 27151555, 26247158, 25695930, 25392699, 24863225, 24254470, 23768699, 23135752, 22679768, 21980115, 21404567, 20998028, 20929516, 20284050, 19955077, 19412147, 19350714, 18758782, 18238872, 18017584, 17957536, 17276472, 17153040, 16542576, 16485934, 16331271, 16062021, 15524198, 15141760, 14926366, 14882198, 14730380, 14121248, 14193381, 14039581, 13778545, 13344530, 13221270, 13039387, 12889663, 12607172, 12376098, 12100287, 11801659, 12026048, 11562758, 11650770, 10994995, 10965629, 11210977, 10810342, 10514356, 10387683, 10424283, 9814698, 9982957, 9747361, 9606352, 9352842, 9374754, 8992833, 8663368, 9058573, 8838024, 8717324, 8576762, 8374761, 8148692, 8027515, 7952951, 7974617, 7764365, 8038977]
14118H038977m36023j05946M7173j80850M5073m50991k52534J32684L93510n46747
14108F684326J58333j72060j09975j26864J90555n5546m29225N4445j51236N6227
14098F098980r3577j63238j158j18639N5438k68551l4798J81683m62138L17388
14088E511390m887k35440O1454K1427m49507L71597k27815J41633k76602j6673
14078D896577l52951J49078k95388K04423o6566l84211M22062k35178J83607j70229
14068D351224m32184M71724n58164N47472j74993R6120k91455L55506k41062J38888
14058D263076l21464n173n2187j50851j03689J48753j57913p2722o9309L4838
14048C513359l3819j16798L43150l58909K13448p7625m11414K85583k29131Q6318
$$ y = [8038977, 7602954, 7497008, 7544181, 7363331, 7408404, 6957413, 6704879, 6837563, 7231073, 6684326, 6842659, 6670599, 6560624, 6433760, 6624315, 6568769, 6139544, 6193989, 6042753, 6098980, 6005403, 5842165, 5841007, 5722368, 5777806, 5509255, 5474457, 5656140, 5194002, 5511390, 5506503, 5271063, 5332517, 5353944, 4904437, 5276034, 5048219, 5189852, 4913250, 4896577, 4543626, 4692704, 4397316, 4601739, 4535173, 4150962, 4573024, 4337846, 4521453, 4351224, 3919040, 4390764, 3832600, 4380072, 4205079, 4301199, 4009744, 4365250, 4124188, 4263076, 3941612, 3936439, 3884252, 3733401, 3629712, 3778465, 3620552, 3547830, 3478521, 3513359, 3479540, 3362742, 3705892, 3346983, 3560431, 3482806, 3071392, 3356975, 3127844, 3214162]
14038C214162k81370M59491k2074l3845o20413N18965k89391K26200o8807O9721
14028C172639l5404P8659k43192o5947O9966k62671P3397q231Q5285l40065J2604
14017B537040O0697K73275l32210o2911q6638L16869J08445k96863j69380L5716
14007B384040O8577m7148j1273k03716O2014K84711l78077P0065k8130M08920
13997B609983j75241k85375L3858Q3171j05778J65290Q6606N90022O02972J772655
13987E378163N826425J7420852J6822746j5922895j3693528o608178k944025r27071
13979E352489q34894q85732k93180n7144R7351n59739k51225J01593M3917k64637
13969B448799p5666l8674l5814N8267o554J86783l22330O06694o17715k54732
$$ y = [3214162, 2932792, 3392283, 3370209, 3336364, 2715951, 3234916, 2945525, 3171725, 3102918, 3172639, 3137235, 3215894, 2972702, 2906755, 2976721, 2714050, 2787447, 2779216, 2864501, 2524436, 2537040, 2597737, 2871012, 2538802, 2475891, 2389253, 2706122, 2814567, 2517704, 2348324, 2384040, 2452617, 2405469, 2394196, 2190480, 2252494, 2537205, 2159128, 2229193, 2201063, 2609983, 2434742, 2149367, 2183225, 2266396, 2160618, 2325908, 2412514, 3002536, 3605508, 5378163, 11204588, 28625440, 45448186, 29525291, 15831763, 9223585, 6279560, 5352489, 4517595, 3631863, 3338683, 3281539, 3378890, 2819151, 2567926, 2669519, 2713436, 2448799, 2373133, 2334459, 2298645, 2356912, 2350358, 2537141, 2214811, 2821505, 2203790, 1949058]
13959A949058J73203j52876J38676J92038k01673m0103k27678k1116M46147m74228
13949A781448K29813k38306J45306n2185n2563J89664l55941O3655J26444L52072
13939B189407k90869j08705k09240M51469r5664k00824N9994l15028M10058J0962
13929A901560j99027k2069l35461K48458j06958j45724K69731L5932k42355M46085
13919A850172k27016j12862J16069o2097J19102l37953J93968r050l66526R813
13909A173620L07045O1739n25200L57974j59387J36433K22255k57555p9759M6548
13899A283713J84709j70286L34552n53942M4682J02220L60026l19971m0975J38548
13889A363276k88367L04139o2780j76833K00286m12480M54016j56740k01057L17987
$$ y = [1949058, 2122261, 1969385, 2108061, 2300099, 2098426, 2058323, 1830645, 1809529, 2255676, 1781448, 2011261, 1772955, 1918261, 1866076, 1813513, 2003177, 1647236, 1710891, 1837335, 2189407, 1898538, 1789833, 1580593, 2032062, 1936398, 1735574, 1795568, 1480540, 1890598, 1901560, 1702533, 1680464, 1345003, 1593461, 1486503, 1340779, 1610510, 1646442, 1404087, 1850172, 1623156, 1510294, 1626363, 1564266, 1683368, 1345415, 1539383, 1530333, 1163807, 1173620, 1480665, 1542404, 1017204, 1375178, 1215791, 1352224, 1574479, 1316924, 1237165, 1283713, 1468422, 1298136, 1632688, 1078746, 1123428, 1225648, 1585674, 1265703, 1224728, 1363276, 1074909, 1379048, 1316268, 1139435, 1339721, 927241, 1381257, 1224517, 1023460, 1341447]
13879A341447l42713Q5342K39520j30238J0966j90953j25229J74847L18606m24727
13869I56868N8146j95486K77669J49391j53325l47902K93338k21251M61521o10282
13859F68687K37106J43294j30590o6854K77618k80389j8130R1292J35644j40487
13849I17191k35617L33748r785K7311N2483l17988N42614j00580l08332k00599
13839G00446L27972M0939j67927J0970J86859j66643P1076p6022j44357L65923
13829A149236k8827k05113k54253N58327j83048j46604O4818k56241P0304K13220
13819I81819q4292J19714J6934O3310m75928J96672j6219k37688K87531r4027
13809G57826Q9065k31717N02017D38341N52602r9541k8456j01110K49239r2252
$$ y = [1341447, 998734, 1084076, 1323596, 1193358, 1204324, 1013371, 888142, 1062989, 1381595, 956868, 1015014, 819528, 1097197, 1246588, 1093263, 745361, 1038699, 817448, 1278969, 668687, 905793, 1049087, 918497, 851643, 1129261, 848872, 830742, 922034, 1057678, 917191, 681574, 1015322, 1005537, 1032848, 1085331, 767343, 1309957, 1209377, 901045, 700446, 1028418, 1069357, 901430, 912400, 1099259, 932616, 1003692, 927670, 783313, 1149236, 1120409, 915296, 661043, 1219370, 1036322, 889718, 954536, 698295, 768599, 981819, 897527, 1017241, 1034175, 1097485, 621557, 818229, 802010, 564322, 851853, 757826, 846891, 615174, 1117191, 438341, 990943, 891402, 862946, 761836, 1011075, 918823]
13799I18823m26517O412L66745P7850k80497K31243j81167L76750k46531r5581
13789G47530l0238M3212j0912k69918M97654l64872J80337q0731j41713L61551
13779I31900l55781j05331j06733M84867o651j98657M6198p314Q7347q138k43870
13768E17837k0322J60827R6383q1764Q8852j66367J34151R4331j90833n8298R5415
13757F70212J199L06495j52463k36187k233r9917B15022M69025L0741J35032o5750
13746G84070j60511K608K04048l9819j86159K11122m02785M1386M13416M0983
13736I08359k93252R0318O7822r5452n4900Q8211M2380j28502r3462q8398m1575
13725D01549K52337j09297r8505J13638O7139J35498l41121J27145p2124k7473
$$ y = [918823, 492306, 498718, 865463, 943313, 662816, 894059, 712892, 1089642, 843111, 747530, 717292, 760504, 749592, 479674, 977328, 612456, 792793, 712062, 570349, 931900, 576119, 470788, 364055, 848922, 842271, 643614, 689812, 682498, 769845, 761707, 517837, 497515, 658342, 754725, 672961, 761813, 595446, 729597, 823928, 633095, 574797, 670212, 671411, 977906, 825443, 589256, 587023, 487106, 215022, 684047, 714788, 849820, 784070, 623559, 626167, 830215, 790396, 604237, 815359, 412574, 453960, 867376, 908359, 615107, 705425, 773247, 677795, 622895, 711106, 753486, 624984, 531522, 443124, 401549, 653886, 544589, 446084, 559722, 626861, 762359, 421238, 548383, 476259, 448786]
13715D48786J26750K9342j37795m0568K00076k84932M16578l10071J53764j30840
13705D71090J05632m7106N4874J67610j37842M816k58618K89774j70931j27683
13695C51616M32725j03592j43856m829j17086J74233j36459L5476l6113j8093
13685D34022j92057K97684M7512k5556K11125C56234N229q4833J53690O2325P8866
13674E71511J1894j76331J2998m5436J35013k26861J80692L3703k09487J73771
13664D61467A39728L48266M0358L5302M0863j31504f563B79015j31715J95722
13654C43022L13875j41420k54215L9926j11424K01006J28940d8909B86185M26352
13644G12537C24984O0813j10384J97056j42544A08554K84990Q7029J31737j73008
$$ y = [448786, 575536, 604878, 467083, 426515, 626591, 341659, 758237, 448166, 601930, 471090, 576722, 529616, 584490, 752100, 614258, 619074, 360456, 650230, 479299, 351616, 784341, 680749, 536893, 532064, 414978, 589211, 452752, 488228, 452115, 434022, 241965, 539649, 587161, 561605, 772730, 356234, 361463, 276630, 430320, 492645, 571511, 583405, 407074, 420072, 374636, 509649, 282788, 463480, 497183, 287696, 461467, 139728, 487994, 528352, 563654, 604517, 473013, -6563, 279015, 147300, 343022, 656897, 515477, 261262, 301188, 189764, 390770, 519710, -48909, 286185, 712537, 324984, 385797, 275413, 472469, 329925, 108554, 393544, 480573, 612310, 439302]
13634D39302A45599J55344J4188L9374J96715k07478P0939K22121k5362k48675
13624C62765K42985k94328J36781M2978K06162l43808K12246B16765K17675J98335
13614F32775j8124k20304J43827j34650K44528k59339j87946P5821n1755L24634
13604E49467k21839j09585L39067P2668B79475K14123C5114M75681A68903M25961
13594E94864o1843k42639C9586K99937P3536O0706a06333E41347r6648k20967
13584B23732m5492L90691j48857K2378D9892J01666K02035J52271j71573A56855
13573G40172B94094j30623h2126D44511E7363L99065Q1744k42438Q9174H5834
13562F07000k43891A30605K68197A77811L45369a360A31087J21271J24063j47277
$$ y = [439302, 145599, 300943, 315131, 354505, 551220, 343742, 414681, 636802, 611440, 362765, 605750, 311422, 448203, 491181, 697343, 353535, 565781, 216765, 434440, 632775, 614651, 394347, 538174, 403524, 648052, 388713, 200767, 276588, 224833, 549467, 327628, 218043, 557110, 629778, 279475, 493598, 35114, 510795, 168903, 594864, 533021, 290382, 39586, 339523, 413059, 473765, -106333, 541347, 444699, 223732, 178240, 568931, 420074, 442452, 49892, 151558, 353593, 505864, 334291, 156855, 740172, 294094, 163471, -82126, 444511, 57363, 456428, 538172, 295734, 384908, 85834, 607000, 363109, 130605, 398802, 177811, 523180, -1360, 131087, 252358, 376421, 229144]
13552B29144e0537A75264Q157l261q2071N3185K4095B3162N01744A27427N41553
13541F68980B54473J73307j85190J66110j65025J81093A60141K28970L70073l52452
13531D06732k0145J86032B24596L4504L9797a52803A11973N0231K80943j13728
13521C29419o6967j22765B7335J39914K62536j84123j0929K65809j91756m2351
13511B66435q1624J63377a55816M6140C42600J2617O8391p0672A09456K55941
13501C65397i8388C05584K4303A38998J30266a7609B07776R7958A39664E1354
13490B05045K77246j14169J69155A6076M3286J58622I5814J02341k2218r568K2746
13479A89115J05905L5495r4162a191A74387K1907J43342F4318a35505B78319J40860
$$ y = [229144, -50537, 175264, 183421, 180160, 98089, 151274, 175369, 23162, 524906, 127427, 668980, 254473, 427780, 242590, 408700, 243675, 424768, 160141, 389111, 759184, 406732, 386587, 572619, 224596, 259100, 298897, -152803, 111973, 162204, 443147, 329419, 262452, 139687, 27335, 167249, 429785, 245662, 234733, 500542, 308786, 266435, 184811, 348188, -155816, -109676, 342600, 355217, 423608, 352936, 109456, 365397, -98388, 305584, 329887, 138998, 269264, -17609, 207776, 305734, 139664, 51354, 205045, 482291, 368122, 537277, 16076, 59362, 217984, 95814, 198155, 175937, 166369, 189115, 295020, 330515, 236353, -1191, 174387, 196294, 339636, 64318, -135505, 278319, 419179]
13468D19179A8472K63818C9826a53966B31165o1356P8807m8960M18520A67038
13457B82794H0987Q4222M2484J08333A18703n2518K96503I1388J51115O6621K72616
13446E81740C878Q7415c9029D3928J09095K67618j56184b2699A04898J03192L36729
13435E44819c0178A2924J11620L82906A85042B6348M12054j87015o6933G4107
13424C11160J41405B26105C9380R5798J63960D2033J89235d6691A72463D1778
13413A59113Q8763d0357A98831J44689B9999K24347K90595F6226F9L45293a47657
13401C27813r5265J92084D3611K47222j21839c6180E54686a16463b1604B21336
13390i2528a0985C48523J17227D4303M78316B07052N2918H9239J02959L3778J62536
$$ y = [419179, 18472, 282290, 39826, -153966, 231165, 169809, 248616, 199656, 618176, 167038, 282794, 80987, 165209, 207693, 316026, 118703, 66185, 362688, 91388, 242503, 309124, 581740, 3878, 91293, -39029, 43928, 153023, 420641, 264457, -22699, 104898, 208090, 544819, -30178, 12924, 124544, 507450, 185042, 26348, 438402, 251387, 184454, 74107, 311160, 452565, 226105, 39380, 135178, 299138, 42033, 231268, -46691, 172463, 41778, 159113, 247876, -40357, 198831, 343520, 29999, 254346, 544941, 66226, 69, 345362, -147657, 327813, 232548, 424632, 43611, 290833, 168994, -36180, 554686, -116463, -21604, 221336, -92528, -10985, 348523, 465750, 44303, 522619, 207052, 259970, 89239, 192198, 225976, 388512]
13379C88512A11533k1014K98591j33627P9241h728l37626C91815r2950J92242
13369D91107N0415k38248c0409C37387J32161R6823f0389E6544K63829j26388
13359A93985J70433a12050B86299p4016g8751B25902H4529L22037m7894n4890
13349C03782G9228g1769L5431G8448L74408j18069j40535L71753E3725K22449
13339B76174j17111O9993J40357j56657K71926G8693L27496A26610K77546h1054
13328b30325A71527d7842I6408J62224J7576o4284n3718J05426A4790J77118p1436
13317A20472l2082K27093J8328L8288a62191c7397B70703j33757J87084F8369
13306A13699a3535A78473F5507b6061A54004b6129B22034L253K41878k5949A88868
$$ y = [388512, 111533, 90519, 389110, 255483, 334724, -8728, -346354, 391815, 298865, 491107, 541522, 303274, -30409, 337387, 469548, 566371, -60389, 56544, 320373, 193985, 364418, -112050, 286299, 212283, -78751, 225902, 84529, 406566, 358672, 303782, 79228, -71769, -36338, 78448, 452856, 334787, 194252, 566005, 53725, 276174, 159063, 229056, 369413, 212756, 484682, 78693, 406189, 126610, 404156, -81054, -230325, 171527, -47842, 96408, 258632, 276208, 211924, 158206, 263632, 14790, 191908, 120472, 88390, 315483, 333811, 372099, -162191, -37397, 270703, 136946, 324030, 68369, 113699, -13535, 178473, 65507, -26061, 154004, -26129, 222034, 225287, 467165, 441216, 188868]
13294B37540l1768J45930C4946J06690K96122a15029C21985N9191L5250j53889
13284B62537j27485k1340k2314B483b88820G4497C1793J2527L253J03277n4408
13273I6442R5678E9425a70553I6466J41419A04269J87490D6675J63148j3950G7743
13261D28608r1749j39836p805e1811A50248j3452r379K0426G2276L4580J01706
13250B08562e1028B3612a27695D28672j84552I0735J64717e0564C92659p7523
13240C15136o1851a44107C51422j70152F4551K83812A04811M4438J1955a86095
13229f9634o101B47773b2531k5349A5519f1500B80108p1006J22807H7050h5607
13217F5677K48907A17931B7149J51911K2865N9532i829j52198C71887j33863G4857
$$ y = [237540, 205772, 351702, 34946, 141636, 437758, -115029, 321985, 381176, 416426, 262537, 135052, 113712, 91398, 2483, -288820, 74497, 31793, 44320, 47573, 150850, 96442, 192120, 59425, -170553, 96466, 237885, 104269, 291759, 46675, 209823, 195873, 77743, 428608, 336859, 197023, 189218, -51811, 150248, 136796, 127417, 147843, 72276, 106856, 208562, -51028, 23612, -127695, 428672, 244120, 90735, 255452, -50564, 392659, 315136, 253285, -144107, 351422, 181270, 64551, 348363, 104811, 149249, 161204, -186095, -69634, -75735, 247773, -22531, -47880, 15519, -61500, 280108, 209102, 331909, 87050, -85607, 65677, 314584, 117931, 27149, 179060, 201925, 261457, -9829, -162027, 371887, 238024, 74857]
13205A76944K76635c29867B34183F8072L0287B663a37021A76254a271D65977I5352
13193a15012A73783j9731L15121b50932e2455A04555j9823N4222N4835K55256
13183D49045A45368K3502H2271J35004H8092k2855a69498C18052J5583a87940
13172a65542B73709h8672m56742A82910c0390j97764e4336A58295B9025J23720
13162A52745b5377A37923h4787B21007A01370b1157P054j2440j01483o1189H742
13150D3783J20667H1225a21497B4346a10887A06467J4816O2678p321b35263B3143
13138D0217a06103B51146F0529L13810a89181D67659k02544h7530A32022e4073
13127a83436B83249C5022J1887K15968j21105d5988q820o4513o3831B01283o41
$$ y = [176944, 453579, -329867, 234183, 68072, 98359, 2663, -137021, 176254, -1271, 465977, 95352, -115012, 173783, 154052, 469173, -250932, -52455, 104555, 84732, 138954, 193789, 449045, 145368, 168870, 82271, 217275, 88092, 65237, -169498, 318052, 333635, -187940, -165542, 273709, -88672, -545414, 182910, -30390, -228154, -54336, 158295, 29025, 152745, -25377, 137923, -84787, 221007, 101370, -21157, -14103, -26543, -128026, -189215, 8742, 43783, 164450, 81225, -121497, 24346, -110887, 106467, 121283, 183961, 176640, -235263, 23143, 40217, -106103, 251146, 60529, 374339, -189181, 467659, 265115, -87530, 132022, -54073, -183436, 283249, 35022, 46909, 262877, 141772, -45988, -54808, -119321, -183152, 201283, 200642]
13116B00642f35443f5321K1012n7832E1880b03527B7282N0220J23450b46236P4816
13105a71420a3309B08619a83857A30459E3758A7170b6102A29251b41135A66551
13094A05592J91702A1674O7687l9428k336q814d353k52290A66497E2827h2801
13082a03757H7886a59042I0571f0955B44747r704J05228j64085o1895e6920E04701
13070a23551j51098B18968C9876K12175h7749C05841B1593L10639M547a45671
13059A04840b35011A26210J09543j15107K38038n9036j27652o1944J02597o0835
13049A51814a77745B33700h9501g886A33860O1152C0879J97330n4271q1080c36
13037a59832a3938A43937C2497K9361c15833J47175A22219M4311M4645a20344
$$ y = [200642, -635443, -65321, -44309, -102141, 51880, -203527, 27282, 77502, 200952, -246236, -171420, -13309, 208619, -183857, 130459, 53758, 17170, -26102, 129251, -241135, 166551, 105592, 297294, 11674, 79361, 39933, 37597, 28783, -4353, -256643, 166497, 52827, -82801, -103757, 87886, -159042, 90571, -60955, 244747, 235043, 340271, 176186, 114291, -56920, 504701, -123551, -274649, 218968, 39876, 252051, -87749, 305841, 21593, 332232, 336779, -145671, 104840, -235011, 126210, 235753, 120646, 358684, 299648, 171996, 110052, 212649, 151814, -177745, 233700, -89501, -7886, 133860, 195012, 30879, 228209, 173938, 92858, -336, -159832, -13938, 143937, 32497, 61858, -315833, -168658, 122219, 166530, 211175, -120344]
13026B82895B6998c15417c3135I6750j4307K28097d6898H0585A9735a13272C367
13014g6172A59231a45340M3684C98a35273B72681k8307a10393A86a03261e0158
13002c7418I921O4433A1975J13289J51214E3138L13300H4098d4119K495C89190
12990b93387a3440A76092A9879J55888R421a92916B40331L3964A9302i6070A26287
12978A47181J29374a9779A37298J26398d23892A95958i8216A09755a78181c4108
12967I6759c00531h544A79451F0956h9187c4287C4167Q3219K0972J6533m3687
12956A11204a0395B18668L8527j11258A3026d5719E829e1512A3967K8902P5527
12945A18396J1994b18410b5584C1424c4767B5581L2142J1411c74307a20063H4675
$$ y = [282895, 26998, -315417, -33135, 96750, 82443, 310540, -46898, 80585, 19735, -113272, 3367, -76172, 159231, -145340, -101656, 398, -135273, 272681, 244374, -110393, 186, -103261, -50158, -37418, 9921, 74354, 11975, 125264, 276478, 53138, 366438, 84098, -44119, -41624, 389190, -293387, -13440, 176092, 19879, 175767, 185188, -192916, 240331, 274295, 19302, -96070, 126287, 147181, 276555, -19779, 137298, 263696, -423892, 195958, -98216, 109755, -178181, -34108, 96759, -300531, -8544, 179451, 60956, -89187, -34287, 34167, 117386, 138358, 154891, 111204, -10395, 218668, 257195, 145937, 13026, -45719, 5829, -51512, 13967, 42869, 118396, 130390, -218410, -25584, 31424, -34767, 25581, 57723, 69134, -374307, -120063, 84675]
12933A24941c35134A13308b75800A40919o7255a93420G3093M7175K4763g2321
12922G9849k8433N4690h2932A78263F0033d6493j2419k02502B45854a84736C23803
12910a45511G8266J16099P6890b11876b6252A70451n0337D8191j2083L05068A67878
12898a71466B59586b09477h7435E3804g6717a0689A66468G6452J33831h696l9672
12887d8368a2248r8912j00375E4257a27669A28452a18238C3362a94597B20418
12876b60202a4656k9208I8072b6533k90560h4339k21055B56659J448n8144R5415
12865B95378b75214A03913N2831O5521i7962B07980C2044a00987G8757n066d1334
12853A38974i3722A11346d2266B07319N0496o3426a1281C00051A04076m4075d6771
$$ y = [124941, -335134, 113308, -275800, 140919, 73664, -193420, 73093, 120268, 145031, -72321, 79849, 51416, 106106, -82932, 178263, 60033, -46493, -58912, -261414, 245854, -184736, 323803, -145511, 78266, 194365, 271255, -211876, -26252, 170451, 120114, 48191, 36108, 341176, 167878, -171466, 259586, -209477, -87435, 53804, -76717, -10689, 166468, 76452, 210283, -8696, -48368, -12248, -111160, -211535, 54257, -127669, 128452, -118238, 33362, -194597, 220418, -260202, -14656, -43864, 98072, -26533, -317093, -84339, -305394, 256659, 258107, 199963, 295378, -275214, 103913, 156744, 222265, -97962, 207980, 32044, -100987, 78757, 73691, -41334, 138974, -93722, 111346, -42266, 207319, 257815, 194389, -11281, 300051, 104076, 60001, -46771]
12841A88974c6779M040o4159j5476j70507G4028i319D5797c30887a28073j15960
12830b44033A00110I592a29036b9646n5168K1952D69611A87528a50284I4746K35909
12819C30655r1982c34093R5260j76167A12109B2185b54559g938m82247a82576
12808A22612i955C71165h0644A1292d7587j19748M1476K8484k38885A21131a73888
12796a25382o1345B28454Q9569I9651J39898e7985B4277b045B51004H1970j717
12785H0253J55316b33329q9563A5629P3517d245B88340h9241d0154g487B4062
12773b05959P8989E723a32814G8552r977b34512I9217J0461a52546A15077a16053
12761C60730K2361A87187G6946d5587G3513e3026j52138O8153o0453A40307N8627
$$ y = [188974, -36779, -32739, -96898, -112374, -282881, 74028, -9319, 45797, -330887, -128073, -244033, 100110, 9592, -129036, -29646, -84814, -62862, 469611, 187528, -150284, 94746, 330655, 238673, -334093, -238833, -415000, 112109, 22185, -254559, -7938, -490185, -182576, 122612, -9955, 371165, -80644, 11292, -47587, -167335, -125859, -97375, -336260, 121131, -173888, -125382, -186727, 228454, 318023, 99651, 239549, -57985, 24277, -2045, 251004, 81970, 80253, 235569, -233329, -322892, 15629, 89146, -4245, 288340, -89241, -40154, -7487, 24062, -205959, -126970, 5723, -132814, 78552, 68575, -234512, 99217, 109678, -152546, 115077, -116053, 360730, 383091, 187187, 76946, -45587, 73513, -53026, -205164, -137011, -197464, 140307, 198934]
12750A98934G1712a99932f9968k66155a9934k84276J23851A95082F4568a66677
12739D7746M8522K86842i733F6646O7049b19581A58470h2538B92753d3124B77462
12727b70480f4527G2838g8035B15641P8669e4511L46k34268A63133M5446a05306
12715B06736g0417m5463A37741b43574i5342A35191a02696b5632B0942M7204l2155
12704C5991J3292K60583E7222L96203A03685a01240l29202A48087a83089B49825
12693b26487i6453A87350R4939n0460a1086B26643a6079j36782f9930m5772B64846
12681B55287a520F1599J18319c9860a4914B13743c24164A19731K57876a15680
12670g3789g021j2874j32608f3173A57508B9955L320d4873H0885r423M8665L4600
$$ y = [198934, 71712, -199932, -69968, -336123, -19934, -304210, -180359, 195082, 64568, -166677, 47746, 96268, 383110, -9733, 66646, 133695, -219581, 158470, -82538, 292753, -43124, 277462, -270480, -64527, 72838, -78035, 215641, 294310, -54511, -54165, -288433, 163133, 208579, -105306, 206736, -70417, -115880, 137741, -243574, -95342, 135191, -102696, -25632, 20942, 68146, 35991, 49283, 309866, 57222, 453425, 103685, -101240, -430442, 148087, -183089, 249825, -226487, -96453, 187350, 282289, 231829, -11086, 226643, -16079, -152861, -69930, -115702, 264846, 255287, -1520, 61599, 179918, -39860, -14914, 213743, -324164, 119731, 377607, -115680, -73789, -7021, -19895, -152503, -63173, 157508, 29955, 33275, -44873, 80885, 71462, 120127, 154727]
12658A54727A6972O6338B5649L1266K7587M2571A4516J13562J49791j36317O6781
12647B08333c633D9694a06497k06127Q1469I2166J14581n9054a05519d8405A24986
12635A04662A2036J24412c52169Q24C70584A70486o0709J23391j05808J11606
12625B38966j04770C3587J23244a4326o012k6897o5635N6181A61514j3107b15639
12613f4014a7536p4066A58076M4609a83826C1122K06275H116M1255a11460A7251
12601A36573l7015b66758C12490k1409b2179j62421C95827E035K628K18483J21564
12590C47710f3358A14185K96941b07457G8115a4022A26856F0138a06388o92k13485
12579c20565D8494N8354P742d28344F0751M8092a59714A16705a95055q2327d5312
$$ y = [154727, 16972, 83310, 25649, 56915, 84502, 127073, 14516, 128078, 277869, 141552, 208333, -3633, 49694, -106497, -312624, -231155, 92166, 206747, 147693, -105519, -48405, 124986, 104662, 12036, 136448, -352169, -351345, 370584, 170486, 109777, 233168, 127360, 238966, 134196, 33587, 156831, -14326, -20338, -47235, -112870, -56689, 161514, 148407, -215639, -64014, -17536, -91602, 158076, 202685, -183826, 31122, 237397, 8116, 49371, -111460, 17251, 136573, 99558, -266758, 312490, 291081, -22179, -184600, 395827, 5035, 7663, 226146, 347710, -63358, 114185, 411126, -207457, 78115, -14022, 126856, 60138, -106388, -107080, -320565, 48494, 106848, 114590, -428344, 60751, 108843, -159714, 116705, -195055, -277382, -45312]
12567b36612G8879B4810R9347B015a14122F0005a73667g6709k30237P5020A94608
12555a33176J7262r8248B60661b435A7778a83816P1059A79114E5796g5487R282
12544f6205C3082J4052b18764A38307h184E8532J52416p2736N5153a01058j77308
12533b78366C9738c41856G223b97021J29269A5298K0127J08521D5742J9506a45142
12521e8914A09317a7792n3907m3306n4803A19965f2339H6374a25278k7498l1710
12510a84486A94944K8246a94881N4169B48344H0138a35935O2593o533G171J0561
12499A7732Q0976C1613D320c86482C87686E9758J32643a74438q4880f1960C2503
12487B9882K17684H0782J72057a41447N6986B13456P8650e9148A85879a96483
$$ y = [-236612, 78879, 24810, 124157, 2015, -114122, 60005, -173667, -76709, -306946, -231926, 194608, -133176, -115914, -214162, 260661, -2435, 17778, -183816, -112757, 179114, 55796, -75487, -66205, 33082, 47134, -218764, 138307, -8184, 58532, 210948, 138212, 193365, -101058, -278366, 39738, -341856, 7223, -297021, -167752, 15298, 35425, 143946, 45742, 65248, -145142, -58914, 109317, -17792, -71699, -115005, -169808, 119965, -62339, 86374, -125278, -152776, -184486, 194944, 223190, -194881, -140712, 248344, 80138, -135935, -73342, -79875, 7171, 17732, 98708, 31613, 4320, -386482, 387686, 59758, 192401, -174438, -259318, -61960, 32503, 29882, 247566, 80782, 252839, -141447, -84461, 213456, 292106, -59148, 185879, -196483]
12476G6040h3276I5525j6923Q9016b56526B28837l9483e1309D4459b21402K4789
12465a96613e5103j46507D0940b19801C59449i9972L0277j5735B51313a25913
12454i3923p5576E5279a91180A62779A8797a20427I8177d0052I3568a12559B20709
12442c63502i2925A47352C4307b08428g0675J582j47105M9449k3913r3519J20298
12431a63883j43257A20179b36069j21866D7505h7034I5820K14730A45250d9791
12420A73157C0577g1902L311j82664l8999a34264c9958D2014b06484R4637A01611
12408b77297n476I6934a85476D0391a06641d5911C2516j5581K58809d7003J0097
12397c6906p6162L801A21581l5482J43557b42195h4301A87233m4715a75101n8278
$$ y = [76040, -83276, 95525, 78602, 167618, -256526, 228837, 189354, -51309, 44459, -221402, -196613, -55103, -201610, 40940, -219801, 359449, -99972, -69695, -85430, 251313, -125913, -93923, -169499, 55279, -191180, 162779, 18797, -120427, 98177, -40052, 93568, -112559, 220709, -363502, -92925, 147352, 34307, -208428, -70675, -69093, -216198, -166749, -190662, -284181, -163883, -307140, 120179, -236069, -357935, 47505, -87034, 95820, 310550, 145250, -49791, 173157, 30577, -71902, -68591, -251255, -290254, -134264, -39958, 42014, -206484, -111847, 101611, -277297, -282773, 96934, -185476, 40391, -106641, -45911, 32516, 16935, 275744, -47003, -36906, -113068, -109267, 121581, 86099, 229656, -242195, -84301, 187233, 142518, -175101, -233379]
12386b33379A62385a4357n0130C0887K3922a42002B10010M220C8188A673L41677
12375C43350j4448j50451G1400Q1621K8142F9047j0257K39498m4136c06040A44446
12363a4764j48735j2005A67085D5533b52550F4450b34536A64339K3593K776R9437
12352B90145k6349a38419A91552i062B29988n474B856K2826a4220A39062E5296
12340a96252B43281G0414a1763B25200J64255g4883C12732A38170J80187j54211
12330A64146K184k9184J00413a62762e4995A93631F0008M7831a09420b5C13077
12318A32083J52561m8686A4206J69687E8707g9984q3171C0699A0161J90443J42262
12307C42866q8859O7013g2326A5729L15919a15320l8009B88724h1546C4261K68066
$$ y = [-233379, 162385, -14357, -64487, 30887, 54809, -142002, 210010, 214230, 38188, 1673, 343350, 328902, 178451, 71400, 153021, 181163, 69047, 58790, 298288, 254152, -306040, 144446, -14764, -163499, -175504, 167085, 45533, -252550, 64450, -234536, 164339, 187932, 190708, 290145, 263796, -138419, 191552, -9062, 229988, 224514, 2856, 25682, -14220, 139062, 55296, -196252, 243281, 70414, -11763, 225200, 389455, -74883, 312732, 138170, 318357, 164146, 166330, 137146, 237559, -162762, -54995, 193631, 60008, 107839, -109420, -25, 313077, 132083, 284644, 235958, 14206, 183893, 58707, -79984, -163155, 30699, 10161, 200604, 342866, 254007, 321020, -72326, 15729, 331648, -115320, -153329, 288724, -81546, 34261, 302327]
12296C02327q3872g1370F9546L3446b2679B00626A6335J99975p7841O0037K08445
12285D06951G7103M07i5709a1237k00999B07151i0060G4728A8133K0690J30278
12274A69101C3370R409N9705L299J94889A44222J52742j36115J04589a7780G4646
12262D03962r3706A31662K8502c056A17202e8219A1234R0886J84b30179b2825
12250A11561J75935F1856f5616A68026g3193C96310b46570C09544A13384L7267
12240A50651m8856m6069a87070K8981B28518p9977J52991A24170K60466a03393
12229B62349E8626J83554a20923L8325D28493j47167r4673J09140a03485H3640
12218A45350h350B17394J25277j56984m5043L9485H7388j7159R3996k8146f7503
$$ y = [302327, 218455, -71370, 69546, 102992, -22679, 200626, 16335, 216310, 138469, 198506, 406951, 77103, 77510, -95709, -11237, -212236, 207151, -90060, 74728, 18133, 38823, 169101, 33370, 42779, 102484, 105783, 300672, 144222, 296964, 160849, 265438, -17780, 74646, 403962, 310256, 131662, 160164, -3056, 117202, -58219, 11234, 102120, 102304, -230179, -22825, 111561, 287496, 61856, -65616, 168026, -73193, 396310, -246570, 309544, 113384, 150651, 101795, 55726, -187070, -158089, 228518, 148541, 301532, 124170, 384636, -103393, 262349, 58626, 242180, -120923, -82598, 428493, 281326, 186653, 295793, -103485, 83640, 145350, -8350, 217394, 342671, 185687, 140644, 180129, 87388, 70229, 164225, 136079, -67503]
12206a49964A81917b42738C79166a76619M5413b8727m597m1338j22561I9887J57688
12195B57575K36186A06171a12078C31427j49316K60425j42904A07690J036K21834
12185C30560m3792R0353A00462K62325a84902A45418j1254N4706C9024a66676
12174C85784m1810G7245a562C08366r8013K49184j46723o1713p9463m4395c3504
12162I5862M8394J60470G058a3279B60285N3006A26156D7952b63007A34590c5898
12150C36244B4895P5307J50099o3247b67813I7232O0795G1824M4742C1746Q0514
12139A12260K26078I1573J05564L02945j79274g5359A4410O3580J99820B7968
12128B61482m3682l4528M570q6916d4699B17251C3374J53903b66A07488J61120
$$ y = [-149964, 181917, -242738, 379166, -176619, -131206, -28727, -33324, -74662, -197223, 99887, 257575, 493761, 106171, -112078, 331427, 182111, 442536, 299632, 107690, 108726, 330560, 286768, 377121, 100462, 362787, -184902, 145418, 134164, 188870, 39024, -166676, 385784, 343974, 77245, -1562, 308366, 210353, 459537, 312814, 251101, 171638, 127243, -33504, 95862, 144256, 304726, 7058, -13279, 260285, 313291, 126156, 47952, -263007, 134590, -35898, 336244, 24895, 100202, 250301, 187054, -267813, 97232, 158027, 71824, 116566, 31746, 112260, 338338, 91573, 197137, 500082, 320808, -75359, 14410, 77990, 277810, 27968, 261482, 217800, 183272, 187842, 100926, -44699, 217251, 33374, 187277, -266, 107488, 268608]
12117B68608j10422k6533D6607B2763a8089A40093P6391a07546j12918C3460g2636
12105B98475I1501a6244N266C25759A32052J05439a33120i584A27345M4246F2730
12093h2780j59299H2468J32227F1308J23478q9844h595C04394j15147a6663j77705
12082a94368C12216j19338L7897a01315B2039J28934K19944D8565M2959d57307
12071A74103r46b74265D2767K3481b89000H1810i499l9663a8038B12274A03959
12059a07657I1604m2333H702h1440K647J4001A1324K18142J33150C4890c6152
12047A82511p0301R5557l4363K7065n8419N2264K9561E0769O0268J38770l2857
12036B16950a15962a991o435j01306G2652i875F6137a24619D7041O8061D5579
$$ y = [268608, 158186, 131653, 46607, 22763, -18089, 140093, 216484, -107546, -220464, 33460, -72636, 298475, 91501, -16244, -10978, 325759, 132052, 237491, -133120, -9584, 127345, 171591, 62730, -82780, -242079, 82468, 214695, 61308, 184786, 94942, -8595, 304394, 189247, -16663, -194368, 312216, 192878, 230775, -101315, 22039, 150973, 370917, 48565, 91524, -457307, 174103, 173157, -274265, 42767, 66248, -289000, 81810, -9499, -49162, -18038, 212274, 103959, -107657, 91604, 49271, 8702, -81440, -78793, -64792, 11324, 229466, 362616, 34890, -36152, 182511, 112210, 207767, 173404, 200469, 142050, 194314, 223875, 50769, 111037, 249807, 216950, -115962, -1991, -8426, -109732, 72652, -9875, 66137, -124619, 47041, 115102, 45579]
12024H0164c01596A5577a2662B00446i988A33558i2094j40014C8886a750j25465
12013a27215b3370D4173N2654Q7282E8251b8970C30123c3841l14982A59901A7986
12001B18994i0262k500e055A14019a65736P3703B3478J21413A6191P5537k420
11990H9308K71702a645E8390I276c53921a23051B29042i7433j40226M3363P7610
11979a16686M5410C1259a8270m9657j11738E9957Q7541A5955a64945E6576b57117
11967B74494b29355J10702N0954A07475J7189c6471A95606D8408e9746C18302
11956A52066n7889c03648A84429C7721a79539K2725I1404a90711j07503M6281
11946b51933H0703a47445b9776l09596B25509e8767B15922a23076L0551j20554
$$ y = [80164, -301596, 15577, -12662, 200446, -9988, 133558, -92094, -232108, 38886, -1750, -127215, -23370, 44173, 96827, 184109, 58251, -28970, 330123, -33841, -348823, 159901, 17986, 218994, -90262, -92762, -5055, 114019, -165736, -92033, 23478, 144891, 16191, 91728, 89308, 361010, -1645, 58390, 9276, -353921, -123051, 229042, -97433, -237659, -194296, -116686, -71276, 31259, -18270, -67927, -179665, 59957, 147498, 15955, -164945, 56576, -257117, 274494, -229355, -118653, -67699, 107475, 124664, -36471, 195606, 48408, -59746, 318302, 152066, 94177, -303648, 184429, 37721, -179539, -156814, 91404, -190711, -298214, -251933, 80703, -147445, -29776, -339372, 225509, -58767, 215922, -123076, -92525, -213079]
11936b13079f4689A24537a77105F6083J16152J17745a98248I485J53152a84977
11925B08922K7607p9257E471c78229a11698B14788c777j28052d229j1139j9981
11914c5349A5622a26865B7413a61222C12965b3498A930a13440a8756j07387A16292
11902h8633j48042H2849C0118d61987d9213A6354D235h4996k9998q9397N0216
11891a54175B49041b18154j856M4225A60948a7204m23005g2485j68964a9308N143
11880a4165j97952B1159b92120A1689J32282f8156B2192A0016k858i5751C0853
11868I3597a82232J0794d8921D6004a845C29403f0111j95197n9645J38005D6487
11856C1951J3826J0378a34775N6687A90757f4044k7976k7200c1565j41365e9789
$$ y = [-213079, -64689, 124537, -177105, 66083, 182235, 299980, -198248, 9485, 162637, -184977, 208922, 236529, 157272, 5471, -378229, -111698, 214788, -3777, -131829, -4229, -15368, -35349, 15622, -126865, 27413, -161222, 312965, -23498, 1930, -113440, -18756, -126143, 116292, -88633, -236675, 82849, 30118, -461987, -49213, 16354, 4235, -84996, -114994, -204391, -154175, 249041, -218154, -220010, -175785, 160948, -17204, -440209, -72485, -241449, -19308, -14165, -212117, 21159, -292120, 11689, 143971, -68156, 22192, 10016, 7158, -95751, 30853, 93597, -182232, -171438, -48921, 46004, -1845, 329403, -60111, -255308, -314953, -176948, 46487, 31951, 45777, 56155, -134775, -78088, 190757, -64044, -92020, -119220, -31565, -172930, -59789]
11844A32267a66294b8665j94357J05018M7529j58584C9764h8373A89374P7152
11834B66526e5136b5940r6206K6316j49881c9242j30081B4689G686b67092a14975
11822a44661N3157a850q4450K8012C8705a20713A11945a90545h3667k89986D4093
11810a58949D699c07557I8198M298F747K67761j24843i0648B06499B3595N3253
11799G6848b69812k2688N9020c0017l01560a12974P653n4256j46835A37840L3315
11788A71155a98345Q9356c1447H2641e3588j4504A97432L3217A8119a25834A71210
11776G335b1336a0013j5532A7334J99945a51245l1685H754O1341a49165h308D859
11763B82064c29910J35695O8852K6008d1948p9387A73327h3869n1222M6426q3737
$$ y = [132267, -166294, -28665, -223022, -118004, -70475, -229059, 39764, -88373, 189374, 266526, -55136, -25940, -122146, -95830, -245711, -39242, -169323, 24689, 7686, -267092, -114975, -144661, -91504, -1850, -86300, -58288, 38705, -120713, 111945, -190545, -83667, -373653, 44093, -158949, 4699, -307557, 98198, 102496, 6747, 274508, 149665, -90648, 206499, 23595, 76848, -269812, -292500, -233480, -30017, -331577, -112974, -105321, -159577, -306412, 137840, 171155, -198345, -108989, -31447, 82641, -53588, -68092, 197432, 230649, 18119, -125834, 171210, 7335, -21336, -10013, -25545, 17334, 217279, -151245, -182930, 8754, 70095, -149165, -8308, 4859, 282064, -329910, -194215, -125363, -99355, -41948, -121335, 173327, -83869, -135091, -88665, -172402]
11752a72402A89846A9567o988g7849A67033M3970b1926H0424J48119B9111e5200
11740A07657e7908m7607n1420A83273F7099G490g7896A3548b95659E7109c5817
11728c91190C09112p2021K0585r6560o8267J8711C0274b9313J3120j24057N2790
11717h7460k6922A18473g2664j11179B90756b53875a14901B46028I9259c04816
11706b05188A99751i5075A79404k7847n6987L74625g9348B71561j15348h1810
11695b2377E3027N0418b4016j79065e72D2317b7658O795o8364A16352a28251C49731
11682A92148i6507j53327h565C9523J04605E4851K1530a4529j45574G4822a61477
11670A20160d22064A45191o7437d07748F0824J77172B7045g3862K8314J5357B08837
$$ y = [-172402, 189846, 19567, 12579, -77849, 167033, 211003, -21926, 80424, 228543, 29111, -55200, 107657, -57908, -105515, -156935, 183273, 67099, 7490, -77896, 13548, -295659, 57109, -35817, -391190, 309112, 237091, 257676, 161116, 92849, 111560, 30274, -29313, -16193, -140250, -87460, -114382, 118473, -72664, -183843, 290756, -253875, -114901, 246028, 99259, -304816, -205188, 199751, -95075, 179404, 151557, 94570, 469195, -79348, 271561, 156213, -81810, -22377, 53027, 103445, -24016, -203081, -572, 42317, -27658, -20863, -89227, 116352, -128251, 349731, 192148, -96507, -249834, -8565, 39523, 144128, 54851, 76381, -14529, -160103, 74822, -161477, 120160, -422064, 145191, 77754, -407748, 60824, 237996, 27045, -73862, -45548, -30191, 208837]
11658b26995M575h9004e14k60499a10439j16788E091L84592A63679h2599A71294
11646B23253G9299g6835F1013c97178C0171a38957c4743j95102d3581E1332a40524
11634f1051k22522B58115i737j48146q8692a0600j76326O7925J3817a6317M313
11623a2004j67456C06460a65287O8676a7634B935a12658A1548J85639o2771A4303
11611a33604o5615F4228a3044j57847B940a34296B1312J63133G9633B027c3812
11599a55811A94555A2599K12436D6213M01040H8686J63007d0024B95062b53627
11588A36508E0291Q9393a95293A76694J86154b8920A93475B5342a83439h2331
11577b22553l959f1149J3850D0785c55153b9488p887k36A79750b8949G9330c19166
$$ y = [-226995, -222420, -89004, -514, -261013, -110439, -227227, 5091, 389683, 163679, -82599, 171294, 223253, 79299, -76835, 61013, -397178, 30171, -138957, -34743, -229845, -43581, 51332, -140524, -61051, -283573, 258115, -9737, -157883, -246575, -10600, -186926, -119001, -105184, -16317, -12004, -179460, 306460, -165287, -96611, -17634, 2935, -112658, 11548, 197187, 134416, 14303, -133604, -199219, 64228, -13044, -170891, 2940, -134296, 21312, 184445, 79633, 2027, -33812, -155811, 194555, 12599, 225035, 46213, 447253, 88686, 251693, -40024, 295062, -253627, 136508, 50291, 139684, -195293, 176694, 362848, -28920, 193475, 25342, -183439, -82331, -222553, -226512, -61149, -47299, 40785, -355153, -29488, -37375, -37611, 179750, -28949, 79330, -319166]
11564C07749K1480a28328F7135g9425D18384a34115O4891l3795A16504J11530
11554B28034D814L7915H403b6134A01672J58871b32432b845I7188c9793A28191
11542c68457B31526Q6594c6860D5402J17643a65352F7242g8998m8918B53407a94554
11530a87413I9097J6959A8652L09646A63351K04147h7397L0315k68940E4126J96478
11519B50604F2440O4160J97180A58880R2654H7306J22759C1751e6334E3966M9285
11508A03251J07755j01425J06699J0705n1966a02581F51419b0032j13791A83760
11497A53873a53059A7414J79252a3001M386A30908k9532J46284J7401J07305o1394
11486C10972A33462L9093m3820k3016a7605H4271J62080B0146b07607D0533b70395
$$ y = [307749, 329229, -128328, 67135, -79425, 418384, -134115, -69224, -103019, 116504, 228034, 4814, 42729, 8403, -26134, 101672, 260543, -232432, -2845, 97188, -39793, 128191, -368457, 231526, 318120, -36860, 45402, 163045, -165352, 67242, -78998, -127916, 253407, -194554, -187413, 99097, 116056, 18652, 328298, 163351, 367498, -87397, -57082, -326022, 54126, 250604, 62440, 126600, 323780, 158880, 251534, 87306, 210065, 31751, -56334, 53966, 103251, 211006, 109581, 216280, 226985, 175019, -102581, 651419, -20032, -133823, 183760, 153873, -153059, 17414, 196666, -13001, -8615, 130908, 101376, 247660, 265061, 372366, 310972, 133462, 172555, 128735, 105719, -17605, 84271, 246351, 20146, -207607, 40533, -270395]
11474d6781G0254K78148A39636E8750J07950l1133g5543D71441I0585N1067E0779
11462E3660J0928K59726i9375A19892N1295L3754R6360D4458a26955n7160G6875
11450A26957J04379d3714D8230K96797j03782k9273e4700A32749b207B7211a53285
11438i8238B21668J02353b7877A3476f3818j73836b3627A27074a31499G5371f6898
11426F0936K5113e0555A60429c25516a0619k14553E1925A8918d5565A78648a9224
11414H8708b23545l738I6422Q0691H2148e4294J5556I4345b2157o8425m46j2912
11402a03940A07679O3981e3833C24595A1225a63667G4797K30090b33101K2508
11392b10593A85503a33467c3379k01854f644j49765A47627a54483K1372f3129
$$ y = [-46781, 70254, 348402, 139636, 58750, 166700, 135567, -75543, 471441, 90585, 141652, 50779, 53660, 64588, 324314, -99375, 119892, 171187, 204941, 301301, 44458, -126955, -184115, 76875, 126957, 231336, -43714, 48230, 345027, 241245, 211972, -54700, 132749, -2207, 27211, -153285, -98238, 221668, 324021, -27877, 13476, -63818, -237654, -23627, 127074, -131499, 75371, -66898, 60936, 86049, -50555, 160429, -325516, -10619, -225172, 51925, 18918, -45565, 178648, -19224, 88708, -223545, -227283, 96422, 177113, 82148, -54294, -38738, 94345, -22157, -90582, -91028, -103940, 107679, 171660, -53833, 324595, 11225, -163667, 74797, 304887, -233101, -210593, 185503, -133467, -33379, -235233, -6644, -156409, 147627, -154483, -133111, -63129]
11381a3554B06280j0530h198j50445D9825a23881A42891J9332G9671C3007a95342
11369c54574a61897O7750n4C85279f0081K8157n2563A07972J22943B2852L35006
11358C57858A17004a35405J6013B73669a38582p5458A4564B383f5724j91113J21423
11347a35414o1744D6250k2713b88434h131o1777B16405J53311d0640A44595a45988
11335F4542K73301b98748A4330N5240c14825I445M02070b45057P0590j79802f864
11323d35695J27251I6190b76199K2038f5420k43448i8454D09601b80200h1432
11312C172b49078B58547a8261j35530A48658O966f0190A34023b78519A0555J29314
11301A39869a33935A78396J24017c76598E8455b46267j915A30171n143c14344
$$ y = [-13554, 206280, 195750, -8198, -158643, 49825, -123881, 142891, 162223, 79671, 33007, -195342, -354574, -161897, -94147, -94201, 385279, -60081, -31924, -84487, 107972, 230915, 22852, 357858, 117004, -135405, -119392, 273669, -138582, -214040, 14564, 2383, -65724, -256837, -135414, -197158, 46250, 23537, -288434, -8131, -69908, 216405, 369716, -40640, 144595, -145988, 64542, 337843, -298748, 14330, 69570, -314825, 9445, 411515, -245057, -174467, -354269, -6864, -435695, -308444, 96190, -276199, -254161, -65420, -308868, -98454, 409601, -280200, -81432, 3172, -249078, 258547, -18261, -153791, 148658, 155624, -60190, 134023, -278519, 10555, 139869, -133935, 178396, 302413, -376598, 58455, -246267, -248182, 130171, 125028, -314344]
11290b63818b5397A74703m0945n7104A0638b22921A45063i0001E3707e2369B557
11278H0068N0872c5871j22326j78944B8977J05361d70962B80460f7855A0900d1264
11266A29560n1062O3156Q6648C0189i6225c8573j93290h0206j1954o7555I9853
11254b66485r0228a69551B244b9548k87813j48184a91190A63111J34758e6442
11243C40666a14547o4326J6286L3886a4862A90917g3444c4098o1649M7482j09605
11232a57870f3067k9742j9510j54186I2614a52056M1890K7871q575C51418a20583
11220A22930e8061A86792e4905j84815A77680c11822J53267j10532d0069q1394
11210a21463K7261C52363B7693A697J90192a01848D06448g3257B71876D7400g7869
$$ y = [-263818, -25397, 174703, 133758, 76654, 10638, -222921, 145063, -90001, 53707, -52369, 2557, 80068, 130940, -35871, -158197, -337141, 28977, 134338, -470962, 280460, -67855, 10900, -41264, 129560, 78498, 141654, 228302, 30189, -96225, -38573, -231863, -80206, -92160, -159715, 99853, -266485, -356713, -169551, 2244, -29548, -317361, -465545, -191190, 163111, 297869, -56442, 340666, -114547, -178873, -162587, -128701, -14862, 190917, -73444, -34098, -95747, -48265, -157870, -63067, -92809, -112319, -266505, 92614, -152056, -110166, -82295, -90870, 351418, -120583, 122930, -58061, 186792, -54905, -239720, 177680, -311822, -158555, -269087, -40069, -121463, -94202, 352363, 27693, 1697, 191889, -101848, 406448, -73257, 271876, 47400, -77869]
11198d8657n8329D5330a77461B17435q3708L2145c4670j73994j29194a54430f0513
11186c30607L1755A0867a531j18320k17966M9223D2531b87521A12067a70403d562
11174A98456d0395k3431R412j15547A40541a05088k43995B79086a67433j59981
11164c27414i3497k6490k04088a50829A55449o3413l1092a1277q7299j15495Q2482
11153a31589I543J50760D5566J13875b19078e4817K5026G1364a48327k9522G9626
11141c1474j13568A1047L7826P0119a33421j07892A27579F832J63385a73688A6201
11129B16218d0654H0529J6613a61864E71421A69251J41003a65374G0232B7160
11118B23626g3836J8597B32872p2259e6354C29496a03971B13398j5587i5195B56286
$$ y = [-48657, -106986, 45330, -177461, 217435, 133727, 165872, -34670, -208664, -337858, -154430, -60513, -330607, -298852, 10867, -1531, -119851, -337817, -288594, 42531, -287521, 112067, -170403, -4562, 198456, -40395, -63826, -54414, -169961, 140541, -105088, -349083, 279086, -167433, -327414, -93497, -119987, -324075, -150829, 155449, 92036, 60944, -11277, -98576, -214071, -131589, 9543, 160303, 45566, 159441, -219078, -54817, -29791, 71364, -148327, -177849, 79626, -31474, -145042, 11047, 48873, 118992, -133421, -241313, 127579, 6832, 170217, -173688, 16201, 216218, -40654, 80529, 97142, -161864, 571421, 169251, 310254, -165374, 70232, 27160, 223626, -73836, -55239, 232872, 160613, -56354, 329496, -103971, 213398, 197811, -95195, 256286]
11106a07309p667r9412B28989d73j30254r6670c0299C0733J00671N8596a54309
11094D45972A38849J3401D7124a49031a179j17338A29453k6890R5345p7169K7732
11083A48471D2374K29206f3632D27804I760L58121b48304A74600M7710J51847
11073C74157J79238k71697j00327n0187J52573L34560k81822K4020K7044l1751
11063C55808Q0766j24156D350K96718j33493F3565J78241L98802j24208B37764
11052B73578J9282J01286K57042J3420k21384K55492J58279k97923J15185L10363
11042I84620m22135l4407Q1609J61052k03668K19712L7238J24899m37357J48454
11032F60017O9705p2497l07987K22821J6924K1907l5889k02879J37170R5596L36923
$$ y = [-107309, -114976, -214388, 228989, -473, -130727, -227397, -30299, 30733, 131404, 190000, -154309, 445972, 138849, 152250, 47124, -149031, -1179, -118517, 129453, 102563, 197908, 120739, 148471, 42374, 271580, -63632, 427804, 9760, 367881, -248304, 174600, 222310, 374157, 553395, 281698, 181371, 131184, 283757, 618317, 336495, 360515, 387559, 355808, 436574, 312418, 4350, 301068, 167575, 63565, 241806, 640608, 516400, 237764, 273578, 292860, 394146, 651188, 664608, 443224, 698716, 856995, 559072, 674257, 984620, 562485, 528078, 609687, 770739, 567071, 786783, 824021, 948920, 511563, 660017, 729722, 657225, 349238, 572059, 588983, 610890, 575001, 372122, 509292, 604888, 941811]
11021I41811k85629p0866j02007m6347M1745J5034P8060l4749p4476J03149k48302
11010C17423M09435j28100j63223J44441r205K33595k59681l5863q9342K53344
11000F72824k58738K35755r6893k2893j42090P9463L24969M5735C38034J10300
10990D48334J77316J77080j55256m8976K82186q3304K12699j79895j90336r2264
10980E47584M48260n9052J41676r1885J36536k05835K03391M16228M1325q412
10970A569816M27785M16155l0580O5076P3259j5509l56420M96715m84412j25257
10960B036628j51999l58839j88219N2277j10623J13879J71946L9544k31345K87446
10950A660695j35684k27940j79719l02373L86626m47240K03335B86425P2542j59043
$$ y = [941811, 656182, 585316, 483309, 436962, 478707, 493741, 571801, 537052, 462576, 565725, 317423, 726858, 598758, 435535, 579976, 570771, 804366, 544685, 508822, 419480, 672824, 414086, 649841, 552948, 530055, 387965, 467428, 792397, 838132, 338034, 448334, 625650, 802730, 647474, 598498, 880684, 797380, 1010079, 830184, 639848, 547584, 995844, 936792, 1078468, 986583, 1123119, 917284, 1120675, 1536903, 1578228, 1569816, 1997601, 2413756, 2383176, 2448252, 2521511, 2506002, 2149582, 2646297, 2161885, 2036628, 1884629, 1525790, 1337571, 1389848, 1279225, 1393104, 1565050, 1604594, 1373249, 1660695, 1525011, 1297071, 1117352, 814979, 1201605, 754365, 957700, 286425, 358967, 199924]
10940A99924P2376j27118m2701A6450M99342j85640L4500I8056P7757d5837A63358
10928D46906D4284a50510J1536C16278I1216D012K67450A05775K060a96438q6638
10917b83076A2269b00594e098l68294A28557C5570i2726j7112j29307f1047k88699
10906c49746B89298e2703j41187j26637a34234M4469A87162b22940B06447c4993
10895a3265l03744i9295B02806f7669J4069j50966P6178A33912c74199e7251o81
10884e7932j4799K3229B3547M7908c32582C464J68093f8575J5696B3129L5428
10873E8557b06931a7356j0886k19275A9925K8644R99a83314D07317F8320N9422
10862A27742c7807B14548l1119a69306O0193A29233A1707a53968j04988O0855
$$ y = [199924, 272300, 145182, 102481, 16450, 515792, 330152, 364652, 98056, 175813, -45837, 163358, 446906, 44284, -150510, -138974, 316278, 91216, 4012, 271462, 105775, 107835, -196438, -283076, 12269, -200594, -5098, -373392, 128557, 35570, -92726, -109838, -239145, -61047, -349746, 289298, -52703, -193890, -320527, -134234, -89765, 187162, -222940, 206447, -34993, -13265, -317009, -99295, 202806, -67669, -53600, -204566, -128388, 133912, -374199, -57251, -57932, -72731, -49502, 23547, 71455, -332582, 3464, 171557, -68575, -52879, 23129, 58557, -206931, -17356, -28242, -247517, 19925, 48569, 49568, -183314, 407317, 68320, 127742, -37807, 214548, 183429, -169306, -109113, 129233, 11707, -153968, -258956, -198101]
10852a98101R4785c8903A90447H8944l7760d37781A05528a11793k1137M1008K7789
10841f4133k65683b5940j00385E4561J2129a49140H1298L7340c23738j23707a8666
10829i7240B91392g7749A68439D2004M48236d676I8329Q6648a97592N0576P3002
10818g4014a6463E9522a61548n1077j052b8193C014P1841J7010c04846a1747m07082
10806d18829n17B24203a17357F0081c14141a47742D6020a98071h0960A00959d9697
10794c24081A18211a20392j3371L6255A67506a73979H9022B0533c8321k02862
10784b41183A27304n5740h5100A3194E020d7632j52544n6973B96848G1470a90298
10772D0905a23839J5325C5033a46015L6017B26805A12774E4548G702f8202j64259
$$ y = [-198101, -103316, -38903, 190447, 88944, 51184, -437781, 105528, -111793, -132930, -91922, -64133, -329816, -25940, -126325, 54561, 66690, -149140, 81298, 118638, -323738, -447445, -18666, -97240, 291392, -77749, 168439, 42004, 490240, -4676, 98329, 184977, -197592, -147016, -74014, -16463, 59522, -161548, -212625, -213677, -28193, 3014, 74855, 91865, -304846, -11747, -418829, -419346, 224203, -117357, 60081, -314141, -147742, 46020, -198071, -80960, 100959, -49697, -324081, 118211, -120392, -133763, -97508, 167506, -173979, 89022, 20533, -38321, -241183, 127304, 71564, -85100, 13194, 5020, -47632, -200176, -257149, 296848, 71470, -190298, 40905, -123839, -108514, 35033, -146015, -109998, 226805, 112774, 54548, 7702, -68202, -232461]
10761b32461f1605j29444j98334a78649A97222H217a26815e7132A93514n388H6038
10749A32717b05517c2726B5822b50322J16143K1239o3525e9389q6485H1723a41855
10737A98067I2895J53234F2982K12513H0744a15340n1123l3012C23593a81222
10726a12872I405b35690A61506d56724i036k4077A43404b6222j0096B35960j3575
10715B22385d29207d9269p3542A97670J5108G3210a31851E7444b52254Q3074J9305
10704a49875H5774A5184b71564A2532a94068a1040j12594b8189k26096d5454C53402
10692a4370o9796F3944a43345G7862A4993a26477p8615A25245b3173p0623k7657
10681a21453a0398B34864a81396B29598c99242i7163b0078j91409g7261j37136
$$ y = [-232461, -61605, -191049, -389383, -178649, 197222, 8217, -126815, -57132, 193514, 188126, 86038, 132717, -205517, -32726, 25822, -250322, -134179, -112940, -176465, -59389, -145874, 81723, -141855, 198067, 92895, 246129, 62982, 275495, 80744, -115340, -166463, -199475, 323593, -181222, -112872, 9405, -235690, 161506, -456724, -9036, -33113, 143404, -26222, -36318, 235960, 222385, -429207, -49269, -122811, 197670, 212778, 73210, -131851, 57444, -252254, -169180, -149875, 85774, 15184, -271564, 12532, -194068, -11040, -123634, -28189, -254285, -45454, 353402, -14370, -84166, 63944, -143345, 77862, 14993, -126477, -205092, 125245, -23173, -93796, -121453, -10398, 234864, -181396, 229598, -399242, -97163, -20078, -211487, -77261, -214397]
10671b14397A58263a07419F0036a90615o5610a7300M273l05971a21867j6935H0746
10659d3531a8482A8742J78298a48107f1128A51044F7751b3616D7008a77724E2928
10647e58572i8156A60593C5964a89955j40297h5199j10123A10038a73170C67011
10636g0377i135a565o7065m8867c2449j68021m3719R6196f0008o8758e9664E5059
10623D8312h3924n7010A37835J68671H7125f2711q012A43764b2031m92804a30865
10611a88897F1019b37128i006j02684c8893k28906f1796m8303L9604j75701B64216
10599e4023H8743D2349g8022K4660D1679a87861g472o3157m34724H7127b5823
10587i4805m9158C2336J05561b27841d2173k26346a0023j88699A41241a07728
$$ y = [-214397, 158263, -107419, 60036, -190615, -256225, -17300, -13027, -318998, -121867, -138802, 80746, -43531, -18482, 18742, 197040, -148107, -61128, 151044, 67751, -23616, 47008, -177724, 52928, -558572, -98156, 160593, 35964, -189955, -330252, -85199, -195322, 110038, -173170, 367011, -70377, -9135, -1565, -68630, -117497, -32449, -200470, -244189, -147993, -60008, -128766, -59664, 55059, 48312, -83924, -140934, 137835, 306506, 87125, -62711, -70723, 143764, -22031, -514835, -130865, -188897, 61019, -237128, -9006, -111690, -38893, -267799, -61796, -110099, -70495, -246196, 264216, -54023, 88743, 42349, -78022, -53362, 41679, -187861, -7472, -70629, -505353, 87127, -25823, -94805, -143963, 32336, 137897, -227841, -42173, -268519, -10023, -198722, 141241, -107728]
10576b73121A55781b04283C79234h1518K4740A20690c1314k27526D977h0005B45468
10564d237D30906F895J13994K1462b46305e8059B6628L7271a58535C10417b48995
10552g9950A66700b47391G3836O0820C2047a44763K8596A20389f5222j2280E04069
10540c4701G1618K01654A3386a64504M153B0269h7126l26335A96953a61254G830
10528C6105a91545P254e7987A6234J82608c09114E666b83049a36841A98708R2564
10517B91272a32135B34722c01251A99590R2394d25264D13542G655L94007b29122
10506c6898J2113H9919b53963B35742c4486r343P219j07863l1595b092A46855
10494c12104A64737a73282A37423ka45593N7649l17030a26704C61139a94154j81234
$$ y = [-273121, 155781, -204283, 379234, -81518, -56778, 120690, -31314, -258840, 4977, -80005, 245468, -4237, 430906, 6895, 120889, 142351, -246305, -58059, 26628, 63899, -158535, 310417, -248995, -79950, 166700, -247391, 73836, 134656, 32047, -144763, -116167, 120389, -65222, -77502, 504069, -34701, 71618, 273272, 13386, -164504, -160351, 20269, -87126, -413461, 196953, -161254, 7830, 36105, -191545, -184291, -57987, 16234, 198842, -309114, 5666, -283049, -136841, 198708, 291272, -132135, 234722, -301251, 199590, 291984, -425264, 413542, 7655, 401662, -229122, -36898, -24785, 89919, -253963, 235742, -34486, -43829, -36610, -144473, -176068, -2092, 146855, -312104, 164737, -173282, 137423, 137421, -145593, -87944, -404974, -126704, 361139, -194154, -375388]
10483c75388B38451a21158K0557b703j83930b079A5412N3183K74735J54628L60558
10472H58516o5007A58503J40825h6276l1951K7312B10708F6706J12969b31027
10461A2849b29036j7645i5437A35602c2641A15251l4839b27205q5963a13262j4441
10450a27703K0501A0131c69580R9477E6826O9698b01555A84870J45803b4132m0942
10439f5074A05751k0460h4471j65969m486J3451A79681C2244b20393f2583n8245
10428a20828k6692k43052N3391g9248j07663O205c9520j3821j13876K3814k42730
10417c86133A4190a04949A08523K7717b32947k3380a06092n9234a8444j35952
10407a54396D5334b45443P233l1387H2986L9545P8314F6955R7417b33321D1039
$$ y = [-375388, 238451, -121158, -100601, -2703, -186633, -2079, 15412, 68595, 343330, 497958, 858516, 793509, 158503, 299328, -86276, -118227, -90915, 210708, 66706, 179675, -231027, 12849, -229036, -246681, -95437, 135602, -32641, 115251, 80412, -227205, -313168, -113262, -127703, -107202, 10131, -369580, -270103, 56826, 126524, -201555, 184870, 330673, -24132, -65074, 105751, 85291, -84471, -250440, -254926, -241475, 179681, 32244, -220393, -62583, -120828, -147520, -390572, -337181, -79248, -186911, -180706, -39520, -53341, -167217, -143403, -386133, 14190, -104949, 108523, 136240, -232947, -256327, -106092, -165326, -18444, -154396, 45334, -245443, -238210, -269597, 82986, 122531, 200845, 66955, 164372, -233321, 41039]
10395E0335a12174b4139A88564B4006f1230B16540J18711g5412L499F3172K22462
10384B85634b9030k4149G6083I291K54869i4587A13810K5728h8901C71010j77567
10373A93443J36939r3736r1435a06075B21230n8650L7459L12131j38823n7440
10363C15907j14278L62531p8806j09032A65924F1935K99706J02855B31826m7204
10353A84622C3121J58156j3692K94807k03115K22977J84109l22824J80107e6851
10342B84835L3542R2439L3856A45396J22838n1015q0657K74945A56629h9382j569
10331i0951B85972j10911b62634I7895a57973A975P7537d0844b0115E5647O7579
10320A23226b25531E32999C8882J90329G6638K9062E0655M6566D2470K03003O179
$$ y = [50335, -112174, -24139, 188564, 24006, -61230, 216540, 335251, -75412, -71913, 63172, 285634, -29030, -53179, 76083, 9291, 264160, -94587, 113810, 139538, -88901, 371010, 193443, 330382, 236646, 145211, -106075, 221230, 162580, 200039, 512170, 373347, 315907, 201629, 564160, 485354, 376322, 165924, 61935, 361641, 464496, 231826, 184622, 33121, 191277, 177585, 472392, 269277, 492254, 676363, 353539, 533646, -56851, 284835, 318377, 410816, 444672, 145396, 268234, 217219, 136562, 411507, 156629, -89382, -90951, 285972, 175061, -262634, 97895, -157973, 1975, 79512, -40844, -20115, 55647, 123226, -225531, 532999, 38882, 229211, 76638, 105700, 50655, 97221, 42470, 245473, 251652]
10309B51652b36991E42316A25200E5478K7519J04657C592b78243Q7952E2271L4933
10298H7204a57295k3279A66734J03184a53907B34806d39009a68835j56136P0154
10288b54817J24986E3080i3505B4919K3242f1369j68509Q464G3410d91801b39904
10276I4883b36437j05578Q6009c0656C3035e4007j24176j61821a8078A05219b9029
10264a31466G2752g4972K3544n7388e0437B49949a25526e8503n544m8621D1519
10252A93584E106K44846r5055p7176P636O6009F8433d1805B51591r0625N636J19315
10240B85917F3516f759A04548h775j91366f0919B08210q4925l476a05236j71895
10229b77131B02909i3248j29455f6173j54459I683R4927b26758N5099l0203h3893
$$ y = [251652, -236991, 542316, 125200, 55478, 82997, 187654, 3592, -278243, -190291, 52271, 87204, -157295, -180574, 166734, 269918, -153907, 234806, -439009, -168835, -324971, -254817, -129831, 53080, -93505, 24919, 48161, -61369, -229878, -221414, 73410, -491801, -239904, 94883, -236437, -342015, -256006, -30656, 33035, -54007, -178183, -340004, -18078, 105219, -29029, -131466, 72752, -74972, -51428, -108816, -50437, 249949, -125526, -58503, -64047, -112668, 41519, 193584, 5106, 249952, 154897, 77721, 85357, 151366, 68433, -41805, 251591, 160966, 166602, 285917, 63516, -6759, 104548, -8775, -200141, -60919, 208210, 123285, 119809, -105236, -277131, 202909, -93248, -222703, -66173, -220632, 9683, 104610, -226758, -171659, -201862, -83893]
10217e6262n9912j50071B88071c53978a18560E03945c49035f7136F7693D928e1685
10205c64771A34809K76969a36709k73747a38391e9304j44095j37872d4662H5187
10194I4494d35110a23753k102B82554d0041A8313d5500j67014g8983k8629e776
10182c07197F5259k1787J3942b44898E4063K2408a27246r2754C5271b85892A6298
10170a66251M501o894K7322a5797k02215k5374Q9742d1073j10754M0852b256j19393
10158a21649r1293k1287K0080h1993G2352n743a47604B26790b49183B3412b7275
10146E9428c7941A52733a2140o6535A87360q9704b12098c4658H1247m0376b01
10134a77535A70436b98172c0678J005j50570e926l03070i2912m8237A9075e4538
$$ y = [-56262, -116174, -266245, 288071, -353978, -118560, 503945, -349035, -67136, 67693, 4928, -51685, -364771, 134809, 411778, -136709, -410456, -138391, -59304, -203399, -341271, -44662, 85187, 94494, -435110, -123753, -125855, 282554, -40041, 18313, -45500, -212514, -78983, -107612, -5776, -307197, 65259, 43472, 57414, -244898, 54063, 76471, -127246, -220000, 35271, -285892, 16298, -166251, -161750, -168644, -141322, -15797, -218012, -243386, -153644, -41073, -151827, -110975, -2256, -121649, -212942, -234229, -214149, -81993, 72352, 66609, -147604, 226790, -249183, 23412, -27275, 59428, -37941, 152733, -12140, -78675, 187360, 97656, -212098, -34658, 81247, 40871, -201, -177535, 170436, -298172, -30678, -29673, -180243, -5926, -308996, -92912, -141149, 19075, -54538]
10122B14835c50394a30561j45482J31370A7366R5864d81462A34113a68460G3158
10111B82306a19209E4138a77558K197P0772p1737j05921Q8451j14203a34043K4843
10100a09200r8552E2030d2705B9652J57888a80901F8989a76905g3921I2385O5246
10089A57631c10975C0745a76064L783C3313a20815N2996B1504K23205a10862K915
10078a07947A17133a78644L5446f901B88071A07753c16811o792A00608b68708
10067G7857b58126J10825c3222B75825F405b36864O2384f8901H5628a58065a7338
10055i036k22007A02586l0202d22790G6803b26709D8504b03442A51393b45988
10044B7364b0195A42453o7330N8558J9516b43501j03799A4463c8561n3268J9172
$$ y = [214835, -350394, -130561, -276043, -144673, 17366, 113230, -481462, 134113, -168460, 73158, 282306, -119209, 54138, -177558, -175361, -104589, -176326, -282247, -193796, -307999, -134043, -109200, -207752, 52030, -42705, 29652, 187540, -180901, 68989, -176905, -73921, 92385, 157631, -310975, 30745, -176064, -172281, 33313, -120815, -67819, 21504, 244709, -110862, -107947, 117133, -178644, -143198, -6901, 288071, 107753, -316811, -323603, 100608, -268708, 77857, -258126, -147301, -33222, 275825, 6405, -236864, -174480, -68901, 85628, -158065, -17338, -9036, -231043, 102586, 72384, -422790, 76803, -226709, 48504, -203442, 151393, -245988, 27364, -20195, 142453, 75123, 133681, 153197, -243501, -347300, 14463, -38561, -91829, -72657]
10033g2657k89681F5255K3662a15281L3232j1407M0017A38767i1674m6598j26974
10022b65246a29513o6976A51138a03493A1445c04725a29639A84676I636a72066
10011a03568c4622j11874A01030c43730a49997j39925E5341J47865c77970B28564
10000a58280B38554c8559k40459a08583r3858B70477G6150e0876A07461c9101
9989A44498k2440D4226J04552E9815K3257a89418A95111a82686j05030B52103
9978a98191A46322K2027L1590b05865D4117M9805B8982a17134p5621r4287d1329
9966B80244a79247g0594j29701M8896A10964a8347m359F5129d696k71749J24645
9955a51800j47006a2496j1321A48385c74069A3699a42910A10408d01854b6940
$$ y = [-72657, -362338, 65255, 88917, -115281, -82049, -93456, -53439, 138767, -91674, -138272, -265246, -129513, -196489, 151138, -103493, 11445, -304725, -129639, 184676, 9636, -172066, -103568, -34622, -146496, 101030, -343730, -149997, -289922, 55341, 203206, -377970, 228564, -158280, 238554, -38559, -279018, -108583, -202441, 270477, 76150, -50876, 107461, -39101, 144498, 122058, 44226, 148778, 59815, 83072, -189418, 195111, -182686, -287716, 252103, -198191, 146322, 168349, 199939, -205865, 44117, 93922, 28982, -117134, -192755, -287042, -41329, 280244, -179247, -70594, -200295, -151399, 110964, -18347, -22706, 65129, -4696, -276445, -151800, -298806, -12496, -23817, 148385, -374069, 13699, -142910, 110408, -401854, -26940]
9944C1497F509a07881l14456a26572m5051L3912I6701a45912C47992D6627A3721
9932d7406J6528A63738b7209j01316d6488A3142h1602A27545a34113H352J12522
9921A20874a65868K773k81725a20955A11302b28236J08021L79o8554m2281c0946
9909b0905A5115a8827j29162j74768J55357A81732b28873f6141q5129G292L3299
9898D0591E224b79980a07947j7309L6407j6918o6362C7302N384c66140R2660J33049
9886a40431O4059Q131k27053O6052A629c80819D402P1631j5034a56288o9194B64984
9873A25943k3624J2755d52256A41051a93246e2367k37243b6060F3332J69850E2274
9861b09912j18378a15336c5760j28921O0183k97096M9383A3166C672b59313B13125
$$ y = [31497, 6509, -107881, -422337, -126572, -171623, -137711, 96701, -145912, 347992, 46627, 13721, -47406, -30878, 163738, -27209, -128525, -46488, 13142, -81602, 127545, -134113, 8352, 120874, -165868, -163095, -444820, -120955, 111302, -228236, -120215, -119836, -188390, -230671, -30946, -20905, 15115, -18827, -147989, -322757, -167400, 181732, -228873, -66141, -151270, 7292, 40591, 5224, -279980, -107947, -125256, -88849, -105767, -172129, 37302, 42686, -366140, -273480, -140431, -76372, -68241, -295294, -229242, 1629, -380819, 4402, 76033, 60999, -156288, -225482, 264984, 125943, 102319, 115074, -452256, 141051, -193246, -52367, -289610, -26060, 63332, 233182, 52274, -209912, -328290, -115336, -35760, -164681, -104498, -401594, -352211, 13166, 3672, -259313, 213125]
9849a87412A34710c80760a74615f3020j79915a19647b146j78380a5989D1995R9539
9838A41534b39203m0019j92598a70509Q2407A1869f4534O4k5736j44480I4964
9826a60464g4563a776j24112d4924B8787a29000A07047l4712j3495L3143b30543
9814a0785A78419f4910q1254j17488P7754d6569C730P970J7467J00366a1807A037
9801b9278A47327J06987E6231N9973c8781G0264Q2359b8259A4709a784k51769
9790b53553P693A07599k6444b49459k69663F7964b15976B8283O5572A3359b74894
9778a69393K1168d3909j30643J48q2576B3272i1553j67256h8173k74931a48499
9766B84315b30920F7925j2755g7136k04724b5155H6642a80258C12577b59121J15021
$$ y = [-187412, 134710, -380760, -174615, -63020, -242935, -119647, -2146, -180526, -15989, 41995, 141534, -239203, -279222, -471820, -170509, -88102, 11869, -64534, -64470, -90206, -234686, 94964, -160464, -74563, -1776, -125888, -44924, 28787, -129000, 107047, 72335, 58840, 91983, -230543, -10785, 178419, -64910, -146164, -263652, -185898, -46569, 3730, 11700, 29167, 129533, -11807, 1037, -29278, 147327, 254314, 56231, 116204, -38781, 70264, 152623, -28259, 14709, -1784, -253553, -245860, 107599, 81155, -249459, -519122, 67964, -215976, 28283, 93855, 13359, -274894, -169393, -148225, -43909, -174552, -174404, -256980, 23272, -91553, -258809, -88173, -363104, -148499, 284315, -230920, 67925, 55170, -77136, -281860, -25155, 86642, -180258, 312577, -259121, -144100]
9755a44100g1640B00148b10298A00400A3614f8088j01535c6542n6816d0094k58002
9744b98096i7810D0486g4669q2343d9047B19746a25594j33009b797A38868J57431
9733B96299C1185a33330p7520j44884J69107j56306a16852M9859P49D25730H9108
9721b4458k34228n5064c5478r1853O0192o1437O1945r4537e1604l41294J18799
9710b74099A66358H0794B4531b79773r567C32471b39552J16794M6128A34528b53661
9698a61438M5844a8599q3475C01216E4747P0656a72693M2476f0604p4338j5389
9687a50331m1864j63533g0587B18642e07324G0759a28749J7361L7525q3110d3372
9675A1120b07979Q7834l85180a4487j62012A5937c6049l98625a79068E786O652
$$ y = [-144100, -71640, 200148, -210298, 100400, 13614, -68088, -169623, -36542, -93358, -40094, -298096, -97810, 40486, -74669, -157012, -49047, 219746, -125594, -258603, -2797, 138868, 296299, 31185, -133330, -210850, -355734, -186627, -342933, -116852, -66993, -66244, 425730, 89108, -24458, -258686, -313750, -35478, -127331, -67139, -128576, -66631, -161168, -51604, -392898, -274099, 166358, 80794, 24531, -279773, -289340, 332471, -239552, -122758, -76630, 134528, -253661, -161438, -115594, -18599, -102074, 301216, 54747, 125403, -172693, -130217, -60604, -134942, -150331, -192195, -355728, -70587, 218642, -507324, 70759, -128749, -111388, -73863, -156973, -43372, 11120, -207979, -120145, -505325, -14487, -176499, 15937, -36049, -434674, -179068, 5786, 12438]
9664A2438a52225b2287j52906n5586R392C60250a51930A54417m6154b71614J26415
9653a45199M548M8637G7251i3969I3638K32482g2039j19122I2716a74577q1935
9642b56512F9024N8981O5671b89264M5097J2655a7724k95284A29828a8845o0774
9631g9619n0965o7690A27969b62414e0748p7470k12302A04315a45487K9009J0816
9620a05662a5050j6829k80240a09363A51742b4207A0517O0918k9467b64661C58748
9608b014q9397A53381b33334h1815A2215a61295k9514A87000b024A29842a34586
9596a0518j40300F5882i4491A16636a12455l0582f7927j71757C27219A03935a88911
9584a83149j07553L5128B0728c78627b5989R874l01258e3647o2444B8219a39636
$$ y = [12438, -152225, -22287, -175193, -230779, -221387, 360250, -151930, 154417, 108263, -271614, -145199, -140651, -92014, 77251, -93969, 93638, 326120, -72039, -191161, 92716, -174577, -256512, 69024, 128005, 193676, -289264, -244167, -231512, -17724, -313008, 129828, -18845, -79619, -130584, -198274, 127969, -262414, -50748, -128218, -340520, 104315, -145487, -116478, -105662, -15050, -31879, -312119, -109363, 151742, -24207, 10517, 71435, 41968, -264661, 358748, -2014, -91411, 153381, -233334, -81815, 12215, -161295, -190809, 187000, -2024, 129842, -134586, -10518, -150818, 65882, -94491, 116636, -112455, -143037, -67927, -239684, 327219, 103935, -188911, -183149, -290702, -255574, 20728, -378627, -25989, -16115, -317373, -53647, -116091, 28219, -139636]
9572a83095N0104B06536Q342H5271a6500H3175b7138F8530i5186A7609a08930
9560b52377O0737R4778a3051A9919a39241J6554a3860B6555d9372D3680c11226
9548i4139k13399A15417l3643a32936d0121d403j81300A3819e1457E506R7742
9537A03248C5677a51661k17321A54232M6988a48243d7765k2095J4660k03566J0239
9526b48527C3235c54789J34243a3703k9922l02390A75818b69428k60254A55945
9515c86065e8002A17255D5462h8936j15155p6515J30104M4491q2j23603A4214
9503B73993c39052J30164j03704A6233L480J51743a8832r7520L0516a4032q2943
9492i6975j6077C3102i8106E093J77599c21455A41008c07201d5956j0372A8623
$$ y = [-183095, -132991, 206536, 214878, 85271, -16500, 83175, -27138, 68530, -95186, 17609, -108930, -252377, -191640, -96862, -13051, 19919, -139241, -122687, -13860, 26555, -49372, 43680, -311226, -94139, -307538, 115417, 81774, -132936, -40121, -4403, -185703, 13819, -51457, 5506, 103248, 35677, -151661, -368982, 154232, 201220, -148243, -47765, -69860, -55200, -258766, -248527, 33235, -354789, -220546, -13703, -43625, -346015, 175818, -269428, -529682, 155945, -386065, -58002, 117255, 45462, -88936, -204091, -280606, -150502, -106011, -106093, -229696, 14214, 273993, -339052, -208888, -312592, 16233, 19713, 171456, -18832, -116352, -85836, -14032, -96975, -113052, 33102, -98106, 5093, 182692, -321455, 141008, -307201, -45956, -56328, 18623]
9480a35804a3404l892p843d983r0004q827B13792c5673A22455a1834j24163A69117
9467f8342k41955A08047a65555j15823B4860e4095A23659b59619p1612A30701
9456c95697P6586a2968a22k53194j3237q5616a47264C0284i0064k03437e4365
9444h1512g789D7369c0572q6274K6253m617d6142E3484m858a58682A40218i6745
9431d46746d1273p3210C18568C2083a20023j11177m2246J19495m4880E7226D469
9419c49981c8544l29521f4862j54189E0273b73580f6892k15915l7988c5384n15311
9408e50695c1896k27061F8892O2868e5963j97005J23000K3922C46531B4449L96543
9397D20992b16636a2417q1170g069D8524j2734i9769j68862f3486B20106a90336
$$ y = [-135804, -13404, -17296, -25139, -4983, -94987, -103814, 213792, -35673, 122455, -11834, -135997, 169117, -68342, -310297, 108047, -165555, -281378, 24860, -54095, 123659, -259619, -331231, 130701, -395697, -319111, -12968, -122, -253316, -266553, -352169, -147264, 30284, -90064, -293501, -54365, -81512, -7789, 47369, -30572, -116846, -90593, -95210, -46142, 53484, 48626, -158682, 140218, -96745, -446746, -41273, -114483, 318568, 32083, -120023, -231200, -273446, -153951, -198831, 57226, 4469, -349981, -38544, -368065, -64862, -219051, 50273, -273580, -66892, -282807, -320795, -35384, -550695, -31896, -258957, 68892, 131760, -55963, -252968, -129968, -106046, 346531, 24449, 420992, -216636, -12417, -93587, -7069, 48524, 35790, -99769, -268631, -63486, 220106, -190336]
9385c41975a16505A32085N1590n6872a37069b7533j89659P1191A24161b71433
9374B3720a07715N320k18874H0035a5861B8203K5553d15335E8778a18469K4307
9363i4162P638k03153A61778p129C1861C399d5394G1099A5139e11419I4168m1996
9351E2172a99508A61488b1190k17246d7062D2318h1665k08597J30037H7110a06048
9339b3862E6126K59635E539K96553d80325C1294h7742A18807J47993a07671k13229
9328c20900A76135L9936G4330c8707j87956k8300M7479R1004n0014e3239G61a2017
9315C9871Q4396a49208N0367k02409g4712I954a11242r9013A0801J19808a49597
9303a16292m3165B28436a43268B8105b7080m56956B512J49185J1206b65701f453
$$ y = [-341975, -116505, 132085, 183675, 126803, -137069, -27533, -217192, -146001, 124161, -271433, 23720, -107715, -102395, -321269, 80035, -15861, 28203, 53756, -415335, 58778, -118469, -94162, -86524, -289677, 161778, 154649, 31861, 3399, -45394, 71099, 15139, -511419, 94168, 52172, -199508, 161488, -21190, -238436, -47062, 42318, -81665, -290262, -160225, 87110, -106048, -23862, 56126, 315761, 5539, 302092, -480325, 31294, -87742, 118807, 266800, -107671, -320900, 176135, 216071, 74330, -38707, -226663, -254963, -207484, -116480, -166494, -53239, 761, -12017, 39871, 124267, -149208, -98841, -301250, -74712, 9954, -111242, -210255, 10801, 130609, -149597, -116292, -159457, 228436, -143268, 28105, -27080, -484036, 2512, 151697, 162903, -265701, -6453]
9291a31489B0562a37470j46644P6678A65743a14044K0141A63422f4323A48925
9280B22039c7793g23A1738c90354i7136n0137I4714c04606J20841F9308i5021
9268B14499Q3771C4546K06600m7701Q0690r9268n1713c8988B65586i4746A26187
9256a36986M0021J0192F3823b81104J21630F9006b99938g5411B46913a81882A39672
9244a06586A21297J02633l2577a85644j20843J3773G7156j1091b58220B21144
9233g740l37837a22294A69050a9770j95351a8688k06638j21126a15827M8505m53041
9222e20363J28371j23348F0119J76555k5020d95563K18668R4873a8055E9989f9622
9210F4721J46969B5944J24113c1191j23974e6029n8327a8212k1291l62037J99073
$$ y = [-131489, 20562, -137470, -284114, -207436, 165743, -114044, -93903, 163422, -64323, 148925, 222039, -37793, -723, 11738, -390354, -97136, -147273, 94714, -304606, -183765, 69308, -95021, 214499, 298270, 34546, 241146, 193445, 274135, 174867, 123154, -38988, 265586, -94746, 126187, -136986, -96965, -86773, 63823, -281104, -159474, 69006, -299938, -75411, 246913, -181882, 139672, -106586, 121297, 223930, 191353, -185644, -306487, -292714, 77156, 66065, -258220, 221144, -7740, -345577, -122294, 169050, -19770, -215121, -18688, -225326, -346452, -115827, -67322, -520363, -391992, -515340, 60119, 236674, 211654, -495563, -276895, -182022, -18055, 59989, -69622, 64721, 211690, 25944, 150057, -31191, -155165, -56029, -114356, -18212, -39503, -401540, -202467]
9199b02467Q9347a1960A30000l6862J22790a25837k70766e9815A22618a51631
9188A30341a08283k77276b7701k3549k45429j72046a5537E1456c10793a05535
9177g902b470q9719I9690l390a59486F6298c86095A14210c15855F8186a49876
9165f5230E664a34241e9844B38460d32892d255D01100b8023j09968N8844k26253
9154c05400O9014J02933c5753C9897d06879B31652b34192P8802F3466J21126c39407
9142c1346o5101a4852B10030h09m5704A8478c28654a24222e2532C0990a63903
9130b11637j9460q4039a31877c8280r4960K6713M8465q7746C25786C9673i1299
9118A57159c8585k58929b0175j1897A87527a76017B21930i2955k28762B03754
$$ y = [-202467, -113120, -11960, 130000, 93138, 215928, -125837, -396603, -59815, 122618, -151631, 130341, -108283, -385559, -27701, -51250, -296679, -468725, -15537, 51456, -310793, -105535, -7902, -2470, -92189, 99690, 96300, -159486, 66298, -386095, 114210, -315855, 68186, -149876, -65230, 5664, -134241, -59844, 238460, -432892, -4255, 401100, -28023, -137991, -79147, -305400, -236386, -133453, -35753, 39897, -406879, 231652, -234192, -155390, 63466, 184592, -339407, -31346, -96447, -14852, 210030, -809, -46513, 18478, -328654, -124222, -52532, 30990, -163903, -211637, -231097, -315136, -131877, -38280, -133240, -106527, -58062, -145808, 325786, 39673, -91299, 157159, -38585, -297514, -20175, -32072, 187527, -176017, 221930, -92955, -321717, 203754]
9107a3588C2796L0360P4490E4113h2101D2873a1977l9C1656a31883H8195c71759
9094D5646b2393j03050o1369c3621A59185o8103a93180j31074b9237K009q7705
9083a14933G1243c1641E15299a51906g4881m0620K9959q2800B361c8000L382j72730
9071b07348e2159b2156B14626a80615K3419L4235A44742B9683g94o4978E2285
9059a7758m4531j14136j57971B53320i2972B49379a02567A31392G76P4723a23046
9047c6382l13610d55G8563g9855p8859b3478j17563E5626O8815D42a64967L2240
9035a32727A06948d36096a60074q151H1751M6984b17656H5327B8228c34524a21041
9023b85851A48050a02338A69394b01387A72622a235k42360A44218a47167A0891
$$ y = [-13588, 32796, 63156, 137646, 54113, -82101, 42873, -11977, -12016, 31656, -131883, 88195, -371759, 45646, -22393, -125443, -186812, -33621, 159185, 91082, -193180, -324254, -29237, -27228, -114933, 71243, -31641, 515299, -151906, -74881, -115501, -85542, -168342, 2361, -38000, -34618, -207348, -52159, -22156, 214626, -180615, -157196, -122961, 144742, 29683, -794, -65772, 52285, -17758, -62289, -176425, -334396, 253320, -92972, 249379, -102567, 131392, 776, 75499, -123046, -36382, -349992, -455, 78563, -79855, -158714, -23478, -141041, 55626, 124441, 442, -164967, -132727, 106948, -436096, -160074, -168225, 81751, 128735, -217656, 85327, 28228, -334524, -121041, -285851, 148050, -102338, 169394, -201387, 172622, -1235, -243595, 144218, -147167, 10891]
9012a82251f8341I3590b21305Q9843M8514A66957J2230D928a45649j30499E8837
9000A23776c14835D0508c51498M7760C1261J28355D8939J2381B8370b26079M6318
8989a79761O6613k81574h0277K95I7617a08615N0232n7958j32349d8249A97260
8977i1047M0988k5343A49737h7835E0544j367f2891o3736j11515E3764a65233
8965D5983J55017a86372K8562A33195J09558D0954J74874b41988D2662h2417j51644
8954b34061A38240K6006K9806k3876i9536H838a4814k105l23p1743b5777j59835
8942a85612o8944F0956a71683B0474a45062G6975b9540A36531n815P0763K66530
8931D68009J27952k70900a96064i6128H9482d6784l17814g579D69532N9024P76870
$$ y = [-182251, -68341, 93590, -221305, -131462, -82948, 166957, 179187, 4928, -145649, -276148, 58837, 123776, -314835, 40508, -351498, -303738, 31261, 159616, 48939, 61320, 28370, -226079, -179761, -113148, -394722, -80277, -79982, 97617, -108615, -58383, -116341, -248690, -48249, 197260, -91047, -50059, -75402, 149737, -87835, 50544, 49177, -62891, -126627, -238142, 53764, -165233, 45983, 201000, -186372, -157810, 133195, 242753, 40954, 215828, -241988, 42662, -82417, -234061, 138240, 164246, 194052, 170176, -99536, 8838, -14814, -16919, -17242, -88985, -25777, -185612, -254556, 60956, -171683, 20474, -145062, 76975, -29540, 136531, 130716, 201479, 468009, 595961, 325061, -196064, -96128, 89482, -46784, -364598, -7579, 469532, 528556, 1305426]
8920A305426K203750Q060150j685968C705583A186009n22354l2402H5018j0899
8911G4119k3608P5984n4280a2540A62718Q6740K0364L194H7729a4753k0754H216
8898H4595A642P2924P8260D0072a25999e0934j23363D1850r81a48488D7363K3515
8886G0878A1509a36255H2563d32264i7640L3056m9926j26239B0239c3000A28847
8874F5429a3605B84629c61101g1973A24148b3572k03853C16270a66722j0387g3139
8862f7875B70103c08271I0093G468L3339A8620J62034b46060H3312l4759f5397
$$ y = [1305426, 3509176, 11569326, 9883358, 3705583, 1186009, 663655, 631253, 85018, 74119, 50511, 126495, 72215, -12540, 162718, 249458, 269822, 273016, 87729, -14753, -35507, 8216, 84595, 1642, 74566, 152826, 40072, -125999, -50934, -174297, 41850, 40869, -148488, 47363, 70878, 11509, -136255, 82563, -432264, -97640, -64584, -114510, -240749, 20239, -33000, 128847, 65429, -13605, 284629, -361101, -71973, 124148, -23572, -227425, 316270, -166722, -177109, -73139, -67875, 270103, -308271, 90093, 7468, 40807, 18620, 180654, -246060, 83312, 48553, -65397]
$$ [...]
##END NTUPLES=NMR SPECTRUM
##END=
