
##TITLE=AC1351_CHIRS12169_6647909_QA816MgoxS
##JCAMPDX= 6.0         $$ Bruker NMR JCAMP-DX V2.0
##DATA TYPE= NMR SPECTRUM
##DATA CLASS= NTUPLES
##ORIGIN= BRUKER
##OWNER= Administrator
$$ 1.72 TOPSPIN		Version 2.1
$$ 2012-08-09 17:07:27.906 -0500  Administrator@TOPSPIN
$$ Compression mode = diff/dup
##.OBSERVE FREQUENCY= 400.02188249412
##.OBSERVE NUCLEUS= ^1H
##.ACQUISITION MODE= SIMULTANEOUS (DQD)
##.ACQUISITION SCHEME= undefined
##.AVERAGES= 64
##.DIGITISER RES= 22
##SPECTROMETER/DATA SYSTEM= spect
##.PULSE SEQUENCE= noesygpps1d.comp
##.SOLVENT NAME= COFFEE_meoh
##.SHIFT REFERENCE= INTERNAL, COFFEE_meoh, 1, 14.96273
##AUDIT TRAIL= $$ (NUMBER, WHEN, WHO, WHERE, PROCESS, VERSION, WHAT)
$$ ##TITLE= Audit trail, TOPSPIN		Version 2.1
$$ ##JCAMPDX= 5.01
$$ ##ORIGIN= Bruker BioSpin GmbH
$$ ##OWNER= Administrator
$$ $$ C:\Bruker\TOPSPIN/data/COFFEE/nmr/AC1351_CHIRS12169_6647909_QA816MgoxS/12/pdata/1/auditp.txt
$$ ##AUDIT TRAIL=  $$ (NUMBER, WHEN, WHO, WHERE, PROCESS, VERSION, WHAT)
(   1,<2012-08-09 17:07:23.171 -0500>,<Administrator>,<TOPSPIN>,<go>,<TOPSPIN 2.1>,
      <created by zg
	started at 2012-08-09 16:55:52.968 -0500,
	POWCHK enabled, PULCHK disabled,
       configuration hash MD5:
       6B 1B 68 BB D9 2E 58 E2 7F 35 AD 54 07 DF 0E 41
       data hash MD5: 64K
       41 09 A5 91 EF B1 23 B5 1C F9 6B D9 D7 B9 8D 9A>)
(   2,<2012-08-09 17:07:26.015 -0500>,<Administrator>,<TOPSPIN>,<proc1d>,<TOPSPIN 2.1>,
      <Start of raw data processing
       efp LB = 0.3 FT_mod = 6 PKNL = 1 PHC0 = 0 PHC1 = 0 SI = 128K 
       data hash MD5: 128K
       FF 50 D7 12 85 E4 92 C1 E6 92 2A EF E3 79 17 9D>)
(   3,<2012-08-09 17:07:27.156 -0500>,<Administrator>,<TOPSPIN>,<proc1d>,<TOPSPIN 2.1>,
      <pk PHC0 = -1.549072 PHC1 = 0 
       data hash MD5: 128K
       B9 18 7A 54 AB D1 AA 87 A4 0D 21 09 DA 1F 8C 62>)
(   4,<2012-08-09 17:07:27.390 -0500>,<Administrator>,<TOPSPIN>,<proc1d>,<TOPSPIN 2.1>,
      <abs ABSG = 1 
       data hash MD5: 128K
       01 22 59 B5 73 A9 E4 34 2A E4 C5 AE F8 93 70 DF>)
(   5,<2012-08-09 17:07:27.468 -0500>,<Administrator>,<TOPSPIN>,<proc1d>,<TOPSPIN 2.1>,
      <abs ABSG = 2 
       data hash MD5: 128K
       ED A5 1F 04 17 D8 E0 AB C7 FE C1 6E 34 98 96 2B>)
(   6,<2012-08-09 17:07:27.578 -0500>,<Administrator>,<TOPSPIN>,<proc1d>,<TOPSPIN 2.1>,
      <abs ABSG = 3 
       data hash MD5: 128K
       B6 66 CF EA 3B 1A 09 A5 AE E0 63 8D FA BA F1 5B>)
(   7,<2012-08-09 17:07:27.750 -0500>,<Administrator>,<TOPSPIN>,<proc1d>,<TOPSPIN 2.1>,
      <abs ABSG = 4 
       data hash MD5: 128K
       74 FE 7E 27 4A 99 F9 FD EE 95 1E 75 62 8B 73 A7>)
(   8,<2012-08-09 17:07:27.812 -0500>,<Administrator>,<TOPSPIN>,<proc1d>,<TOPSPIN 2.1>,
      <abs ABSG = 5 
       data hash MD5: 128K
       FA F5 B6 5A F6 9D C2 C5 75 59 46 0F A4 CD 1E 95>)
$$ ##END=
$$ 
$$ $$ hash MD5
$$ $$ 9C 24 85 3E B8 28 BC D4 AF C8 EF D4 D7 B2 22 CD
##$RELAX= 
##$RELAX= 
##$RELAX= 
##$RELAX= 
##$RELAX= 
##$RELAX= 
##$RELAX= 
##$RELAX= 
$$ Bruker specific parameters
$$ [...]
##$TP07= 0
##$TPNAME0= <>
##$TPNAME1= <>
##$TPNAME2= <>
##$TPNAME3= <>
##$TPNAME4= <>
##$TPNAME5= <>
##$TPNAME6= <>
##$TPNAME7= <>
##$TPOAL= (0..7)
0.5 0.5 0.5 0.5 0.5 0.5 0.5 0.5
##$TPOFFS= (0..7)
0 0 0 0 0 0 0 0
##$TUNHIN= 0
##$TUNHOUT= 0
##$TUNXOUT= 0
##$USERA1= <user>
##$USERA2= <user>
##$USERA3= <user>
##$USERA4= <user>
##$USERA5= <user>
##$V9= 5
##$VALIST= <valist>
##$VCLIST= <CCCCCCCCCCCCCCC>
##$VD= 0
##$VDLIST= <DDDDDDDDDDDDDDD>
##$VPLIST= <PPPPPPPPPPPPPPP>
##$VTLIST= <TTTTTTTTTTTTTTT>
##$WBST= 1024
##$WBSW= 4
##$XGAIN= (0..3)
0 0 0 0
##$XL= 0
##$YL= 0
##$YMAX_a= 16721707
##$YMIN_a= -10133611
##$ZGOPTNS= <>
##$ZL1= 120
##$ZL2= 120
##$ZL3= 120
##$ZL4= 120
##$ABSF1= 14.96273
##$ABSF2= -5.595451
##$ABSG= 5
##$ABSL= 3
##$ALPHA= 0
##$AQORDER= 0
##$ASSFAC= 0
##$ASSFACI= 0
##$ASSFACX= 0
##$ASSWID= 0
##$AUNMP= <proc_prof1d_extract.lims>
##$AXLEFT= 0
##$AXNAME= <>
##$AXNUC= <1H>
##$AXRIGHT= 0
##$AXTYPE= 0
##$AXUNIT= <>
##$AZFE= 0.1
##$AZFW= 0.1
##$BCFW= 0
##$BC_mod= 0
##$BYTORDP= 0
##$COROFFS= 0
##$CY= 15
##$DATMOD= 1
##$DC= 0
##$DFILT= <>
##$DTYPP= 0
##$F1P= 0
##$F2P= 0
##$FCOR= 0.5
##$FTSIZE= 131072
##$FT_mod= 6
##$GAMMA= 0
##$GB= 0
##$INTBC= 1
##$INTSCL= 1
##$ISEN= 128
##$LB= 0.3
##$LEV0= 0
##$LPBIN= 0
##$MAXI= 10000
##$MC2= 0
##$MEAN= 0
##$ME_mod= 0
##$MI= 0
##$NCOEF= 0
##$NC_proc= -2
##$NLEV= 6
##$NOISF1= 0
##$NOISF2= 0
##$NSP= 0
##$NTH_PI= 0
##$NZP= 0
##$OFFSET= 14.96273
##$PC= 1
##$PHC0= -1.549072
##$PHC1= 0
##$PH_mod= 1
##$PKNL= yes
##$PPARMOD= 0
##$PPDIAG= 0
##$PPIPTYP= 0
##$PPMPNUM= 2147483647
##$PPRESOL= 1
##$PSCAL= 4
##$PSIGN= 0
##$PYNMP= <proc.py>
##$REVERSE= no
##$SF= 400.020008945104
##$SI= 131072
##$SIGF1= 0
##$SIGF2= 0
##$SINO= 400
##$SIOLD= 131072
##$SPECTYP= <>
##$SREGLST= <1H.CDCl3>
##$SSB= 0
##$STSI= 131072
##$STSR= 0
##$SW_p= 8223.68421052631
##$SYMM= 0
##$S_DEV= 0
##$TDeff= 65536
##$TDoff= 0
##$TI= <>
##$TILT= no
##$TM1= 0
##$TM2= 0
##$TOPLEV= 0
##$USERP1= <user>
##$USERP2= <user>
##$USERP3= <user>
##$USERP4= <user>
##$USERP5= <user>
##$WDW= 1
##$XDIM= 131072
##$YMAX_p= 414998385
##$YMIN_p= -24196
##$CURPLOT= <Network HP LaserJet P1505>
##$CURPRIN= <$Network HP LaserJet P1505>
##$DFORMAT= <normdp>
##$LAYOUT= <+/1D_H.xwp>
##$LFORMAT= <normlp>
##$PFORMAT= <normpl>
##$SURQMSG= 1
$$ End of Bruker specific parameters
$$ ---------------------------------
##NTUPLES= NMR SPECTRUM
##VAR_NAME=  FREQUENCY,     SPECTRUM/REAL,   SPECTRUM/IMAG
##SYMBOL=    X,             R,               I
##VAR_TYPE=  INDEPENDENT,   DEPENDENT,       DEPENDENT
##VAR_FORM=  AFFN,          ASDF,            ASDF
##VAR_DIM=   131072,        131072,          131072
##UNITS=     HZ,            ARBITRARY UNITS, ARBITRARY UNITS
##FACTOR=    0.0627417313425164, 1,          1
##FIRST=     8223.62146879497, 6023,         -61829
##LAST=      0,             7059,            -61104
##MIN=       0,             -24196,          0
##MAX=       8223.62146879497, 414998385,    0
$$ Real data points
##PAGE= N=1
##DATA TABLE= (X++(R..R)), XYDATA
$$ [...]
$$ plain form
60940 8757483 7703288 6815593 6069104 5442187 4914702 4467095 4082675 3748971 3456252
60931 3456252 3196302 2963087 2753031 2563658 2392624 2238311 2100192 1977826 1869873
60922 1869873 1774279 1688742 1610813 1538205 1469410 1403751 1340896 1280852 1224315 1172213 1124725
60911 1124725 1081275 1041493 1005443 972808 942701 914677 889280 867075 847622 829921 813535
60900 813535 798778 785941 774717 764383 754449 745216 737646 732402 728985 726100 722881 719338 715669
60887 715669 711789 707788 704259 701652 699610 697302 694090 689580 683497 676137 668672 662267 656842 651278
60873 651278 644896 638208 632043 626540 621416 616841 613469 611657 611097 611310 612141 613586 615460 617564 620139
60858 620139 623786 628831 634967 641589 648330 655186 662322 669964 678342 687529 697386 707755 718591 729728
$$ packed form
60940H757483j054195q87695p46489o26917n27485m47607l84420l33704k92719
60931C456252k59950k33215k10056j89373j71034j54313j38119j22366j07953
60922A869873r5594q5537p7929p2608o8795o5659o2855o0044n6537n2102m7488
60911A124725m3450l9782l6050l2635l0107k8024k5397k2205j9453j7701j6386
60900H13535j4757j2837j1224j0334r934r233p570n244l417k885l219l543l669
60887G15669l880m001l529k607k042k308l212m510o083p360p465o405n425n564
60873F51278o382o688o165n503n124m575l372j812n60K13Q31J445J874K104K575
60858F20139L647N045O136O622O741O856P136P642Q378R187R857J0369J0836J1137
$$ plain form
60844 729728 740699 751103 761066 771031 781068 790648 799080 805957 811206 815015 817719 819443 819805 818287
60830 818287 815019 810930 807074 804028 801894 800391 798767 796049 791756 786233 780194 774190 768613 763754
60816 763754 759550 755550 751400 747130 742832 738427 733992 729892 726291 722934 719794 717505 716623 716848 717579
60801 717579 718962 721685 725863 730779 735716 740543 745516 751060 757729 765807 774893 784335 794048 804351
60787 804351 815081 825561 835513 845309 855157 864749 873932 882977 891708 899078 904237 907552 909996 911909
60773 911909 912960 913036 912473 911541 910328 909108 908296 907857 907162 905625 903283 900650 898159 895804 893247 890240
60757 890240 886929 883660 880474 877043 873151 869023 865009 861221 857730 854864 852922 851702 850613 849292
60743 849292 847845 846492 845196 843762 842154 840589 839287 838170 836959 835628 834640 834456 834894 835306 835370 835388
$$ packed form
60844G29728J0971J0404R963R965J0037R580Q432O877N249L809K704J724L62j518
60830H18287l268m089l856l046k134j503j624k718m293n523o039o004n577m859
60816G63754m204m000m150m270m298m405m435m100l601l357l140k289q82K25P31
60801G17579J383K723M178M916M937M827M973N544O669Q078R086R442R713J0303
60787H04351J0730J0480R952R796R848R592R183R045Q731P370N159L315K444J913
60773I11909J051P6n63r32j213j220q12m39o95j537k342k633k491k355k557l007
60757H90240l311l269l186l431l892m128m014l788l491k866j942j220j089j321
60743H49292j447j353j296j434j608j565j302j117j211j331r88j84M38M12O4J8
$$ plain form
60727 835388 835706 836213 836638 837007 837508 838098 838479 838332 837427 835708 833405 830856 828043 824556 820237 815539
60711 815539 810973 806404 801235 795207 788679 782131 775608 768668 760852 752245 743544 735386 727645 719725
60697 719725 711515 703586 696353 689600 683101 677175 672191 667962 664102 660591 657432 654087 649983 645496
60683 645496 641779 639473 638016 636318 633838 630935 628437 626925 626372 626511 627450 629533 632474 635261 637377
60668 637377 639650 643293 648426 654196 660044 666043 672063 677486 681933 685662 689019 692085 695095 698687
60654 698687 703365 708995 715021 721024 727010 733428 740930 749763 759321 768598 777078 784844 791874 797819
60640 797819 802665 807152 812157 817874 823847 829601 835022 840244 845321 850085 854353 858239 861966 865196
60626 865196 866932 866545 864691 862570 860369 857091 851951 845224 837535 829026 819739 810284 801511 793679
$$ packed form
60727H35388L18N07M25L69N01N90L81j47r05j719k303k549k813l487m319m698
60711H15539m566m569n169o028o528o548o523o940p816q607q701q158p741p920
60697G19725q210p929p233o753o499n926m984m229l860l511l159l345m104m487
60683F45496l717k306j457j698k480k903k498j512n53J39R39K083K941K787K116
60668F37377K273L643N133N770N848N999O020N423M447L729L357L066L010L592
60654F98687M678N630O026O003N986O418P502Q833R558R277Q480P766P030N945
60640G97819M846M487N005N717N973N754N421N222N077M764M268L886L727L230
60626H65196J736l87j854k121k201l278n140o727p689q509r287r455q773p832
$$ plain form
60612 793679 786362 779114 771969 765421 760230 757104 756301 757514 760275 764426 770102 777397 786128 795830
60598 795830 805787 815177 823352 830017 835191 838959 841273 841943 840963 838969 837206 836793 838002 840353 843292
60583 843292 846630 850429 854669 858975 862505 864351 864283 862956 861162 859111 856703 854178 851960 850009 847824
60568 847824 844962 841124 835892 829019 820943 812440 803720 794451 784668 775030 766036 757616 749732 742768
60554 742768 736985 732091 727761 724201 721823 720615 720168 720147 720528 721598 723857 727669 732892 739101 746195
60539 746195 754493 764259 775681 789516 807213 830042 858413 892242 931442 975570 1023259 1072383
60527 1072383 1120631 1165643 1204816 1235479 1255390 1263198 1258796 1243599 1220325 1192223 1162385 1133512
60515 1133512 1107781 1086581 1070512 1059745 1054148 1052889 1054270 1056393 1058162 1059657 1061626 1064690 1068986
$$ packed form
60612G93679p317p248p145o548n191l126q03J213K761M151N676P295Q731R702
60598G95830R957R390Q175O665N174L768K314O70r80j994j763m13J209K351K939
60583H43292L338L799M240M306L530J846o8j327j794k051k408k525k218j951k185
60568H47824k862l838n232o873q076q503q720r269r783r638q994q420p884o964
60554G42768n783m894m330l560k378j208m47k1L81J070K259L812N223O209P094
60539G46195Q298R766J1422J3835J7697K2829K8371L3829L9200M4128M7689M9124
60527A072383M8248M5012L9173L0663J9911P808m402j5197k3274k8102k9838k8873
60515A133512k5731k1200j6069j0767n597j259J381K123J769J495J969L064M296
$$ plain form
60502 1068986 1074444 1081142 1089040 1097532 1106095 1115773 1129331 1149166 1175500 1207432 1245214 1290311
60490 1290311 1343404 1403762 1470758 1544600 1624966 1710154 1798623 1890839 1989044 2096037 2215104
60479 2215104 2350761 2508688 2694859 2914629 3171542 3465661 3792412 4142436 4501347
60470 4501347 4849128 5161269 5412865 5583467 5659794 5636376 5515903 5309271 5034055 4711447
60460 4711447 4362836 4006862 3657566 3324554 3014592 2732412 2479938 2256053 2058332
60451 2058332 1884766 1733461 1601774 1486980 1387296 1301185 1226275 1160201 1102169 1052301
60441 1052301 1009595 971872 937712 907051 879656 854417 830579 808461 788327 769579 751752
60430 751752 735366 721016 708281 696346 685129 675024 665953 657443 649388 642076 635635 630056 625631
$$ packed form
60502A068986N458O698P898Q492Q563R678J3558J9835K6334L1932L7782M5097
60490A290311N3093O0358O6996P3842Q0366Q5188Q8469R2216R8205J06993J19067
60479B215104J35657J57927J86171K19770K56913K94119L26751L50024L58911
60470D501347L47781L12141K51596J70602P6327k3418j20473k06632k75216l22608
60460D711447l48611l55974l49296l33012l09962k82180k52474k23885j97721
60451B058332j73566j51305j31687j14794r9684q6111p4910o6074n8032m9868
60441A052301m2706l7723l4160l0661k7395k5239k3838k2118k0134j8748j7827
60430G51752j6386j4350j2735j1935j1217j0105r071q510q055p312o441n579m425
$$ plain form
60417 625631 622781 621423 620935 620717 620464 619972 619133 618199 617704 617951 618795 619989 621571 623705 626280 628883
60401 628883 631247 633599 636430 639927 643795 647686 651622 655896 660666 665808 671011 675850 679848 682730
60387 682730 684609 685805 686512 686678 686043 684216 680983 676844 673001 670426 668939 667513 665462 663003 660681
60372 660681 658682 656932 655563 654913 655063 655611 656042 656239 656490 657046 657931 659278 661447 664397 667220 668931
60356 668931 669707 670762 672909 675921 679446 683760 689084 694839 700283 705495 711073 717159 723377 729509
60342 729509 735573 741438 746956 752415 758281 764526 770722 776736 782701 788315 792694 795204 796160 796617 797652
60327 797652 799741 802600 805705 809096 813360 818675 824343 829668 834762 839805 843914 845638 844445 841081
60313 841081 836557 831520 826467 821726 817047 811936 806540 801648 797720 794499 791674 789284 787331 785606
$$ packed form
60417F25631k850j358m88k18k53m92q39r34m95K47Q44J194J582K134K575K603
60401F28883K364K352K831L497L868L891L936M274M770N142N203M839L998K882
60387F82730J879J196P07J66o35j827l233m139l843k575j487j426k051k459k322
60372F60681j999j750j369o50J50N48M31J97K51N56Q85J347K169K950K823J711
60356F68931P76J055K147L012L525M314N324N755N444N212N578O086O218O132
60342G29509O064N865N518N459N866O245O196O014N965N614M379K510R56M57J035
60327G97652K089K859L105L391M264N315N668N325N094N043M109J724j193l364
60313H41081m524n037n053m741m679n111n396m892l928l221k825k390j953j725
$$ plain form
60299 785606 784151 783398 783682 785018 787411 790882 795103 799563 804225 809462 815252 820999 826265 831070 835318
60284 835318 838568 840692 842221 843735 845379 847153 849172 851359 853450 855572 858345 862133 866671 871697
60270 871697 877390 883931 891195 899254 908573 919281 930860 943069 956601 972184 989580 1008320
60258 1008320 1029036 1053047 1080647 1110758 1142623 1177113 1215836 1259423 1307311 1359125 1415682
60247 1415682 1478382 1548023 1624591 1708058 1798713 1896538 2000811 2110759 2226196 2346840
60237 2346840 2471200 2596807 2721508 2843810 2961906 3073153 3174902 3265348 3343303 3407743
60227 3407743 3458028 3494104 3516030 3523577 3516820 3496948 3466139 3426777 3381029 3331035 3279126 3227892
60215 3227892 3180099 3138338 3104469 3079443 3063802 3058331 3064236 3082899 3115379 3161969 3222263 3295843
$$ packed form
60299G85606j455p53K84J336K393L471M221M460M662N237N790N747N266M805M248
60284H35318L250K124J529J514J644J774K019K187K091K122K773L788M538N026
60270H71697N693O541P264Q059R319J0708J1579J2209J3532J5583J7396J8740
60258A008320K0716K4011K7600L0111L1865L4490L8723M3587M7888N1814N6557
60247A415682O2700O9641P6568Q3467R0655R7825J04273J09948J15437J20644
60237B346840J24360J25607J24701J22302J18096J11247J01749R0446P7955O4440
60227C407743N0285L6076K1926P547o757j9872l0809l9362m5748m9994n1909n1234
60215C227892m7793m1761l3869k5026j5641n471N905J8663L2480M6590O0294P3580
$$ plain form
60203 3295843 3382710 3482570 3593818 3713769 3839848 3969943 4101515 4231094 4354954 4469735
60193 4469735 4572304 4659832 4730526 4783663 4818420 4833213 4826800 4799587 4753305 4689913 4611531
60182 4611531 4521093 4422215 4318466 4213331 4110638 4014159 3926610 3849518 3784183 3732288 3695477
60171 3695477 3674827 3670930 3684145 3714495 3761451 3823917 3900191 3987788 4083315 4182630 4281297
60160 4281297 4375203 4461016 4536159 4598464 4646191 4678528 4695794 4698938 4689144 4668245 4639284 4606153
60148 4606153 4572656 4542105 4517626 4502222 4498280 4507194 4529666 4566195 4617205 4682980 4763898 4860994
60136 4860994 4976202 5111867 5269976 5451993 5659311 5893488 6155667 6445873 6762997
60127 6762997 7105110 7469303 7851362 8246113 8648101 9051430 9448960 9832290 10192968
$$ packed form
60203C295843Q6867R9860J11248J19951J26079J30095J31572J29579J23860J14781
60193D469735J02569Q7528P0694N3137L4757J4793o413k7213m6282o3392p8382
60182D611531r0438r8878j03749j05135j02693r6479q7549p7092o5335n1895l6811
60171C695477k0650l897J3215L0350M6956O2466P6274Q7597R5527R9315R8667
60160D281297R3906Q5813P5143O2305M7727L2337J7266L144r794k0899k8961l3131
60148D606153l3497l0551k4479j5404l942Q914K2472L6529N1010O5775Q0918R7096
60136D860994J15208J35665J58109J82017K07318K34177K62179K90206L17124
60127F762997L42113L64193L82059L94751M01988M03329L97530L83330L60678
$$ plain form
60118 10192968 10523551 10817617 11069437 11274024 11427179 11525247 11565303 11546063 11468440 11334973
60108 11334973 11149032 10914936 10638644 10327996 9992399 9642309 9288368 8940170 8605440
60099 8605440 8290381 8000530 7740966 7515703 7327112 7175975 7062141 6985207 6944569 6938674
60089 6938674 6964349 7017207 7092695 7186435 7293594 7408536 7525358 7638434 7742388 7832088
60079 7832088 7903066 7951789 7975557 7972761 7943517 7889410 7812156 7712825 7592619 7453759 7298966
60068 7298966 7130529 6950608 6762245 6569320 6375430 6183298 5995330 5814274 5643054
60059 5643054 5484125 5339046 5208640 5093565 4994824 4913675 4851141 4807866 4784436 4781497 4799423
60048 4799423 4838121 4897202 4975828 5072256 5183814 5307399 5439493 5575625 5710545 5839321
$$ packed form
60118A0192968L30583K94066K51820K04587J53155R8068M0056j9240p7623j33467
60108A1334973j85941k34096k76292l10648l35597l50090l53941l48198l34730
60099H605440l15059k89851k59564k25263j88591j51137j13834p6934m0638n895
60089F938674K5675N2858P5488R3740J07159J14942J16822J13076J03954Q9700
60079G832088P0978M8723K3768k796k9244n4107p7254r9331j20206j38860j54793
60068G298966j68437j79921j88363j92925j93890j92132j87968j81056j71220
60059E643054j58929j45079j30406j15075r8741q1149o2534m3275k3430k939J7926
60048D799423L8698N9081P8626R6428J11558J23585J32094J36132J34920J28776
$$ plain form
60038 5839321 5957802 6061882 6147271 6210669 6250550 6266061 6255679 6217888 6152911 6063075 5951702
60027 5951702 5822443 5679494 5527458 5370649 5212939 5058177 4910141 4771900 4645618
60018 4645618 4533010 4435543 4354172 4289321 4241294 4210534 4197593 4203182 4228108 4272866 4337427
60007 4337427 4421790 4526449 4651813 4797192 4960702 5139854 5331524 5531350 5733729 5932574
59997 5932574 6121838 6295623 6448682 6577200 6678760 6751459 6793465 6803527 6781505 6728331
59987 6728331 6645976 6537774 6408450 6263516 6108667 5949657 5792218 5641574 5501907 5376259
59977 5376259 5266856 5175492 5103724 5052792 5023332 5015280 5028005 5060334 5110239 5174808 5250981
59966 5250981 5336446 5429712 5529376 5633524 5739775 5845738 5949313 6048515 6141051 6224381
$$ packed form
60038E839321J18481J04080Q5389O3398L9881J5511j0382l7791o4977q9836j11373
60027E951702j29259j42949j52036j56809j57710j54762j48036j38241j26282
60018D645618j12608r7467q1371o4851m8027l0760j2941N589K4926M4758O4561
60007D337427Q4363J04659J25364J45379J63510J79152J91670J99826K02379J98845
59997E932574J89264J73785J53059J28518J01560P2699M2006J0062k2022n3174
59987F728331q2355j08202j29324j44934j54849j59010j57439j50644j39667j25648
59977E376259j09403r1364p1768n0932k9460q052J2725L2329M9905O4569P6173
59966E250981Q5465R3266R9664J04148J06251J05963J03575R9202R2536Q3330
$$ plain form
59956 6224381 6296616 6357280 6406662 6444479 6469974 6483633 6488001 6486159 6480027 6471027 6462033 6457742
59944 6457742 6463167 6482609 6520083 6579842 6666028 6782284 6932016 7118595 7344843 7612333
59934 7612333 7921293 8270998 8659839 9084633 9539554 10015629 10501305 10983301 11446640
59925 11446640 11874346 12248440 12552363 12772920 12900773 12930820 12863360 12704479 12464428 12155604
59915 12155604 11791996 11389076 10962243 10524857 10088146 9662436 9257172 8879596 8534392
59906 8534392 8224899 7953935 7723243 7533040 7382723 7271786 7199907 7166568 7170871 7211504
59896 7211504 7286806 7394969 7533878 7700245 7888919 8093276 8305905 8518288 8720218 8900508
59886 8900508 9048561 9154991 9211428 9211184 9150865 9031070 8855635 8630786 8364815 8067286
$$ packed form
59956F224381P2235O0664M9382L7817K5495J3659M368j842o132r000q994m291
59944F457742N425J9442L7474N9759Q6186J16256J49732J86579K26248K67490
59934G612333L08960L49705L88841M24794M54921M76075M85676M81996M63339
59925A1446640M27706L74094L03923K20557J27853L0047o7460j58881k40051l08824
59915A2155604l63608m02920m26833m37386m36711m25710m05264l77576l45204
59906H534392l09493k70964k30692j90203j50317j10937p1879l3339M303M0633
59896G211504P5302J08163J38909J66367J88674K04357K12629K12383K01930J80290
59886H900508J48053J06430N6437k44o0319j19795j75435k24849k65971k97529
$$ plain form
59876 8067286 7747694 7414834 7077092 6742351 6417218 6106824 5815354 5546008 5300273
59867 5300273 5078063 4878911 4702450 4547611 4412257 4294020 4190799 4100008 4018110 3941550
59857 3941550 3867848 3795597 3724185 3654085 3586759 3523538 3464904 3411258 3363807 3324011 3292416
59846 3292416 3268552 3251496 3239849 3231332 3223095 3212533 3197567 3176458 3147929 3111536 3067810 3018211
59834 3018211 2965156 2911537 2859603 2810401 2764548 2723221 2687829 2658992 2636482 2620169 2610496
59823 2610496 2608055 2613209 2626308 2647860 2678206 2717236 2764512 2819444 2881132 2948167 3018779 3091265
59811 3091265 3164364 3237272 3309330 3379580 3446529 3508220 3562419 3606855 3639672 3660040 3668596
59800 3668596 3667342 3659156 3647248 3634808 3624881 3620276 3623368 3635871 3658942 3693643 3741348 3803775
$$ packed form
59876H067286l19592l32860l37742l34741l25133l10394k91470k69346k45735
59867E300273k22210j99152j76461j54839j35354j18237j03221r0791q1898p6560
59857C941550p3702p2251p1412p0100o7326o3221n8634n3646m7451l9796l1595
59846C292416k3864j7056j1647q517q237j0562j4966k1109k8529l6393m3726m9599
59834C018211n3055n3619n1934m9202m5853m1327l5392k8837k2510j6313r673
59823B610496k441N154J3099K1552L0346L9030M7276N4932O1688O7035P0612P2486
59811C091265P3099P2908P2058P0250O6949O1691N4199M4436L2817K0368Q556
59800C668596j254q186j1908j2440r927m605L092J2503K3071L4701M7705O2427
$$ plain form
59788 3803775 3882913 3981042 4100650 4244257 4414599 4615125 4849931 5122743 5435998 5790612
59778 5790612 6185408 6615096 7067964 7525365 7963229 8354457 8672026 8893407 9005231
59769 9005231 9005756 8904132 8717693 8468569 8179850 7871961 7560748 7257712 6971036 6706191
59759 6706191 6466321 6252854 6066042 5905208 5769003 5655908 5564647 5494374 5444684 5415243
59749 5415243 5405061 5412363 5435769 5475535 5533042 5609035 5702943 5814081 5942944 6091035 6259900
59738 6259900 6450688 6664549 6903240 7169368 7465867 7795028 8158335 8557587 8995692
59729 8995692 9475519 9997965 10561648 11163956 11800995 12466061 13149168 13838702 14523158
59720 14523158 15191307 15832190 16436649 16999490 17520499 18004215 18459298 18897516 19332140
$$ packed form
59788C803775P9138R8129J19608J43607J70342K00526K34806K72812L13255L54614
59778E790612L94796M29688M52868M57401M37864L91228L17569K21381J11824
59769I005231N25j01624j86439k49124k88719l07889l11213l03036k86676k64845
59759F706191k39870k13467j86812j60834j36205j13095r1261p0273m9690k9441
59749E415243j0182P302K3406L9766N7507P5993R3908J11138J28863J48091J68865
59738F259900J90788K13861K38691K66128K96499L29161L63307L99252M38105
59729H995692M79827N22446N63683O02308O37039O65066O83107O89534O84456
59720A4523158O68149O40883O04459N62841N21009M83716M55083M38218M34624
$$ plain form
59711 19332140 19776479 20242958 20742054 21280704 21861052 22480290 23130936 23800894 24473766
59702 24473766 25129930 25747992 26306240 26784497 27166333 27440775 27603108 27655282 27605898 27469079
59692 27469079 27262453 27005686 26719900 26426733 26146669 25897913 25696538 25556766 25490727
59683 25490727 25508571 25619317 25831148 26150622 26582252 27129312 27794106 28576173 29469701
59674 29469701 30462247 31534475 32659372 33801048 34914728 35948671 36847678 37557904
59666 37557904 38032564 38237315 38154031 37782789 37142175 36267237 35204819 34007634 32729103
59657 32729103 31419666 30123840 28877413 27704932 26618274 25616995 24690176 23818598
59649 23818598 22976851 22136885 21274029 20373207 19431437 18455875 17460274 16462138 15479996
$$ packed form
59711A9332140M44339M66479M99096N38650N80348O19238O50646O69958O72872
59702B4473766O56164O18062N58248M78257L81836K74442J62333N2174m9384j36819
59692B7469079k06626k56767k85786k93167k80064k48756k01375j39772o6039
59683B5490727J7844J10746K11831L19474M31630N47060O64794P82067Q93528
59674B9469701R92546J072228J124897J141676J113680J033943Q99007P10226
59666C7557904M74660K04751q3284l71242o40614q74938j062418j197185j278531
59657C2729103j309437j295826j246427j172481j086658j001279r26819q71578
59649B3818598q41747q39966q62856r00822r41770r75562r95601r98136r82142
$$ plain form
59640 15479996 14530248 13625125 12772769 11978186 11243611 10568815 9952079 9391041 8882648
59631 8882648 8423014 8008026 7634007 7297689 6995971 6725892 6484444 6268359 6074760
59622 6074760 5902229 5750509 5618805 5505007 5406764 5322315 5249782 5186554 5130053 5078264
59612 5078264 5028708 4977791 4922265 4860820 4793301 4718912 4636446 4546022 4449474 4349002 4246374
59601 4246374 4143390 4042065 3943958 3849932 3760794 3677673 3601582 3533080 3472525 3420409 3377270
59590 3377270 3343393 3318522 3301760 3291995 3288629 3291658 3300838 3315127 3333185 3354090 3377259 3402119
59578 3402119 3428189 3455087 3482038 3507887 3532134 3555643 3579847 3605734 3634196 3666869 3705749
59567 3705749 3752056 3806188 3868728 3940841 4023544 4117096 4221440 4337124 4465765 4609524
$$ packed form
59640A5479996r49748r05123q52356p94583p34575o74796o16736n61038n08393
59631H882648m59634m14988l74019l36318l01718k70079k41448k16085j93599
59622F074760j72531j51720j31704j13798r8243q4449p2533o3228n6501n1789
59612E078264m9556n0917n5526o1445o7519p4389q2466r0424r6548j00472j02628
59601D246374j02984j01325r8107r4026q9138q3121p6091o8502o0555n2116m3139
59590C377270l3877k4871j6762r765l366L029R180J4289J8058K0905K3169K4860
59578C402119K6070K6898K6951K5849K4247K3509K4204K5887K8462L2673L8880
59567C705749M6307N4132O2540P2113Q2703R3552J04344J15684J28641J43759
$$ plain form
59557 4609524 4769926 4947223 5141219 5352538 5582370 5830927 6096965 6378999 6675816
59548 6675816 6985168 7302980 7624771 7947168 8267060 8580067 8881275 9167350 9436851
59539 9436851 9688557 9920674 10131888 10322255 10492497 10642768 10772430 10881137 10970461 11044881
59529 11044881 11110970 11175265 11242950 11318283 11405025 11505261 11617865 11738515 11860610 11975521
59519 11975521 12072666 12140787 12169772 12151390 12079253 11949366 11760911 11516017 11218911 10875676
59509 10875676 10494320 10084104 9654531 9214889 8773915 8338972 7915765 7509331 7124674
59500 7124674 6765679 6433971 6129759 5853320 5604821 5383261 5186882 5014459 4865213
59491 4865213 4737690 4629904 4540581 4469338 4415742 4379140 4359349 4356540 4370390 4400192 4445829
$$ packed form
59557D609524J60402J77297J93996K11319K29832K48557K66038K82034K96817
59548F675816L09352L17812L21791L22397L19892L13007L01208K86075K69501
59539I436851K51706K32117K11214J90367J70242J50271J29662J08707Q9324P4420
59529A1044881O6089O4295O7685P5333Q6742J00236J12604J20650J22095J14911
59519A1975521R7145O8121K8985j8382p2137j29887j88455k44894k97106l43235
59509A0875676l81356m10216m29573m39642m40974m34943m23207m06434l84657
59500G124674l58995l31708l04212k76439k48499k21560j96379j72423j49246
59491D865213j27523j07786q9323p1243n3596l6602j9791k809J3850K9802M5637
$$ plain form
59480 4445829 4507834 4586626 4682510 4796382 4929522 5082749 5256505 5451402 5667517 5903082
59470 5903082 6154843 6419596 6694148 6973573 7250570 7516841 7764193 7984094 8167338
59461 8167338 8305085 8390271 8418458 8388380 8302036 8163692 7978687 7753493 7496186 7215404
59451 7215404 6918628 6612254 6303073 5998171 5702976 5420406 5152164 4899791 4664230
59442 4664230 4445646 4244377 4061170 3895890 3746852 3612077 3490567 3381962 3285626 3200643
59432 3200643 3126154 3061329 3005522 2958750 2921388 2893042 2872307 2857803 2848847 2844915 2845306 2849745
59420 2849745 2858570 2871810 2888660 2908347 2931063 2957642 2988625 3023905 3062905 3104839 3148885
59409 3148885 3193982 3238183 3278898 3314845 3347854 3381990 3421043 3467579 3523900 3592351 3674431
$$ packed form
59480D445829O2005P8792R5884J13872J33140J53227J73756J94897K16115K35565
59470E903082K51761K64753K74552K79425K76997K66271K47352K19901J83244
59461H167338J37747Q5186K8187l0078q6344j38344j85005k25194k57307k80782
59451G215404k96776l06374l09181l04902k95195k82570k68242k52373k35561
59442D664230k18584k01269j83207j65280j49038j34775j21510j08605r6336q4983
59432C200643p4489o4825n5807m6772l7362k8346k0735j4504q956l932L91M439
59420B849745Q825J3240J6850J9687K2716K6579L0983L5280L9000M1934M4046
59409C148885M5097M4201M0715L5947L3009L4136L9053M6536N6321O8451Q2080
$$ plain form
59398 3674431 3770799 3882249 4009219 4150151 4302134 4464356 4639968 4833915 5050161 5291976
59388 5291976 5563553 5869594 6213563 6597308 7021977 7488110 7994750 8538872 9115198
59379 9115198 9715793 10330033 10945809 11551084 12134629 12686411 13198430 13665443 14084797
59370 14084797 14455956 14780339 15060799 15300325 15501035 15664193 15790294 15878485 15926305 15930555
59360 15930555 15888398 15797733 15657445 15468233 15233357 14958687 14652394 14324398 13984826 13641853
59350 13641853 13300627 12963800 12632131 12304276 11976963 11646374 11309541 10964724 10611316
59341 10611316 10249952 9882433 9511470 9140877 8775745 8421379 8081756 7759621 7457904
59332 7457904 7179741 6926743 6698397 6493645 6312005 6152679 6013829 5893609 5790895
$$ packed form
59398C674431R6368J11450J26970J40932J51983J62222J75612J93947K16246K41815
59388E291976K71577L06041L43969L83745M24669M66133N06640N44122N76326
59379I115198O00595O14240O15776O05275N83545N51782N12019M67013M19354
59370A4084797L71159L24383K80460K39526K00710J63158J26101Q8191M7820M250
59360A5930555m2157r0665j40288j89212k34876k74670l06293l27996l39572l42973
59350A3641853l41226l36827l31669l27855l27313l30589l36833l44817l53408
59341A0611316l61364l67519l70963l70593l65132l54366l39623l22135l01717
59332G457904k78163k52998k28346k04752j81640j59326j38850j20220j02714
$$ plain form
59323 5790895 5704138 5630471 5566982 5512094 5464696 5422679 5383457 5345420 5307753 5269215 5228169
59312 5228169 5183692 5135779 5084682 5030755 4974779 4917709 4860202 4802887 4746783 4692902 4641765
59301 4641765 4593869 4550247 4511976 4479485 4452961 4433136 4421133 4417839 4423939 4440230 4467394 4505777
59289 4505777 4555790 4618084 4692924 4779965 4879217 4991653 5118256 5258934 5412987 5579948
59279 5579948 5759118 5948645 6145866 6348116 6552383 6754408 6948920 7130552 7294100
59270 7294100 7434483 7547532 7630750 7682677 7701822 7686957 7638174 7556827 7444632 7303725
59260 7303725 7137624 6951517 6751504 6543884 6334670 6128789 5929546 5739264 5560244
59251 5560244 5394573 5243237 5106236 4983602 4875760 4783022 4705445 4643413 4597867 4569750
$$ packed form
59323E790895q6757p3667o3489n4888m7398m2017l9222l8037l7667l8538m1046
59312E228169m4477m7913n1097n3927n5976n7070n7507n7315n6104n3881n1137
59301D641765m7896m3622l8271l2491k6524j9825j2003l294O100J6291K7164L8383
59289D505777N0013O2294P4840Q7041R9252J12436J26603J40678J54053J66961
59279E579948J79170J89527J97221K02250K04267K02025J94512J81632J63548
59270G294100J40383J13049Q3218N1927J9145j4865m8783q1347j12195j40907
59260G303725j66101j86107k00013k07620k09214k05881j99243j90282j79020
59251E560244j65671j51336j37001j22634j07842r2738p7577o2032m5546k8117
$$ plain form
59241 4569750 4559565 4567598 4594402 4641017 4708881 4799560 4914523 5055286 5223731 5422020 5652178
59230 5652178 5915893 6214316 6547209 6912041 7304264 7718164 8146325 8577993 8999014
59221 8999014 9394059 9748616 10049059 10282540 10438230 10508655 10489858 10381545 10188004 9918144
59211 9918144 9583737 9197856 8774892 8330181 7877760 7428522 6990942 6572521 6179310
59202 6179310 5814786 5480462 5177113 4904388 4660046 4441208 4246303 4074654 3924532
59193 3924532 3792913 3677115 3575529 3486779 3409294 3341781 3283217 3232370 3188136 3150231 3118670
59182 3118670 3092717 3071346 3054613 3043513 3038352 3038218 3042181 3050185 3062597 3079621 3101296 3127419
59170 3127419 3157376 3190573 3227009 3266803 3309277 3353066 3396951 3439940 3480791 3518352 3552272
$$ packed form
59241D569750j0185Q033K6804M6615O7864R0679J14963J40763J68445J98289K30158
59230E652178K63715K98423L32893L64832L92223M13900M28161M31668M21021
59221H999014L95045L54557L00443K33481J55690P0425j8797j08313j93541k69860
59211I918144l34407l85881m22964m44711m52421m49238m37580m18421l93211
59202F179310l64524l34324l03349k72725k44342k18838j94905j71649j50122
59193C924532j31619j15798j01586q8750p7485o7513n8564n0847m4234l7905l1561
59182C118670k5953k1371j6733j1100n161j34L963Q004J2412J7024K1675K6123
59170C127419K9957L3197L6436L9794M2474M3789M3885M2989M0851L7561L3920
$$ plain form
59159 3552272 3582576 3608609 3629186 3643768 3652686 3656225 3654278 3646940 3634699 3617999 3597324 3573768
59147 3573768 3548765 3523137 3496944 3470344 3444008 3418714 3395111 3373915 3355767 3340866 3329214
59136 3329214 3321126 3317123 3317618 3323281 3335360 3354887 3381755 3415351 3455923 3504519 3561713 3627235
59124 3627235 3700974 3783648 3876457 3980561 4096722 4224804 4363779 4512975 4673259 4846254
59114 4846254 5032461 5230746 5439499 5657509 5883644 6116302 6353118 6590524 6823430
59105 6823430 7045599 7250064 7428964 7573802 7676969 7733078 7738547 7690915 7589898 7438884
59095 7438884 7244244 7013192 6752994 6471534 6176930 5876181 5574925 5278275 4990682
59086 4990682 4714962 4452561 4204914 3973559 3758976 3560510 3377691 3210549 3058444
$$ packed form
59159C552272L0304K6033K0577J4582Q918L539j947p338j2241j6700k0675k3556
59147C573768k5003k5628k6193k6600k6336k5294k3603k1196j8148j4901j1652
59136C329214q088m003M95N663J2079J9527K6868L3596M0572M8596N7194O5522
59124C627235P3739Q2674R2809J04104J16161J28082J38975J49196J60284J72995
59114D846254J86207J98285K08753K18010K26135K32658K36816K37406K32906
59105F823430K22169K04465J78900J44838J03167N6109N469m7632j01017j51014
59095G438884j94640k31052k60198k81460k94604l00749l01256k96650k87593
59086D990682k75720k62401k47647k31355k14583j98466j82819j67142j52105
$$ plain form
59077 3058444 2919736 2793055 2677985 2574113 2480232 2394937 2317332 2246859 2183036 2125578
59067 2125578 2074168 2028047 1986469 1949649 1918526 1893502 1874119 1859931 1850824 1846304 1845243 1846559
59055 1846559 1849552 1853533 1857681 1861124 1862407 1859132 1849136 1832017 1808705 1779798 1745524 1707229 1667437
59042 1667437 1628132 1590087 1554057 1521233 1491982 1465412 1440943 1419409 1401983 1388906 1379903
59031 1379903 1375056 1374471 1377672 1383925 1392672 1403243 1414662 1426171 1437353 1447393 1454899 1459006 1460210
59018 1460210 1459650 1457974 1455282 1451765 1448011 1444975 1443843 1445535 1450076 1456736 1464891 1474468 1485563 1498095
59004 1498095 1511784 1525984 1539515 1551076 1559825 1565274 1567062 1565487 1561910 1557738 1553149 1547639 1541593
58991 1541593 1536245 1532149 1528781 1525823 1523822 1523323 1524233 1526416 1530204 1535994 1543830 1553511 1564633 1576674
$$ packed form
59077C058444j38708j26681j15070j03872r3881q5295p7605p0473o3823n7458
59067B125578n1410m6121m1578l6820l1123k5024j9383j4188r107m520j061J316
59055A846559K993L981M148L443J283l275r996j7119k3312k8907l4274l8295l9792
59042A667437l9305l8045l6030l2824k9251k6570k4469k1534j7426j3077r003
59031A379903m847n85L201O253Q747J0571J1419J1509J1182J0040P506M107J204
59018A460210n60j676k692l517l754l036j132J692M541O660Q155R577J1095J2532
59004A498095J3689J4200J3531J1561Q749N449J788j575l577m172m589n510o046
58991A541593n348m096l368k958k001m99R10K183L788N790P836R681J1122J2041
$$ plain form
58977 1576674 1589659 1604631 1622722 1643885 1667215 1692230 1719075 1747848 1778793 1812822 1850711
58966 1850711 1891950 1935471 1981158 2029310 2078894 2127910 2175460 2221936 2267156 2310020 2350253
58955 2350253 2388843 2426318 2462251 2497041 2532663 2570867 2611987 2656232 2704868 2759290 2820023
58944 2820023 2887384 2962089 3044528 3134495 3232254 3338857 3454893 3580034 3714523 3859969
58934 3859969 4017979 4189074 4373731 4573510 4790422 5026120 5282341 5561261 5864820
58925 5864820 6194631 6553089 6943465 7368435 7829640 8329277 8870663 9456248 10086197
58916 10086197 10759720 11476305 12234040 13027063 13845288 14675457 15501157 16302518 17057204
58907 17057204 17741868 18332909 18807780 19147782 19340463 19379974 19266858 19008587 18619188
$$ packed form
58977A576674J2985J4972J8091K1163K3330K5015K6845K8773L0945L4029L7889
58966A850711M1239M3521M5687M8152M9584M9016M7550M6476M5220M2864M0233
58955B350253L8590L7475L5933L4790L5622L8204M1120M4245M8636N4422O0733
58944B820023O7361P4705Q2439Q9967R7759J06603J16036J25141J34489J45446
58934C859969J58010J71095J84657J99779K16912K35698K56221K78920L03559
58925E864820L29811L58458L90376M24970M61205M99637N41386N85585O29949
58916A0086197O73523P16585P57735P93023Q18225Q30169Q25700Q01361P54686
58907A7057204O84664N91041M74871L40002J92681L9511j13116k58271l89399
$$ plain form
58898 18619188 18116772 17521038 16852659 16132945 15382068 14617465 13854127 13105289 12381725
58889 12381725 11691041 11038538 10428237 9862395 9340850 8861795 8422779 8020539 7650851
58880 7650851 7309535 6993123 6698106 6420605 6157761 5908673 5673096 5449954 5238069
58871 5238069 5037582 4849636 4675023 4513840 4365788 4230016 4105185 3990407 3885646
58862 3885646 3790761 3704910 3627434 3558471 3498049 3445410 3399907 3361655 3330580 3305752 3286532
58851 3286532 3273486 3267345 3267774 3273946 3285548 3302535 3324825 3352989 3388276 3431146 3480703 3536348
58839 3536348 3598962 3669648 3748507 3835651 3932298 4039641 4157607 4285960 4425703 4578268
58829 4578268 4744268 4924355 5120411 5334589 5567976 5821568 6097815 6399887 6730055
$$ packed form
58898A8619188n02416n95734o68379p19714p50877p64603p63338p48838p23564
58889A2381725o90684o52503o10301n65842n21545m79055m39016m02240l69688
58880G650851l41316l16412k95017k77501k62844k49088k35577k23142k11885
58871E238069k00487j87946j74613j61183j48052j35772j24831j14778j04761
58862C885646r4885q5851p7476o8963o0422n2639m5503l8252l1075k4828j9220
58851C286532j3046o141M29O172J1602J6987K2290K8164L5287M2870M9557N5645
58839C536348O2614P0686P8859Q7144R6647J07343J17966J28353J39743J52565
58829D578268J66000J80087J96056K14178K33387K53592K76247L02072L30168
$$ plain form
58820 6730055 7090185 7483181 7912571 8381132 8891087 9444965 10044672 10689828 11378007
58811 11378007 12105859 12868311 13656532 14457535 15255244 16030760 16761943 17424410 17993929
58802 17993929 18448436 18769514 18944221 18966525 18837278 18563565 18158459 17640086 17029212
58793 17029212 16347099 15614959 14853348 14080268 13309915 12553575 11820547 11117314 10447095
58784 10447095 9811625 9212796 8651817 8128055 7640186 7187659 6769734 6384033 6027545
58775 6027545 5698459 5395630 5116752 4858439 4617734 4392631 4181756 3984624 3801521
58766 3801521 3632062 3474495 3327237 3190058 3062791 2944187 2833382 2731204 2638373 2553496
58756 2553496 2474580 2401598 2335753 2277077 2224578 2177927 2136968 2100149 2065490 2032806 2003294
$$ packed form
58820F730055L60130L92996M29390M68561N09955N53878N99707O45156O88179
58811A1378007P27852P62452P88221Q01003P97709P75516P31183O62467N69519
58802A7993929M54507L21078J74707K2304j29247k73713m05106n18373o10874
58793A7029212o82113p32140p61611p73080p70353p56340p33028p03233o70219
58784A0447095o35470n98829n60979n23762m87869m52527m17925l85701l56488
58775F027545l29086l02829k78878k58313k40705k25103k10875j97132j83103
58766C801521j69459j57567j47258j37179j27267j18604j10805j02178r2831q4877
58756B553496p8916p2982o5845n8676n2499m6651m0959l6819l4659l2684k9512
$$ plain form
58745 2003294 1977291 1954111 1933588 1915839 1899826 1884011 1868266 1853405 1838943 1823019 1804530
58734 1804530 1783878 1761749 1738630 1715331 1692482 1669526 1645468 1620371 1594927 1568975 1541762
58723 1541762 1513266 1483909 1453477 1421718 1389517 1358061 1327443 1297415 1268748 1242279 1217435
58712 1217435 1193436 1171061 1151339 1133346 1115462 1098120 1082975 1069900 1057247 1044775 1033811
58701 1033811 1024595 1015878 1007274 999642 992937 985924 978308 970944 963570 954534 943281 931092 918900
58688 918900 906329 893457 881495 870980 861014 851060 841897 834089 826936 819676 812592 806489 802139
58675 802139 800384 801525 804373 807101 809053 810598 811571 811513 811200 812090 814204 816235 817828 819945 822868
58660 822868 825564 827243 827884 827101 824208 819563 814160 807865 799800 790634 782690 777659 776006 778703 787521
$$ packed form
58745B003294k6003k3180k0523j7749j6013j5815j5745j4861j4462j5924j8489
58734A804530k0652k2129k3119k3299k2849k2956k4058k5097k5444k5952k7213
58723A541762k8496k9357l0432l1759l2201l1456l0618l0028k8667k6469k4844
58712A217435k3999k2375j9722j7993j7884j7342j5145j3075j2653j2472j0964
58701A033811r216q717q604p632o705p013p616p364p374r036j1253j2189j2192
58688I18900j2571j2872j1962j0515r966r954r163p808p153p260p084o103m350
58675H02139j755J141K848K728J952J545R73n8l13Q90K114K031J593K117K923
58660H22868K696J679O41p83k893m645n403o295q065r166p944n031j653K697Q818
$$ plain form
58645 787521 803115 824464 850405 880064 911803 943767 975812 1009148 1043978 1079402 1115669
58634 1115669 1154355 1196063 1240108 1286845 1338127 1394968 1456884 1524123 1598416 1680890 1771280
58623 1771280 1869939 1978710 2099189 2232068 2378873 2542361 2724291 2924314 3141379 3374183
58613 3374183 3619488 3871869 4125614 4374885 4611355 4823876 5001680 5136668 5222690 5255363
58603 5255363 5234028 5162250 5045549 4890139 4704123 4497278 4278226 4053225 3828156 3609369
58593 3609369 3401444 3206019 3023887 2856398 2703901 2564896 2438160 2324125 2223058
58584 2223058 2133536 2053876 1983541 1922094 1868158 1820302 1777596 1738618 1701512 1665700 1631979
58573 1631979 1600296 1569201 1538126 1508373 1481115 1456226 1433722 1414376 1397953 1382692 1367344
$$ packed form
58645G87521J5594K1349K5941K9659L1739L1964L2045L3336L4830L5424L6267
58634A115669L8686M1708M4045M6737N1282N6841O1916O7239P4293Q2474R0390
58623A771280R8659J08771J20479J32879J46805J63488J81930K00023K17065K32804
58613C374183K45305K52381K53745K49271K36470K12521J77804J34988Q6022L2673
58603E255363k1335p1778j16701j55410j86016k06845k19052k25001k25069k18787
58593C609369k07925j95425j82132j67489j52497j39005j26736j14035j01067
58584B223058q9522p9660p0335o1447n3936m7856m2706l8978l7106l5812l3721
58573A631979l1683l1095l1075k9753k7258k4889k2504j9346j6423j5261j5348
$$ plain form
58562 1367344 1352012 1336362 1318937 1299027 1277408 1254596 1230337 1205312 1181150 1158073 1134737
58551 1134737 1111037 1088720 1068564 1049492 1031289 1015419 1002070 989087 975180 961572 949137
58540 949137 936582 923075 910101 898921 888517 877803 867641 858932 850890 842924 836036 830642
58528 830642 825174 818598 812147 806799 801215 794071 786228 778735 770809 761825 753217 746297 740130 733627
58514 733627 727855 724156 721771 719426 717599 717214 717788 718803 721211 725613 730574 734711 738868 744401 750879
58499 750879 757290 763838 770800 777278 782781 788304 794280 799358 802852 806228 810371 813606 814396 813827 813346
58484 813346 812199 809344 805739 802399 798196 791991 784998 778681 772219 764469 756443 749392 742356 734200
58470 734200 726217 720036 714665 708209 700920 693944 686749 678444 670169 663514 657952 652205 646703 642369
$$ packed form
58562A367344j5332j5650j7425j9910k1619k2812k4259k5025k4162k3077k3336
58551A134737k3700k2317k0156j9072j8203j5870j3349j2983j3907j3608j2435
58540I49137j2555j3507j2974j1180j0404j0714j0162q709q042p966o888n394
58528H30642n468o576o451n348n584p144p843p493p926q984q608o920o167o503
58514G33627n772l699k385k345j827l85N74J015K408M402M961M137M157N533O478
58499G50879O411O548O962O478N503N523N976N078L494L376M143L235P90n69m81
58484H13346j147k855l605l340m203o205o993o317o462p750q026p051p036q156
58470G34200p983o181n371o456p289o976p195q305q275o655n562n747n502m334
$$ plain form
58456 642369 638607 634939 633003 634400 638012 641745 645346 649338 653104 656463 661197 668382 676121 682463
58442 682463 688557 696202 704388 711288 717658 725051 732495 738187 742777 747700 751835 753212 752596 752019 750979
58427 750979 747404 741361 734728 728245 721738 716077 712016 708344 703926 700221 699007 699198 698847 698596 700097
58412 700097 702706 705054 708249 714049 721302 727614 733219 739816 746849 752407 756592 760659 763986 765179
58398 765179 764937 764618 763382 760065 756407 754907 754787 753607 751549 750570 750589 750079 749354 749791 750920 751553 752509
58381 752509 755060 758243 760978 765126 772918 783109 793210 803539 815244 826426 834562 841012 848851
58368 848851 857873 866011 873909 883510 893689 901883 908655 916136 923485 928582 932748 938949 946671 953286
58354 953286 959115 966241 973740 979227 983812 990333 997722 1002402 1004321 1006426 1009102 1010359 1010681 1012447
$$ packed form
58456F42369l762l668j936J397L612L733L601L992L766L359M734P185P739O342
58442F82463O094P645Q186O900O370P393P444N692M590M923M135J377o16n77j040
58427G50979l575o043o633o483o507n661m061l672m418l705j214J91l51k51J501
58412G00097K609K348L195N800P253O312N605O597P033N558M185M067L327J193
58398G65179k42l19j236l317l658j500j20j180k058r79J9n10p25M37J129O33R56
58381G52509K551L183K735M148P792J0191J0101J0329J1705J1182Q136O450P839
58368H48851R022Q138P898R601J0179Q194O772P481P349N097M166O201P722O615
58354I53286N829P126P499N487M585O521P389M680J919K105K676J257L22J766
$$ plain form
58340 1012447 1015338 1017363 1019559 1024529 1031300 1036852 1041702 1048667 1057249 1064711 1071698 1081107 1092411 1102811
58326 1102811 1112946 1125572 1139623 1151679 1162430 1175431 1190295 1203477 1215169 1228958 1245129
58315 1245129 1260681 1275479 1292006 1309479 1324609 1337710 1351620 1365292 1375202 1382490 1391725 1403139
58303 1403139 1413139 1421977 1433526 1447771 1460952 1473056 1487719 1504868 1520963 1536434 1555212
58292 1555212 1576908 1597219 1616126 1637861 1662705 1686835 1710355 1737371 1767913 1797953 1827489
58281 1827489 1860312 1895759 1929223 1960826 1994895 2031046 2064922 2097570 2134461 2175167 2213859
58270 2213859 2250120 2289014 2330295 2368305 2403119 2440831 2482057 2521446 2559458 2602906 2652395
58259 2652395 2701113 2747778 2798795 2855825 2913473 2971393 3036214 3108983 3183143 3257448 3338286
$$ packed form
58340A012447K891K025K196M970O771N552M850O965Q582P462O987R409J1304J0400
58326A102811J0135J2626J4051J2056J0751J3001J4864J3182J1692J3789J6171
58315A245129J5552J4798J6527J7473J5130J3101J3910J3672R910P288R235J1414
58303A403139J0000Q838J1549J4245J3181J2104J4663J7149J6095J5471J8778
58292A555212K1696K0311J8907K1735K4844K4130K3520K7016L0542L0040K9536
58281A827489L2823L5447L3464L1603L4069L6151L3876L2648L6891M0706L8692
58270B213859L6261L8894M1281L8010L4814L7712M1226L9389L8012M3448M9489
58259B652395M8718M6665N1017N7030N7648N7920O4821P2769P4160P4305Q0838
$$ plain form
58248 3338286 3426775 3516519 3606763 3704515 3810916 3919053 4027958 4144889 4271103 4399821
58238 4399821 4531040 4673305 4827919 4987074 5150574 5328100 5521782 5723533 5932898
58229 5932898 6159675 6405506 6661807 6929704 7222110 7541968 7879393 8234773 8622446
58220 8622446 9046473 9496420 9973011 10493306 11064143 11676608 12334093 13058388 13860309
58211 13860309 14733537 15686160 16747674 17936277 19253080 20718771 22380316 24271885
58203 24271885 26409986 28839749 31643639 34895021 38656992 43045645 48242734 54437030
58195 54437030 61830157 70732812 81592761 94927724 111351279 131681187 156788309
58188 156788309 187082579 222083235 260401453 299764570 336715740 366582235 384636315
$$ packed form
58248C338286Q8489Q9744R0244R7752J06401J08137J08905J16931J26214J28718
58238D399821J31219J42265J54614J59155J63500J77526J93682K01751K09365
58229E932898K26777K45831K56301K67897K92406L19858L37425L55380L87673
58220H622446M24027M49947M76591N20295N70837O12465O57485P24295Q01921
58211A3860309Q73228R52623J061514J188603J316803J465691J661545J891569
58203B4271885K138101K429763K803890L251382L761971M388653N197089O194296
58195E4437030P393127Q902655J0859949J3334963J6423555K0329908K5107122
58188A56788309L0294270L5000656L8318218L9363117L6951170K9866495J8054080
$$ plain form
58181 384636315 388116720 377472570 355763577 326958453 294615960 261484618 229530142
58174 229530142 199970383 173386775 149966802 129686983 112351870 97636227 85196099
58167 85196099 74729036 65942383 58545200 52301354 47043768 42625847 38907168 35792433
58159 35792433 33233048 31181105 29585752 28436186 27761679 27592271 27970177 28989021
58151 28989021 30745960 33231262 36302458 39739647 43221567 46227996 48102340 48355832
58143 48355832 46940516 44213027 40672381 36754526 32787053 29000620 25527956 22421970
58135 22421970 19697487 17349983 15348982 13647456 12205646 10992774 9972226 9105036
58127 9105036 8365575 7738008 7201268 6732089 6318011 5953184 5625874 5322816 5040571
$$ packed form
58181C84636315L480405j0644150k1708993k8805124l2342493l3131342l1954476
58174B29530142k9559759k6583608k3419973k0279819j7335113j4715643j2440128
58167H5196099j0467063q786653p397183o243846n257586m417921l718679l114735
58159C5792433k559385k051943j595353j149566o74507j69408L77906J018844
58151B8989021J756939K485302L071196L437189L481920L006429J874344K53492
58143D8355832j415316k727489l540646l917855l967473l786433l472664l105986
58135B2421970k724483k347504k001001j701526j441810j212872j020548q67190
58127I105036p39461o27567n36740m69179m14078l64827l27310l03058k82245
$$ plain form
58118 5040571 4780226 4536225 4302075 4081194 3880272 3697185 3526223 3369387 3231466
58109 3231466 3109383 2996986 2895081 2806421 2725867 2645562 2565159 2487726 2410678 2330197 2249832
58098 2249832 2175496 2106208 2038030 1972382 1912202 1854721 1796358 1740120 1690045 1642970 1593887
58087 1593887 1544935 1501143 1461678 1423056 1386647 1355128 1325648 1294217 1263070 1236349 1212340
58076 1212340 1187099 1161812 1139489 1118352 1095610 1073876 1056746 1041791 1024988 1008228 995310
58065 995310 984281 971058 957242 946925 938889 929179 918672 910935 905065 897447 888285 879937 871205
58052 871205 859640 847179 837295 828898 819082 809339 802892 798295 791996 785059 781108 779629 777306 774099
58038 774099 772165 770747 767957 765658 766709 769210 769268 767613 767709 769070 768414 765898 764284 763203 760050
$$ packed form
58118E040571k60345k44001k34150k20881k00922j83087j70962j56836j37921
58109C231466j22083j12397j01905q8660q0554q0305q0403p7433p7048q0481q0365
58098B249832p4336o9288o8178o5648o0180n7481n8363n6238n0075m7075m9083
58087A593887m8952m3792l9465l8622l6409l1519k9480l1431l1147k6721k4009
58076A212340k5241k5287k2323k1137k2742k1734j7130j4955j6803j6760j2918
58065I95310j1029j3223j3816j0317q036r710j0507p737n870p618r162q348q732
58052H71205j1565j2461r884q397r816r743o447m597o299o937l951j479k323l207
58038G74099j934j418k790k299J051K501N8j655R6J361o56k516j614j081l153
$$ plain form
58023 760050 755563 752932 752227 750947 749133 748682 748565 745936 741395 738197 736888 735246 732774 730734 728619
58008 728619 724985 720880 718183 715737 711406 706624 704382 703972 702301 699090 696121 692639 686501 678857
57994 678857 672691 667467 660143 650893 642965 637279 631990 627186 625308 626726 629170 631704 635386 640011
57980 640011 643950 647141 650765 654313 656370 657662 659821 661953 662076 661037 661181 661980 661014 658470 656615
57965 656615 655509 653419 650864 650058 650710 650510 649418 649367 650080 649300 646948 644975 643258 639799 635008 631766
57949 631766 631095 631544 632824 636125 640724 644196 646288 648951 652368 654608 655343 656198 657206 656569 654175
57934 654175 651745 649275 644887 638525 632207 626310 619083 610147 600988 591725 581056 569817 560958 555281
57920 555281 550610 545756 541962 539815 538152 536807 537238 539705 542819 546470 552103 559455 566135 571208
$$ packed form
58023G60050m487k631p05j280j814m51j17k629m541l198j309j642k472k040k115
58008G28619l634m105k697k446m331m782k242m10j671l211k969l482o138p644
57994F78857o166n224p324r250p928n686n289m804j878J418K444K534L682M625
57980F40011L939L191L624L548K057J292K159K132J23j039J44P99r66k544j855
57965F56615j106k090k555q06O52k00j092n1P13p80k352j973j717l459m791l242
57949F31766o71M49J280L301M599L472K092K663L417K240P35Q55J008o37k394
57934F54175k430k470m388o362o318n897p227q936r159r263j0669j1239q859n677
57920E55281m671m854l794k147j663j345M31K467L114L651N633P352O680N073
$$ plain form
57906 571208 576269 582322 588508 594502 601238 608543 614878 620026 625341 630885 635166 638094 641228 644600
57892 644600 646317 645926 645224 645022 643966 641265 637807 633912 628756 622647 617163 612478 607249 601621 597487
57877 597487 595243 593217 590870 589626 589845 589989 589630 590396 593026 596203 599150 602744 607264 611712 616032
57862 616032 621332 627199 631533 633751 635482 637472 638618 638640 638715 638735 636968 633313 629925 627673 624989 621159
57846 621159 617661 615161 612244 608400 605248 603522 601800 599538 598375 598923 599180 597781 595997 594919 593380
57831 593380 590443 587288 584750 581458 576271 570302 564803 559225 552998 546913 541074 533804 524397 514804
57817 514804 506828 499697 492121 484627 478143 472262 466660 462314 459627 457228 454220 451757 450907 450903 450999 451989
57801 451989 454281 456577 458183 460583 464986 470321 475471 481499 489710 499341 509161 519618 531391 543403
$$ packed form
57906E71208N061O053O186N994O736P305O335N148N315N544M281K928L134L372
57892F44600J717l91p02k02j056k701l458l895n156o109n484m685n229n628m134
57877E97487k244k026k347j244K19J44l59P66K630L177K947L594M520M448M320
57862F16032N300N867M334K218J731J990J146K2P5K0j767l655l388k252k684l830
57846F21159l498k500k917l844l152j726j722k262j163N48K57j399j784j078j539
57831E93380k937l155k538l292n187n969n499n578o227o085n839p270r407r593
57817E14804p976p131p576p494o484n881n602m346k687k399l008k463q50mR6R90
57801D51989K292K296J606K400M403N335N150O028Q211R631R820J0457J1773J2012
$$ plain form
57787 543403 554178 563711 572166 578317 581178 581826 581771 580860 578402 574935 571180 566641 560903 554875 549185
57772 549185 542774 534780 526355 518957 512296 505655 499754 495469 492090 488702 486038 485160 485445 485556 485299
57757 485299 484997 484377 483710 484797 489094 495943 504086 513537 524370 535156 544475 552767 560917 568253
57743 568253 573827 578587 584379 591657 599705 608019 615989 622421 627210 632369 639751 648731 657767 666982
57729 666982 677419 688956 700925 713959 729324 747262 767653 791322 818789 848395 877362
57718 877362 904136 928353 949566 967702 983888 999211 1013450 1026487 1039918 1055631 1073733
57707 1073733 1093520 1115472 1140658 1169236 1201338 1238453 1282089 1331987 1387465 1449559 1519894
57696 1519894 1598463 1684684 1780014 1887289 2007952 2141907 2289703 2452891 2632371 2827972
$$ packed form
57787E43403J0775R533Q455O151K861O48n5r11k458l467l755m539n738o028n690
57772E49185o411p994q425p398o661o641n901m285l379l388k664q78K85J11k57
57757D85299l02o20o67J087M297O849Q143R451J0833J0786R319Q292Q150P336
57743E68253N574M760N792P278Q048Q314P970O432M789N159P382Q980R036R215
57729F66982J0437J1537J1969J3034J5365J7938K0391K3669K7467K9606K8967
57718H77362K6774K4217K1213J8136J6186J5323J4239J3037J3431J5713J8102
57707A073733J9787K1952K5186K8578L2102L7115M3636M9898N5478O2094P0335
57696A519894P8569Q6221R5330J07275J20663J33955J47796J63188J79480J95601
$$ plain form
57686 2827972 3039101 3263901 3497776 3734104 3965886 4185384 4383140 4549525 4677478
57677 4677478 4762819 4803221 4799074 4755113 4679347 4580531 4467783 4351365 4240948 4142402 4057171
57666 4057171 3983794 3917794 3850422 3770365 3668549 3541620 3392004 3226391 3053824 2883045
57656 2883045 2720321 2569539 2433376 2313301 2209214 2120408 2046500 1986563 1938411 1900161
57646 1900161 1871719 1853349 1843741 1841079 1845142 1856654 1875366 1900629 1933135 1974164 2023631 2080785
57634 2080785 2146460 2222893 2311720 2413799 2530351 2662354 2809128 2969241 3142201 3327300
57624 3327300 3521208 3718578 3914343 4103179 4277188 4426751 4543998 4623711 4661508 4654103
57614 4654103 4602034 4510004 4383988 4229807 4054546 3866656 3673289 3478867 3286844 3101148
$$ packed form
57686B827972K11129K24800K33875K36328K31782K19498J97756J66385J27953
57677D677478Q5341M0402m147m3961p5766r8816j12748j16418j10417r8546q5231
57666D057171p3377o6000o7372q0057j01816j26929j49616j65613j72567j70779
57656B883045j62724j50782j36163j20075j04087q8806p3908n9937m8152l8250
57646A900161k8442j8370r608k662M063J1512J8712K5263L2506M1029M9467N7154
57634B080785O5675P6433Q8827J02079J16552J32003J46774J60113J72960J85099
57624C327300J93908J97370J95765J88836J74009J49563J17247P9713L7797p405
57614D654103n2069r2030j26016j54181j75261j87890j93367j94422j92023j85696
$$ plain form
57604 3101148 2925052 2760028 2606520 2464785 2334529 2214945 2105706 2006948 1918006 1837193
57594 1837193 1763111 1695189 1633005 1576261 1525434 1481109 1442454 1407589 1375528 1346575 1320761
57583 1320761 1297329 1275881 1256654 1239400 1223274 1208133 1194747 1183448 1173731 1165408 1158963 1154477
57571 1154477 1151241 1148717 1147024 1146350 1146815 1148873 1152908 1158408 1164435 1170829 1178160 1186802 1196936 1208942
57557 1208942 1222651 1236803 1250601 1265285 1282762 1303143 1325205 1348743 1374692 1403283 1433993
57546 1433993 1467254 1504364 1545779 1591266 1641686 1698770 1763067 1834053 1912314 1999644 2096728
57535 2096728 2202782 2317872 2443596 2580778 2728172 2883941 3046403 3212297 3375784
57526 3375784 3530094 3669103 3786909 3877551 3936257 3960432 3949442 3904770 3830656 3733091 3617562
$$ packed form
57604C101148j76096j65024j53508j41735j30256j19584j09239r8758q8942q0813
57594A837193p4082o7922o2184n6744n0827m4325l8655l4865l2061k8953k5814
57583A320761k3432k1448j9227j7254j6126j5141j3386j1299r717q323o445m486
57571A154477l236k524j693o74M65K058M035N500O027O394P331Q642J0134J2006
57557A208942J3709J4152J3798J4684J7477K0381K2062K3538K5949K8591L0710
57546A433993L3261L7110M1415M5487N0420N7084O4297P0986P8261Q7330R7084
57535B096728J06054J15090J25724J37182J47394J55769J62462J65894J63487
57526C375784J54310J39009J17806R0642N8706K4175j0990m4672p4114r7565j15529
$$ plain form
57515 3617562 3488704 3351781 3212568 3075262 2941993 2814703 2695764 2586312 2485688
57506 2485688 2393287 2309450 2234035 2165751 2103714 2048253 1999512 1956711 1919372 1887816 1861736
57495 1861736 1839849 1821709 1808378 1800441 1796803 1796369 1799606 1807535 1820441 1838490 1862417 1892587
57483 1892587 1928335 1969032 2014880 2066213 2123245 2187135 2259983 2342974 2435655 2537673 2649935
57472 2649935 2773218 2906834 3049405 3199651 3355352 3512388 3665445 3808710 3935383
57463 3935383 4038036 4110663 4149877 4153966 4122394 4057072 3962823 3845519 3710620 3563844 3411478
57452 3411478 3258661 3108306 2962532 2823964 2694647 2574853 2464139 2362726 2270913 2188125
57442 2188125 2113579 2047061 1988169 1935681 1888559 1846753 1810261 1778222 1749721 1724554 1702492
$$ packed form
57515C617562j28858j36923j39213j37306j33269j27290j18939j09452j00624
57506B485688r2401q3837p5415o8284o2037n5461m8741m2801l7339l1556k6080
57495A861736k1887j8140j3331p937l638m34L237P929J2906J8049K3927L0170
57483A892587L5748M0697M5848N1333N7032O3890P2848Q2991R2681J02018J12262
57472B649935J23283J33616J42571J50246J55701J57036J53057J43265J26673
57463C935383J02653P2627L9214M089l1572o5322r4249j17304j34899j46776j52366
57452C411478j52817j50355j45774j38568j29317j19794j10714j01413r1813q2788
57442B188125p4546o6518n8892n2488m7122m1806l6492l2039k8501k5167k2062
$$ plain form
57431 1702492 1682792 1665210 1650460 1638793 1629073 1620101 1611965 1605305 1600188 1596475 1594347 1593629 1593505
57418 1593505 1593577 1594275 1595596 1596677 1597332 1598770 1601822 1605670 1609321 1613167 1617999 1623568 1629341 1635703 1643160
57403 1643160 1651139 1658779 1666237 1674233 1682910 1692045 1701630 1711473 1720970 1730053 1739562 1750011 1760863
57390 1760863 1771684 1782886 1794621 1806163 1817311 1829137 1842248 1855492 1867604 1879081 1891185
57379 1891185 1904046 1916976 1929808 1942680 1955275 1967448 1979917 1993297 2007133 2020708 2034006
57368 2034006 2047096 2059607 2071681 2084324 2097862 2111198 2123593 2135826 2148502 2160639 2171349
57357 2171349 2181591 2192685 2204297 2215546 2227031 2239993 2254358 2269313 2284934 2301593 2318583
57346 2318583 2335140 2352073 2370590 2390194 2409489 2428439 2447983 2468032 2487796 2507664 2528760
$$ packed form
57431A702492j9700j7582j4750j1667r720q972q136o660n117l713k128p18j24
57418A593505P2O98J321J081O55J438L052L848L651L846M832N569N773O362P457
57403A643160P979P640P458P996Q677R135R585R843R497R083R509J0449J0852
57390A760863J0821J1202J1735J1542J1148J1826J3111J3244J2112J1477J2104
57379A891185J2861J2930J2832J2872J2595J2173J2469J3380J3836J3575J3298
57368B034006J3090J2511J2074J2643J3538J3336J2395J2233J2676J2137J0710
57357B171349J0242J1094J1612J1249J1485J2962J4365J4955J5621J6659J6990
57346B318583J6557J6933J8517J9604J9295J8950J9544K0049J9764J9868K1096
$$ plain form
57335 2528760 2550807 2572316 2592870 2613526 2634916 2656524 2677924 2699283 2720581 2741653 2763089
57324 2763089 2785810 2809706 2833766 2857490 2881181 2905024 2928937 2953076 2977454 3001437 3024661
57313 3024661 3048013 3072570 3098002 3123227 3148194 3173760 3200254 3227451 3255490 3284485 3313630
57302 3313630 3342057 3370266 3399455 3429918 3461350 3494156 3528975 3565441 3602934 3642045 3683629
57291 3683629 3726908 3770251 3813493 3857746 3903235 3949217 3995768 4043540 4091694 4138025 4181459
57280 4181459 4222606 4261568 4296992 4327705 4353588 4374312 4388814 4396788 4399425 4398160 4393835 4387543
57268 4387543 4380960 4375236 4370508 4366901 4365046 4365283 4367286 4370857 4376252 4383583 4392702 4403705 4416673 4431057
57254 4431057 4446246 4462493 4480166 4498409 4515935 4532979 4550909 4569911 4588578 4605961 4622493
$$ packed form
57335B528760K2047K1509K0554K0656K1390K1608K1400K1359K1298K1072K1436
57324B763089K2721K3896K4060K3724K3691K3843K3913K4139K4378K3983K3224
57313C024661K3352K4557K5432K5225K4967K5566K6494K7197K8039K8995K9145
57302C313630K8427K8209K9189L0463L1432L2806L4819L6466L7493L9111M1584
57291C683629M3279M3343M3242M4253M5489M5982M6551M7772M8154M6331M3434
57280D181459M1147L8962L5424L0713K5883K0724J4502P974K637j265m325o292
57268D387543o583n724m728l607j855K37K003L571N395P331R119J1003J2968J4384
57254D431057J5189J6247J7673J8243J7526J7044J7930J9002J8667J7383J6532
$$ plain form
57243 4622493 4638688 4654451 4670062 4686322 4703222 4719757 4735538 4751334 4767588 4783737 4799586
57232 4799586 4816059 4833799 4852046 4869722 4886857 4904310 4922740 4942303 4962748 4983432 5003801
57221 5003801 5024112 5045149 5067171 5089748 5112542 5135385 5157624 5178361 5197482 5215725 5233635
57210 5233635 5251207 5268413 5285300 5301714 5317723 5334056 5351171 5368242 5384174 5399256 5414567
57199 5414567 5430085 5444926 5459294 5474547 5491086 5507670 5523239 5538104 5552879 5567387 5581162
57188 5581162 5594241 5607132 5620561 5635193 5650879 5666429 5680997 5695342 5710771 5727330 5744217
57177 5744217 5761359 5779076 5796609 5812727 5827546 5842038 5855833 5867315 5875988 5883020 5889293 5894575
57165 5894575 5898786 5902488 5905800 5908288 5910084 5911821 5913511 5915062 5917735 5923343 5931959 5942171 5953542
$$ packed form
57243D622493J6195J5763J5611J6260J6900J6535J5781J5796J6254J6149J5849
57232D799586J6473J7740J8247J7676J7135J7453J8430J9563K0445K0684K0369
57221E003801K0311K1037K2022K2577K2794K2843K2239K0737J9121J8243J7910
57210E233635J7572J7206J6887J6414J6009J6333J7115J7071J5932J5082J5311
57199E414567J5518J4841J4368J5253J6539J6584J5569J4865J4775J4508J3775
57188E581162J3079J2891J3429J4632J5686J5550J4568J4345J5429J6559J6887
57177E744217J7142J7717J7533J6118J4819J4492J3795J1482Q673P032O273N282
57165E894575M211L702L312K488J796J737J690J551K673N608Q616J0212J1371
$$ plain form
57152 5953542 5966908 5982241 5998272 6014540 6031860 6050503 6069917 6090546 6113818 6139806 6166776
57141 6166776 6193431 6219646 6244740 6267228 6286871 6304890 6321676 6336444 6349675 6363502 6378795
57130 6378795 6394152 6408699 6423782 6440998 6460735 6483651 6511394 6544654 6582475 6624550 6672287
57119 6672287 6726702 6787292 6853992 6928097 7010250 7099638 7196240 7301791 7417602 7543878 7682537
57108 7682537 7838753 8018905 8229462 8478860 8777787 9136281 9563139 10069714 10672449
57099 10672449 11391750 12252607 13288393 14541251 16057280 17884181 20073790 22681211
57091 22681211 25757264 29342612 33466617 38141920 43352649 49048105 55145695 61531799
57083 61531799 68062372 74583530 80965165 87095830 92813611 97840999 101822425 104462986
$$ packed form
57152E953542J3366J5333J6031J6268J7320J8643J9414K0629K3272K5988K6970
57141F166776K6655K6215K5094K2488J9643J8019J6786J4768J3231J3827J5293
57130F378795J5357J4547J5083J7216J9737K2916K7743L3260L7821M2075M7737
57119F672287N4415O0590O6700P4105Q2153Q9388R6602J05551J15811J26276J38659
57108G682537J56216J80152K10557K49398K98927L58494M26858N06575O02735
57099A0672449P19301Q60857J035786J252858J516029J826901K189609K607421
57091B2681211L076053L585348M124005M675303N210729N695456O097590O386104
57083F1531799O530573O521158O381635O130665N717781N027388L981426K640561
$$ plain form
57075 104462986 105650964 105463168 104074063 101663066 98375043 94320988 89591873 84278736
57067 84278736 78495154 72388240 66130167 59898429 53856402 48138008 42837637 38008512
57059 38008512 33669251 29812879 26414130 23435916 20835952 18571626 16601949 14888362
57051 14888362 13395882 12093775 10955055 9955752 9074906 8294844 7601054 6981517 6425920
57042 6425920 5925264 5472095 5060716 4686672 4345977 4035095 3751364 3492702 3256851
57033 3256851 3041426 2844654 2665380 2502279 2353588 2217637 2093083 1978687 1873410
57024 1873410 1776676 1688060 1606811 1532252 1464358 1403300 1348604 1299430 1255364 1216189 1181183
57013 1181183 1149413 1120590 1094880 1072181 1052271 1035366 1021892 1012149 1006786 1007048 1013930 1027964
$$ packed form
57075A04462986J187978j87796j389105k410997l288023m054055m729115n313137
57067H4278736n783582o106914o258073o231738o042027n718394n300371m829125
57059C8008512m339261l856372l398749k978214k599964k264326j969677j713587
57051A4888362j492480j302107j138720r99303q80846p80062o93790o19537n55597
57042F425920n00656m53169m11379l74044l40695l10882k83731k58662k35851
57033C256851k15425j96772j79274j63101j48691j35951j24554j14396j05277
57024A873410r6734q8616q1249p4559o7894o1058n4696m9174m4066l9175l5006
57013A181183l1770k8823k5710k2699j9910j6905j3474r743n363K62O882J4034
$$ plain form
57001 1027964 1050557 1084527 1132775 1198235 1286460 1405917 1563011 1757748 1985459 2238241
56991 2238241 2498046 2729277 2887214 2941227 2890953 2760352 2579667 2373979 2162216 1958107
56981 1958107 1769172 1597172 1441142 1299624 1171013 1054099 948996 856590 777008 709385
56971 709385 652852 606707 569735 540333 517337 500039 487562 478978 473992 472847 475584 481902
56959 481902 491754 505699 524598 548802 576845 604512 625894 636357 634772 622961 603678 579560
56947 579560 553204 527015 502679 481194 463318 449541 439620 432740 428430 427172 429882 436948 448117
56934 448117 463469 484089 511153 544312 581375 619429 655321 684875 703074 706437 695088 671916
56922 671916 640283 603271 564108 525650 489407 456076 426769 402510 382748 365719 350401
$$ packed form
57001A027964K2593L3970M8248O5460Q8225J19457J57094J94737K27711K52782
56991B238241K59805K31231J57937N4013n0274j30601j80685k05688k11763k04109
56981A958107j88935j72000j56030j41518j28611j16914j05103r2406p9582o7623
56971G09385n6533m6145l6972k9402k2996j7298j2477q584m986j145K737O318
56959D81902R852J3945J8899K4204K8043K7667K1382J0463j585j1811j9283k4118
56947E79560k6356k6189k4336k1485j7876j3777r921o880m310j258K710P066J1169
56934D48117J5352K0620K7064L3159L7063L8054L5892K9554J8199L363j1349k3172
56922F71916l1633l7012l9163l8458l6243l3331k9307k4259j9762j7029j5318
$$ plain form
56911 350401 337025 325681 315770 307064 300116 295206 291853 289676 288779 289041 289888 291016 292434 293698
56897 293698 294079 293720 293674 294613 296454 299423 304445 312263 323142 337595 356273 378806 403705 429440
56883 429440 454389 475563 489038 492533 486786 474097 456652 436652 416549 398087 381856 368401
56871 368401 358882 354052 353584 357160 365355 378850 397686 422146 453573 493530 542624 600594 666510
56858 666510 737748 808930 872449 920287 946172 947862 928292 893799 850539 802853 754594 710013
56846 710013 672301 642319 619803 605003 598403 599910 609605 628866 659922 704715 764727 841005
56834 841005 933153 1038337 1151369 1264682 1367461 1446348 1489559 1491754 1455464 1388737 1301972
56823 1301972 1205683 1108835 1017664 935551 863735 802220 750730 709533 679414 660864 653890
$$ packed form
56911C50401j3376j1344r911q706o948m910l353k177q97K62Q47J128J418J264
56897B93698L81l59m6R39J841K969N022P818J0879J4453J8678K2533K4899K5735
56883D29440K4949K1174J3475L495n747j2689j7445k0000k0103j8462j6231j3455
56871C68401r519m830m68L576Q195J3495J8836K4460L1427L9957M9094N7970O5916
56858F66510P1238P1182O3519M7838K5885J690j9570l4493m3260m7686m8259m4581
56846G10013l7712k9982k2516j4800o600J507R695J9261L1056M4793O0012P6278
56834H41005R2148J05184J13032J13313J02779P8887M3211K195l6290o6727q6765
56823A301972r6289r6848r1171q2113p1816o1515n1490m1197l0119j8550o974
$$ plain form
56812 653890 658807 676653 708334 753735 811866 881202 959008 1040112 1116336 1177288 1212900 1217112
56800 1217112 1190396 1138815 1070635 993727 914837 839153 769636 707433 653258 607784 570881
56789 570881 541712 519908 505793 499397 500407 509186 526553 552190 584407 621572 662016 701815
56777 701815 734350 753422 756299 743454 716861 679514 635303 587897 540039 494246 452911 416884
56765 416884 385081 356547 331970 312313 296990 284457 273743 264384 255693 247175 238991 231268
56753 231268 223755 216856 211870 209169 207135 204059 200190 196780 194033 191258 188255 185244 182046 178581
56739 178581 175545 173403 171345 168405 165069 162510 160810 159213 157626 156569 155966 155283 154612 154452 154536 153985
56723 153985 152507 150525 148329 146040 144198 143390 143366 143258 142605 141589 140572 140027 140446 141658 142579 142342
$$ packed form
56812F53890M917J7846L1681M5401N8131O9336P7806Q1104P6224O0952L5612M212
56800A217112k6716n1581o8180p6908p8890p5684o9517o2203n4175m5474l6903
56789E70881k9169k1804j4115o396J010Q779J7367K5637L2217L7165M0444L9799
56777G01815L2535J9072K877j2845k6593l7347m4211m7406m7858m5793m1335l6027
56765D16884l1803k8534k4577j9657j5323j2533j0714r359q691q518q184p723
56753B31268p513o899m986k701k034l076l869l410k747k775l003l011l198l465
56739A78581l036k142k058k940l336k559j700j597j587j057o03o83o71j60Q4n51
56723A53985j478j982k196k289j842q08k4j08o53j016j017n45M19J212R21k37
$$ plain form
56707 142342 141274 140279 139843 140163 141402 142984 143502 142336 140619 139653 139086 137839 136112 135095 135114 135380
56691 135380 135351 135216 135234 135610 136765 138753 140677 141685 142225 143332 144961 146099 146342 146311 146510 146667 146290
56674 146290 145200 143592 142030 141157 140955 140607 139518 137912 136039 133524 130142 126433 122877 119234 115424
56659 115424 112152 109799 107651 105213 103399 103262 104402 105829 107602 110303 113660 117051 120729 125122
56645 125122 129503 132793 135236 137818 140398 141849 141747 140602 138663 135848 132660 129947 127887 126241
56631 126241 125277 125300 125698 125664 125517 126200 127896 130367 134066 139473 145756 151609 157182 163744 171687 180269
56615 180269 189085 198220 207006 214206 219616 224217 228662 232741 236315 239553 242244 243938 244742 244906 243845
56600 243845 240773 236160 231374 226983 222600 218148 214026 210066 205606 200626 195772 191381 187498 184570
$$ packed form
56707A42342j068r95m36L20J239J582N18j166j717r66n67j247j727j017J9K66
56691A35380k9j35J8L76J155J988J924J008N40J107J629J138K43l1J99J57l77
56674A46290j090j608j562q73k02l48j089j606j873k515l382l709l556l643l810
56659A15424l272k353k148k438j814j37J140J427J773K701L357L391L678M393
56645A25122M381L290K443K582K580J451j02j145j939k815l188k713k060j646
56631A26241r64K3L98l4j47O83J696K471L699N407O283N853N573O562P943Q582
56615A80269Q816R135Q786P200N410M601M445M079L574L238K691J694Q04J64j061
56600B43845l072m613m786m391m383m452m122l960m460m980m854m391l883k928
$$ plain form
56586 184570 182950 181949 180631 179309 179094 180183 181748 183220 184444 184993 184702 184550 185578 187256 188321
56571 188321 188829 189795 191172 192014 192483 193869 196515 199424 202101 205115 208602 211753 214142 216209 218204
56556 218204 219914 221566 223732 226251 228451 230376 232479 234301 234972 234909 235411 236559 237086 236380 235007 233234
56540 233234 230738 227976 226164 225525 225001 223871 222300 220239 217452 214716 213303 212990 212246 210623 209331
56525 209331 209161 209533 209902 210392 210628 209640 207461 205233 203285 200670 197084 193622 191088 189071 187238 185988
56509 185988 185277 184281 182806 181624 180882 179703 177890 176540 176307 176441 176171 175726 175392 174879 174180 173851 173931
56492 173931 173809 173530 173925 175060 175888 175863 175600 175581 175547 175519 176129 177585 179493 181800 184585 187033 188213 188857
56474 188857 190558 193252 195416 196790 198662 201211 202948 203405 204002 205398 206282 205840 205288 205761 206538 206587
$$ packed form
56586A84570j620j001j318j322k15J089J565J472J224N49k91j52J028J678J065
56571A88321N08R66J377Q42M69J386K646K909K677L014L487L151K389K067J995
56556B18204J710J652K166K519K200J925K103J822O71o3N02J148N27p06j373j773
56540B33234k496k762j812o39n24j130j571k061k787k736j413l13p44j623j292
56525B09331j70L72L69M90K36r88k179k228j948k615l586l462k534k017j833j250
56509A85988p11r96j475j182p42j179j813j350k33J34k70m45l34n13o99l29Q0
56492A73931j22k79L95J135Q28k5k63j9l4k8O10J456J908K307K785K448J180O44
56474A88857J701K694K164J374J872K549J737M57N97J396Q84m42n52M73P77M9
$$ plain form
56458 206587 206185 205841 205255 204406 204076 204282 203797 202240 201104 201674 203475 205619 207997 210131 210648 209130
56442 209130 207011 205545 204377 203106 202515 203033 203514 202860 201495 200110 198429 196422 195280 195808 196963
56427 196963 197164 196019 193902 191062 188033 185611 183481 180078 174569 167759 160427 152275 143169 133741
56413 133741 124017 113116 101118 89572 79438 70413 63146 60044 62700 70282 81486 96043 113045
56400 113045 129822 144180 156289 167140 176754 185062 192842 200393 206885 212129 217363 223172 228406
56387 228406 232295 235777 239593 242976 245413 247718 250179 251849 252922 255507 260549 266338 271715 278265
56373 278265 287287 296900 304425 309665 313675 316255 316967 316888 317029 316552 314537 311860 309341 305939 300988
56358 300988 296419 294405 294369 294620 295188 296710 298218 298606 298908 300610 303012 304611 305749 307540 309496 310588
$$ packed form
56458B06587m02l44n86q49l30K06m85j557j136N70J801K144K378K134N17j518
56442B09130k119j466j168j271n91N18M81o54j365j385j681k007j142N28J155
56427A96963K01j145k117k840l029k422k130l403n509o810p332q152r106r428
56413A33741r724j0901j1998j1546j0134r025p267l102K656P582J1204J4557J7002
56400A13045J6777J4358J2109J0851R614Q308P780P551O492N244N234N809N234
56387B28406L889L482L816L383K437K305K461J670J073K585N042N789N377O550
56373B78265R022R613P525N240M010K580P12p9J41m77k015k677k519l402m951
56358C00988m569k014l6K51N68J522J508L88L02J702K402J599J138J791J956J092
$$ plain form
56342 310588 311338 312560 313414 313097 313122 315453 319679 324387 329914 337213 345323 352689 359876 368366 377728
56327 377728 386488 394746 403420 412014 419649 427231 435984 444825 451727 456720 461070 464632 466609 467918
56313 467918 470060 472490 473650 473687 473634 472952 470598 467603 465820 464904 463163 460601 458567 457214 455948 455533
56297 455533 457089 459790 462159 464754 468969 474202 479012 484124 491350 500303 509105 517656 527306 538023
56283 538023 548799 560187 573542 588399 603528 619910 639626 662386 686215 711070 738693
56272 738693 769324 801691 836083 874463 917684 965338 1018079 1077331 1143003 1214174 1291728
56261 1291728 1377672 1472340 1574895 1685905 1806564 1935943 2071871 2213804 2361809 2513360
56251 2513360 2664256 2812062 2955477 3090970 3213533 3320499 3411407 3484624 3537568 3570170
$$ packed form
56342C10588P50J222Q54l17K5K331M226M708N527P299Q110P366P187Q490R362
56327C77728Q760Q258Q674Q594P635P582Q753Q841O902M993M350L562J977J309
56313D67918K142K430J160L7n3o82k354k995j783r16j741k562k034j353j266m15
56297D55533J556K701K369K595M215N233M810N112P226Q953Q802Q551R650J0717
56283E38023J0776J1388J3355J4857J5129J6382J9716K2760K3829K4855K7623
56272G38693L0631L2367L4392L8380M3221M7654N2741N9252O5672P1171P7554
56261A291728Q5944R4668J02555J11010J20659J29379J35928J41933J48005J51551
56251B513360J50896J47806J43415J35493J22563J06966R0908P3217N2944L2602
$$ plain form
56241 3570170 3584811 3582983 3565227 3534034 3493389 3445409 3390466 3330314 3267753 3203472 3136460
56230 3136460 3067191 2997024 2924819 2847805 2765644 2680122 2591150 2496906 2397920 2297185 2196030
56219 2196030 2093601 1990593 1889790 1792590 1698555 1608578 1524804 1447205 1373911 1305141 1243053
56208 1243053 1187460 1135646 1086890 1043215 1005073 970099 937002 907013 880682 856759 834949
56197 834949 816319 800324 784888 769979 757666 748193 739551 731352 725376 721835 718942 716697 717141
56184 717141 720134 722838 724299 726767 731618 737702 744503 753084 762931 771645 778705 785991 793837 800248
56170 800248 804701 808883 812963 815089 815298 815921 817370 817578 816381 816255 817874 819213 819999 822736 828258
56155 828258 834561 841146 850149 862047 874644 887543 903258 922650 943754 966419 993612 1026706
$$ packed form
56241C570170J4641j828j7756l1193m0645m7980n4943o0152o2561o4281o7012
56230C136460o9269p0167p2205p7014q2161q5522q8972r4244r8986j00735j01155
56219B196030j02429j03008j00803r7200r4035q9977q3774p7599p3294o8770o2088
56208A243053n5593n1814m8756m3675l8142l4974l3097k9989k6331k3923k1810
56197H34949j8630j5995j5436j4909j2313r473q642q199n976l541k893k245M44
56184G17141K993K704J461K468M851O084O801Q581R847Q714P060P286P846O411
56170H00248M453M182M080K126K09O23J449K08j197j26J619J339P86K737N522
56155H28258O303O585R003J1898J2597J2899J5715J9392K1104K2665K7193L3094
$$ plain form
56143 1026706 1063940 1105046 1153087 1210415 1277377 1356247 1451460 1564241 1691555 1831731 1985952
56132 1985952 2152243 2322961 2490459 2650712 2799875 2932928 3048701 3151692 3246151 3332228
56122 3332228 3409535 3479263 3540027 3586223 3613530 3622555 3615396 3593082 3558230 3515117 3464226 3400637
56110 3400637 3319881 3221518 3105917 2972921 2825947 2672549 2518764 2367278 2222175 2089543
56100 2089543 1971266 1863877 1765735 1679646 1606354 1541785 1483497 1433721 1393074 1357358 1323808
56089 1323808 1294606 1271016 1250075 1230362 1214964 1205184 1197274 1188910 1182915 1181011 1180011 1177945 1177815
56076 1177815 1181422 1185618 1188560 1193505 1202478 1212387 1221384 1232636 1247633 1262305 1274089 1286327 1301304
56063 1301304 1315730 1327701 1341190 1358707 1376352 1391206 1406752 1425767 1444800 1461109 1478169
$$ packed form
56143A026706L7234M1106M8041N7328O6962P8870R5213J12781J27314J40176J54221
56132A985952J66291J70718J67498J60253J49163J33053J15773J02991R4459Q6077
56122C332228P7307O9728O0764M6196K7307R025p159k2314l4852m3113n0891o3589
56110C400637q0756r8363j15601j32996j46974j53398j53785j51486j45103j32632
56100B089543j18277j07389r8142q6089p3292o4569n8288m9776m0647l5716l3550
56089A323808k9202k3590k0941j9713j5398r780p910q364n995j904j000k066j30
56076A177815L607M196K942M945Q973R909Q997J1252J4997J4672J1784J2238J4977
56063A301304J4426J1971J3489J7517J7645J4854J5546J9015J9033J6309J7060
$$ plain form
56052 1478169 1498758 1519485 1537776 1557311 1580871 1604869 1626804 1650889 1680255 1710900 1739467
56041 1739467 1769558 1803938 1838055 1867952 1897156 1929125 1960637 1989409 2020223 2056368 2093148
56030 2093148 2127174 2163748 2207431 2253861 2298848 2346872 2402064 2459464 2513984 2569421 2629696
56019 2629696 2689993 2745783 2801844 2863044 2925317 2985304 3049393 3123137 3201288 3278630 3360720
56008 3360720 3453134 3550367 3646782 3748078 3860069 3976817 4092325 4213117 4346237 4485977
55998 4485977 4626053 4773482 4936097 5107943 5282027 5465680 5667581 5881523 6099400
55989 6099400 6328115 6576738 6839633 7110113 7397742 7713424 8050769 8401730 8776691
55980 8776691 9188688 9632551 10101496 10608985 11171101 11783445 12440080 13158431 13959297
$$ packed form
56052A478169K0589K0727J8291J9535K3560K3998K1935K4085K9366L0645K8567
56041A739467L0091L4380L4117K9897K9204L1969L1512K8772L0814L6145L6780
56030B093148L4026L6574M3683M6430M4987M8024N5192N7400N4520N5437O0275
56019B629696O0297N5790N6061O1200O2273N9987O4089P3744P8151P7342Q2090
56008C360720R2414R7233R6415J01296J11991J16748J15508J20792J33120J39740
55998D485977J40076J47429J62615J71846J74084J83653K01901K13942K17877
55989F099400K28715K48623K62895K70480K87629L15682L37345L50961L74961
55980H776691M11997M43863M68945N07489N62116O12344O56635P18351Q00866
$$ plain form
55971 13959297 14840383 15797948 16855881 18043626 19366418 20830643 22477061 24354018
55963 24354018 26483103 28891759 31654412 34859748 38571023 42873123 47930014 53944725
55955 53944725 61110967 69684894 80075112 92801201 108445166 127760016 151704082
55948 151704082 181060829 215858517 255140507 297053650 338671243 375616534 402541082
55941 402541082 414998385 411511142 394036846 366568486 333308102 297706151 262329639
55934 262329639 228920347 198448481 171307431 147576688 127145516 109731648 94960272
55927 94960272 82477249 71966998 63110404 55604046 49215192 43770456 39105485 35069827
55919 35069827 31563395 28520879 25867917 23527504 21454925 19627740 18009792 16557372
$$ packed form
55971A3959297Q81086R57565J057933J187745J322792J464225J646418J876957
55963B4354018K129085K408656K762653L205336L711275M302100N056891O014711
55955E3944725P166242Q573927J0390218J2726089J5643965J9314850K3944066
55948A51704082K9356747L4797688L9281990M1913143M1617593L6945291K6924548
55941D02541082J2457303l487243j7474296k7468360l3260384l5601951l5376512
55934B62329639l3409292l0471866k7141050k3730743k0431172j7413868j4771376
55927I4960272j2483023j0510251q856594p506358o388854n444736m664971m035658
55919C5069827l506432l042516k652962k340413k072579j827185j617948j452420
$$ plain form
55911 16557372 15250418 14085078 13042954 12096429 11236131 10465015 9771917 9136663 8554612
55902 8554612 8031407 7559446 7122597 6718305 6352854 6020327 5707451 5413960 5147785
55893 5147785 4905021 4674281 4456029 4258514 4078892 3906759 3742325 3593254 3457201
55884 3457201 3324760 3196325 3079433 2972469 2867113 2764058 2670834 2586619 2504141 2424073
55874 2424073 2352975 2289251 2225187 2160823 2102314 2048787 1994049 1939200 1890497 1846593 1800542
55863 1800542 1752703 1709367 1670406 1630422 1590501 1556773 1528618 1499861 1470554 1446505 1428390
55852 1428390 1412200 1399079 1393735 1393964 1392086 1385714 1377197 1364136 1341097 1309777 1277277 1245180
55840 1245180 1210031 1173293 1140486 1111259 1080299 1047508 1017588 990248 960642 929173 901246
$$ packed form
55911A6557372j306954j165340j042124r46525q60298p71116o93098o35254n82051
55902H554612n23205m71961m36849m04292l65451l32527l12876k93491k66175
55893E147785k42764k30740k18252j97515j79622j72133j64434j49071j36053
55884C457201j32441j28435j16892j06964j05356j03055r3224q4215q2478q0068
55874B424073p1098o3724o4064o4364n8509n3527n4738n4849m8703m3904m6051
55863A800542m7839m3336l8961l9984l9921l3728k8155k8757k9307k4049j8115
55852A428390j6190j3121n344K29j878o372q517j3061k3039l1320l2500l2097
55840A245180l5149l6738l2807k9227l0960l2791k9920k7340k9606l1469k7927
$$ plain form
55829 901246 877457 853334 828636 807705 790702 773515 756280 742996 732723 720127 704937
55818 704937 692061 682147 670842 657748 647300 640113 632086 622918 617054 615189 613029 609501 608185
55805 608185 609440 609123 606419 605252 606518 606359 603534 601171 599786 595711 587961 579693 571491 560164
55791 560164 545674 532368 521680 510271 496993 485062 475602 465530 453814 443663 436654 430575
55779 430575 424822 422084 422824 423616 422495 420569 417151 409141 396720 383953 372347 359415 344929
55766 344929 332595 323803 315564 306594 299737 296225 292947 287619 281694 276096 269125 260669 253717 249597
55752 249597 246113 242030 238904 237024 234270 230548 228593 228828 228220 225699 223876 223814 223097 220845 219601
55737 219601 220220 219789 216792 213776 212724 212252 211468 212115 214618 216296 215708 214727 214330 212543 208565 204730
$$ packed form
55829I01246k3789k4123k4698k0931j7003j7187j7235j3284j0273j2596j5190
55818G04937j2876r914j1305j3094j0448p187q027r168n864j865k160l528j316
55805F08185J255l17k704j167J266j59k825k363j385m075p750q268q202j1327
55791E60164j4490j3306j0688j1409j3278j1931r460j0072j1716j0151p009o079
55779D30575n753k738P40P92j121j926l418q010j2421j2767j1606j2932j4486
55766C44929j2334q792q239q970o857l512l278n328n925n598o971q456o952m120
55752B49597l484m083l126j880k754l722j955K35o08k521j823o2p17k252j244
55737B19601O19m31k997l016j052m72p84O47K503J678n88r81l97j787l978l835
$$ plain form
55721 204730 202208 198873 193578 188538 185250 182058 177971 175024 174540 174798 174570 175314 177727 179858 180869
55706 180869 183061 187956 193848 199269 205370 212734 219375 224084 228367 233037 236365 237671 239194 242115
55692 242115 244214 243740 242280 241498 240248 237300 233823 230893 227515 223312 220227 219440 219486 219393 220690 224381
55676 224381 228957 233301 238425 244461 249217 251826 254495 258457 261448 261547 260290 259552 258519 256281 254336
55661 254336 253782 252831 249897 246584 244997 244488 243569 242662 242537 242316 241303 240576 240642 239816 236893 232979 228738
55644 228738 222573 213604 203802 194895 185846 175621 165750 157760 150762 143974 138882 136189 133352 128016
55630 128016 121597 116663 113036 109309 105965 103992 102363 99840 97480 96593 95928 93678 90670 88833 87987
55615 87987 86765 85270 84252 82968 80383 77318 75164 73636 71875 70431 70087 70018 69170 68163 67960 67987
$$ packed form
55721B04730k522l335n295n040l288l192m087k947m84K58k28P44K413K131J011
55706A80869K192M895N892N421O101P364O641M709M283M670L328J306J523K921
55692B42115K099m74j460p82j250k948l477k930l378m203l085p87M6r3J297L691
55676B24381M576M344N124O036M756K609K669L962K991R9j257p38j033k238j945
55661B54336n54r51k934l313j587n09r19r07j25k21j013p27O6q26k923l914m241
55644B28738o165q969r802q907r049j0225r871p990o998o788n092k693k837n336
55630A28016o419m934l627l727l344j973j629k523k360q87o65k250l008j837q46
55615H7987j222j495j018j284k585l065k154j528j761j444l44o9q48j007k03K7
$$ plain form
55599 67987 67408 66826 66974 67181 66816 66626 66985 66615 64836 63234 63204 63707 63388 62947 63377 63727 62857 61662
55581 61662 61375 61415 60991 61000 62056 62545 61118 59372 59551 61099 62078 62576 64082 66629 69098 71436 74292
55564 74292 77324 79905 82544 85743 88523 89825 90240 90690 90787 90160 89809 90287 90139 88123 85352 83273
55548 83273 81200 78042 74779 72906 71939 70768 70051 70943 72832 74632 76908 80393 83823 85679 86844
55533 86844 89112 92234 94714 96314 97531 97815 96589 94752 92995 90038 84803 78806 73872 68979 62068
55518 62068 53563 45226 36860 27250 17405 9766 4886 1729 500 2189 5717 8494 9699 10564 11679
55503 11679 12450 12941 13936 15359 16683 18494 21632 25319 28121 30142 32255 34098 35042 36201 38991
55488 38991 42512 44965 47009 51151 58387 68055 80308 95764 112851 128302 140385 149283 154578
$$ packed form
55599F7987n79n82J48K07l65j90L59l70j779j602l0N03l19m41M30L50q70j195
55581F1662k87M0m24RJ056M89j427j746J79J548R79M98J506K547K469K338K856
55564G4292L032K581K639L199K780J302M15M50R7o27l51M78j48k016k771k079
55548H3273k073l158l263j873r67j171p17Q92J889J800K276L485L430J856J165
55533H6844K268L122K480J600J217K84j226j837j757k957n235n997m934m893o911
55518F2068q505q337q366r610r845p639m880A729E00J689L528K777J205Q65J115
55503A1679P71M91R95J423J324J811L138L687K802K021K113J843R44J159K790
55488C8991L521K453K044M142P236R668J2253J5456J7087J5451J2083Q898N295
$$ plain form
55475 154578 155072 151193 145016 137552 128227 117231 106154 95991 86485 77680 70238 64077 58440 53356
55461 53356 49381 46070 42430 38701 35958 34281 33052 32574 33451 34793 35112 34644 34691 35044 34277 32381
55445 32381 30872 30327 29948 29509 29633 30137 30097 29619 29671 30233 30439 30300 30366 30010 28221 25869 24938 25520 25776
55426 25776 24923 24137 24344 25178 26315 27839 29129 29311 28915 29246 30096 30046 29027 28497 28940 29242 28760 28058
55408 28058 27402 26442 25657 26210 28082 30098 31923 34190 36590 37768 37381 36440 35417 33821 31774 30118
55392 30118 28761 26670 23729 20909 18590 16481 15110 15377 16595 17071 16740 17088 18306 18796 17975 17354
55376 17354 18133 19568 20404 20258 19103 17042 15029 14208 14185 13547 12222 11508 11679 11545 10781 10641 11791
55359 11791 13265 14171 14782 15430 15883 16251 16962 17616 17456 17026 17577 18787 19039 18101 17386 17378 17061 16310 16433
$$ packed form
55475A54578M94l879o177p464r325j0996j1077j0163r506q805p442o161n637n084
55461E3356l975l311l640l729k743j677j229m78Q77J342L19m68M7L53p67j896
55445C2381j509n45l79m39J24N04m0m78N2N62K06j39O6l56j789k352r31N82K56
55426B5776q53p86K07Q34J137J524J290J82l96L31Q50n0j019n30M43L02m82p02
55408B8058o56r60p85N53J872K016J825K267K400J178l87r41j023j596k047j656
55392C0118j357k091k941k820k319k109j371K67J218M76l31L48J218M90q21o21
55376A7354P79J435Q36j46j155k061k013q21k3o38j325p14J71j34p64j40J150
55359A1791J474R06O11O48M53L68P11O54j60m30N51J210K52r38p15ql17p51J23
$$ plain form
55340 16433 17668 18460 18092 17858 18603 19195 18593 17559 17156 17140 16977 16958 17271 17369 17061 16947 17091 16715 15741
55321 15741 15106 14990 14468 13526 13552 15011 16396 16481 15962 15877 15998 15806 15553 15355 14625 13392 12821 13500 14496
55302 14496 14931 15146 15516 15518 14857 14184 13889 13465 12829 12831 13682 14267 13876 13259 13177 13286 13280 13709 14761 15560 15531
55281 15531 15261 15242 15081 14701 14951 16215 17702 18801 19796 20582 20278 18874 17767 17743 17927 17602 17454 17996
55263 17996 18318 17586 16406 15566 14783 13827 13579 14743 16603 18134 19283 20204 20413 19769 19142 19113 19063 18471
55245 18471 17911 17843 17621 16726 15869 15830 16268 16610 17056 17810 18422 18748 19414 20568 21378 21529 21867 22705 22987
55226 22987 22134 21251 21333 21709 21461 21047 21094 20848 19339 17156 15658 15205 15305 15741 16465 17115 17547 18056 18431
55207 18431 17885 16602 16047 16869 17808 17707 17206 17355 17914 18326 19046 20512 21867 22121 21641 21274 20978 20470
$$ packed form
55340A6433J235P92l68k34P45N92o02j034m03j6j63j9L13R8l08j14J44l76r74
55321A5741o35j16n22r42K6J459J385Q5n19q5J21j92k53j98p30j233n71O79R96
55302A4496M35K15L70Ko61o73k95m24o36KQ51N85l91o17q2J09oM29J052P99k9
55281A5531k70j9j61l80K50J264J487J099R95P86l04j404j107k4J84l25j48N42
55263A7996L22p32j180q40p83r56k48J164J860J531J149R21K09o44o27k9n0n92
55245A8471n60o8k22q95q57l9M38L42M46P54O12L26O66J154Q10J51L38Q38K82
55226B2987q53q83Q2L76k48m14M7k46j509k183j498m53J00M36P24O50M32N09L75
55207A8431n46j283n55Q22R39j01n01J49N59M12P20J466J355K54m80l67k96n08
$$ plain form
55189 20470 20231 20614 20918 20535 20079 20301 20851 21211 21806 23032 24221 24704 24897 25255 25268 24553 23796 23504 23074
55170 23074 22204 21877 22690 23624 23818 24105 25238 26095 25446 24193 23915 24354 24333 24104 24620 25307 24778 23321
55152 23321 22622 23248 24196 24715 24914 24726 23797 22348 20958 19710 18572 18084 18573 19293 19535 19878 21131
55135 21131 22848 24224 25610 27654 29759 30944 31554 32529 33620 33983 33941 34520 35720 36843 38019 39816
55119 39816 41736 42686 42547 41861 40515 38282 36141 35337 35517 35384 34745 34304 33900 32790 31394 30919 31387
55102 31387 31757 31880 32588 33901 34779 34795 34525 34238 33696 33241 33651 34823 35943 36939 38455 40420 42067
55085 42067 43346 44898 46623 47684 47995 48346 48930 49122 48859 48957 49807 50856 51613 52215 52852 53505 54203 54761
55067 54761 54591 53615 52870 53179 53812 53714 53350 53819 54756 54907 54375 54361 54802 54294 52594 51240 51210 51665 51616 51357
$$ packed form
55189B0470k39L83L04l83m56K22N50L60N95J226J189M83J93L58J3p15p57k92m30
55170B3074q70l27Q13R34J94K87J133Q57o49j253k78M39k1k29N16O87n29j457
55152B3321o99O26R48N19J99j88r29j449j390j248j138m88M89P20K42L43J253
55135B1131J717J376J386K044K105J185O10R75J091L63m2N79J200J123J176J797
55119C9816J920R50j39o86j346k233k141q04J80j33o39m41m04j110j396m75M68
55102C1387L70J23P08J313Q78J6k70k87n42m55M10J172J120R96J516J965J647
55085D2067J279J552J725J061L11L51N84J92k63R8Q50J049P57O02O37O53O98N58
55067E4761j70r76p45L09O33r8l64M69R37J51n32j4M41n08j700j354l0M55m9k59
$$ plain form
55047 51357 51498 51836 51897 51671 51293 50820 50611 51060 51772 51814 50903 49512 47904 46138 44982 45567 47874 50552
55029 50552 52418 53265 53257 52613 52035 52417 53895 55906 58084 60223 61660 61793 61175 60979 61490 62122 62741 63796
55011 63796 65224 66425 67233 67805 67634 65966 63174 60548 58702 57290 56177 55615 55295 54491 53231 52191
54995 52191 51448 50529 49584 49279 49569 49827 50099 50880 51719 51464 50012 48528 47856 47919 48626 50050 51698 52980
54977 52980 54312 56469 58963 60626 61584 62996 64907 66190 66736 67772 69732 71632 72986 74589 76950
54962 76950 79684 82890 87296 92511 96984 100428 104505 110319 117018 123755 131187 139898 149001 157617
54948 157617 166248 175337 183693 189680 192930 193756 191974 187529 181268 173841 164781 153866 142508 132407
54934 132407 123525 114698 105797 97976 92037 87543 83468 79052 74289 70114 67737 67290 67586 67591 67510 67964
$$ packed form
55047E1357J41L38O1k26l78m73k09M49P12M2r11j391j608j766j156N85K307K678
55029E0552J866Q47qo44n78L82J478K011K178K139J437J33o18j96N11O32O19J055
55011F3796J428J201Q08N72j71j668k792k626j846j412j113n62l20q04j260j040
54995E2191p43r19r45l05K90K58K72P81Q39k55j452j484o72O3P07J424J648J282
54977E2980J332K157K494J663R58J412J911J283N46J036J960J900J354J603K361
54962G6950K734L206M406N215M473L444M077N814O699O737P432Q711R103Q616
54948A57617Q631R089Q356N987L250Q26j782m445o261p427r060j0915j1358j0101
54934A32407q882q827q901p821n939m494m075m416m763m175k377m47K96Nq1M54
$$ plain form
54918 67964 68871 69826 70998 72936 75888 79853 84870 90827 97422 104656 112863 121980 131400 140773 150202
54903 150202 159324 166964 172095 174488 174142 170934 165250 158148 150413 142130 133475 125091 117248 109523
54889 109523 101793 94795 89213 84913 81489 78758 76350 73678 70822 68625 67418 66426 64890 63042
54875 63042 61515 60543 60130 60182 60072 58955 56985 55384 54860 54852 54706 54633 54893 54990 54379 53251 52063 50999
54857 50999 50345 50582 51669 52965 54189 55529 56523 56083 54156 52185 51167 50381 48838 46918 45585 44885
54841 44885 44213 43369 42437 41259 39869 38865 38648 38856 39112 39638 40518 41228 41513 41985 43154 44673 46161
54824 46161 47854 49744 51014 51217 51125 51536 52113 52310 52584 53627 55149 56489 57769 59352 60815 61641
54808 61641 62440 64294 67239 70445 73643 77349 81873 87076 93045 100127 108328 117300 126939 137444
$$ packed form
54918F7964R07R55J172J938K952L965N017N957O595P234Q207R117R420R373R429
54903A50202R122P640N131K393l46l208n684p102p735q283q655q384p843p725
54889A09523p730o998n582m300l424k731k408k672k856k197j207r92j536j848
54875F3042j527r72m13N2j10j117j970j601n24qj46p3K60R7o11j128j188j064
54857E0999o54K37J087J296J224J340R94m40j927j971j018p86j543j920j333p00
54841D4885o72q44r32j178j390j004k17K08K56N26Q80P10K85M72J169J519J488
54824D6161J693J890J270K03r2M11N77J97K74J043J522J340J280J583J463Q26
54808F1641P99J854K945L206L198L706M524N203N969P082Q201Q972R639J0505
$$ plain form
54794 137444 148832 160710 172375 182841 191102 196678 199642 200002 197624 192882 186748 179964 172773
54781 172773 165586 158999 152842 146245 139128 132610 127471 123207 119246 115979 113804 112170 110511 109273
54767 109273 109085 109721 110760 112495 115222 118406 121502 124948 129425 134877 141181 149003 158900 170188
54753 170188 181755 193458 205743 218384 230474 241118 249295 253805 254333 251997 247814 241323 231762
54740 231762 219897 207445 195218 183078 171348 160915 152067 144270 137010 130067 123254 116736 111256
54727 111256 107245 104053 100851 97772 95330 93272 91045 88820 87046 85446 83575 81907 81206 81190 80978
54712 80978 80529 80449 80633 80307 79268 77982 76609 75037 73802 73815 75134 76858 78251 79156 79508 79395 79456
54695 79456 80316 81657 82647 83125 83547 83972 84006 83574 82992 82418 82032 82399 83811 85577 86843 87706 88623 89205
$$ packed form
54794A37444J1388J1878J1665J0466Q261N576K964L60k378m742o134o784p191
54781A72773p187o587o157o597p117o518n139m264l961l267k175j634j659j238
54767A09273j88O36J039J735K727L184L096L446M477N452O304P822R897J1288
54753A70188J1567J1703J2285J2641J2090J0644Q177M510N28k336m183o491r561
54740B31762j1865j2452j2227j2140j1730j0433q848p797p260o943o813o518n480
54727A11256m011l192l202l079k442k058k227k225j774j600j871j668p01j6k12
54712H0978m49q0J84l26j039j286j373j572j235J3J319J724J393R05L52j13O1
54695G9456Q60J341R90M78M22M25L4m32n82n74l86L67J412J766J266Q63R17N82
$$ plain form
54677 89205 88795 87898 87779 88834 90559 92907 96289 100272 103642 105964 107852 109574 110717 111518 113208
54662 113208 116394 120132 123185 125362 127045 128262 129031 130086 132498 136582 141512 145985 149276 151892
54648 151892 155192 160125 166455 173385 180624 188351 196491 204611 212361 219419 225160 228938 230608 230331
54634 230331 228036 223576 217174 209331 200524 191372 182622 174523 166683 159054 152397 147159 142541 137526
54620 137526 132232 127393 123166 119416 116585 115071 114135 112603 110369 108171 106238 104339 102822 102316 102534
54605 102534 102549 102178 101913 101608 100459 98351 96076 94112 92219 90314 88690 87241 85487 83446 81597
54590 81597 79924 77925 75523 73101 70725 68308 66437 65885 66331 66644 66434 66207 66034 65369 64256 63489
54574 63489 63269 62918 62253 62082 62971 64466 65882 66866 67004 65952 64347 63503 63730 63882 62960 61283 59699
$$ packed form
54677H9205m10q97j19J055J725K348L382L983L370K322J888J722J143Q01J690
54662A13208L186L738L053K177J683J217P69J055K412M084M930M473L291K616
54648A51892L300M933O330O930P239P727Q140Q120P750P058N741L778J670k77
54634B30331k295m460o402p843q807r152q750q099p840p629o657n238m618n015
54620A37526n294m839m227l750k831j514r36j532k234k198j933j899j517n06K18
54605A02534J5l71k65l05j149k108k275j964j893j905j624j449j754k041j849
54590H1597j673j999k402k422k376k417j871n52M46L13k10k27j73o65j113p67
54574F3489k20l51o65j71Q89J495J416R84J38j052j605q44K27J52r22j677j584
$$ plain form
54557 59699 58624 58294 59007 60523 61992 63023 64166 65958 68202 70539 72937 75185 76665 77200 77548
54542 77548 78558 80282 82204 83883 85173 86362 88261 91607 96180 101049 105678 110168 114373 117679
54528 117679 119848 121298 122309 122672 122317 121521 120255 118056 114881 111403 108165 105040 101779 98492 95345
54513 95345 92320 89424 86682 83901 80986 78379 76547 75175 73639 72097 71209 70866 70286 69346 68713 68498
54497 68498 67955 66807 65823 65738 66480 67762 69501 71324 72619 73395 74275 75377 76135 76402 76712 77196 77328
54480 77328 77107 77351 78300 79032 78822 78116 77569 77099 76540 76336 76802 77460 77756 77808 77883 77806 77399 76847 76227 75324
54460 75324 74363 74028 74305 74163 73002 71582 70869 70722 70469 70104 70053 70228 70074 69277 67934 66336 64924 64084
54442 64084 63725 63429 63158 63214 63442 63254 62628 62279 62608 63313 64230 65511 66672 66632 65269 63875 63432 63468 63334
$$ packed form
54557E9699j075l30P13J516J469J031J143J792K244K337K398K248J480N35L48
54542G7548J010J724J922J679J290J189J899L346M573M869M629M490M205L306
54528A17679K169J450J011L63l55p96j266k199l175l478l238l125l261l287l147
54513I5345l025k896k742k781k915k607j832j372j536j542q88l43n80r40o33k15
54497F8498n43j148r84q5P42J282J739J823J295P76Q80J102P58K67L10M84J32
54480G7328k21K44R49P32k10p06n47m70n59k04M66O58K96N2P5p7m07n52o20r03
54460G5324r61l35K77j42j161j420p13j47k53l65n1J75j54p97j343j598j412q40
54442F4084l59k96k71N6K28j88o26l49L29P05R17J281J161m0j363j394m43L6j34
$$ plain form
54423 63334 63547 64849 66748 68097 68622 68996 69781 71024 72554 74065 75232 76188 77433 78939 79999 80345
54407 80345 80689 81644 82908 84094 85542 87542 89458 90526 91016 91874 93566 95906 98533 100942 102487
54392 102487 102968 102955 103096 103501 104051 104658 104851 103891 101845 99857 98819 98421 98007 97558 97193 96528 95320 94108
54374 94108 93382 92694 91373 89595 88029 86861 85870 85026 84332 83532 82578 81964 82015 82281 82171 81705 81163 80562
54356 80562 79976 79791 80153 80722 81435 82802 84984 87336 89394 91520 93948 96112 97633 99085 100981 102812
54340 102812 103929 104601 105310 105817 105841 105891 106406 106808 106483 105965 105982 105937 104561 101690 98278 95113 92535 90907
54322 90907 90162 89217 87005 83860 80875 78265 75475 72570 70284 68801 67544 66206 65064 64340 64015
54307 64015 64128 64508 64555 64025 63580 63698 63566 62224 60315 59388 59670 59840 59007 57626 56395 55428 54794 54784
$$ packed form
54423F3334K13J302J899J349N25L74P85J243J530J511J167R56J245J506J060L46
54407H0345L44R55J264J186J448K000J916J068M90Q58J692K340K627K409J545
54392A02487M81j3J41M05N50O07J93r60k046j988j038l98m14m49l65o65j208j212
54374I4108p26o88j321j778j566j168r91q44o94q00r54o14N1K66j10m66n42o01
54356H0562n86j85L62N69P13J367K182K352K058K126K428K164J521J452J896J831
54340A02812J117O72P09N07K4N0N15M02l25n18J7m5j376k871l412l165k578j628
54322I0907p45r45k212l145k985k610k790k905k286j483j257j338j142p24l25
54307F4015J13L80M7n30m45J18j32j342j909r27K82J70q33j381j231r67o34j0
$$ plain form
54289 54784 55282 55707 55818 55894 55980 55720 55073 54500 54278 54246 54273 54366 54344 54044 53834 54258 55182 55901 56070 55882 55524
54268 55524 55106 54991 55380 55661 54966 53379 51847 50903 50283 49787 49664 49999 50480 51000 51833 53034 54237 55267
54250 55267 56370 57638 58667 58987 58581 57883 57492 57845 58930 60340 61743 63032 63940 64059 63591 63467 64168
54233 64168 65017 65186 64872 64661 64354 63402 62151 61590 61932 62312 61868 60507 58729 57343 57107 57939 58693 58443
54215 58443 57724 57772 58840 60071 60727 60693 60013 58893 57994 57830 57913 57354 56179 55265 55092 55401 55960 56783 57664
54196 57664 58279 58711 59189 59470 59262 58975 59206 59753 60105 60607 62065 64281 66122 67047 67501 67760 67433 66320
54178 66320 64855 63506 62507 62180 62682 63455 63745 63657 63832 64228 64194 63679 63264 63039 62600 62253 62955 64833 66810
54159 66810 67995 68400 68121 67030 65670 65261 66197 67443 67976 67985 68157 68665 69422 70550 71894 72755 72738 72369
$$ packed form
54289E4784M98M25J11P6Q6k60o47n73k22l2K7R3k2l00k10M24R24P19J69j88l58
54268E5524m18j15L89K81o95j587j532r44o20m96j23L35M81N20Q33J201J203J030
54250E5267J103J268J029L20m06o98l91L53J085J410J403J289R08J19m68j24P01
54233F4168Q49J69l14k11l07r52j251n61L42L80m44j361j778j386k36Q32P54k50
54215E8443p19M8J068J231O56l4o80j120q99j64Q3n59j175r14j73L09N59Q23Q81
54196E7664O15M32M78K81k08k87K31N47L52N02J458K216J841R25M54K59l27j113
54178F6320j465j349r99l27N02P73K90q8J75L96l4n15m15k25m39l47P02J878J977
54159F6810J185M05k79j091j360m09R36J246N33RJ72N08P57J128J344Q61j7l69
$$ plain form
54141 72369 72337 72539 72351 71472 70143 68880 68225 68420 69116 69701 69955 69991 69677 68736 67424 66441 66050 65844 65423
54122 65423 64739 63843 62904 62422 62680 63022 62448 60904 59230 57878 56524 54968 53496 52261 51151 50398
54106 50398 50487 51320 52263 53043 53806 54338 54200 53646 53419 53552 53398 52902 52738 53036 53170 53024 53296 54204 55094
54087 55094 55723 56729 58307 59560 59824 59646 59805 60250 60624 60963 61327 61512 61606 62014 62542 62436 61758 61631
54069 61631 62514 63335 63105 62430 62538 63651 65179 66778 68342 69554 70278 70880 71531 71821 71624 71642 72419 73497
54051 73497 74304 75176 76721 78743 80609 82205 83805 85393 86788 88094 89489 90964 92628 94768 97252
54036 97252 99529 101622 104347 108069 112091 115923 120274 125990 132684 139253 145086 150045 153939 156962
54022 156962 160100 164168 168836 173287 177336 181188 184638 187349 189461 191165 192233 192744 193644 195594 197745
$$ packed form
54141G2369l2K02j88q79j329j263o55J95O96N85K54L6l14r41j312r83l91k06m21
54122F5423o84q96r39m82K58L42n74j544j674j352j354j556j472j235j110p53
54106E0398Q9Q33R43P80P63N32j38n54k27J33j54m96j64K98J34j46K72R08Q90
54087E5094O29J006J578J253K64j78J59M45L74L39L64J85R4M08N28j06o78j27
54069F1631Q83Q21k30o75J08J113J528J599J564J212P24O02O51K90j97J8P77J078
54051G3497Q07Q72J545K022J866J596J600J588J395J306J395J475J664K140K484
54036I7252K277K093K725L722M022L832M351N716O694O569N833M959L894L023
54022A56962L138M068M668M451M049L852L450K711K112J704J068N11R00J950K151
$$ plain form
54007 197745 198659 198087 196865 195423 193483 191034 188465 185698 182190 177983 174017 171098 169078 167125 164486
53992 164486 161039 157460 154772 153395 152798 152233 151421 150249 148436 146004 143584 141674 140069 138607 137826
53977 137826 138029 138251 137185 134961 133018 132281 132333 132342 131992 131283 130132 128525 126737 125190 124194 123737 123410
53960 123410 122772 122004 121843 122634 123850 124872 125773 126899 128186 129437 130820 132504 134188 135605 137131
53945 137131 139266 141828 144324 146840 149917 153738 158029 162556 167166 171535 175401 178834 181806 183800
53931 183800 184433 184218 184084 184310 184421 183893 182477 180152 177336 174948 173712 173597 174353 176143 179041 182331
53915 182331 185173 187790 191247 196124 202020 208274 214483 220390 225919 231422 237400 243899 250478 256712
53901 256712 262411 267506 272009 275918 278905 280445 280508 279745 278647 277042 274805 272466 270449 268225 264972
$$ packed form
54007A97745R14n72j222j442j940k449k569k767l508m207l966k919k020j953k639
53992A64486l447l579k688j377n97n65q12j172j813k432k420j910j605j462p81
53977A37826K03K22j066k224j943p37N2Rl50p09j151j607j788j547r96m57l27
53960A23410o38p68j61P91J216J022R01J126J287J251J383J684J684J417J526
53945A37131K135K562K496K516L077L821M291M527M610M369L866L433K972J994
53931A83800O33k15j34K26J11n28j416k325k816k388j236j15P56J790K898L290
53915A82331K842K617L457M877N896O254O209N907N529N503N978O499O579O234
53901B56712N699N095M503L909K987J540O3p63j098j605k237k339k017k224l253
$$ plain form
53886 264972 260681 255929 250906 245430 239636 233850 228007 221870 215602 209453 203220 196778 190812 186092
53872 186092 182210 177998 173204 168844 165749 163531 161198 158162 154492 150738 147668 145669 144237 142414
53858 142414 139815 136907 134296 132095 129954 127408 124266 120911 118058 115940 114019 111764 109413 107618
53844 107618 106713 106691 107376 108146 107981 106460 104334 102502 100889 99029 97287 96589 97165 98370 99518 100192
53828 100192 100033 99102 98259 98344 99069 99472 99303 99169 99441 99839 100056 100066 99917 99904 100733 102678 104841 106087 106532
53809 106532 107099 107853 107964 107364 107160 108117 109830 111823 114434 118004 121991 125578 128692 131925 135767 140304
53793 140304 145332 150494 155578 160719 166009 170943 174831 177788 180731 184289 188238 192117 195768 199036
53779 199036 201505 202903 203510 203896 204430 205091 205556 205532 205179 204999 204978 204202 201801 198085 194194 190883 188179
$$ packed form
53886B64972m291m752n023n476n794n786n843o137o268o149o233o442n966m720
53872A86092l882m212m794m360l095k218k333l036l670l754l070j999j432j823
53858A42414k599k908k611k201k141k546l142l355k853k118j921k255k351j795
53844A07618r05k2O85P70j65j521k126j832j613j860j742o98N76J205J148O74
53828A00192j59r31q43Q5P25M03j69j34K72L98K17J0j49j3Q29J945K163J246M45
53809A06532N67P54J11o00k04R57J713J993K611L570L987L587L114L233L842M537
53793A40304N028N162N084N141N290M934L888K957K943L558L949L879L651L268
53779A99036K469J398O07L86N34O61M65k4l53j80k1p76k401l716l891l311k704
$$ plain form
53762 188179 185926 183843 181261 177644 173472 169909 167552 166131 165264 164742 164080 162692 160687 158804 157387
53747 157387 156049 154454 152765 151192 149750 148602 148012 147830 147542 146926 146088 144883 143025 140883 139434
53732 139434 139160 139509 139615 139074 137960 136595 135386 134420 133278 131784 130721 131020 132369 133520 134041 134791
53716 134791 136481 138630 140344 141413 142252 143259 144509 145634 145990 145490 145222 146428 148866 151083 152395
53701 152395 153580 155293 156897 157549 157588 158112 159683 162094 165028 168309 171732 175020 177842 179767 180566
53686 180566 180659 180834 181418 182176 183054 184374 186166 187989 189642 191443 193487 195215 196022 195857 195081 194253 194130
53669 194130 195171 196830 197999 198411 198903 199987 200898 200553 198852 196605 194706 193763 193979 194850 195368 195005
53653 195005 194322 194303 195333 196933 198142 198069 196561 194542 193294 193263 193920 194724 195594 196455 197026 197268 197401 197339
$$ packed form
53762A88179k253k083k582l617m172l563k357j421q67n22o62j388k005j883j417
53747A57387j338j595j689j573j442j148n90j82k88o16q38j205j858k142j449
53732A39434k74L49J06n41j114j365j209r66j142j494j063K99J349J151N21P50
53716A34791J690K149J714J069Q39J007J250J125L56n00k68J206K438K217J312
53701A52395J185J713J604O52L9N24J571K411K934L281L423L288K822J925P99
53686A80566R3J75N84P58Q78J320J792J823J653J801K044J728Q07j65p76q28j23
53669A94130J041J659J169M12M92J084R11l45j701k247j899r43K16Q71N18l63
53653A95005o83j9J030J600J209p3j508k019j248l1O57Q04Q70Q61N71K42J33o2
$$ plain form
53635 197339 196765 195845 195152 194742 194127 193352 193214 194091 195434 196757 198281 200147 201886 203264 204837 207015
53619 207015 209294 211086 212606 214259 215761 216681 217370 218555 220354 222407 224674 227401 230455 233350 235928
53604 235928 238578 241796 245720 250014 254092 257682 261205 265279 269907 274583 279090 283456 287170 289485
53590 289485 290780 292666 296169 300610 304770 308399 311910 315361 318446 321006 322884 323855 324260 325117 326882
53575 326882 328638 329243 328781 328181 327884 327721 327696 328004 328467 328746 328990 329613 330476 330937 330643 329871 329114 328700 328652
53556 328652 328610 328070 326998 325932 325196 324415 323159 321678 320524 319856 319562 319771 320667 321997 323240 324153 324898
53539 324898 325783 327089 328841 330602 331863 332800 334143 336107 338119 339910 342109 345256 348879 352182 355110
53524 355110 358112 361403 365088 369547 374926 380640 386117 391727 398289 405906 413950 422022 430287 438997
$$ packed form
53635A97339n74r20o93m10o15p75j38Q77J343J323J524J866J739J378J573K178
53619B07015K279J792J520J653J502R20O89J185J799K053K267K727L054K895K578
53604B35928K650L218L924M294M078L590L523M074M628M676M507M366L714K315
53590B89485J295J886L503M441M160L629L511L451L085K560J878R71M05Q57J765
53575C26882J756O05m62o00k97j63k5L08M63K79K44O23Q63M61k94p72p57m14m8
53556C28652m2n40j072j066p36p81j256j481j154o68k94K09Q96J330J243R13P45
53539C24898Q85J306J752J761J261R37J343J964K012J791K199L147L623L303K928
53524C55110L002L291L685M459N379N714N477N610O562P617Q044Q072Q265Q710
$$ plain form
53510 438997 448254 458194 468938 480402 492446 505032 518050 531315 544984 559541 575054 590900
53498 590900 606676 622909 640464 659595 679956 701113 722691 744498 766873 790336 814558
53487 814558 838283 860763 882560 904459 926348 947838 969228 991012 1012996 1034782 1056613
53476 1056613 1078939 1101601 1124203 1146807 1169508 1191883 1213718 1235627 1257970 1279715 1299522
53465 1299522 1317547 1335038 1352498 1369408 1385468 1400774 1414870 1427017 1437535 1447645 1457666
53454 1457666 1466423 1472795 1476834 1479008 1479308 1477636 1474281 1469379 1462495 1453343 1442552 1431135 1419377
53441 1419377 1406663 1392385 1376764 1360620 1344344 1327259 1308319 1287437 1265657 1243830 1221791
53430 1221791 1199177 1176410 1154263 1133011 1112762 1094095 1077528 1062687 1048874 1036181 1025175
$$ packed form
53510D38997R257R940J0744J1464J2044J2586J3018J3265J3669J4557J5513J5846
53498E90900J5776J6233J7555J9131K0361K1157K1578K1807K2375K3463K4222
53487H14558K3725K2480K1797K1899K1889K1490K1390K1784K1984K1786K1831
53476A056613K2326K2662K2602K2604K2701K2375K1835K1909K2343K1745J9807
53465A299522J8025J7491J7460J6910J6060J5306J4096J2147J0518J0110J0021
53454A457666Q757O372M039K174L00j672l355m902o884r152j0791j1417j1758
53441A419377j2714j4278j5621j6144j6276j7085j8940k0882k1780k1827k2039
53430A221791k2614k2767k2147k1252k0249j8667j6567j4841j3813j2693j1006
$$ plain form
53419 1025175 1015711 1007022 998944 992115 986887 982833 979469 976786 975045 974691 976463 980843 987272 994560
53405 994560 1002167 1010580 1020489 1032214 1045892 1061495 1078602 1096762 1116107 1137021 1159294 1182337
53393 1182337 1206280 1232040 1260124 1290059 1321225 1353616 1387521 1423016 1460079 1498815 1539295
53382 1539295 1581457 1625369 1671325 1719585 1770138 1822635 1876410 1930756 1985435 2040664 2096361
53371 2096361 2151787 2206298 2259940 2312836 2364491 2414357 2462540 2509126 2553228 2593637 2630147
53360 2630147 2663320 2693189 2719193 2741270 2759915 2775108 2786136 2792627 2794911 2793271 2787638 2778135
53348 2778135 2765091 2748431 2727792 2703299 2675413 2643929 2608026 2567449 2522810 2474654 2423138
53337 2423138 2368985 2313892 2259501 2206512 2154988 2104888 2056027 2008136 1961225 1915404 1870307
$$ packed form
53419A025175r464q689q078o829n228m054l364k683j741l54J772M380O429P288
53405I94560P607Q413R909J1725J3678J5603J7107J8160J9345K0914K2273K3043
53393A182337K3943K5760K8084K9935L1166L2391L3905L5495L7063L8736M0480
53382A539295M2162M3912M5956M8260N0553N2497N3775N4346N4679N5229N5697
53371B096361N5426N4511N3642N2896N1655M9866M8183M6586M4102M0409L6510
53360B630147L3173K9869K6004K2077J8645J5193J1028O491K284j640n633r503
53348B778135j3044j6660k0639k4493k7886l1484l5903m0577m4639m8156n1516
53337B423138n4153n5093n4391n2989n1524n0100m8861m7891m6911m5821m5097
$$ plain form
53326 1870307 1825339 1780634 1737077 1695253 1655056 1616404 1579557 1544576 1511303 1480133 1452002
53315 1452002 1427262 1405172 1384753 1365521 1347282 1329922 1313681 1298813 1284690 1269946 1253937
53304 1253937 1237421 1221566 1206939 1193758 1182318 1172667 1164492 1157736 1152805 1149752 1147812 1146148 1144557
53291 1144557 1143162 1142008 1141354 1141850 1143988 1147656 1152521 1158421 1165303 1173299 1183081 1195578 1211066 1228990
53277 1228990 1248745 1270034 1292455 1315484 1339075 1363499 1388331 1412421 1435201 1457221 1478975
53266 1478975 1500014 1519748 1538305 1555911 1571947 1585422 1596046 1604343 1611003 1616522 1621045 1624114
53254 1624114 1624854 1622810 1618318 1611918 1603744 1593741 1581979 1568517 1553261 1536065 1516541 1493936
53242 1493936 1467921 1439546 1410506 1381328 1351242 1320048 1288956 1259005 1229771 1200432 1171190
$$ packed form
53326A870307m4968m4705m3557m1824m0197l8652l6847l4981l3273l1170k8131
53315A452002k4740k2090k0419j9232j8239j7360j6241j4868j4123j4744j6009
53304A253937j6516j5855j4627j3181j1440r651q175o756m931l053j940j664j591
53291A144557j395j154o54M96K138L668M865N900O882P996R782J2497J5488J7924
53277A228990J9755K1289K2421K3029K3591K4424K4832K4090K2780K2020K1754
53266A478975K1039J9734J8557J7606J6036J3475J0624Q297O660N519M523L069
53254A624114P40k044m492o400q174j0003j1762j3462j5256j7196j9524k2605
53242A493936k6015k8375k9040k9178l0086l1194l1092k9951k9234k9339k9242
$$ plain form
53231 1171190 1142731 1115028 1087669 1060826 1034954 1009947 985460 961729 939206 917657 896459
53220 896459 875625 855760 837021 818762 800273 781478 762953 745606 730167 716666 704486
53209 704486 693090 682397 672328 662442 652353 642046 631489 620393 608670 596579 584116 570905
53197 570905 557107 543771 531740 520793 510463 500971 492525 484325 475278 465497 456155 447936 440308
53184 440308 432288 423344 413614 403728 394288 385210 375774 365696 355709 346637 338331 330086 321680 313364
53170 313364 305256 297499 290721 285458 281282 277212 272876 268569 264418 260357 256821 254503 253198 251660
53156 251660 248954 245406 241948 239046 236568 234367 232588 231476 231064 230983 230655 229741 228324 226642 224909
53141 224909 223547 223158 223864 224918 225417 225212 224770 224361 223834 223065 222203 221544 221451 222285 224037 226137 227905
$$ packed form
53231A171190k8459k7703k7359k6843k5872k5007k4487k3731k2523k1549k1198
53220H96459k0834j9865j8739j8259j8489j8795j8525j7347j5439j3501j2180
53209G04486j1396j0693j0069r886j0089j0307j0557j1096j1723j2091j2463j3211
53197E70905j3798j3336j2031j0947j0330r492q446q200r047r781r342q219p628
53184D40308q020q944r730r886r440r078r436j0078r987r072q306q245q406q316
53170C13364q108p757o778n263m176m070m336m307m151m061l536k318j305j538
53156B51660k706l548l458k902k478k201j779j112m12q1l28r14j417j682j733
53141B24909j362l89P06J054M99k05m42m09n27p69q62o59r3Q34J752K100J768
$$ plain form
53124 227905 229066 229709 230032 230394 231163 232088 232241 231130 229543 228650 228483 228051 226862 225559 224864 224485 223420
53107 223420 221082 217857 214692 212185 210031 207422 204115 200867 198564 197155 195744 193640 190991 188448
53093 188448 186447 184750 182595 179472 175826 172720 170664 169144 167467 165631 164035 162841 162050 161721 161620
53078 161620 161068 159757 158358 157702 157653 157481 157011 156551 155870 154237 151630 149091 147515 146743 146141 145499 144936
53061 144936 144380 143668 142965 142594 142453 141942 140592 138645 136894 135985 135906 136136 136114 135510 134272 132756 131715
53044 131715 131721 132547 133418 133891 134079 134010 133344 131993 130502 129384 128493 127426 126227 125282 124767 124556 124410 124000
53026 124000 123044 121765 120922 121044 121871 122809 123522 123749 123053 121311 119185 117550 116624 116096 115834 115901 116082 115972
53008 115972 115550 115224 115308 115789 116543 117542 118846 120563 122645 124630 125870 126224 126236 126419 126693 126703 126249 125177
$$ packed form
53124B27905J161O43L23L62P69R25J53j111j587q93j67m32j189j303o95l79j065
53107B23420k338l225l165k507k154k609l307l248k303j409j411k104k649k543
53093A88448k001j697k155l123l646l106k056j520j677j836j596j194p91l29j01
53078A61620n52j311j399o56m9j72m70m60o81j633k607k539j576p72o02o42n63
53061A44936n56p12p03l71j41n11j350j947j751r09p9K30k2o04j238j516j041
53044A31715OQ26Q71M73J88o9o66j351j491j118q91j067j199r45n15k11j46m10
53026A24000r56j279q43J22Q27R38P13K27o96j742k126j635r26n28k62O7J81j10
53008A15972m22l26Q4M81P54R99J304J717K082J985J240L54J2J83K74J0m54j072
$$ plain form
52990 125177 123391 121385 120267 120731 122335 124232 126201 128486 130990 133192 134704 135485 135786 136222 137475
52975 137475 139596 141941 144123 146413 148782 150316 150336 149522 149119 149464 150078 150735 151527 152177 152274 152042 152032 152144
52957 152144 151765 150795 149777 149083 148653 148488 148696 149015 148975 148523 148008 147630 147405 147463 147833 148155 148158 148144 148372 148336
52937 148336 147462 146203 145582 145834 146337 146702 147006 147074 146499 145500 144889 145089 145840 146891 148194 149441 150167 150398
52919 150398 150574 150876 151213 151658 152141 152021 150939 149904 150347 152108 153572 153910 153965 154618 155539 156182 156971 158676
52901 158676 161215 163715 165332 165729 165301 165159 166250 168193 169646 170066 170293 171103 172082 172496 172525 172950 174123
52884 174123 175862 177959 180227 182310 183870 184762 184897 184314 183524 183257 183625 184030 184147 184435 185343 186584 187598
52867 187598 188331 189164 190363 191904 193506 194756 195546 196451 198170 200525 202594 203903 204855 205884 207011
$$ packed form
52990A25177j786k006j118M64J604J897J969K285K504K202J512P81L01M36J253
52975A37475K121K345K182K290K369J534K0q14m03L45O14O57P92O50R7k32j0J12
52957A52144l79r70j018o94m30j65K08L19m0m52n15l78k25N8L70L22Lj4K28l6
52937A48336q74j259o21K52N03L65L04O8n75r99o11K00P51J051J303J247P26K31
52919A50398J76L02L37M45M83j20j082j035M43J761J464L38N5O53R21O43P89J705
52901A58676K539K500J617L97m28j42J091J943J453M20K27Q10R79M14K9M25J173
52884A74123J739K097K268K083J560Q92J35n83p90k67L68M05J17K88R08J241J014
52867A87598P33Q33J199J541J602J250P90R05J719K355K069J309R52J029J127
$$ plain form
52852 207011 208427 210589 213304 215520 216586 217035 217606 218243 218701 219376 220654 221905 222098 221186 220056 219180
52836 219180 218038 215967 212996 209743 206847 204592 202831 201243 199752 198541 197535 196238 194322 192157
52822 192157 190375 189025 187501 185336 182863 180959 180093 179659 178513 176349 174190 173141 172977 172591 171496
52807 171496 170070 168436 166166 163342 160884 159378 158367 157323 156532 156397 156530 156308 155791 155377 154938 154077
52791 154077 152909 151874 150944 149726 148255 146988 146005 144847 143292 141803 141008 141027 141485 141949 142208 142239 142009
52774 142009 141367 140266 139014 138114 137690 137253 136188 134368 132232 130410 129292 128736 128124 126904 125202 123726
52758 123726 123046 123121 123468 123535 122916 121531 119687 117800 116104 114747 113895 113368 112498 110890 109104 107874 106832
52741 106832 104860 101844 99124 97838 97514 96833 95266 93456 92348 92437 93592 95245 96787 97971 98895
$$ packed form
52852B07011J416K162K715K216J066M49N71O37M58O75J278J251J93r12j130q76
52836B19180j142k071k971l253k896k255j761j588j491j211j006j297j916k165
52822A92157j782j350j524k165k473j904q66m34j146k164k159j049j64l86j095
52807A71496j426j634k270k824k458j506j011j044p91j35J33k22n17m14m39q61
52791A54077j168j035r30j218j471j267r83j158j555j489p95J9M58M64K59L1k30
52774A42009o42j101j252r00m24m37j065j820k136j822j118n56o12j220j702j476
52758A23726o80P5L47O7o19j385j844j887j696j357q52n27q70j608j786j230j042
52741A06832j972l016k720j286l24o81j567j810j108Q9J155J653J542J184R24
$$ plain form
52726 98895 99649 100248 100746 101072 100863 99981 99048 98827 99152 99209 98833 98710 99138 99528 99474 99491 100161 101146 101620 101243
52706 101243 100400 99835 100223 101637 103230 103993 103935 103950 104476 105111 105622 106368 107386 108066 108167 108186 108174 107224 104868
52687 104868 102090 100079 98725 97282 95799 94847 94364 93844 93361 93466 94199 94985 95364 95129 94076 92340
52671 92340 90812 90433 91114 91868 91861 90899 89167 87123 85424 84391 83654 82747 81768 81048 80579 80270 80291 80539
52653 80539 80224 78791 76918 75821 75763 76085 76463 77229 78404 79323 79450 78991 78494 78369 78906 80269 82226
52636 82226 84162 85562 86346 86763 87153 87725 88345 88582 88123 87081 85899 85151 85417 86906 89059 90948 92203
52619 92203 93060 93475 92994 91770 90860 90920 91391 91625 92023 93205 94683 95475 95653 96206 97501 98858 99605 99728
52601 99728 99403 98731 98056 97855 98148 98468 98591 98797 99360 100177 101059 102047 103237 104450 105173 104952 104070 103703
$$ packed form
52726I8895P54N99M98L26k09q82r33k21L25N7l76j23M28L90n4J7O70R85M74l77
52706A01243q43n65L88J414J593P63n8J5N26O35N11P46J018O80J01J9j2r50k356
52687A04868k778k011j354j443j483r52m83n20m83J05P33P86L79k35j053j736
52671I2340j528l79O81P54pr62j732k044j699j033p37r07r79p20m69l09K1K48
52653H0539l15j433j873j097n8L22L78P66J175R19J27m59m97j25N37J363J957
52636H2226J936J400P84M17L90N72O20K37m59j042j182p48K66J489K153J889J255
52619I2203Q57M15m81j224r10O0M71K34L98J182J478P92J78N53J295J357P47J23
52601I9728l25o72o75k01K93L20J23K06N63Q17Q82R88J190J213P23k21q82l67
$$ plain form
52583 103703 104896 107314 109568 110932 111979 113295 114466 114980 115266 116011 117096 118084 119254 121171 123618
52568 123618 125808 127387 128391 128528 127490 125798 124528 124242 124809 126025 127689 129380 130905 132671 134874
52553 134874 136694 137236 136921 136914 137460 137823 137736 137727 137986 138050 137819 137889 138614 139706 140977 142643 144618 146254 147101
52534 147101 147289 147030 146367 145553 145045 144989 145228 145805 146805 147781 148131 148088 148545 149772 151032 151588 151290 150209
52516 150209 148603 147392 147621 149042 150128 149960 149338 149504 150525 151593 152305 152914 153600 154185 154534 154816 155296
52499 155296 155985 156473 156194 155105 154004 153821 154658 155874 156998 158079 159261 160556 162029 163572 164533 164200
52483 164200 162840 161678 161622 162460 163429 164111 164588 165130 165923 166859 167602 168079 168725 169849 170991 171435 171225 171070
52465 171070 171393 172036 172731 173217 173041 172012 170730 169973 169610 168957 168089 167877 168609 169519 169962 170224 170854 171849
$$ packed form
52583A03703J193K418K254J364J047J316J171N14K86P45J085R88J170J917K447
52568A23618K190J579J004J37j038j692j270k86N67J216J664J691J525J766K203
52553A34874J820N42l15pN46L63q7rK59O4k31P0P25J092J271J666J975J636Q47
52534A47101J88k59o63q14n08n6K39N77J000R76L50m3M57J227J260N56k98j081
52516A50209j606j211K29J421J086j68o22J66J021J068P12O09O86N85L49K82M80
52499A55296O89M88k79j089j101j83Q37J216J124J081J182J295J473J543R61l33
52483A64200j360j162n6Q38R69O82M77N42P93R36P43M77O46J124J142M44k10j55
52465A71070L23O43O95M86j76j029j282p57l63o53q68k12P32R10M43K62O30R95
$$ plain form
52447 171849 172832 173422 173270 172291 171066 170388 170289 170081 169443 168769 168344 167906 167173 166112 164559 162312 159830
52430 159830 158080 157361 156979 156281 155372 154633 154263 154473 155353 156279 156235 155083 153776 153011 152421 151468 150320 149425
52412 149425 148846 148534 148672 149345 150405 151928 154144 156583 158047 157927 156950 156210 156057 156336 156993 157890 158590
52395 158590 158948 159469 160608 162127 163586 165011 166577 168010 168796 168825 168529 168581 169493 171122 172582 173150 173235
52378 173235 173838 175106 176286 177106 178147 179601 180777 181368 182117 183588 185189 186221 187055 188359 189797
52363 189797 190488 190343 190126 190517 191790 194082 197211 200400 202829 204340 205254 205785 206080 206507 207438 208917
52347 208917 210837 213163 215713 218125 220275 222347 224294 225761 226763 227847 229290 230757 232016 233333
52333 233333 234828 236187 237410 239064 241274 243218 244231 244751 245579 246863 248368 250047 251694 252736 253120
$$ packed form
52447A71849R83N90j52r79j225o78r9k08o38o74m25m38p33j061j553k247k482
52430A59830j750p19l82o98r09p39l70K10Q80R26m4j152j307p65n90r53j148q95
52412A49425n79l12J38O73J060J523K216K439J464j20r77p40j53K79O57Q97P00
52395A58590L58N21J139J519J459J425J566J433P86K9k96N2R12J629J460N68Q5
52378A73235O03J268J180Q20J041J454J176N91P49J471J601J032Q34J304J438
52363A89797O91j45k17L91J273K292L129L189K429J511R14N31K95M27R31J479
52347B08917J920K326K550K412K150K072J947J467J002J084J443J467J259J317
52333B33333J495J359J223J654K210J944J013N20Q28J284J505J679J647J042L84
$$ plain form
52318 253120 253794 255607 258288 261114 263916 266748 269345 271756 274806 278981 283483 287413 291271 296138
52304 296138 301828 307111 311569 316109 321660 328276 335530 342962 350172 357264 365031 373997 383480 392431
52290 392431 401046 410607 421773 433923 446283 458909 472310 486719 501977 517709 533525 549297
52278 549297 565185 581181 596932 612324 627832 643797 659871 675745 691921 708934 726132
52267 726132 742043 755748 767209 776635 784460 791678 799148 806521 812685 817246 820732 823330 824382
52254 824382 823414 820926 817814 814529 810999 806983 802335 797245 792255 787747 783541 779372 775508 772441
52240 772441 770227 768730 768310 769559 772404 776122 780261 785087 791149 798819 808112 818520 829265 840179
52226 840179 852009 865200 878826 891535 903277 915113 927433 939414 950324 960402 970109 979223
$$ packed form
52318B53120O74J813K681K826K802K832K597K411L050M175M502L930L858M867
52304B96138N690N283M458M540N551O616P254P432P210P092P767Q966R483Q951
52290C92431Q615R561J1166J2150J2360J2626J3401J4409J5258J5732J5816J5772
52278E49297J5888J5996J5751J5392J5508J5965J6074J5874J6176J7013J7198
52267G26132J5911J3705J1461R426P825P218P470P373O164M561L486K598J052
52254H24382r68k488l112l285l530m016m648n090m990m508m206m169l864l067
52240G72441k214j497m20J249K845L718M139M826O062P670R293J0408J0745J0914
52226H40179J1830J3191J3626J2709J1742J1836J2320J1981J0910J0078R707R114
$$ plain form
52214 979223 987080 993221 997570 1000311 1001760 1001988 1000612 997257 992041 985196 976501 965741 953498 940722
52200 940722 927596 913608 898743 883768 869206 854763 839991 824955 809982 795297 781093
52189 781093 767592 754873 742896 731659 721032 710630 700317 690645 682259 675028 668286 661693
52177 661693 655297 649032 642886 637359 632928 629203 625300 620907 616220 611130 605502 600100 596032 593180
52163 593180 590242 586591 582983 580124 577564 574533 571013 567406 563850 560424 557461 555152 553264 551558
52149 551558 550015 548438 546382 543828 541387 539526 538023 536412 534511 532368 530135 528030 525919 523040
52135 523040 518876 514284 510826 508859 507238 505142 503071 501576 500092 497879 495304 493257 491821 490353
52121 490353 488529 486603 484852 483356 482171 481292 480650 480403 480905 482121 483503 484699 485927 487355 488738
$$ packed form
52214I79223P857O141M349K741J449K28j376l355n216o845q695j0760j2243j2776
52200I40722j3126j3988j4865j4975j4562j4443j4772j5036j4973j4685j4204
52189G81093j3501j2719j1977j1237j0627j0402j0313r672q386p231o742o593
52177F61693o396o265o146n527m431l725l903m393m687n090n628n402m068k852
52163E93180k938l651l608k859k560l031l520l607l556l426k963k309j888j706
52149E51558j543j577k056k554k441j861j503j611j901k143k233k105k111k879
52135E23040m164m592l458j967j621k096k071j495j484k213k575k047j436j468
52121D90353j824j926j751j496j185q79o42k47N02J216J382J196J228J428J383
$$ plain form
52106 488738 490034 491798 494446 497656 501007 504691 509049 513966 519392 525963 534360 544378 555363 567299
52092 567299 580678 595516 611257 627578 644587 662283 680508 699534 720045 742326 765885
52081 765885 789999 814229 838256 861622 883914 905009 925001 943963 961868 978639 994209
52070 994209 1008540 1021515 1032852 1042307 1050024 1056401 1061426 1064482 1065066 1063457 1060261 1055455 1048409 1038942
52056 1038942 1027926 1016606 1005571 994612 983398 971926 960273 948300 935938 923670 912320
52045 912320 902271 893197 884704 876934 870229 864494 859327 854693 851072 848965 848611 850149 853625 858721
52031 858721 864807 871396 878383 885834 893820 902467 911865 921823 931946 941974 951953 962062 972367
52018 972367 982563 991790 999013 1003938 1007330 1010040 1011955 1012344 1010918 1007946 1003538 997534 990039 981322
$$ packed form
52106D88738J296J764K648L210L351L684M358M917N426O571Q397J0018J0985J1936
52092E67299J3379J4838J5741J6321J7009J7696J8225J9026K0511K2281K3559
52081G65885K4114K4230K4027K3366K2292K1095J9992J8962J7905J6771J5570
52070I94209J4331J2975J1337R455P717O377N025L056N84j609l196m806p046r467
52056A038942j1016j1320j1035j0959j1214j1472j1653j1973j2362j2268j1350
52045I12320j0049r074q493p770o705n735n167m634l621k107l54J538L476N096
52031H58721O086O589O987P451P986Q647R398R958J0123J0028R979J0109J0305
52018I72367J0196R227P223M925L392K710J915L89j426k972m408o004p495q717
$$ plain form
52004 981322 971142 958884 944463 928483 911455 893501 874958 856404 837756 818035 796501
51993 796501 773535 750112 726870 704047 681807 660123 638686 617268 595960 574809 553579
51982 553579 532139 510803 490118 470585 452675 436652 422161 408379 394790 381491 368691
51971 368691 356428 344899 334498 325196 316421 307889 300166 293970 289218 285063 280609 275405 269578
51958 269578 263742 258560 254228 250586 247603 245296 243273 240993 238560 236536 234871 232828 230259 228050
51944 228050 226815 225895 224298 221982 219519 217051 214394 211805 209799 208309 206694 204557 202025 199334
51930 199334 196585 193923 191507 189268 186935 184347 181635 179185 177472 176729 176659 176623 176127 174959 173051 170614
51914 170614 168314 166726 165616 164298 162688 161280 160077 158443 156276 154418 153493 153158 152953 153005 153314 153216
$$ packed form
52004I81322j0180j2258j4421j5980j7028j7954j8543j8554j8648j9721k1534
51993G96501k2966k3423k3242k2823k2240k1684k1437k1418k1308k1151k1230
51982E53579k1440k1336k0685j9533j7910j6023j4491j3782j3589j3299j2800
51971C68691j2263j1529j0401r302q775q532p723o196m752m155m454n204n827
51958B69578n836n182m332l642k983k307k023k280k433k024j665k043k569k209
51944B28050j235r20j597k316k463k468k657k589k006j490j615k137k532k691
51930A99334k749k662k416k239k333k588k712k450j713p43p0l6m96j168j908k437
51914A70614k300j588j110j318j610j408j203j634k167j858r25l35k05N2L09r8
$$ plain form
51898 153216 152377 151606 151724 152204 151848 150469 148946 147885 147128 146454 145861 145147 143966 142472 141346 141027 141278
51881 141278 141527 141323 140549 139510 138772 138660 139019 139618 140474 141568 142602 143360 143949 144419 144547 144350 144337 144891
51863 144891 145871 147260 149564 152897 156173 158076 158599 158912 159846 161130 162044 162267 162098 162227 163192 164780
51847 164780 166221 167202 168236 169696 171038 171551 171340 170950 170503 169913 169461 169392 169316 168823 168370 168662 169513 170191
51829 170191 170656 171485 172734 173840 174640 175487 176330 176635 176439 176577 177542 178770 179327 178774 177263 175369 173899
51812 173899 173242 172782 171588 169723 168201 167550 167212 166618 166106 166338 167349 168635 169773 170596 171064 171314 171636
51795 171636 172204 172936 173603 173867 173352 172145 171135 171314 172685 174329 175549 176361 176843 176718 175860 174698 173754
51778 173754 173175 172977 173351 174459 176175 178218 180317 182179 183629 184884 186362 188156 190069 192128 194520
$$ packed form
51898A53216q39p71J18M80l56j379j523j061p57o74n93p14j181j494j126l19K51
51881A41278K49k04p74j039p38j12L59N99Q56J094J034P58N89M70J28j97j3N54
51863A44891R80J389K304L333L276J903N23L13R34J284R14K23j69J29R65J588
51847A64780J441R81J034J460J342N13k11l90m47n90m52o9p6m93m53K92Q51O78
51829A70191M65Q29J249J106Q00Q47Q43L05j96J38R65J228N57n53j511j894j470
51812A73899o57m60j194j865j522o51l38n94n12K32J011J286J138Q23M68K50L22
51795A71636N68P32O67K64n15j207j010J79J371J644J220Q12M82j25q58j162r44
51778A73754n79j98L74J108J716K043K099J862J450J255J478J794J913K059K392
$$ plain form
51763 194520 196902 198401 198673 198508 198975 200286 201925 203606 205638 208317 211338 213922 215471 216081 216397
51748 216397 216979 217893 218941 220008 220958 221445 221241 220664 220224 219912 219318 218484 218091 218664 219972 221479 222957
51731 222957 224406 225683 226630 227453 228638 230408 232348 233603 233498 232066 230012 228116 226682 225567 224542
51716 224542 223501 222514 221898 222057 222993 224101 224732 224872 224960 225171 225196 224750 223993 223366 223189 223471 224003 224662 225617
51697 225617 227096 228923 230503 231382 231618 231503 231294 231358 232149 233752 235755 237848 240185 242952 246032 249429
51681 249429 253476 258116 262457 265625 267662 269045 269789 269689 269005 268144 267007 265474 264226 264130 264905 265308
51665 265308 264656 263348 261903 260329 258569 256746 254758 252318 249584 247145 245182 243215 240837 238191
51651 238191 235598 233247 231305 229833 228531 227119 225900 225338 225119 224406 223065 221839 221176 220720 220209 219989
$$ packed form
51763A94520K382J499K72j65M67J311J639J681K032K679L021K584J549O10L16
51748B16397N82R14J048J067R50M87k04n77m40l12n94q34l93N73J308J507J478
51731B22957J449J277R47Q23J185J770J940J255j05j432k054j896j434j115j025
51716B24542j041r87o16J59R36J108O31J40Q8K11K5m46p57o27j77K82N32O59R55
51697B25617J479J827J580Q79K36j15k09O4P91J603K003K093K337K767L080L397
51681B49429M047M640M341L168K037J383P44j00o84q61j137j533j248r6P75M03
51665B65308o52j308j445j574j760j823j988k440k734k439j963j967k378k646
51651B38191k593k351j942j472j302j412j219n62k19p13j341j226o63m56n11k20
$$ plain form
51635 219989 220138 219813 218160 215510 213142 212022 212045 212313 211933 210753 209470 208819 208754 208716 208542 208601 209101 209873
51617 209873 210843 212054 213145 213472 212930 212144 211730 211841 212460 213519 214667 215588 216599 218256 220328 222036
51601 222036 223388 225326 228247 231317 233723 235721 237899 240242 242632 245545 249391 253620 257227 259908
51587 259908 262129 264337 266640 269016 271268 272933 273658 273618 273312 273150 273403 274203 275323 276303 276982 277585 278199
51570 278199 278671 279221 280456 282334 283767 283914 283479 284048 286302 289378 291881 293174 293763 294720 296651 299146
51554 299146 301346 303008 304559 306160 307357 307885 308188 308774 309562 310290 311064 312051 313032 313660 313842 313544 312651
51537 312651 311314 310036 309088 308272 307519 307208 307525 308085 308580 309205 309970 310252 309613 308487 307388 306014 303858
51520 303858 301279 299098 297479 295995 294523 293208 291800 289895 287796 286236 285268 284264 283092 282394 282341
$$ packed form
51635B19989J49l25j653k650k368j120K3K68l80j180j283o51o5l8j74N9N00P72
51617B09873R70J211J091L27n42p86m14J11O19J059J148R21J011J657K072J708
51601B22036J352J938K921L070K406J998K178K343K390K913L846M229L607K681
51587B59908K221K208K303K376K252J665P25m0l06j62K53Q00J120R80O79O03O14
51570B78199M72N50J235J878J433J47m35N69K254L076K503J293N89R57J931K495
51554B99146K200J662J551J601J197N28L03N86P88P28P74R87R81O28J82k98q93
51537C12651j337j278r48q16p53l11L17N60M95O25P65K82o39j126j099j374k156
51520C03858k579k181j619j484j472j315j408j905k099j560r68j004j172o98n3
$$ plain form
51505 282341 281911 279988 276718 273220 270247 267648 265161 263145 262260 262555 263229 263395 262891 262239 262080 262834
51489 262834 264643 267116 269286 270397 270841 271784 273791 276349 278813 281186 283727 286493 289616 293441 297908
51474 297908 302289 306021 309352 312742 316101 319098 321835 324652 327657 330905 334703 339156 343738 347818
51460 347818 351348 354518 357084 358618 359239 359537 359911 360345 360614 360321 359056 356957 354836 353290 352021 350430
51444 350430 348498 346547 344548 342343 340168 338246 336152 333272 329735 326195 322911 319755 316980 315114
51430 315114 314167 313639 313319 313302 313220 312353 310732 309377 309042 309310 309313 308815 308127 307341 306191 304619 303165 302669
51412 302669 303547 305274 306642 306754 305743 304370 303035 301484 299381 296803 294099 291499 289012 286487 283732
51397 283732 280643 277307 273879 270413 266832 263011 258901 254690 250784 247377 244080 240331 236175 232191
$$ packed form
51505B82341m30j923l270l498k973k599k487k016q85K95O74J66n04o52j59P54
51489B62834J809K473K170J111M44R43K007K558K464K373K541K766L123L825M467
51474B97908M381L732L331L390L359K997K737K817L005L248L798M453M582M080
51460C47818L530L170K566J534O21K98L74M34K69k93j265k099k121j546j269j591
51444C50430j932j951j999k205k175j922k094k880l537l540l284l156k775j866
51430C15114r47n28l20j7q2q67j621j355l35K68Lm98o88p86j150j572j454m96
51412C02669Q78J727J368J12j011j373j335j551k103k578k704k600k487k525k755
51397B83732l089l336l428l466l581l821m110m211l906l407l297l749m156l984
$$ plain form
51383 232191 228610 225079 221468 218239 215640 213129 210163 207096 204702 203114 201781 200220 198287 195956
51369 195956 193334 190673 188029 185217 182504 180855 180840 181693 182132 181841 181394 181047 180458 179541 178697 178097 177441
51352 177441 176626 176022 175882 175953 175934 176017 176767 178666 181712 185237 188225 190076 191044 191795 192757 194117 195986
51335 195986 198107 199680 200028 199302 198198 197282 196985 197738 199449 201175 202088 202552 203544 205136 206330 206281 204968
51318 204968 202706 199799 196786 194319 192534 190985 189271 187330 185163 182776 180370 178141 175915 173416
51304 173416 170792 168387 166230 164232 162698 161934 161477 160435 158550 156383 154513 153191 152627 152903 153612
51289 153612 154232 154815 155697 156674 157177 157121 156840 156292 155098 153255 150985 148101 144590 141635 140803 141972 143279
51272 143279 143387 142726 142165 141722 141185 140870 140934 140796 140030 139161 138819 138724 138261 137482 136807 136230 135512 134728 133973
$$ packed form
51383B32191l581l531l611l229k599k511k966l067k394j588j333j561j933k331
51369A95956k622k661k644k812k713j649j5Q53M39k91m47l47n89r17q44o00o56
51352A77441q15o04j40P1j9Q3P50J899L046L525K988J851R68P51R62J360J869
51335A95986K121J573L48p26j104r16k97P53J711J726R13M64R92J592J194m9j313
51318B04968k262k907l013k467j785j549j714j941k167k387k406k229k226k499
51304A73416k624k405k157j998j534p64m57j042j885k167j870j322n64K76P09
51289A53612O20N83Q82R77N03n6k81n48j194j843k270k884l511k955q32J169J307
51272A43279J08o61n61m43n37l15O4j38p66q69l42r5m63p79o75n77p18p84p55
$$ plain form
51253 133973 132941 131461 130073 129375 129140 128689 127830 126797 125568 124002 122483 121674 121672 121964 122268 122811 123655
51236 123655 124296 124182 123390 122593 122446 123117 124306 125592 126657 127212 126997 126146 125428 125683 126958 128501 129627
51219 129627 130265 130651 130913 131077 131148 131107 131155 131888 133707 136082 138047 139518 141432 144254 147069 148653 148956
51202 148956 148957 149409 150295 151323 152405 153612 154954 156281 157297 157789 157830 157639 157279 156782 156449 156595 157022 157206
51184 157206 157038 156826 156549 155768 154434 153104 152052 150844 149215 147736 147050 146930 146680 146086 145426 144866 144367
51167 144367 143990 143751 143296 142199 140563 139001 138029 137645 137459 137098 136594 136409 136853 137521 137630 136961 136066 135474
51149 135474 135140 134770 134227 133459 132502 131711 131543 131906 132274 132518 132995 133645 133770 133070 132143 131461 130611 129189
51131 129189 127765 127168 127254 127179 126566 125651 124552 123162 121681 120576 119992 119681 119464 119358 119320 119222 118972 118413
$$ packed form
51253A33973j032j480j388o98k35m51q59j033j229j566j519q09kK92L04N43Q44
51236A23655O41j14p92p97j47O71J189J286J065N55k15q51p18K55J275J543J126
51219A29627O38L86K62J64P1m1M8P33J819K375J965J471J914K822K815J584L03
51202A48956JM52Q86J028J082J207J342J327J016M92M1j91l60m97l33J46M27J84
51184A57206j68k12k77p81j334j330j052j208j629j479o86j20k50n94o60n60m99
51167A44367l77k39m55j097j636j562r72l84j86l61n04j85M44O68J09o69q95n92
51149A35474l34l70n43p68r57p91j68L63L68K44M77O50J25p00r27o82q50j422
51131A29189j424n97Q6p5o13r15j099j390j481j105n84l11k17j06l8r8k50n59
$$ plain form
51113 118413 117349 115992 115075 115058 115467 115452 114797 114008 113629 113890 114814 116242 117901 119736 122002 124718 127357
51096 127357 129328 130478 130845 130518 130119 130843 133267 136496 139117 140711 141790 142647 143137 143402 143950 144954
51080 144954 146107 147147 147980 148404 148319 148141 148365 148830 149095 149387 150403 152138 153739 154698 155361 156044 156406
51063 156406 156154 155685 155469 155243 154433 153126 152114 152025 152778 153849 154778 155386 155683 155638 155087 153916 152330 150815
51045 150815 149807 149462 149665 150135 150554 150764 150882 151186 151885 153032 154485 155915 157022 157848 158690 159639 160439
51028 160439 160963 161496 162314 163263 164089 164932 166131 167673 169120 170023 170229 170003 170070 171252 173712 176700 179275
51011 179275 181086 182304 183228 184321 186172 188888 191764 194023 195679 197245 198960 200882 203416 206938
50997 206938 211054 215020 218938 223841 230408 238177 246158 253694 260620 267128 273735 281039 289282 298412
$$ packed form
51113A18413j064j357r17j7M09j5o55p89l79K61R24J428J659J835K266K716K639
51096A27357J971J150L67l27l99P24K424L229K621J594J079Q57M90K65N48J004
51080A44954J153J040Q33M24q5j78K24M65K65K92J016J735J601R59O63O83L62
51063A56406k52m69k16k26q10j307j012q9P53J071R29O08K97m5n51j171j586j515
51045A50815j008l45K03M70M19K10J18L04O99J147J453J430J107Q26Q42R49Q00
51028A60439N24N33Q18R49Q26Q43J199J542J447R03K06k26O7J182K460K988K575
51011A79275J811J218R24J093J851K716K876K259J656J566J715J922K534L522
50997B06938M116L966L918M903O567P769P981P536O926O508O607P304Q243R130
$$ plain form
50983 298412 308517 319810 332231 345561 359974 375992 393838 413328 434488 457745 483482
50972 483482 511985 543977 580467 621705 666880 715236 766966 822575 881895 944342 1009726
50961 1009726 1078051 1148615 1219894 1290315 1358590 1423346 1483060 1536622 1583544 1623309 1654863
50950 1654863 1677088 1689624 1692894 1687410 1673456 1651541 1622827 1588887 1551195 1511067 1469905 1429109
50938 1429109 1389644 1351931 1316193 1282668 1251361 1221860 1193591 1166090 1138870 1111236 1082585
50927 1082585 1052802 1022097 990452 957500 923056 887566 851869 816529 781538 746767 712614
50916 712614 680005 649665 621623 595617 571730 550209 530814 512923 496391 481804 469660
50905 469660 459713 451373 444333 438435 433255 428321 423689 420023 418082 418164 419791 421871 423449 424465 425579
$$ packed form
50983B98412J0105J1293J2421J3330J4413J6018J7846J9490K1160K3257K5737
50972D83482K8503L1992L6490M1238M5175M8356N1730N5609N9320O2447O5384
50961A009726O8325P0564P1279P0421O8275O4756N9714N3562M6922L9765L1554
50950A654863K2225J2536L270n484j3954k1915k8714l3940l7692m0128m1162m0796
50938A429109l9465l7713l5738l3525l1307k9501k8269k7501k7220k7634k8651
50927A082585k9783l0705l1645l2952l4444l5490l5697l5340l4991l4771l4153
50916G12614l2609l0340k8042k6006k3887k1521j9395j7891j6532j4587j2144
50905D69660r947q340p040n898n180m934m632l666j941Q2J627K080J578J016J114
$$ plain form
50890 425579 427280 429549 432399 436041 440188 443878 446531 448821 451962 456479 462149 468752 476196 484102
50876 484102 491942 499654 507746 516806 527184 538935 551753 565160 579093 594087 610637 628754
50864 628754 648529 670686 696029 724714 756633 792203 832156 876899 926810 982910 1046427
50853 1046427 1117895 1197440 1285841 1384356 1493450 1612525 1740986 1878743 2025345 2179300
50843 2179300 2338543 2500989 2664283 2825424 2980846 3126505 3257861 3370428 3460731 3526570
50833 3526570 3566541 3580037 3567932 3532555 3476645 3402867 3314640 3216729 3114228 3011067 2909839
50822 2909839 2812731 2721941 2639103 2564629 2497780 2437227 2381488 2328947 2277701 2225745 2171492
50811 2171492 2113995 2052572 1986509 1915541 1840425 1762555 1682995 1602277 1521121 1440907 1363303
$$ packed form
50890D25579J701K269K850L642M147L690K653K290L141M517N670O603P444P906
50876D84102P840P712Q092R060J0378J1751J2818J3407J3933J4994J6550J8117
50864F28754J9775K2157K5343K8685L1919L5570L9953M4743M9911N6100O3517
50853A046427P1468P9545Q8401R8515J09094J19075J28461J37757J46602J53955
50843B179300J59243J62446J63294J61141J55422J45659J31356J12567R0303O5839
50833C526570L9971J3496j2105l5377n5910p3778q8227r7911j02501j03161j01228
50822B909839r7108r0790q2838p4474o6849o0553n5739n2541n1246n1956n4253
50811B171492n7497o1423o6063p0968p5116p7870p9560q0718q1156q0214p7604
$$ plain form
50800 1363303 1289692 1221061 1158096 1101160 1050232 1004904 964422 927971 895256 866726 843058
50789 843058 824501 810874 801898 797178 796087 797966 802270 808263 814990 822006 829738 838554 847691 855645
50775 855645 861407 864836 866272 866532 866893 868020 868919 867809 864039 858383 851572 843550 834325 824517 814643
50760 814643 804653 794573 784949 776300 768766 762546 758007 755067 753154 752181 753007 756529 762850 771617
50746 771617 782628 795773 811016 828836 850165 875540 904834 938133 976230 1019833 1068915
50735 1068915 1123415 1184022 1251735 1326986 1409598 1499099 1594552 1694517 1797691 1903144 2009448
50724 2009448 2114010 2213813 2306384 2389486 2460392 2516305 2555352 2576463 2578545 2560691 2523449
50713 2523449 2469399 2402353 2326335 2245147 2162210 2080341 2001791 1928483 1861951 1802847 1750719
$$ packed form
50800A363303p3611o8631o2965n6936n0928m5328m0482l6451l2715k8530k3668
50789H43058j8557j3627q976m720j091J879M304N993O727P016P732Q816R137P954
50775H55645N762L429J436K60L61J127Q99j110l770n656o811q022r225r808r874
50760H14643r990j0080r624q649p534o220m539k940j913r73Q26L522O321Q767
50746G71617J1011J3145J5243J7820K1329K5375K9294L3299L8097M3603M9082
50735A068915N4500O0607O7713P5251Q2612Q9501R5453R9965J03174J05453J06304
50724B009448J04562R9803R2571Q3102P0906N5913L9047K1111K082j7854l7242
50713B523449n4050o7046p6018q1188q2937q1869p8550p3308o6532n9104n2128
$$ plain form
50702 1750719 1704502 1663280 1626571 1593911 1564172 1535453 1505738 1473598 1438211 1399062 1356126
50691 1356126 1310265 1262901 1215083 1167225 1119790 1073824 1030601 991038 955521 924024 896307
50680 896307 872371 852743 837917 827503 820426 816090 814860 817354 823798 834249 848826 867467
50668 867467 889897 916011 945732 978283 1012174 1046194 1079870 1112788 1144180 1173601 1201309
50657 1201309 1227497 1251790 1274004 1294704 1314332 1332375 1348204 1362270 1375574 1388163 1399058
50646 1399058 1407740 1415082 1422680 1431637 1442021 1453267 1465160 1478616 1495271 1516122 1540795 1568303
50634 1568303 1598046 1629696 1662558 1695553 1727602 1757691 1784904 1808760 1829232 1846134 1858907
50623 1858907 1867361 1872207 1874435 1874698 1873744 1872817 1872954 1874368 1877241 1882696 1892101 1905676 1922476 1941393
$$ packed form
50702A750719m6217m1222l6709l2660k9739k8719k9715l2140l5387l9149m2936
50691A356126m5861m7364m7818m7858m7435m5966m3223l9563l5517l1497k7717
50680H96307k3936j9628j4826j0414p077m336j230K494O444J0451J4577J8641
50668H67467K2430K6114K9721L2551L3891L4020L3676L2918L1392K9421K7708
50657A201309K6188K4293K2214K0700J9628J8043J5829J4066J3304J2589J0895
50646A399058Q682P342P598Q957J0384J1246J1893J3456J6655K0851K4673K7508
50634A568303K9743L1650L2862L2995L2049L0089K7213K3856K0472J6902J2773
50623A858907Q454M846K228K63r54r27J37J414K873N455R405J3575J6800J8917
$$ plain form
50609 1941393 1961331 1980720 1997939 2012305 2023828 2032035 2035842 2034633 2028578 2017653 2001040 1977686
50597 1977686 1946915 1908474 1862736 1811027 1754998 1695458 1632567 1567437 1502608 1440314 1380846
50586 1380846 1323208 1266932 1212581 1160872 1112126 1066553 1024450 985955 951003 919651 892139
50575 892139 868474 848200 830726 815814 803566 794091 787312 783094 781355 781973 784706 789362 796032
50562 796032 805018 816551 830581 846777 864583 883447 903378 925257 950249 978749 1010185 1043925
50550 1043925 1079982 1118555 1159322 1201629 1245184 1290008 1335656 1380929 1424675 1466714 1507810
50539 1507810 1548713 1589424 1629463 1668728 1707790 1747342 1787712 1829144 1872221 1917556 1965271
50528 1965271 2015262 2067877 2123838 2183537 2246907 2313883 2384361 2457662 2532706 2608870 2685985
$$ packed form
50609A941393J9938J9389J7219J4366J1523Q207L807j209o055j0925j6613k3354
50597A977686l0771l8441m5738n1709n6029n9540o2891o5130o4829o2294n9468
50586A380846n7638n6276n4351n1709m8746m5573m2103l8495l4952l1352k7512
50575H92139k3665k0274j7474j4912j2248r475o779m218j739O18K733M656O670
50562G96032Q986J1533J4030J6196J7806J8864J9931K1879K4992K8500L1436L3740
50550A043925L6057L8573M0767M2307M3555M4824M5648M5273M3746M2039M1096
50539A507810M0903M0711M0039L9265L9062L9552M0370M1432M3077M5335M7715
50528A965271M9991N2615N5961N9699O3370O6976P0478P3301P5044P6164P7115
$$ plain form
50517 2685985 2763318 2839163 2911603 2978961 3039262 3090121 3129820 3157915 3174230 3177811 3167459
50506 3167459 3142854 3104590 3053600 2991258 2919797 2841938 2760188 2676895 2594740 2516680 2445507
50495 2445507 2383608 2332789 2293908 2266929 2251552 2247352 2253114 2266678 2285936 2309440 2335533 2361459
50483 2361459 2383880 2399742 2406089 2399759 2378278 2340961 2288635 2222789 2145597 2060140 1969622 1876424
50471 1876424 1782419 1689637 1599794 1513641 1431641 1354871 1284321 1219716 1160160 1105677 1057058
50460 1057058 1014326 976561 943228 914517 890259 869625 852206 838382 828234 820963 815815 812889
50448 812889 812634 815108 819994 826824 834997 844168 854805 867767 883149 900125 918121 937511 958925
50435 958925 982435 1007711 1034435 1062279 1090918 1120365 1150974 1182980 1216266 1250522 1285247
$$ packed form
50517B685985P7333P5845P2440O7358O0301N0859L9699K8095J6315L581j0352
50506C167459k4605l8264n0990o2342p1461p7859q1750q3293q2155p8060p1173
50495B445507o1899n0819l8881k6979j5377m200N762J3564J9258K3504K6093K5926
50483B361459K2421J5862O347o330k1481l7317n2326o5846p7192q5457r0518r3198
50471A876424r4005r2782q9843q6153q2000p6770p0550o4605n9556n4483m8619
50460A057058m2732l7765l3333k8711k4258k0634j7419j3824j0148p271n148k926
50448H12889k55K474M886O830Q173R171J0637J2962J5382J6976J7996J9390K1414
50435I58925K3510K5276K6724K7844K8639K9447L0609L2006L3286L4256L4725
$$ plain form
50424 1285247 1319707 1353488 1387099 1421427 1456504 1491299 1524784 1556743 1587665 1618477 1650296
50413 1650296 1683803 1718798 1754966 1792868 1833347 1875988 1919174 1961796 2003916 2045420 2085004
50402 2085004 2121087 2152998 2180725 2204112 2222838 2236650 2245061 2247172 2242163 2229527 2208557 2178209
50390 2178209 2138039 2088883 2032184 1969027 1900257 1827223 1751917 1676443 1602648 1532046 1465914
50379 1465914 1405477 1351975 1306260 1268406 1238142 1215635 1201331 1195022 1195652 1202055 1213147 1227189
50367 1227189 1241719 1254671 1265025 1271996 1274124 1269737 1258001 1239146 1214018 1183760 1149632 1112776
50355 1112776 1074237 1035202 996791 959495 923323 888628 856285 826809 799872 775029 752377
50344 752377 732183 714278 698268 683976 671402 660546 651576 644773 640031 636729 634287 632510 631316
$$ packed form
50424A285247L4460L3781L3611L4328L5077L4795L3485L1959L0922L0812L1819
50413A650296L3507L4995L6168L7902M0479M2641M3186M2622M2120M1504L9584
50402B085004L6083L1911K7727K3387J8726J3812Q411K111n009j2636k0970l0348
50390B178209m0170m9156n6699o3157o8770p3034p5306p5474p3795p0602o6132
50379A465914o0437n3502m5715l7854l0264k2507j4304o309O30O403J1092J4042
50367A227189J4530J2952J0354O971K128m387j1736j8855k5128l0258l4128l6856
50355A112776l8539l9035l8411l7296l6172l4695l2343k9476k6937k4843k2652
50344G52377k0194j7905j6010j4292j2574j0856q970o803m742l302k442j777j194
$$ plain form
50331 631316 630682 631108 633538 638367 644929 652255 659947 668087 676833 686522 697675 710450 724370 738874
50317 738874 753767 768927 784113 799437 815557 832938 851253 869882 888561 907107 924921
50306 924921 941265 955914 969189 981524 993164 1003987 1013398 1020778 1026178 1030227 1033211 1034783 1034725
50293 1034725 1033397 1031139 1027859 1023554 1018596 1013072 1006369 997889 987627 975658 961626 945314 927171
50280 927171 907747 887153 865654 844243 823845 804350 785116 766116 747866 730451 713349
50269 713349 696102 678605 660907 643280 626368 610828 596849 584302 573093 563039 553742 544991
50257 544991 536995 529865 523323 517294 512285 508615 505759 503071 500771 499556 499557 500308 501399 502515 503203
50242 503203 503343 503508 504184 504943 505169 505221 505922 507105 507720 507318 506534 506044 505944 506210 506818 507165 506229 503723
$$ packed form
50331F31316o34M26K430M829O562P326P692Q140Q746R689J1153J2775J3920J4504
50317G38874J4893J5160J5186J5324J6120J7381J8315J8629J8679J8546J7814
50306I24921J6344J4649J3275J2335J1640J0823R411P380N400M049K984J572n8
50293A034725j328k258l280m305m958n524o703q480j0262j1969j4032j6312j8143
50280I27171j9424k0594k1499k1411k0398j9495j9234j9000j8250j7415j7102
50269G13349j7247j7497j7698j7627j6912j5540j3979j2547j1209j0054r297q751
50257E44991p996p130o542o029n009l670k856k688k300j215JP51J091J116O88
50242E03203J40J65O76P59K26N2P01J183O15m02p84m90j00K66O08L47r36k506
$$ plain form
50224 503723 500436 497210 494230 491561 489601 488531 487869 487080 486239 485685 485413 485224 485225 485763 486981 488695 490594
50207 490594 492357 493785 495023 496497 498462 500740 503014 505211 507449 509775 512135 514510 516932 519372
50193 519372 521651 523450 524443 524487 523752 522642 521593 520844 520232 519202 517275 514552 511487 508111 503829 498251
50177 498251 491851 485506 479640 474257 469550 465977 463677 462224 461058 459992 459278 459328 460355 462109 464053
50162 464053 465852 467563 469262 470726 471601 471605 470452 468004 464767 461793 459685 458008 456103 454155 452909
50147 452909 452590 452718 452961 453555 454751 456367 458039 459621 461127 462529 463774 464878 465860 466661 467181 467450
50131 467450 467765 468543 469841 471131 471840 472044 472265 472684 473022 473276 473910 475099 476365 477309 478151 479190 480238
50114 480238 481036 481712 482386 482778 482741 482695 483012 483357 483261 482975 483145 483956 485183 486765 488714 490755 492681 494775
$$ packed form
50224E03723l287l226k980k669j960j070o62p89q41n54k72j89JN38J218J714J899
50207D90594J763J428J238J474J965K278K274K197K238K326K360K375K422K440
50193E19372K279J799R93M4p35j110j049p49o12j030j927k723l065l376m282n578
50177D98251o400o345n866n383m707l573k300j453j166j066p14N0J027J754J944
50162D64053J799J711J699J464Q75Mj153k448l237k974k108j677j905j948j246
50147D52909l19J28K43N94J196J616J672J582J506J402J245J104R82Q01N20K69
50131D67450L15P78J298J290P09K04K21M19L38K54O34J189J266R44Q42J039J048
50114D80238P98O76O74L92l7m6L17L45r6k86J70Q11J227J582J949K041J926K094
$$ plain form
50096 494775 497281 499805 501934 504194 507648 512691 518905 525855 533300 540707 547379 553197 558722 564574
50082 564574 571104 578505 586715 595413 604488 614245 624631 634708 643632 651762 660079 668891 677981 687582
50068 687582 698093 708979 719071 728002 736315 744185 751164 757399 764013 771872 780810 790418 800828
50055 800828 812443 825649 841103 859589 881243 905546 932298 961914 994545 1029630 1066504
50044 1066504 1104733 1143613 1182152 1219856 1256719 1292030 1324038 1351340 1374068 1393257 1409685
50033 1409685 1423816 1436256 1447589 1457972 1467125 1474370 1478460 1477910 1471729 1459371 1439968 1412500
50021 1412500 1377052 1335212 1288829 1239154 1187573 1136203 1086857 1039923 995003 952273 912566
50010 912566 876523 844284 815812 790880 768951 749514 732439 717781 705465 695338 687024 679583
$$ packed form
50096D94775K506K524K129K260L454N043O214O950P445P407O672N818N525N852
50082E64574O530P401Q210Q698R075R757J0386J0077Q924Q130Q317Q812R090R601
50068F87582J0511J0886J0092Q931Q313P870O979O235O614P859Q938R608J0410
50055H00828J1615J3206J5454J8486K1654K4303K6752K9616L2631L5085L6874
50044A066504L8229L8880L8539L7704L6863L5311L2008K7302K2728J9189J6428
50033A409685J4131J2440J1333J0383R153P245M090n50o181j2358j9403k7468
50021A412500l5448m1840m6383m9675n1581n1370m9346m6934m4920m2730l9707
50010I12566l6043l2239k8472k4932k1929j9437j7075j4658j2316j0127q314p441
$$ plain form
49998 679583 671997 664337 657758 652805 648447 643387 637650 632034 626604 620750 614450 608444 603121 598018
49984 598018 592497 586310 579542 572524 565880 560128 555270 551084 547675 545248 543529 541958 540386 539061
49970 539061 538052 537283 537137 538344 541120 544800 548479 551679 554392 556953 559994 564117 569312 574873 580012
49955 580012 584451 588510 592867 598222 604908 612668 620932 629273 637538 645764 654350 664157 675950 689586
49941 689586 704157 719179 735440 754419 776984 802927 831769 863719 899685 940500 986442
49930 986442 1037454 1093359 1153465 1216253 1279952 1343419 1406080 1467118 1525243 1579501 1629913
49919 1629913 1677145 1721947 1765051 1807092 1848195 1887774 1924875 1958456 1987148 2009168 2022817
49908 2022817 2026880 2020489 2003118 1975090 1937642 1892030 1838944 1779271 1715034 1648796 1582156 1515373
$$ packed form
49998F79583p586p660o579m953m358n060n737n616n430n854o300o006n323n103
49984E98018n521o187o768p018o644n752m858m186l409k427j719j571j572j325
49970E39061j009p69j46J207K776L680L679L200K713K561L041M123N195N561N139
49955E80012M439M059M357N355O686P760Q264Q341Q265Q226Q586R807J1793J3636
49941F89586J4571J5022J6261J8979K2565K5943K8842L1950L5966M0815M5942
49930I86442N1012N5905O0106O2788O3699O3467O2661O1038N8125N4258N0412
49919A629913M7232M4802M3104M2041M1103L9579L7101L3581K8692K2020J3649
49908B022817M063o391j7371k8028l7448m5612n3086n9673o4237o6238o6640o6783
$$ plain form
49896 1515373 1448424 1381842 1316423 1252684 1190956 1131743 1075743 1023623 975855 932586 893544
49885 893544 858134 825752 796051 768987 744690 723193 704197 687028 670900 655229 639864
49874 639864 625195 611922 600399 590079 579874 569183 558417 548416 539549 531420 523354 515167
49862 515167 507637 502041 498844 496931 494612 491395 488183 485743 483764 481758 480018 479047 478586 478043 477502
49847 477502 477557 478256 478922 479015 478617 478049 477581 477576 478376 479820 481277 482376 483455 485118 487547 490399 493272
49830 493272 496143 499379 503309 507840 512649 517745 523499 529981 536643 543078 549888 558317 569031 581684
49816 581684 595772 611573 629985 651628 676279 703263 732283 763845 798820 837637 879923
49805 879923 924698 970617 1016130 1059871 1101146 1139769 1175305 1206834 1233743 1256482 1276270
$$ packed form
49896A515373o6949o6582o5419o3739o1728n9213n6000n2120m7768m3269l9042
49885H93544l5410l2382k9701k7064k4297k1497j8996j7169j6128j5671j5365
49874F39864j4669j3273j1523j0320j0205j0691j0766j0001q867q129q066q187
49862E15167p530n596l197j913k319l217l212k440j979k006j740r71m61n43n41
49847D77502N5O99O66R3l98n68m68nQ00J444J457J099J079J663K429K852K873
49830D93272K871L236L930M531M809N096N754O482O662O435O810Q429J0714J2653
49816E81684J4088J5801J8412K1643K4651K6984K9020L1562L4975L8817M2286
49805H79923M4775M5919M5513M3741M1275L8623L5536L1529K6909K2739J9788
$$ plain form
49794 1276270 1294225 1311054 1327249 1343065 1358178 1371483 1381269 1385572 1382637 1371355 1351254 1322202
49782 1322202 1284486 1239397 1189330 1136807 1083395 1029759 976594 925118 876626 831742 790283
49771 790283 751821 716431 684783 657438 634180 614201 596702 581010 566384 552374 539384
49760 539384 528230 519013 510983 503603 497096 491714 487217 483425 480539 478421 476245 473568 471205 470281
49746 470281 470701 471202 470699 469020 466631 464269 462694 462231 462595 463430 464739 466478 468195 469566 470815 472099
49730 472099 472982 473172 473225 473715 474149 473653 472419 471507 471413 471793 472421 473337 474055 473757 472479 471146 470251 469444
49712 469444 468609 468300 468672 468916 468369 467467 467022 467180 467604 468097 468529 468688 468750 469450 471189 473404 475312 476836
49694 476836 478309 479659 480560 481101 481774 482928 484684 487124 490116 493202 496112 499143 502530 505744 508009
$$ packed form
49794A276270J7955J6829J6195J5816J5113J3305R786M303k935j1282k0101k9052
49782A322202l7716m5089n0067n2523n3412n3636n3165n1476m8492m4884m1459
49771G90283l8462l5390l1648k7345k3258j9979j7499j5692j4626j4010j2990
49760E39384j1154r217q030p380o507n382m497l792k886k118k176k677k363r24
49746D70281M20N01n03j679k389k362j575m63L64Q35J309J739J717J371J249J284
49730D72099Q83J90N3M90M34m96j234r12r4L80O28R16P18k98j278j333q95q07
49712D69444q35l09L72K44n47r02m45J58M24M93M32J59O2P00J739K215J908J524
49694D76836J473J350R01N41O73J154J756K440K992L086K910L031L387L214K265
$$ plain form
49679 508009 509335 510415 511634 512855 514191 516187 518989 521925 524328 526360 528678 531641 535192 539247
49665 539247 543731 548326 552556 556185 559337 562239 565094 568168 571757 575920 580409 584944 589424 593799
49651 593799 597846 601210 603692 605517 607412 610319 614758 620253 625571 629790 633117 636545 640817 645859
49637 645859 651111 656101 660708 665101 669523 674090 678862 684186 690616 698210 706099 713227 719375 724964
49623 724964 730006 734036 737253 740975 746446 753616 761534 769540 777561 785569 793410 801122 809012 817343
49609 817343 826157 835386 845003 855139 866099 877991 890287 902215 913770 925886 939268 953497
49597 953497 967775 982090 997038 1012756 1028751 1044740 1061030 1077980 1095538 1113371 1131100
49586 1131100 1148453 1165546 1183008 1201410 1220538 1239556 1257986 1276280 1295360 1315796 1337384
$$ packed form
49679E08009J326J080J219J221J336J996K802K936K403K032K318K963L551M055
49665E39247M484M595M230L629L152K902K855L074L589M163M489M535M480M375
49651E93799M047L364K482J825J895K907M439N495N318M219L327L428M272N042
49637F45859N252M990M607M393M422M567M772N324O430P594P889P128O148N589
49623G24964N042M030L217L722N471P170P918Q006Q021Q008P841P712P890Q331
49609H17343Q814R229R617J0136J0960J1892J2296J1928J1555J2116J3382J4229
49597I53497J4278J4315J4948J5718J5995J5989J6290J6950J7558J7833J7729
49586A131100J7353J7093J7462J8402J9128J9018J8430J8294J9080K0436K1588
$$ plain form
49575 1337384 1359397 1381276 1403082 1425096 1446964 1467747 1487044 1505558 1524074 1542348 1559620
$$ packed form
49575A337384K2013K1879K1806K2014K1868K0783J9297J8514J8516J8274J7272
$$ [...]
##END NTUPLES=NMR SPECTRUM
##END=
