
##TITLE=AC1351_CHIRS12169_6647909_QA816MgoxS
##JCAMPDX= 6.0         $$ Bruker NMR JCAMP-DX V2.0
##DATA TYPE= NMR SPECTRUM
##DATA CLASS= NTUPLES
##ORIGIN= BRUKER
##OWNER= Administrator
$$ 1.72 TOPSPIN		Version 2.1
$$ 2012-08-10 16:22:15.343 -0500  Administrator@TOPSPIN
$$ Compression mode = diff/dup
##.OBSERVE FREQUENCY= 400.02188249412
##.OBSERVE NUCLEUS= ^1H
##.ACQUISITION MODE= SIMULTANEOUS (DQD)
##.ACQUISITION SCHEME= undefined
##.AVERAGES= 8
##.DIGITISER RES= 22
##SPECTROMETER/DATA SYSTEM= spect
##.PULSE SEQUENCE= zg30
##.SOLVENT NAME= COFFEE_meoh
##.SHIFT REFERENCE= INTERNAL, COFFEE_meoh, 1, 14.98509
##AUDIT TRAIL= $$ (NUMBER, WHEN, WHO, WHERE, PROCESS, VERSION, WHAT)
$$ ##TITLE= Audit trail, TOPSPIN		Version 2.1
$$ ##JCAMPDX= 5.01
$$ ##ORIGIN= Bruker BioSpin GmbH
$$ ##OWNER= Administrator
$$ $$ C:\Bruker\TOPSPIN/data/COFFEE/nmr/AC1351_CHIRS12169_6647909_QA816MgoxS/20/pdata/1/auditp.txt
$$ ##AUDIT TRAIL=  $$ (NUMBER, WHEN, WHO, WHERE, PROCESS, VERSION, WHAT)
(   1,<2012-08-10 16:22:07.281 -0500>,<Administrator>,<TOPSPIN>,<go>,<TOPSPIN 2.1>,
      <created by zg
	started at 2012-08-10 16:21:00.453 -0500,
	POWCHK enabled, PULCHK disabled,
       configuration hash MD5:
       6B 1B 68 BB D9 2E 58 E2 7F 35 AD 54 07 DF 0E 41
       data hash MD5: 64K
       A1 26 C7 EE 08 6F 4A 9E 29 7A C0 FA 19 90 9D A3>)
(   2,<2012-08-10 16:22:11.187 -0500>,<Administrator>,<TOPSPIN>,<proc1d>,<TOPSPIN 2.1>,
      <Start of raw data processing
       efp LB = 0 FT_mod = 6 PKNL = 1 PHC0 = 0 PHC1 = 0 SI = 32K 
       data hash MD5: 32K
       8B DB DC 62 CF BE 29 1F A9 BB 11 A4 E7 60 54 24>)
(   3,<2012-08-10 16:22:11.468 -0500>,<Administrator>,<TOPSPIN>,<proc1d>,<TOPSPIN 2.1>,
      <pk PHC0 = 180.0879 PHC1 = 0 
       data hash MD5: 32K
       C5 FC 83 A9 CF 9A CE 8C 1F 04 DF 19 4B C8 F5 1C>)
(   4,<2012-08-10 16:22:11.546 -0500>,<Administrator>,<TOPSPIN>,<proc1d>,<TOPSPIN 2.1>,
      <abs ABSG = 1 
       data hash MD5: 32K
       74 7F CE 42 B6 1B B4 62 75 44 BC 49 22 F8 03 1B>)
(   5,<2012-08-10 16:22:11.578 -0500>,<Administrator>,<TOPSPIN>,<proc1d>,<TOPSPIN 2.1>,
      <abs ABSG = 2 
       data hash MD5: 32K
       D0 2C 82 00 4A 92 2A A3 A6 C7 60 08 73 C5 ED 7C>)
(   6,<2012-08-10 16:22:11.609 -0500>,<Administrator>,<TOPSPIN>,<proc1d>,<TOPSPIN 2.1>,
      <abs ABSG = 3 
       data hash MD5: 32K
       11 39 82 C4 C5 FB D5 1C 9D E2 FF B1 CB F4 66 F0>)
(   7,<2012-08-10 16:22:11.640 -0500>,<Administrator>,<TOPSPIN>,<proc1d>,<TOPSPIN 2.1>,
      <abs ABSG = 4 
       data hash MD5: 32K
       74 13 01 69 21 61 79 5F 6F B7 18 8D A7 EA E3 E5>)
(   8,<2012-08-10 16:22:11.671 -0500>,<Administrator>,<TOPSPIN>,<proc1d>,<TOPSPIN 2.1>,
      <abs ABSG = 5 
       data hash MD5: 32K
       8F F9 F9 A3 68 53 C0 55 69 B2 D7 B7 08 A0 9E 1D>)
$$ ##END=
$$ 
$$ $$ hash MD5
$$ $$ 0A AF B5 2C FF FA 9D C1 70 A2 E0 D7 01 4C 62 86
##$RELAX= 
##$RELAX= 
##$RELAX= 
##$RELAX= 
##$RELAX= 
##$RELAX= 
##$RELAX= 
$$ Bruker specific parameters
$$ --------------------------
$$ [...]
##$TP= (0..7)
150 150 150 150 150 150 150 150
##$TP07= 0
##$TPNAME0= <>
##$TPNAME1= <>
##$TPNAME2= <>
##$TPNAME3= <>
##$TPNAME4= <>
##$TPNAME5= <>
##$TPNAME6= <>
##$TPNAME7= <>
##$TPOAL= (0..7)
0.5 0.5 0.5 0.5 0.5 0.5 0.5 0.5
##$TPOFFS= (0..7)
0 0 0 0 0 0 0 0
##$TUNHIN= 0
##$TUNHOUT= 0
##$TUNXOUT= 0
##$USERA1= <user>
##$USERA2= <user>
##$USERA3= <user>
##$USERA4= <user>
##$USERA5= <user>
##$V9= 5
##$VALIST= <valist>
##$VCLIST= <CCCCCCCCCCCCCCC>
##$VD= 0
##$VDLIST= <DDDDDDDDDDDDDDD>
##$VPLIST= <PPPPPPPPPPPPPPP>
##$VTLIST= <TTTTTTTTTTTTTTT>
##$WBST= 1024
##$WBSW= 4
##$XGAIN= (0..3)
0 0 0 0
##$XL= 0
##$YL= 0
##$YMAX_a= 481502
##$YMIN_a= -631366
##$ZGOPTNS= <>
##$ZL1= 120
##$ZL2= 120
##$ZL3= 120
##$ZL4= 120
##$ABSF1= 14.98509
##$ABSF2= -5.573092
##$ABSG= 5
##$ABSL= 3
##$ALPHA= 0
##$AQORDER= 0
##$ASSFAC= 0
##$ASSFACI= 0
##$ASSFACX= 0
##$ASSWID= 0
##$AUNMP= <proc_prof1d_extract_pilot.lims>
##$AXLEFT= 0
##$AXNAME= <>
##$AXNUC= <1H>
##$AXRIGHT= 0
##$AXTYPE= 0
##$AXUNIT= <>
##$AZFE= 0.1
##$AZFW= 0.1
##$BCFW= 0
##$BC_mod= 0
##$BYTORDP= 0
##$COROFFS= 0
##$CY= 15
##$DATMOD= 1
##$DC= 0
##$DFILT= <>
##$DTYPP= 0
##$F1P= 0
##$F2P= 0
##$FCOR= 0.5
##$FTSIZE= 32768
##$FT_mod= 6
##$GAMMA= 0
##$GB= 0
##$INTBC= 1
##$INTSCL= 1
##$ISEN= 128
##$LB= 0
##$LEV0= 0
##$LPBIN= 0
##$MAXI= 10000
##$MC2= 0
##$MEAN= 0
##$ME_mod= 0
##$MI= 0
##$NCOEF= 0
##$NC_proc= -8
##$NLEV= 6
##$NOISF1= 0
##$NOISF2= 0
##$NSP= 0
##$NTH_PI= 0
##$NZP= 0
##$OFFSET= 14.98509
##$PC= 1
##$PHC0= 180.0879
##$PHC1= 0
##$PH_mod= 1
##$PKNL= yes
##$PPARMOD= 0
##$PPDIAG= 0
##$PPIPTYP= 0
##$PPMPNUM= 2147483647
##$PPRESOL= 1
##$PSCAL= 4
##$PSIGN= 0
##$PYNMP= <proc.py>
##$REVERSE= no
##$SF= 400.02
##$SI= 32768
##$SIGF1= 0
##$SIGF2= 0
##$SINO= 400
##$SIOLD= 32768
##$SPECTYP= <>
##$SREGLST= <1H.CDCl3>
##$SSB= 0
##$STSI= 32768
##$STSR= 0
##$SW_p= 8223.68421052631
##$SYMM= 0
##$S_DEV= 0
##$TDeff= 65536
##$TDoff= 0
##$TI= <>
##$TILT= no
##$TM1= 0
##$TM2= 0
##$TOPLEV= 0
##$USERP1= <user>
##$USERP2= <user>
##$USERP3= <user>
##$USERP4= <user>
##$USERP5= <user>
##$WDW= 1
##$XDIM= 32768
##$YMAX_p= 454143756
##$YMIN_p= -713982
##$CURPLOT= <Network HP LaserJet P1505>
##$CURPRIN= <$Network HP LaserJet P1505>
##$DFORMAT= <normdp>
##$LAYOUT= <+/1D_H.xwp>
##$LFORMAT= <normlp>
##$PFORMAT= <normpl>
##$SURQMSG= 1
$$ End of Bruker specific parameters
$$ ---------------------------------
##NTUPLES= NMR SPECTRUM
##VAR_NAME=  FREQUENCY,     SPECTRUM/REAL,   SPECTRUM/IMAG
##SYMBOL=    X,             R,               I
##VAR_TYPE=  INDEPENDENT,   DEPENDENT,       DEPENDENT
##VAR_FORM=  AFFN,          ASDF,            ASDF
##VAR_DIM=   32768,         32768,           32768
##UNITS=     HZ,            ARBITRARY UNITS, ARBITRARY UNITS
##FACTOR=    0.250966925370066, 1,           1
##FIRST=     8223.43324360094, 76274,        7079
##LAST=      0,             -16365,          -43452
##MIN=       0,             -713982,         0
##MAX=       8223.43324360094, 454143756,    0
$$ Real data points
##PAGE= N=1
##DATA TABLE= (X++(R..R)), XYDATA
$$ [...]
19466e6515C45001c17022O4148A05298a9463q9182a7327p3635Q758k69402A7303
$$ -56515 345001 -317022 -252874 105298 -19463 -108645 -17327 -90962 -82204 -351606 17303
19454b84300B78675A19613b34053e7041K147j11086A03533j9764L7503B1940a18770
$$ -284300 278675 119613 -234053 -57041 -54894 -165980 103533 83769 121272 21940 -118770
19442A2225b39542C96449C4664d73949a44600d0919l5466l38497e1874k66003
$$ 12225 -239542 396449 34664 -473949 -144600 -40919 -76385 -414882 -51874 -317877
19432c17877a0668k08676M0992h8572r9034A57609a90692H0759a08586k25231
$$ -317877 -10668 -219344 -178352 -88572 -187606 157609 -190692 80759 -108586 -333817
19422c33817a65933p6116d2216k60016P7520j26838A34236K0142E6739a80260
$$ -333817 -165933 -242049 -42216 -302232 -224712 -351550 134236 154378 56739 -180260
19411A5252e287q7794K7601k25460C6344a17011q3916a5365j66988P1673G3615
$$ 15252 -5287 -93081 -65480 -290940 36344 -117011 -200927 -15365 -182353 -110680 73615
19399b33944J15845a6250E5139e863j48834d1594k19201a3859F7846a98474h7336
$$ -233944 -118099 -16250 55139 -5863 -154697 -41594 -260795 -13859 67846 -198474 -87336
19387E9430k7486e9739A89594r2710o343b21133c712j88571P0527A1893K7688
$$ 59430 31944 -59739 189594 96884 90541 -221133 -3712 -192283 -121756 11893 39581
19376C9581e7543A20539i4780H3709b9256o9850F7259K20321k6583a50879g0123
$$ 39581 -57543 120539 -94780 83709 -29256 -99106 67259 287580 260997 -150879 -70123
19364b1827A56721c67536h0911k81267C22446a20780A72477c7773k12512a02944
$$ -21827 156721 -367536 -80911 -362178 322446 -120780 172477 -37773 -250285 -102944
19353A33682a26283B32890F3578c1907o3615B09802E3427K3484a6847j78201l06628
$$ 133682 -126283 232890 63578 -31907 -95522 209802 53427 76911 -16847 -195048 -501676
19342e01676B09168d7620j82609n2397J08021M9893K9601j19047R2082q6738A83654
$$ -501676 209168 -47620 -230229 -282626 -174605 -124712 -95111 -214158 -122076 -208814 183654
19330a1056j95261g8526j86311C06947j32211G5450a79591P8125C0576c44840
$$ -11056 -206317 -78526 -264837 306947 174736 75450 -179591 -101466 30576 -344840
19319i7683j5136B39a26260B10583a31363j61378O8626a06019j32701B23522i861
$$ -97683 -112819 239 -126260 210583 -131363 -292741 -224115 -106019 -238720 223522 -9861
19307a03825b283C51743G7148a19155C6116R2582i0242b4534A7787d20622d5477
$$ -103825 -2283 351743 77148 -119155 36116 128698 -90242 -24534 17787 -420622 -45477
19295C5518d5978k0150j48746l3702E1525a6943m4679D4034a70706k3465C9773
$$ 35518 -45978 -66128 -214874 -248576 51525 -16943 -61622 44034 -170706 -194171 39773
19283a39222K4539C7987a59432e2527o7730F077a52790c8189q1294d5316I7859
$$ -139222 -114683 37987 -159432 -52527 -120257 6077 -152790 -38189 -119483 -45316 97859
19271b86702a28467l2381E4136r310b71396g8437a8280D5313a66122B635a06568
$$ -286702 -128467 -160848 54136 44826 -271396 -78437 -18280 45313 -166122 2635 -106568
19259a07942A51915A3117a65857k77510D0623K1230g4997j48701K0424B77743
$$ -107942 151915 13117 -165857 -443367 40623 61853 -74997 -223698 -203274 277743
19248B98863d3790q9140j24817C82171a9514j15218k2267D2581K52603b02753
$$ 298863 -43790 -132930 -257747 382171 -19514 -134732 -156999 42581 295184 -202753
19237A0157d0071A4887i2678A30133b39538B17775a4406k9036F5428a81522r9629
$$ 10157 -40071 14887 -92678 130133 -239538 217775 -14406 -43442 65428 -181522 -281151
19226b81151C11898a77857I4412e86858a18957l6451F4817c87065J45635G9695
$$ -281151 311898 -177857 94412 -586858 -118957 -155408 64817 -387065 -241430 79695
19215B23999a01842j56445m4180a0887j52325f7803j60794A7902a3209B7508i2151
$$ 223999 -101842 -258287 -302467 -10887 -163212 -67803 -228597 17902 -13209 27508 -92151
19203b62939a06017k20154O015a39572B41650d0402j68475A17742a71421C4911
$$ -262939 -106017 -326171 -320156 -139572 241650 -40402 -208877 117742 -171421 34911
19192a08302A28509a55811L2207A01143a2868l20130h9718C93477a79593N3627
$$ -108302 128509 -155811 -123604 101143 -12868 -332998 -89718 393477 -179593 -125966
19182a25966J4054n2967G225K6628b1995j48604j863R67f2816H8346L35576A31469
$$ -125966 -111912 -164879 7225 33853 -21995 -170599 -172462 -171495 -62816 88346 423922 131469
19169b69248B17803D7476f5259j37619B3710a17115L220A16552J8377b63955P1605
$$ -269248 217803 47476 -65259 -202878 23710 -117115 -113895 116552 134929 -263955 -192350
19158a92350C5993L6426a62622l444A77986D6395K8915a94717A92629a73986M4724
$$ -192350 35993 72419 -162622 -166066 177986 46395 75310 -194717 192629 -173986 -129262
19147a29262j4023j11715o2929A62562b46221J18940K6302D5966d39006J816J59027
$$ -129262 -143285 -255000 -317929 162562 -246221 -127281 -100979 45966 -439006 -437190 -278163
19136b78163O1329d2247a5809m5978k28497K4975i4417A99177B5684L8178J69153
$$ -278163 -216834 -42247 -15809 -61787 -290284 -265309 -94417 199177 25684 63862 233015
19125B33015c66892C7043b73709A17726J86296b1434C9910i2070n882n2076G6245
$$ 233015 -366892 37043 -273709 117726 304022 -21434 39910 -92070 -97952 -150028 76245
19113a35568B4488a40937C74524A52235i3732p1317q7969R7070a0709C1775b97914
$$ -135568 24488 -140937 374524 152235 -93732 -165049 -253018 -155948 -10709 31775 -297914
19101G7539a29334O1945k6737q8590N0932B2608g6252a2155j64759C335a5120
$$ 77539 -129334 -67389 -94126 -182716 -131784 22608 -76252 -12155 -176914 3335 -15120
19089a25253B71939j08495a00501C9945d2337o1489j61492P9177B74277b05011
$$ -125253 271939 163444 -100501 39945 -42337 -103826 -265318 -186141 274277 -205011
19078a313l78j2610j20590A99689q4905L5207K64587a50785A74533G0759P7294
$$ -1313 -1691 -14301 -134891 199689 114784 149991 414578 -150785 174533 70759 148053
19067A48053a26648k2227l9769O0401A11397b12633j3751m2223L9852j2292B3758
$$ 148053 -126648 -148875 -188644 -128243 111397 -212633 -226384 -268607 -228755 -241047 23758
19055B79943A6432b5540l20595a24604k45010b9482l1476p2523q9370A93941F261
$$ 279943 16432 -25540 -346135 -124604 -369614 -29482 -60958 -133481 -222851 193941 6261
19043A61168d06912j34113A0479g7003G6988d16469A32544d29183R4701a40144
$$ 161168 -406912 -541025 10479 -77003 76988 -416469 132544 -429183 -334482 -140144
19032a22203M0064k25783a52499k2167d4227a6023r4710C43333c1992D14649A396
$$ -122203 -82139 -307922 -152499 -174666 -44227 -16023 -110733 343333 -31992 414649 1396
19020D42995a26713D6519K54422A21230e37729b12708A34272F6040P3852o9886
$$ 442995 -126713 46519 300941 121230 -537729 -212708 134272 66040 139892 70006
19010G0006a8464j19998A27701L1025J10585H7563K8421n1550b7346B12019b81283
$$ 70006 -18464 -138462 127701 158726 269311 87563 115984 64434 -27346 212019 -281283
18998a72204j2642g5847D2380O6532f8445k79963d145A87190a87965b9093p6250
$$ -172204 -184846 -75847 42380 108912 -68445 -348408 -4145 187190 -187965 -29093 -105343
18987a05343b0252n0592j38213I9059a47192k83598g8338j30154p6590a8830k70961
$$ -105343 -20252 -70844 -209057 99059 -147192 -430790 -78338 -208492 -285082 -18830 -289791
18976b89791h2156I5436g9775G126K63949J15583J00365j95383o3698K9238a43890
$$ -289791 -82156 95436 -79775 7126 271075 386658 487023 291640 227942 257180 -143890
18964A36607j823F2084i0566H2822J14665g4955B42450f4907k14227L8093L011
$$ 136607 134784 62084 -90566 82822 197487 -74955 242450 -64907 -279134 -241041 -238030
18953b38030C39723b0042j3102A84947c8768c644E0328i4324A22341a10707I5466
$$ -238030 339723 -20042 -33144 184947 -38768 -3644 50328 -94324 122341 -110707 95466
18941a65911A73030c5963k02224F6031e40380B29798D8378J06431m6802c5456
$$ -165911 173030 -35963 -238187 66031 -540380 229798 48378 154809 108007 -35456
18930B43110d1834l16878a59025H7473k7885f3123k16425r093B04515J7099g9398
$$ 243110 -41834 -358712 -159025 87473 59588 -63123 -279548 -288641 204515 221614 -79398
18918a91775A1554b16455N2582A44595K0135D1074J10136a93086F7684a80962
$$ -191775 11554 -216455 -163873 144595 164730 41074 151210 -193086 67684 -180962
18907C07246j5305K70347B65216H4288f3145C00475a7793q5961j10438D06490
$$ 307246 291941 562288 265216 84288 -63145 300475 -17793 -103754 -214192 406490
18896b54055F7042o032a04432B8150j957e172r3615K6980j16823B446a68542A22173
$$ -254055 67042 61010 -104432 28150 26193 -5172 -98787 -71807 -188630 2446 -168542 122173
18883b88769j7D2099a98622F0063J3131O9077g9652J1239A0510c15551G399c8058
$$ -288769 -288786 42099 -198622 60063 73194 142271 -79652 -68413 10510 -315551 7399 -38058
18870A02864m4867N0821a57455A3170J61804a29048J2257b304r8621O07c8549
$$ 102864 57997 108818 -157455 13170 174974 -129048 -116791 -2304 -100925 -100318 -38549
18858D697b86627J38980B59125J25693A79265Q7337c34797a15241J3660j19098
$$ 4697 -286627 -147647 259125 384818 179265 266602 -334797 -115241 -101581 -220679
18848b20679J01446o870c4121A75205e9224A37668L9085c07328a05780j3559C19511
$$ -220679 -119233 -126103 -34121 175205 -59224 137668 176753 -307328 -105780 -119339 319511
18836a7154j22225A47233a30658A16330f8105K9536A05114a87169l10648a5549
$$ -17154 -139379 147233 -130658 116330 -68105 -38569 105114 -187169 -497817 -15549
18825A4995c00196i3597m4733e7496l94970G3771d52619a55587E7268i4320C86
$$ 14995 -300196 -93597 -138330 -57496 -452466 73771 -452619 -155587 57268 -94320 386
18813B35328j13627i0287L8634k7949k7752A6425J49839G2877d1738A35372j9025
$$ 235328 121701 -90287 -51653 -79602 -107354 16425 166264 72877 -41738 135372 116347
18802A16347i6518I3356K01657a62561G743K683b40896b2481j53969E5350a985
$$ 116347 -96518 93356 295013 -162561 7743 10426 -240896 -22481 -176450 55350 -1985
18790A58106a53221A22937C3106G762a40560F6225a00609b4773J0190C91846c0445
$$ 158106 -153221 122937 33106 7762 -140560 66225 -100609 -24773 -14583 391846 -30445
18778A4889d05868J82396j37625e3062A80633D1968a50476C10289b24064A33543
$$ 14889 -405868 -223472 -361097 -53062 180633 41968 -150476 310289 -224064 133543
18767i4260I508J23252b83105C2899b03303B96018E3885f7722l30521R6855j3983
$$ -94260 9508 132760 -283105 32899 -203303 296018 53885 -67722 -398243 -301388 -315371
18756c15371e1700A03245b29984i4494l43730A97895l0065f1198l16257E960c7173
$$ -315371 -51700 103245 -229984 -94494 -438224 197895 167830 -61198 -377455 5960 -37173
18744a36435E7451a48247k48961C535J07364H297L49426A50065J347h6961K5862
$$ -136435 57451 -148247 -397208 3535 110899 8297 357723 150065 151412 -86961 -61099
18733f1099l33252E9408c10460D4181c15412a36680K2279e1975q4976j39828R4044
$$ -61099 -394351 59408 -310460 44181 -315412 -136680 -114401 -51975 -136951 -276779 -182735
18722a82735q2931A51089a69366F4899K163a88996H3443a12738B59920a38607
$$ -182735 -265666 151089 -169366 64899 67062 -188996 83443 -112738 259920 -138607
18711H3353d9431j04001j9202N579N7220A50134G3948h326j89432e4364A47490
$$ 83353 -49431 -153432 -172634 -167055 -109835 150134 73948 -8326 -197758 -54364 147490
18699B02868c00295A6363b13291g7566l16616F4813h6351F553b51252q9019J43645
$$ 202868 -300295 16363 -213291 -77566 -394182 64813 -86351 6553 -251252 -340271 -196626
18688a96626B44672g9281r1299r3976A59554b0313A48534b46544k1544J32597
$$ -196626 244672 -79281 -170580 -264556 159554 -20313 148534 -246544 -268088 -135491
18678a35491A05277N6530k0352o6608b04420A95748b34992O0082A19556l1104
$$ -135491 105277 161807 141455 74847 -204420 195748 -234992 -174910 119556 88452
18668H8452l0727a49274j402j57094B03907H6493B2468a2719k7337H3101a3079
$$ 88452 57725 -149274 -150676 -307770 203907 86493 22468 -12719 -40056 83101 -13079
18656b6248i86E063M9540J5134g0367j9160B13785a60695j18601b7348j89125
$$ -26248 -986 5063 54603 69737 -70367 -89527 213785 -160695 -279296 -27348 -216473
18645b16473n8943h4522o3188O8062A59692a12219K7505A1205b00777B33864b13029
$$ -216473 -275416 -84522 -147710 -79648 159692 -112219 -84714 11205 -200777 233864 -213029
18633b8707B12758I5104a90969A28649J89120a29922c9653E23J10176f8895j69426
$$ -28707 212758 95104 -190969 128649 317769 -129922 -39653 523 110699 -68895 -238321
18622b38321e5780A8607g8224k01450J19770j58356a35268B81161A21156b19549
$$ -238321 -55780 18607 -78224 -279674 -159904 -318260 -135268 281161 121156 -219549
18611b18423e5338j65068M2136O0091k9762c4478j89621f1372I9591b01168d6153
$$ -218423 -55338 -220406 -178270 -118179 -147941 -34478 -224099 -61372 99591 -201168 -46153
18599C6688a61567e5834A45879a20576M8433j65665J8495A18522b80089J37582
$$ 36688 -161567 -55834 145879 -120576 -72143 -237808 -219313 118522 -280089 -142507
18589a42507O7810j66866b7168A76547J0297e6446C05858B1871b27291h321l22497
$$ -142507 -74697 -241563 -27168 176547 186844 -56446 305858 21871 -227291 -8321 -330818
18578c30818J31438P1721J9415f769k5346k55391j86426B19319B4814O0291d9519
$$ -330818 -199380 -127659 -108244 -6769 -32115 -287506 -473932 219319 24814 85105 -49519
18566a15040C5767b0893l3623j0601F6233a05278D3648a67186A89096f4598j12152
$$ -115040 35767 -20893 -54516 -65117 66233 -105278 43648 -167186 189096 -64598 -176750
18555a76750N3777N5312C6627P3652G539l167g5014A3228c39156O0431n0927a14468
$$ -176750 -122973 -67661 36627 110279 7539 4372 -75014 13228 -339156 -278725 -329652 -114468
18542A48953d41545O0156J89143K8830n4774C37522e1003j19198G662P0406Q8948
$$ 148953 -441545 -381389 -192246 -163416 -218190 337522 -51003 -170201 7662 78068 167016
18531A67016e2196I700K68319C882a99263h0804K1566k13966A62508a4537a102
$$ 167016 -52196 9700 278019 3882 -199263 -80804 -59238 -273204 162508 -14537 -1102
18519c38902f4602j05775A04280h6676E9406d248m04244A55260a4236j91098A31349
$$ -338902 -64602 -170377 104280 -86676 59406 -4248 -408492 155260 -14236 -205334 131349
18507A61316C6097b14270A83321m6342L936g3616k05211a37308E7187P0253C2462
$$ 161316 36097 -214270 183321 136979 140915 -73616 -278827 -137308 57187 127440 32462
18495a6944A96125a33138D9156J01236l8506a62565A1023M2185a36148e5293j78350
$$ -16944 196125 -133138 49156 150392 111886 -162565 11023 53208 -136148 -55293 -233643
18484b33643B4687J97857h0182A17777J81723b42316D9062O9458a81424O2910
$$ -233643 24687 222544 -80182 117777 299500 -242316 49062 118520 -181424 -118514
18474a18514A332a60353B40993b7973F5972a15610j09709H6670a61244M0795E922
$$ -118514 1332 -160353 240993 -27973 65972 -115610 -225319 86670 -161244 -120449 5922
18462c52407P7654f379K470A04210K2924B357b33745k9672J13955H5856k1363
$$ -352407 -274753 -6379 -3909 104210 127134 2357 -233745 -263417 -149462 85856 64493
18451F4493M26388b78362C6882A4932J72194g7792c3178B07992I0916f2763B3363
$$ 64493 490881 -278362 36882 14932 187126 -77792 -33178 207992 90916 -62763 23363
18439b24040R8116r526K2513d1765A14174g1310j04981b2433E8395b03658P9953
$$ -224040 -125924 -135450 -112937 -41765 114174 -71310 -176291 -22433 58395 -203658 -123705
18428a23705E831B819h0996A54736b37785A90917a33840B20913D7341c38976a68107
$$ -123705 5831 2819 -80996 154736 -237785 190917 -133840 220913 47341 -338976 -168107
18416G402b72635a8400D3361b28186d2147o023o4429B01857q1919C8032J23545
$$ 7402 -272635 -18400 43361 -228186 -42147 -48170 -112599 201857 119938 38032 161577
18405A61577m8043b87483H579a04523M1819J7495o4010K1747A57616m3970A3511
$$ 161577 113534 -287483 8579 -104523 -62704 -45209 -109219 -87472 157616 113646 13511
18393B7880a15692N2264C3164b32233A98035G9505K0533a65978l06814E3429i0687
$$ 27880 -115692 -63428 33164 -232233 198035 79505 100038 -165978 -472792 53429 -90687
18381b61805J30814e735k14546A73614a23022B48095b4299q4870D4357J83826
$$ -261805 -130991 -5735 -220281 173614 -123022 248095 -24299 -109169 44357 228183
18371B28183e9946q1337m9283F1568L74188E53J32749a66482J5707A47673l9648
$$ 228183 -59946 -141283 -190566 61568 435756 553 133302 -166482 -150775 147673 108025
18360A08025a43658A24270c32380B47745a61961B1258d8802k8218k0437a7117
$$ 108025 -143658 124270 -332380 247745 -161961 21258 -48802 -77020 -97457 -17117
18349A6867e7052a8880C7971c14588e0179A14602b35853e7987p0288J5282k22348
$$ 16867 -57052 -18880 37971 -314588 -50179 114602 -235853 -57987 -128275 -112993 -335341
18338c35341a37332b7775j26071O1120H3293a51872B36102F6421i0006I3534L23141
$$ -335341 -137332 -27775 -153846 -92726 83293 -151872 236102 66421 -90006 93534 416675
18327D16675A52534K99549D062b17407A03198g4393b2276I2838d99483A48601
$$ 416675 152534 452083 4062 -217407 103198 -74393 -22276 92838 -499483 148601
18316a10307B55695j03882a65545G1464B3913e15916D07294d8993e394l44161
$$ -110307 255695 151813 -165545 71464 23913 -515916 407294 -48993 -5394 -349555
18306c49555E614K41605i6816A79808c217m2721k1268A0056a55642k15425A09290
$$ -349555 5614 247219 -96816 179808 -3217 -45938 -67206 10056 -155642 -371067 109290
18294b03975K8492e2023E190i3216B01584b63951c5639k1340j03682j75622I9877
$$ -203975 -175483 -52023 5190 -93216 201584 -263951 -35639 -56979 -160661 -336283 99877
18282f614C8187L2306f3186b5734Q381r8327G9254a61858d6187l4923m8512q657
$$ -6614 38187 70493 -63186 -25734 -17353 -115680 79254 -161858 -46187 -81110 -129622 -138279
18270a38279e3154G6949A372J77561a27465e33k81534J11854I9030b58376c5265
$$ -138279 -53154 76949 1372 178933 -127465 -533 -282067 -170213 99030 -258376 -35265
18258b08516H1211A6003n884Q7248g7584A7797c00799a17814m4123A72612a15849
$$ -208516 81211 16003 10119 97367 -77584 17797 -300799 -117814 -161937 172612 -115849
18246A06245Q9016b92974L9817D8100k579J44221a40300A21361c5215B94159a64080
$$ 106245 195261 -292974 -253157 48100 45521 189742 -140300 121361 -35215 294159 -164080
18234b40153M3691G0787b45182d4502A92373c9369F5495A7952c37561A92978b0431
$$ -240153 -196462 70787 -245182 -44502 192373 -39369 65495 17952 -337561 192978 -20431
18222a45878k7252g7403C49286a39050N9959n1200C1032a09132L7388b7985k88527
$$ -145878 -173130 -77403 349286 -139050 -79091 -130291 31032 -109132 -71744 -27985 -316512
18211c16512H7860J01669b15125A85470L7752R0688A03923M1173a07424B17167
$$ -316512 87860 189529 -215125 185470 223222 313910 103923 145096 -107424 217167
18200D49264A59280c3595A69934a3797j33914j05846a00109A81819j5289c4518
$$ 449264 159280 -33595 169934 -13797 -147711 -253557 -100109 181819 166530 -34518
18189A25417d22010D0189a23671j79868J28651k59156J48972A13654f2138B7290
$$ 125417 -422010 40189 -123671 -303539 -174888 -434044 -285072 113654 -62138 27290
18178c12715F9604A5227J36422b76158A30547J59883G6399d16794a01066A74850
$$ -312715 69604 15227 151649 -276158 130547 290430 76399 -416794 -101066 174850
18167F2066g3947l1568C055a63152B9418J10750k3396b20274g4370B08363j1423
$$ 62066 -73947 -105515 3055 -163152 29418 140168 116772 -220274 -74370 208363 196940
18156A96940a05225q7458h4967g040k406k68832J10257J0949g2623A64689b2434
$$ 196940 -105225 -192683 -84967 -7040 -9446 -278278 -168021 -157072 -72623 164689 -22434
18144A0462M52421a37010D4447b07340c9844j31182K2053g2023q8281J6614C14112
$$ 10462 462883 -137010 44447 -207340 -39844 -171026 -148973 -72023 -160304 -143690 314112
18132A28710D2427K89359j44911p085i2117l7415j49856Q7319I5580D408Q2225
$$ 128710 42427 331786 186875 179790 -92117 -129532 -279388 -192069 95580 4408 86633
18121H6633a11234B41959H6374b03009a0507B0421h6786A10442E0073b01731B44695
$$ 86633 -111234 241959 86374 -203009 -10507 20421 -86786 110442 50073 -201731 244695
18109D88867c4150A57001a07591A52240J75807A4175a99566h175B06114F1594
$$ 488867 -34150 157001 -107591 152240 328047 14175 -199566 -8175 206114 61594
18098I6385g6515b9146j77693G004A0J4784L0056M2286J17303E7418M9081A7064
$$ 96385 -76515 -29146 -206839 7004 10 14794 44850 87136 204439 57418 106499 17064
18085A237a59437q9991J16521j104D122b19489B05554J3704C5187a51083j08504
$$ 1237 -159437 -249428 -132907 -134011 4122 -219489 205554 219258 35187 -151083 -259587
18074b59587f3019P37A05471b7796A76500g862j38556d6092C38049B1685Q5431
$$ -259587 -63019 -62282 105471 -27796 176500 -7862 -146418 -46092 338049 21685 107116
18063A07116A5269R6972B0622J04289Q4907q1810a18533c3611k35538c2947l29040
$$ 107116 15269 112241 20622 124911 209818 128008 -118533 -33611 -269149 -32947 -361987
18052c61987A23627B1000g1333J2528a2843m1480j24869D0037P3637m8086B478
$$ -361987 123627 21000 -71333 -58805 -12843 -54323 -179192 40037 113674 65588 2478
18040a15800G2657d6379B4485J41722f8910A19552K63256g0381l8953E28315A3456
$$ -115800 72657 -46379 24485 166207 -68910 119552 382808 -70381 -109334 528315 13456
18028b3683A86601k1686b8188B27269B0620b46923B99406B7958b09389R4969j08535
$$ -23683 186601 164915 -28188 227269 20620 -246923 299406 27958 -209389 -114420 -222955
18017b22955m204R4867G5283k3397J52120o5123a31930j81655D33173A48912b4449
$$ -222955 -227159 -132292 75283 51886 204006 138883 -131930 -313585 433173 148912 -24449
18005A37611b7301e651A67234b78538J00281b0591A9615b41937e6884F6870Q753
$$ 137611 -27301 -5651 167234 -278538 -178257 -20591 19615 -241937 -56884 66870 75623
17994G5623M5340K842g8550k11011B2018N1086b03920B77114b8964A45219l5789
$$ 75623 120963 123805 -78550 -289561 22018 73104 -203920 277114 -28964 145219 109430
17983A09430b3556k89013a0192E5047b53035A13664b4277k69411A1917M8555K36605
$$ 109430 -23556 -312569 -10192 55047 -253035 113664 -24277 -293688 11917 60472 297077
17972B97077h0300j07098r8755A19792c09824A18736k2836P8301i291k2221C31022
$$ 297077 -80300 -187398 -286153 119792 -309824 118736 95900 174201 -9291 -31512 331022
17960h594j9907E6103J14677c42922B16138E2445j4936a47956A43604c53665a13745
$$ -8594 -28501 56103 170780 -342922 216138 52445 37509 -147956 143604 -353665 -113745
17948G4159b06475f0521B59151h8883j25804R031C45584d3983A67224a92072p1368
$$ 74159 -206475 -60521 259151 -88883 -214687 -205656 345584 -43983 167224 -192072 -263440
17937b63440A80619b9727A10586J0632b80084B28676e8600n5370M3655E0066b83280
$$ -263440 180619 -29727 110586 121218 -280084 228676 -58600 -113970 -70315 50066 -283280
17925A67649b31978j73185F0339N2177a96286I7150b23126B38980a24376M2693
$$ 167649 -231978 -405163 60339 112516 -196286 97150 -223126 238980 -124376 -81683
17915h1683I7684N8360k3443F203a41849B562b80023B09428H1841L2398b25543
$$ -81683 97684 156044 132601 6203 -141849 2562 -280023 209428 81841 114239 -225543
17903a12757A41934a89759n436A67930k630J62278b3293H7812M6500j7719c19643
$$ -112757 141934 -189759 -195195 167930 165300 327578 -23293 87812 134312 116593 -319643
17891B81496m3342a4653p1147B9152b6451B91106h0012B19955b95536B37342a30415
$$ 281496 238154 -14653 -85800 29152 -26451 291106 -80012 219955 -295536 237342 -130415
17879A82537D0528a05618L355B79073A35694F010M46662D3251i5146a019q2675
$$ 182537 40528 -105618 -102263 279073 135694 6010 452672 43251 -95146 -1019 -83694
17868h3694b3745I9858a5993F1722r850a79623n5840d8297O892j96142a2365A55704
$$ -83694 -23745 99858 -15993 61722 51872 -179623 -235463 -48297 -41405 -237547 -12365 155704
17855a86499C8225J30437e2536B13021A03091a91559A08696J89975A12309J12466
$$ -186499 38225 168662 -52536 213021 103091 -191559 108696 298671 112309 224775
17845B24775o8074g4869B52869J01153h6688l652b3483r5131I0357P1662d0679
$$ 224775 156701 -74869 252869 354022 -86688 -90340 -23483 -118614 90357 162019 -40679
17833a82310B14451N2707j32767c38569A77658p3649m7051b54645h656k5195B065
$$ -182310 214451 267158 134391 -338569 177658 104009 56958 -254645 -8656 -33851 2065
17821a23043A37883a37171b9368l92688B43326e7001B22654J34936j48912D7131
$$ -123043 137883 -137171 -29368 -422056 243326 -57001 222654 357590 208678 47131
17810A52252Q5603j03925c276A77768a34313q2695b2619A41216D7113L7252a32655
$$ 152252 237855 133930 -3276 177768 -134313 -217008 -22619 141216 47113 84365 -132655
17798F6597a39623b606A93673e0309B15814q8989j0385h9166k915K5762b5627
$$ 66597 -139623 -2606 193673 -50309 215814 126825 116440 -89166 -92081 -66319 -25627
17786D2848a00604A47690c3227G7857a86442M4490B6330N15007I7430J51388j23212
$$ 42848 -100604 147690 -33227 77857 -186442 -141952 26330 541337 97430 248818 125606
17775A25606b315A85050G3517a67395D3843K7190Q3173c404A99631P54H7706R6778
$$ 125606 -2315 185050 73517 -167395 43843 71033 154206 -3404 199631 200385 87706 184484
17763A84484E0801N00942b12498A17186H464J86117n1862J74143d117j349A34839
$$ 184484 50801 551743 -212498 117186 8464 194581 142719 316862 -4117 -5466 134839
17751A40735b8928k5362A65863C4918J82872J1230g9542H5847l4452J6531N1957
$$ 140735 -28928 -54290 165863 34918 217790 229020 -79542 85847 51395 67926 119883
17740A19883J56747a33971I0689b84111I5798a71667j05150c0393j02477A07949
$$ 119883 276630 -133971 90689 -284111 95798 -171667 -276817 -30393 -132870 107949
17729i3382A34689R309a44843D4297a56363A21101E0109h4037B13756J08617D9858
$$ -93382 134689 143998 -144843 44297 -156363 121101 50109 -84037 213756 322373 49858
17717B0620a40773M1569C3370f9565A10399b15005D0022J34871O0968B0445O6057
$$ 20620 -140773 -99204 33370 -69565 110399 -215005 40022 174893 235861 20445 86502
17706H6502K713J84489B3854J21274a67824B42134M2437o4164M0705m7887G3727
$$ 86502 89215 273704 23854 145128 -167824 242134 284571 220407 261112 213225 73727
17694A68499B2589e4659A5448J8708b63869Q5394B95603E4707b4457o0123I8532
$$ 168499 22589 -54659 15448 34156 -263869 -178475 295603 54707 -24457 -84580 98532
17682B06291J4622a64258k2742f9147A95887A4212J57026a8779A51443a2089j06996
$$ 206291 220913 -164258 -187000 -69147 195887 14212 171238 -18779 151443 -12089 -119085
17671a19085M0590p2941A45803A0960g5992l12406a06183j08469A04427J87952
$$ -119085 -78495 -151436 145803 10960 -75992 -388398 -106183 -214652 104427 292379
17661B92379J88116b4038j84042A86112G3692p237M62396A3678a09698D5536P280
$$ 292379 480495 -24038 -208080 186112 73692 66455 528851 13678 -109698 45536 52816
17650E2816j5619J09067P7830b2425q381j21099E6559K52661A47339C8586R3986
$$ 52816 37197 146264 224094 -22425 -30806 -151905 56559 309220 147339 38586 132572
17639A32572g540A07693R195J83595G2926a39185C14332h6441j43229E5117K00883
$$ 132572 -7540 107693 116888 300483 72926 -139185 314332 -86441 -229670 55117 256000
17628B56000f5786I8665K96998A92380J0517d2502A95305m2442a0260B02080a16744
$$ 256000 -65786 98665 395663 192380 202897 -42502 195305 152863 -10260 202080 -116744
17616A17805P2776J33664n3114D8324J89072N1493R624o5739a80036C48123i2165
$$ 117805 190581 324245 271131 48324 237396 288889 298513 232774 -180036 348123 -92165
17604B46602j10117b06247R1749A18948J16129l1980H4946C2080N9524J69421
$$ 246602 136485 -206247 -114498 118948 235077 203097 84946 32080 91604 261025
17594B61025a23189B31502h0188B8724d5064A85521H4569J8967c46494A34506
$$ 261025 -123189 231502 -80188 28724 -45064 185521 84569 103536 -346494 134506
17583A54618n4200O5426C4806L6492K41378a05780e2472A54997J05953J27698
$$ 154618 100418 165844 34806 71298 312676 -105780 -52472 154997 260950 388648
17573C88648j68756J23506D7263M79649B40496n539G2925J17455r3735K12907
$$ 388648 219892 343398 47263 526912 240496 234957 72925 190380 96645 309552
17563C09552j03387l4293q5176J32904A02742b38258c6223e615B327K04975o6640
$$ 309552 206165 171872 86696 219600 102742 -238258 -36223 -5615 2327 207302 140662
17552A40662Q9331h490B01969a71716B93128j40316c5867A54929E2909e7814B38005
$$ 140662 229993 -8490 201969 -171716 293128 152812 -35867 154929 52909 -57814 238005
17540B85537j39711a4994D04493k9207E2018K15270F1358j9755J22794K33160
$$ 285537 145826 -14994 404493 375286 52018 267288 61358 41603 164397 397557
17530C97557j24113L70178C05953N8028L6663L28926J82704O043k22499J76762
$$ 397557 273444 643622 305953 363981 400644 729570 912274 918317 695818 872580
17520H72580j94271k97745K20414k81534K26930J94899k15233B04097J01733M30405
$$ 872580 678309 380564 600978 319444 546374 741273 526040 204097 305830 736235
17510G36235L68257l21473j15403J65499m757r8143j38316A33718N0658Q1061
$$ 736235 1104492 783019 667616 833115 828358 730215 591899 133718 184376 265437
17500B65437J16510J15063p4431A57149A2573K22993K13238j64745L3579A51259
$$ 265437 381947 497010 422579 157149 12573 235566 448804 284059 317638 151259
17489B30847j02684J49326j05298p3386a43533j16561C11780K41233A53176L8505
$$ 230847 128163 277489 172191 98805 -143533 -260094 311780 553013 153176 191681
17479A91681G5027L15229A06440R0063Q8268J95095j18874J29827B43213J05512
$$ 191681 75027 390256 106440 196503 284771 479866 360992 490819 243213 348725
17469C48725q10C3879L21065H9820J3467L08164E7825J34403K43680M4832G2433
$$ 348725 347915 33879 354944 89820 103287 411451 57825 192228 435908 480740 72433
17457E39471j91806j14471K35403j52073f0625B70056J43497j53920M1058L44727
$$ 539471 347665 233194 468597 316524 -60625 270056 413553 259633 300691 645418
17447F45418m6147r3898k25717j7459Q0506A5902K71064R1155G0391K60693j3745
$$ 645418 599271 505373 279656 262197 342703 15902 286966 378121 70391 331084 317339
17436C17339A35199M5274J29852R314J17343j99874L354L99k9569J47133Q6747
$$ 317339 135199 180473 310325 319639 436982 237108 240462 240861 211292 358425 445172
17425D45172A88364M541M1620L22247A66559M10131B09707K30944R4817j22098
$$ 445172 188364 192905 234525 556772 166559 576690 209707 440651 535468 413370
17415D13370A17225N53568a10774B56921J0072A25420J00237K9402M3342o3822
$$ 413370 117225 670793 -110774 256921 266993 125420 225657 255059 298401 234579
17405B34579J27802H2325d9254A86029N9124O4671K43067m1997j92940o3952K42300
$$ 234579 362381 82325 -49254 186029 245153 309824 552891 510894 317954 254002 496302
17394D96302j16048j08789J80173r0067G1019M86053k71012J93262d885H1503
$$ 496302 380254 271465 451638 361571 71019 557072 286060 479322 -4885 81503
17383H4266K3269k071Q9100L37862m4320k3949q9478j78544J88490H5909J41260
$$ 84266 107535 105464 194564 532426 488106 464157 374679 196135 384625 85909 227169
17372B27169H7504L29148A63176R4870l0531C0067M50817B35067J4491o6985o2851
$$ 227169 87504 416652 163176 258046 227515 30067 480884 235067 249558 182573 119722
17361A19722A5914J08098c1744A508J28291R9514K16197n1202K10841j79530l5897
$$ 119722 15914 124012 -31744 1508 129799 229313 445510 394308 605149 425619 389722
17350C89722r2636E5463J76732B1024J67151K06208A9831K93947n2284J3195a86319
$$ 389722 297086 55463 232195 21024 188175 394383 19831 313778 261494 274689 -186319
17338E44176k09521A1924N30046A57007j2763J47560B7787J72419j4195J50806
$$ 544176 334655 11924 541970 157007 144244 291804 27787 200206 186011 336817
17328C36817J6163J20471q3435j74490M0465P3111A52870K25800o3825K1542j02137
$$ 336817 352980 473451 390016 215526 255991 329102 152870 378670 314845 336387 234250
17317B34250K3081j07702j6698K04092j67000k0275M3780Q0405J4638K0523J85957
$$ 234250 257331 149629 132931 337023 170023 149748 193528 273933 288571 309094 495051
17306D95051h6542C67129N5507j80342o8909p5916j3432C7139M78964A93670J13293
$$ 495051 -86542 367129 422636 242294 173385 97469 84037 37139 516103 193670 306963
17295C06963J32530j9826J2726j22261o0335K07586j9285A49370J5811P0971Q9262
$$ 306963 439493 419667 432393 310132 249797 457383 438098 149370 165181 236152 325414
17284C25414O2610A08369L49246k1460A93139L5243J29306J54418B48783m7746
$$ 325414 388024 108369 457615 436155 193139 228382 357688 512106 248783 201037
17274B01037M08265j65451k10265A3312J66118K04915J39917j19858j934J09788
$$ 201037 609302 443851 233586 13312 179430 384345 524262 404404 402470 512258
17264E12258j06901j32206N4160b3036A42060P5322J61070j4888j02947K27848
$$ 512258 405357 273151 327311 -23036 142060 217382 378452 363564 260617 488465
17254D88465A56286L85399L6790k16127j7200K78082p6985B30759K08074m5214
$$ 488465 156286 541685 578475 362348 345148 623230 546245 230759 438833 393619
17244C93619p6305J08565A13442L05754B5805N5644K27155K47865A82738J52497
$$ 393619 317314 425879 113442 419196 25805 81449 308604 556469 182738 335235
17234C35235m7472J52603k6415N9704K5453B16766K94442r7246j48782J75331
$$ 335235 287763 440366 413951 473655 499108 216766 511208 413962 265180 440511
17224D40511A58983L7632H6178J62590J50486K72078C32752m6625n3234K40219
$$ 440511 158983 196615 86178 248768 399254 671332 332752 286127 232893 473112
17214D73112J25656n8279j22130J35601B07322j03304L70955r1303r7280j28939
$$ 473112 598768 540489 418359 553960 207322 104018 474973 383670 286390 157451
17204A57451K51731j22647K01413j016K5289B29190K41317j43626n08O5862o1692
$$ 157451 409182 286535 487948 486932 512221 229190 470507 326881 326373 392235 330543
17193C30543J23402p0585k2782m4480Q378A39389M00169m8752R9083k64603R149
$$ 330543 453945 383360 360578 316098 324476 139389 539558 490806 589889 325286 334435
17182C34435K22723H1607K85257K3995J07016p2609A4127M61158J52715B31197
$$ 334435 557158 81607 366864 390859 497875 425266 14127 475285 628000 231197
17171E57499Q2707j68225Q6291J24064N9818j00055L25507m25660L01384C20166
$$ 557499 640206 471981 558272 682336 742154 642099 967606 541946 843330 320166
17160E26001j95434L08972A31165D2826N76096B84067L57915j59592J04801n2095
$$ 526001 330567 639539 131165 42826 618922 284067 641982 482390 587191 535096
17150E35096J63396j4513B73873L37468p2911R5346j38537L0409J19383k83368
$$ 535096 698492 683979 273873 611341 538430 633776 495239 525648 645031 361663
17140C61663K50061A57573L03815j63197O59670D16765K98141j12819j57624P1040
$$ 361663 611724 157573 461388 298191 957861 416765 714906 602087 444463 515503
17130E15503j04325k1246K38659N7434k50942l7566L92511B28504K11529P8264
$$ 515503 411178 389932 628591 686025 435083 397517 790028 228504 440033 518297
17120E18297j05905J64092j04378J94617A96994N71696C21906M28329C42411K78015
$$ 518297 412392 576484 472106 666723 196994 768690 321906 750235 342411 620426
17110F20426K94369k77539K86606B70474N11871C14845J82287r7776J65861j99708
$$ 620426 914795 637256 923862 270474 782345 314845 497132 399356 565217 365509
17100C65509L3867L57593o1466j60506J89780k08174o4287K91309J24986k44392
$$ 365509 399376 756969 695503 534997 724777 516603 452316 743625 868611 624219
17090F24219J99617O2080j01152j40021m2198O2773J73365j30266j14126K86116
$$ 624219 823836 885916 784764 644743 602545 665318 838683 708417 594291 880407
17080H80407M5919k64914l1971J78471J49758l09133J41855l87374L72218Q4702
$$ 880407 926326 661412 629441 807912 957670 648537 790392 403018 775236 859938
17070H59938j54321l7797J39860J74963l69956M28437l28942J99036P5736q4340
$$ 859938 705617 667820 807680 982643 612687 1041124 712182 911218 986954 902614
17060I02614j85061L52361j46652L6138K83873l19563K64403k79178j21124J09640
$$ 902614 717553 1069914 923262 959400 1243273 923710 1188113 908935 787811 897451
17050H97451l58220p4396L44230L7827j45543L84278k53060M5584r8729N4640
$$ 897451 539231 464835 809065 846892 701349 1085627 832567 878151 779422 834062
17040H34062J03734K3824n8686J28991r8869J74874q4674K86143j24028l35784
$$ 834062 937796 961620 902934 1031925 933056 1107930 1023256 1309399 1185371 849587
17030H49587K15453m8966j5921L5320j80743N376M75111l47655J31736M9326j32901
$$ 849587 1065040 1016074 1000153 1035473 854730 860106 1335217 987562 1119298 1168624 1035723
17019A035723k08310K37334j7414q1112O7084j06550L8411q6893O7881K73858
$$ 1035723 827413 1064747 1047333 966221 1033305 926755 965166 878273 946154 1220012
17009A220012O3308o6882j2897k23925m9220M35340K345k94937k3977M66365m93846
$$ 1220012 1283320 1216438 1203541 979616 930396 1365736 1368081 1073144 1049167 1515532 1021686
16998A021686k0176J93676m18059L80337j39166J03011K34341J27687k18157j53815
$$ 1021686 1001510 1195186 777127 1157464 1018298 1121309 1355650 1483337 1265180 1111365
16988A111365N40938m54395j5933K65875j09020j45274J31666K82696k37708M0092
$$ 1111365 1652303 1197908 1181975 1447850 1338830 1193556 1325222 1607918 1370210 1410302
16978A410302k2644m3593Q5827P510K1075O7360j61526q549K21032K14636k65484
$$ 1410302 1387658 1344065 1429892 1437402 1458477 1525837 1364311 1355762 1576794 1791430 1525946
16967A525946O8067J95754n07038J27973N59723j26041m46826L21664j78895J37248
$$ 1525946 1594013 1789767 1282729 1410702 1970425 1844384 1397558 1719222 1540327 1677575
16957A677575J17416m3899l9980k634l152L74671J09775n29715L65557O8601m58691
$$ 1677575 1794991 1751092 1711112 1708478 1705326 2079997 2189772 1660057 2025614 2094215 1635524
16946A635524K15288k45844K84281j43939n8122L60263m053L9567j22095K17124
$$ 1635524 1850812 1604968 1889249 1745310 1687188 2047451 2043398 2082965 1960870 2177994
16936B177994j7317o8771k92834M5747J90610j88302K09029J52107o2326M0075
$$ 2177994 2160677 2091906 1799072 1844819 2035429 1847127 2056156 2208263 2145937 2186012
16926B186012k32239K29767J2555K85975M6486l34835J95544o3316p1842J9731
$$ 2186012 1953773 2183540 2196095 2482070 2528556 2193721 2389265 2325949 2254107 2273838
16916B273838n3560K23815m3194K52771j83518m452J1924K40279l02986L02328
$$ 2273838 2220278 2444093 2400899 2653670 2470152 2465700 2477624 2717903 2414917 2717245
16906B717245k89380K39434m8096J17186J50715n4117N01558j10587j09864j26215
$$ 2717245 2427865 2667299 2619203 2736389 2887104 2832987 3334545 3223958 3114094 2987879
16896B987879J75484m8388n1081L10492l58807K56856j54358L84939k00367j23388
$$ 2987879 3163363 3114975 3063894 3374386 3015579 3272435 3118077 3503016 3302649 3179261
16886C179261R4020J25584m7613M46935k03707k03490k3406M02345K1007J39725
$$ 3179261 3273281 3398865 3351252 3798187 3594480 3390990 3367584 3769929 3790936 3930661
16876C930661j59913k27309N78250J41545R1208l83494N0338p9865M20343j1318
$$ 3930661 3770748 3543439 4121689 4263234 4354442 3970948 4021286 3941421 4361764 4350446
16866D350446l56963N15280L40269l78581R5845J08777L78146l71982K40010M4321
$$ 4350446 3993483 4508763 4849032 4470451 4566296 4675073 5053219 4681237 4921247 4965568
16856D965568j82778M91328m36137K88340K79025j88667J86422J36490k80486
$$ 4965568 4782790 5274118 4837981 5126321 5405346 5216679 5403101 5539591 5259105
16847E259105N6913L14862J10182M7976J69619K67023k78340L07237K13470j56227
$$ 5259105 5316018 5630880 5741062 5789038 5958657 6225680 5947340 6254577 6468047 6311820
16837F311820L29925m573J19403k86637L31547J77417R7251K37384J90222P1232
$$ 6311820 6641745 6637172 6756575 6469938 6801485 6978902 7076153 7313537 7503759 7574991
16827G574991M1704O1447L43961k77632O59761j7610J40801M02248j37214L34280
$$ 7574991 7616695 7678142 8022103 7744471 8404232 8386622 8527423 8929671 8792457 9126737
16817I126737J46475K13463K73502K65501k14454N66017O6765N4804K93584M3823
$$ 9126737 9273212 9486675 9760177 10025678 9811224 10377241 10444006 10498810 10792394 10836217
16807A0836217N47588K27282n9745M68996J86916J39067L31704L21513M99898
$$ 10836217 11383805 11611087 11551342 12020338 12207254 12346321 12678025 12999538 13499436
16798A3499436L59591K64957K09121M12333J20258L60014L63319N47905J31759
$$ 13499436 13859027 14123984 14333105 14745438 14865696 15225710 15589029 16136934 16268693
16789A6268693Q04636J52736N51995L94969Q52116k03425P26684R63546N9451
$$ 16268693 17073329 17226065 17778060 18173029 19025145 18821720 19548404 20511950 20571401
16780B0571401O56750R12932M54877O06819O82102N75068M77933J037702N00835
$$ 20571401 21228151 22141083 22595960 23202779 23884881 24459949 24937882 25975584 26476419
16771B6476419J007350O51955J211871Q75581P05916J180427Q37324J171134J197258
$$ 26476419 27483769 28135724 29347595 30223176 30929092 32109519 32946843 34117977 35315235
16762C5315235J247200J311563J229880J202461J244125J898349J069800J764514
$$ 35315235 36562435 37873998 39103878 40306339 41550464 43448813 44518613 46283127
16754D6283127J934659J357339J729756J797131K217844J882416K087760K215247
$$ 46283127 48217786 49575125 51304881 53102012 55319856 57202272 59290032 61505279
16746F1505279K295756K094906K555305K642601K267099K617483K646864K794104
$$ 61505279 63801035 65895941 68451246 71093847 73360946 75978429 78625293 81419397
16738H1419397K613264K876424K484932K898084L095587K501626K552414L013507
$$ 81419397 84032661 86909085 89394017 92292101 95387688 97889314 100441728 103455235
16730A03455235K075130K961605J736330K342506J680107J506418J201906J521720
$$ 103455235 105530365 108491970 110228300 112570806 114250913 115757331 116959237 118480957
16722A18480957M45645O62927J2937k43970k92510q12700q21704j623895j508546
$$ 118480957 118926602 119589529 119602466 119358496 119065986 118253286 117431582 115807687 114299141
16713A14299141j574983j971668k455873k320783k376617k865345k545045k607398
$$ 114299141 112724158 110752490 108296617 105975834 103599217 100733872 98188827 95581429
16705I5581429k991465l018329k784752k536951k953903k895285k286672k768090
$$ 95581429 92589964 89571635 86786883 84249932 81296029 78400744 76114072 73345982
16697G3345982k697011k865129k057890k275583k408569k411481j894872k023283
$$ 73345982 70648971 67783842 65725952 63450369 61041800 58630319 56735447 54712164
16689E4712164k191299j635321k099325j510748j814745j405404j731144j511765
$$ 54712164 52520865 50885544 48786219 47275471 45460726 44055322 42324178 40812413
16681D0812413j382974j378612j233540r72291j452175q37451j161411j206784
$$ 40812413 39429439 38050827 36817287 35844996 34392821 33555370 32393959 31187175
16673C1187175r60526o07936j479978p69494q55619q07978j014764n40830q65383
$$ 31187175 30226649 29618713 28138735 27369241 26513622 25705644 24690880 24150050 23284667
16664B3284667m11433m80744q28419n86998m71188q59945o4685r06803j84534
$$ 23284667 22873234 22392490 21564071 20977073 20505885 19645940 19581255 18674452 18489918
16655A8489918q51335m52708m64097m15558j82041o20494k02053k89167n97385
$$ 18489918 17638583 17185875 16721778 16306220 16124179 15503685 15301632 15012465 14415080
16646A4415080j71223m21393l02162l75933m74554k71612O7313l52152l46292
$$ 14415080 14243857 13822464 13520302 13144369 12669815 12398203 12465516 12113364 11767072
16637A1767072m97709K11471j64613n73460n07414L78583o59779j79351Q5278
$$ 11767072 11269363 11480834 11316221 10742761 10235347 10613930 9954151 9774800 9860078
16628I860078j02209m64975j80706l57768K0586p2619o25107M18920m54899j82046
$$ 9860078 9757869 9292894 9112188 8754420 8775006 8702387 8077280 8496200 8041301 7859255
16618G859255M8586m99768Q9347Q1945j12396m52331R5700k6958l10655j74145
$$ 7859255 7907841 7408073 7497420 7579365 7466969 7014638 7110338 7083380 6772725 6598580
16608F598580K79789o93506k24755M35992M4117o38122o1566L2941J06567l04763
$$ 6598580 6878369 6184863 5960108 6396100 6440217 5802095 5740529 5773470 5880037 5575274
16598E575274j8217j75977M16359m39040J40956n73052J63949j94569K11831k38042
$$ 5575274 5557057 5381080 5797439 5358399 5499355 4926303 5090252 4895683 5107514 4869472
16588D869472j04569Q6611l61075j48801K4355L3175k19107j8926j27114R3525
$$ 4869472 4764903 4851514 4490439 4341638 4365993 4399168 4180061 4161135 4034021 4127546
16578D127546k62883L90314k06186r1933j38670j26093K94410l11093n5918j04646
$$ 4127546 3864663 4254977 4048791 3956858 3818188 3692095 3986505 3675412 3619494 3514848
16568C514848J33644l19265m7508Q0703o098j93485K71515J30997l1821o86540
$$ 3514848 3648492 3329227 3281719 3362422 3356324 3162839 3434354 3565351 3533530 2846990
16558B846990P9929M61333N9772m18161K37174j84609j70611j46296m7171K95419
$$ 2846990 2926919 3388252 3448024 3029863 3267037 3082428 2911817 2765521 2718350 3013769
16548C013769P081j77634k16772k6419k05479J2236K25104J22201j98189l60782
$$ 3013769 3020850 2843216 2626444 2600025 2394546 2406782 2631886 2754087 2555898 2195116
16538B195116M81675m37351L66233m42351M15752j63758p3649M8558j53415J18523
$$ 2195116 2676791 2239440 2605673 2163322 2579074 2415316 2341667 2390225 2236810 2355333
16528B355333L24425o82594J02665j01067J68024J75319q3500l21818m3364J03128
$$ 2355333 2679758 1997164 2099829 1998762 2166786 2342105 2258605 1936787 1893423 1996551
16518A996551L25497k39601j6353o4353M2510J58247m24251P9337L82639j77293
$$ 1996551 2322048 2082447 2066094 2001741 2044251 2202498 1778247 1857584 2240223 2062930
16508B062930O7017l52271J83988l51161J29834q6999J56195J31886j14707j77263
$$ 2062930 2129947 1777676 1961664 1610503 1740337 1653338 1809533 1941419 1826712 1649449
16498A649449j0108K76862j02838r2623J88816k63434j57894j9527j67726L39542
$$ 1649449 1639341 1916203 1813365 1720742 1909558 1646124 1488230 1468703 1300977 1640519
16488A640519j41214M551K89846N448k50114l08179J03302Q3057j53636L92962
$$ 1640519 1499305 1503856 1793702 1799150 1549036 1240857 1344159 1427216 1273580 1666542
16478A666542o0047j64993J26401O9036j70202m10411M65180J8836k10333K41934
$$ 1666542 1606495 1441502 1567903 1636939 1466737 1056326 1521506 1540342 1330009 1571943
16468A571943k67815k0652L47687n08934o5910M14204j44729n7099k174k28574
$$ 1571943 1304128 1283476 1631163 1122229 1056319 1470523 1325794 1268695 1266521 1037947
16458A037947J75095j25370K70824k38956j01079K49091j28462r6423J28284J63959
$$ 1037947 1213042 1087672 1358496 1119540 1018461 1267552 1139090 1042667 1170951 1334910
16448A334910k32554j19438P1956m7263l48261R2582O82033m53887J01279m6177
$$ 1334910 1102356 982918 1054874 1007611 659350 751932 1433965 980078 1081357 1035180
16438A035180j27893K27251j92363j32282n1511M15957k49260J69816J48091L8263
$$ 1035180 907287 1134538 942175 809893 758382 1174339 925079 1094895 1242986 1281249
16428A281249k36187j11714P9376M6275j30876J0635q2939R4277j32656K48564
$$ 1281249 1045062 933348 1012724 1058999 928123 938758 855819 950096 817440 1066004
16418A066004j05683k86528J53040k16953K75623j58038j02828K90007j88984
$$ 1066004 960321 673793 826833 609880 885503 727465 624637 914644 725660
16409G25660J69936K91440k73719j50697J35137k89589J72950J98555l70195J14775
$$ 725660 895596 1187036 913317 762620 897757 608168 781118 979673 609478 724253
16399G24253K46790j56962k60918K43228J55670k48725k9716N0922j83793K67314
$$ 724253 971043 814081 553163 796391 952061 703336 673620 724542 540749 808063
16389H08063j68362J88954k4987j79389J85792J58215k28901K62445l09746k8294
$$ 808063 639701 828655 803668 624279 810071 968286 739385 1001830 692084 663790
16379F63790J00806l1450Q978J46143k54868p8977O73483n72574N368J29910k12504
$$ 663790 764596 733146 742124 888267 633399 554422 1227905 655331 660699 790609 578105
16368E78105N1818J38654A80439N74060j54956Q1637l2747k8450j37026K39596
$$ 578105 629923 768577 180439 754499 599543 681180 648433 619983 482957 722553
16358G22553L6857M8484l94417r6873J44063J50158R0049J24006r5099j42474
$$ 722553 759410 807894 413477 316604 460667 610825 700874 824880 729781 587307
16348E87307L3295j10669R1087J60842j79931k69001K57209J2367M7651O6326
$$ 587307 620602 509933 601020 761862 581931 312930 570139 582506 630157 696483
16338F96483j93855K09257j93898J61420j49578j36266j37166J31526M31666C69009
$$ 696483 502628 711885 517987 679407 529829 393563 256397 387923 819589 369009
16327A73395L85427K445N5702k00521L38835l49512M8474n8304J44969j03516
$$ 173395 558822 561267 616969 416448 755283 405771 454245 395941 540910 437394
16317D37394K01206k44041M3078K1208K2411q4716R9965j18751P440j39937J52363
$$ 437394 638600 394559 437637 458845 481256 396540 496505 377754 385194 245257 397620
16306C97620A87925L67042k50556q6129f5287C97321j95679J46404J99142A33150
$$ 397620 187925 554967 304411 218282 -65287 397321 201642 348046 547188 133150
16295D84528j59056P3217j29596N08801C15205l7494j4118j27722P5017J35662
$$ 484528 325472 398689 269093 777894 315205 277711 263593 135871 210888 346550
16285C46550L78553C45853J86658k25986m2123m8575L26739k67106L55171C07498
$$ 346550 725103 345853 532511 306525 264402 215827 542566 275460 630631 307498
16274E20588B04953L76211m9823A64029l9756N19946o7361j34092l8247j14554
$$ 520588 204953 581164 531341 164029 124273 644219 576858 442766 404519 289965
16264B89965k4651J73017J42794B83256K08835j51238e1199E49450j43945N522
$$ 289965 265314 438331 581125 283256 492091 340853 -51199 549450 405505 411027
16254D11027o3751G8825L47783A80489K05863K9718A87960N6715J81655q7852
$$ 411027 347276 78825 426608 180489 386352 416070 187960 244675 426330 338478
16244C38478K44392R99F5953K45800K36517B24692K3012K6961l1478B3616N15744
$$ 338478 582870 583869 65953 311753 548270 224692 247704 274665 243187 23616 539360
16233E39360F3420L06695j26826O8666k3365K97404r7571p6638q3891q7699K8400
$$ 539360 63420 370115 243289 311955 288590 585994 488423 411785 327894 240195 268595
16222B68595Q0927G8146E459K35112F9534M1997H72L72461j67155K4194j14696
$$ 268595 349522 78146 5459 240571 69534 111531 872 373333 206178 230372 115676
16211A15676L25945A93079J16323o1828N8703m7765j04560L18538E2040L49611
$$ 115676 441621 193079 309402 247574 306277 258512 153952 472490 52040 401651
16201D01651k124C1023P2815J14115O8302B5128J68266l3898k7992L894K92231
$$ 401651 399527 31023 103838 217953 286255 25128 193394 159496 131504 135398 427629
16190D27629H4304l3617K35617H7103J3690J9845k2744Q276N2072B9968J08376
$$ 427629 84304 50687 286304 87103 100793 120638 97894 106170 158242 29968 138344
16179A38344L79771e3791B79531M1985m1727b62337B32881o3850B0506L78356
$$ 138344 518115 -53791 279531 321516 279789 -262337 232881 169031 20506 398862
16169C98862A49830J39811P7589L1678a3401H6478J32448b92256A64889p1265
$$ 398862 149830 289641 367230 398908 -13401 86478 218926 -292256 164889 93624
16159I3624K06282M26p2996c2036D13366i016A15925K9435L53441k46248n8693
$$ 93624 299906 300332 227336 -32036 413366 -9016 115925 145360 498801 252553 193860
16148A93860R5026D4867J79589P2391j22901k8454P4221P9350I8369J49012H2295
$$ 193860 288886 44867 224456 296847 173946 145492 219713 299063 98369 247381 82295
16136A45201J92245a4995A38091k7555L8384J94263G6708M6732a28903e6242H2113
$$ 145201 337446 -14995 138091 110536 148920 343183 76708 123440 -128903 -56242 82113
16124B25597G0383A2525K55016r9910J65282A20503a80030d9130C33023A53060
$$ 225597 70383 12525 267541 167631 332913 120503 -180030 -49130 333023 153060
16113E2916L66211A78517N1390q1907g175C61745j04411j27477E9562J01468P6294
$$ 52916 419127 178517 229907 148000 -7175 361745 257334 129857 59562 161030 237324
16102B37324l1246N6351r0236G9139h7411A22315g9570D53551F218J7612K73147
$$ 237324 206078 262429 172193 79139 -87411 122315 -79570 453551 6218 23830 296977
16091B96977G7208b8283j58026A15929J36340G6854K19627B6838J19184L4739
$$ 296977 77208 -28283 -186309 115929 252269 76854 296481 26838 146022 180761
16081A80761b32859K6466B10851J09698c3284A55862l0006c8586A20546k396a47118
$$ 180761 -232859 -206393 210851 320549 -33284 155862 125856 -38586 120546 118150 -147118
16069B338i574A79587k1360a14322B4525d3094C15252b22593e8515A39812J31898
$$ 2338 -9574 179587 158227 -114322 24525 -43094 315252 -222593 -58515 139812 271710
16058B71710E2813R6081b02555a6747D24200c7402j63819g1083A35921n6175c3791
$$ 271710 52813 148894 -202555 -16747 424200 -37402 -201221 -71083 135921 79746 -33791
16046b96583A07580Q3658i9804F0742c4545k4018p8819A23310a4562j90084B46559
$$ -296583 107580 191238 -99804 60742 -34545 -58563 -137382 123310 -14562 -204646 246559
16034C48425h7735m9712m9639C06524b60718A20479M2626M2545K0439i9001j5012
$$ 348425 -87735 -137447 -187086 306524 -260718 120479 163105 205650 226089 -99001 -114013
16023a14013k59741A86665O2257A6196b45263R4319B1183a8669G8247K115J11349
$$ -114013 -373754 186665 248922 16196 -245263 -150944 21183 -18669 78247 80362 191711
16012A91711D0312K08008g382A59341G9097Q771J8353a7621A19709l741J07736
$$ 191711 40312 248320 -7382 159341 79097 87868 106221 -17621 119709 115968 223704
16001B23704J07672a90563J5081e2347n3482a0171q8085B03562K7154I4260j2985
$$ 223704 331376 -190563 -175482 -52347 -105829 -10171 -98256 203562 230716 94260 81275
15990H1275K27962p4868o0163K04233J70724K94382j14601M23428k82189J01913
$$ 81275 309237 234369 174206 378439 549163 843545 728944 1152372 870183 972096
15980I72096B71948J60702b2101C26502p6213g8766C08865c0521a0875I1098B8553
$$ 972096 271948 432650 -22101 326502 250289 -78766 308865 -30521 -10875 91098 28553
15968B82447a10226p2954f80A37926A5209f8767m9L1144J7708A20973a77690P031
$$ 282447 -110226 -183180 -680 137926 15209 -68767 -68816 -37672 -19964 120973 -177690 -170659
15956a70659j10745A84185b43188e5644A29026a29726q6528c9373B71772n3071
$$ -170659 -281404 184185 -243188 -55644 129026 -129726 -216254 -39373 271772 218701
15946B18701j06370L0836a19708p5553A78677D5360J09384A207d7787A5260K23531
$$ 218701 112331 143167 -119708 -195261 178677 45360 154744 1207 -47787 15260 238791
15935B38791p7587O1703f5753Q207B3704a03006A80072B8714a41489E7160a67680
$$ 238791 161204 222907 -65753 -57546 23704 -103006 180072 28714 -141489 57160 -167680
15923a08815p1854B7823a11130j25469H7995L0904K2793a00897B15774A00999
$$ -108815 -180669 27823 -111130 -236599 87995 118899 141692 -100897 215774 100999
15912h1240B59165J5198a05903d6000j66821G086J06177d0648B25157R2215j00148
$$ -81240 259165 274363 -105903 -46000 -212821 7086 113263 -40648 225157 317372 217224
15901B17224a42715B40089h4908j07147D6328N6209J3718c4995G6759g1271b4596
$$ 217224 -142715 240089 -84908 -192055 46328 102537 116255 -34995 76759 -71271 -24596
15889B22718F4238B3012K4115b17066E1663e061k32645B3414b06479a0268l69426
$$ 222718 64238 23012 47127 -217066 51663 -5061 -237706 23414 -206479 -10268 -379694
15878c79694A95656a51795A23090J18404o2385i6948J2089E3898B4097J53023
$$ -379694 195656 -151795 123090 241494 179109 -96948 -84859 53898 24097 177120
15868A77120D7293e4207J546k96761a07444M2317B06955b5586C9920b21512J05506
$$ 177120 47293 -54207 -52661 -349422 -107444 -65127 206955 -25586 39920 -221512 -116006
15857a16006j97158B5275P2816K22144A29275a11707b4781q1137I0340c9868k19628
$$ -116006 -313164 25275 98091 320235 129275 -111707 -24781 -105918 90340 -39868 -259496
15846b59496f5734E95884a08373l00447J01728a08675k99137i4797G6902g4844
$$ -259496 -65734 595884 -108373 -408820 -307092 -108675 -407812 -94797 76902 -74844
15835d8906A05749a06430D1029c28068J61915I4688a61990A77938g3200j52540
$$ -48906 105749 -106430 41029 -328068 -166153 94688 -161990 177938 -73200 -225740
15825b25740D31280g1483b6927H2161M7756i479A46966j0838c705k16022D4772
$$ -225740 431280 -71483 -26927 82161 129917 -9479 146966 136128 -3705 -219727 44772
15813a28544C9276i8104d1840A85797C5935M2233e0458A92822a04193b4969k1917
$$ -128544 39276 -98104 -41840 185797 35935 78168 -50458 192822 -104193 -24969 -46886
15802d6886A94758l5099b04414b7449E2938a3107B33280I1498d39896c4998r7661
$$ -46886 194758 159659 -204414 -27449 52938 -13107 233280 91498 -439896 -34998 -132659
15791a32659f2005A00248B6038b4413F8789i8723j33422C05303a16046q9811A63725
$$ -132659 -62005 100248 26038 -24413 68789 -98723 -232145 305303 -116046 -205857 163725
15779H1500L1174B7489i5235p5402N765G4121C71P998b3559J0184B15094p8389
$$ 81500 112674 27489 -95235 -170637 -164872 74121 371 8369 -23559 -13375 215094 136705
15767A36705A1516i2379j39198A89462b25347J1906c0917B08347f3732k29163
$$ 136705 11516 -92379 -231577 189462 -225347 -213441 -30917 208347 -63732 -292895
15757b92895A06816L26246A22173d219G7769a11811j07486o9947i3540A27644
$$ -292895 106816 433062 122173 -4219 77769 -111811 -219297 -289244 -93540 127644
15746A35889a54031P3665C50958r7442H3398K95806A32062J08354A608b22716
$$ 135889 -154031 -80366 350958 253516 83398 379204 132062 240416 1608 -222716
15735A58741a30637n7530a8240j31191p7985A86838C9349b21009i8347j09489
$$ 158741 -130637 -188167 -18240 -149431 -227416 186838 39349 -221009 -98347 -207836
15725b07836h5218A25219A1399n529b46023a6573l19429a40132a594B46058a84604
$$ -207836 -85218 125219 11399 5870 -246023 -16573 -336002 -140132 -1594 246058 -184604
15713F5460K19362b30590h6649F4386a82815l03124a32834N5988K7682D00358
$$ 65460 284822 -230590 -86649 64386 -182815 -485939 -132834 -76846 -49164 400358
15702f0362k75996a14236j71574m003R2218E6942i8801Q260A73395F558J31914
$$ -60362 -336358 -114236 -285810 -289813 -197595 56942 -98801 -90541 173395 6558 138472
15691A38472b3487A56478d676J952m8173A71424D1772N7878A4181h3975J2583
$$ 138472 -23487 156478 -4676 -2724 -50897 171424 41772 99650 14181 -83975 -71392
15680g1392a7281B5705e3755C67196c68693p0023A349a11018a063l1710D66749
$$ -71392 -17281 25705 -53755 367196 -368693 -438716 1349 -111018 -1063 -32773 466749
15668I4954A2562K87659G8211a36768B27104A6231K4779a10071d2876l31001a66128
$$ 94954 12562 300221 78211 -136768 227104 16231 41010 -110071 -42876 -373877 -166128
15656F217L9262b10740P8435F6239R9882a07055I4844J6750D5472e2153I9962
$$ 6217 45479 -210740 -132305 66239 166121 -107055 94844 111594 45472 -52153 99962
15644B31432a91368H3760a69549K4621a9345o0811D7375b5801A56813g7636J7197
$$ 231432 -191368 83760 -169549 -144928 -19345 -80156 47375 -25801 156813 -77636 -60439
15633f0439k56272g034m5192b1003A21959B3654a36895A76175c6736H8384C0371
$$ -60439 -316711 -7034 -52226 -21003 121959 23654 -136895 176175 -36736 88384 30371
15621f5600j28014d6151j17606C2574b06091j46958D1992K9690b37546Q1228P3477
$$ -65600 -193614 -46151 -163757 32574 -206091 -353049 41992 71682 -237546 -156318 -82841
15610h2841m9176j60776a4127I4496L7590J84871C1056b5985B63118f13604A09459
$$ -82841 -132017 -292793 -14127 94496 132086 316957 31056 -25985 263118 -613604 109459
15598b76057a11758J9657b5836j88738B06807R271l4850K3108H3364a2583B51610
$$ -276057 -111758 -92101 -25836 -214574 206807 216078 181228 204336 83364 -12583 251610
15586A57974a96041n0556H7599J91507f5233j74206J5459L0111A22936a73210
$$ 157974 -196041 -246597 87599 279106 -65233 -239439 -223980 -193869 122936 -173210
15575c4823a661D9171O4169i4968r8421C7598J4064c9628j82654J05578m1428
$$ -34823 -1661 49171 113340 -94968 -193389 37598 51662 -39628 -222282 -116704 -158132
15564a58132f0490A70736E1007J43104E6637b7352m626A36565K53603b74513j79601
$$ -158132 -60490 170736 51007 194111 56637 -27352 -31978 136565 390168 -274513 -454114
15553d54114d0616D9782a2850r9515A7734b37869M5456A03143a95348Q4768d4312
$$ -454114 -40616 49782 -12850 -112365 17734 -237869 -192413 103143 -195348 -110580 -44312
15541a23758G658J37148a5741B57374a94614d8810p7473B60351A4853J39883J15606
$$ -123758 7658 144806 -15741 257374 -194614 -48810 -126283 260351 14853 154736 270342
15530B70342f0899H1971b504k47530G1717a34762c0301F9431f1851B50980A4179
$$ 270342 -60899 81971 -2504 -250034 71717 -134762 -30301 69431 -61851 250980 14179
15518C82733j85917I5626J49503p1238G4178J37986k1021G4387L04766j05522
$$ 382733 196816 95626 245129 173891 74178 212164 191143 74387 379153 273631
15508B73631R2884I9209O6995K3963a41923A13776R7992I4422a48792f714A44415
$$ 273631 366515 99209 166204 190167 -141923 113776 211768 94422 -148792 -6714 144415
15496A90955b383F7444K4923k0405L5566j9370f5274A70805C1938J06084g3498
$$ 190955 -2383 67444 92367 71962 107528 88158 -65274 170805 31938 138022 -73498
15484A61421P1764A03409a49372A30514O2859o1768N09252A75906D0031L47573
$$ 161421 233185 103409 -149372 130514 193373 131605 640857 175906 40031 387604
15474C87604J46918L13582k48243k56361J61740H2930K10585G8364K12152H0934
$$ 387604 534522 848104 599861 343500 505240 82930 293515 78364 290516 80934
15463B70658d1064o8589c9689p7075A20191I379l818g631H214f4998m1811I1945
$$ 270658 -41064 -109653 -39689 -116764 120191 9379 5561 -7631 8214 -64998 -106809 91945
15450A78686A1914a3452F9619M677a10510Q099D96558j83483K02180P86592k25944
$$ 178686 11914 -13452 69619 74296 -110510 -102411 496558 313075 515255 1301847 1075903
15439A075903K5140l16198C447M68610H2600Q9111b33606H7971f4149K8109B80715
$$ 1075903 1101043 784845 3447 472057 82600 171711 -233606 87971 -64149 -36040 280715
15427B36751j08792Q990d9057l1071j17959b0637D3131J0655j7485a69098b866
$$ 236751 127959 136949 -49057 -80128 -198087 -20637 43131 53786 36301 -169098 -2866
15415B10774G345J26547a48247g1606b7511A5390c45812g297j72219A0724a4273
$$ 210774 7345 133892 -148247 -71606 -27511 15390 -345812 -7297 -179516 10724 -14273
15403A5179a53038m3159j12000B90410c6194D3949M6528l8123b44994P0314A40908
$$ 15179 -153038 -196197 -308197 290410 -36194 43949 90477 52354 -244994 -174680 140908
15391f8542B28446J72288A85825B1372J27442a88976G8369B0898a71769Q4442
$$ -68542 228446 400734 185825 21372 148814 -188976 78369 20898 -171769 -87327
15381h7327a9694q4238d6955r8348A72283k0810J95144E9374K40363j38957m4604
$$ -87327 -19694 -103932 -46955 -145303 172283 151473 346617 59374 299737 160780 116176
15370A16176K93397A59056a96284B6160J55282J20376C7138A0563L1059K35475
$$ 116176 409573 159056 -196284 26160 181442 301818 37138 10563 41622 277097
15360B77097a27444c7541B69181J3636n2635F1094L76143E2934l009K36133A09816
$$ 277097 -127444 -37541 269181 282817 230182 61094 437237 52934 49925 286058 109816
15348C7657R2495j337n2992K73326J52156k18889c737A89865L48154k68150C4998
$$ 37657 130152 128815 75823 349149 501305 282416 -3737 189865 538019 269869 34998
15336B79496j32311J10744C8484J34309f0252D3040J05618Q1500p4773B6001J5492
$$ 279496 147185 257929 38484 172793 -60252 43040 148658 230158 155385 26001 41493
15325D1493a96552l1318B73169j5467j13343J6234Q5473n4447p6056E3516K85820
$$ 41493 -196552 -227870 273169 257702 144359 160593 246066 191619 115563 53516 339336
15314C39336K1440A21711J82596A41342F8542i4479A65704m2760g9818c1496A83474
$$ 339336 360776 121711 304307 141342 68542 -94479 165704 122944 -79818 -31496 183474
15302B10986a09704J4043C45780A27267b787I5224a94941h2040j8301c8630C5911
$$ 210986 -109704 -95661 345780 127267 -2787 95224 -194941 -82040 -100341 -38630 35911
15290B2684J42256a4607A08207a66910A31169a38928O5089l30897a2340K000A50268
$$ 22684 164940 -14607 108207 -166910 131169 -138928 -73839 -404736 -12340 -10340 150268
15278A82887o5441c64354J41324j14118C1643K27768Q2431E8369j5535q854J06233
$$ 182887 117446 -364354 -223030 -337148 31643 259411 341842 58369 42834 33980 140213
15267A40213j014J57477P7776e5195n064D388J60813f355k24287f7809j72231
$$ 140213 139199 296676 374452 -55195 -60259 4388 165201 -6355 -230642 -67809 -240040
15256b40040d1818A11623K2050J93728a70461E3140a07738D0696M2469i0559A80169
$$ -240040 -41818 111623 133673 327401 -170461 53140 -107738 40696 83165 -90559 180169
15244B06245M60507M2470O69718J37861k88212P56613I68852D30899j16728k1410
$$ 206245 666752 709222 1378940 1516801 1228589 1985202 968852 430899 314171 292761
15234B92761p2509N8062b18471G9691J69570j12359J34317a52177A52024L6333
$$ 292761 220252 278314 -218471 79691 249261 136902 271219 -152177 152024 188357
15224A88357a26066B3930R2875f7463r0460A86701F9825R8724h4972I6695R0388
$$ 188357 -126066 23930 116805 -67463 -157923 186701 69825 168549 -84972 96695 187083
15213A87083K35717A0465J85386K6524r427C1580d2056B21380C0884d26232H528
$$ 187083 422800 10465 195851 222375 212948 31580 -42056 221380 30884 -426232 8528
15201B6469a1845k01282F609g0102D11056F2919K18677A19339d0496B346g2082
$$ 26469 -11845 -213127 6609 -70102 411056 62919 281596 119339 -40496 2346 -72082
15189f2257A97606G0320b65374B77069r2404c7873D90871B07508I1746j7015g0961
$$ -62257 197606 70320 -265374 277069 184665 -37873 490871 207508 91746 74731 -70961
15177A8536b26038A45296O966C9410J86893o0957E0187L68262A0773b3858C69683
$$ 18536 -226038 145296 152262 39410 226303 165346 50187 418449 10773 -23858 369683
15165B81777l1987m8862b18233B39561P0290P0927H5302a6287A21635m1662K1114
$$ 281777 249790 200928 -218233 239561 309851 380778 85302 -16287 121635 79973 101087
15154A01087a78348B45855j8060a17725A69411n5870k3962r634b19929B6164d8117
$$ 101087 -178348 245855 227795 -117725 169411 113541 89579 79945 -219929 26164 -48117
15142a14493A43836R6336A05885R4493g6807H237a82136E41482F7293C2212J74744
$$ -114493 143836 240172 105885 200378 -76807 8237 -182136 541482 67293 32212 206956
15131B06956H082h4593A71150J1058J29155B8056K96629j26664J1126a7705B70162
$$ 206956 8082 -84593 171150 182208 311363 28056 324685 198021 209147 -17705 270162
15119E8744L72407r8758J01152A54193K14357q4926F5588g6553F9577J4648K7730
$$ 58744 431151 332393 433545 154193 368550 283624 65588 -76553 69577 84225 111955
15108A11955k6204a2739A64373d7998k56108c3856A96527J07048A4420J17355
$$ 111955 85751 -12739 164373 -47998 -304106 -33856 196527 303575 14420 131775
15098A31775O0874c1655B18856J69400a34991A54131o7670c9887B62741b0110
$$ 131775 192649 -31655 218856 388256 -134991 154131 86461 -39887 262741 -20110
15087a72589B57180D9430K21690f9594k43513A75483q1268a13472A97471d8285
$$ -172589 257180 49430 271120 -69594 -313107 175483 94215 -113472 197471 -48285
15076B41428A3809N76982e7966B40810A6279N33628A47980B2700K37293E5549
$$ 241428 13809 590791 -57966 240810 16279 549907 147980 22700 259993 55549
15065B74641a15299F2705L92675j78052b8522H5078J78253p6294p139K63588J69656
$$ 274641 -115299 62705 455380 277328 -28522 85078 263331 187037 179898 443486 613142
15054F13142B37805P9785J24241J8225F1633k9434K93311J50868K6994B49943
$$ 613142 237805 317590 441831 460056 61633 32199 325510 476378 503372 249943
15043D45828j93604g2125C04565J0257J7641M03727A02476J34145L64018j74211
$$ 445828 252224 -72125 304565 314822 332463 736190 102476 236621 600639 426428
15033D26428J74799q9917r3037M1928K34610K52419j96590j52368j92089A21603
$$ 426428 601227 511310 418273 460201 694811 947230 750640 598272 406183 121603
15022D08383I6315J55111J94059R362J99702O710l25543J86575j86606j67634
$$ 408383 96315 251426 445485 454847 654549 661259 335716 522291 335685 168051
15012A68051P9695l4261J37021o7655J26291L2408A84085K81008M7486L8370k03353
$$ 168051 247746 213485 350506 282851 409142 441550 184085 465093 512579 550949 347596
15001C47596l6611J95814j35477J34966O3362k21267q6046J70628o8162L3062
$$ 347596 310985 506799 371322 506288 569650 348383 262337 432965 364803 397865
14991C97865J22202J06618j1593N7112j83084j64771E1538K87749J78349p4405
$$ 397865 520067 626685 615092 672204 489120 324349 51538 339287 517636 443231
14981D43231l168R5535L19924P9402k14487k15374L2960k42697K27764B18069
$$ 443231 440063 535598 855522 934924 720437 505063 538023 295326 523090 218069
14970F72693j29390n903m3945J30240B84182J76602J43531B70676j26812K18339
$$ 672693 543303 537400 493455 623695 284182 460784 604315 270676 143864 362203
14960C62203R254K24677j86429G0779K18565p3216L58941B16931j4551J45417
$$ 362203 371457 596134 409705 70779 289344 216128 575069 216931 202380 347797
14950C47797A04022K19703N71743C58010N03111j45813j09116l8408L15092C19730
$$ 347797 104022 323725 895468 358010 861121 715308 606192 567784 882876 319730
14939a1384F60844k75258J48639J79876L6032B69374M07404j7248l14582N94936
$$ -11384 660844 385586 534225 714101 750133 269374 676778 659530 344948 939884
14929I39884O1584K27245j6980K8779P01892k93675k33390r0544O1486R7468P7535
$$ 939884 1001468 1228713 1211733 1240512 1942404 1648729 1415339 1324795 1386281 1483749 1561284
14918A561284N5063K33091O39681K4680o76132m60159l12626N3823k54696J20417
$$ 1561284 1616347 1849438 2489119 2513799 1837667 1377508 1064882 1118705 864009 984426
14908I84426m26735B48481J97476n5498K7960j61504O7621K51467L1866B58678
$$ 984426 557691 248481 445957 390459 418419 256915 324536 576003 607869 258678
14897C43602R2316r3884m9285R4590l0568K47580J17280B88567j12435M03556
$$ 343602 435918 342034 292749 387339 356771 604351 721631 288567 176132 579688
14887E79688K8168J37751j35583L48206k24102J00005l09298L71634C83145L69373
$$ 579688 607856 745607 610024 958230 734128 834133 524835 896469 383145 752518
14877G52518K4238q5389k45597j18455K82681k1242j244K31067K9232D13212K60765
$$ 752518 776756 691367 445770 327315 609996 588754 587510 818577 847809 413212 673977
14866F73977m7815j98099M25461l02161M04956k10918k79983J48368k48965Q6930
$$ 673977 626162 428063 853524 551363 956319 745401 465418 613786 364821 451751
14856D51751O0435j16694O0L15273A60251K47531J38770r068L6967k04341J92684
$$ 451751 512186 395492 395552 710825 160251 407782 546552 537484 574451 370110 562794
14845E62794N9285J15702J95548j29034N14416m11221J53157P0272j07998k77472
$$ 562794 622079 737781 933329 804295 1318711 907490 1060647 1130919 1022921 745449
14835G45449L201K95286l80915J4056C11210J03078j45207M03002k13352K69715
$$ 745449 748650 1043936 663021 677077 311210 414288 269081 672083 458731 728446
14825G28446k7439p4376M7175N9657J5159l1831j18864L2052L9887O1326L08847
$$ 728446 701007 626631 673806 733463 748622 716791 597927 629979 669866 731192 1040039
14814A040039j6987m71751K63351o6545k11679K42808L7632l03107R4711J22924
$$ 1040039 1023052 551301 814652 748107 536428 779236 816868 513761 608472 731396
14804G31396P2832K64329K6568l56266Q6372r2710j74718K29342l75306k8667
$$ 731396 804228 1068557 1095125 738859 825231 732521 557803 787145 411839 383172
14794C83172K80947j16016K54505k26067j21131K22961j05111M3J18513N6193
$$ 383172 664119 548103 802608 576541 455410 678371 573260 573303 691816 748009
14784G48009k92719K66199l00678J16909L80553D08763L97447J63242J23767j8140
$$ 748009 455290 721489 420811 537720 918273 408763 806210 969452 1093219 1075079
14774A075079L5915q0104j49779j531K06573E30028J62725m751p6888J59865l82606
$$ 1075079 1110994 1030890 881111 879580 1086153 530028 692753 688002 611114 770979 388373
14763C88373L60244j97453K93315L2076o1571l60316K26675k97494K56641O5898
$$ 388373 748617 551164 844479 876555 814984 454668 681343 383849 640490 706388
14753G06388B76393O22899D19340M19572j54055k79924J31826L23411k01373J9237
$$ 706388 276393 899292 419340 838912 684857 404933 536759 860170 658797 678034
14743F78034K1557K71540j86670J39202k57827L50675l48541R0101j47931O8945
$$ 678034 699591 971131 784461 923663 665836 1016511 667970 758071 610140 679085
14733F79085J94706K47185j84171n8396K53443L10490K25726l01542N81460k03114
$$ 679085 873791 1120976 936805 878409 1131852 1442342 1668068 1366526 1947986 1744872
14723A744872q0524k22226k54410k41562J26533k19858L12179k07373j73986M69399
$$ 1744872 1664348 1442122 1187712 946150 1072683 852825 1165004 957631 783645 1253044
14713A253044n14703M6893j24274M12191k74239K06366K60304m78863O4639J47676
$$ 1253044 738341 785234 660960 1073151 798912 1005278 1265582 786719 851358 999034
14703I99034K64302L14936K36184M977K01048m28740k49514o8360Q74l09350J92155
$$ 999034 1263336 1578272 1814456 1819433 2020481 1591741 1342227 1273867 1274741 965391 1157546
14692A157546l68768K32836J0449k17746N8224k7556J31513P5808j56951j98740
$$ 1157546 788778 1021614 1032063 814317 872541 844985 976498 1052306 895355 696615
14682F96615K85994P6786q989j06292j038l03829L30142J29294m76076L19661
$$ 696615 982609 1059395 1050406 944114 943076 639247 969389 1098683 622607 942268
14672I42268J1716o8047J62254M3966k35725j85424K39494M73449m62781J24819
$$ 942268 953984 885937 1048191 1092157 856432 671008 910502 1383951 921170 1045989
14662A045989k1162o907J09117L4055J15498k46738J02713J68152k55131L41380
$$ 1045989 1024827 1017920 1127037 1161092 1276590 1029852 1132565 1300717 1045586 1386966
14652A386966j36515J04711k30427k5666L61313l34920M20929l96283k00183J7919
$$ 1386966 1250451 1355162 1124735 1099069 1460382 1125462 1546391 1150108 949925 967844
14642I67844L84313J9267k70156J45319k44389L86375k56774j08809M13699m59457
$$ 967844 1352157 1371424 1101268 1246587 1002198 1388573 1131799 1022990 1436689 977232
14632I77232K22518M71672j36500k24056J0317P937K9821J22261k42199j81713
$$ 977232 1199750 1671422 1534922 1310866 1321183 1329120 1358941 1481202 1239003 1057290
14622A057290L37681P6913J69599m60265L13540j76244J79968J32589l88700L3299
$$ 1057290 1394971 1471884 1641483 1181218 1494758 1318514 1498482 1631071 1242371 1275670
14612A275670L27042k66734L70342j96509N8727o7779m586J19805m09776P39845
$$ 1275670 1602712 1335978 1706320 1509811 1568538 1500759 1496173 1615978 1206202 1946047
14602A946047m54593J97744j92438M98294m19175K20857j03398Q5890j81004O64920
$$ 1946047 1491454 1689198 1496760 1995054 1575879 1796736 1693338 1779228 1598224 2263144
14592B263144n34722q9982O3610n7409L10167N8594q1115j22887K30953l10955
$$ 2263144 1728422 1638440 1702050 1644641 1954808 2013402 1932287 1809400 2040353 1729398
14582A729398K51746L3631j75520K41902k66540K67002p3085p8904O426j48078
$$ 1729398 1981144 2014775 1839255 2081157 1814617 2081619 2008534 1929630 1936056 1787978
14572A787978K87975P2574m3049K20166j13821L6469J2353J94244j33974L53026
$$ 1787978 2075953 2148527 2105478 2325644 2211823 2248292 2260645 2454889 2320915 2673941
14562B673941p3111K24158J51261l24631L51041N6662o2084J15120K68141L02579
$$ 2673941 2600830 2824988 2976249 2651618 3002659 3059321 2997237 3112357 3380498 3683077
14552C683077M51130K80334P25552J734738L076277O652460J8273754R105931
$$ 3683077 4134207 4414541 5140093 6874831 9951108 16603568 34877322 43983253
14544D3983253B0449909A0165710l993480j861624o36602Q402R44582J282613
$$ 43983253 20449909 10165710 6172230 4310606 3674004 3682406 4626988 5909601
14536E909601k482734o40616p51914N29905M2743l21109L94648m23363o133J84747
$$ 5909601 3426867 2786251 2034337 2564242 2606985 2285876 2680524 2257161 2251028 2435775
14526B435775K04916k56838J2036j54865M06647k16936J43610l45101L21481Q6081
$$ 2435775 2640691 2383853 2395889 2241024 2647671 2430735 2574345 2229244 2550725 2636806
14516B636806Q2229O7379l38509L08094r007K58608J35089k78195K11715n10250
$$ 2636806 2719035 2786414 2447905 2755999 2746992 3005600 3140689 2862494 3074209 2563959
14506B563959M01267N6312l55190K54580j05380J28319M95371o3579L1572j26074
$$ 2563959 2965226 3021538 2666348 2920928 2815548 2943867 3439238 3375659 3407231 3281157
14496C281157k14129N6234K86673j61435J58353L3155j5141K25679m5281J4517
$$ 3281157 3067028 3123262 3409935 3248500 3406853 3440008 3424867 3650546 3605265 3619782
14486C619782J9189J43976J18579n5482L11901l00397o0877j00011K41595Q0838
$$ 3619782 3638971 3782947 3901526 3846044 4157945 3857548 3796671 3696660 3938255 4019093
14476D019093J66065J04662k08112n0382L3611K67026L6322j8690J05005j01642
$$ 4019093 4185158 4289820 4081708 4031326 4064937 4331963 4368285 4349595 4454600 4352958
14466D352958N31612n9324j47853O6102M447j31543J14994L61874K41651l77764
$$ 4352958 4884570 4825246 4677393 4743495 4747942 4616399 4731393 5093267 5334918 4957154
14456D957154j7292K89468n1425J0004Q766J91729J8166L45414k43975O1310M55443
$$ 4957154 4939862 5229330 5177905 5187909 5196675 5388404 5406570 5751984 5508009 5569319 6024762
14445F024762l8035j9802N3569J56095J8159j75782K39067N2654k9899J70444
$$ 6024762 5986727 5966925 6020494 6176589 6194748 6018966 6258033 6310687 6280788 6451232
14435F451232J32563N0775J67709q5497J28410L85751J02784m9588R6521p5360
$$ 6451232 6583795 6634570 6802279 6716782 6845192 7230943 7333727 7284139 7380660 7305300
14425G305300J22160K71404L56055m2089K65477K40790o0489K11092L00145r8245
$$ 7305300 7427460 7698864 8054919 8012830 8278307 8519097 8458608 8669700 8969845 8871600
14415H871600K10235m0478m1020J34043L64322l01180M75376J21862J72824J31597
$$ 8871600 9081835 9041357 9000337 9134380 9498702 9197522 9672898 9794760 9967584 10099181
14405A0099181R6215K34744J21433M01567J15629l64861L85941k29007L39890
$$ 10099181 10195396 10430140 10551573 10953140 11068769 10703908 11089849 10860842 11200732
14396A1200732K59687K35503J30926k21633O06775K33212K32599P2602J59054
$$ 11200732 11460419 11695922 11826848 11605215 12211990 12445202 12677801 12750403 12909457
14387A2909457K68162L29163K65971K97654J98115J8330M37436J83374M99133
$$ 12909457 13177619 13506782 13772753 14070407 14268522 14286852 14724288 14907662 15406795
14378A5406795K78216q3956M49062L26867J22106K52467N16777M27572J20274
$$ 15406795 15685011 15601055 16050117 16376984 16499090 16751557 17268334 17695906 17816180
14369A7816180P24135M58799L40476J33084N92664P38293K10514n0093L74747
$$ 17816180 18540315 18999114 19339590 19472674 20065338 20803631 21014145 20964052 21338799
14360B1338799O57215K66552L55036P80555L70376R19747L72387O96551P48190
$$ 21338799 21996014 22262566 22617602 23398157 23768533 24688280 25060667 25757218 26505408
14351B6505408P46344O0602Q39822R08240N05741J128321N64920Q24984Q60194
$$ 26505408 27251752 27312354 28152176 29060416 29566157 30694478 31259398 32084382 32944576
14342C2944576R54710Q71572O62616J180051P19288J359195R90592R66011J371022
$$ 32944576 33899286 34770858 35433474 36613525 37332813 38692008 39682600 40648611 42019633
14333D2019633J119352J217217J146338J550669J765373J383259J646518J639302
$$ 42019633 43138985 44356202 45502540 47053209 48818582 50201841 51848359 53487661
14325E3487661J762566J680749J838442K014203K105915K244774K629192K288221
$$ 53487661 55250227 56930976 58769418 60783621 62889536 65134310 67763502 70051723
14317G0051723K348508K701240K536085K988350L279033K916314L852062L648360
$$ 70051723 72400231 75101471 77637556 80625906 83904939 86821253 90673315 94321675
14309I4321675L779372L898508M268572M592278M401100N295058N387386N670719
$$ 94321675 98101047 101999555 106268127 110860405 115261505 120556563 125943949 131614668
14301A31614668N912147O394879O913429P010656P724903P666200Q432532R265731
$$ 131614668 137526815 143921694 150835123 157845779 165570682 173236882 181669414 190935145
14293A90935145R429053R692350J0827626J0980775J1726895J2349600J2485280
$$ 190935145 200364198 210056548 220884174 231864949 243591844 255941444 268426724
14286B68426724J3605658J3739563J4150551J4557950J4716304J4759184J5121834
$$ 268426724 282032382 295771945 309922496 324480446 339196750 353955934 369077768
14279C69077768J4465334J4232173J3714729J2763143J0947454R101388N863100
$$ 369077768 383543102 397775275 411490004 424253147 435200601 444301989 450165089
14272D50165089K695261Q45550M37856k031490m961556n954102r503189r245938
$$ 450165089 452860350 453705900 454143756 452112266 447150710 441196608 431693419 422447481
14264D22447481r647740j1027556j0810803j1649901j1503185j2744869j3855799
$$ 422447481 412799741 401772185 390961382 379311481 367808296 355063427 341207628
14257C41207628j3619917j4398095j4146232j4286508j4096924j3391037j3419881
$$ 341207628 327587711 313189616 299043384 284756876 270659952 257268915 243849034
14250B43849034j2753332j1810622r539758j0493008j0194771r435609q244800
$$ 243849034 231095702 219285080 209745322 199252314 189057543 179621934 171377134
14243A71377134q242022p957178o956866p137306o233603o011836n688449n435869
$$ 171377134 163135112 155177934 148221068 141083762 134850159 128838323 123149874 117714005
14235A17714005n251733m511645m172106m435118l854251m050079l611294l381780
$$ 117714005 112462272 107950627 103778521 99343403 95489152 91439073 87827779 84445999
14227H4445999l317561k685111l201742k646723k850145k351696k274291k011545
$$ 84445999 81128438 78443327 75241585 72594862 69744717 67393021 65118730 63107185
14219F3107185k295092j659450k628074j698770j686519j609498j038106k021973
$$ 63107185 60812093 59152643 56524569 54825799 53139280 51529782 50491676 48469703
14211D8469703j785524j156914j453718j162528l38873j343240j444805j122377
$$ 48469703 46684179 45527265 44073547 42911019 42572146 41228906 39784101 38661724
14203C8661724j365018p47930p61204o83182j142958q91032p50020j004163q65112
$$ 38661724 37296706 36548776 35787572 35104390 33961432 33070400 32320380 31316217 30451105
14194C0451105m42419p99849p76720q85293m54848q50034m40368k86325q43429
$$ 30451105 30008686 29208837 28432117 27546824 27091976 26241942 25801574 25515249 24671820
14185B4671820m82463m74333n61630p27120o25598k05072m02857m95029n50872
$$ 24671820 24189357 23715024 23153394 22426274 21800676 21595604 21192747 20697718 20146846
14176B0146846j21r06976j4121l34467n65711m79863j01803m01641j48927n51869
$$ 20146846 20146725 19239749 19225628 18891161 18325450 17845587 17743784 17342143 17193216 16641347
14166A6641347k22786m15601m4450p75529K76090n28655j1999m76197l18170n13958
$$ 16641347 16418561 16002960 15958510 15182981 15459071 14930416 14918417 14442220 14124050 13610092
14156A3610092n1606L9525n74290N5413q0058m21457o21656n2553J18368l93497
$$ 13610092 13558486 13598011 13023721 13079134 12999076 12577619 11955963 11903410 12021778 11628281
14146A1628281k35388O6217j29183m97011J51484m73896J50211l95163p1983k03304
$$ 11628281 11392893 11459110 11329927 10832916 10984400 10510504 10660715 10265552 10193569 9990265
14136I990265m7344k55989j82488p6915k31954m0395q2212J04263k57458n25501
$$ 9990265 9942921 9686932 9504444 9427529 9195575 9155180 9072968 9177231 8919773 8394272
14126H394272q4308M22862n49709J36785k04534N2629l25181j70507K2901J26849
$$ 8394272 8309964 8732826 8183117 8319902 8115368 8167997 7842816 7672309 7695210 7822059
14116G822059j18814l09829k35550K0065j61943J76039j13214n20881L56906o0206
$$ 7822059 7703245 7393416 7157866 7177931 7015988 7192027 7078813 6557932 6914838 6854632
14106F854632O8940l33898l11811r1848J45124k00637k37279O70j21681M34137
$$ 6854632 6923572 6589674 6277863 6186015 6331139 6130502 5893223 5893893 5772212 6206349
14096F206349l85022j13876j90093K65087j58861q6272j8917o5453K284Q0692
$$ 6206349 5821327 5707451 5517358 5782445 5623584 5537312 5518395 5452942 5455226 5535918
14086E535918n59952N70621n50508n6648j60319J78202m60851M03174k72742M0799
$$ 5535918 4975966 5546587 4996079 4939431 4779112 4957314 4496463 4899637 4626895 4667694
14076D667694J84564j94484n0418j02801J11215O2883j29165J30119n60436o6790
$$ 4667694 4852258 4657774 4607356 4504555 4615770 4678653 4549488 4679607 4119171 4052381
14066D052381L09484n99681N27787j69143L27277j16907j46223n9396O7914l65453
$$ 4052381 4361865 3762184 4289971 4120828 4448105 4331198 4184975 4125579 4193493 3828040
14056C828040J56173J04321k93721K6571k64511J04366o3797N6690k27407O5384
$$ 3828040 3984213 4088534 3794813 3821384 3556873 3661239 3597442 3654132 3426725 3492109
14046C492109J69652k98109J14817J36181k58283J58667j88419L35905m50306
$$ 3492109 3661761 3363652 3478469 3614650 3356367 3515034 3326615 3662520 3212214
14037C212214J23842l07972J75900j28498q9818J55186j10396J92587m6358j90228
$$ 3212214 3336056 3028084 3203984 3075486 2985668 3140854 3030458 3223045 3176687 2986459
14027B986459O1485L2618M3637l21848J69884l52385M39527m12254P0916J32448
$$ 2986459 3047944 3080562 3124199 2802351 2972235 2619850 3059377 2647123 2718039 2850487
14017B850487k36010j02042K89235q9746n5890k11886N01565n47657K463K64375
$$ 2850487 2614477 2512435 2801670 2711924 2656034 2444148 2945713 2398056 2400519 2664894
14007B664894r4682k47653o5871J21367J1678K2113j92718M5371O9391k0820k21140
$$ 2664894 2570212 2322559 2256688 2378055 2389733 2411846 2219128 2264499 2333890 2313070 2091930
13996B091930m3184L9734J66863J23422n178p8300K41015R10950J904922M853876
$$ 2091930 2048746 2088480 2255343 2378765 2373587 2295287 2536302 3447252 5352174 10206050
13986A0206050J5216963K0248546j8339571j2390282n194832k846138q45385j366951
$$ 10206050 25423013 45671559 27331988 14941706 9746874 6900736 6055351 4688400
13978D688400n47893l61698q1577m95921j54883p7381j45183M5219m94675n7499
$$ 4688400 4140507 3778809 3697232 3201311 3046428 2969047 2823864 2869083 2374408 2316909
13968B316909L08201k75062j3578J12084k49457L33287Q0107l15376K7607l39760
$$ 2316909 2625110 2350048 2336470 2448554 2199097 2532384 2612491 2297115 2324722 1984962
13958A984962J06374q5148J34318j2030J78623j93292j50343L31833n66160K23357
$$ 1984962 2091336 2006188 2140506 2128476 2307099 2113807 1963464 2295297 1729137 1952494
13948A952494K85064j76886k53291N41819n66254k83111K43096J2770k6927P8479
$$ 1952494 2237558 2060672 1807381 2349200 1782946 1499835 1742931 1755701 1728774 1807253
13938A807253O5318j29993L101l4627P7148n9152N4400r0518k020m0333R0438
$$ 1807253 1872571 1742578 1745679 1711052 1788200 1729048 1783448 1692930 1690910 1650577 1741015
13927A741015p6975p0956K86352K4595l51988J79800m38963K81619L51339n37041
$$ 1741015 1664040 1593084 1879436 1904031 1552043 1731843 1292880 1574499 1925838 1388797
13917A388797J38201M03681l56063m58599N92586k16417j58507M3193N9191J88060
$$ 1388797 1526998 1930679 1574616 1116017 1708603 1492186 1333679 1376872 1436063 1624123
13907A624123k05679N238O8516K4924j91095J19619k9307j0349k7657M8560Q7283
$$ 1624123 1418444 1423682 1492198 1517122 1326027 1445646 1416339 1405990 1378333 1426893 1514176
13896A514176k61625L22647j02717n7005R878j70568K42552k27424M7187l85148
$$ 1514176 1252551 1575198 1472481 1415476 1425354 1254786 1497338 1269914 1317101 931953
13886I31953K63131L05431N6576m00247K19235j77500j49634J2458o2282M14530
$$ 931953 1195084 1500515 1557091 1156844 1376079 1198579 1048945 1061403 999121 1413651
13876A413651n50869j04200Q04075j89782m1375k48215J56784K5945j07552L14378
$$ 1413651 862782 758582 1562657 1372875 1331500 1083285 1240069 1266014 1158462 1472840
13866A472840m76798K79302k63055R2076L6102J58792j53377j15525k0527K41004
$$ 1472840 996042 1275344 1012289 1104365 1140467 1299259 1145882 1030357 1009830 1250834
13856A250834m6361L0842j30054j07722q5923K83384k36125j50953L77379k30206
$$ 1250834 1204473 1235315 1105261 997539 911616 1195000 958875 807922 1185301 955095
13846I55095M7606J03783J71990q2548j91503P4074L2083n3900k36409l5088k3793
$$ 955095 1002701 1106484 1278474 1195926 1004423 1078497 1110580 1056680 820271 785183 761390
13835G61390M82458J6720n82057M73985l70791o1412K31297K35461k11508r8101
$$ 761390 1243848 1260568 678511 1152496 781705 720293 951590 1187051 975543 877442
13825H77442q1792L27798j14223j8884l24240J27634J10386p2638L3173r8891
$$ 877442 795650 1123448 1009225 990341 666101 793735 904121 831483 864656 765765
13815G65765K83500j29314k42344K50915l27183K65990n3556j33470L05809n8961
$$ 765765 1049265 919951 677607 928522 601339 867329 813773 680303 986112 927151
13805I27151O0242j42160n6037J49291j31910k6295p8083L41760j32450L36445
$$ 927151 987393 845233 789196 938487 806577 780282 702199 1043959 911509 1247954
13795A247954l89664K32850l55746j39854o7680K69652L0354j17581Q6920k56660
$$ 1247954 858290 1091140 735394 595540 527860 797512 827866 710285 797205 540545
13785E40545L11059L9846k5021k45490J57696j85975K57992J8073k22069O0585
$$ 540545 851604 891450 866429 620939 778635 592660 850652 868725 646656 707241
13775G07241R8493l79246N62483l77087N16024l52510k25479J68318P4476K9170
$$ 707241 805734 426488 988971 611884 1127908 775398 549919 718237 792713 821883
13765H21883j69221J51221l03839K74107J81162k57009k54443L23628N7140k8406
$$ 821883 652662 803883 500044 774151 955313 698304 443861 767489 824629 796223
13755G96223k59287L65929m11667m1616M45932j61826L8150j52147k4127J69376
$$ 796223 536936 902865 491198 449582 895514 733688 771838 619691 595564 764940
13745G64940k04188Q883L39775r6037l53183K59746N9668L3024k59829K90979
$$ 764940 560752 569635 909410 813373 460190 719936 779604 812628 552799 843778
13735H43778j69562j31698k2050p969J32434K72501m12802j7148L3019L0517l0565
$$ 843778 674216 542518 520468 512499 644933 917434 504632 487484 520503 551020 520455
13724E20455p6720K27600o2072j92217J45715m3568P7792K1004j96511A66903
$$ 520455 443735 671335 609263 417046 562761 519193 596985 617989 421478 166903
13713D33596A25774O85771C74148K88111j52107K23715k00168J57895A70831M32470
$$ 433596 125774 811545 374148 662259 510152 733867 533699 691594 170831 603301
13703F03301p0332J82920K1476B53767J91733K13229j81450L81439l46199J90944
$$ 603301 532969 715889 737365 253767 445500 658729 477279 858718 512519 703463
13693G03463j11059k02076R4982O216K78474l68441N9592L886q3649L04870j42630
$$ 703463 592404 390328 485310 491526 770000 401559 461151 465037 381388 686258 543628
13682E43628F9122M96076j24448q110J42984j31693J94082C13325K26358j1086
$$ 543628 69122 565198 440750 432640 575624 443931 638013 313325 539683 528597
13672E28597L79681k52449J14462l65244K46946p7628q6814J03312j23854j92446
$$ 528597 908278 655829 770291 405047 651993 574365 487551 590863 467009 274563
13662B74563J01958K88934o8494r7981A51387P3640K83050K47041k22623o4298
$$ 274563 376521 665455 596961 498980 151387 225027 508077 755118 532495 468197
13652D68197j56196L60777r4331j47773J81392j46566R1818B54460N08401l39200
$$ 468197 312001 672778 578447 430674 612066 465500 557318 254460 762861 423661
13642D23661j52061K47756Q258K1275K6658j08844j35255K25995j15130A24969
$$ 423661 271600 519356 527614 548889 575547 466703 331448 557443 442313 124969
13631C51539L23780A29255L92846H9044K11437j00939J58719K45813A14822K30454
$$ 351539 675319 129255 522101 89044 300481 199542 358261 604074 114822 345276
13621C45276J40838F7289K47949K58569J7853r3488J78753j0300j62875k34907
$$ 345276 486114 67289 315238 573807 591660 498172 676925 666625 503750 268843
13611B68843K30624k34718N35375l75297j7155J12815j87717O2489j3264E2102
$$ 268843 499467 264749 800124 424827 407672 520487 332770 395259 381995 52102
13600I9193J5521a1079A85869L73624j4967j86637m1922R0765J6479A47112K41557
$$ 99193 114714 -11079 185869 559493 544526 357889 315967 406732 423211 147112 388669
13589C88669p8860g7799B84051Q6429A47182L54766O585q2897J05412R08L6500
$$ 388669 309809 -77799 284051 370480 147182 501948 508533 425636 531048 531956 568456
13578E68456k57745J2365J54945k38668K28336r3111l2095L9938k449j0741o5530
$$ 568456 310711 323076 478021 239353 467689 374578 342483 382421 379972 369231 303701
13567C03701K7662o532H5684J27053L8053L756l9918E2485J3694J91696C0912
$$ 303701 331363 324831 85684 212737 250790 254546 214628 52485 66179 257875 30912
13555B94010a16802A0278L50894K6237j03240J29903m2031j55928J9242N7226
$$ 294010 -116802 10278 361172 387409 284169 414072 372041 216113 235355 292581
13545B92581H7148M8843J85118O4327j33402B5906K52977A00791c494A05919K17304
$$ 292581 87148 135991 321109 385436 252034 25906 278883 100791 -3494 105919 323223
13534C23223N649j57989L99770n6853k35366k875j21704K12333r9458K92848j93458
$$ 323223 328872 170883 570653 513800 278434 275559 153855 366188 266730 559578 366120
13523C66120k9685J0823A57965E9234K99131J99896j84512q1697K45989B38241
$$ 366120 336435 347258 157965 59234 358365 558261 373749 292052 538041 238241
13512B79471J8895q1110P7196K15140B45931L8801L6383J18583A24041K99747
$$ 279471 298366 217256 294452 509592 245931 284732 321115 439698 124041 423788
13502D23788R88j41214J38718q4392J42086j60259j58417J91427j38815K40335
$$ 423788 424776 283562 422280 337888 479974 319715 161298 352725 213910 454245
13492D54245A76935K09451A876M10722E7924L6127P7337l7593k2039J92788j5653
$$ 454245 176935 386386 1876 412598 57924 94051 171388 133795 111756 304544 288891
13481B88891j5943O8732j68250L29292A57407l792A3845K63506j3464j9706J75232
$$ 288891 272948 341680 173430 502722 157407 153615 13845 277351 263887 244181 419413
13470D19413q3620C4815Q6382P2850d9025A45280o8730K49445N7168k7935F7553
$$ 419413 335793 34815 121197 194047 -49025 145280 76550 325995 383163 355228 67553
13458d5059B16907J95226j5996a04460E20568j81281j02191J8432M3899j42337
$$ -45059 216907 412133 396137 -104460 520568 339287 237096 255528 299427 157090
13448A57090K13574j06389q9114J25471f2267C53669J0173J10403B24998P3381
$$ 157090 370664 264275 175161 300632 -62267 353669 363842 474245 224998 298379
13438B98379E0908K32458j5783F4945K03006J64318A76010K12684j20394m5978
$$ 298379 50908 283366 267583 64945 267951 432269 176010 388694 268300 222322
13428B22322j04975J87773k1458n1943L1644K71241G7348k8731N5478a4220B54575
$$ 222322 117347 305120 283662 231719 263363 534604 77348 48617 104095 -14220 254575
13416C14023j24896J62324A15528a05743B82694J4166j35703N0740M1665N1422
$$ 314023 189127 351451 115528 -105743 282694 296860 161157 211897 253562 304984
13406C04984A15016Q2074J23809A35013n1825J91058J11229A57210J53066G7748
$$ 304984 115016 197090 320899 135013 83188 274246 385475 157210 310276 77748
13395D51842q0459D0826J58763J23337a6112B70329E3274P742j9942K29397B0842
$$ 451842 371383 40826 199589 322926 -16112 270329 53274 61016 41074 270471 20842
13383B62639j02655a05687B64427h843C58822q9555f2315D7987J98838l3327J31006
$$ 262639 159984 -105687 264427 -8843 358822 269267 -62315 47987 246825 213498 344504
13372C44504q9637q2005K0888N6035L89458B6123K80967E6043N8199L5373A3619
$$ 344504 254867 172862 193750 249785 639243 26123 307090 56043 114242 149615 13619
13360G874L58306A18569L6560p6080R9297q0926c2898A92497J53041E7597L9892
$$ 7874 366180 118569 155129 79049 178346 97420 -32898 192497 345538 57597 97489
13349I7489J54859A02376A4980M48210I4572J64541p9453Q438J89905p0604O0443
$$ 97489 252348 102376 14980 463190 94572 259113 179660 188098 378003 307399 367842
13338C67842M4758A07953P0167J4067l1454c5894B3902J32095J05605m6768M7461
$$ 367842 412600 107953 178120 192187 160733 -35894 23902 155997 261602 214834 262295
13327B62295q8098j1412J93448M6928r2584j24606C243Q9308L3467J95846a2870
$$ 262295 174197 162785 356233 403161 310577 185971 3243 92551 126018 321864 -12870
13315B55774J16220p4025J24282l8551H8504K09797I9497J69779D837a76104B51917
$$ 255774 371994 297969 422251 383700 88504 298301 99497 269276 4837 -176104 251917
13303b9167B009J56807O30518A42672m5558b3353C78313L8790I7611f5200B84347
$$ -29167 2009 158816 789334 142672 97114 -23353 378313 417103 97611 -65200 284347
13291B30125g1513H8936o34g4926H5973M94362B78307j22530j7287J12668H6236
$$ 230125 -71513 88936 88302 -74926 85973 580335 278307 155777 138490 251158 86236
13279A81627J30966a21300o9593E5415K27813D1444M60196A90799b57567B27308
$$ 181627 312593 -121300 -190893 55415 283228 41444 501640 190799 -257567 227308
13268I5686C6239g622C90024A35926K17766r8383e5787D60976I4829D3730J32584
$$ 95686 36239 -7622 390024 135926 353692 255309 -55787 460976 94829 43730 176314
13257A76314q0197m4735g9678A50069O2947l2888E468J09271e3955j30750C11226
$$ 176314 96117 51382 -79678 150069 213016 180128 5468 114739 -53955 -184705 311226
13245I5234c469C06972H0735K65760d3537A95930l7146b68252B74502D0390a12380
$$ 95234 -3469 306972 80735 346495 -43537 195930 158784 -268252 274502 40390 -112380
13233C68618F2174f3248C09376j3723j40839G1515b33960E8781N5844L541b0176
$$ 368618 62174 -63248 309376 295653 154814 71515 -233960 58781 114625 118166 -20176
13221b8752H4315O7260Q2461c08271B00983m0811O4929r6916a46714F3481K5424
$$ -28752 84315 151575 234036 -308271 200983 160172 225101 128185 -146714 63481 88905
13210H8905K23107I2284K22231a35369j07029C76988a47879C68530a51594B77815
$$ 88905 312012 92284 314515 -135369 -242398 376988 -147879 368530 -151594 277815
13199D89648B43946b4310C3636N0008J64508d1982H18J83910i6529A96887d0600
$$ 489648 243946 -24310 33636 83644 248152 -41982 818 184728 -96529 196887 -40600
13187a7487A02089A2708J42039k4868b93918A18160P3410D8543Q0917f5705l2210
$$ -17487 102089 12708 154747 129879 -293918 118160 191570 48543 129460 -65705 -97915
13176i7915K9227A3331b5364j24776B47481a71006B69976O7069i0512B16942b44188
$$ -97915 -68688 13331 -25364 -150140 247481 -171006 269976 337045 -90512 216942 -244188
13164a49734c9697B92157R0966c40421I5091a71502A11850J92105C1700K85753
$$ -149734 -39697 292157 383123 -340421 95091 -171502 111850 303955 31700 317453
13154C17453j49519M7732Q2052H0072J55424p7388L4152a79056H5789J93057q311
$$ 317453 167934 215666 297718 80072 235496 158108 192260 -179056 85789 278846 270535
13143B70535H6954f7629n2609B07626A586b70205k5977d9034D0818J10409n9200
$$ 270535 86954 -67629 -120238 207626 1586 -270205 -296182 -49034 40818 151227 92027
13132I2027Q4389a2705p9293A32586f5637G7846f2250A62349F9505N22018p8917
$$ 92027 176416 -12705 -91998 132586 -65637 77846 -62250 162349 69505 591523 512606
13121E12606d2546k60661J45441A0306f4930H9538i4446i765j30684r8757a3703
$$ 512606 -42546 -303207 -157766 10306 -64930 89538 -94446 -9765 -140449 -239206 -13703
13109a31714A70284H4618L42067j21678a32635c7514m646a5993D5918K17411e8762
$$ -131714 170284 84618 426685 305007 -132635 -37514 -42160 -15993 45918 263329 -58762
13097A8482a06849A48878a88936B0831J19869M5757b3817H8975L22905R175G7275
$$ 18482 -106849 148878 -188936 20831 140700 186457 -23817 88975 411880 421055 77275
13085I1227J47077J34581b29794A59575P8952a37009A67155a32057L0101A1838
$$ 91227 238304 372885 -229794 159575 238527 -137009 167155 -132057 -101956 11838
13074a69772M8273B08706L3444A6115d0654B64326b23463A50683c5159A61416
$$ -169772 -121499 208706 242150 16115 -40654 264326 -223463 150683 -35159 161416
13063D7072K33358A0066g4119A22312a65549B59012a60462M6679C8208a35930
$$ 47072 280430 10066 -74119 122312 -165549 259012 -160462 -113783 38208 -135930
13052A63855n2859m3408J33262a15720B13945d36407F6646K21033j7418c7626
$$ 163855 110996 67588 200850 -115720 213945 -436407 66646 287679 270261 -37626
13041c076C37b27520B06262p7067P7578a3366C39481E4574g4200b9170C21416
$$ -3076 337 -227520 206262 129195 206773 -13366 339481 54574 -74200 -29170 321416
13029G2174J02887e128A52399o3120c2925B87971h72j57747j0186A65271d6468
$$ 72174 175061 -5128 152399 89279 -32925 287971 -872 -158619 -168805 165271 -46468
13017a8052k25931e5566A79742f3490A9673f8312B61971C4407K69997I7449m5408
$$ -18052 -243983 -55566 179742 -63490 19673 -68312 261971 34407 304404 97449 52041
13006E2041L2094C3065b9028D0973O9157J24201b04685Q5423B96234O134o8199
$$ 52041 84135 33065 -29028 40973 110130 234331 -204685 -119262 296234 302368 234169
12995B34169g693p9725A4433a0500A78260C9093K9065e427A50588J60736A08219
$$ 234169 -7693 -87418 14433 -10500 178260 39093 68158 -5427 150588 311324 108219
12983e1905O416A3436b74A65971E9248J11555d44l6596j41530f4783D4948K31534
$$ -51905 -45489 13436 -274 165971 59248 170803 -444 -37040 -178570 -64783 44948 276482
12971B76482A11135O8169g0290A79970E2605d887A37241R0917o6402D111J42250
$$ 276482 111135 179304 -70290 179970 52605 -4887 137241 228158 161756 4111 146361
12960A46361b00113C44680E1190g427B12984a26873B7008a6304k0862A0218L35685
$$ 146361 -200113 344680 51190 -7427 212984 -126873 27008 -16304 -37166 10218 345903
12949C45903B74c15935E7026K5279K1317k9095J36831q7918b24569A04470D1906
$$ 345903 274 -315935 57026 82305 103622 74527 211358 123440 -224569 104470 41906
12937I9523M0444a02436A61353B6181a30955I3997a04617A21023a6328l70889
$$ 99523 139967 -102436 161353 26181 -130955 93997 -104617 121023 -16328 -387217
12927c87217a30305A73987c296j93378A06162l113f7610k6406C8354a99293g5138
$$ -387217 -130305 173987 -3296 -196674 106162 103049 -67610 -94016 38354 -199293 -75138
12915b10998C24424a63123o712f8916d552m28049A48307h5932m1164c0689k21638
$$ -210998 324424 -163123 -169835 -68916 -4552 -432601 148307 -85932 -127096 -30689 -252327
12904b52327A9314J60562K32779D937c13847j356R2002Q2395j54964I3908d6880
$$ -252327 19314 179876 412655 4937 -313847 -315203 -223201 -140806 -295770 93908 -46880
12892A6203M18J69608M0872F2451J85301e6726j35697A39632h9285j17183c980
$$ 16203 16621 186229 227101 62451 247752 -56726 -192423 139632 -89285 -206468 -3980
12880B20200F0855c92762D8530a27739j23855C9874J76656R015b895k98264B35990
$$ 220200 60855 -392762 48530 -127739 -251594 39874 216530 225545 -2895 -301159 235990
12868C00617b22435J07238r3989A46831c5569j67075h6623D45791e6228E0596
$$ 300617 -222435 -115197 -209186 146831 -35569 -202644 -86623 445791 -56228 50596
12857e2899I5307a29108A32127b17348C45174h5329A60514d5465m10797H4653
$$ -52899 95307 -129108 132127 -217348 345174 -85329 160514 -45465 -456262 84653
12846C66955F4221g4102c2840A02759f728D0867q97L350a53088A20363L0928c2074
$$ 366955 64221 -74102 -32840 102759 -6728 40867 39970 43320 -153088 120363 151291 -32074
12833a26681n8523D1341K0315L2768c36409M8450I5456b61355A91841b6143A7857
$$ -126681 -185204 41341 61656 94424 -336409 -287959 95456 -261355 191841 -26143 17857
12821C43064j35268q5431i6713q5794H671c22487J45393j42523P8569a3006A38160
$$ 343064 207796 122365 -96713 -182507 8671 -322487 -177094 -319617 -241048 -13006 138160
12809B35549a92453f4109A86703i7844f54m3333G6560J87417j24693J1189b6688
$$ 235549 -192453 -64109 186703 -97844 -654 -43987 76560 263977 139284 150473 -26688
12797D0148K99329a57988A53659A8510a03743A25946a94480O2763A67204b24062
$$ 40148 339477 -157988 153659 18510 -103743 125946 -194480 -131717 167204 -224062
12786h3092k66046i7692C0085b97385A2248O9719O746b1410j01980H8400D607
$$ -83092 -349138 -97692 30085 -297385 12248 81967 88713 -21410 -123390 88400 4607
12774d5153A36709l3497J17161G6515g4117F0134h153B73793I5269L2760a89924
$$ -45153 136709 103212 220373 76515 -74117 60134 -8153 273793 95269 128029 -189924
12762F60N78449c42062g757k35279Q4193C09492A12094d4811C2282L4912a11164
$$ 660 579109 -342062 -7757 -243036 -158843 309492 112094 -44811 32282 67194 -111164
12750A37514a81064b0980j27917A1405i452G742J4085J58569N1642e865E47215
$$ 137514 -181064 -20980 -148897 11405 -9452 7742 21827 180396 232038 -5865 547215
12738B47131a5120k5922C80471j80778n0986n6418A4649K23771J34113A53727
$$ 247131 -15120 -41042 380471 199693 148707 92289 14649 238420 372533 153727
12727b54587D465J05130h7125G8779J59590q7352d2373k49675N1504B0328J21620
$$ -254587 4465 109595 -87125 78779 238369 151017 -42373 -292048 -240544 20328 141948
12716A41948K44953F8418a19269m8964C9903K3095d6808l5276B09680j2292j6631
$$ 141948 386901 68418 -119269 -168233 39903 62998 -46808 -82084 209680 197388 180757
12705A80757m2248Q7138l530J74135a72361G8839b4560r0364c7847D8261b36616
$$ 180757 138509 225647 222117 396252 -172361 78839 -24560 -114924 -37847 48261 -236616
12693H1624d6303d50l4940A40996a21878F9698d738A19306a59192A65525P081
$$ 81624 -46303 -450 -35390 140996 -121878 69698 -4738 119306 -159192 165525 172606
12682A72606o4071c1676A18959K8182a42448D4074J02695K41550D8231o89a20770
$$ 172606 108535 -31676 118959 147141 -142448 44074 146769 388319 48231 47542 -120770
12670C20078a7902A6132J61734h9508A9769N49210C7644a41879o6486A33662i6515
$$ 320078 -17902 16132 177866 -89508 19769 568979 37644 -141879 -208365 133662 -96515
12658B21113g1825A42808k4965B9269J73496a0656E6335f3153p6053A41691F0988
$$ 221113 -71825 142808 117843 29269 202765 -10656 56335 -63153 -139206 141691 60988
12646A99923i2785j3101j6267j83630A0073h804B31713E3262o702f997B00899
$$ 199923 -92785 -105886 -122153 -305783 10073 -8804 231713 53262 46560 -6997 200899
12634A08696c19756A43920o3271J09915J326n2381K16420c58984f6254b9701A52441
$$ 108696 -319756 143920 80649 190564 191890 139509 355929 -358984 -66254 -29701 152441
12622f2110A45828b76963A85739F5255K6129b13140a6122k3786F6241J8047i7227
$$ -62110 145828 -276963 185739 65255 91384 -213140 -16122 -39908 66241 84288 -97227
12610B24374b9052B84303A11161a20743A4552N3235a03598C2205K36768Q3971
$$ 224374 -29052 284303 111161 -120743 14552 67787 -103598 32205 268973 352944
12600C52944i052E08761j53760A61720Q605E74N2043j2334h1824m7758q3269C78882
$$ 352944 -9052 508761 355001 161720 170325 574 52617 40283 -81824 -129582 -212851 378882
12587d9204j852r5179n083A59575A4282J16669a66965O4895r3948H1262a68084
$$ -49204 -51056 -146235 -151318 159575 14282 130951 -166965 -102070 -196018 81262 -168084
12575f498k17644C47525j25520j05088g462j55794E31173a78942A29793g6567
$$ -6498 -224142 347525 222005 116917 -7462 -163256 531173 -178942 129793 -76567
12564B65245H7436k8869b5689B41951a33231e0803D2151j7275i7551q1316H647
$$ 265245 87436 58567 -25689 241951 -133231 -50803 42151 24876 -97551 -178867 8647
12552B59506A3504D137P1822M6132a59806A78781D5651f7914q4608l8729A72476
$$ 259506 13504 4137 75959 122091 -159806 178781 45651 -67914 -152522 -191251 172476
12540h1785A75328n9530R4258b47613K8970B10391a831k27608A38737J7895c3286
$$ -81785 175328 115798 210056 -247613 -218643 210391 -1831 -229439 138737 156632 -33286
12528a35545j92815e2811j19827H4363b21068o8514J25518f6974j43994P7360
$$ -135545 -328360 -52811 -172638 84363 -221068 -289582 -164064 -66974 -210968 -133608
12518a33608A69698l6186a73984I1282l4682O4026J00414f1708A46176L10956
$$ -133608 169698 133512 -173984 91282 56600 120626 221040 -61708 146176 457132
12508D57132g5451l5426D14152i3624a6841B45108c395l1071j24168A80945h9471
$$ 457132 -75451 -110877 414152 -93624 -16841 245108 -3395 -34466 -158634 180945 -89471
12496I276M153g730A14089R7972b16001I3326Q9600i5944J5977A78292c55219
$$ 9276 13429 -7730 114089 212061 -216001 93326 182926 -95944 -79967 178292 -355219
12484A89014B8406a96350P5032I4168d657n6998B91824A31169e5979B66566a42065
$$ 189014 28406 -196350 -121318 94168 -4657 -61655 291824 131169 -55979 266566 -142065
12472B43648I5933a97191o0539A13652a0310j99903B52850O1154E6716D553b3790
$$ 243648 95933 -197191 -257730 113652 -10310 -210213 252850 314004 56716 4553 -23790
12460a39523b5890r0264L4912n1343j17057b8623n3476j18463G1566d8679n1975
$$ -139523 -25890 -116154 -81242 -132585 -249642 -28623 -82099 -200562 71566 -48679 -100654
12449a00654A00556L9502i6857C0337A4969R3808K6514J5601f3859B0174a17403
$$ -100654 100556 140058 -96857 30337 14969 108777 135291 150892 -63859 20174 -117403
12437E1049d6571j76828A22591J77646A23326J04998i1187E5173f9954A88908
$$ 51049 -46571 -223399 122591 300237 123326 228324 -91187 55173 -69954 188908
12426E2818O2837g8886k02184f2640A3535J3111g1557A0916a35878j20355L7846
$$ 52818 115655 -78886 -281070 -62640 13535 26646 -71557 10916 -135878 -256233 -218387
12415b18387o8234c0674Q064j04734G8205L9425g7615I5121h2597B56029a82230
$$ -218387 -286621 -30674 -22610 -127344 78205 117630 -77615 95121 -82597 256029 -182230
12403d65801A82828a73459C6909O5655J24543P9953E4638c48962a29023A83062
$$ -465801 182828 -173459 36909 102564 227107 307060 54638 -348962 -129023 183062
12392b23887A15451m6252l0032h647A80510D4937c9774B12041b22031A21338c7876
$$ -223887 115451 69199 39167 -8647 180510 44937 -39774 212041 -222031 121338 -37876
12380B4628L52698p2861A17051R0362F5518K186L6288J08256a13415C3855M0289
$$ 24628 377326 304465 117051 207413 65518 67704 103992 212248 -113415 33855 74144
12369G4144B6752L26244c2345A43302E9078P3610b29480A11457c1909j17208D68
$$ 74144 26752 352996 -32345 143302 59078 132688 -229480 111457 -31909 -149117 468
12357a87695C82726j17481f9305A27559e3917A9966J82258D5285Q407j7386K591
$$ -187695 382726 265245 -69305 127559 -53917 19966 202224 45285 53692 36306 38897
12346C8897Q445J41737D934O6912a48155A5664K39420d1982C13J00504b29845
$$ 38897 47342 189079 4934 71846 -148155 15664 255084 -41982 313 100817 -229845
12334D6991K53015H6448g3445C54227J0822g3776H1639C0167L54437a14313k6868
$$ 46991 300006 86448 -73445 354227 365049 -73776 81639 30167 384604 -114313 -141181
12323a41181B09825P9179A25346b02208C80889I8723J06448l0905k5457a8842
$$ -141181 209825 289004 125346 -202208 380889 98723 205171 174266 148809 -18842
12312d2679j32082k8831A19026k8729J42917F6406J86421f0483B34862c6953A90930
$$ -42679 -174761 -203592 119026 90297 233214 66406 252827 -60483 234862 -36953 190930
12300e8944m020l06254B1638a97112A82530P1734j22154d1796C30955A46122P1553
$$ -58944 -62964 -369218 21638 -197112 182530 254264 132110 -41796 330955 146122 217675
12289B17675J24948a11397D4095J23625i498q1823A62828J61j7241J1197a05007
$$ 217675 342623 -111397 44095 167720 -9498 -91321 162828 162989 145748 156945 -105007
12277B59186A27334J32857K9981a62657A0591J00808Q4371L5968E996J23612R6316
$$ 259186 127334 260191 290172 -162657 10591 111399 195770 231738 5996 129608 225924
12266B25924p2994n731L6240m5311o1662a84622A97706B8635J02161k2553g307
$$ 225924 152930 147199 183439 138128 76466 -184622 197706 28635 130796 108243 -7307
12254A56443K94851j66431n4781r8104R7232I5838J72187I9147k609P701d2753
$$ 156443 451294 284863 230082 131978 229210 95838 268025 99147 96538 104239 -42753
12242B37866F5718K32359B2971J94458D3391k506J53918G1972h7977A909a29191
$$ 237866 65718 298077 22971 217429 43391 40885 194803 71972 -87977 1909 -129191
12230C68357b2506D8851J61369e7361B38647Q7978r4931c51318A63497O9072L2411
$$ 368357 -22506 48851 210220 -57361 238647 326625 231694 -351318 163497 232569 264980
12219B64980q4905B8266L18065k9537p5223r4547a01924B08943N7294K7503J4170
$$ 264980 180075 28266 346331 316794 241571 147024 -101924 208943 266237 293740 307910
12208C07910k0019d1097D25735B2557a46336B11544p9238D1424c3561G1882N5904
$$ 307910 287891 -41097 425735 22557 -146336 211544 132306 41424 -33561 71882 127786
12197A27786P8408J07390c8387B17269g0195A06602K35732j61249O0200I525J7000
$$ 127786 206194 313584 -38387 217269 -70195 106602 342334 181085 241285 9525 26525
12186B6525J11679J3930j7829R1256A05958J78377B3775a81991A47454L38658
$$ 26525 138204 152134 134305 225561 105958 284335 23775 -181991 147454 486112
12176D86112I8701O1757B3799J83862J33881I8723P3749m8368O2109j8677K16700
$$ 486112 98701 160458 23799 207661 341542 98723 172472 124104 186213 167536 384236
12165C84236D1189L44094H8101K72015j66798K21529A66270M863e0873E9217h659
$$ 384236 41189 385283 88101 360116 193318 414847 166270 171133 -50873 59217 -8659
12153c428q5557K5308B45625f8688B08634q8425b8040B07050F7435J65315e0282
$$ -3428 -88985 -63677 245625 -68688 208634 120209 -28040 207050 67435 232750 -50282
12141a96903A7808J12359E0108A8190J28862h3169A83574J91381a10875B779L09137
$$ -196903 17808 130167 50108 18190 147052 -83169 183574 374955 -110875 2779 311916
12130C11916O8834j01292n9719b9280A9794J40113B8386j3822N11893j86544j32486
$$ 311916 380750 279458 219739 -29280 19794 159907 28386 14564 526457 339913 207427
12119B07427g7490B59327A7032h7185d368A93408A5573Q2215Q1058p8683c08059
$$ 207427 -77490 259327 17032 -87185 -4368 193408 15573 97788 178846 100163 -308059
12107a06612a1143A21060Q3637e0245C26541j25401E4348a83373A10654A2475
$$ -106612 -11143 121060 204697 -50245 326541 201140 54348 -183373 110654 12475
12096c9997B22364c5746B07186C9356j698a14274C05717I9758M27513b466B18247
$$ -39997 222364 -35746 207186 39356 37658 -114274 305717 99758 527271 -2466 218247
12084F7030M04078B1302J26019c6292A08712c03935A07747J89780H7911a02045
$$ 67030 471108 21302 147321 -36292 108712 -303935 107747 297527 87911 -102045
12073A58752J12450c0237C09894a16679J4973B80751j05371a17553e7856b6847
$$ 158752 271202 -30237 309894 -116679 -101706 280751 175380 -117553 -57856 -26847
12062a11246G5864d572j9523p8759j26111a1656m19855A38818a15034C30259E3582
$$ -111246 75864 -4572 -24095 -102854 -228965 -11656 -431511 138818 -115034 330259 53582
12050E3273M7492h6222j58376G3732B2037g2239A11268f3227n05564B04498B1479
$$ 53273 100765 -86222 -244598 73732 22037 -72239 111268 -63227 -568791 204498 21479
12038H6480a51064a9068B02069c5692A20831D6262J61091I8171J46096b76488
$$ 86480 -151064 -19068 202069 -35692 120831 46262 207353 98171 244267 -276488
12027A16539c52338a51236a3795A82776l5338c8645A0350L12946A10018M9244
$$ 116539 -352338 -151236 -13795 182776 147438 -38645 10350 323296 110018 159262
12017A59262R6383C0243J00844J8285K73396j65433I905f1852o7859L2034P472
$$ 159262 255645 30243 131087 149372 422768 257335 9905 -61852 -129711 -97677 -90205
12006i0205j2655I140g1075K0832k8171q7722c5085B931a2736j06002D06385j08485
$$ -90205 -102860 9140 -71075 -50243 -78414 -166136 -35085 2931 -12736 -118738 406385 297900
11994B97900d6888A80560h048n2007a1426A29030c73659a16747B1848J64814G5215
$$ 297900 -46888 180560 -8048 -60055 -11426 129030 -373659 -116747 21848 186662 75215
11982h6410m6771j28725c5936o8638n1528r8241g7394A59573D4159r526J72892
$$ -86410 -133181 -261906 -35936 -104574 -156102 -254343 -77394 159573 44159 34633 207525
11971B07525b3264j54447Q2174J6667j83708B08406B374K00693b39299C03325
$$ 207525 -23264 -177711 -95537 -78870 -262578 208406 2374 203067 -239299 303325
11960f4056C63354J02024C1987P9248K1620A2369J64139J64373a34117n1099A80091
$$ -64056 363354 465378 31987 111235 132855 12369 176508 340881 -134117 -185216 180091
11948D05317i6036k49079b4383j02211A20896L434d7012I8102N369e4767j21116
$$ 405317 -96036 -345115 -24383 -126594 120896 124330 -47012 98102 103471 -54767 -175883
11937a75883O4714d0623n9967B0148a08118B29161J0959a57997a025A84584q1337
$$ -175883 -111169 -40623 -100590 20148 -108118 229161 240120 -157997 -1025 184584 103247
11926A03247b79912a22324e9304D49802a23315A14853J15962a5797C26954a47736
$$ 103247 -279912 -122324 -59304 449802 -123315 114853 230815 -15797 326954 -147736
11915D58340A95942j7571k6218k8507a37346B40999b01268e4121j68942h7718
$$ 458340 195942 178371 152153 123646 -137346 240999 -201268 -54121 -223063 -87718
11904A69780d1979f025A7196J93889D505N5803i6460b6144e92F609J1026J32122
$$ 169780 -41979 -6025 17196 211085 4505 60308 -96460 -26144 -592 6609 17635 149757
11892A49757b26316j20335C77526i2261D7729A4388g7909l0865j91404J43685
$$ 149757 -226316 -346651 377526 -92261 47729 14388 -77909 -108774 -300178 -156493
11882a56493A04873Q5702E0981Q1487b12785A23589c57112J02543A26515O6457
$$ -156493 104873 190575 50981 132468 -212785 123589 -357112 -254569 126515 192972
11872A92972g2799I1671b07454a3215j53436A61094a92175e7190A21591a85647
$$ 192972 -72799 91671 -207454 -13215 -166651 161094 -192175 -57190 121591 -185647
11861B77149a47084B18702a62425r193I2896a29112A51282c80623f483D507O7964
$$ 277149 -147084 218702 -162425 -171618 92896 -129112 151282 -380623 -6483 4507 72471
11850G2471K4403a02771J9051c343o1942B03821D1673a56595j01129f7324C45091
$$ 72471 96874 -102771 -83720 -3343 -65285 203821 41673 -156595 -257724 -67324 345091
11838B3242J25960C9408a47802B73676a32271c2999p1954j3472J8898E0563K807
$$ 23242 149202 39408 -147802 273676 -132271 -32999 -104953 -118425 -99527 50563 53370
11827E3370c06660G1657R7305b62149A9885a78788A41841D3452F65c03559A48903
$$ 53370 -306660 71657 168962 -262149 19885 -178788 141841 43452 665 -303559 148903
11815c40530A38564c60100a16728C77552b05442b1472j06374j32841i3771j51737
$$ -340530 138564 -360100 -116728 377552 -205442 -21472 -127846 -260687 -93771 -245508
11805b45508F218k494c9916j81439A33618a95881b9370F2402C0700a03572A68892
$$ -245508 6218 3724 -39916 -221355 133618 -195881 -29370 62402 30700 -103572 168892
11793d7216j65782I7895b08148a5809m3283E4018b66791d5339A92749a68039g0639
$$ -47216 -212998 97895 -208148 -15809 -59092 54018 -266791 -45339 192749 -168039 -70639
11781C6375J08425c23155a10835d227k21441L4522j233D2344A7681i5349L7195
$$ 36375 144800 -323155 -110835 -4227 -225668 -191146 -192379 42344 17681 -95349 -58154
11770e8154k8456K9225m27002a13064H7341b77114D914e8203I6003A7537O1253
$$ -58154 -86610 -57385 -484387 -113064 87341 -277114 4914 -58203 96003 17537 78790
11759G8790I892J42714h0934m9473j07641A61932H0430B573M2645c58246B06525
$$ 78790 9892 152606 -80934 -130407 -238048 161932 80430 2573 45218 -358246 206525
11747H5453c8989G5836a38237D3959O1537A8631h9658M4336n0427j72660K1827
$$ 85453 -38989 75836 -138237 43959 105496 18631 -89658 -45322 -95749 -268409 -246582
11736b46582d9336A6331c06691E5886a45965A27435A5128K722f9008k12612J7912
$$ -246582 -49336 16331 -306691 55886 -145965 127435 15128 17850 -69008 -281620 -263708
11725b63708k65282B38774g0584B05130a51571f9111O491B0227M1073B4147a81698
$$ -263708 -528990 238774 -70584 205130 -151571 -69111 -62620 20227 61300 24147 -181698
11713a12793j5729j37843h6242o022l00417a17485N2910C1787K54027N0350j01119
$$ -112793 -128522 -266365 -86242 -92264 -392681 -117485 -64575 31787 285814 336164 235045
11702B35045b68893C20594c55451a46657K1393L5851C08247j44028J00998j0377
$$ 235045 -268893 320594 -355451 -146657 -125264 -89413 308247 164219 265217 254840
11692B54840f5939j47631I3528b61383C10714A15032Q2849a84375B922b36901
$$ 254840 -65939 -213570 93528 -261383 310714 115032 197881 -184375 2922 -236901
11681b0813A07017K0771F3258j8293K45449G5945K36246a22267A47671d657B3749
$$ -20813 107017 127788 63258 44965 290414 75945 312191 -122267 147671 -4657 23749
11669b48031J20458n4078E5043j2962c92055A60481b11829i2708n9181E2152K8079
$$ -248031 -127573 -181651 55043 42081 -392055 160481 -211829 -92708 -151889 52152 80231
11658H0231b2398A7450d5310A82399e7105A0837a07283A27951c87325G7709j9543
$$ 80231 -22398 17450 -45310 182399 -57105 10837 -107283 127951 -387325 77709 58166
11647E8166K61602b48907B51440a09632B7660K2989d8483d4j78719L3815m1890
$$ 58166 319768 -248907 251440 -109632 27660 50649 -48483 -44 -178763 -144948 -186838
11636a86838I257a15861B53847j19022f2497B29608j13764D1097f3227j62290
$$ -186838 9257 -115861 253847 134825 -62497 229608 115844 41097 -63227 -225517
11626b25517H8396J25849I8153C8485b01614J4497B482b05487K4386A17042P4201
$$ -225517 88396 214245 98153 38485 -201614 -187117 2482 -205487 -181101 117042 191243
11615A91243a5897B9105K21696b13268D6719J18185f4458j38197L6102n1828H9111
$$ 191243 -15897 29105 250801 -213268 46719 164904 -64458 -202655 -166553 -218381 89111
11603i3226k83807K5735a21359B86682j18930L5099a33032d4442A82427C5746
$$ -93226 -377033 -351298 -121359 286682 167752 202851 -133032 -44442 182427 35746
11592A07342b01888O9966L2103B53915a08077p9086C08155E6270a09449A32314
$$ 107342 -201888 -131922 -99819 253915 -108077 -187163 308155 56270 -109449 132314
11581g7689C5316e8941b6353A86532a995j75597A73611G0900h4523b6862B50213
$$ -77689 35316 -58941 -26353 186532 -1995 -177592 173611 70900 -84523 -26862 250213
11569E3499e8623B31418E9022a9795l1095A80148f4836j39064R868j2381B06174
$$ 53499 -58623 231418 59022 -19795 -50890 180148 -64836 -203900 -194032 -206413 206174
11557a45876A78772J37455A57759a27740I1884h6547K1203A20456a8123n5012
$$ -145876 178772 316227 157759 -127740 91884 -86547 -65344 120456 -18123 -73135
11547g3135B1033a35829C20964d6046j4392B3403b26001C37738A52087j0753F4510
$$ -73135 21033 -135829 320964 -46046 -60438 23403 -226001 337738 152087 141334 64510
11535E1727j020J19126b8682C57090h6819j5377c5875p2997j987B19768f932C0350
$$ 51727 50707 169833 -28682 357090 -86819 -102196 -35875 -108872 -110859 219768 -6932 30350
11522A33515J82708a93348C06607r4897a86580A36642e7554A06556k6108J3509
$$ 133515 316223 -193348 306607 211710 -186580 136642 -57554 106556 80448 93957
11512I3957a05948C98334i7380B48632C0073M8809K345m773J31971b8745A61472
$$ 93957 -105948 398334 -97380 248632 30073 78882 81227 76454 208425 -28745 161472
11500B388J01761h8726G4772J90925G5405M016b241E7600b05245J1140A95817
$$ 2388 104149 -88726 74772 265697 75405 79421 -2241 57600 -205245 -194105 195817
11488B11023M5849a45839C56090N5880B8811J2143J78105J8548F1872K00768a29052
$$ 211023 256872 -145839 356090 411970 28811 40954 219059 237607 61872 262640 -129052
11476B33512a15357C64165E0191b5288F2675J63856k324J33778j52396I9133J77930
$$ 233512 -115357 364165 50191 -25288 62675 226531 224207 357985 205589 99133 277063
11465B77063Q3481B0177J01677A9149a25340F8351J34113l8332J44496a0247E60422
$$ 277063 360544 20177 121854 19149 -125340 68351 202464 164132 308628 -10247 560422
11453A84173a05568B37171N1798a68279a8877A25949J046J26488E0690K35444
$$ 184173 -105568 237171 288969 -168279 -18877 125949 126995 253483 50690 286134
11443B86134J80738a86796g513C9096R6140e3060A3589J21514i5634B23139F8779
$$ 286134 466872 -186796 -7513 39096 135236 -53060 13589 135103 -95634 223139 68779
11431a99034B09742a36780q421d7437J0758j83429d1443A18503E3742O423J689
$$ -199034 209742 -136780 -145201 -47437 -36679 -220108 -41443 118503 53742 60165 61854
11420F1854b70518A59703g4410j99369C24260a98191j65738Q5176B06750b84544
$$ 61854 -270518 159703 -74410 -273779 324260 -198191 -363929 -278753 206750 -284544
11409A75503g4632j82521a3351k5884C99030j16061A8294d9664A13639a10414
$$ 175503 -74632 -257153 -13351 -39235 399030 282969 18294 -49664 113639 -110414
11398B84678G1812A6719a64381C70366b91874L148B17076E4911L1698b25043a7431
$$ 284678 71812 16719 -164381 370366 -291874 -288726 217076 54911 86609 -225043 -17431
11386A76105F5065b34728C7118a9507j59914D1802a26921j35061k55677a80995
$$ 176105 65065 -234728 37118 -19507 -179421 41802 -126921 -261982 -517659 -180995
11375B14568e8064B9376a42247A97171a50293F6704J39998b89722R3068O7186
$$ 214568 -58064 29376 -142247 197171 -150293 66704 206702 -289722 -196654 -129468
11365a29468k04726d3134F0929h7827K4211A81031c0398n04846c2659B45727b4134
$$ -129468 -334194 -43134 60929 -87827 -63616 181031 -30398 -535244 -32659 245727 -24134
11353a49892F6903b6200j55544A83372J24458h8138L7344R418j37528A49218a33328
$$ -149892 66903 -26200 -181744 183372 307830 -88138 -50794 -41376 -178904 149218 -133328
11341a57663j72878B12004a61449j80007R1253h5360C75777a20968B29575L1474
$$ -157663 -330541 212004 -161449 -341456 -250203 -85360 375777 -120968 229575 261049
11331B61049a65827g8800l29114a6246B15446b93769c9883q1359g720m676C33848
$$ 261049 -165827 -78800 -407914 -16246 215446 -293769 -39883 -121242 -7720 -12396 333848
11319b67341J6508C3453Q7616H705i8719J0828j97475J38853f0995I8612d3356
$$ -267341 -250833 33453 121069 8705 -98719 -87891 -285366 -146513 -60995 98612 -43356
11307c2098A12025g1356l2995j474j84687J28401A63010F7774c3422B0903a14145
$$ -32098 112025 -71356 -104351 -105825 -290512 -162111 163010 67774 -33422 20903 -114145
11295a89182L234a1093j58578L8321j90499A51376C474J38190a55125j12888M1916
$$ -189182 -185948 -11093 -169671 -131350 -321849 151376 3474 141664 -155125 -268013 -226097
11284b26097b1752B8224a08924k3351A70972f574D9201d6888J5348A47015h0661
$$ -226097 -21752 28224 -108924 -132275 170972 -6574 49201 -46888 -31540 147015 -80661
11272a31205k03275h5843a9229j41475P8291c8494j34243K7338j13175A50316
$$ -131205 -334480 -85843 -19229 -160704 -82413 -38494 -172737 -145399 -258574 150316
11261a97684F9893j4431J01368c65164a53176K9458j70452D7959a09796b3493
$$ -197684 69893 55462 156830 -365164 -153176 -123718 -294170 47959 -109796 -23493
11250f142m43710A02456A9321J82412F4523A1645a9125m1416i149D7944i8556
$$ -6142 -449852 102456 19321 201733 64523 11645 -19125 -60541 -9149 47944 -98556
11238A47149N7315i6615A26573a81417B60242i1753k33638I664Q8275i872A05571
$$ 147149 204464 -96615 126573 -181417 260242 -91753 -325391 9664 97939 -9872 105571
11226A41401i534k05637m8967P3389B76321a68884K6704c0463j40390K4532B2068
$$ 141401 -9534 -215171 -264138 -190749 276321 -168884 -142180 -30463 -170853 -146321 22068
11214D0486J22402b78333F8436c35250A6586Q8934N739J80018b76806c8484a729
$$ 40486 162888 -278333 68436 -335250 16586 105520 111259 291277 -276806 -38484 -1729
11202A79944a73093q0151A43386o4614a10404J8246k5064p4281I4379a78452e9995
$$ 179944 -173093 -253244 143386 78772 -110404 -92158 -117222 -191503 94379 -178452 -59995
11190B3910a72636j58167F5185j6862j2766a05266C4067K3133d55267a47803A71496
$$ 23910 -172636 -330803 65185 48323 35557 -105266 34067 57200 -455267 -147803 171496
11178f6179m28838H1832c16632A3222i548k35513D15964g5739j564l0924K9406
$$ -66179 -495017 81832 -316632 13222 -9548 -245061 415964 -75739 -77303 -108227 -78821
11167g8821E4507f438k97655D0911b11152l7463D2171L1510p595B1877J24286
$$ -78821 54507 -6438 -304093 40911 -211152 -248615 42171 73681 66086 21877 146163
11156A46163F4563L3896a76224h7125P107j3490B1597N0376d0490J9119K186A49664
$$ 146163 64563 98459 -176224 -87125 -80018 -93508 21597 71973 -40490 -21371 -19185 149664
11143C1631j5739N1966p94N3341A865O8222b11557E0946e193A07514f6704k56415
$$ 31631 15892 67858 67064 120405 1865 70087 -211557 50946 -5193 107514 -66704 -323119
11131c23119b7872B13758B616b1221A06038a36600f3372j87602N1128A30009K1155
$$ -323119 -27872 213758 2616 -21221 106038 -136600 -63372 -250974 -199846 130009 151164
11120A51164b18238h2406A17018O4083J4936J92117b9315F8839F144a19565A90686
$$ 151164 -218238 -82406 117018 181101 196037 388154 -29315 68839 6144 -119565 190686
11108e6299B02324q4666b34143C18727r0658J7834g951m5742B171J16943P0832
$$ -56299 202324 117658 -234143 318727 228069 245903 -7951 -53693 2171 119114 189946
11097A89946G9619I851L49042q2688J2392C6537N6863J9233o010J19400J48835
$$ 189946 79619 9851 358893 276205 288597 36537 93400 112633 106623 226023 374858
11086C74858A41688J92137o9951A09393L21739h1138B84639m6612J72864j79162
$$ 374858 141688 333825 263874 109393 431132 -81138 284639 238027 410891 231729
11076B31729N5459j16108G0876a78444A98888b39A02307J08061J67922A05969
$$ 231729 287188 171080 70876 -178444 198888 -239 102307 210368 378290 105969
11065A49249L4881J00451j37249P1053N3046J04466J47725j00519L18522k93918
$$ 149249 184130 284581 147332 218385 271431 375897 523622 423103 741625 447707
11055D47707L0992j4180K87753C29830L37414j102J284j29386J3502K49464j48315
$$ 447707 478699 464519 752272 329830 667244 666142 667426 538040 551542 801006 652691
11044F52691J12124K02619j60865l36169J46469N0105L19060j40165j93136R5801
$$ 652691 764815 967434 806569 470400 616869 666974 986034 845869 652733 748534
11034G48534K86680D03664M23834l36106Q2461k16217L62834C25701L38856J03301
$$ 748534 1035214 403664 827498 491392 573853 357636 720470 325701 664557 767858
11024G67858l9642J56740k61949N0890P1052J63489C70220M72105l04569J01355
$$ 767858 728216 884956 623007 673897 744949 908438 370220 842325 537756 639111
11014F39111o7169m9455j14806A46573L40375n0634L4556j46147K58793K6413
$$ 639111 571942 522487 407681 146573 486948 436314 470870 324723 583516 609929
11004F09929r5386L56060j30935l34618M6696K75700j90996o0649L95220l39517
$$ 609929 514543 870603 739668 405050 451746 727446 536450 475801 871021 531504
10994E31504J91106k98011Q453L22157O3910j91580j9970K2502J35428n7545K34719
$$ 531504 722610 424599 433052 755209 819119 627539 607569 630071 765499 707954 942673
10983I42673l34652L05600j20800J32358k54265L90461Q6061j27957K32579J20483
$$ 942673 608021 913621 792821 925179 670914 1061375 1147436 1019479 1252058 1372541
10973A372541N547J31406N58554M58953N6024p5849L00564j24735j94651n0355
$$ 1372541 1378088 1509494 2068048 2527001 2583025 2507176 2807740 2683005 2488354 2437999
10963B437999J3173l81587m94737P7626l78469J89467m53930N81864j52014J9878
$$ 2437999 2451172 2069585 1574848 1652474 1274005 1463472 1009542 1591406 1439392 1459270
10953A459270M3539r9818K66816q591n89082R0676M214j46171m15642P6477j54469
$$ 1459270 1502809 1402991 1669807 1661216 1072134 1162810 1167024 1020853 605211 681688 527219
10942E27219m4778j07515p1147J28574h7045B84621a02949C1932P3171J7256L47225
$$ 527219 482441 374926 303779 432353 -87045 284621 -102949 31932 105103 122359 469584
10931D69584I6642l1779a29716A06327b99543A43392a67834c221A87111q9958
$$ 469584 96642 64863 -129716 106327 -299543 143392 -167834 -3221 187111 97153
10921I7153a25485k76658B6760R175I785d4635B3141a01133A30352a83125b0380
$$ 97153 -125485 -402143 26760 35935 9785 -44635 23141 -101133 130352 -183125 -20380
10909a0786l76397C0760c51347A85902a64554j7862C29550j46309q3146b42339
$$ -10786 -387183 30760 -351347 185902 -164554 -182416 329550 183241 100095 -242339
10898d9501A27796f1995j01425A317d7934j31362m7583J10588A27320a05623J8565
$$ -49501 127796 -61995 -163420 1317 -47934 -179296 -226879 -116291 127320 -105623 -87058
10887h7058D79736b70542k66235f1711E7865J11545i8055j83457a02223d8374
$$ -87058 479736 -270542 -536777 -61711 57865 169410 -98055 -281512 -102223 -48374
10876G6152b30897b0566k68827J02483o8832J22973C17156a10052J060q1831k09108
$$ 76152 -230897 -20566 -289393 -186910 -255742 -132769 317156 -110052 -108992 -190823 -399931
10865c99931J80341I2551h2610l033A91898H8601a14453F6287j4764K33443j36695
$$ -399931 -219590 92551 -82610 -85643 191898 88601 -114453 66287 51523 284966 148271
10854A48271J25153p8978D6442J17695b3866o8442I0220c34331O8771L112J4376
$$ 148271 273424 194446 46442 164137 -23866 -92308 90220 -334331 -265560 -262448 -248072
10843b48072h9036o7848B2843J52682F0346c43565B95397c36821P5659A4847a4711
$$ -248072 -89036 -156884 22843 175525 60346 -343565 295397 -336821 -261162 14847 -14711
10831b5630o1290R439D4171b30700E9750b50510J9916q6515A35907b39971b6434
$$ -25630 -86920 -77481 44171 -230700 59750 -250510 -230594 -317109 135907 -239971 -26434
10819a12117b6616k10924e4248j51557L9029n9571A1038a31395C48438c28676
$$ -112117 -26616 -237540 -54248 -205805 -166776 -226347 11038 -131395 348438 -328676
10808G8296g8052j2512A41541A491b07313a225C53812A29048J5621e8244j7953
$$ 78296 -78052 -90564 141541 1491 -207313 -1225 353812 129048 144669 -58244 -76197
10797g6197F5323k1456a61532g6928A55486a66961F6000k5351R9977C3610b44757
$$ -76197 65323 43867 -161532 -76928 155486 -166961 66000 40649 140626 33610 -244757
10785b02762C9047b02604r3281l349A83727B8551A052J79277b21018E6139J12380
$$ -202762 39047 -202604 -295885 -299234 183727 28551 1052 180329 -221018 56139 168519
10774A68519a16288m560C91206b69212j48931C02650b23184J06508K3144A25906
$$ 168519 -116288 -120848 391206 -269212 -418143 302650 -223184 -116676 -93532 125906
10763a0768G4873B2617c16466J03414B37475j02366a21908j3341e6660C3974c2203
$$ -10768 74873 22617 -316466 -213052 237475 135109 -121908 -135249 -56660 33974 -32203
10751a81244A21964c09388M8804A01399b16033A51605a80534B19848l8671b62443
$$ -181244 121964 -309388 -260584 101399 -216033 151605 -180534 219848 181177 -262443
10740A6906b585l32950b7354I6678c21508a42690j40746j44367a14031q7893h5507
$$ 16906 -2585 -335535 -27354 96678 -321508 -142690 -283436 -427803 -114031 -201924 -85507
10728d29084c6931A57207e7533A87372G5859e8139l4800A91320c26885J22808
$$ -429084 -36931 157207 -57533 187372 75859 -58139 -92939 191320 -326885 -204077
10718b04077A02860D8871j4934b08666A15314C9982J23080k996a91788b9148A09018
$$ -204077 102860 48871 33937 -208666 115314 39982 163062 160066 -191788 -29148 109018
10706d45D6921c3539D8720J23325A3697a36522I6983J72109c08621B01451o8812
$$ -445 46921 -33539 48720 172045 13697 -136522 96983 269092 -308621 201451 132639
10695A32639J66278d91233B24304b07258G3601a10740j12254J08671A10280g3936
$$ 132639 298917 -491233 224304 -207258 73601 -110740 -222994 -114323 110280 -73936
10684b6716n0043A59463A3131h0622b3873E1730q321q334a11279B65702b58084
$$ -26716 -76759 159463 13131 -80622 -23873 51730 43409 35075 -111279 265702 -258084
10672c94853i7471A31965j9104n25b7053G4657a84291j41999C1578O1203b45326
$$ -394853 -97471 131965 112861 112336 -27053 74657 -184291 -326290 31578 92781 -245326
10660f7650B44302c68618D5788a99280d2613B54067a27808B3935K7921J59639
$$ -67650 244302 -368618 45788 -199280 -42613 254067 -127808 23935 51856 211495
10650B11495b55970E1495b58729B53515j18836g5025E3237b04779e6864I3170
$$ 211495 -255970 51495 -258729 253515 134679 -75025 53237 -204779 -56864 93170
10639E566a13567L3379j82183j01497B22663c0197F4784b32200a01851B01773
$$ 5566 -113567 -80188 -262371 -363868 222663 -30197 64784 -232200 -101851 201773
10628d7841k6581M399e179A77830j1585j4050J3655C4184i5150A11493J2662F0563
$$ -47841 -74422 -70023 -5179 177830 166245 152195 165850 34184 -95150 111493 124155 60563
10615b67877A99612Q2620b61969a06755Q604L4400A16126b2286D356a42057A97767
$$ -267877 199612 282232 -261969 -106755 -98151 -63751 116126 -22286 4356 -142057 197767
10603e8449j089k09223J19453j8408C2191c8834a8872A74514J17631F5309a49084
$$ -58449 -59538 -268761 -149308 -167716 32191 -38834 -18872 174514 292145 65309 -149084
10591c36705c9681j50004D0021b80256C00426H0517A5245b42975j96966A71544
$$ -336705 -39681 -189685 40021 -280256 300426 80517 15245 -242975 -439941 171544
10580h1879k73527J24908e0269k47104b9257A05064R8074d17860a85172l0972
$$ -81879 -355406 -230498 -50269 -297373 -29257 105064 203138 -417860 -185172 -216144
10570b16144e4975j01834J4231j68884F8747l826b63566N1722J2448E2746R4432
$$ -216144 -54975 -156809 -142578 -311462 68747 64921 -263566 -211844 -199396 52746 147178
10559A47178k3470D1680K692O3584b73023A95310c8307j46575j31712c2525j20804
$$ 147178 123708 41680 44372 107956 -273023 195310 -38307 -184882 -316594 -32525 -153329
10548a53329I2192a07865A36662b5644m4128q890K8708C9906c79674G3707g3236
$$ -153329 92192 -107865 136662 -25644 -69772 -78662 -49954 39906 -379674 73707 -73236
10536I9131L4895f4358o8515I7427b23172O6834C0710N4538a74390B27568a68152
$$ 99131 134026 -64358 -132873 97427 -223172 -156338 30710 85248 -174390 227568 -168152
10524E0360J58858b62815i3403j30259P9942A02365a53850A00345D6179a70241
$$ 50360 209218 -262815 -93403 -223662 -143720 102365 -153850 100345 46179 -170241
10513d6399l7612p0840b9903j40158e263A40247a99159M2706J6365G3544B8432
$$ -46399 -84011 -154851 -29903 -170061 -5263 140247 -199159 -156453 -140088 73544 28432
10501h4143h074A89057b48730i963o9404a5231C58110b2136j51091Q5972K888
$$ -84143 -8074 189057 -248730 -9963 -79367 -15231 358110 -22136 -173227 -87255 -84367
10490h4367k03070D18J07759O6028g7851k15264A95054N9595a50112A39075Q2131
$$ -84367 -287437 418 108177 174205 -77851 -293115 195054 254649 -150112 139075 221206
10479B21206h7736A11075g7031C55515J98661N364J58257C34261a13666B90961
$$ 221206 -87736 111075 -77031 355515 554176 559540 717797 334261 -113666 290961
10468B52830k4505o843C8706a58934C8239g9891C0079O8419a50700j04189B07710
$$ 252830 228325 221482 38706 -158934 38239 -79891 30079 98498 -150700 -254889 207710
10456A1118K24437b9093l6730k43890i9517A38882a93073n7091A2459b13530R7469
$$ 11118 235555 -29093 -65823 -309713 -99517 138882 -193073 -250164 12459 -213530 -116061
10445a16061G0624a43569p1086L5254h30r3966E621a01515j86884E9226b8908
$$ -116061 70624 -143569 -214655 -179401 -830 -94796 5621 -101515 -288399 59226 -28908
10433b74916O9971A2750L08506B9264r166b57886e6733j48544o1686C18169c03966
$$ -274916 -204945 12750 321256 29264 20098 -257886 -56733 -205277 -266963 318169 -303966
10421b34828A50120h8784E9758b39G2458J2871b08489A6969a42457j47145a14570
$$ -234828 150120 -88784 59758 -239 72458 85329 -208489 16969 -142457 -289602 -114570
10409A43162c6672B070c54089A0753J15527f795l0815A60537g859q3660D8818
$$ 143162 -36672 2070 -354089 10753 126280 -6795 -37610 160537 -7859 -91519 48818
10397h4637L4549A9393c1561B87465A20908C006J59065a03102E4600J8126h2773
$$ -84637 -50088 19393 -31561 287465 120908 3006 162071 -103102 54600 72726 -82773
10385a71595G690g811C31208c8472p2689D4266f4313R250A3077J61520H6861L28636
$$ -171595 7690 -7811 331208 -38472 -111161 44266 -64313 -55063 13077 174597 86861 415497
10373D15497K244A66471b22426L1412B19494M6512K3354H7788J89061n2275J10109
$$ 415497 417741 166471 -222426 -191014 219494 266006 289360 87788 276849 224574 334683
10362C34683a660A10078E4791M16134E9876K50741a31515J0297A98225a286B42259
$$ 334683 -1660 110078 54791 470925 59876 310617 -131515 -121218 198225 -1286 242259
10350F1122L74053j1018J88665j94756n7720j78038D6227K89212j44502Q0400
$$ 61122 435175 424157 612822 418066 360346 182308 46227 335439 190937 271337
10340B71337L89333C02985j29743Q1703b05321B79432R0312A42328J61284j31352
$$ 271337 660670 302985 173242 254945 -205321 279432 369744 142328 303612 172260
10330A72260o6167J90834a14916j0961I717K0012K1877J35943f363n1445B39837
$$ 172260 106093 296927 -114916 -125877 9717 29729 51606 187549 -6363 -57808 239837
10318A68492K9903E9417J74875n1907n2708l5659b113j44818A09280B4289N2284
$$ 168492 198395 59417 234292 182385 129677 94018 -2113 -146931 109280 24289 76573
10307G6573g5444C13555C3782a59566A56979e8886F7463c26371A06614a32792
$$ 76573 -75444 313555 33782 -159566 156979 -58886 67463 -326371 106614 -132792
10296a51657A20137K8021B9901p413e5076q1312B03775J5474b2964E3957c7607
$$ -151657 120137 148158 29901 22488 -55076 -136388 203775 219249 -22964 53957 -37607
10284a28446b8057J0347j42476r5397h1126H5671l5813a25512c3359A06808J45613
$$ -128446 -28057 -17710 -160186 -255583 -81126 85671 49858 -125512 -33359 106808 252421
10273B52421H9644c04520G701R9246b25518B28354J36129A27287h8341A98898
$$ 252421 89644 -304520 7701 106947 -225518 228354 364483 127287 -88341 198898
10262F6185b01479g3848l7646D7559d0724B24477e5684A57848n2088a71339G7369
$$ 66185 -201479 -73848 -111494 47559 -40724 224477 -55684 157848 105760 -171339 77369
10250D10890a7822D76824D5057e1906B3286i9627A69268c17086J52829B2441b92998
$$ 410890 -17822 476824 45057 -51906 23286 -99627 169268 -317086 -164257 22441 -292998
10238C06761C879a18382p960A17252c5449C1794c0491B3114a05123b4013l4095
$$ 306761 3879 -118382 -126342 117252 -35449 31794 -30491 23114 -105123 -24013 -58108
10227e8108l2530l1814A87710h5058C03980b570k59239D05199b56212A31948M4830
$$ -58108 -90638 -122452 187710 -85058 303980 -2570 -261809 405199 -256212 131948 176778
10216A76778p6069A997g2667k49794P8379A85905i4691j895B1279a01650p0717
$$ 176778 100709 1997 -72667 -322461 -244082 185905 -94691 -96586 21279 -101650 -172367
10205a72367F1286L91963B6124J3536a96102B4735b05230L2225B19554a96071
$$ -172367 61286 453249 26124 39660 -196102 24735 -205230 -173005 219554 -196071
10194c3607j73345g2905j89785O7028j1992j4952b9724q6417i209l2940k98037
$$ -33607 -206952 -72905 -262690 -195662 -207654 -222606 -29724 -116141 -9209 -42149 -340186
10183c40186a46976A47589b26155k25837D75011a55501H4711a70640A69622p4981
$$ -340186 -146976 147589 -226155 -451992 475011 -155501 84711 -170640 169622 94641
10173I4641b61306f3279B3252c53435B6158b07123Q0310k87614a31265N4714k47859
$$ 94641 -261306 -63279 23252 -353435 26158 -207123 -126813 -414427 -131265 -76551 -324410
10162c24410m3200g5507E3727M5827i5966j03447M9688c2261k51032b0756l13884
$$ -324410 -367610 -75507 53727 99554 -95966 -199413 -149725 -32261 -283293 -20756 -334640
10151c34640A12882J30157A20115d8554r6368A53743a13361C10491B1553b11349
$$ -334640 112882 243039 120115 -48554 -144922 153743 -113361 310491 21553 -211349
10140c10743E8462c20424J42955m8017h6117C64254A931L4566b11758b9016r2057
$$ -310743 58462 -320424 -177469 -225486 -86117 364254 1931 36497 -211758 -29016 -121073
10129a21073j2194A86110b82719K9734q4145f8387A1649K1680b72343g5836A44998
$$ -121073 -133267 186110 -282719 -252985 -337130 -68387 11649 33329 -272343 -75836 144998
10117A08338N80a86206l9543e0394j34766f7218k47001F5634a27308A03764b33325
$$ 108338 108918 -186206 -225749 -50394 -185160 -67218 -314219 65634 -127308 103764 -233325
10105a42882p2820A15102E4045a69428B5424g911k24048A33848c16342g2512A94468
$$ -142882 -215702 115102 54045 -169428 25424 -7911 -231959 133848 -316342 -72512 194468
10093c09662a27399H4882R8513b5236A71197a64788l0575O2884b2379j20266C62285
$$ -309662 -127399 84882 183395 -25236 171197 -164788 -195363 -132479 -22379 -142645 362285
10081G4682b67800A8824a55666g5052j87798G4102b70059j15130J54778a8874
$$ 74682 -267800 18824 -155666 -75052 -262850 74102 -270059 -385189 -230411 -18874
10070c23602f7681r9726N744C04769a61653F1341g1837j66252c6367j81364M9779
$$ -323602 -67681 -167407 -161663 304769 -161653 61341 -71837 -238089 -36367 -217731 -167952
10059a67952E5471J7206a87887I7270a11740C39944a53607j57391j4416g6970
$$ -167952 55471 72677 -187887 97270 -111740 339944 -153607 -310998 -325414 -76970
10048A68666N51b52924n5112i7513B9403a95776C1710Q1122l9903d9197k1353
$$ 168666 169217 -252924 -308036 -97513 29403 -195776 31710 112832 72929 -49197 -70550
10037g0550j25857l6672B43773a07329K485A32423o2446d31770N7813p3952G488
$$ -70550 -196407 -233079 243773 -107329 -104844 132423 69977 -431770 -373957 -447909 7488
10025I3754b43851I8777c7676j32900j81117B41881g5216j82356A12685c89008
$$ 93754 -243851 98777 -37676 -170576 -351693 241881 -75216 -257572 112685 -389008
10014b23423j41076J07911K7518a13355I3040h6592B45990e9758E5209a32340
$$ -223423 -364499 -256588 -229070 -113355 93040 -86592 245990 -59758 55209 -132340
10003B7649c27555c6439A93353b80309E3821a80524C0571a29401A24213C7967
$$ 27649 -327555 -36439 193353 -280309 53821 -180524 30571 -129401 124213 37967
9992A51049c10301A26653b04995Q1918f639C5789M5707a72614r2127b3746j66075
$$ 151049 -310301 126653 -204995 -123077 -6639 35789 81496 -172614 -264741 -23746 -189821
9981a89821D5974i3828a6591j89395A98351e1769l5664j8048H1148C3844b63323
$$ -189821 45974 -93828 -16591 -205986 198351 -51769 -87433 -105481 81148 33844 -263323
9969c17723N7710A72623R0583j09685b5312D7337b47308a09009A92626j3435a0057
$$ -317723 -260013 172623 263206 153521 -25312 47337 -247308 -109009 192626 179191 -10057
9957b3572j87588o0554J2102e6215j81931a18655M4522b7396J605A73204h8147
$$ -23572 -211160 -271714 -259612 -56215 -238146 -118655 -74133 -27396 -25791 173204 -88147
9945B34541b40992A03574a3918j59028I3045J11613G0102M2795g3485I9805m0266
$$ 234541 -240992 103574 -13918 -172946 93045 204658 70102 112897 -73485 99805 59539
9934E9539j8421L5429l4117a18149c4530A26510a71431j37438J00611A30090m9503
$$ 59539 41118 76547 42430 -118149 -34530 126510 -171431 -308869 -208258 130090 80587
9923H0587a04812L9411F8177b61861B74929b7038k4851j91375A17673K3258b05699
$$ 80587 -104812 -65401 68177 -261861 274929 -27038 -51889 -243264 117673 140931 -205699
9911A30076a01911Q007q0062j41063J55790A40225M5864a61503O1974F1811l0328
$$ 130076 -101911 -93904 -173966 -315029 -159239 140225 186089 -161503 -99529 61811 31483
9900C1483b30660I936a10448q7877J209r3275B77702a39881a9485m852k85922
$$ 31483 -230660 9936 -110448 -198325 -197116 -290391 277702 -139881 -19485 -24337 -310259
9889c10259L5166e5586B1049K1128b36465Q417C1886d7604e558k4535l5822E5702
$$ -310259 -275093 -55586 21049 42177 -236465 -228048 31886 -47604 -5558 -30093 -65915 55702
9876I8412N2763m5105h8709C27862a74759d421j6606r7623R600A2381L9823j2184
$$ 98412 151175 106070 -88709 327862 -174759 -4421 -21027 -118650 -109050 12381 52204 40020
9864D0020J59313d5660l32425j40402a14374j82015J02621i1718B30713a8271
$$ 40020 199333 -45660 -378085 -518487 -114374 -296389 -193768 -91718 230713 -18271
9853c37383A02924c59107D09542b13049k07559g6356b40B46230a25790r8912J00084
$$ -337383 102924 -359107 409542 -213049 -420608 -76356 -240 246230 -125790 -224702 -124618
9842a24618o978j783G6177J0371f7174k7766r0397p1689D3617c89592g1070j81246
$$ -124618 -131596 -133379 76177 86548 -67174 -94940 -185337 -257026 43617 -389592 -71070 -252316
9830b52316g4875a6488D017i7619A7303J49085a70301p1004o0904A7545b14893
$$ -252316 -74875 -16488 4017 -97619 17303 166388 -170301 -241305 -302209 17545 -214893
9818i0805G1833C2470d3482A26470g1005k92092a3088D8667b03879d3923j19021
$$ -90805 71833 32470 -43482 126470 -71005 -363097 -13088 48667 -203879 -43923 -162944
9807a62944o3956O8885G5392a03847a239k22013A71551a88748j18837a5891j12240
$$ -162944 -226900 -158015 75392 -103847 -1239 -223252 171551 -188748 -307585 -15891 -128131
9796a28131L158L0538A04979J451J13259b7491k23757A69743q3037i2860b9132
$$ -128131 -124973 -94435 104979 106430 219689 -27491 -251248 169743 86706 -92860 -29132
9784a39872m3529P4371L4457l04158g2013k47012D51913C4236b0345k68208a29020
$$ -139872 -183401 -109030 -74573 -378731 -72013 -319025 451913 34236 -20345 -288553 -129020
9772e10239B3302e4932B97801j07737g9389p0046G5789a8533D9888B1044J17163
$$ -510239 23302 -54932 297801 190064 -79389 -149435 75789 -18533 49888 21044 138207
9761A38207b07182A39950O6492c44j16134J0345j9945p6071a1547B1712a98362
$$ 138207 -207182 139950 206442 -344 -116478 -106133 -126078 -202149 -11547 21712 -198362
9749b87835d7013G2204b76156i1377B01423A2906a38066a0236j47086E5362f365
$$ -287835 -47013 72204 -276156 -91377 201423 12906 -138066 -10236 -157322 55362 -6365
9737A45310a82291Q6772D788a73080n7749E6861a88624k63665I338a20736c0414
$$ 145310 -182291 -95519 4788 -173080 -230829 56861 -188624 -452289 9338 -120736 -30414
9725B49809C256L28649a4762H7002N6451d42591J68431l2388A8904J7908J37512
$$ 249809 3256 331905 -14762 87002 143453 -442591 -274160 -306548 18904 36812 174324
9714A74324o6497l0059b32379i5748o0977D0468d8564l2103G7851c12412A4343
$$ 174324 107827 77768 -232379 -95748 -156725 40468 -48564 -80667 77851 -312412 14343
9702A81659e837k90699a29903f4580k25120B9657J69509i6097b8082j36097K1653
$$ 181659 -5837 -296536 -129903 -64580 -289700 29657 199166 -96097 -28082 -164179 -142526
9691a42526l9178D9211b15650k4992C5599K34901b71771j35852e2263A40592K2509
$$ -142526 -181704 49211 -215650 -240642 35599 270500 -271771 -407623 -52263 140592 163101
9680A63101n5948c2210k16531A6035R8379a30101j42402A62626o1651f3324n1593
$$ 163101 107153 -32210 -248741 16035 114414 -130101 -272503 162626 100975 -63324 -114917
9669a14917o5235j69507a26334B7900h8108o2339c8067B15722b71162E6925a56714
$$ -114917 -180152 -349659 -126334 27900 -88108 -150447 -38067 215722 -271162 56925 -156714
9657b15049A38856a06884A54556d98261A31615c45890a66289P947j6151L3359
$$ -215049 138856 -106884 154556 -498261 131615 -345890 -166289 -158342 -174493 -141134
9647a41134I7553I563J6804b13061B02082F5450b30415a2692F0822g5975c7553
$$ -141134 97553 9563 26367 -213061 202082 65450 -230415 -12692 60822 -75975 -37553
9635A81569b5752j49648C9692a25264f1235C14774F5507f8196p5472A95688h7187
$$ 181569 -25752 -175400 39692 -125264 -61235 314774 65507 -68196 -143668 195688 -87187
9623B8623R6796a34092H4974d62048b05344A24596k0833d14023Q5245A46411F2473
$$ 28623 125419 -134092 84974 -462048 -205344 124596 103763 -414023 -328778 146411 62473
9611A00536a44329f4125j25506A06009g1146L928l48645K00024f4687F8774a21672
$$ 100536 -144329 -64125 -189631 106009 -71146 -67218 -415863 -215839 -64687 68774 -121672
9599D4984A3766b16883j24799a15632A42418b31638A72150O3002b11378F8564
$$ 44984 13766 -216883 -341682 -115632 142418 -231638 172150 235152 -211378 68564
9588b53629G1610f1326o1873l553a0696q2748a3364A86391a99112L0212B7830
$$ -253629 71610 -61326 -123199 -126752 -10696 -93444 -13364 186391 -199112 -168900 27830
9576b22032K1456A99983b04935k9985h3259A00977d7238A57823a95669o1957I2282
$$ -222032 -200576 199983 -204935 -234920 -83259 100977 -47238 157823 -195669 -257626 92282
9564b17135R6703A35311E6391A8008a58645e1206C318R4313a75112D8675f1568
$$ -217135 -120432 135311 56391 18008 -158645 -51206 3318 97631 -175112 48675 -61568
9552b14385f1366B04688a75811E08205A23828a13123d8852j01861f8939j30487
$$ -214385 -61366 204688 -175811 508205 123828 -113123 -48852 -150713 -68939 -199426
9542a99426B75312e0873n3799a8199k23057i2057b4869r4867r5325A79671g5869
$$ -199426 275312 -50873 -104672 -18199 -241256 -92057 -24869 -119736 -215061 179671 -75869
9530a49849D6206J5386h5l8170j06327M152B8524J16772b5235q9586k49645A41852
$$ -149849 46206 61592 -85 -38255 -144582 -140430 28524 145296 -25235 -114821 -364466 141852
9517H0313b88734a01530j4367d3059D6447c93691I0119j2503a78129A55322n4461
$$ 80313 -288734 -101530 -115897 -43059 46447 -393691 90119 77616 -178129 155322 100861
9506A00861M0874a38955A11935C5652b10523L9401j2297I9512f1032l7811D9433
$$ 100861 141735 -138955 111935 35652 -210523 -171122 -183419 99512 -61032 -98843 49433
9494c4587H9432c50389A85276a07592o3448A66464e1959A9153J72674b25978j86103
$$ -34587 89432 -350389 185276 -107592 -171040 166464 -51959 19153 191827 -225978 -412081
9483d12081A9840c3007A72388b12363M2635a4715A00851b89125N7078h6709k90120
$$ -412081 19840 -33007 172388 -212363 -169728 -14715 100851 -289125 -232047 -86709 -376829
9472c76829A31125b32067J08459j824J4241a5183C8589j5352c01178P1004F0996
$$ -376829 131125 -232067 -123608 -125432 -111191 -15183 38589 23237 -301178 -230174 60996
9460C37379b53141A77213b42368a8798A58277C4184d9465H8589a35613m2916A84678
$$ 337379 -253141 177213 -242368 -18798 158277 34184 -49465 88589 -135613 -178529 184678
9448i4726p1148m5049A56080o8161O4054a91001e2039a9397l25247a14873A31074
$$ -94726 -165874 -210923 156080 87919 151973 -191001 -52039 -19397 -344644 -114873 131074
9436a98153A18452a17094j627e3637k9816k9957M4686D4586d64074E396K56012
$$ -198153 118452 -117094 -118721 -53637 -83453 -113410 -68724 44586 -464074 5396 261408
9425B61408c84928F7257b30391j33975P8511R2257A3596c85637D13098A93480
$$ 261408 -384928 67257 -230391 -364366 -285855 -193598 13596 -385637 413098 193480
9414H3142J74434d6344A53544c98685a2721l0273k96648J46735B66173j03416
$$ 83142 257576 -46344 153544 -398685 -12721 -42994 -339642 -192907 266173 162757
9404A62757C1247b00449Q1137o2503g4169j92208A50438a7902k34392k3338j07545
$$ 162757 31247 -200449 -119312 -181815 -74169 -266377 150438 -17902 -252294 -275632 -383177
9393c83177J56386A6380P2280a89284H0599C1498a41127C9483K82449b87002A16911
$$ -383177 -226791 16380 88660 -189284 80599 31498 -141127 39483 321932 -287002 116911
9381D89296E5158a67941B12940q3619b69837B955a74631A26578b00891d5210A80051
$$ 489296 55158 -167941 212940 129321 -269837 2955 -174631 126578 -200891 -45210 180051
9369g7819C66813f1342a854A82467h3323j08592D4841a12950j18434P1757k80742
$$ -77819 366813 -61342 -1854 182467 -83323 -191915 44841 -112950 -231384 -159627 -440369
9358d40369a72862A12078c39824D3615N9768K83828A62466F9605C0381K25029
$$ -440369 -172862 112078 -339824 43615 103383 387211 162466 69605 30381 255410
9348B55410a47617j02786l3492f1273A62544m2799N6325a77767m6957r4453I4222
$$ 255410 -147617 -250403 -283895 -61273 162544 119745 176070 -177767 -224724 -319177 94222
9336a99441f582j5854k55034a05289A13691g0878B872e3748I008J17683C5426
$$ -199441 -6582 -22436 -277470 -105289 113691 -70878 2872 -53748 9008 126691 35426
9324I026R0857h1798D1534L7243c03133h4933p8312M1043c3000k23753E6943a7646
$$ 9026 99883 -81798 41534 78777 -303133 -84933 -163245 -122202 -33000 -256753 56943 -17646
9311F619Q338J0071a85191a3292r8714I0427a59864A3910L31585b27502b2652
$$ 6619 14957 25028 -185191 -13292 -112006 90427 -159864 13910 345495 -227502 -22652
9299a50658m7029N6439j30577e2204H2982b03082k12361j29199i9633G2298b7011
$$ -150658 -197687 -141248 -271825 -52204 82982 -203082 -415443 -544642 -99633 72298 -27011
9287b49982A21418b38429F5568b16772h9332A28603d9960m0150a5818C56393j00530
$$ -249982 121418 -238429 65568 -216772 -89332 128603 -49960 -90110 -15818 356393 255863
9276B55863b08576f2075A3433J6740M0993b21500M7755e645A47680a74135N05
$$ 255863 -208576 -62075 13433 30173 71166 -221500 -173745 -5645 147680 -174135 -173630
9265a73630j97054a48185d952k08865R1414H5032i4763A58177p2810a01015r0245
$$ -173630 -370684 -148185 -4952 -213817 -122403 85032 -94763 158177 85367 -101015 -191260
9254a91260B1853i6978k73999A71782a60551C0478J79095a1104q4048C7621Q537
$$ -191260 21853 -96978 -370977 171782 -160551 30478 209573 -11104 -95152 37621 46158
9243D6158a31209A21802f868B2041a90105N1419k4554k5906B67345a10568d3888
$$ 46158 -131209 121802 -6868 22041 -190105 -138686 -163240 -189146 267345 -110568 -43888
9231f5215k57031h4462M91K8790N845r2462J1793F560b00729R1558K6438H25b93458
$$ -65215 -322246 -84462 -83971 -55181 -49336 -141798 -130005 6560 -200729 -109171 -82733 825 -293458
9217c36486M1752J28613M0280N6743j56183D5110J8460J13563a06971D0451c47230
$$ -336486 -294734 -166121 -125841 -69098 -225281 45110 63570 177133 -106971 40451 -347230
9205F0821a64047H5919a47790r2366N9760A87767m5909E2551c82411a9521A68831
$$ 60821 -164047 85919 -147790 -240156 -180396 187767 141858 52551 -382411 -19521 168831
9193C25542M3417j53600b86140b7404G2754K03643a6874A22825N0707a75527N8968
$$ 325542 368959 215359 -286140 -27404 72754 276397 -16874 122825 173532 -175527 -116559
9182a16559A79430G3461j103B5388J0997M906b66157A39380C5776J5964k863a11526
$$ -116559 179430 73461 72358 25388 36385 41291 -266157 139380 35776 51740 48877 -111526
9169b45533E9727N8784c9834j00971f1520j40920c8328H6653d8469n7676A15407
$$ -245533 59727 118511 -39834 -140805 -61520 -202440 -38328 86653 -48469 -106145 115407
9157a66335K940K6205j95012o4136A4306i0058B54805a27649I970d43009a70261
$$ -166335 -163395 -137190 -332202 -396338 14306 -90058 254805 -127649 9970 -443009 -170261
9145A67267a95764A92399a46852j47914f4468B44989d12407a17138I7675g0293
$$ 167267 -195764 192399 -146852 -294766 -64468 244989 -412407 -117138 97675 -70293
9134e9138j99844C0799L109a5835q7478b159j02564l04472F7835a33452c5182
$$ -59138 -258982 30799 33908 -15835 -103313 -2159 -104723 -409195 67835 -133452 -35182
9122B3317D540e3665A24824a09227c4873n6096Q121j1467K925j87562I686c64161
$$ 23317 4540 -53665 124824 -109227 -34873 -90969 -82848 -94315 -91390 -278952 9686 -364161
9109a21014A93163B8853a95403c6272j12719B92110a47763A00071i8411j88568
$$ -121014 193163 28853 -195403 -36272 -148991 292110 -147763 100071 -98411 -286979
9099b86979J27653G8840l9171A8387L8883b77759C5465N9681J1177K16421b00416
$$ -286979 -159326 78840 39669 18387 57270 -277759 35465 95146 106323 322744 -200416
9087G8314e23047a99849r427a6845o5927a9394o7908c486j20180f1622k55657
$$ 78314 -523047 -199849 -209276 -16845 -82772 -19394 -87302 -3486 -123666 -61622 -317279
9076c17279B3033b02636b5853G4162a85994b5846j4195I9750J35550a57282g8000
$$ -317279 23033 -202636 -25853 74162 -185994 -25846 -40041 99750 235300 -157282 -78000
9064H983a87938Q5607L8896j02910A7123f447q3259M2410o1875k11560j6127A52745
$$ 8983 -187938 -102331 -63435 -166345 17123 -6447 -89706 -47296 -109171 -320731 -336858 152745
9051I982N8448c14000J42030h0192A68773m1488a52521c4043k20107a27030j99108
$$ 9982 68430 -314000 -171970 -80192 168773 127285 -152521 -34043 -254150 -127030 -326138
9040c26138a04520j6281H3289d0045A4199i1199D9553b75034j05371J66011Q7970
$$ -326138 -104520 -120801 83289 -40045 14199 -91199 49553 -275034 -380405 -214394 -126424
9029a26424F3880g5260A23621a32009j31184A07133g9693C0223e9721C40599a80904
$$ -126424 63880 -75260 123621 -132009 -263193 107133 -79693 30223 -59721 340599 -180904
9017B05278c35917l824B4642g2673D97142a56935M4424m225C6293a21441D3152
$$ 205278 -335917 -339741 24642 -72673 497142 -156935 -112511 -116736 36293 -121441 43152
9005a60637n8012j32955L0561a46752j60925P0034B4106i9001j88671g7194m04690
$$ -160637 -218649 -351604 -321043 -146752 -307677 -237643 24106 -99001 -287672 -77194 -481884
8994d81884a34349a0826j10876K2765j45521A13035a35550A25472J35079I365
$$ -481884 -134349 -10826 -121702 -98937 -244458 113035 -135550 125472 260551 9365
8983f4344A08619b6334k14826a2490k25753C7622J6656R575M14808h0788j77825
$$ -64344 108619 -26334 -241160 -12490 -238243 37622 54278 63853 478661 -80788 -258613
8972b58613h4856a6457l9801a6814q0371j20561L1476l912h3115m0145c6266k15308
$$ -258613 -84856 -16457 -56258 -16814 -97185 -217746 -186270 -190182 -83115 -123260 -36266 -251574
8960b51574A51459b83605i2426m9772K0339l1101N0571k0974j83700a05161C59654
$$ -251574 151459 -283605 -92426 -142198 -121859 -152960 -102389 -123363 -307063 -105161 359654
8948D6095f3607j01142A29672D3422a98323E2077a2520j5491j59905k5836A1979
$$ 46095 -63607 -164749 129672 43422 -198323 52077 -12520 -28011 -187916 -213752 11979
8936G3284K31007j9440c87214J50810C79190b43316o4681J11377A9230d5408F1529
$$ 73284 304291 284851 -387214 -236404 379190 -243316 -307997 -196620 19230 -45408 61529
8924A25008l9291O2921M93848J169807L133132J1829922F075518B501412j206186
$$ 125008 85717 148638 642486 1812293 4945425 16775347 6075518 2501412 1295226
8915A295226l09315l85168M27a22344A38923A0044J63952f17442B55187M02783
$$ 1295226 985911 600743 601170 -122344 138923 10044 173996 -617442 255187 657970
8905F57970D4120b0543k3581j2454A68958g8385k4763b0074H4524K06820A1549
$$ 657970 44120 -20543 -44124 -56578 168958 -78385 -103148 -20074 84524 291344 11549
8893b41230g9677B04210B5243d104C9007G684a0702k10083j671h0251j8343A59030
$$ -241230 -79677 204210 25243 -4104 39007 7684 -10702 -220785 -222456 -80251 -98594 159030
8880b10145h6451a4603A29158a49677A57459C7670J50537i0162A10171a2299D570
$$ -210145 -86451 -14603 129158 -149677 157459 37670 188207 -90162 110171 -12299 4570
8868A04153m0476b29570F8782P1468Q9167r0034a78400O3464j1465A22552b99849
$$ 104153 63677 -229570 68782 140250 229417 139383 -178400 -114936 -126401 122552 -299849
8856A09330b69080A55061c08132D9669d3351m9983J2625e800l10469A3236a76883
$$ 109330 -269080 155061 -308132 49669 -43351 -93334 -80709 -5800 -316269 13236 -176883
$$ [...]
##END NTUPLES=NMR SPECTRUM
##END=
