
##TITLE=AC1351_CHIRS12169_6647909_QA816MgoxS
##JCAMPDX= 6.0         $$ Bruker NMR JCAMP-DX V2.0
##DATA TYPE= NMR SPECTRUM
##DATA CLASS= NTUPLES
##ORIGIN= BRUKER
##OWNER= Administrator
$$ 1.72 TOPSPIN		Version 2.1
$$ 2012-08-10 16:35:18.578 -0500  Administrator@TOPSPIN
$$ Compression mode = diff/dup
##.OBSERVE FREQUENCY= 400.02188249412
##.OBSERVE NUCLEUS= ^1H
##.ACQUISITION MODE= SIMULTANEOUS (DQD)
##.ACQUISITION SCHEME= undefined
##.AVERAGES= 64
##.DIGITISER RES= 22
##SPECTROMETER/DATA SYSTEM= spect
##.PULSE SEQUENCE= noesygpps1d.comp
##.SOLVENT NAME= COFFEE_meoh
##.SHIFT REFERENCE= INTERNAL, COFFEE_meoh, 1, 14.9624
##AUDIT TRAIL= $$ (NUMBER, WHEN, WHO, WHERE, PROCESS, VERSION, WHAT)
$$ ##TITLE= Audit trail, TOPSPIN		Version 2.1
$$ ##JCAMPDX= 5.01
$$ ##ORIGIN= Bruker BioSpin GmbH
$$ ##OWNER= Administrator
$$ $$ C:\Bruker\TOPSPIN/data/COFFEE/nmr/AC1351_CHIRS12169_6647909_QA816MgoxS/22/pdata/1/auditp.txt
$$ ##AUDIT TRAIL=  $$ (NUMBER, WHEN, WHO, WHERE, PROCESS, VERSION, WHAT)
(   1,<2012-08-10 16:35:13.515 -0500>,<Administrator>,<TOPSPIN>,<go>,<TOPSPIN 2.1>,
      <created by zg
	started at 2012-08-10 16:23:43.140 -0500,
	POWCHK enabled, PULCHK disabled,
       configuration hash MD5:
       6B 1B 68 BB D9 2E 58 E2 7F 35 AD 54 07 DF 0E 41
       data hash MD5: 64K
       9B 70 47 62 88 0E 6E 8F 3E 7D 0B 53 8A C3 01 29>)
(   2,<2012-08-10 16:35:16.562 -0500>,<Administrator>,<TOPSPIN>,<proc1d>,<TOPSPIN 2.1>,
      <Start of raw data processing
       efp LB = 0.3 FT_mod = 6 PKNL = 1 PHC0 = 0 PHC1 = 0 SI = 128K 
       data hash MD5: 128K
       9A 2B 14 75 A3 3E 06 D7 43 0D A5 35 5F 6A 9A 4B>)
(   3,<2012-08-10 16:35:17.875 -0500>,<Administrator>,<TOPSPIN>,<proc1d>,<TOPSPIN 2.1>,
      <pk PHC0 = 1.966553 PHC1 = 0 
       data hash MD5: 128K
       D0 7B D7 1E 80 55 77 3D 60 2E 10 78 AB 91 CA 6E>)
(   4,<2012-08-10 16:35:18.218 -0500>,<Administrator>,<TOPSPIN>,<proc1d>,<TOPSPIN 2.1>,
      <abs ABSG = 1 
       data hash MD5: 128K
       1A 1C 65 5D 1D 15 26 EF D9 46 C0 54 C8 22 E3 63>)
(   5,<2012-08-10 16:35:18.296 -0500>,<Administrator>,<TOPSPIN>,<proc1d>,<TOPSPIN 2.1>,
      <abs ABSG = 2 
       data hash MD5: 128K
       2D F7 FF 26 81 26 A0 AD 77 95 B5 3C 75 68 A4 A1>)
(   6,<2012-08-10 16:35:18.375 -0500>,<Administrator>,<TOPSPIN>,<proc1d>,<TOPSPIN 2.1>,
      <abs ABSG = 3 
       data hash MD5: 128K
       43 0A AF 68 76 FD CF 20 53 75 A0 10 C7 AA 4E 9F>)
(   7,<2012-08-10 16:35:18.437 -0500>,<Administrator>,<TOPSPIN>,<proc1d>,<TOPSPIN 2.1>,
      <abs ABSG = 4 
       data hash MD5: 128K
       7A 68 31 D1 89 3C 59 8E BD 07 76 7A C2 BC DC 1D>)
(   8,<2012-08-10 16:35:18.484 -0500>,<Administrator>,<TOPSPIN>,<proc1d>,<TOPSPIN 2.1>,
      <abs ABSG = 5 
       data hash MD5: 128K
       12 B5 40 D5 53 55 11 AE A2 8A 74 D8 6A 03 6F 3C>)
$$ ##END=
$$ 
$$ $$ hash MD5
$$ $$ D7 63 11 BB AB FB D1 19 E6 96 FF 9E 0C D4 C7 EF
##$RELAX= 
##$RELAX= 
##$RELAX= 
##$RELAX= 
##$RELAX= 
##$RELAX= 
##$RELAX= 
##$RELAX= 
$$ Bruker specific parameters
$$ [...]
150 150 150 150 150 150 150 150
##$TP07= 0
##$TPNAME0= <>
##$TPNAME1= <>
##$TPNAME2= <>
##$TPNAME3= <>
##$TPNAME4= <>
##$TPNAME5= <>
##$TPNAME6= <>
##$TPNAME7= <>
##$TPOAL= (0..7)
0.5 0.5 0.5 0.5 0.5 0.5 0.5 0.5
##$TPOFFS= (0..7)
0 0 0 0 0 0 0 0
##$TUNHIN= 0
##$TUNHOUT= 0
##$TUNXOUT= 0
##$USERA1= <user>
##$USERA2= <user>
##$USERA3= <user>
##$USERA4= <user>
##$USERA5= <user>
##$V9= 5
##$VALIST= <valist>
##$VCLIST= <CCCCCCCCCCCCCCC>
##$VD= 0
##$VDLIST= <DDDDDDDDDDDDDDD>
##$VPLIST= <PPPPPPPPPPPPPPP>
##$VTLIST= <TTTTTTTTTTTTTTT>
##$WBST= 1024
##$WBSW= 4
##$XGAIN= (0..3)
0 0 0 0
##$XL= 0
##$YL= 0
##$YMAX_a= 16695607
##$YMIN_a= -9678691
##$ZGOPTNS= <>
##$ZL1= 120
##$ZL2= 120
##$ZL3= 120
##$ZL4= 120
##$ABSF1= 14.9624
##$ABSF2= -5.595781
##$ABSG= 5
##$ABSL= 3
##$ALPHA= 0
##$AQORDER= 0
##$ASSFAC= 0
##$ASSFACI= 0
##$ASSFACX= 0
##$ASSWID= 0
##$AUNMP= <proc_prof1d_extract.lims>
##$AXLEFT= 0
##$AXNAME= <>
##$AXNUC= <1H>
##$AXRIGHT= 0
##$AXTYPE= 0
##$AXUNIT= <>
##$AZFE= 0.1
##$AZFW= 0.1
##$BCFW= 0
##$BC_mod= 0
##$BYTORDP= 0
##$COROFFS= 0
##$CY= 15
##$DATMOD= 1
##$DC= 0
##$DFILT= <>
##$DTYPP= 0
##$F1P= 0
##$F2P= 0
##$FCOR= 0.5
##$FTSIZE= 131072
##$FT_mod= 6
##$GAMMA= 0
##$GB= 0
##$INTBC= 1
##$INTSCL= 1
##$ISEN= 128
##$LB= 0.3
##$LEV0= 0
##$LPBIN= 0
##$MAXI= 10000
##$MC2= 0
##$MEAN= 0
##$ME_mod= 0
##$MI= 0
##$NCOEF= 0
##$NC_proc= -2
##$NLEV= 6
##$NOISF1= 0
##$NOISF2= 0
##$NSP= 0
##$NTH_PI= 0
##$NZP= 0
##$OFFSET= 14.9624
##$PC= 1
##$PHC0= 1.966553
##$PHC1= 0
##$PH_mod= 1
##$PKNL= yes
##$PPARMOD= 0
##$PPDIAG= 0
##$PPIPTYP= 0
##$PPMPNUM= 2147483647
##$PPRESOL= 1
##$PSCAL= 4
##$PSIGN= 0
##$PYNMP= <proc.py>
##$REVERSE= no
##$SF= 400.020009074999
##$SI= 131072
##$SIGF1= 0
##$SIGF2= 0
##$SINO= 400
##$SIOLD= 131072
##$SPECTYP= <>
##$SREGLST= <1H.CDCl3>
##$SSB= 0
##$STSI= 131072
##$STSR= 0
##$SW_p= 8223.68421052631
##$SYMM= 0
##$S_DEV= 0
##$TDeff= 65536
##$TDoff= 0
##$TI= <>
##$TILT= no
##$TM1= 0
##$TM2= 0
##$TOPLEV= 0
##$USERP1= <user>
##$USERP2= <user>
##$USERP3= <user>
##$USERP4= <user>
##$USERP5= <user>
##$WDW= 1
##$XDIM= 131072
##$YMAX_p= 390350482
##$YMIN_p= -12980
##$CURPLOT= <Network HP LaserJet P1505>
##$CURPRIN= <$Network HP LaserJet P1505>
##$DFORMAT= <normdp>
##$LAYOUT= <+/1D_H.xwp>
##$LFORMAT= <normlp>
##$PFORMAT= <normpl>
##$SURQMSG= 1
$$ End of Bruker specific parameters
$$ ---------------------------------
##NTUPLES= NMR SPECTRUM
##VAR_NAME=  FREQUENCY,     SPECTRUM/REAL,   SPECTRUM/IMAG
##SYMBOL=    X,             R,               I
##VAR_TYPE=  INDEPENDENT,   DEPENDENT,       DEPENDENT
##VAR_FORM=  AFFN,          ASDF,            ASDF
##VAR_DIM=   131072,        131072,          131072
##UNITS=     HZ,            ARBITRARY UNITS, ARBITRARY UNITS
##FACTOR=    0.0627417313425164, 1,          1
##FIRST=     8223.62146879497, 4364,         -61146
##LAST=      0,             6763,            -60473
##MIN=       0,             -12980,          0
##MAX=       8223.62146879497, 390350482,    0
$$ Real data points
##PAGE= N=1
##DATA TABLE= (X++(R..R)), XYDATA
$$ [...]
$$ plain form
60950 17042534 15041797 13285839 11765269 10457265 9334879 8372399 7547050 6838918
60942 6838918 6230852 5708252 5258010 4867353 4524082 4218047 3941971 3690726 3460365
60933 3460365 3248041 3052220 2872168 2707108 2556087 2418353 2293257 2179478 2074607
60924 2074607 1975762 1880711 1788414 1698754 1612114 1529294 1451445 1379458 1313317 1252280 1195849
60913 1195849 1144271 1097871 1056222 1018260 983118 950516 920442 892784 867298 843726 821943
60902 821943 802109 784527 769111 755222 742299 730501 720264 711396 703208 695576 689213 684627
60890 684627 681341 678595 676355 675066 674673 674498 674013 673127 671649 669094 665322 660944 656675 652515 647981
60875 647981 642966 637901 633013 627818 621656 614642 607855 602495 598869 596257 593777 591316 589460 588612
$$ packed form
60950A7042534k000737j755958j520570j308004j122386r62480q25349p08132
60942F838918o08066n22600m50242l90657l43271l06035k76076k51245k30361
60933C460365k12324j95821j80052j65060j51021j37734j25096j13779j04871
60924B074607r8845r5051r2297q9660q6640q2820p7849p1987o6141o1037n6431
60913A195849n1578m6400m1649l7962l5142l2602l0074k7658k5486k3572k1783
60902H21943j9834j7582j5416j3889j2923j1798j0237q868q188p632o363m586
60890F84627l286k746k240j289l93j75m85q86j478k555l772m378m269m160m534
60875F47981n015n065m888n195o162p014o787n360l626k612k480k461j856q48
$$ plain form
60861 588612 588524 588810 589584 591222 593779 597101 601334 606666 612516 617725 621938 626276 632160 639884 648807
60846 648807 658572 669378 681237 693725 706599 720000 733681 746469 756905 764330 769150 772230
60834 772230 774184 775169 775209 774702 774408 774772 775374 775396 774567 773271 771770 769863 767510 765248 763570 762225 760577
60817 760577 758446 756120 753636 750551 746562 741977 737357 732894 728397 723800 719418 715638 712536 709946
60803 709946 707804 706170 704879 703446 701520 699282 697259 695875 695407 696124 698125 701116 704692 708866 714001
60788 714001 720246 727359 735108 743486 752414 761568 770629 779506 788247 797044 806297 816253 826435 835808
60774 835808 843724 850399 856309 861535 865983 869802 873163 875979 878260 880450 882885 885026 885824 884896 882904
60759 882904 880691 878413 875732 872553 869332 866635 864532 862430 859602 855950 852191 849239 847500 846770
$$ packed form
60861E88612q8K86P74J638K557L322M233N332N850N209M213M338N884P724Q923
60846F48807R765J0806J1859J2488J2874J3401J3681J2788J0436P425M820L080
60834G72230J954R85M0n07k94L64O02K2q29j296j501j907k353k262j678j345j648
60817G60577k131k326k484l085l989m585m620m463m497m597m382l780l102k590
60803G09946k142j634j291j433j926k238k023j384m68P17K001K991L576M174N135
60788G14001O245P113P749Q378Q928R154R061Q877Q741Q797R253R956J0182R373
60774H35808P916O675N910N226M448L819L361K816K281K190K435K141P98r28j992
60759H82904k213k278k681l179l221k697k103k102k828l652l759k952j739p30
$$ plain form
60745 846770 846535 846206 845297 843696 841682 839474 836876 833564 829552 825106 820372 815465 810840 807214 805044
60730 805044 804298 804682 805774 807011 807880 808268 808385 808375 808270 808247 808485 808727 808443 807631 806999 807013 807152 806573 805271
60711 805271 804023 803173 801957 799259 794747 789094 783257 777709 772214 766163 759165 751490 743988 737483
60697 737483 732146 727422 722554 717176 711457 705722 700048 694272 688313 682377 676795 671747 667169 662861
60683 662861 658599 654203 649580 644726 639717 634771 630315 626813 624387 622715 621461 620630 620280 620038 619413
60668 619413 618640 618758 620480 623305 626147 628627 631310 634745 638828 643215 647909 653049 658330 663011 666628
60653 666628 669553 672833 677355 683106 689242 694979 700325 705798 711590 717369 722853 728145 733368 738368
60639 738368 742986 747310 751456 755386 759213 763355 768128 773429 779095 785244 791912 798681 805086 811120
$$ packed form
60745H46770k35l29r09j601k014k208k598l312m012m446m734m907m625l626k170
60730H05044p46L84J092J237Q69L88J17j0j05k3K38K42k84q12o32J4J39n79j302
60711H05271j248q50j216k698m512n653n837n548n495o051o998p675p502o505
60697G37483n337m724m868n378n719n735n674n776n959n936n582n048m578m308
60683F62861m262m396m623m854n009m946m456l502k426j672j254q31l50k42o25
60668F19413p73J18J722K825K842K480K683L435M083M387M694N140N281M681L617
60653F66628K925L280M522N751O136N737N346N473N792N779N484N292N223N000
60639G38368M618M324M146L930L827M142M773N301N666O149O668O769O405O034
$$ plain form
60625 811120 816887 822004 826006 829116 831958 834495 835910 835642 833932 831222 827633 823279 818482 813374
60611 813374 807827 802135 797241 793784 791400 789467 788174 788189 789533 791483 793521 795673 797815 799331 799718
60596 799718 798996 797126 793483 787565 780147 773206 768476 766234 765596 765714 766464 768107 770708 774086 778138
60581 778138 782869 787996 792798 796559 799118 800825 802002 802683 802935 803156 803753 804606 805178 805233 805156 805311 805314 804325
60563 804325 802051 799090 796197 793473 790414 786470 781384 775213 768295 761092 753889 746821 740345 735397
60549 735397 732747 732273 733199 735019 737955 742588 749307 758126 768815 781191 795405 811901 831051
60536 831051 853101 878695 909046 944964 985654 1028790 1071594 1111364 1145139 1169825 1183287
60525 1183287 1185152 1176386 1158560 1133823 1105095 1075548 1047726 1023301 1003466 989019 979969 975465
$$ packed form
60625H11120N767N117M002L110K842K537J415k68j710k710l589m354m797n108
60611H13374n547n692m894l457k384j933j293J5J344J950K038K152K142J516L87
60596G99718p22j870l643n918p418o941m730k242o38J18P50J643K601L378M052
60581G78138M731N127M802L761K559J707J177O81K52K21N97Q53N72N5p7J55Lr89
60563H04325k274k961k893k724l059l944n086o171o918p203p203p068o476m948
60549G35397k650m74R26J820K936M633O719Q819J0689J2376J4214J6496J9150
60536H31051K2050K5594L0351L5918M0690M3136M2804L9770L3775K4686J3462
60525A183287J865q766j7826k4737k8728k9547k7822k4425j9835j4447r050m504
$$ plain form
60513 975465 974446 976274 980515 986211 991810 996137 999268 1002154 1005525 1009576 1014706 1021883 1031924 1044871
60499 1044871 1060604 1079760 1103512 1132680 1167713 1209453 1259216 1317904 1385534 1461718 1546106
60488 1546106 1638107 1736761 1841484 1953126 2074364 2209321 2362849 2539873 2745061 2982499
60478 2982499 3254404 3558455 3885214 4217796 4534084 4809935 5022292 5152338 5188533 5128532
60468 5128532 4979424 4756560 4480911 4174915 3858274 3545893 3248147 2971625 2719361
60459 2719361 2491607 2287500 2106107 1946004 1804754 1679639 1568661 1470419 1383375 1305875
60449 1305875 1236783 1175582 1121807 1074609 1032844 995402 961551 931080 903935 879610 857083
60438 857083 835398 814079 793006 772332 752646 734757 718983 704927 692021 679901 668162
$$ packed form
60513I75465j019J828M241N696N599M327L131K886L371M051N130P177J0041J2947
60499A044871J5733J9156K3752K9168L5033M1740M9763N8688O7630P6184Q4388
60488A546106R2001R8654J04723J11642J21238J34957J53528J77024K05188K37438
60478B982499K71905L04051L26759L32582L16288K75851K12357J30046L6195o0001
60468E128532j49108k22864k75649l05996l16641l12381k97746k76522k52264
60459B719361k27754k04107j81393j60103j41250j25115j10978r8242q7044p7500
60449A305875o9092o1201n3775m7198m1765l7442l3851l0471k7145k4325k2527
60438H57083k1685k1319k1073k0674j9686j7889j5774j4056j2906j2120j1739
$$ plain form
60427 668162 656380 644757 634259 625724 619118 613876 609456 605225 600460 595133 590329 587209 585717
60414 585717 584853 583996 583321 583031 582868 582592 582531 583326 585252 587896 590607 593212 596132 599604 603058 605800
60398 605800 608136 611149 615251 619721 623890 628018 632562 637301 641749 645849 649664 652859 655126 656676
60384 656676 657684 657723 656386 654071 651478 648721 645653 642683 640462 638983 637792 636873 636595 636855 637026 636658
60368 636658 635677 634042 631904 629929 628822 628638 629160 630657 633458 636981 640147 642709 645309 648281 651406
60353 651406 654873 659385 664964 670579 675447 679978 684996 690768 697215 704345 711872 718974 725136 730932
60339 730932 737405 744843 752589 759854 766314 771967 776788 780670 783740 786718 790761 796614 804023 812339
60325 812339 821499 831880 843256 854628 865118 874275 881249 884519 883145 877841 870225 861298 851224
$$ packed form
60427F68162j1782j1623j0498q535o606n242m420m231m765n327m804l120j492
60414E85717q64q57o75k90j63k76o1P95J926K644K711K605K920L472L454K742
60398F05800K336L013M102M470M169M128M544M739M448M100L815L195K267J550
60384F56676J008L9j337k315k593k757l068k970k221j479j191r19k78K60J71l68
60368F36658r81j635k138j975j107j84N22J497K801L523L166K562K600K972L125
60353F51406L467M512N579N615M868M531N018N772O447P130P527P102O162N796
60339G30932O473P438P746P265O460N653M821L882L070K978M043N853P409Q316
60325H12339R160J0381J1376J1372J0490R157O974L270j374n304p616q927j0074
$$ plain form
60312 851224 840323 829589 820090 812231 805714 799938 794325 788503 782475 776675 771749 768063 765356 763031
60298 763031 760887 759395 759106 760000 761580 763365 764997 766160 766895 767891 770027 773550 777956 782540 786766
60283 786766 790389 793678 797332 801660 806048 809739 812915 816280 819815 822865 825533 828980 833994 839986
60269 839986 845859 851258 856581 862385 869315 878151 889271 902222 916186 930773 946232 963213 982484
60256 982484 1004581 1029436 1056610 1085958 1117817 1152542 1190321 1231534 1276781 1326433 1380684
60245 1380684 1440225 1506246 1579482 1659756 1746705 1840300 1940291 2045772 2155828 2269989 2387406
60234 2387406 2505991 2623049 2736462 2844677 2945865 3037889 3119080 3188394 3244789 3287049
60224 3287049 3314468 3327435 3327213 3315329 3293227 3262374 3224611 3182287 3137846 3093262 3050201 3010722
$$ packed form
60312H51224j0901j0734r499p859o517n776n613n822o028n800m926l686k707k325
60298G63031k144j492k89Q94J580J785J632J163P35R96K136L523M406M584M226
60283G86766L623L289L654M328M388L691L176L365L535L050K668L447N014N992
60269H39986N873N399N323N804O930Q836J1120J2951J3964J4587J5459J6981J9271
60256I82484K2097K4855K7174K9348L1859L4725L7779M1213M5247M9652N4251
60245A380684N9541O6021P3236Q0274Q6949R3595R9991J05481J10056J14161J17417
60234B387406J18585J17058J13413J08215J01188R2024Q1191O9314N6395M2260
60224C287049K7419J2967k22j1884k2102l0853l7763m2324m4441m4584m3061l9479
$$ plain form
60212 3010722 2977365 2952296 2936658 2930964 2935710 2951328 2977969 3015798 3065331 3127149 3201445 3287936
60200 3287936 3385786 3493291 3607979 3727349 3849130 3970518 4087718 4196862 4295105 4380440
60190 4380440 4450903 4504696 4540831 4558894 4558370 4538966 4501662 4448800 4383039 4306732 4222393 4133143
60178 4133143 4042414 3953465 3869234 3792188 3724147 3666564 3621044 3589257 3572225 3570066 3582488
60167 3582488 3609189 3649642 3702873 3767556 3841868 3922916 4006656 4088841 4166158 4236408 4297828
60156 4297828 4348579 4386951 4411931 4423580 4422931 4411628 4391720 4365727 4336593 4307307 4280625 4259258
60144 4259258 4246022 4243317 4252453 4273897 4308190 4356206 4418428 4494624 4584755 4690060 4812795
60133 4812795 4955117 5118614 5304860 5515771 5752999 6016991 6306708 6619997 6954016
$$ packed form
60212C010722l3357k5069j5638n694M746J5618K6641L7829M9533O1818P4296Q6491
60200C287936R7850J07505J14688J19370J21781J21388J17200J09144R8243Q5335
60190D380440P0463N3793L6135J8063n24j9404l7304n2862o5761p6307q4339q9250
60178D133143r0729q8949q4231p7046o8041n7583m5520l1787j7032k159J2422
60167C582488K6701M0453N3231O4683P4312Q1048Q3740Q2185P7317P0250O1420
60156D297828N0751L8372K4980J1649o49j1303j9908k5993k9134k9286k6682k1367
60144D259258j3236k705R136K1444L4293M8016O2222P6196R0131J05305J22735
60133D812795J42322J63497J86246K10911K37228K63992K89717L13289L34019
$$ plain form
60124 6954016 7305309 7669545 8041174 8413501 8779499 9132806 9467804 9778683 10058860
60115 10058860 10301782 10502236 10656591 10761992 10815907 10816599 10763622 10657858 10501696 10299561
60105 10299561 10057916 9784368 9486946 9174272 8855688 8540327 8235937 7948785 7684294
60096 7684294 7447071 7240351 7066029 6925365 6819279 6747822 6709828 6703281 6725791 6774492
60086 6774492 6845586 6934125 7034292 7140069 7245895 7346699 7437401 7512859 7568859 7603075
60076 7603075 7614864 7604252 7571477 7517236 7442806 7349780 7239873 7114886 6976551 6826522
60066 6826522 6666770 6499709 6327694 6152752 5977272 5804464 5637396 5477882 5327065
60057 5327065 5186861 5059850 4947886 4851760 4772264 4710497 4666908 4641100 4632963 4643092 4671617
$$ packed form
60124F954016L51293L64236L71629L72327L65998L53307L34998L10879K80177
60115A0058860K42922K00454J54355J05401N3915O92n2977j05764j56162k02135
60105A0299561k41645k73548k97422l12674l18584l15361l04390k87152k64491
60096G684294k37223k06720j74322j40664j06086p1457l7994o547K2510M8701
60086F774492P1094Q8539J00167J05777J05826J00804R0702P5458N6000L4216
60076G603075J1789j0612l2775n4241p4430r3026j09907j24987j38335j50029
60066F826522j59752j67061j72015j74942j75480j72808j67068j59514j50817
60057E327065j40204j27011j11964r6126p9496o1767m3589k5808q137J0129K8525
$$ plain form
60046 4671617 4717575 4780018 4858847 4953571 5061704 5179064 5301272 5424264 5543735 5654970
60036 5654970 5753376 5834978 5896691 5936579 5953718 5947599 5917835 5864546 5788719 5692133 5577499
60025 5577499 5448848 5311090 5168656 5024893 4882872 4746039 4617568 4499667 4393996
60016 4393996 4302106 4224854 4162007 4113205 4078960 4060147 4057135 4070289 4100905 4150622 4219982
60005 4219982 4308385 4415340 4540906 4684713 4845109 5019241 5203163 5391547 5577880 5755573
59995 5755573 5919243 6065191 6190905 6294069 6371983 6422164 6443525 6436565 6402236 6341250 6254947
59984 6254947 6146377 6020019 5880864 5734234 5585882 5441287 5304822 5180014 5070156
59975 5070156 4977965 4904901 4851582 4818680 4806653 4814747 4841075 4883671 4940714 5009836 5088188
$$ packed form
60046D671617M5958O2443P8829R4724J08133J17360J22208J22992J19471J11235
60036E654970R8406Q1602O1713L9888J7139o119k9764n3289p5827r6586j14634
60025E577499j28651j37758j42434j43763j42021j36833j28471j17901j05671
60016D393996r1890p7252o2847m8802l4245j8813l012J3154L0616M9717O9360
60005D219982Q8403J06955J25566J43807J60396J74132J83922J88384J86333J77693
59995E755573J63670J45948J25714J03164P7914N0181K1361o960l4329o0986q6303
59984F254947j08570j26358j39155j46630j48352j44595j36465j24808j09858
59975E070156r2191p3064n3319l2902j2027Q094K6328M2596N7043O9122P8352
$$ plain form
59964 5088188 5173565 5264811 5360788 5459415 5557986 5653981 5745311 5830154 5906905 5974179 6030852
59953 6030852 6076369 6111000 6135507 6150579 6157007 6156392 6151256 6144376 6138493 6136833 6143412 6162488 6197893
59940 6197893 6253110 6331700 6437248 6572909 6741269 6944624 7185062 7463839 7780589 8133291
59930 8133291 8518912 8933373 9370221 9819418 10267875 10701035 11103463 11458573 11749668
59921 11749668 11962718 12088600 12123370 12067920 11928182 11714586 11439884 11117122 10759454 10380447
59911 10380447 9992989 9607772 9233241 8876464 8543168 8237267 7961294 7717301 7506867
59902 7506867 7330706 7189109 7082526 7011009 6973498 6968578 6995674 7054495 7143530 7260037 7401277
59891 7401277 7564398 7744763 7935190 8126933 8310590 8476107 8613157 8712386 8766107 8768290
$$ packed form
59964E088188Q5377R1246R5977R8627R8571R5995R1330Q4843P6751O7274N6673
59953F030852M5517L4631K4507J5072O428o15n136o880n883j660O579J9076L5405
59940F197893N5217P8590J05548J35661J68360K03355K40438K78777L16750L52702
59930H133291L85621M14461M36848M49197M48457M33160M02428L55110K91095
59921A1749668K13050J25882L4770n5450j39738k13596k74702l22762l57668l79007
59911A0380447l87458l85217l74531l56777l33296l05901k75973k43993k10434
59902G506867j76161j41597j06583p1517l7511m920K7096N8821Q9035J16507J41240
59891G401277J63121J80365J90427J91743J83657J65517J37050R9229N3721K183
$$ plain form
59881 8768290 8715263 8607203 8448352 8245303 8005323 7736077 7445784 7142765 6834971 6529790
59871 6529790 6233391 5949757 5680929 5428601 5195020 4982127 4790459 4619323 4467557
59862 4467557 4333791 4216452 4114041 4025077 3947442 3878088 3813789 3752097 3691554 3631431 3571630
59851 3571630 3512678 3455607 3401830 3352888 3309844 3272937 3242134 3217751 3199857 3186977 3176109
59840 3176109 3164196 3149062 3128948 3102122 3067603 3025910 2978681 2927878 2875523 2823641 2773833
59829 2773833 2727043 2684034 2645900 2613889 2588899 2571370 2561460 2559062 2563624 2574007 2588606 2605979
59817 2605979 2625750 2648815 2676445 2709451 2748480 2794549 2848330 2908892 2973738 3040066 3105408
59806 3105408 3167235 3222994 3271011 3310848 3342588 3366281 3382278 3391545 3395379 3395187 3392687 3389878
$$ packed form
59881H768290n3027j08060j58851k03049k39980k69246k90293l03019l07794l05181
59871F529790k96399k83634k68828k52328k33581k12893j91668j71136j51766
59862D467557j33766j17339j02411q8964p7635o9354o4299o1692o0543o0123n9801
59851C571630n8952n7071n3777m8942m3044l6907l0803k4383j7894j2880j0868
59840C176109j1913j5134k0114k6826l4519m1693m7229n0803n2355n1882m9808
59829B773833m6790m3009l8134l2011k4990j7529r910k398M562J0383J4599J7373
59817B605979J9771K3065K7630L3006L9029M6069N3781O0562O4846O6328O5342
59806C105408O1827N5759M8017L9837L1740K3693J5997R267L834j92k500k809
$$ plain form
59794 3389878 3388685 3390907 3398400 3412781 3435055 3466157 3507816 3562212 3630886 3714792 3815481 3935421
59782 3935421 4077070 4242679 4435387 4659564 4919353 5217210 5553858 5928305 6336255
59773 6336255 6767594 7204670 7622271 7990046 8278026 8463801 8537727 8503715 8376490 8177458
59763 8177458 7930298 7657027 7375616 7099351 6836927 6592937 6369329 6167263 5987721
59754 5987721 5830771 5695332 5580112 5484275 5407106 5347840 5306042 5281475 5273400 5280905 5304060
59743 5304060 5343784 5400205 5472311 5559831 5664440 5788232 5931882 6095210 6278882 6484601
59733 6484601 6714187 6969479 7252922 7567377 7915460 8299550 8721994 9184504 9687371
59724 9687371 10229524 10808813 11421402 12060866 12718139 13382102 14040253 14680022 15290904
$$ packed form
59794C389878j193K222P493J4381K2274L1102M1659N4396O8674Q3906J00689J19940
59782C935421J41649J65609J92708K24177K59789K97857L36648L74447M07950
59773F336255M31339M37076M17601L67775K87980J85775P3926l4012j27225j99032
59763H177458k47160k73271k81411k76265k62424k43990k23608k02066j79542
59754E987721j56950j35439j15220r5837p7169n9266m1798k4567q075P505K3155
59743E304060L9724N6421P2106Q7520J04609J23792J43650J63328J83672K05719
59733F484601K29586K55292K83443L14455L48083L84090M22444M62510N02867
59724I687371N42153N79289O12589O39464O57273O63963O58151O39769O10882
$$ plain form
59715 15290904 15866113 16402888 16902500 17370790 17817996 18256842 18700213 19159905 19645773
59706 19645773 20164271 20717263 21302164 21912393 22537005 23160536 23764271 24328146 24832135
59697 24832135 25257873 25591193 25824023 25954256 25984973 25924615 25787035 25589803 25351917 25092885
59687 25092885 24832364 24588660 24377012 24209808 24098117 24052169 24080662 24190653 24388325 24679317
59677 24679317 25068489 25559912 26156602 26859015 27663206 28560057 29534790 30565100 31619038
59668 31619038 32655267 33625814 34479233 35163915 35633159 35851744 35801158 35481577 34911160
59659 34911160 34123456 33162871 32078995 30921576 29736816 28564501 27436151 26374752
59651 26374752 25395043 24502461 23691095 22943363 22232817 21528998 20802959 20032988 19209299
$$ packed form
59715A5290904N75209N36775M99612M68290M47206M38846M43371M59692M85868
59706A9645773N18498N52992N84901O10229O24612O23531O03735N63875N03989
59697B4832135M25738L33320K32830J30233L0717o0358j37580j97232k37886k59032
59687B5092885k60521k43704k11648j67204j11691m5948K8493J09991J97672K90992
59677B4679317L89172M91423N96690P02413Q04191Q96851R74733J030310J053938
59668C1619038J036229R70547Q53419O84682M69244K18585n0586l19581n70417
59659C4911160p87704r60585j083876j157419j184760j172315j128350j061399
59651B6374752r79709q92582q11366p47732p10546p03819p26039p69971q23689
$$ plain form
59642 19209299 18335415 17425460 16499197 15577326 14678232 13816239 13001203 12238853 11531370
59633 11531370 10878246 10277568 9727002 9223777 8764381 8345043 7962607 7614643 7298761
59624 7298761 7012264 6752458 6516960 6303823 6111705 5939800 5787131 5651887 5531747
59615 5531747 5424723 5329327 5244028 5166857 5095400 5026845 4958266 4887294 4812445 4732604 4646678
59604 4646678 4554268 4456340 4354587 4250383 4144927 4040011 3937720 3839381 3745601 3657343
59594 3657343 3576103 3502785 3437104 3378450 3326822 3282612 3245923 3216521 3194238 3179099 3171028
59583 3171028 3169483 3173353 3181334 3192571 3206832 3223911 3243091 3263408 3284217 3305203 3326079 3346621
59571 3346621 3366906 3387338 3408735 3432588 3460806 3494827 3535254 3582669 3638298 3703360 3778152
$$ packed form
59642A9209299q73884r09955r26263r21871q99094q61993q15036p62350p07483
59633A1531370o53124o00678n50566n03225m59396m19338l82436l47964l15882
59624G298761k86497k59806k35498k13137j92118j71905j52669j35244j20140
59615E531747j07024r5396q5299p7171p1457o8555o8579p0972p4849p9841q5926
59604D646678r2410r7928j01753j04204j05456j04916j02291r8339r3780q8258
59594C657343q1240p3318o5681n8654n1628m4210l6689k9402k2283j5139q071
59583C171028j545L870P981J1237J4261J7079J9180K0317K0809K0986K0876K0542
59571C346621K0285K0432K1397K3853K8218L4021M0427M7415N5629O5062P4792
$$ plain form
59560 3778152 3862358 3955987 4059692 4174609 4302411 4444991 4603419 4777550 4967216 5173259
59550 5173259 5396685 5637255 5893609 6164164 6446813 6738144 7034026 7330720 7624431
59541 7624431 7910229 8182976 8439663 8680009 8904613 9113212 9304257 9474808 9620823
59532 9620823 9739152 9830111 9897699 9947342 9984361 10014418 10043711 10077850 10121355 10178558 10253691
59521 10253691 10349033 10463436 10592981 10732020 10872820 11005183 11117754 11199825 11241858 11235573
59511 11235573 11175015 11057712 10884269 10657186 10380771 10061875 9709575 9333593 8943001
59502 8943001 8546060 8150405 7762904 7389379 7034521 6701888 6393784 6111104 5853531
59493 5853531 5620294 5410998 5225539 5063043 4921364 4798197 4692544 4604516 4533873 4479462
$$ packed form
59560C778152Q4206R3629J03705J14917J27802J42580J58428J74131J89666K06043
59550E173259K23426K40570K56354K70555K82649K91331K95882K96694K93711
59541G624431K85798K72747K56687K40346K24604K08599J91045J70551J46015
59532I620823J18329R0959O7588M9643L7019L0057K9293L4139M3505N7203P5133
59521A0253691R5342J14403J29545J39039J40800J32363J12571Q2071M2033o285
59511A1235573o0558j17303j73443k27083k76415l18896l52300l75982l90592
59502H943001l96941l95655l87501l73525l54858l32633l08104k82680k57573
59493E853531k33237k09296j85459j62496j41679j23167j05653q8028p0643n4411
$$ plain form
59483 4479462 4440198 4415989 4407534 4415686 4441032 4483528 4542426 4617184 4708555 4818259 4947457
59472 4947457 5096191 5264313 5451922 5658313 5881087 6116827 6361964 6612205 6861381
59463 6861381 7101563 7324266 7521246 7684513 7806500 7880885 7903556 7873201 7791394 7662167
59453 7662167 7491286 7285536 7052207 6798627 6531819 6258385 5984395 5714941 5453722
59444 5453722 5203176 4964956 4740181 4529463 4333039 4150918 3982834 3828429 3687667
59435 3687667 3560649 3446646 3343813 3250479 3166392 3092066 3027253 2970817 2921844 2879960 2844624
59424 2844624 2815011 2790752 2772093 2759190 2751796 2749618 2752316 2759152 2769314 2782671 2799705 2820895
59412 2820895 2846780 2878134 2914678 2953332 2988861 3016981 3036709 3050125 3061066 3074087 3093212
$$ packed form
59483D479462l9264k4209q455Q152K5346M2496N8898P4758R1371J09704J29198
59472D947457J48734J68122J87609K06391K22774K35740K45137K50241K49176
59463F861381K40182K22703J96980J63267J21987P4385K2671l0355q1807j29227
59453G662167j70881k05750k33329k53580k66808k73434k73990k69454k61219
59444E453722k50546k38220k24775k10718j96424j82121j68084j54405j40762
59435C687667j27018j14003j02833r3334q4087p4326o4813n6436m8973m1884l5336
59424B844624k9613k4259j8659j2903p394k178K698O836J0162J3357J7034K1190
59412B820895K5885L1354L6544L8654L5529K8120J9728J3416J0941J3021J9125
$$ plain form
59401 3093212 3120730 3157628 3205326 3265826 3339433 3423166 3512362 3603805 3697391 3795864 3903762
59390 3903762 4026047 4166764 4328747 4514424 4726364 4966877 5237833 5541257 5879656
59381 5879656 6255371 6669851 7123353 7614327 8138607 8689579 9259113 9837641 10413514
59372 10413514 10973985 11508085 12008487 12470646 12891377 13269108 13604719 13901073 14161614
59363 14161614 14389320 14585981 14751607 14884762 14983602 15045967 15068406 15046400 14976559 14858274
59353 14858274 14693216 14484582 14237804 13960892 13662434 13349038 13024922 12692969 12354888
59344 12354888 12010591 11658551 11297162 10925669 10544495 10155546 9762118 9368108 8977525
59335 8977525 8594861 8225014 7871916 7537620 7223303 6930530 6660725 6413977 6189398
$$ packed form
59401C093212K7518L6898M7698O0500P3607Q3733Q9196R1443R3586R8473J07898
59390C903762J22285J40717J61983J85677K11940K40513K70956L03424L38399
59381E879656L75715M14480M53502M90974N24280N50972N69534N78528N75873
59372A0413514N60471N34100N00402M62159M20731L77731L35611K96354K60541
59363A4161614K27706J96661J65626J33155R8840O2365K2439k2006o9841j18285
59353A4858274j65058k08634k46778k76912k98458l13396l24116l31953l38081
59344A2354888l44297l52040l61389l71493l81174l88949l93428l94010l90583
59335H977525l82664l69847l53098l34296l14317k92773k69805k46748k24579
$$ plain form
59326 6189398 5986462 5805083 5644490 5502895 5378322 5269244 5174550 5093450 5025325 4969179
59316 4969179 4923404 4886478 4857604 4836195 4821029 4810456 4803077 4797710 4793079 4788172 4782546 4775657
59304 4775657 4766228 4753022 4735935 4715585 4692166 4665563 4636463 4606453 4576966 4548846 4522990
59293 4522990 4500644 4482913 4470588 4464716 4466867 4478490 4500277 4532282 4574570 4627703 4692726 4770628
59281 4770628 4861821 4966317 5084325 5216083 5360865 5516677 5681292 5853050 6030161 6209607
59271 6209607 6387130 6557662 6714971 6851389 6959111 7032469 7069211 7070306 7039242 6981140
59261 6981140 6901490 6805081 6695895 6577520 6453162 6325453 6196581 6068385 5942038 5817992
59251 5817992 5696632 5578734 5464995 5355639 5250961 5151857 5059368 4974144 4896836 4828510
$$ packed form
59326F189398k02936j81379j60593j41595j24573j09078r4694q1100o8125n6146
59316D969179m5775l6926k8874k1409j5166j0573p379n367m631m907n626o889
59304D775657r429j3206j7087k0350k3419k6603k9100l0010k9487k8120k5856
59293D522990k2346j7731j2325n872K151J1623K1787L2005M2288N3133O5023P7902
59281D770628R1193J04496J18008J31758J44782J55812J64615J71758J77111J79446
59271F209607J77523J70532J57309J36418J07722P3358L6742J095l1064n8102
59261F981140p9650r6409j09186j18375j24358j27709j28872j28196j26347j24046
59251E817992j21360j17898j13739j09356j04678r9104r2489q5224p7308o8326
$$ plain form
59241 4828510 4770040 4721564 4683348 4656942 4644840 4649127 4670969 4711076 4770146 4849233 4950308
59230 4950308 5076186 5229314 5410998 5622315 5865076 6140762 6448584 6785273 7146282
59221 7146282 7525890 7915871 8304952 8679908 9026785 9331334 9579643 9759623 9862550
59212 9862550 9883799 9822781 9682370 9468340 9189366 8857282 8486160 8090001 7681038 7270031
59202 7270031 6866911 6479906 6114279 5772752 5456950 5167749 4904673 4666105 4450241
59193 4450241 4255318 4079310 3920276 3776959 3648300 3532546 3427669 3332412 3246078 3167527
59183 3167527 3095463 3029666 2970819 2918951 2873047 2832377 2797152 2767446 2742435 2721333 2704403
59172 2704403 2692397 2685381 2682639 2683559 2688265 2697529 2712177 2732349 2757299 2786052 2818198 2853739
$$ packed form
59241D828510n8470m8476l8216k6406j2102M287K1842M0107N9070P9087J01075
59230D950308J25878J53128J81684K11317K42761K75686L07822L36689L61009
59221G146282L79608L89981L89081L74956L46877L04549K48309J79980J02927
59212I862550K1249o1018j40411k14030k78974l32084l71122l96159m08963m11007
59202G270031m03120l87005l65627l41527l15802k89201k63076k38568k15864
59193D450241j94923j76008j59034j43317j28659j15754j04877r5257q6334p8551
59183C167527p2064o5797n8847n1868m5904m0670l5225k9706k5011k1102j6930
59172B704403j2006p016k742R20M706R264J4648K0172K4950K8753L2146L5541
$$ plain form
59160 2853739 2892472 2934031 2978400 3025721 3075548 3126798 3178434 3229729 3279838 3327679 3372265
59149 3372265 3412724 3448041 3477366 3500605 3518140 3529912 3535313 3534159 3527211 3515580 3500043 3481166
59137 3481166 3459642 3436246 3411727 3387036 3363545 3342867 3326338 3314573 3307561 3305475 3309423 3320971
59125 3320971 3340790 3368348 3403310 3446707 3500219 3564762 3640301 3726629 3823706 3931603 4050714
59114 4050714 4181722 4324937 4480173 4647782 4829048 5024691 5233533 5453524 5683314
59105 5683314 5921447 6164324 6406257 6641326 6863749 7066321 7239993 7375736 7466407 7507163
59095 7507163 7495620 7432425 7321012 7166392 6974557 6752754 6508969 6250394 5982781 5711288
59085 5711288 5440957 5176038 4919606 4674205 4442035 4224153 4020266 3829823 3652746
$$ packed form
59160B853739L8733M1559M4369M7321M9827N1250N1636N1295N0109M7841M4586
59149C372265M0459L5317K9325K3239J7535J1772N401j154o948j1631j5537j8877
59137C481166k1524k3396k4519k4691k3491k0678j6529j1765p012k086L948J1548
59125C320971J9819K7558L4962M3397N3512O4543P5539Q6328R7077J07897J19111
59114D050714J31008J43215J55236J67609J81266J95643K08842K19991K29790
59105E683314K38133K42877K41933K35069K22423K02572J73672J35743R0671M0756
59095G507163j1543o3195j11413j54620j91835k21803k43785k58575k67613k71493
59085E711288k70331k64919k56432k45401k32170k17882k03887j90443j77077
$$ plain form
59076 3652746 3488710 3336511 3194772 3062808 2940347 2826901 2721955 2625390 2537079 2456214
59066 2456214 2381498 2312115 2248268 2190675 2139494 2093801 2052314 2014732 1982041 1955293 1934486
59055 1934486 1918979 1908381 1902248 1899268 1897554 1895648 1892629 1887379 1878550 1865184 1846751 1822779 1793200
59042 1793200 1758994 1721848 1683324 1644945 1608540 1575432 1545488 1518010 1493373 1472604 1455560
59031 1455560 1440966 1428508 1419444 1414705 1413651 1415293 1419502 1426134 1433961 1441410 1447757 1452834 1456166
59018 1456166 1457256 1456347 1454163 1451087 1447176 1442815 1438842 1436115 1435210 1436431 1439864 1445498 1453392 1463535
59004 1463535 1475487 1488266 1500628 1511401 1519813 1525745 1529418 1530606 1528678 1523750 1517166 1510163 1502702
58991 1502702 1494487 1486543 1480535 1476845 1474538 1473109 1472982 1474268 1476361 1479025 1482841 1488292 1495394 1504356
$$ packed form
59076C652746j64036j52199j41739j31964j22461j13446j04946r6565q8311q0865
59066B456214p4716o9383o3847n7593n1181m5693m1487l7582l2691k6748k0807
59055A934486j5507j0598o133k980j714j906l019n250q829j3366j8433k3972k9579
59042A793200l4206l7146l8524l8379l6405l3108k9944k7478k4637k0769j7044
59031A455560j4594j2458r064m739j054J642M209O632P827P449O347N077L332
59018A456166J090r09k184l076l911m361l973k727r05J221L433N634P894J0143
59004A463535J1952J2779J2362J0773Q412N932L673J188j928m928o584p003p461
58991A502702q215p944o008l690k307j429j27J286K093K664L816N451P102Q962
$$ plain form
58977 1504356 1515486 1528218 1541410 1554956 1570096 1587777 1607727 1629522 1653408 1679538 1707404
58966 1707404 1736732 1768154 1802361 1839211 1878134 1918726 1960499 2002688 2044739 2086437 2127280
58955 2127280 2166442 2203714 2239842 2275596 2311084 2346232 2381349 2417089 2454496 2495124 2540334
58944 2540334 2590426 2645169 2705115 2771336 2843963 2922226 3006211 3097399 3197201 3306089 3424452
58933 3424452 3552997 3691882 3840775 4000529 4173747 4363046 4569675 4794422 5038816
58924 5038816 5304741 5593810 5907847 6249302 6620684 7024270 7462640 7938473 8453386
58915 8453386 9007891 9602682 10238586 10914504 11626212 12367287 13129392 13900564 14664292
58906 14664292 15401260 16091141 16712396 17242323 17659708 17948140 18097364 18103469 17969435 17704990
$$ packed form
58977A504356J1130J2732J3192J3546J5140J7681J9950K1795K3886K6130K7866
58966A707404K9328L1422L4207L6850L8923M0592M1773M2189M2051M1698M0843
58955B127280L9162L7272L6128L5754L5488L5148L5117L5740L7407M0628M5210
58944B540334N0092N4743N9946O6221P2627P8263Q3985R1188R9802J08888J18363
58933C424452J28545J38885J48893J59754J73218J89299K06629K24747K44394
58924E038816K65925K89069L14037L41455L71382M03586M38370M75833N14913
58915H453386N54505N94791O35904O75918P11708P41075P62105P71172P63728
58906A4664292P36968O89881O21255N29927M17385K88432J49224O105j34034k64445
$$ plain form
58896 17704990 17324840 16846828 16291078 15678532 15028384 14356907 13678647 13007092 12353155
58887 12353155 11724120 11125024 10559959 10031251 9538792 9081581 8659083 8270209 7912184
58878 7912184 7581619 7275628 6990756 6722175 6465654 6219641 5984214 5758931 5543164
58869 5543164 5337551 5143314 4960540 4788493 4627122 4476889 4337528 4208228 4088648
58860 4088648 3978667 3877715 3785434 3702295 3628296 3561741 3500709 3445215 3396524 3354882 3319415
58849 3319415 3289903 3267095 3251329 3242107 3238957 3241765 3250501 3265589 3288111 3318603 3356126 3399544
58837 3399544 3449129 3505845 3569786 3640729 3719556 3807546 3904667 4010217 4124966 4251225 4390897
58826 4390897 4544799 4713676 4898468 5099693 5318029 5555619 5815650 6100712 6412690
$$ packed form
58896A7704990l80150m78012n55750o12546o50148o71477o78260o71555o53937
58887A2353155o29035n99096n65065n28708m92459m57211m22498l88874l58025
58878G912184l30565l05991k84872k68581k56521k46013k35427k25283k15767
58869E543164k05613j94237j82774j72047j61371j50233j39361j29300j19580
58860D088648j09981j00952r2281q3139p3999o6555o1032n5494m8691m1642l5467
58849C319415k9512k2808j5766r222l150K808Q736J5088K2522L0492L7523M3418
58837C399544M9585N6716O3941P0943P8827Q7990R7121J05550J14749J26259J39672
58826D390897J53902J68877J84792K01225K18336K37590K60031K85062L11978
$$ plain form
58817 6412690 6754028 7127729 7536145 7980997 8464439 8988740 9554851 10162270 10809840
58808 10809840 11494830 12210764 12947121 13690933 14427172 15137448 15800071 16392385 16892777
58799 16892777 17281356 17541381 17662101 17640588 17481246 17194483 16795599 16303103 15736529
58790 15736529 15115257 14458268 13783216 13104835 12434436 11780609 11149551 10544880 9968358
58781 9968358 9421222 8904369 8417673 7960311 7531814 7131893 6759259 6411602 6086848
58772 6086848 5783594 5500414 5235718 4988325 4757174 4540420 4335811 4142154 3959639
58763 3959639 3788680 3629212 3480981 3343547 3215879 3096731 2985464 2881888 2785532 2695879
58753 2695879 2613064 2537341 2468056 2404033 2344725 2290030 2239339 2191948 2148161 2108753 2073448
$$ packed form
58817F412690L41338L73701M08416M44852M83442N24301N66111O07419O47570
58808A0809840O84990P15934P36357P43812P36239P10276O62623N92314N00392
58799A6892777L88579K60025J20720k1513j59342k86763l98884m92496n66574
58790A5736529o21272o56989o75052o78381o70399o53827o31058o04671n76522
58781I968358n47136n16853m86696m57362m28497l99921l72634l47657l24754
58772F086848l03254k83180k64696k47393k31151k16754k04609j93657j82515
58763C959639j70959j59468j48231j37434j27668j19148j11267j03576r6356q9653
58753B695879q2815p5723o9285o4023n9308n4695n0691m7391m3787l9408l5305
$$ plain form
58742 2073448 2041168 2011605 1985133 1961186 1938207 1915389 1893156 1871648 1850078 1828034 1806235
58731 1806235 1785451 1765551 1745972 1726216 1705617 1683554 1660269 1636676 1613080 1588837 1563403
58720 1563403 1536852 1509202 1480138 1449708 1418561 1387339 1356509 1326847 1299205 1273672 1249666
58709 1249666 1226883 1205426 1185099 1165460 1146612 1129114 1113109 1098278 1084521 1071865 1059899
58698 1059899 1048215 1037182 1027322 1018153 1008760 999253 990470 982447 974478 966600 959561 953180 946158
58685 946158 937835 928994 920559 912561 904706 897007 889546 882411 875955 870333 864943 859237 853964 850455
58671 850455 848819 847948 847179 846689 846354 845599 844511 843853 843877 844278 845257 847281 849768 851339 851489 850733 849212
58654 849212 846619 843602 841633 841297 842128 844228 848355 854175 860181 865888 872571 881309 891803 903665
$$ packed form
58742B073448l2280k9563k6472k3947k2979k2818k2233k1508k1570k2044k1799
58731A806235k0784j9900j9579j9756k0599k2063k3285k3593k3596k4243k5434
58720A563403k6551k7650k9064l0430l1147l1222l0830k9662k7642k5533k4006
58709A249666k2783k1457k0327j9639j8848j7498j6005j4831j3757j2656j1966
58698A059899j1684j1033r860r169r393r507q783q023p969p878p039o381p022
58685I46158q323q841q435p998p855p699p461p135o456n622n390n706n273l509
58671H50455j636q71p69m90l35p55j088o58K4M01R79K024K487J571J50p56j521
58654H49212k593l017j969l36Q31K100M127N820O006N707O683Q738J0494J1862
$$ plain form
58640 903665 917394 933390 951334 971140 993254 1017509 1043031 1069869 1099360 1132322 1168231
58629 1168231 1206835 1249267 1296748 1349329 1406619 1468793 1536404 1610320 1692268 1784275 1887096
58618 1887096 2000338 2124461 2261372 2412789 2579452 2762341 2962842 3180704 3412803
58609 3412803 3654225 3898929 4138643 4362742 4560534 4723046 4842713 4913496 4932780 4902255
58599 4902255 4826304 4710654 4562882 4392133 4206723 4012748 3815508 3620650 3432759 3254094
58589 3254094 3085767 2928988 2784178 2650279 2526313 2412808 2310645 2219506 2138417 2066854
58579 2066854 2004253 1949324 1900816 1858217 1820888 1787403 1756476 1727657 1700428 1673676 1646811
58568 1646811 1620342 1594599 1569013 1543439 1519010 1496705 1476064 1456173 1436814 1417761 1397974
$$ packed form
58640I03665J3729J5996J7944J9806K2114K4255K5522K6838K9491L2962L5909
58629A168231L8604M2432M7481N2581N7290O2174O7611P3916Q1948R2007J02821
58618A887096J13242J24123J36911J51417J66663J82889K00501K17862K32099
58609C412803K41422K44704K39714K24099J97792J62512J19667P0783J9284l0525
58599D902255p5951j15650j47772j70749j85410j93975j97240j94858j87891j78665
58589C254094j68327j56779j44810j33899j23966j13505j02163r1139q1089p1563
58579B066854o2601n4929m8508m2599l7329l3485l0927k8819k7229k6752k6865
58568A646811k6469k5743k5586k5574k4429k2305k0641j9891j9359j9053j9787
$$ plain form
58557 1397974 1376528 1353545 1329447 1304243 1278314 1252866 1228808 1206085 1184717 1165358 1148093
58546 1148093 1131869 1115965 1100896 1087067 1073746 1060244 1047007 1034654 1022892 1011193 999496
58535 999496 987620 975188 962778 951783 942415 933207 923246 913348 904213 895085 885356 875859 867295
58522 867295 858824 849531 839899 830569 821139 811530 803130 796958 791944 786571 781145 776957 774288 772797
58508 772797 772774 774376 776433 777652 778371 779893 782765 786877 792353 799047 805926 812152 818071 824203 830247
58493 830247 836092 842708 850798 859520 867652 875069 882037 888184 893307 898043 902542 905570 906115 904800
58479 904800 902624 899481 895076 889964 884434 877662 869256 860400 852200 844252 836159 828933 823336 818282
58465 818282 812571 806926 802624 799339 796095 793189 791417 790471 789773 789813 790914 791734 790729 788169 785148
$$ packed form
58557A397974k1446k2983k4098k5204k5929k5448k4058k2723k1368j9359j7265
58546A148093j6224j5904j5069j3829j3321j3502j3237j2353j1762j1699j1697
58535I99496j1876j2432j2410j0995r368r208r961r898r135r128r729r497q564
58522H67295q471r293r632r330r430r609q400o172n014n373n426m188k669j491
58508G72797k3J602K057J219P19J522K872M112N476O694O879O226N919O132O044
58493H30247N845O616Q090Q722Q132P417O968O147N123M736M499L028N45j315
58479I04800k176l143m405n112n530o772q406q856q200p948q093p226n597n054
58465H18282n711n645m302l285l244k906j772r46o98M0J101Q20j005k560l021
$$ plain form
58450 785148 781721 777723 774285 772703 772667 773213 774439 776718 779344 781679 784651 789478 795910 803181 811482
58435 811482 820887 830100 838020 845253 852386 858217 861531 863254 864793 865604 864545 862356 860580 859141
58421 859141 857176 855135 853901 852896 851218 849602 849146 849249 848959 849123 850923 853529 855688 858500 863960
58406 863960 871687 879628 887209 895279 903623 910976 916857 921235 923188 922198 919896 918226 916760 914052
58392 914052 910591 908041 906583 905499 905322 906796 908762 909746 910691 913435 917477 921079 924615 929891 936943
58377 936943 944439 952462 961897 971741 980060 987105 994643 1002719 1009933 1016308 1023028 1029957 1036257 1042779
58363 1042779 1050812 1059188 1065719 1070853 1076815 1083761 1090076 1095924 1103007 1111158 1118575 1125242 1132858 1141465
58349 1141465 1149423 1156567 1164150 1171746 1177403 1180908 1183908 1186927 1189268 1191627 1195651 1201012 1205966 1210583
$$ packed form
58450G85148l427l998l438j582l6N46J226K279K626K335K972M827O432P271Q301
58435H11482R405R213P920P233P133N831L314J723J539Q11j059k189j776j439
58421H59141j965k041j234j005j678j616m56J03k90J64J800K606K159K812N460
58406H63960P727P941P581Q070Q344P353N881M378J953r90k302j670j466k708
58392I14052l461k550j458j084j77J474J966R84R45K744M042L602L536N276P052
58377I36943P496Q023R435R844Q319P045P538Q076P214O375O720O929O300O522
58363A042779Q033Q376O531N134N962O946O315N848P083Q151P417O667P616Q607
58349A141465P958P144P583P596N657L505L000L019K341K359M024N361M954M617
$$ plain form
58335 1210583 1216412 1223330 1229963 1236862 1245953 1257062 1268244 1279281 1291598 1305099 1318429 1331982
58323 1331982 1347184 1363220 1378065 1392272 1407988 1424626 1439481 1452450 1466186 1481625 1497262
58312 1497262 1512819 1529632 1547290 1563702 1578658 1593691 1608511 1621385 1632807 1644867 1657192
58301 1657192 1667656 1676953 1688346 1702943 1719242 1737000 1757257 1778847 1799375 1819426 1841359
58290 1841359 1864412 1885783 1906085 1928567 1953211 1976994 1999988 2025662 2054906 2085162 2115834
58279 2115834 2149143 2185237 2221911 2259446 2300258 2343507 2385756 2427169 2471098 2517287 2561713
58268 2561713 2603543 2645810 2688719 2729049 2767149 2807749 2852743 2899728 2948629 3002785 3062281
58257 3062281 3123250 3185096 3251410 3322481 3394183 3465682 3540833 3620528 3701332 3783163 3870363
$$ packed form
58335A210583N829O918O633O899R091J1109J1182J1037J2317J3501J3330J3553
58323A331982J5202J6036J4845J4207J5716J6638J4855J2969J3736J5439J5637
58312A497262J5557J6813J7658J6412J4956J5033J4820J2874J1422J2060J2325
58301A657192J0464R297J1393J4597J6299J7758K0257K1590K0528K0051K1933
58290A841359K3053K1371K0302K2482K4644K3783K2994K5674K9244L0256L0672
58279B115834L3309L6094L6674L7535M0812M3249M2249M1413M3929M6189M4426
58268B561713M1830M2267M2909M0330L8100M0600M4994M6985M8901N4156N9496
58257C062281O0969O1846O6314P1071P1702P1499P5151P9695Q0804Q1831Q7200
$$ plain form
58246 3870363 3963524 4058469 4155130 4258880 4370978 4486537 4604291 4729461 4864257 5004605
58236 5004605 5149133 5302453 5466630 5638549 5818502 6011971 6220188 6438693 6667845
58227 6667845 6914474 7180662 7462015 7759700 8082192 8432031 8803550 9197207 9622925
58218 9622925 10085643 10581875 11114762 11697397 12336600 13029580 13781988 14612346 15533286
58209 15533286 16547386 17668485 18927472 20350372 21953605 23770593 25860551 28283027
58201 28283027 31091947 34366966 38221057 42764786 48101351 54381661 61836621 70747981
58193 70747981 81446707 94375533 110104422 129271029 152615228 181094841 215603267
58186 215603267 255894968 299258911 340235838 372121711 389522837 390350482 376163882
$$ packed form
58246C870363R3161R4945R6661J03750J12098J15559J17754J25170J34796J40348
58236E004605J44528J53320J64177J71919J79953J93469K08217K18505K29152
58227F667845K46629K66188K81353K97685L22492L49839L71519L93657M25718
58218I622925M62718M96232N32887N82635O39203O92980P52408Q30358R20940
58209A5533286J014100J121099J258987J422900J603233J816988K089958K422476
58201B8283027K808920L275019L854091M543729N336565O280310P454960Q911360
58193G0747981J0698726J2928826J5728889J9166607K3344199K8479613L4508426
58186B15603267M0291701M3363943M0976927L1885873J7401126Q27645j4186600
$$ plain form
58179 376163882 350997247 319613908 286122311 253379089 223050757 195932032 172223505
58172 172223505 151737729 134103502 118939479 105919922 94756442 85187487 76996224
58165 76996224 70010766 64082829 59083893 54917806 51517090 48828926 46818573 45481177
58157 45481177 44846170 44992278 46054497 48125384 51025656 54135700 56529490 57383209
58149 57383209 56345676 53607516 49698488 45220051 40663398 36342152 32412105 28929831
58141 28929831 25897439 23278028 21010155 19035347 17313272 15811046 14493120 13330038
58133 13330038 12305592 11406399 10612858 9906600 9277136 8714092 8201529 7726561 7285562
58124 7285562 6875925 6489915 6122571 5777404 5457801 5159988 4880253 4621673 4387549
$$ packed form
58179C76163882k5166635l1383339l3491597l2743222l0328332k7118725k3708527
58172A72223505k0485776j7634227j5164023j3019557j1163480r568955q191263
58165G6996224o985458n927937m998936m166087l400716k688164k010353j337396
58157D5481177o35007J46108J062219K070887K900272L110044K393790Q53719
58149E7383209j037533k738160l909028m478437m556653m321246l930047l482274
58141B8929831l032392k619411k267873j974808j722075j502226j317926j163082
58133A3330038j024446q99193p93541p06258o29464n63044n12563m74968m40999
58124G285562m09637l86010l67344l45167l19603k97813k79735k58580k34124
$$ plain form
58115 4387549 4174834 3979885 3804137 3648183 3506128 3371368 3242603 3119481 2998429
58106 2998429 2877955 2762424 2655416 2554515 2457153 2365832 2282636 2204127 2126909 2053184
58096 2053184 1985728 1922321 1860256 1801678 1749224 1700721 1653254 1608369 1568227 1530528 1492301
58085 1492301 1455173 1421975 1391302 1360085 1328589 1298582 1269508 1240536 1213487 1189744 1167118
58074 1167118 1143512 1120781 1101342 1084044 1067078 1051793 1039639 1028262 1014715 1000051 986922
58063 986922 975165 963473 952960 945218 938935 931926 924456 917389 909452 899652 890067 882791 876290
58050 876290 868095 858960 851082 844297 837430 831352 827324 824120 820050 816125 814065 812929 810831 808354
58036 808354 807182 806895 806149 805568 806558 808561 810141 811447 813057 813890 812825 810928 809681 808550 806679
$$ packed form
58115D387549k12715j94949j75748j55954j42055j34760j28765j23122j21052
58106B998429j20474j15531j07008j00901r7362r1321q3196p8509p7218p3725
58096B053184o7456o3407o2065n8578n2454m8503m7467m4885m0142l7699l8227
58085A492301l7128l3198l0673l1217l1496l0007k9074k8972k7049k3743k2626
58074A167118k3606k2731j9439j7298j6966j5285j2154j1377j3547j4664j3129
58063I86922j1757j1692j0513p742o283p009p470p067p937r800r585p276o501
58050H76290q195r135p878o785o867o078m028l204m070l925k060j136k098k477
58036H08354j172k87p46n81R90K003J580J306J610Q33j065j897j247j131j871
$$ plain form
58021 806679 805203 805350 805952 805468 804842 805681 807112 807122 805664 803946 801983 799262 796473 794202 791323 786936
58005 786936 782484 779670 777840 775621 773477 772315 771326 769671 768623 769508 771152 771890 772413 773978 775481
57990 775481 775091 773206 771005 767654 761997 755651 751282 748885 746711 744803 744570 745721 746609 747015 747932
57975 747932 749298 750542 752547 756412 761009 764355 766687 769565 772720 774500 774816 774958 775024 774153 772849
57960 772849 772531 773197 773862 774751 776523 777916 776791 773269 769395 766076 762765 759739 758093 757631 757252 757284
57944 757284 759094 762493 765867 768756 772038 775630 778370 780190 782162 784289 785383 785186 784483 783022 779485
57929 779485 773731 767062 759964 751524 741399 730665 720395 710883 702378 695085 688411 681709 675700
57916 675700 671720 669751 668737 668597 670298 674146 679624 686704 695633 705603 715280 724545 734190 744140
$$ packed form
58021H06679j476J47O02m84o26Q39J431J0j458j718j963k721k789k271k879m387
58005G86936m452k814j830k219k144j162r89j655j048Q85J644P38N23J565J503
57990G75481l90j885k201l351n657o346m369k397k174j908k33J151Q88M06R17
57975G47932J366J244K005L865M597L346K332K878L155J780L16J42O6q71j304
57960G72849l18O66O65Q89J772J393j125l522l874l319l311l026j646m62l79L2
57944G57284J810L399L374K889L282L592K740J820J972K127J094j97p03j461l537
57929G79485n754o669p098q440j0125j0734j0270r512q505p293o674o702o009
57916F75700l980j969j014j40J701L848N478P080Q929R970R677R265R645R950
$$ plain form
57902 744140 753557 762386 771115 779299 785989 791407 796504 801195 804729 807424 810225 812806 813953 813568
57888 813568 812490 810644 807387 803398 800205 797882 795242 792212 789944 788615 787224 785712 785157 785558 785538
57873 785538 784685 784363 785689 788390 792046 796760 802151 807316 812301 818171 825284 832862 840464 848384 856363
57858 856363 863411 869153 873993 877871 880345 881906 883531 884828 884353 881985 879247 876990 874544 871519
57844 871519 868698 866604 864818 863306 862882 863687 864556 864554 864041 863771 864019 864819 865878 866096 864430 861393 858435
57827 858435 855809 852419 847774 842566 837297 831899 826777 822530 818492 813319 807208 801758 797362 792667
57813 792667 787054 781718 777629 774257 771063 768559 767087 766131 765639 766474 768829 771669 774477 778039 782780
57798 782780 787924 793126 799435 807644 817049 826649 836138 844918 851774 856661 861418 867492 874225 880474
$$ packed form
57902G44140R417Q829Q729Q184O690N418N097M691L534K695K801K581J147l85
57888H13568j078j846l257l989l193k323k640l030k268j329j391j512n55M01k0
57873G85538q53l22J326K701L656M714N391N165M985N870P113P578P602P920P979
57858H56363P048N742M840L878K474J561J625J297m75k368k738k257k446l025
57844H71519k821k094j786j512m24Q05Q69kn13k70K48Q00J059K18j666l037k958
57827H58435k626l390m645n208n269n398n122m247m038n173o111n450m396m695
57813G92667n613n336m089l372l194k504j472r56m92Q35K355K840K808L562M741
57798G82780N144N202O309Q209R405R600R489Q780O856M887M757O074O733O249
$$ plain form
57784 880474 886577 893391 900502 906813 912125 916782 920454 922441 922768 922031 920586 918667 916848 915755 915726
57769 915726 917028 919688 922844 925268 926929 929120 932665 937193 942603 949859 959484 970454 981531 992605
57755 992605 1003769 1014072 1022326 1028421 1032913 1035998 1037817 1039110 1040674 1042606 1044721 1047131 1049919 1052948
57741 1052948 1056496 1061264 1067143 1072864 1077534 1081703 1086315 1091484 1097064 1103500 1111237 1119956 1129181 1139009
57727 1139009 1149564 1160388 1171067 1181861 1193097 1204636 1216416 1228771 1241633 1254255 1266365
57716 1266365 1278740 1291991 1305644 1319125 1332849 1347531 1363223 1379816 1397754 1417436 1438561
57705 1438561 1460846 1484780 1511014 1539646 1570722 1604660 1641573 1681042 1723381 1770287 1823364
57694 1823364 1882766 1948246 2020789 2102237 2193826 2296156 2410123 2536935 2677442 2832193
$$ packed form
57784H80474O103O814P111O311N312M657L672J987L27p37j445j919j819j093k9
57769I15726J302K660L156K424J661K191L545M528N410P256R625J0970J1077J1074
57755I92605J1164J0303Q254O095M492L085J819J293J564J932K115K410K788L029
57741A052948L548M768N879N721M670M169M612N169N580O436P737Q719R225R828
57727A139009J0555J0824J0679J0794J1236J1539J1780J2355J2862J2622J2110
57716A266365J2375J3251J3653J3481J3724J4682J5692J6593J7938J9682K1125
57705A438561K2285K3934K6234K8632L1076L3938L6913L9469M2339M6906N3077
57694A823364N9402O5480P2543Q1448R1589J02330J13967J26812J40507J54751
$$ plain form
57684 2832193 3001860 3186875 3386819 3600386 3825233 4057102 4289399 4514076 4722637
57675 4722637 4906451 5057622 5170984 5245390 5283236 5289871 5273714 5244795 5210391 5170840 5119276
57664 5119276 5045077 4938444 4794705 4617206 4416599 4206339 3997972 3799495 3615927 3449804
57654 3449804 3301649 3171120 3057644 2959871 2875599 2803048 2741442 2689730 2645875 2608441 2577887
57643 2577887 2555092 2539426 2529473 2524834 2525905 2532502 2544179 2561546 2585928 2617847 2657000 2703531
57631 2703531 2758327 2822211 2895821 2980079 3075853 3183328 3302479 3433908 3578293 3735285
57621 3735285 3903591 4081562 4266457 4453191 4634665 4803230 4951204 5070652 5154282 5197280
57611 5197280 5198151 5158248 5081287 4973077 4840663 4691178 4531267 4366753 4202053 4040145
$$ packed form
57684B832193J69667J85015J99944K13567K24847K31869K32297K24677K08561
57675D722637J83814J51171J13362P4406L7846O635j6157k8919l4404l9551n1564
57664E119276p4199j06633j43739j77499k00607k10260k08367j98477j83568j66123
57654C449804j48155j30529j13476r7773q4272p2551o1606n1712m3855l7434l0554
57643B577887k2795j5666r953m639J071O597J1677J7367K4382L1919L9153M6531
57631B703531N4796O3884P3610Q4258R5774J07475J19151J31429J44385J56992
57621C735285J68306J77971J84895J86734J81474J68565J47974J19448Q3630M2998
57611E197280Q71l9903p6961j08210j32414j49485j59911j64514j64700j61908
$$ plain form
57601 4040145 3883516 3734594 3594774 3463812 3341088 3226982 3122260 3026763 2939624 2860289
57591 2860289 2788394 2723088 2663415 2609026 2559706 2514675 2473258 2435705 2402368 2372523 2344997
57580 2344997 2319561 2296689 2276393 2258289 2242449 2229060 2217545 2207111 2197929 2190728 2185413 2181119
57568 2181119 2177478 2174910 2173848 2174515 2177167 2181615 2186844 2192020 2197571 2204396 2212515 2221512 2231745 2243867
57554 2243867 2257560 2272070 2287683 2305295 2324739 2344973 2365841 2388316 2413112 2440427 2471003
57543 2471003 2505892 2544930 2586848 2631296 2679603 2733323 2793174 2859679 2933657 3015650 3105780
57532 3105780 3204418 3312111 3428816 3554292 3689187 3834369 3988791 4149113 4311575 4472798
57522 4472798 4628238 4771186 4894241 4991155 5057232 5089435 5087301 5053149 4990822 4904786 4800576
$$ packed form
57601D040145j56629j48922j39820j30962j22724j14106j04722r5497q7139p9335
57591B860289p1895o5306n9673n4389m9320m5031m1417l7553l3337k9845k7526
57580B344997k5436k2872k0296j8104j5840j3389j1515j0434r182p201n315m294
57568B181119l641k568j062O67K652M448N229N176N551O825Q119Q997J0233J2122
57554B243867J3693J4510J5613J7612J9444K0234K0868K2475K4796K7315L0576
57543B471003L4889L9038M1918M4448M8307N3720N9851O6505P3978Q1993R0130
57532C105780R8638J07693J16705J25476J34895J45182J54422J60322J62462J61223
57522D472798J55440J42948J23055R6914O6077L2203k134l4152o2327q6036j04210
$$ plain form
57511 4800576 4684764 4563315 4440242 4318148 4199323 4085735 3978638 3878827 3786901 3703012
57501 3703012 3626986 3558996 3499455 3447921 3402904 3363229 3328942 3300419 3277287 3258774 3244504
57490 3244504 3234316 3227744 3224287 3224006 3227473 3235283 3247690 3264351 3284410 3307331 3333723 3364785
57478 3364785 3400972 3442005 3488316 3541602 3603620 3675183 3756580 3848091 3949585 4060420 4180375
57467 4180375 4310042 4449565 4597329 4750270 4904923 5057406 5202589 5333894 5444163
57458 5444163 5526962 5577763 5594545 5577571 5528969 5452835 5355238 5242908 5121407 4994770 4866633
57447 4866633 4740711 4619898 4505756 4399252 4301255 4212002 4130853 4057116 3990587 3930904
57437 3930904 3877097 3828349 3784675 3746287 3712737 3683206 3657276 3634875 3615674 3599016 3584360
$$ packed form
57511D800576j15812j21449j23073j22094j18825j13588j07097r9811r1926q3889
57501C703012p6026o7990n9541n1534m5017l9675l4287k8523k3132j8513j4270
57490C244504j0188o572l457k81L467P810J2407J6661K0059K2921K6392L1062
57478C364785L6187M1033M6311N3286O2018P1563Q1397R1511J01494J10835J19955
57467D180375J29667J39523J47764J52941J54653J52483J45183J31305J10269
57458E444163Q2799N0801J6782j6974m8602p6134r7597j12330j21501j26637j28137
57447D866633j25922j20813j14142j06504r7997q9253q1149p3737o6529n9683
57437C930904n3807m8748m3674l8388l3550k9531k5930k2401j9201j6658j4656
$$ plain form
57426 3584360 3571530 3560637 3551886 3545299 3540544 3537193 3535108 3534349 3534901 3536866 3540637 3546293 3552991 3559626
57412 3559626 3565995 3572657 3579875 3587481 3595648 3604728 3614353 3623734 3632961 3642911 3653735 3664630 3675490
57399 3675490 3687502 3701421 3716355 3731081 3745615 3760577 3775792 3790572 3804922 3819575 3835083
57388 3835083 3851491 3868574 3885796 3902356 3917836 3932631 3947402 3962429 3977710 3993170 4008412
57377 4008412 4022857 4036586 4050548 4065514 4081345 4097651 4114516 4132020 4149601 4166555 4182795
57366 4182795 4198659 4214399 4230314 4246864 4264070 4281241 4297838 4314203 4330957 4348138 4365509
57355 4365509 4383269 4401789 4420860 4439777 4458046 4475631 4492767 4509905 4527581 4545947 4564593
57344 4564593 4583063 4601308 4619487 4637730 4656235 4675158 4694227 4712945 4731340 4749923 4768725
$$ packed form
57426C584360j2830j0893q751o587m755l351k085p59N52J965L771N656O698O635
57412C559626O369O662P218P606Q167R080R625R381R227R950J0824J0895J0860
57399C675490J2012J3919J4934J4726J4534J4962J5215J4780J4350J4653J5508
57388C835083J6408J7083J7222J6560J5480J4795J4771J5027J5281J5460J5242
57377D008412J4445J3729J3962J4966J5831J6306J6865J7504J7581J6954J6240
57366D182795J5864J5740J5915J6550J7206J7171J6597J6365J6754J7181J7371
57355D365509J7760J8520J9071J8917J8269J7585J7136J7138J7676J8366J8646
57344D564593J8470J8245J8179J8243J8505J8923J9069J8718J8395J8583J8802
$$ plain form
57333 4768725 4787028 4804376 4821205 4838199 4855650 4873698 4892422 4911309 4929443 4946707 4964086
57322 4964086 4982341 5001156 5020059 5039256 5058871 5078222 5096683 5114623 5132759 5151218 5169916
57311 5169916 5189162 5209047 5229018 5248889 5269608 5292018 5315471 5338628 5361133 5383484 5405838
57300 5405838 5428148 5451062 5475411 5500959 5526720 5552489 5579074 5607074 5636371 5666806 5698443
57289 5698443 5731128 5764662 5799503 5836518 5875904 5917019 5959303 6002655 6046778 6090788 6133698
57278 6133698 6174783 6213349 6248482 6279177 6304527 6323825 6336664 6342772 6341706 6333194 6318054 6298203
57266 6298203 6275338 6250094 6222912 6194958 6167481 6140841 6115006 6090555 6068325 6048456 6030599
57255 6030599 6014758 6001145 5989603 5979953 5972510 5967313 5963275 5959147 5955104 5952268 5950858 5949875 5948612
$$ packed form
57333D768725J8303J7348J6829J6994J7451J8048J8724J8887J8134J7264J7379
57322D964086J8255J8815J8903J9197J9615J9351J8461J7940J8136J8459J8698
57311E169916J9246J9885J9971J9871K0719K2410K3453K3157K2505K2351K2354
57300E405838K2310K2914K4349K5548K5761K5769K6585K8000K9297L0435L1637
57289E698443L2685L3534L4841L7015L9386M1115M2284M3352M4123M4010M2910
57278F133698M1085L8566L5133L0695K5350J9298J2839O108j066q512j5140j9851
57266F298203k2865k5244k7182k7954k7477k6640k5835k4451k2230j9869j7857
57255F030599j5841j3613j1542r650p443n197m038m128m043k836j410r83j263
$$ plain form
57242 5948612 5947391 5946736 5946809 5947797 5949926 5952917 5956151 5959565 5963555 5967916 5971698 5974384 5976522 5978990 5982109
57227 5982109 5985611 5988915 5991351 5992695 5993536 5994621 5995872 5996552 5996271 5995273 5993862 5992213 5990574 5988975 5986900
57212 5986900 5983987 5980856 5978305 5975817 5971902 5965982 5958952 5951747 5944408 5936867 5929648 5923199 5917243 5911343
57198 5911343 5905616 5900419 5895780 5891571 5887902 5885034 5883105 5882138 5882061 5882610 5883411 5884217 5884880 5885237 5885280 5885191 5884861
57181 5884861 5883649 5881120 5877702 5874093 5870306 5865924 5860959 5855742 5850253 5844403 5838708 5833681 5828601 5821831
57167 5821831 5812514 5801219 5788885 5775847 5761895 5746584 5729420 5710416 5690434 5670345 5649968
57156 5649968 5628544 5605987 5582754 5558679 5533001 5505621 5477388 5449064 5420951 5393674 5368379
57145 5368379 5345893 5326283 5309180 5293839 5279036 5263807 5248192 5232455 5215912 5197702 5178398
$$ packed form
57242E948612j221o55P3R88K129K991L234L414L990M361L782K686K138K468L119
57227E982109L502L304K436J344Q41J085J251O80k81r98j411j649j639j599k075
57212E986900k913l131k551k488l915n920p030p205p339p541p219o449n956n900
57198E911343n727n197m639m209l669k868j929r67p7N49Q01Q06O63L57M3q9l30
57181E884861j212k529l418l609l787m382m965n217n489n850n695n027n080o770
57167E821831r317j1295j2334j3038j3952j5311j7164j9004j9982k0089k0377
57156E649968k1424k2557k3233k4075k5678k7380k8233k8324k8113k7277k5295
57145E368379k2486j9610j7103j5341j4803j5229j5615j5737j6543j8210j9304
$$ plain form
57134 5178398 5159437 5140948 5121602 5100705 5078934 5056686 5033261 5008268 4982467 4956517 4930044
57123 4930044 4902660 4874885 4847386 4820288 4793904 4769322 4747727 4729931 4716877 4709723 4709017 4714674
57111 4714674 4727032 4746979 4774902 4810864 4856346 4914878 4990833 5088864 5214770 5375448 5577777
57100 5577777 5829379 6141518 6530404 7015737 7619813 8368301 9289659 10412830 11766998
57091 11766998 13383280 15292627 17518717 20072460 22951373 26138316 29596153 33263374
57083 33263374 37053297 40852243 44519425 47904125 50882838 53386891 55388342 56854683
57075 56854683 57719332 57896512 57322127 55986133 53944330 51315829 48267256 44980961
57067 44980961 41618113 38297790 35100246 32081545 29282901 26730800 24434668 22388233
$$ packed form
57134E178398j8961j8489j9346k0897k1771k2248k3425k4993k5801k5950k6473
57123D930044k7384k7775k7499k7098k6384k4582k1595j7796j3054p154p06N657
57111D714674J2358J9947K7923L5962M5482N8532P5955R8031J25906J60678K02329
57100E577777K51602L12139L88886M85333O04076P48488R21358J123171J354168
57091A1766998J616282J909347K226090K553743K878913L186943L457837L667221
57083C3263374L789923L798946L667182L384700K978713K504053K001451J466341
57075E6854683Q64649J77180n74385j335994k041803k628501l048573l286295
57067D4980961l362848l320323l197544l018701k798644k552101k296132k046435
$$ plain form
57059 22388233 20575434 18977718 17578729 16364176 15318593 14422823 13654379 12989856
57051 12989856 12407805 11891091 11427992 11011319 10635877 10295822 9983463 9689980 9407174
57042 9407174 9128820 8850814 8570758 8287958 8003625 7720295 7440502 7165972 6897864
57033 6897864 6637079 6383888 6137512 5896576 5660041 5427626 5199398 4975246 4754940
57024 4754940 4538729 4327731 4123514 3927296 3739672 3560972 3391384 3230526 3077311
57015 3077311 2930610 2789893 2655156 2526589 2404678 2290358 2184784 2089174 2004947 1933622
57005 1933622 1876434 1834570 1810011 1805627 1824676 1871532 1952653 2072958 2226355 2388457 2521413
56994 2521413 2590190 2578228 2491637 2351836 2184230 2009780 1841980 1688069 1551618 1434062
$$ packed form
57059B2388233j812799j597716j398989j214553j045583q95770p68444o64523
57051A2989856n82051n16714m63099m16673l75442l40055l12359k93483k82806
57042I407174k78354k78006k80056k82800k84333k83330k79793k74530k68108
57033F897864k60785k53191k46376k40936k36535k32415k28228k24152k20306
57024D754940k16211k10998k04217j96218j87624j78700j69588j60858j53215
57015C077311j46701j40717j34737j28567j21911j14320j05574r5610q4227p1325
57005A933622n7188m1864k4559m384J9049M6856Q1121J20305J53397J62102J32956
56994B521413O8777j1962q6591j39801j67606j74450j67800j53911j36451j17556
$$ plain form
56984 1434062 1335065 1252942 1185198 1128450 1078258 1030221 981765 932605 883658 836129 791469
56973 791469 751044 715266 683591 655608 631651 612130 596933 585739 578330 574300 572964 573923
56961 573923 577423 583993 594164 608577 627588 650228 673790 694676 709484 715599 711792 698951
56949 698951 679849 657722 635042 613407 593750 576198 560317 546055 534175 525429 519679 516281
56937 516281 515051 516481 521184 529614 542271 559877 583060 611533 643048 673036 695868 707122
56925 707122 705103 690762 666835 637068 605372 574815 547084 522724 501571 483029 466496 451881
56913 451881 439465 429161 420296 412359 405547 400215 396001 391832 386828 381110 375753 371888 369685 368327
56899 368327 367142 366526 367320 369495 372146 374841 378315 383583 390933 400140 411196 424463 440438 459623
$$ packed form
56984A434062r8997q2123o7744n6748n0192m8037m8456m9160m8947m7529m4660
56973G91469m0425l5778l1675k7983k3957j9521j5197j1194p409m030j336R59
56961E73923L500O570J0171J4413J9011K2640K3562K0886J4808O115l807j2841
56949F98951j9102k2127k2680k1635j9657j7552j5881j4262j1880q746n750l398
56937E16281j230J430M703Q430J2657J7606K3183K8473L1515K9988K2832J1254
56925G07122k019j4341k3927k9767l1696l0557k7731k4360k1153j8542j6533j4615
56913D51881j2416j0304q865p937o812n332m214m169n004n718n357l865k203j358
56899C68327j185o16P94K175K651K695L474N268P350R207J1056J3267J5975J9185
$$ plain form
56885 459623 482114 506725 530606 550146 562456 566233 561837 551039 536440 520548 505134 491330
56873 491330 479986 471654 466374 463918 464346 468183 475944 487687 503247 523001 548263 580800 622071
56860 622071 672979 733560 801499 870311 929919 970619 987387 981012 956125 918838 875339 830894
56848 830894 789107 752090 721103 696699 678674 666826 661824 664694 675618 694156 720781 757427
56836 757427 806458 869988 950045 1047473 1158692 1273177 1374876 1447313 1479367 1468833 1422286
56825 1422286 1351406 1268123 1181687 1098473 1022681 956462 900103 852980 814521 784368 762286
56814 762286 748297 742694 745749 757814 779850 813499 860371 921014 993579 1071995 1145212 1199810
56802 1199810 1225298 1218195 1182161 1125295 1056993 985405 915974 851627 794055 744284 702267
$$ packed form
56885D59623K2491K4611K3881J9540J2310L777m396j0798j4599j5892j5414j3804
56873D91330j1344q332n280k456M28L837P761J1743J5560J9754K5262L2537M1271
56860F22071N0908O0581O7939O8812N9608M0700J6768o375k4887l7287m3499m4445
56848H30894m1787l7017l0987k4404j8025j1848n002K870J0924J8538K6625L6646
56836G57427M9031O3530Q0057R7428J11219J14485J01699P2437L2054j0534m6547
56825A422286p0880q3283q6436q3214p5792o6219n6359m7123l8459l0153k2082
56814G62286j3989n603L055J2065K2036L3649M6872O0643P2565P8416P3217N4598
56802A199810K5488p103l6034n6866o8302p1588o9431o4347n7572m9771m2017
$$ plain form
56791 702267 667080 638125 615604 599597 589523 584879 585768 592345 604735 624004 651923 688361
56779 688361 729147 767256 795881 810178 807587 788411 756182 716180 673021 629803 588817 551766
56767 551766 519103 490212 464629 442529 423846 407631 392775 378959 366554 355843 346636 338544
56755 338544 331351 325033 319480 314356 309443 305025 301603 299131 296898 294336 291597 289080 286681 283853
56741 283853 280231 275977 271656 267900 264994 262663 260453 258296 256356 254420 252032 249275 246731 244487
56727 244487 241842 238321 234383 230754 227715 225380 223958 223187 222167 220400 218513 217364 216919 216629 216375
56712 216375 216310 216244 215924 215567 215386 214927 213604 211598 209468 207199 204413 201293 198383 195586 192198 188003
56696 188003 183557 179304 175085 170672 166222 162020 158224 154904 151974 149162 146425 144261 143083 142448
$$ packed form
56791G02267l5187k8955k2521j6007j0074m644Q89O577J2390J9269K7919L6438
56779F88361M0786L8109K8625J4297k591j9176l2229m0002m3159m3218m0986l7051
56767E51766l2663k8891k5583k2100j8683j6215j4856j3816j2405j0711r207q092
56755C38544p193o318n553n124m913m418l422k472k233k562k739k517k399k828
56741B83853l622m254m321l756k906k331k210k157j940j936k388k757k544k244
56727B44487k645l521l938l629l039k335j422p71j020j767j887j149m45k90k54
56712B16375o5o6l20l57j81m59j323k006k130k269k786l120k910k797l388m195
56696A88003m446m253m219m413m450m202l796l320k930k812k737k164j178o35
$$ plain form
56682 142448 141519 140276 139582 140013 141249 142812 144834 147776 151784 156583 161823 167330 173140 179327 185729
56667 185729 192036 198376 205592 214486 224776 235144 244370 252226 259318 266334 273430 280152 285947 290737
56653 290737 294783 297954 299621 299539 298347 296650 293993 289456 283135 276287 269900 263727 257027 249883 243355
56638 243355 238395 234836 231644 228127 224648 221923 219870 217724 215284 213423 213086 214246 216128 217979
56624 217979 219287 219781 219682 219686 220266 221223 222131 222826 223179 222827 221600 219825 217827 215452 212435 208856 204948
56607 204948 200871 196976 193765 191186 188521 185425 182512 180387 178669 176609 174195 171989 170316 169213
56593 169213 168779 168960 169339 169660 170158 170888 171328 171213 171104 171419 171555 170845 169822 169593 170419 171846 173782 176371
56575 176371 179101 181162 182616 184272 186451 188732 190868 193136 195762 198639 201556 204177 206035 207061
$$ packed form
56682A42448r29j243o94M31J236J563K022K942M008M799N240N507N810O187O402
56667A85729O307O340P216Q894J0290J0368R226P856P092P016P096O722N795M790
56653B90737M046L171J667q2j192j697k657m537o321o848o387o173o700p144o528
56638B43355m960l559l192l517l479k725k053k146k440j861l37J160J882J851
56624B17979J308M94r9MN80R57R08O95L53l52j227j775j998k375l017l579l908
56607B04948m077l895l211k579k665l096k913k125j718k060k414k206j673j103
56593A69213m34J81L79L21M98P30M40j15j09L15J36p10j023k29Q26J427J936K589
56575A76371K730K061J454J656K179K281K136K268K626K877K917K621J858J026
$$ plain form
56561 207061 207856 208910 210036 211177 213090 216314 220044 223097 225607 228677 232657 236789 240300 242877
56547 242877 244310 244747 245063 245995 247078 247325 246590 245300 243429 240899 238535 237154 236021 233704 230322
56532 230322 227488 226116 225706 225679 225813 225308 223220 220154 217973 217324 216899 215644 214229 213667 213777 213848 213791
56515 213791 213899 214247 214861 215705 216212 215679 214364 213216 212408 211242 209648 208368 207323 205297 201951 198803
56499 198803 197404 197626 198500 199612 200857 201836 202441 203183 204163 204540 203783 202705 202460 203233 204515 205895 206927
56482 206927 207034 206332 205857 206318 207304 208271 209531 211557 214097 216675 219294 222018 224523 226710 229062 231746
56466 231746 234085 235523 236420 237242 237760 237822 238144 239472 241503 243431 244994 246229 246753 246133 244676 243182
56450 243182 242241 242184 243164 244703 245678 245394 244305 243252 242504 242007 241950 242469 243234 243874 244458 245189 246090 247237
$$ packed form
56561B07061P95J054J126J141J913L224L730L053K510L070L980M132L511K577
56547B42877J433M37L16R32J083K47p35j290j871k530k364j381j133k317l382
56532B30322k834j372m10k7J34n05k088l066k181o49m25j255j415n62J10P1n7
56515B13791J08L48O14Q44N07n33j315j148q08j166j594j280j045k026l346l148
56499A98803j399K22Q74J112J245R79O05P42R80L77p57j078k45P73J282J380J032
56482B06927J07p02m75M61R86R67J260K026K540K578K619K724K505K187K352K684
56466B31746K339J438Q97Q22N18O2L22J328K031J928J563J235N24o20j457j494
56450B43182r41n7R80J539R75k84j089j053p48m97n7N19P65O40N84P31R01J147
$$ plain form
56432 247237 248730 250177 250916 250974 251080 251453 251524 251156 251060 251428 251265 249821 247771 246201 245205 244267 243158 241705
56414 241705 239471 236595 234187 232959 232103 230337 227420 223816 219615 214865 210411 207362 205963 205779 206615
56399 206615 208431 210722 212791 214496 216171 218067 220276 222801 225316 227288 228722 230224 232015 233578
56385 233578 234592 235446 236353 236877 236784 236469 235951 234399 231409 227819 224527 221477 218633 217028 217808 220974
56369 220974 225919 232385 239954 247412 253762 259327 264950 270732 276381 282084 288039 293721 298537 302568
56355 302568 305923 308149 309247 310496 313209 317231 321564 325772 329820 333291 335836 337786 339395 340215
56341 340215 340204 340556 342333 345061 347878 351155 355576 360374 364090 366681 369370 372730 376386 380375 385375
56326 385375 391531 398249 405201 412606 420502 428545 436426 443850 450416 456173 461831 467747 473236 477642
$$ packed form
56432B47237J493J447P39N8J06L73P1l68r6L68j63j444k050j570r96r38j109j453
56414B41705k234k876k408j228q56j766k917l604m201m750m454l049j399j84Q36
56399B06615J816K291K069J705J675J896K209K525K515J972J434J502J791J563
56385B33578J014Q54R07N24r3l15n18j552k990l590l292l050k844j605P80L166
56369B20974M945O466P569P458O350N565N623N782N649N703N955N682M816M031
56355C02568L355K226J098J249K713M022M333M208M048L471K545J950J609Q20
56341C40215j1L52J777K728K817L277M421M798L716K591K689L360L656L989N000
56326C85375O156O718O952P405P896Q043P881P424O566N757N658N916N489M406
$$ plain form
56312 477642 481373 485069 488450 490989 492960 494769 495891 495581 494117 492379 490835 489824 489980 491187 491914
56297 491914 490857 488626 486790 486025 486416 488579 492955 498646 504409 510267 516815 523692 530240 536956 544757
56282 544757 553430 562403 572368 584472 598461 613384 629619 648340 669396 691558 714716 740089
56270 740089 768365 799344 833269 870844 911983 956195 1004300 1058276 1119358 1187603 1263121
56259 1263121 1346324 1437100 1535148 1640968 1755108 1876646 2003759 2135398 2270827 2407779
56249 2407779 2542768 2673152 2797332 2913104 3017409 3107704 3182265 3239427 3278175 3299399
56239 3299399 3305191 3297181 3276893 3247054 3210642 3168934 3122200 3071894 3020105 2967097 2911467 2852673
56227 2852673 2791391 2727429 2659481 2587222 2511692 2433411 2352040 2268162 2183456 2098666 2013194
$$ packed form
56312D77642L731L696L381K539J971J809J122l10j464j738j544j011J56J207P27
56297D91914j057k231j836p65L91K163M376N691N763N858O548O877O548O716P801
56282E44757Q673Q973R965J2104J3989J4923J6235J8721K1056K2162K3158K5373
56270G40089K8276L0979L3925L7575M1139M4212M8105N3976O1082O8245P5518
56259A263121Q3203R0776R8048J05820J14140J21538J27113J31639J35429J36952
56249B407779J34989J30384J24180J15772J04305R0295P4561N7162L8748K1224
56239C299399N792q010k0288k9839l6412m1708m6734n0306n1789n3008n5630n8794
56227B852673o1282o3962o7948p2259p5530p8281q1371q3878q4706q4790q5472
$$ plain form
56216 2013194 1927098 1841838 1758690 1677973 1600146 1526057 1455887 1389327 1326923 1269700 1217450
56205 1217450 1168989 1124073 1083350 1046547 1012571 981446 954182 930531 908757 887791 867926
56194 867926 849334 831810 816006 802921 792024 781814 772262 764642 758938 753695 748606 744912 742918
56181 742918 741451 740281 740749 743317 746681 749955 753780 758657 764176 770415 778075 786698 794757 801973
56167 801973 809488 817354 824165 829704 835576 842440 848926 854133 858958 864040 868537 871990 875452 879809
56153 879809 884859 890844 898977 909611 921784 935267 951193 970026 990945 1013939 1040541 1071887
56141 1071887 1108198 1150847 1202817 1266378 1342409 1432526 1539352 1663568 1802491 1951945
56131 1951945 2107178 2261444 2406703 2537474 2652601 2753090 2840785 2919576 2994479 3067398
$$ packed form
56216B013194q6096q5260q3148q0717p7827p4089p0170o6560o2404n7223n2250
56205A217450m8461m4916m0723l6803l3976l1125k7264k3651k1774k0966j9865
56194H67926j8592j7524j5804j3085j0897j0210r552p620n704n243n089l694j994
56181G42918j467j170M68K568L364L274L825M877N519O239P660Q623Q059P216
56167H01973P515P866O811N539N872O864O486N207M825N082M497L453L462M357
56153H79809N050N985Q133J0634J2173J3483J5926J8833K0919K2994K6602L1346
56141A071887L6311M2649N1970O3561P6031R0117J06826J24216J38923J49454
56131A951945J55233J54266J45259J30771J15127J00489Q7695P8791P4903P2919
$$ plain form
56121 3067398 3135276 3193046 3236505 3262374 3269197 3259855 3240710 3216605 3188069 3153325 3109814 3053131
56109 3053131 2978121 2883277 2772112 2649497 2519421 2387078 2259395 2141300 2033814 1937090
56099 1937090 1852508 1780369 1718433 1664502 1617985 1577659 1540810 1506061 1474380 1446036 1419494
56088 1419494 1394517 1373008 1355277 1338826 1322508 1308519 1298470 1290829 1284160 1279490 1277441 1276346
56076 1276346 1275285 1275720 1278205 1280941 1283602 1288853 1297746 1307319 1315261 1323269 1333206 1343727 1353542 1364273
56062 1364273 1376982 1389475 1400224 1411509 1425493 1440661 1455388 1471515 1490844 1511344 1530445
56051 1530445 1549108 1569245 1590040 1610143 1630564 1652275 1674007 1695418 1719113 1746469 1774916
56040 1774916 1802385 1830677 1861267 1891898 1920948 1951088 1984774 2020052 2054709 2090495 2129172
$$ packed form
56121C067398O7878N7770M3459K5869O823r342j9145k4105k8536l4744m3511n6683
56109C053131p5010r4844j11165j22615j30076j32343j27683j18095j07486r6724
56099A937090q4582p2139o1936n3931m6517m0326l6849l4749l1681k8344k6542
56088A419494k4977k1509j7731j6451j6318j3989j0049p641o669m670k049j095
56076A276346j061M35K485K736K661N251Q893R573P942Q008R937J0521R815J0731
56062A364273J2709J2493J0749J1285J3984J5168J4727J6127J9329K0500J9101
56051A530445J8663K0137K0795K0103K0421K1711K1732K1411K3695K7356K8447
56040A774916K7469K8292L0590L0631K9050L0140L3686L5278L4657L5786L8677
$$ plain form
56029 2129172 2168535 2206641 2245948 2288954 2333850 2378887 2426759 2479989 2536168 2592507 2650787
56018 2650787 2713068 2776981 2840289 2905526 2974961 3045745 3115430 3187382 3264981 3345450 3425425
56007 3425425 3507606 3595627 3687419 3780208 3877075 3981884 4092811 4207591 4329645 4461911
55997 4461911 4600396 4741448 4889577 5050140 5220401 5396291 5581721 5782083 5994754
55988 5994754 6215565 6448471 6699055 6965088 7243811 7541679 7865871 8213206 8579116
55979 8579116 8970245 9395886 9854889 10344642 10875062 11459274 12098660 12792600 13554647
55970 13554647 14402809 15343360 16382701 17545986 18864752 20357076 22042742 23968532
55962 23968532 26196227 28779425 31780941 35300718 39455996 44350686 50106656 56919000
$$ packed form
56029B129172L9363L8106L9307M3006M4896M5037M7872N3230N6179N6339N8280
56018B650787O2281O3913O3308O5237O9435P0784O9685P1952P7599Q0469P9975
56007C425425Q2181Q8021R1792R2789R6867J04809J10927J14780J22054J32266
55997D461911J38485J41052J48129J60563J70261J75890J85430K00362K12671
55988E994754K20811K32906K50584K66033K78723K97868L24192L47335L65910
55979H579116L91129M25641M59003M89753N30420N84212O39386O93940P62047
55970A3554647Q48162R40551J039341J163285J318766J492324J685666J925790
55962B3968532K227695K583198L001516L519777M155278M894690N755970O812344
$$ plain form
55954 56919000 65049364 74795495 86530488 100758040 118076612 139153264 164852640
55947 164852640 196234874 233835564 276260203 319209165 356177829 380788496 389294726
55940 389294726 381712369 361185359 332336944 299650604 266528401 235108033 206524399
55933 206524399 181232004 159223529 140206261 123791051 109623365 97399578 86837270
55926 86837270 77683381 69738341 62842097 56844681 51608977 47026907 43008088 39459575
55918 39459575 36295012 33455468 30903391 28602519 26518356 24629385 22919602 21363553
55910 21363553 19932158 18608359 17384346 16248601 15188351 14200004 13284598 12436286
55902 12436286 11645855 10911300 10234087 9608674 9025898 8483035 7980817 7514259 7076072
$$ packed form
55954E6919000Q130364R746131J1734993J4227552J7318572K1076652K5699376
55947A64852640L1382234L7600690M2424639M2948962L6968664K4610667Q506230
55940C89294726p582357k0527010k8848415l2686340l3122203l1420368k8583634
55933B06524399k5292395k2008475j9017268j6415210j4167686j2223787j0562308
55926H6837270r153889p945040o896244n997416n235704m582070m018819l548513
55918C9459575l164563k839544k552077k300872k084163j888971j709783j556049
55910B1363553j431395j323799j224013j135745j060250r88347r15406q48312
55902A2436286p90431p34555o77213o25413n82776n42863n02218m66558m38187
$$ plain form
55893 7076072 6665698 6285564 5931758 5597639 5283518 4993589 4726060 4475210 4240621
55884 4240621 4025458 3827680 3641437 3465470 3302091 3149673 3004037 2865857 2739129
55875 2739129 2623440 2514788 2412806 2320349 2237095 2160128 2089637 2027667 1972286 1919084 1867324
55864 1867324 1818858 1772478 1725330 1678574 1635689 1596454 1558461 1523271 1495046 1473869 1455948
55853 1455948 1439214 1423097 1404056 1377493 1343801 1307299 1269987 1231525 1194104 1161413 1133147
55842 1133147 1106094 1080276 1058664 1041131 1024191 1006748 990912 976943 962420 946732 931672
55831 931672 917133 900680 881841 862737 844256 825504 806977 790248 774447 756987 737770
55820 737770 718945 700780 681715 662229 644627 629102 614023 599925 589165 581613 574711 567856
$$ packed form
55893G076072m10374l80134l53806l34119l14121k89929k67529k50850k34589
55884D240621k15163j97778j86243j75967j63379j52418j45636j38180j26728
55875B739129j15689j08652j01982r2457q3254p6967p0491o1970n5381n3202n1760
55864A867324m8466m6380m7148m6756m2885l9235l7993l5190k8225k1177j7921
55853A455948j6734j6117j9041k6563l3692l6502l7312l8462l7421l2691k8266
55842A133147k7053k5818k1612j7533j6940j7443j5836j3969j4523j5688j5060
55831I31672j4539j6453j8839j9104j8481j8752j8527j6729j5801j7460j9217
55820G37770j8825j8165j9065j9486j7602j5525j5079j4098j0760p552o902o855
$$ plain form
55808 567856 562800 559673 556583 553379 551939 552424 552972 553287 554873 557484 559052 559231 559320 558540 554312 546615
55792 546615 538218 530076 520342 508540 496920 486774 476990 467235 459121 453118 447398 440905 434868
55779 434868 430517 427857 427074 428173 428783 425370 417240 406657 394784 380756 365163 350936 339747
55766 339747 330529 322396 316061 311422 306757 301424 296722 293086 289013 283660 278022 272724 267145 261429
55752 261429 256783 253034 248479 242877 237967 234358 230618 226240 222661 220386 217881 214485 211726 210482
55738 210482 209313 206976 204331 202475 201165 200302 200811 202765 204555 205073 204929 204619 203440 201104 198419
55723 198419 195528 191496 186460 182115 179136 176225 172654 169603 167954 166846 165521 164616 164516 164375 163909
55708 163909 164299 166229 168853 171737 175890 181767 188022 193335 197693 200823 201371 199026 195772 193682 192865
$$ packed form
55808E67856n056l127l090l204j440M85N48L15J586K611J568J79Q9p80m228p697
55792E46615q397q142r734j1802j1620j0146r784r755q114o003n720o493o037
55779D34868m351k660p83J099O10l413q130j0583j1873j4028j5593j4227j1189
55766C39747r218q133o335m639m665n333m702l636m073n353n638n298n579n716
55752B61429m646l749m555n602m910l609l740m378l579k275k505l396k759j244
55738B10482j169k337k645j856j310q63N09J954J790N18j44l10j179k336k685
55723A98419k891m032n036m345k979k911l571l051j649j108j325r05j00j41m66
55708A63909L90J930K624K884M153N877O255N313M358L130N48k345l254k090q17
$$ plain form
55693 192865 192695 193413 195257 197463 199439 201705 204573 207100 208336 208481 207996 206717 204630 202270 199780
55678 199780 196796 193781 192039 191893 192380 193129 194876 197651 200260 202166 204031 205778 206225 205467 205527 207533
55662 207533 210132 211876 213297 215278 217134 217815 217612 217322 216929 216328 216145 216777 217696 218519 219505 220261 219407
55645 219407 216357 212065 207292 201696 195336 189299 183878 177871 170783 164018 158759 154269 149512 144805
55631 144805 140584 136096 130674 125020 119993 115381 110913 107087 103957 100675 97278 95257 95108 95060 93645
55616 93645 91853 91179 91154 90520 89430 88660 87849 86328 84673 83819 83527 83199 83126 83496 83339 82030 80733 80654
55598 80654 80936 80032 78218 76895 76180 75071 73458 72189 71470 70747 69905 69195 68354 67078 65991 65871 66229
55581 66229 65833 64336 62431 60718 59367 58488 57938 57156 55867 54491 53414 52641 52600 54130 56985 59621
$$ packed form
55693A92865j70P18J844K206J976K266K868K527J236J45m85j279k087k360k490
55678A99780k984l015j742j46M87P49J747K775K609J906J865J747M47p58O0K006
55662B07533K599J744J421J981J856O81k03k90l93o01j83O32R19Q23R86P56q54
55645B19407l050m292m773n596o360o037n421o007p088o765n259m490m757m707
55631A44805m221m488n422n654n027m612m468l826l130l282l397k021j49m8j415
55616I3645j792o74k5o34j090p70q11j521j655q54k92l28p3L70j57j309j297p9
55598H0654K82r04j814j323p15j109j613j269p19p23q42p10q41j276j087j20L58
55581F6229l96j497j905j713j351q79n50p82j289j376j077p73m1J530K855K636
$$ plain form
55565 59621 61302 63091 65736 68057 68805 68721 69178 69942 69929 69241 68636 67796 65871 63244 61177 60109 59620
55548 59620 59485 59484 58838 57277 56085 56668 58594 60367 61503 62486 63325 63664 63861 64547 65591 66781 68876
55531 68876 72518 76713 79950 82338 85089 88386 91453 94376 98042 102399 106431 109984 114142 119684
55517 119684 126330 133405 139960 144351 145138 142535 137909 131951 124493 115900 107293 99284 91720 84705
55503 84705 78745 73782 69163 64678 60679 57163 53719 50424 47881 46318 45470 45187 45303 45101 43956
55488 43956 42444 41830 42418 43270 43560 43400 43358 43894 45244 47166 48877 49788 50079 50101 49697 48748 47794 47268
55470 47268 46618 45057 42694 40085 37249 34114 31364 29744 28969 28310 27741 27508 27145 26097 24838 24127
55454 24127 23690 22884 22124 22269 22973 23096 22458 21810 21343 20676 20132 20495 21489 21932 21467 20898 20777 20852 20926 21062
$$ packed form
55565E9621J681J789K645K321P48q4M57P64j3o88o05q40j925k627k067j068m89
55548E9620j35jo46j561j192N83J926J773J136R83Q39L39J97O86J044J190K095
55531F8876L642M195L237K388K751L297L067K923L666M357M032L553M158N542
55517A19684O646P075O555M391P87k603m626n958p458q593q607q009p564p015
55503H4705n960m963m619m485l999l516l444l295k543j563q48k83J16k02j145
55488D3956j512o14N88Q52K90j60m2N36J350J922J711R11K91K2m04r49r54n26
55470D7268o50j561k363k609k836l135k750j620p75o59n69k33l63j048j259p11
55454B4127m37q06p60J45P04J23o38o48m67o67n44L63R94M43m65n69j21P5P4J36
$$ plain form
55434 21062 20950 20247 19500 19570 20259 20690 20888 21647 22958 24021 24781 25951 27384 27926 27217 26274 25933 25978
55416 25978 26140 26724 27757 28637 29045 29329 29656 29710 29447 29282 29372 29561 29971 30675 30985 30218 29063 28867 29603
55397 29603 29982 29557 29158 29045 28354 26887 25826 25957 26542 26676 26492 26281 25691 24648 23929 23956 23993 23411 22785
55378 22785 22853 23262 23249 22861 22620 22579 22535 22632 23080 23667 24088 24353 24428 24083 23468 23223 23589 24066 24299 24547 24866
55357 24866 24716 23924 23258 23331 23634 23353 22544 21824 21481 21579 22394 23917 25312 25622 24818 23637 22661 22066 21927
55338 21927 22099 21985 21008 19300 17604 16548 16279 16640 17388 18266 19047 19468 19229 18297 17159 16451 16304 16374
55320 16374 16435 16525 16581 16445 16240 16269 16540 16879 17496 18887 21094 23574 25776 27384 28110 27922 27414 27257 27257
55301 27257 26729 25788 25407 26031 26951 27348 27228 27013 26870 26775 26710 26546 26229 26185 26915 28069 28615 28119 27188 26493
$$ packed form
55434B1062j12p03p47P0O89M31J98P59J311J063P60J170J433N42p09r43l41M5
55416B5978J62N84J033Q80M08K84L27N4k63j65R0J89M10P04L10p67j155j96P36
55397B9603L79m25l99j13o91j467j061J31N85J34j84k11n90j043p19K7L7n82o26
55378B2785O8M09j3l88k41m1m4R7M48N87M21K65P5l45o15k45L66M77K33K48L19
55357B4866j50p92o66P3L03k81q09p20l43R8Q15J523J395L10q04j181r76n95j39
55338B1927J72j14r77j708j696j056k69L61P48Q78P81M21k39r32j138p08j47P0
55320A6374O1R0N6j36k05K9K71L39O17J391K207K480K202J608P26j88n08j57%
55301B7257n28r41l81O24R20L97j20k15j43r5o5j64l17m4P30J154N46m96r31o95
$$ plain form
55281 26493 26046 25709 25657 25979 26400 26726 27090 27569 28053 28585 29228 29527 28808 27175 25526 24457 23894 23888 24846
55262 24846 26658 28449 29621 30403 31000 30998 30116 28849 27779 26764 25365 23682 22298 21657 21795 22380 22887
55245 22887 22991 22822 22497 21630 19924 18068 17210 17549 18255 18798 19402 20173 20752 21086 21547 22046 21948 21130 20154
55226 20154 19204 17939 16721 16747 18347 20242 21109 20958 20333 19277 17914 17142 17705 19207 20824 22434
55210 22434 24266 26037 27235 27883 28381 28927 29521 30073 30226 29658 28839 28628 28869 28382 26884 25727 25920
55193 25920 26555 26244 25213 24741 25204 25925 26479 26903 26920 26170 25114 24704 25137 25749 26081 26307 26621 26890 26948
55174 26948 26750 26335 26001 26291 27361 28637 29468 29860 30206 30663 31177 31628 31522 30133 27574 25222 24395
55157 24395 24979 25953 26774 27561 28398 29276 30373 31655 32441 32100 30972 29949 29447 29420 30008 31275 32503
$$ packed form
55281B6493m47l37n2L22M21L26L64M79M84N32O43K99p19j633j649j069n63oR58
55262B4846J812J791J172P82N97kq82j267j070j015j399j683j384o41J38N85N07
55245B2887J04j69l25q67j706j856q58L39P06N43O04P71N79L34M61M99r8q18r76
55226B0154r50j265j218K6J600J895Q67j51o25j056j363p72N63J502J617J610
55210B2434J832J771J198O48M98N46N94N52J53n68q19k11K41m87j498j157J93
55193B5920O35l11j031m72M63P21N54M24J7p50j056m10M33O12L32K26L14K69N8
55174B6948j98m15l34K90J070J276Q31L92L46M57N14M51j06j389k559k352q27
55157B4395N84R74Q21P87Q37Q78J097J282P86l41j128j023n02k7N88J267J228
$$ plain form
55140 32503 32620 31473 30081 29566 30253 31657 32868 33104 32376 31643 31917 33281 35025 36442 37177 37189 36837
55123 36837 36786 37393 38423 39673 41400 43672 45727 46623 46310 45522 44817 44172 43363 42294 41070 40019 39447
55106 39447 39240 39036 38871 39127 39716 40026 39936 40114 40930 41896 42614 43363 44153 44166 43035 41838 41825 42813 43843
55087 43843 44780 46159 47935 49459 50442 50983 51038 50763 50948 52109 53527 54242 54557 55429 56741 57482 57423 57263
55069 57263 57148 56392 54894 53613 53282 53616 54108 54713 55435 56005 56276 56327 56022 55163 54149 53708 53822 53651
55051 53651 52747 51623 50923 50714 50790 51026 51196 50984 50368 49588 48768 48099 48191 49460 51196 52155 52208 52503 53767
55032 53767 55304 56079 56047 55934 56280 57145 58303 59330 59856 59991 60165 60429 60408 60090 60076 60689 61378 61383 60625 59587
55012 59587 58681 58073 57821 57783 57558 56868 55899 55078 54538 53998 53182 52326 52198 53402 55605 57689 58823 59133
$$ packed form
55140C2503J17j147j392n15O87J404J211K36p28p33K74J364J744J417P35J2l52
55123C6837n1O07J030J250J727K272K055Q96l13p88p05o45q09j069j224j051n72
55106C9447k07k04j65K56N89L10r0J78Q16R66P18P49P90J3j131j197j3R88J030
55087D3843R37J379J776J524R83N41N5k75J85J161J418P15L15Q72J312P41n9j60
55069E7263j15p56j498j281l31L34M92O05P22N70K71N1l05q59j014m41J14j71
55051E3651r04j124p00k09P6K36J70k12o16p80q20o69R2J269J736R59N3K95J264
55032E3767J537P75l2j13L46Q65J158J027N26J35J74K64k1l18j4O13O89Np58j038
55012E9587r06o08k52l8k25o90r69q21n40n40q16q56j28J204K203K084J134L10
$$ plain form
54994 59133 59095 58679 57585 56067 54926 54644 54981 55380 55454 55112 54553 54201 54403 55274 56882 59181 61516 62748
54976 62748 62457 61661 61703 62679 63557 63648 63255 62979 63037 63338 63759 64345 65508 67776 70961 73926 75760 76910
54958 76910 78603 81466 85304 89823 94760 99578 103966 108543 114280 121326 129121 137458 146472 155684
54944 155684 164020 170911 176511 180709 182735 181989 178602 173046 165816 157567 148870 139783 130281 121066
54930 121066 113240 107111 102066 97621 93844 90714 87910 85372 83331 81680 80008 78358 77165 76454
54916 76454 75882 75613 76287 78046 80431 83310 86956 91169 95418 100031 106143 114092 122927 131808 140797
54901 140797 149764 157679 163704 168020 170837 171442 169060 163996 157198 149344 140985 132937 125724 119053
54887 119053 112508 106245 100540 95236 90269 86149 83219 80945 78611 76269 74340 72791 71404 70464
$$ packed form
54994E9133l8m16j094j518j141k82L37L99P4l42n59l52K02Q71J608K299K335J232
54976F2748k91p96M2R76Q78R1l93k76N8L01M21N86J163K268L185K965J834J150
54958G6910J693K863L838M519M937M818M388M577N737P046P795Q337R014R212
54944A55684Q336O891N600M198K026p46l387n556p230q249q697r087r502r215
54930A21066p826o129n045m445l777l130k804k538k041j651j672j650j193p11
54916G6454n72k69O74J759K385K879L646M213M249M613O112P949Q835Q881Q989
54901A40797Q967P915O025M316K817O05k382n064o798p854q359q048p213o671
54887A19053o545o263n705n304m967m120k930k274k334k342j929j549j387r40
$$ plain form
54873 70464 70356 70734 70854 70543 70191 69872 69132 67678 65834 64234 63244 62606 61605 59892 58173 57593 58279
54856 58279 59069 58901 57880 56621 55308 53906 52634 51595 50452 49134 48369 48772 49812 50436 50426 50347 50312
54839 50312 49615 47715 45057 42824 42060 42882 44334 45222 45344 45549 46412 47441 48026 48527 49732 51647 53548
54822 53548 54964 55854 56052 55397 54382 53962 54514 55473 56099 56219 56165 56393 57290 59088 61774 65145 68844
54805 68844 72350 75218 77521 79818 82533 85665 89215 93385 98125 103059 108247 114480 122276 131077
54791 131077 140038 149125 158668 168194 176506 182765 186787 188381 187245 183581 178198 171891 165170 158551
54777 158551 152520 147133 142131 137467 133293 129492 125759 122171 119128 116721 114703 113144 112459 112612 112876
54762 112876 112750 112669 113459 115425 118297 121825 126055 131186 137478 145193 154376 164677 175586 186838
$$ packed form
54873G0464j08L78J20l11l52l19p40j454j844j600r90o38j001j713j719n80O86
54856E8279P90j68j021j259j313j402j272j039j143j318p65M03J040O24j0p9l5
54839E0312o97j900k658k233p64Q22J452Q88J22K05Q63J029N85N01J205J915J901
54822E3548J416Q90J98o55j015m20N52R59O26J20n4K28Q97J798K686L371L699
54805F8844L506K868K303K297K715L132L550M170M740M934N188O233P796Q801
54791A31077Q961R087R543R526Q312O259M022J594j136l664n383o307o721o619
54777A58551o031n387n002m664m174l801l733l588l043k407k018j559o85J53K64
54762A12876j26q1P90J966K872L528M230N131O292P715R183J0301J0909J1252
$$ plain form
54748 186838 198470 210361 221793 231548 238481 242022 242159 239196 233691 226436 218072 208667 198042
54735 198042 186602 175443 165391 156400 148177 140961 135132 130325 125621 120610 115759 111607 108102
54722 108102 104922 102077 99847 98274 96951 95322 93121 90552 88093 86075 84467 83083 81934 81235
54708 81235 81048 81057 80839 80364 80105 80496 81356 82065 82378 82715 83468 84374 84974 85382 86063 86992 87652 87847 87878 87821
54688 87821 87298 86250 85352 85268 85888 86615 87035 87036 86729 86608 87329 88900 90416 91066 91104 91391 92273 93421 94625
54669 94625 96200 98565 101725 105149 108017 109744 110533 111283 112752 114932 117350 119666 121784 123649 125301
54654 125301 126968 128819 130734 132454 133814 134846 135926 137873 141407 146357 151852 157450 163543 170422
54640 170422 177609 184584 191529 198697 205557 211328 216038 220186 223443 224473 222245 217040 210079 202563
$$ packed form
54748A86838J1632J1891J1432R755O933L541J37k963n505p255q364r405j0625
54735A98042j1440j1159j0052q991q223p216n829m807m704n011m851m152l505
54722A08102l180k845k230j573j323j629k201k569k459k018j608j384j149o99
54708H1235j87Rk18m75k59L91Q60P09L13L37P53R06O00M08O81R29O60J95L1n7
54688H7821n23j048q98q4O20P27M20Jl07j21P21J571J516O50L8K87Q82J148J204
54669I4625J575K365L160L424K868J727P89P50J469K180K418K316K118J865J652
54654A25301J667J851J915J720J360J032J080J947L534M950N495N598O093O879
54640A70422P187O975O945P168O860N771M710M148L257J030k228n205o961p516
$$ plain form
54626 202563 195170 188050 181054 174048 167110 160476 154444 149301 145033 141113 136975 132816 129444 127123
54612 127123 125114 122671 119920 117354 115067 113064 111765 111403 111305 110514 108914 107073 105251 103295 101371
54597 101371 99949 98978 97818 96120 94223 92498 90785 88731 86449 84614 83918 84314 84781 84167 82387
54582 82387 80363 78617 76643 74138 72108 71755 72711 73416 73086 72352 71958 71847 71726 71686 71898 72318 72962 73928
54564 73928 74896 75153 74435 73333 72567 72216 71874 71311 70740 70659 71450 72932 74316 74921 74912 75017 75549 76094 76188
54545 76188 75908 75684 75888 76644 77815 79118 80474 82171 84472 87163 89871 92615 95698 99143 102698
54530 102698 106312 110162 114165 117865 120839 122911 123985 124030 123240 121952 120399 118697 116907 114897 112412
54515 112412 109514 106657 103984 101001 97384 93733 90949 89213 88151 87535 87056 85857 83318 80140 77699
$$ packed form
54626B02563p393p120o996p006o938o634o032n143m268l920m138m159l372k321
54612A27123k009k443k751k566k287k003j299l62r8p91j600j841j822j956j924
54597A01371j422r71j160j698j897j725j713k054k282j835o96L96M67o14j780
54582H2387k024j746j974k505k030l53R56P05l30p34l94j11j21m0K12M20O44R66
54564G3928R68K57p18j102p66l51l42n63n71q1P91J482J384O05rJ05N32N45R4
54545G6188k80k24K04P56J171J303J356J697K301K691K708K744L083L445L555
54530A02698L614L850M003L700K974K072J074M5p90j288j553j702j790k010k485
54515A12412k898k857k673k983l617l651k784j736j062o16m79j199k539l178k441
$$ plain form
54500 77699 76363 75399 74485 74199 74793 75521 75698 75600 75774 76102 76084 75624 75019 74497 74065 73606 72977 72243 71832
54481 71832 72135 72978 73931 75015 76542 78362 79936 81146 82279 83199 83328 82674 82071 82102 82459 82649 82646 82558
54463 82558 82332 82128 82312 82764 82856 82443 82122 82134 81799 80584 78967 77576 76201 74491 73029 72724 73439 74146
54445 74146 74321 74362 74649 75025 75365 75946 76865 77499 77029 75408 73535 72403 72210 72465 72862 73721 75321 77186
54427 77186 78457 78809 78504 77694 76332 74796 73864 73861 74388 75079 76026 77221 78239 78865 79479 80452 81659 82905
54409 82905 84306 85852 87159 88080 89033 90283 91473 92362 93461 95306 97626 99877 102126 104654 107083
54394 107083 108834 110136 111707 113525 114796 115156 115045 114821 114289 113371 112484 111854 111108 109998 109052 108928 109343
54377 109343 109203 107815 105615 103647 102559 102179 101935 101500 101012 100740 100611 100163 99012 97307 95666 94583
$$ packed form
54500G7699j336r64r14k86N94P28J77r8J74L28j8m60o05n22m32m59o29p34m11
54481G1832L03Q43R53J084J527J820J574J210J133R20J29o54o03L1L57J90lq8
54463H2558k26k04J84M52R2m13l21J2l35j215j617j391j375j710j462l05P15P07
54445G4146J75M1K87L76L40N81R19O34m70j621j873j132j93K55L97Q59J600J865
54427G7186J271L52l05q10j362j536r32lN27O91R47J195J018O26O14R73J207J246
54409H2905J401J546J307R21R53J250J190Q89J099J845K320K251K249K528K429
54394A07083J751J302J571J818J271L60j11k24n32r18q87o30p46j110r46j24M15
54377A09343j40j388k200j968j088l80k44m35m88k72j29m48j151j705j641j083
$$ plain form
54361 94583 93954 93286 92413 91790 91954 92843 93853 94479 94623 94365 93813 93263 93191 93871 95124 96555 97974 99547
54343 99547 101561 104001 106331 107863 108485 108793 109351 110122 110938 112036 113515 114582 114157 112266 110084 108482
54327 108482 107197 105628 103768 101951 100208 98288 96012 93359 90529 88074 86567 85919 85457 84852 84444
54312 84444 84368 83924 82305 79683 77118 75516 74919 74688 74192 73365 72586 71951 70943 69218 67415 66518 66549
54295 66549 66593 66083 65277 64484 63791 63647 64640 66273 67080 66495 65684 65816 66400 66185 64976 63634 62799 62485
54277 62485 62486 62378 61514 59785 57996 56843 56004 54953 54119 54280 55283 56334 57203 58141 58910 59030 58853 59251
54259 59251 60201 60789 60776 61139 62619 64595 65862 65939 65212 64297 63653 63480 63677 64065 64698 65651 66556 66766 66102
54240 66102 65084 64415 64497 65369 66653 67603 67625 66800 65655 64597 63895 63894 64656 65532 65751 65369 65053 65000 64809
$$ packed form
54361I4583o29o68q73o23J64Q89J010O26J44k58n52n50p2O80J253J431J419J573
54343I9547K014K440K330J532O22L08N58P71Q16J098J479J067m25j891k182j602
54327A08482j285j569j860j817j743j920k276k653k830k455j507o48m62o05m08
54312H4444p6m44j619k622k565j602n97k31m96q27p79o35j008j725j803q97L1
54295F6549M4n10q06p93o93j44R93J633Q07n85q11J32N84k15j209j342q35l14
54277F2485Jj08q64j729j789j153q39j051q34J61J003J051Q69R38P69J20j77L98
54259E9251R50N88j3L63J480J976J267P7p27r15o44j73J97L88O33R53R05K10o64
54240F6102j018o69Q2Q72J284R50K2q25j145j058p02jP62Q76K19l82l16n3j91
$$ plain form
54221 64809 64383 64189 64441 64726 64697 64496 64245 63738 63045 62849 63656 65004 65924 65984 65564 65292 65561 66389 67474
54202 67474 68438 69197 69970 70839 71516 71788 71935 72393 73041 73151 72266 70930 70219 70520 71120 71188 70846 70789 71076
54183 71076 71019 70289 69392 68750 68121 67387 67200 68090 69373 69817 69118 68006 67146 66670 66618 66989 67382 67330 67086
54164 67086 67398 68477 69789 70914 71925 72880 73596 74049 74404 74569 74307 73856 73742 73853 73473 72450 71572
54147 71572 71449 71786 72199 72953 74215 75164 74727 72972 71030 69751 69004 68348 67771 67518 67543 67427 66765 65502
54129 65502 63943 62495 61464 60963 60896 61004 61119 61411 62091 62807 62733 61554 60059 59324 59631 60534 61624 62566
54111 62566 62733 61743 60344 59955 61085 62807 63948 64130 63502 62253 60824 59939 59882 60130 60167 60236 60854 61923
54093 61923 62804 63065 62727 61994 61172 60725 60983 61746 62421 62555 62140 61559 61368 61939 63084 64114 64457 64174
$$ packed form
54221F4809m26j94K52K85k9k01k51n07o93j96Q07J348R20O0m20k72K69Q28J085
54202F7474R64P59P73Q69O77K72J47M58O48J10q85j336p11L01O00O8l42n7K87
54183G1076n7p30q97o42o29p34j87Q90J283M44o99j112q60m76n2L71L93n2k44
54164F7086L12J079J312J125J011R55P16M53L55J65k62m51j14J11l80j023q78
54147G1572j23L37M13P54J262R49m37j755j942j279p47o56n77k53K5j16o62j263
54129F5502j559j448j031n01o7J08J15K92O80P16p4j179j495p35L07R03J090R42
54111F2566J67r90j399l89J130J722J141J82o28j249j429q85n7K48L7O9O18J069
54093F1923Q81K61l38p33q22m47K58P63O75J34m15n81j91N71J145J030L43k83
$$ plain form
54075 64174 63756 63537 63474 63439 63589 64338 65884 67781 69261 70075 70792 71991 73455 74578 75331 76311 77846
54058 77846 79568 80863 81338 80897 79929 79413 80226 82160 84120 85437 86456 87683 88989 89999 90769 91625
54042 91625 92708 94051 95866 98371 101499 104968 108417 111440 113901 116355 119749 124488 130099 135913
54028 135913 141592 146848 151354 155282 159386 164038 168662 172600 176116 179860 183708 186840 188884 190337
54014 190337 191865 193709 195770 197804 199332 199795 198987 197259 195270 193621 192576 191755 190221 187230 183104
53999 183104 179135 176444 174964 173583 171209 167636 163518 159686 156563 154092 151949 149750 147317 144910
53985 144910 143099 142171 141851 141736 141746 141874 141848 141560 141468 141959 142458 141974 140559 139377 139090 138944 137871 135869
53967 135869 133808 132375 131703 131636 131800 131680 131086 130414 130150 130295 130492 130433 129942 129058 128291 128379 129419 130658
$$ packed form
54075F4174m18k19o3l5J50P49J546J897J480Q14P17J199J464J123P53R80J535
54058G7846J722J295M75m41r68n16Q13J934J960J317J019J227J306J010P70Q56
54042I1625J083J343J815K505L128L469L449L023K461K454L394M739N611N814
54028A35913N679N256M506L928M104M652M624L938L516L744L848L132K044J453
54014A90337J528J844K061K034J528M63q08j728j989j649j045q21j534k991m126
53999A83104l969k691j480j381k374l573m118l832l123k471k143k199k433k407
53985A44910j811r28l20j15J0J28k6k88r2M91M99m84j415j182k87j46j073k002
53967A35869k061j433o72o7J64j20n94o72k64J45J97n9m91q84p67Q8J040J239
$$ plain form
53949 130658 131516 132393 133954 136024 137880 139378 141065 143240 145553 147685 149917 152749 156283 160220 164277
53934 164277 168364 172327 175678 177766 178353 177868 176933 175790 174517 173606 173726 174857 176205 177196 178017 178995
53918 178995 180087 181363 183428 186806 191249 196088 200948 205690 210050 213859 217413 221188 225441 230381
53904 230381 236306 243045 249615 255046 259281 262751 265366 266613 266480 265611 264528 263279 261825 260267 258620
53889 258620 256758 254683 252468 249976 246933 243218 238813 233634 227766 221654 215691 209763 203644 197635
53875 197635 192315 187794 183704 179801 176060 172341 168500 164783 161589 158870 156308 153946 152041 150311
53861 150311 148037 145037 141911 139151 136590 133905 131132 128416 125756 123259 121195 119554 117964 116325
53847 116325 115034 114307 113672 112599 111283 110403 110258 110531 110741 110587 110001 109198 108600 108377 108112 107204 105625
$$ packed form
53949A30658Q58Q77J561K070J856J498J687K175K313K132K232K832L534L937M057
53934A64277M087L963L351K088N87m85r35j143j273r11J20J131J348R91Q21R78
53918A78995J092J276K065L378M443M839M860M742M360L809L554L775M253M940
53904B30381N925O739O570N431M235L470K615J247j33q69j083j249j454j558j647
53889B58620j862k075k215k492l043l715m405n179n868o112n963n928o119o009
53875A97635n320m521m090l903l741l719l841l717l194k719k562k362j905j730
53861A50311k274l000l126k760k561k685k773k716k660k497k064j641j590j639
53847A16325j291p27o35j073j316q80j45K73K10j54n86q03n98k23k65r08j579
$$ plain form
53830 105625 103996 102823 101974 101086 100293 100208 101153 102691 104111 105183 106131 107012 107505 107467 107266 107400 107957 108707
53812 108707 109454 110145 110827 111744 113208 115168 117150 118876 120645 122801 125158 127407 129750 132632 136016
53797 136016 139487 142900 146451 150276 154582 159963 166749 173999 179985 183988 186969 190154 193615 196706
53783 196706 199314 201955 204858 207589 209647 211029 212136 213313 214515 215263 214979 213481 211148 208523 205875
53768 205875 203220 200634 198377 196728 195744 195160 194487 193244 191155 188199 184630 180999 177963 175840 174440
53753 174440 173430 172657 171871 170454 167915 164637 161650 159589 158242 157184 156350 155782 155225 154335 153071 151568
53737 151568 149794 147670 145456 143712 142736 142250 141775 141256 141108 141576 142247 142456 142110 141758 141790 142004 142156 142502
53719 142502 143370 144566 145708 146925 148605 150556 152026 152650 152861 153229 153862 154618 155403 156085 156529 156999 158165
$$ packed form
53830A05625j629j173q49q88p93q5R45J538J420J072R48Q81M93l8k01J34N57P50
53812A08707P47O91O82R17J464J960J982J726J769K156K357K249K343K882L384
53797A36016L471L413L551L825M306N381O786P250N986M003K981L185L461L091
53783A96706K608K641K903K731K058J382J107J177J202P48k84j498k333k625k648
53768B05875k655k586k257j649r84n84o73j243k089k956l569l631l036k123j400
53753A74440j010p73p86j417k539l278k987k061j347j058q34n68n57q90j264j503
53737A51568j774k124k214j744r76m86m75n19j48M68O71K09l46l52L2K14J52L46
53719A42502Q68J196J142J217J680J951J470O24K11L68O33P56P85O82M44M70J166
$$ plain form
53702 158165 160393 163254 165993 168238 170018 171379 172350 173182 174243 175630 177044 178114 178799 179502 180795
53687 180795 182966 185817 188894 191794 194202 195846 196738 197351 198226 199411 200562 201562 202662 203957 205112
53672 205112 205729 205741 205329 204735 204244 204104 204278 204480 204556 204623 204873 205443 206467 207842 208936 208963 207923 206782
53654 206782 206471 206914 207299 207038 206172 205044 203894 202739 201478 200139 199123 199029 200054 201675 203021 203530
53638 203530 203198 202430 201782 201742 202544 204176 206535 209435 212443 214899 216272 216551 216308 216384 217370 219126 220852
53621 220852 221845 222210 222700 223919 225896 228302 230764 232973 234856 236711 238908 241405 243850 246127 248485
53606 248485 251036 253546 255842 258131 260763 263939 267742 272101 276580 280532 283711 286526 289545 292953
53592 292953 296583 300230 303792 307342 311162 315433 319785 323466 326115 328143 330173 332364 334465 336272
$$ packed form
53702A58165K228K861K739K245J780J361R71Q32J061J387J414J070O85P03J293
53687A80795K171K851L077K900K408J644Q92O13Q75J185J151J000J100J295J155
53672B05112O17J2m12n94m91j40J74K02P6O7K50N70J024J375J094K7j040j141
53654B06782l11M43L85k61q66j128j150j155j261j339j016r4J025J621J346N09
53638B03530l32p68o48m0Q02J632K359K900L008K456J373K79k43P6R86J756J726
53621B20852R93L65M90J219J977K406K462K209J883J855K197K497K445K277K358
53606B48485K551K510K296K289K632L176L803M359M479L952L179K815L019L408
53592B92953L630L647L562L550L820M271M352L681K649K028K030K191K101J807
$$ plain form
53578 336272 337760 338941 339809 340413 340910 341548 342502 343582 344266 344276 343923 343524 342758 341222 339483 338768 339456
53561 339456 340574 340996 340448 339098 337014 334606 332855 332347 332514 332534 332566 333363 334940 336437 337249 337590 337915
53544 337915 338368 338935 339723 340923 342678 344901 347033 348270 348453 348497 349440 351230 353017 354504 356358 359238
53528 359238 363008 367118 371274 375466 379738 384237 389257 395007 401396 408189 415220 422443 429919 437836
53514 437836 446342 455360 464678 474268 484335 495038 506340 518166 530561 543645 557511 572141
53502 572141 587343 602884 618859 635823 654320 674298 695174 716394 737736 759132 780511
53491 780511 801878 823351 845026 866871 888713 910239 931126 951399 971612 992424 1014023
53480 1014023 1036155 1058668 1081748 1105494 1129504 1153071 1175800 1197948 1220124 1242610 1265002
$$ packed form
53578C36272J488J181Q68O04M97O38R54J080O84J0l53l99p66j536j739p15O88
53561C39456J118M22n48j350k084k408j751n08J67K0L2P97J577J497Q12L41L25
53544C37915M53N67P88J200J755K223K132J237J83M4R43J790J787J487J854K880
53528C59238L770M110M156M192M272M499N020N750O389O793P031P223P476P917
53514D37836Q506R018R318R590J0067J0703J1302J1826J2395J3084J3866J4630
53502E72141J5202J5541J5975J6964J8497J9978K0876K1220K1342K1396K1379
53491G80511K1367K1473K1675K1845K1842K1526K0887K0273K0213K0812K1599
53480A014023K2132K2513K3080K3746K4010K3567K2729K2148K2176K2486K2392
$$ plain form
53469 1265002 1286592 1307046 1326467 1344785 1361502 1376322 1389756 1402617 1415024 1426356 1436278
53458 1436278 1445330 1454174 1462569 1469448 1473950 1476030 1475990 1473822 1469330 1462737 1454697 1445590 1435239 1423553
53444 1423553 1411076 1398389 1385215 1370704 1354575 1337360 1319484 1300742 1280936 1260412 1239618
53433 1239618 1218631 1197514 1176653 1156302 1136252 1116540 1098050 1081772 1067668 1054864 1042793
53422 1042793 1031553 1021328 1012159 1004238 997799 992652 988464 985520 984583 985812 988394 991462 994885 999030
53408 999030 1004344 1011511 1021402 1034251 1049099 1064572 1080145 1096319 1113716 1132405 1152165 1173043
53396 1173043 1195441 1219777 1246132 1274247 1303777 1334516 1366457 1399812 1435017 1472549 1512498
53385 1512498 1554378 1597517 1641581 1686592 1732702 1780279 1830011 1882393 1936962 1992410 2047617
$$ packed form
53469A265002K1590K0454J9421J8318J6717J4820J3434J2861J2407J1332R922
53458A436278R052Q844Q395O879M502K080m0k168m492o593q040r107j0351j1686
53444A423553j2477j2687j3174j4511j6129j7215j7876j8742j9806k0524k0794
53433A239618k0987k1117k0861k0351k0050j9712j8490j6278j4104j2804j2071
53422A042793j1240j0225r169p921o439n147m188k944r37J229K582L068L423M145
53408I99030N314P167R891J2849J4848J5473J5573J6174J7397J8689J9760K0878
53396A173043K2398K4336K6355K8115K9530L0739L1941L3355L5205L7532L9949
53385A512498M1880M3139M4064M5011M6110M7577M9732N2382N4569N5448N5207
$$ plain form
53374 2047617 2102281 2156481 2210060 2262710 2314368 2365115 2414824 2463145 2509679 2553828 2594520
53363 2594520 2630554 2661438 2687785 2710747 2731100 2748894 2763729 2775020 2782013 2783949 2780597 2772616
53351 2772616 2761115 2746797 2729636 2709260 2685280 2657202 2624454 2586848 2544881 2499379 2451072
53340 2451072 2400674 2349149 2297559 2246749 2197266 2149346 2102658 2056403 2010108 1964181 1919299
53329 1919299 1875435 1832014 1788917 1746748 1706032 1666731 1628785 1592647 1558958 1527942 1499375
53318 1499375 1472961 1448556 1426166 1405787 1387076 1369137 1351017 1332572 1314575 1297776 1282114
53307 1282114 1267068 1252503 1238832 1226435 1215232 1204851 1195064 1186014 1178088 1171548 1166282 1161956
53295 1161956 1158411 1155740 1154002 1153045 1152756 1153331 1155178 1158641 1163864 1170801 1179316 1189361 1201178 1215187
$$ packed form
53374B047617N4664N4200N3579N2650N1658N0747M9709M8321M6534M4149M0692
53363B594520L6034L0884K6347K2962K0353J7794J4835J1291O993J936l352p981
53351B772616j1501j4318j7161k0376k3980k8078l2748l7606m1967m5502m8307
53340B451072n0398n1525n1590n0810m9483m7920m6688m6255m6295m5927m4882
53329A919299m3864m3421m3097m2169m0716l9301l7946l6138l3689l1016k8567
53318A499375k6414k4405k2390k0379j8711j7939j8120j8445j7997j6799j5662
53307A282114j5046j4565j3671j2397j1203j0381r787r050p926o540n266m326
53295A161956l545k671j738r57k89N75J847L463N223O937Q515J0045J1817J4009
$$ plain form
53281 1215187 1231589 1250207 1270752 1293050 1316832 1341423 1365922 1389746 1412816 1435191 1456738
53270 1456738 1477316 1497132 1516583 1535662 1553705 1569849 1583574 1594730 1603379 1609944 1615321 1620310
53258 1620310 1624814 1627842 1628347 1625797 1620125 1611701 1601425 1590160 1577785 1563352 1546483 1527956 1508436
53245 1508436 1487293 1463469 1437058 1409186 1380579 1351140 1320907 1290500 1260509 1231098 1202386
53234 1202386 1174548 1147381 1120410 1093655 1067711 1042897 1018876 995376 972686 951103 930399
53223 930399 910186 890393 871026 851899 833018 814844 797760 781559 765864 750794 736860
53212 736860 724364 713189 702943 692967 682458 670992 658851 646609 634467 622196 609531 596385
53200 596385 582808 568984 555242 541980 529705 519069 510398 503020 495440 486537 476435 466034
$$ packed form
53281A215187J6402J8618K0545K2298K3782K4591K4499K3824K3070K2375K1547
53270A456738K0578J9816J9451J9079J8043J6144J3725J1156Q649O565N377M989
53258A620310M504L028N05k550n672q424j0276j1265j2375j4433j6869j8527j9520
53245A508436k1143k3824k6411k7872k8607k9439l0233l0407k9991k9411k8712
53234A202386k7838k7167k6971k6755k5944k4814k4021k3500k2690k1583k0704
53223I30399k0213j9793j9367j9127j8881j8174j7084j6201j5695j5070j3934
53212G36860j2496j1175j0246r976j0509j1466j2141j2242j2142j2271j2665j3146
53200E96385j3577j3824j3742j3262j2275j0636q671p378p580q903j0102j0401
$$ plain form
53188 466034 456028 446607 437672 428870 419633 409627 399104 388546 378156 367951 358135 348948 340365
53175 340365 332320 325045 318722 312884 306684 299840 292981 286963 282145 278381 275369 272767 270126 266993
53161 266993 263224 259205 255637 252881 250506 247727 244341 240970 238233 236065 234110 232454 231478 231177 231086
53146 231086 230856 230439 229686 228205 225894 223389 221651 221045 220904 220142 218338 216189 214762 214432 214798 215447
53130 215447 216249 216878 216685 215486 213967 212888 212267 211875 212058 213304 215248 216955 218169 219500 221259 222878
53114 222878 223831 224413 225165 226027 226587 226815 227020 227240 227189 226709 225914 224898 223614 222090 220511 219043 217736
53097 217736 216558 215364 213843 211738 209167 206550 204083 201434 198150 194358 190876 188477 187108 185959
53083 185959 184313 182172 180010 178157 176601 175217 173868 172308 170332 168106 166108 164651 163626 162784
$$ packed form
53188D66034j0006r421q935q802r237j0006j0523j0558j0390j0205r816r187q583
53175C40365q045p275o323n838o200o844o859o018m818l764l012k602k641l133
53161B66993l769m019l568k756k375k779l386l371k737k168j955j656r76l01r1
53146B31086k30m17p53j481k311k505j738o06j41p62j804k149j427l30L66O49
53130B15447Q02O29j93j199j519j079o21l92J83J246J944J707J214J331J759J619
53114B22878R53N82P52Q62N60K28K05K20n1m80p95j016j284j524j579j468j307
53097B17736j178j194j521k105k571k617k467k649l284l792l482k399j369j149
53083A85959j646k141k162j853j556j384j349j560j976k226j998j457j025q42
$$ plain form
53069 162784 162028 161274 160312 159102 158003 157341 156832 155836 154218 152563 151412 150657 149925 149180 148537 147732 146342
53052 146342 144501 142890 141889 141214 140562 140135 140178 140387 140251 139740 139208 138804 138408 138015 137705 137298 136562 135693
53034 135693 135079 134567 133534 131793 129841 128058 126281 124504 123339 123213 123552 123421 122771 122434 123003 124225
53018 124225 125551 126748 127834 128705 129092 128811 128013 127158 126606 126202 125467 124282 123092 122302 121810 121418 121334
53001 121334 121847 122771 123643 124284 124730 124787 124217 123282 122582 122312 122165 122039 122319 123204 124149 124300 123377 121997 121190
52982 121190 121628 123174 125187 127283 129627 132285 134629 135928 136396 137089 138632 140528 141945 142750 143519
52967 143519 144820 146747 148960 150972 152533 153866 155384 157108 158561 159305 159418 159380 159757 160963 162982
52952 162982 165134 166432 166395 165396 164163 163178 162611 162454 162435 162110 161294 160262 159354 158626 158079 157901 158077 157993
$$ packed form
53069A62784p56p54r62j210j099o62n09r96j618j655j151p55p32p45o43q05j390
53052A46342j841j611j001o75o52m27M3K09j36n11n32m04l96l93l10m07p36q69
53034A35693o14n12j033j741j952j783j777j777j165j26L39j31o50l37N69J222
53018A24225J326J197J086Q71L87k81p98q55n52m04p35j185j190p90m92l92q4
53001A21334N13R24Q72O41M46N7n70r35p00k70j47j26K80Q85R45J51r23j380q07
52982A21190M38J546K013K096K344K658K344J299M68O93J543J896J417Q05P69
52967A43519J301J927K213K012J561J333J518J724J453P44J13l8L77J206K019
52952A62982K152J298l7r99j233r85n67j57j9l25q16j032r08p28n47j78J76q4
$$ plain form
52934 157993 156931 155000 153206 152501 152952 153949 154941 155818 156668 157427 157911 158125 158362 158791 159093 158779 157924 157317
52916 157317 157709 159082 160762 162059 162649 162569 162157 161887 162003 162297 162419 162360 162470 162974 163653 164019 163722 162831
52898 162831 161850 161452 162024 163343 164718 165475 165427 164996 164910 165597 166764 167727 168273 168983 170517 172692 174588
52881 174588 175503 175575 175462 175733 176568 177772 178848 179292 179007 178327 177528 176497 175142 173942 173685 174585 175973
52864 175973 177019 177564 178023 178683 179463 180307 181433 182997 184739 186210 187302 188349 189730 191468 193261
52849 193261 194799 196041 197219 198635 200472 202757 205416 208248 210913 213104 214807 216224 217397 218079
52835 218079 217993 217049 215215 212501 209306 206454 204495 203053 201265 198833 196284 194175 192492 190936 189409
52820 189409 187968 186617 185416 184579 184100 183440 181964 179692 177323 175427 173889 172267 170400 168430 166351
$$ packed form
52934A57993j062j931j794p05M51R97R92Q77Q50P59M84K14K37M29L02l14q55o07
52916A57317L92J373J680J297N90q0m12k70J16K94J22n9J10N04O79L66k97q91
52898A62831r81l98N72J319J375P57m8m31q6O87J167R63N46P10J534K175J896
52881A74588R15P2j13K71Q35J204J076M44k85o80p99j031j355j200k57R00J388
52864A75973J046N45M59O60P80Q44J126J564J742J471J092J047J381J738J793
52849A93261J538J242J178J416J837K285K659K832K665K191J703J417J173O82
52835B18079q6r44j834k714l195k852j959j442j788k432k549k109j683j556j527
52820A89409j441j351j201q37m79o60j476k272k369j896j538j622j867j970k079
$$ plain form
52805 166351 163960 161342 159118 157877 157463 157153 156486 155628 154811 153816 152285 150311 148389 146931 146133 146178
52789 146178 147128 148580 149776 150149 149556 148050 145793 143289 141247 139978 139109 138098 136848 135645 134675
52774 134675 133816 132814 131518 130012 128601 127560 126850 126209 125541 125031 124800 124663 124326 123652 122695 121666 120969
52757 120969 120950 121391 121526 120762 119276 117675 116285 114978 113545 111954 110326 108835 107505 105958 103671
52742 103671 100768 98354 97585 98399 99534 99816 99121 98012 96871 95662 94383 93443 93407 94335 95427 95585
52726 95585 94475 92881 91820 91493 91379 91132 90966 91104 91344 91329 91015 90688 90694 91218 92105 92881 93191 93276 93693
52707 93693 94479 95058 95215 95652 97051 98872 99760 99162 98015 97681 98671 100560 102680 104542 105896 106880 107971
52690 107971 109434 110852 111539 111400 111036 110934 110951 110725 110254 109813 109560 109548 109937 110807 111737 111968 111077 109325
$$ packed form
52805A66351k391k618k224j241m14l10o67q58q17r95j531j974j922j458p98M5
52789A46178R50J452J196L73n93j506k257k504k042j269q69j011j250j203r70
52774A34675q59j002j296j506j411j041p10o41o68n10k31j37l37o74r57j029o97
52757A20969j9M41J35p64j486j601j390j307j433j591j628j491j330j547k287
52742A03671k903k414p69Q14J135K82o95j109j141j209j279r40l6R28J092J58
52726I5585j110j594j061l27j14k47j66J38K40j5l14l27ON24Q87P76L10Q5M17
52707I3693P86N79J57M37J399J821Q88n98j147l34R90J889K120J862J354R84J091
52690A07971J463J418O87j39l64j02J7k26m71m41k53j2L89Q70R30K31q91j752
$$ plain form
52672 109325 107232 105075 102918 100896 99212 97925 96983 96469 96598 97300 97945 97712 96333 94338 92426 90748
52656 90748 89043 87435 86601 86917 87789 88224 87943 87463 87157 86771 86046 85342 85220 85632 85923 85643 85138 85244
52638 85244 86460 88399 90046 90659 90431 90157 90279 90531 90530 90359 90316 90427 90558 90818 91411 92134 92433 92053 91363
52619 91363 90946 91058 91569 92216 92801 93303 93897 94725 95520 95615 94563 92754 91241 90837 91389 91993 91982 91579 91564
52600 91564 92376 93751 95188 96472 97608 98483 98943 99068 99112 99140 98992 98651 98383 98423 98694 99020 99522 100634
52582 100634 102672 105475 108450 110899 112268 112302 111245 110012 109826 111266 113672 115779 116981 117660 118257
52567 118257 118555 118193 117464 117105 117473 118336 119380 120437 121318 121905 122501 123649 125481 127557 129411 130869
52551 130869 131829 132172 132105 132132 132459 132794 133047 133769 135448 137632 139337 140228 140883 141845 142866 143286 142884 142095
$$ packed form
52672A09325k093k157k157k022j684j287r42n14J29P02O45k33j379j995j912j678
52656I0748j705j608q34L16Q72M35k81m80l06l86p25p04j22M12K91k80n05J06
52638H5244J216J939J647O13k28k74J22K52jj71m3J11J31K60N93P23K99l80o90
52619I1363m17J12N11O47N85N02N94Q28P95R5j052j809j513m04N52O04j1m03j5
52600I1564Q12J375J437J284J136Q75M60J25M4K8j48l41k68M0K71L26N02J112
52582A00634K038K803K975K449J369L4j057j233j86J440K406K107J202O79N97
52567A18257K98l62p29l59L68Q63J044J057Q81N87N96J148J832K076J854J458
52551A30869R60L43o7K7L27L35K53P22J679K184J705Q91O55R62J021M20m02p89
$$ plain form
52533 142095 141465 141102 140752 140325 140206 140861 142192 143494 144139 144088 143706 143344 143283 143699 144341 144496 143781 142863 142906
52514 142906 144203 145791 146571 146467 146253 146511 147096 147540 147688 147828 148274 148929 149383 149473 149560 150070 150845 151256 150949
52495 150949 150176 149307 148349 147183 146077 145641 146231 147571 149046 150322 151551 152973 154447 155641 156646
52480 156646 158009 159876 161465 161891 161360 160949 161244 161798 162065 162178 162481 162877 163136 163433 164071 165045 166403
52463 166403 168623 171903 175286 177282 177433 176648 175989 175752 175780 175955 176099 175994 175812 176018 176553 176700 176138 175544
52445 175544 175586 175855 175537 174770 174433 174680 174649 173875 173161 173459 174461 174920 174205 172912 171949 171516 171175 170549 169633
52426 169633 168578 167483 166436 165578 165050 164951 165339 166128 166978 167479 167524 167357 167139 166692 165843 164838 164087 163671
52408 163671 163406 163297 163507 163896 164088 164130 164564 165603 166671 167140 167210 167621 168630 169759 170482 170802 171051 171411
$$ packed form
52533A42095o30l63l50m27j19O55J331J302O45n1l82l62o1M16O42J55p15r18M3
52514A42906J297J588P80j04k14K58N85M44J48J40M46O55M54R0Q7N10P75M11l07
52495A50949p73q69r58j166j106m36N90J340J475J276J229J422J474J194J005
52480A56646J363J867J589M26n31m11K95N54K67J13L03L96K59K97O38R74J358
52463A66403K220L280L383J996J51p85o59k37K8J75J44j05j82K06N35J47n62n94
52445A75544M2K69l18p67l37K47l1p74p14K98J002M59p15j293r63m33l41o26r16
52426A69633j055j095j047q58n28r9L88P89Q50N01M5j67k18m47q49j005p51m16
52408A63671k65j09K10L89J92M2M34J039J068M69P0M11J009J129P23L20K49L60
$$ plain form
52390 171411 171758 171873 171741 171619 171757 172098 172447 172906 173801 175124 176456 177562 178603 179527 179836 179515 179625
52373 179625 181199 183750 185752 186589 187218 188711 190915 192894 194161 195000 196013 197718 200298 203329 205934
52358 205934 207519 208310 208974 209940 211209 212660 214283 216208 218586 221269 223635 225080 225815 226767 228500
52343 228500 230621 232553 234451 236876 239809 242530 244438 245562 246287 246929 247661 248554 249547 250485 251250 251754
52327 251754 251962 252105 252767 254468 257157 260268 263245 265837 268031 270012 272220 275068 278537 282225 285862
52312 285862 289555 293461 297527 301698 306116 310878 315813 320787 326178 332708 340769 350110 360233 370812
52298 370812 381636 392505 403511 415282 428489 442985 457770 471983 485773 500036 515441
52287 515441 531900 548796 565528 581877 598059 614406 630931 647294 663288 679117 694964
$$ packed form
52390A71411L47J15j32j22J38L41L49M59Q95J323J332J106J041R24L09l21J10
52373A79625J574K551K002Q37O29J493K204J979J267Q39J013J705K580L031K605
52358B05934J585P91O64R66J269J451J623J925K378K683K366J445P35R52J733
52343B28500K121J932J898K425K933K721J908J124P25O42P32Q93R93R38P65N04
52327B51754K08J43O62J701K689L111K977K592K194J981K208K848L469L688L637
52312B85862L693L906M066M171M418M762M935M974N391O530Q061R341J0123J0579
52298C70812J0824J0869J1006J1771J3207J4496J4785J4213J3790J4263J5405
52287E15441J6459J6896J6732J6349J6182J6347J6525J6363J5994J5829J5847
$$ plain form
52276 694964 710560 725473 739643 753204 765950 777457 787707 797084 805650 812914 818529 822733
52264 822733 825839 827673 827928 826845 825163 823420 821468 818642 814376 808871 803196 798446 794729 791245
52250 791245 787437 783615 780289 777412 774739 772508 771230 771012 771644 773276 776515 781864 789431 799140 810714
52235 810714 823379 836096 848343 860398 872676 885083 897283 909335 921624 934164 946306
52224 946306 957383 967365 976550 984653 990706 994132 995587 996301 996734 996314 994387 990801 985439 977932 968259
52209 968259 957251 945936 934530 922406 908918 893978 878081 862056 846603 831751 816951
52198 816951 801906 787105 773249 760487 748611 737656 727739 718570 709711 701286 693840 687437 681420
52185 681420 675198 668849 662833 657464 652777 648613 644720 641002 637701 635073 632915 630668 627966 624847
$$ packed form
52276F94964J5596J4913J4170J3561J2746J1507J0250R377Q566P264N615M204
52264H22733L106J834K55j083j682j743j952k826m266n505n675m750l717l484
52250G91245l808l822l326k877k673k231j278k18O32J632L239N349P567R709J1574
52235H10714J2665J2717J2247J2055J2278J2407J2200J2052J2289J2540J2142
52224I46306J1077R982R185Q103O053L426J455P14M33m20j927l586n362p507r673
52209I68259j1008j1315j1406j2124j3488j4940j5897j6025j5453j4852j4800
52198H16951j5045j4801j3856j2762j1876j0955r917r169q859q425p446o403o017
52185F81420o222o349o016n369m687m164l893l718l301k628k158k247k702l119
$$ plain form
52171 624847 621526 618246 615222 612341 609095 605303 601715 599259 597736 595966 593350 590553 588350 586593
52157 586593 584792 583077 581839 580762 578927 575850 571978 568181 565095 562845 561044 559050 556501 553555
52143 553555 550466 547131 543349 539373 535813 532985 530600 528129 525298 522290 519701 518154 517656 517333 516111
52128 516111 513739 510975 508749 507371 506520 505738 504774 503629 502444 501320 500172 498884 497602 496797 496937
52113 496937 498173 500370 503294 506738 510558 514735 519395 524683 530664 537362 544788 552826 561218 569889
52099 569889 579244 589941 602304 616189 631406 647970 665756 684291 703225 722868 743813 766091
52087 766091 789004 811787 834039 855537 876150 896112 915922 935649 954617 972021 987604
52076 987604 1001472 1013622 1023944 1032391 1038851 1043125 1045380 1046279 1046219 1044767 1041343 1036157 1029883 1022657
$$ packed form
52171F24847l321l280l024k881l246l792l588k456j523j770k616k797k203j757
52157E86593j801j715j238j077j835l077l872l797l086k250j801j994k549k946
52143E53555l089l335l782l976l560k828k385k471k831l008k589j547m98l23j222
52128E16111k372k764k226j378q51p82r64j145j185j124j148j288j282q05J40
52113D96937J236K197K924L444L820M177M660N288N981O698P426Q038Q392Q671
52099E69889R355J0697J2363J3885J5217J6564J7786J8535J8934J9643K0945K2278
52087G66091K2913K2783K2252K1498K0613J9962J9810J9727J8968J7404J5583
52076I87604J3868J2150J0322Q447O460M274K255Q99o0j452l424n186o274p226
$$ plain form
52062 1022657 1014157 1004526 994419 983976 972589 960076 947413 935844 925650 916187 906815 897386
52050 897386 888144 879605 872463 867255 864082 862711 862788 863847 865439 867486 870368 874440 879621 885616 892298
52035 892298 899675 907697 916362 925821 936075 946689 957104 967153 977021 986690 995738 1003766 1010789
52022 1010789 1016988 1022157 1025650 1026963 1026303 1024427 1021928 1018832 1014824 1009581 1002784 994139 983691 971855
52008 971855 958853 944355 928082 910538 892558 874206 854720 833671 811614 789430 767521
51997 767521 745867 724341 702673 680604 658440 637181 617632 599621 582357 565322 548520
51986 548520 532128 516285 501047 486168 471101 455607 440319 426304 414028 402932 392035
51975 392035 380798 369458 358669 348845 339809 331143 322786 315056 308039 301411 295068 289515 285269
$$ packed form
52062A022657q500r631j0107j0443j1387j2513j2663j1569j0194r463r372r429
52050H97386r242q539p142n208l173j371P7J059J592K047K882M072N181N995O682
52035H92298P377Q022Q665R459J0254J0614J0415J0049R868R669R048Q028P023
52022A010789O199N169L493J313o60j876k499l096m008n243o797q645j0448j1836
52008I71855j3002j4498j6273j7544j7980j8352j9486k1049k2057k2184k1909
51997G67521k1654k1526k1668k2069k2164k1259j9549j8011j7264j7035j6802
51986E48520j6392j5843j5238j4879j5067j5494j5288j4015j2276j1096j0897
51975C92035j1237j1340j0789r824r036q666q357p730p017o628o343n553m246
$$ plain form
51962 285269 282132 279418 276653 273671 270242 266177 261771 257634 253989 250519 247052 243936 241494 239442
51948 239442 237232 234857 232856 231499 230245 228306 225589 222796 220597 218954 217358 215383 212846 209654
51934 209654 205940 202204 198991 196397 194117 191860 189482 186843 183985 181337 179240 177374 175211 173062
51920 173062 171937 172140 172676 172444 171463 170522 170107 170143 170395 170499 169934 168511 166739 165257 164090 162832 161309
51903 161309 159666 158055 156713 156055 156093 155962 154665 152317 150083 148827 148313 147812 147022 146210 145746 145728 145914
51886 145914 145984 145965 146266 147063 147862 148006 147535 147185 147583 148696 149974 150703 150417 149423 148848 149671 151647 153602
51868 153602 154799 155563 156516 157715 158786 159523 160069 160677 161508 162507 163386 163896 164177 164666 165577 166706 167793
51851 167793 168795 169742 170578 171332 172267 173627 175267 176669 177327 177134 176442 175746 175278 174949 174695 174714 175252 176278
$$ packed form
51962B85269l137k714k765k982l429m065m406m137l645l470l467l116k442k052
51948B39442k210k375k001j357j254j939k717k793k199j643j596j975k537l192
51934B09654l714l736l213k594k280k257k378k639k858k648k097j866k163k149
51920A73062j125K03N36k32r81r41m15L6K52J04n65j423j772j482j167j258j523
51903A61309j643j611j342o58L8j31j297k348k234j256n14n01p90q12m64j8J86
51886A45914P0j9L01P97P99J44m71l50L98J113J278P29k86r94n75Q23J976J955
51868A53602J197P64R53J199J071P37N46O08Q31R99Q79N10K81M89R11J129J087
51851A67793J002R47Q36P54R35J360J640J402O58j93o92o96m68l29k54J9N38J026
$$ plain form
51833 176278 177553 178910 180339 181898 183608 185322 186607 187028 186678 186101 185484 184328 182292 180040 178693
51818 178693 178608 179174 179682 179888 179746 179199 178374 177598 177116 177005 177278 177755 177910 177347 176391 175699 175323 174679 173593
51799 173593 172779 173019 174230 175641 176605 177042 177327 177944 179049 180318 181369 182267 183240 183990 183806 182519 180813
51782 180813 179411 178488 178102 178631 180264 182420 184254 185546 186692 187958 189240 190471 191745 192978 193876
51767 193876 194439 195171 196549 198448 200377 202185 204204 206614 209002 210837 212186 213554 215043 216123 216455
51752 216455 216508 217032 218179 219509 220663 221592 222269 222572 222475 222094 221594 221295 221656 222794 224186 225206 225864
51735 225864 226644 227785 229168 230726 232407 233800 234382 234164 233625 233099 232690 232689 233324 234139 234337 233866 233434 233412
51717 233412 233506 233705 234543 235991 236937 236423 234748 232780 230845 229017 227860 227932 228822 229511 229623 229621 229887 230284
$$ packed form
51833A76278J275J357J429J559J710J714J285M21l50n77o17j156k036k252j347
51818A78693q5N66N08K06j42n47q25p76m82j11K73M77J55n63r56o92l76o44j086
51799A73593q14K40J211J411R64M37K85O17J105J269J051Q98R73P50j84j287j706
51782A80813j402r23l86N29J633K156J834J292J146J266J282J231J274J233Q98
51767A93876N63P32J378J899J929J808K019K410K388J835J349J368J489J080L32
51752B16455N3N24J147J330J154R29O77L03r7l81n00k99L61J138J392J020O58
51735B25864P80J141J383J558J681J393N82k18n39n26m09jO35Q15J98m71m32k2
51717B33412R4J99Q38J448R46n14j675j968j935j828j157P2Q90O89J12kK66L97
$$ plain form
51699 230284 230581 230736 230747 230737 231239 232844 235467 238295 240524 241910 242661 243158 243794 244762 245992 247544 249892
51682 249892 253452 257867 262176 265714 268536 270939 272949 274395 275162 275224 274646 273737 273043 272971 273346 273390 272235
51665 272235 269685 266506 263754 261740 259851 257500 254893 252608 250699 248684 246260 243667 241299 239245
51651 239245 237325 235364 233435 231880 230979 230556 230134 229599 229383 229711 230020 229616 228693 228105 228160 228218 227682 226862
51633 226862 226555 227000 227572 227387 226033 223818 221534 219911 219108 218667 218004 216970 215918 215258 215055 215085 215185
51616 215185 215418 215900 216668 217771 219278 221007 222478 223458 224371 225817 227739 229477 230633 231465 232411 233725
51600 233725 235732 238837 242942 247159 250478 252571 253860 255137 257174 260307 264084 267668 270713 273493
51586 273493 276117 278257 279881 281510 283282 284468 284509 283936 283553 283310 282784 282289 282515 283365 284142 284734 285626
$$ packed form
51699B30284K97J55J1j0N02J605K623K828K229J386P51M97O36R68J230J552K348
51682B49892L560M415M309L538K822K403K010J446P67O2n78r09o94p2L75M4j155
51665B72235k550l179k752k014j889k351k607k285j909k015k424k593k368k054
51651B39245j920j961j929j555r01m23m22n35k16L28L09m04r23n88N5N8n36q20
51633B26862l07M45N72j85j354k215k284j623q03m41o63j034j052o60k03L0J00
51616B15185K33M82P68J103J507J729J471R80R13J446J922J738J156Q32R46J314
51600B33725K007L105M105M217L319K093J289J277K037L133L777L584L045K780
51586B73493K624K140J624J629J772J186M1n73l83k43n26m95K26Q50P77N92Q92
$$ plain form
51569 285626 286805 287682 288155 288761 289633 290334 291013 292653 295591 298702 300787 302078 303598 305549 307240 308386
51553 308386 309618 311613 314274 316920 318984 320386 321379 322117 322424 322149 321652 321527 321714 321364 319961 318219
51537 318219 317421 318071 319646 321464 323212 324548 324854 323804 321949 320257 319042 317676 315504 312781 310384
51522 310384 308699 307228 305422 303418 301659 300138 298515 296765 295141 293564 291636 289347 287279 285859
51508 285859 284845 283732 282293 280498 278338 276050 274221 273302 273130 273175 273085 272777 272225 271462 270731 270353 270459
51491 270459 270975 271824 273054 274788 277017 279378 281264 282409 283288 284586 286348 288103 289821 292116 295286
51476 295286 298754 301897 304924 308434 312493 316713 320956 325341 329684 333567 336976 340326 343823 347247
51462 347247 350391 353265 355806 357776 359064 359761 359912 359557 359031 358748 358567 357850 356348 354633 353365 352492
$$ packed form
51569B85626J179Q77M73O06Q72P01O79J640K938L111K085J291J520J951J691J146
51553C08386J232J995K661K646K064J402R93P38L07k75m97j25J87l50j403j742
51537C18219p98O50J575J818J748J336L06j050j855j692j215j366k172k723k397
51522C10384j685j471j806k004j759j521j623j750j624j577j928k289k068j420
51508B85859j014j113j439j795k160k288j829r19j72M5r0l08n52p63p31l78J06
51491B70459N16Q49J230J734K229K361J886J145Q79J298J762J755J718K295L170
51476B95286L468L143L027L510M059M220M243M385M343L883L409L350L497L424
51462C47247L144K874K541J970J288O97J51l55n26k83j81p17j502j715j268q73
$$ plain form
51446 352492 351433 349785 347542 344999 342724 341310 340683 339800 337520 333763 329503 325712 322647 320071 317751
51431 317751 315651 313977 313026 312690 312176 310660 308286 306055 304577 303474 302255 301226 301042 301732 302760
51416 302760 303805 304888 305841 306282 306184 305922 305648 305105 304206 303274 302445 301323 299567 297418 295196 292607 289157
51399 289157 285112 281447 278768 276743 274719 272479 270114 267481 264219 260258 255992 251846 247874 243915
51385 243915 239995 236325 232942 229595 226113 222667 219500 216570 213691 210810 207880 204637 200945 197338
51371 197338 194667 193106 191944 190547 189074 187955 187109 186107 184811 183413 182038 180714 179560 178662 177892
51356 177892 177194 176836 177011 177383 177526 177678 178499 180065 181648 182609 183068 183498 184116 184948 186165 187972 190220
51339 190220 192424 194191 195543 196796 198153 199475 200533 201404 202402 203574 204536 205027 205274 205577 205852 206005
$$ packed form
51446C52492j059j648k243k543k275j414o27q83k280l757m260l791l065k576k320
51431C17751k100j674r51l36n14j516k374k231j478j103j219j029j84O90J028
51416C02760J045J083R53M41r8k62k74n43q99r32q29j122j756k149k222k589l450
51399B89157m045l665k679k025k024k240k365k633l262l961m266m146l972l959
51385B43915l920l670l383l347l482l446l167k930k879k881k930l243l692l607
51371A97338k671j561j162j397j473j119q46j002j296j398j375j324j154q98p70
51356A77892o98l58J75L72J43J52Q21J566J583R61M59M30O18Q32J217J807K248
51339A90220K204J767J352J253J357J322J058Q71R98J172R62M91K47L03K75J53
$$ plain form
51323 206005 206417 207489 208799 209357 208749 207539 206429 205467 204222 202327 199713 196656 193730 191359 189329
51308 189329 187061 184442 181956 179863 177748 175147 172227 169551 167473 166045 165217 164826 164582 164330 164113
51293 164113 163812 163022 161582 160023 159113 159055 159334 159274 158572 157433 156377 155764 155381 154655 153405 152161 151503
51276 151503 151362 151268 151081 151109 151616 152514 153506 154221 154221 153183 151197 148716 146227 144077 142525 141688 141338 140967
51258 140967 140187 139028 137773 136600 135473 134313 133212 132423 132191 132563 133292 133904 133923 133222 132150 131199 130517
51241 130517 129831 128897 127822 126883 126252 126057 126444 127301 128118 128453 128450 128560 128888 129195 129488 130087 130990 131640 131620
51222 131620 131291 131415 132275 133428 134271 134669 134969 135491 136209 137021 138140 139861 141954 143774 145143 146661
51206 146661 148725 150710 151667 151542 151130 151065 151448 152233 153263 154061 154312 154520 155491 157170 158712 159633 160117
$$ packed form
51323B06005M12J072J310N58o08j210j110r62j245j895k614l057k926k371k030
51308A89329k268k619k486k093k115k601k920k676k078j428q28l91k44k52k17
51293A64113l01p90j440j559r10n8K79o0p02j139j056o13l83p26j250j244o58
51276A51503j41r4j87K8N07Q98R92P15%j038j986k481k489k150j552q37l50l71
51258A40967p80j159j255j173j127j160j101p89k32L72P29O12J9p01j072r51o82
51241A30517o86r34j075r39o31j95L87Q57Q17L35lJ10L28L07K93N99R03O50k0
51222A31620l29J24Q60J153Q43L98L00N22P18Q12J119J721K093J820J369J518
51206A46661K064J985R57j25m12o5L83P85J030P98K51K08R71J679J542R21M84
$$ plain form
51189 160117 160175 159510 158413 157790 157876 157806 156972 155970 155556 155416 154761 153581 152512 151776 150952 149675 148062 146589
51171 146589 145806 145816 145863 144946 143143 141728 141528 141851 141565 140607 139746 139415 139489 139755 139863 139236 137752 136080
51153 136080 134677 132983 130473 127972 126837 127162 127889 128510 129541 131291 133239 134785 135740 135975 135435 134653
51137 134653 134437 134871 135332 135557 135829 136060 135655 134540 133417 132623 131602 129999 128410 127545 127296 127269 127556
51120 127556 128331 129142 129352 129032 128833 129118 129685 130133 130120 129404 128065 126614 125614 125234 125320 125722 126374 127211
51102 127211 128108 128811 129026 128832 128902 129827 131291 132476 133292 134477 136255 137759 138315 138585 139693 141610 143242
51085 143242 143930 144105 144489 145282 146312 147460 148649 149707 150486 151061 151650 152317 152802 152741 152141 151576 151676 152439
51067 152439 153360 154218 155309 156734 157933 158285 157886 157336 156957 156651 156401 156446 156897 157530 158047 158373 158540 158454
$$ packed form
51189A60117N8o65j097o23Q6p0q34j002m14j40o55j180j069p36q24j277j613j473
51171A46589p83J0M7r17j803j415k00L23k86r58q61l31P4K66J08o27j484j672
51153A36080j403j694k510k501j135L25P27O21J031J750J948J546R55K35n40p82
51137A34653k16M34M61K25K72K31m05j115j123p94j021j603j589q65k49k7K87
51120A27556P75Q11K10l20j99K85N67M48j3p16j339j451j000l80Q6M02O52Q37
51102A27211Q97P03K15j94P0R25J464J185Q16J185J778J504N56K70J108J917J632
51085A43242O88J75L84P93J030J148J189J058P79N75N89O67M85o1o00n65J00P63
51067A52439R21Q58J091J425J199L52l99n50l79l06k50M5M51O33N17L26J67q6
$$ plain form
51049 158454 157906 156769 155188 153529 152184 151372 151121 151338 151833 152436 153193 154340 155878 157323 158119 158194 157892
51032 157892 157498 157172 157191 157793 158820 159951 161241 162929 164750 166086 166912 167935 169530 171180 172336 173193
51016 173193 174139 174947 175192 175126 175529 176841 178894 181325 183780 185872 187396 188552 189685 190969 192620 195093
51000 195093 198651 202930 207380 211900 216673 221616 226545 231634 237137 242798 248211 253650 259831 266852
50986 266852 274163 281731 290403 300729 312100 323637 335440 348373 362968 379196 397120 417138
50974 417138 439478 464059 491062 521318 555822 594952 638285 685069 734854 787787 844355
50963 844355 904763 968535 1034835 1103039 1172615 1242343 1310104 1373852 1432655 1486351 1534313
50952 1534313 1575084 1607346 1630709 1645296 1651076 1648097 1637004 1618780 1594175 1563946 1529537 1492881
$$ packed form
51049A58454n48j137j581j659j345q12k51K17M95O03P57J147J538J445P96P5l02
51032A57892l94l26J9O02J027J131J290J688J821J336Q26J023J595J650J156Q57
51016A73193R46Q08K45o6M03J312K053K431K455K092J524J156J133J284J651K473
51000A95093L558M279M450M520M773M943M929N089N503N661N413N439O181P021
50986B66852P311P568Q672J0326J1371J1537J1803J2933J4595J6228J7924K0018
50974D17138K2340K4581K7003L0256L4504L9130M3333M6784M9785N2933N6568
50963H44355O0408O3772O6300O8204O9576O9728O7761O3748N8803N3696M7962
50952A534313M0771L2262K3363J4587N780k979j1093j8224k4605l0229l4409l6656
$$ plain form
50940 1492881 1455539 1418541 1383039 1350239 1320362 1292321 1264955 1238189 1212513 1187691 1162580
50929 1162580 1136150 1108221 1079174 1049195 1017890 984656 949538 913642 878293 843745 809347
50918 809347 775124 742410 712273 684013 656152 628516 602294 578221 555891 535153 517041
50907 517041 502511 490907 480470 470142 460213 451360 443755 437218 431744 427542 424782 423516 423701
50894 423701 425063 426996 428782 430049 430927 431730 432598 433638 435242 437942 441801 446245 450650 454914 459279
50879 459279 463828 468480 473320 478609 484506 491041 498405 506982 516978 528169 540126 552664 566100
50866 566100 581146 598431 618063 639783 663603 690088 719909 753452 791118 833718 882121
50855 882121 936766 997926 1066307 1142835 1227985 1321913 1425205 1538761 1662642 1795613 1936173
$$ packed form
50940A492881l7342l6998l5502l2800k9877k8041k7366k6766k5676k4822k5111
50929A162580k6430k7929k9047k9979l1305l3234l5118l5896l5349l4548l4398
50918H09347l4223l2714l0137k8260k7861k7636k6222k4073k2330k0738j8112
50907E17041j4530j1604j0437j0328r929q853p605o537n474m202k760j266J85
50894D23701J362J933J786J267Q78Q03Q68J040J604K700L859M444M405M264M365
50879D59279M549M652M840N289N897O535P364Q577R996J1191J1957J2538J3436
50866E66100J5046J7285J9632K1720K3820K6485K9821L3543L7666M2600M8403
50855H82121N4645O1160O8381P6528Q5150R3928J03292J13556J23881J32971J40560
$$ plain form
50844 1936173 2083530 2237088 2395287 2555293 2713565 2866254 3009305 3138789 3251243
50835 3251243 3343599 3413046 3457585 3476858 3472096 3445240 3398398 3334244 3256450 3169296 3076877
50824 3076877 2982764 2890191 2802097 2720725 2647218 2581567 2522844 2469462 2419515 2371176 2322965
50813 2322965 2273622 2221836 2166395 2106677 2042798 1975052 1903368 1827643 1748628 1668142 1588187
50802 1588187 1510004 1434147 1361306 1292684 1229408 1171799 1119413 1071739 1028675 990296 956545
50791 956545 927400 903193 884311 870484 860688 853940 849917 848564 849372 851457 854245 857703 861877
50778 861877 866474 870943 874678 877137 878083 877726 876404 874029 870205 864906 858675 851977 844710 836600 827734
50763 827734 818367 808536 798251 787882 777848 768152 758741 750316 744088 740555 739035 738666 739397 741568
$$ packed form
50844A936173J47357J53558J58199J60006J58272J52689J43051J29484J12454
50835C251243R2356O9447M4539J9273m762k6856m6842o4154p7794q7154r2419
50824C076877r4113r2573q8094q1372p3507o5651n8723n3382m9947m8339m8211
50813B322965m9343n1786n5441n9718o3879o7746p1684p5725p9015q0486p9955
50802A588187p8183p5857p2841o8622o3276n7609n2386m7674m3064l8379l3751
50791I56545k9145k4207j8882j3827r796o748m023j353Q08K085K788L458M174
50778H61877M597M469L735K459R46l57j322k375l824n299o231o698p267q110q866
50763H27734r367r831j0285j0369j0034r696r411q425o228l533j520l69P31K171
$$ plain form
50749 741568 745107 749791 756150 765302 777851 793498 811851 833045 857353 884827 915827 951463
50737 951463 992918 1040523 1093987 1153306 1218871 1290802 1368895 1453243 1544127 1640911 1741563
50726 1741563 1843616 1945179 2044576 2139529 2227363 2305859 2373342 2427942 2467341 2489460 2493197
50715 2493197 2478521 2446291 2398292 2337374 2267348 2192466 2116586 2042500 1972016 1906589 1847501
50704 1847501 1795207 1748989 1707804 1671280 1639323 1610882 1583807 1556063 1526510 1494400 1458821
50693 1458821 1419212 1376111 1330886 1284804 1238572 1192583 1147262 1103246 1061443 1022853 988184
50682 988184 957702 931491 909508 891253 875777 862474 851757 844660 841911 843672 849965 860846
50670 860846 876124 895262 917645 942697 969812 998499 1028516 1059458 1090249 1119573 1146929
$$ packed form
50749G41568L539M684O359R152J2549J5647J8353K1194K4308K7474L1000L5636
50737I51463M1455M7605N3464N9319O5565P1931P8093Q4348R0884R6784J00652
50726A741563J02053J01563R9397R4953Q7834P8496O7483N4600L9399K2119L737
50715B493197j4676l2230m7999o0918p0026p4882p5880p4086p0484o5427n9088
50704A847501n2294m6218m1185l6524l1957k8441k7075k7744k9553l2110l5579
50693A458821l9609m3101m5225m6082m6232m5989m5321m4016m1803l8590l4669
50682I88184l0482k6211k1983j8255j5476j3303j0717p097k749J761O293J0881
50670H60846J5278J9138K2383K5052K7115K8687L0017L0942L0791K9324K7356
$$ plain form
50659 1146929 1172768 1197440 1220585 1241912 1261946 1281369 1300012 1317172 1332714 1347069 1360257
50648 1360257 1371792 1381768 1391251 1401173 1411519 1422102 1433561 1446920 1462528 1480242 1500447 1524024
50636 1524024 1551158 1580879 1612019 1644127 1677045 1710049 1741786 1770932 1796633 1818445 1836182
50625 1836182 1849788 1859295 1864925 1867209 1866843 1864482 1860986 1857833 1856842 1859222 1865209 1874755 1888143 1905429
50611 1905429 1925541 1946476 1966543 1985166 2002415 2017953 2030518 2038387 2040380 2036415 2027009 2012246
50599 2012246 1991382 1963449 1928008 1885309 1836096 1781477 1722732 1660978 1597157 1532478 1468542
50588 1468542 1406756 1347694 1291232 1237127 1185421 1136565 1091309 1050201 1012995 978902 947559
50577 947559 919325 894421 872377 852723 835651 821452 809845 800558 794018 790549 789278 788953 789691
$$ packed form
50659A146929K5839K4672K3145K1327K0034J9423J8643J7160J5542J4355J3188
50648A360257J1535R976R483R922J0346J0583J1459J3359J5608J7714K0205K3577
50636A524024K7134K9721L1140L2108L2918L3004L1737K9146K5701K1812J7737
50625A836182J3606R507N630K284l66k361l496l153r91K380N987R546J3388J7286
50611A905429K0112K0935K0067J8623J7249J5538J2565P869J993l965r406j4763
50599B012246k0864k7933l5441m2699m9213n4619n8745o1754o3821o4679o3936
50588A468542o1786n9062n6462n4105n1706m8856m5256m1108l7206l4093l1343
50577I47559k8234k4904k2044j9654j7072j4199j1607r287o540l469j271l25P38
$$ plain form
50564 789691 792847 799076 807658 817978 830555 845979 863768 883048 903814 926739 952145 979809
50552 979809 1009541 1041392 1075407 1111672 1150465 1191892 1235334 1279467 1322795 1364160 1403098
50541 1403098 1440032 1475943 1511595 1547245 1583136 1619897 1658139 1698051 1739701 1783471 1829801
50530 1829801 1878732 1930096 1983987 2040779 2100792 2164189 2231019 2301134 2374224 2450061 2528384
50519 2528384 2608251 2687884 2765520 2840120 2910843 2976104 3033674 3081466 3117836 3141402 3151228
50508 3151228 3147170 3129541 3098526 3054464 2998725 2933702 2861831 2785113 2705685 2626371 2550375
50497 2550375 2480739 2420166 2370779 2333584 2308262 2293779 2289091 2293220 2304984 2322990 2345792 2371707
50485 2371707 2398368 2422520 2440326 2448013 2442545 2422036 2385824 2334428 2269548 2193819 2110169 2021183
$$ packed form
50564G89691L156O229Q582J0320J2577J5424J7789J9280K0766K2925K5406K7664
50552I79809K9732L1851L4015L6265L8793M1427M3442M4133M3328M1365L8938
50541A403098L6934L5911L5652L5650L5891L6761L8242L9912M1650M3770M6330
50530A829801M8931N1364N3891N6792O0013O3397O6830P0115P3090P5837P8323
50519B528384P9867P9633P7636P4600P0723O5261N7570M7792L6370K3566R826
50508C151228m058j7629l1015m4062n5739o5023p1871p6718p9428p9314p5996
50497B550375o9636o0573m9387l7195k5322j4483m688M129J1764J8006K2802K5915
50485B371707K6661K4152J7806P687n468k0509l6212n1396o4880p5729q3650q8986
$$ plain form
50473 2021183 1929040 1835840 1743652 1654197 1568633 1487641 1411566 1340539 1274723 1214453 1159903
50462 1159903 1110696 1066181 1026114 990748 960114 933577 910333 890074 872849 858498 846630
50451 846630 837180 830615 827360 827101 828880 831910 836217 842405 850914 861715 874665 889748 906686
50438 906686 924639 942790 961210 980760 1002078 1025064 1049432 1075282 1102749 1131418 1160492
50427 1160492 1189432 1218139 1246719 1275457 1304964 1335789 1367662 1399416 1429927 1459057 1487613
50416 1487613 1516667 1547124 1579685 1614722 1652071 1691246 1731989 1774420 1818441 1863168 1907254
50405 1907254 1949761 1990493 2029421 2066057 2099551 2129163 2154309 2174232 2187994 2194957 2194928 2187611
50393 2187611 2172104 2147371 2113245 2070592 2020406 1963150 1899348 1830476 1758781 1686306 1614613
$$ packed form
50473B021183r2143r3200r2188q9455q5564q0992p6075p1027o5816o0270n4550
50462A159903m9207m4515m0067l5366l0634k6537k3244k0259j7225j4351j1868
50451H46630r450o565l255k59J779L030M307O188Q509J0801J2950J5083J6938
50438I06686J7953J8151J8420J9550K1318K2986K4368K5850K7467K8669K9074
50427A160492K8940K8707K8580K8738K9507L0825L1873L1754L0511K9130K8556
50416A487613K9054L0457L2561L5037L7349L9175M0743M2431M4021M4727M4086
50405A907254M2507M0732L8928L6636L3494K9612K5146J9923J3762O963k9p317
50393B187611j5507k4733l4126m2653n0186n7256o3802o8872p1695p2475p1693
$$ plain form
50382 1614613 1545425 1480775 1422120 1369770 1323714 1284658 1253698 1231196 1216567 1209043 1207959 1212262
50370 1212262 1220442 1231232 1243837 1257132 1269106 1277492 1280633 1277440 1266975 1248734 1223268 1192081
50358 1192081 1156865 1119071 1080026 1040990 1002986 966697 932459 900144 869208 839173 810131
50347 810131 782655 757335 734537 714369 696537 680420 665647 652561 641725 633008 625564 618785
50335 618785 612929 608690 606440 606005 606885 608573 610877 614140 618968 625642 633868 643149 653262 664300
50321 664300 676395 689466 703101 716711 729976 743183 756931 771453 786466 801712 817374
50310 817374 833726 850601 867420 883668 899128 913674 927087 939172 949992 959872 969102 977562
50298 977562 984622 989527 991984 992457 991899 991196 990763 990514 990071 988969 986673 982556 975966 966402 953675
$$ packed form
50382A614613o9188o4650n8655n2350m6056l9056l0960k2502j4629p524j084M303
50370A212262Q180J0790J2605J3295J1974Q386L141l193j0465j8241k5466l1187
50358A192081l5216l7794l9045l9036l8004l6289l4238l2315l0936l0035k9042
50347H10131k7476k5320k2798k0168j7832j6117j4773j3086j0836q717p444o779
50335F18785n856m239k250m35Q80J688K304L263M828O674Q226R281J0113J1038
50321F64300J2095J3071J3635J3610J3265J3207J3748J4522J5013J5246J5662
50310H17374J6352J6875J6819J6248J5460J4546J3413J2085J0820R880R230Q460
50298I77562P060M905K457M73n58p03m33k49m43j102k296m117o590r564j2727
$$ plain form
50283 953675 938012 920085 900802 880858 860508 839857 819233 799029 779255 759656 740299
50272 740299 721602 703689 686155 668724 651771 635884 621232 607684 595187 583653 572823
50261 572823 562679 553703 546303 540220 534980 530595 527255 524631 522132 519683 517548 515583 513457 511523
50247 511523 510601 510783 511297 511641 511953 512014 510910 508225 504793 501615 498772 496012 493722 492460 491951 491392
50231 491392 490442 489191 487460 484970 482047 479361 477047 474779 472622 471059 470164 469510 468990 468971 469435 469755
50215 469755 469695 469961 471290 473510 476037 478936 482759 487479 492148 495776 498187 499878 501307 502513 503295
50200 503295 503526 503249 502589 501766 501128 500913 500862 500294 498827 496853 495036 493463 491644 489221 486276 482915
50184 482915 479053 474726 470174 465392 460016 454012 448200 443657 440691 438693 436928 435175 433674 432760
$$ packed form
50283I53675j5663j7927j9283j9944k0350k0651k0624k0204j9774j9599j9357
50272G40299j8697j7913j7534j7431j6953j5887j4652j3548j2497j1534j0830
50261E72823j0144q976p400o083n240m385l340k624k499k449k135j965k126j934
50247E11523r22J82N14L44L12O1j104k685l432l178k843k760k290j262n09n59
50231D91392r50j251j731k490k923k686k314k268k157j563q95o54n20j9M64L20
50215D69755o0K66J329K220K527K899L823M720M669L628K411J691J429J206P82
50200E03295K31k77o60q23o38k15n1n68j467j974j817j573j819k423k945l361
50184D82915l862m327m552m782n376o004n812m543k966j998j765j753j501r14
$$ plain form
50170 432760 432594 433066 433862 434765 435873 437348 438978 440146 440309 439419 437851 435974 433815 431148 427974 424901
50154 424901 422792 421810 420987 419095 415948 412588 410118 408697 407791 407048 406609 406766 407646 409128 410774 411861
50138 411861 411848 410910 409841 409362 409694 410750 412373 414327 416386 418608 421232 424104 426561 428228 429636
50123 429636 431625 434346 437329 440326 443453 446478 448699 449812 450387 451139 452178 453344 454845 456910 459059
50108 459059 460354 460463 460045 460040 460879 462469 464514 466702 468872 471176 473941 477183 480429 483187 485534 488098
50092 488098 491430 495452 499590 503476 507449 512237 518162 524879 531955 539333 547026 554696 561995 569163
50078 569163 576780 584915 592983 600589 608126 616318 625410 635004 644453 653302 661529 669513 677595 685608
50064 685608 693089 699976 706799 714024 721652 729715 738780 749481 761688 774597 787665 801169 815881
$$ packed form
50170D32760j66M72P96R03J108J475J630J168J63q90j568j877k159k667l174l073
50154D24901k109r82q23j892l147l360k470j421r06p43m39J57Q80J482J646J087
50138D11861j3r38j069m79L32J056J623J954K059K222K624K872K457J667J408
50123D29636J989K721K983K997L127L025K221J113N75P52J039J166J501K065K149
50108D59059J295J09m18nQ39J590K045K188K170K304K765L242L246K758K347K564
50092D88098L332M022M138L886L973M788N925O717P076P378P693P670P299P168
50078E69163P617Q135Q068P606P537Q192R092R594R449Q849Q227P984Q082Q013
50064F85608P481O887O823P225P628Q063R065J0701J2207J2909J3068J3504J4712
$$ plain form
50051 815881 832509 851449 872761 896262 921911 950127 981489 1015956 1052541 1089927 1127294
50040 1127294 1164399 1200858 1235496 1266539 1292587 1313541 1330547 1345011 1357724 1368924 1378903
50029 1378903 1388225 1397357 1406285 1414419 1420599 1423176 1420470 1411387 1395530 1372772 1343017 1306672 1265127
50016 1265127 1220498 1174883 1129880 1086544 1045390 1006414 969402 934384 901705 871665 844305
50005 844305 819635 797790 778716 761814 746234 731500 717634 704616 692103 679877 668293
49994 668293 657824 648261 638779 628838 618671 608724 599022 589355 579819 570753 562274 554224 546504 539162
49980 539162 532173 525513 519512 514772 511586 509619 508297 507321 506765 506841 507660 508985 510240 511023 511663 512920
49964 512920 515002 517293 519287 521375 524301 528140 532270 536162 539713 542932 545851 548805 552324 556594
$$ packed form
50051H15881J6628J8940K1312K3501K5649K8216L1362L4467L6585L7386L7367
50040A127294L7105L6459L4638L1043K6048K0954J7006J4464J2713J1200R979
50029A378903R322R132Q928Q134O180K577k706r083j5857k2758k9755l6345m1545
50016A265127m4629m5615m5003m3336m1154l8976l7012l5018l2679l0040k7360
50005H44305k4670k1845j9074j6902j5580j4734j3866j3018j2513j2226j1584
49994F68293j0469r563r482r941j0167r947r702r667r536r066q479q050p720p342
49980E39162o989o660o001m740l186j967j322r76n56P6Q19J325J255P83O40J257
49964E12920K082K291J994K088K926L839M130L892L551L219K919K954L519M270
$$ plain form
49950 556594 561382 566555 572339 578928 586193 593968 602286 611178 620544 630530 641849 655403 671614
49937 671614 690187 710472 732044 755227 781208 811419 846615 886681 931350 980725 1034830
49926 1034830 1092984 1154026 1216984 1281083 1345119 1407288 1465798 1519651 1568972 1614851 1658726
49915 1658726 1701499 1743134 1783202 1821654 1858637 1893589 1924943 1950793 1969457 1979300 1978698 1966781
49903 1966781 1944140 1912335 1872700 1825897 1772605 1714225 1652660 1589542 1525826 1461985 1398421
49892 1398421 1335670 1274392 1215326 1159225 1106637 1057636 1011750 968341 927143 888497 853026
49881 853026 821094 792499 766636 742910 721016 700870 682369 665337 649656 635276 621964
49870 621964 609189 596416 583512 570857 559098 548809 540111 532417 524736 516549 508333 500985 494783
$$ packed form
49950E56594M788N173N784O589P265P775Q318Q892R366R986J1319J3554J6211
49937F71614J8573K0285K1572K3183K5981L0211L5196M0066M4669M9375N4105
49926A034830N8154O1042O2958O4099O4036O2169N8510N3853M9321M5879M3875
49915A658726M2773M1635M0068L8452L6983L4952L1354K5850J8664R843o02j1917
49903A966781k2641l1805l9635m6803n3292n8380o1565o3118o3716o3841o3564
49892A398421o2751o1278n9066n6101n2588m9001m5886m3409m1198l8646l5471
49881H53026l1932k8595k5863k3726k1894k0146j8501j7032j5681j4380j3312
49870F21964j2775j2773j2904j2655j1759j0289q698p694p681q187q216p348o202
$$ plain form
49857 494783 489250 484003 479335 475799 473523 472148 471115 469833 467802 464988 461989 459571 457986 456878
49843 456878 455783 454515 453152 451851 450736 449836 449089 448458 448029 447953 448387 449540 451556 454228 457034 459708
49827 459708 462659 466452 470953 475395 479349 483261 487878 493482 499994 507527 516431 526866 538733 552120
49813 552120 567507 585417 606057 629440 655668 684886 717106 752249 790255 830942 873721
49802 873721 917719 962155 1006334 1049141 1088868 1123969 1153991 1179576 1201543 1220333 1236455
49791 1236455 1251111 1265825 1281294 1296810 1310864 1322095 1329398 1331267 1325589 1310507 1285581 1251946
49779 1251946 1211446 1165862 1116899 1066327 1015592 965360 915894 867974 823127 782714 747004
49768 747004 715268 686658 660796 637694 617322 599269 582749 567092 552365 539324 528482
$$ packed form
49857D94783n533n247m668l536k276j375j033j282k031k814k999k418j585j108
49843D56878j095j268j363j301j115r00p47o31m29p6M34J153K016K672K806K674
49827D59708K951L793M501M442L954L912M617N604O512P533Q904J0435J1867J3387
49813E52120J5387J7910K0640K3383K6228K9218L2220L5143L8006M0687M2779
49802H73721M3998M4436M4179M2807L9727L5101L0022K5585K1967J8790J6122
49791A236455J4656J4714J5469J5516J4054J1231P303J869n678j5082k4926l3635
49779A251946m0500m5584m8963n0572n0735n0232m9466m7920m4847m0413l5710
49768G47004l1736k8610k5862k3102k0372j8053j6520j5657j4727j3041j0842
$$ plain form
49757 528482 519352 510942 502915 495834 490202 485686 481540 477460 473647 470301 467436 465125 463452 462148
49743 462148 460579 458289 455393 452362 449636 447476 445984 445088 444692 444859 445644 446709 447459 447748 448027 448470
49727 448470 448362 446958 444784 443361 443526 444618 445466 445654 445445 444973 444049 442664 441217 440240 440009 440304 440458
49710 440458 439900 438916 438568 439545 441295 442664 443189 443350 443709 444344 445136 446060 447034 447896 448747 450025 452018
49693 452018 454488 456939 459061 460816 462320 463798 465513 467565 469820 472090 474226 476023 477250 477919
49679 477919 478384 479097 480295 481927 483721 485342 486665 487966 489730 492270 495617 499607 503836 507711 510991
49664 510991 514210 518091 522490 526481 529634 532675 536528 541093 545373 548537 550565 552088 553962 556680
49650 556680 559804 562210 563323 563935 565365 567956 570852 573154 574818 576398 578472 581424 585335 589765
$$ packed form
49757E28482r130q410q027p081n632m516m146m080l813l346k865k311j673j304
49743D62148j569k290k896l031k726k160j492q96l96J67P85J065P50K89K79M43
49727D48470j08j404k174j423J65J092Q48J88k09m72r24j385j447r77k31K95J54
49710D40458n58r84l48R77J750J369N25J61L59O35P92R24R74Q62Q51J278J993
49693D52018K470K451K122J755J504J478J715K052K255K270K136J797J227O69
49679D77919M65P13J198J632J794J621J323J301J764K540L347L990M229L875L280
49664E10991L219L881M399L991L153L041L853M565M280L164K028J523J874K718
49650E56680L124K406J113O12J430K591K896K302J664J580K074K952L911M430
$$ plain form
49636 589765 593906 597244 600027 602908 606267 609932 613513 616875 620257 623925 627806 631630 635468 639836
49622 639836 645082 650943 656992 663255 669985 676993 683813 690526 697838 706106 714754 722938 730479 737868
49608 737868 745698 754431 764386 775426 786730 797328 806996 816372 826231 836956 848736 861840 876420
49595 876420 892234 908794 925699 942672 959451 975891 992131 1008424 1024854 1041414 1058292
49584 1058292 1075821 1094071 1112782 1131775 1151129 1170794 1190348 1209430 1228229 1247186 1266381
49573 1266381 1285530 1304548 1323722 1343330 1363377 1383744 1404259 1424521 1443953 1462146 1478988
$$ packed form
49636E89765M141L338K783K881L359L665L581L362L382L668L881L824L838M368
49622F39836N246N861O049O263O730P008O820O713P312Q268Q648Q184P541P389
49608G37868P830Q733R955J1040J1304J0598R668R376R859J0725J1780J3104J4580
49595H76420J5814J6560J6905J6973J6779J6440J6240J6293J6430J6560J6878
49584A058292J7529J8250J8711J8993J9354J9665J9554J9082J8799J8957J9195
49573A266381J9149J9018J9174J9608K0047K0367K0515K0262J9432J8193J6842
$$ [...]
##END NTUPLES=NMR SPECTRUM
##END=
