
##TITLE=AC1352_CHIAH12170_6672572_iBDQRKUdyq
##JCAMPDX= 6.0         $$ Bruker NMR JCAMP-DX V2.0
##DATA TYPE= NMR SPECTRUM
##DATA CLASS= NTUPLES
##ORIGIN= BRUKER
##OWNER= Administrator
$$ 1.72 TOPSPIN		Version 2.1
$$ 2012-08-14 18:54:41.531 -0500  Administrator@TOPSPIN
$$ Compression mode = diff/dup
##.OBSERVE FREQUENCY= 400.02188249412
##.OBSERVE NUCLEUS= ^1H
##.ACQUISITION MODE= SIMULTANEOUS (DQD)
##.ACQUISITION SCHEME= undefined
##.AVERAGES= 64
##.DIGITISER RES= 22
##SPECTROMETER/DATA SYSTEM= spect
##.PULSE SEQUENCE= noesygpps1d.comp
##.SOLVENT NAME= COFFEE_meoh
##.SHIFT REFERENCE= INTERNAL, COFFEE_meoh, 1, 14.96083
##AUDIT TRAIL= $$ (NUMBER, WHEN, WHO, WHERE, PROCESS, VERSION, WHAT)
$$ ##TITLE= Audit trail, TOPSPIN		Version 2.1
$$ ##JCAMPDX= 5.01
$$ ##ORIGIN= Bruker BioSpin GmbH
$$ ##OWNER= Administrator
$$ $$ C:\Bruker\TOPSPIN/data/COFFEE/nmr/AC1352_CHIAH12170_6672572_iBDQRKUdyq/12/pdata/1/auditp.txt
$$ ##AUDIT TRAIL=  $$ (NUMBER, WHEN, WHO, WHERE, PROCESS, VERSION, WHAT)
(   1,<2012-08-14 18:54:36.203 -0500>,<Administrator>,<TOPSPIN>,<go>,<TOPSPIN 2.1>,
      <created by zg
	started at 2012-08-14 18:43:05.921 -0500,
	POWCHK enabled, PULCHK disabled,
       configuration hash MD5:
       6B 1B 68 BB D9 2E 58 E2 7F 35 AD 54 07 DF 0E 41
       data hash MD5: 64K
       17 08 A7 2B 9C C2 B9 47 2B 63 C9 56 A6 91 8D C4>)
(   2,<2012-08-14 18:54:39.531 -0500>,<Administrator>,<TOPSPIN>,<proc1d>,<TOPSPIN 2.1>,
      <Start of raw data processing
       efp LB = 0.3 FT_mod = 6 PKNL = 1 PHC0 = 0 PHC1 = 0 SI = 128K 
       data hash MD5: 128K
       8E 6A BA 43 61 98 B6 94 44 30 A9 EC 8D ED 50 43>)
(   3,<2012-08-14 18:54:40.640 -0500>,<Administrator>,<TOPSPIN>,<proc1d>,<TOPSPIN 2.1>,
      <pk PHC0 = -0.9393311 PHC1 = 0 
       data hash MD5: 128K
       11 0D 01 26 D1 1A DC 86 70 33 77 3C FA A3 8A A8>)
(   4,<2012-08-14 18:54:41.187 -0500>,<Administrator>,<TOPSPIN>,<proc1d>,<TOPSPIN 2.1>,
      <abs ABSG = 1 
       data hash MD5: 128K
       27 30 69 57 84 7B F7 7B 91 2C 52 A5 D9 DE 93 21>)
(   5,<2012-08-14 18:54:41.250 -0500>,<Administrator>,<TOPSPIN>,<proc1d>,<TOPSPIN 2.1>,
      <abs ABSG = 2 
       data hash MD5: 128K
       B3 B3 B0 BE 7D 6E 91 AB D9 D3 3E 46 A5 57 D2 72>)
(   6,<2012-08-14 18:54:41.312 -0500>,<Administrator>,<TOPSPIN>,<proc1d>,<TOPSPIN 2.1>,
      <abs ABSG = 3 
       data hash MD5: 128K
       36 48 98 AB B7 01 80 63 2B EB CC DD D9 0E 21 B8>)
(   7,<2012-08-14 18:54:41.390 -0500>,<Administrator>,<TOPSPIN>,<proc1d>,<TOPSPIN 2.1>,
      <abs ABSG = 4 
       data hash MD5: 128K
       D6 0C 43 DB 14 B2 8A A3 4A 7A AB 8A A8 EC F0 6D>)
(   8,<2012-08-14 18:54:41.437 -0500>,<Administrator>,<TOPSPIN>,<proc1d>,<TOPSPIN 2.1>,
      <abs ABSG = 5 
       data hash MD5: 128K
       25 61 91 00 31 EB E8 94 E5 E3 2F 86 18 C3 94 53>)
$$ ##END=
$$ 
$$ $$ hash MD5
$$ $$ 77 F3 E2 AE CD 8D C7 B8 DB 1A 7D 29 A7 4B F6 98
##$RELAX= 
##$RELAX= 
##$RELAX= 
##$RELAX= 
##$RELAX= 
##$RELAX= 
##$RELAX= 
##$RELAX= 
$$ Bruker specific parameters
$$ [...]
##$TP07= 0
##$TPNAME0= <>
##$TPNAME1= <>
##$TPNAME2= <>
##$TPNAME3= <>
##$TPNAME4= <>
##$TPNAME5= <>
##$TPNAME6= <>
##$TPNAME7= <>
##$TPOAL= (0..7)
0.5 0.5 0.5 0.5 0.5 0.5 0.5 0.5
##$TPOFFS= (0..7)
0 0 0 0 0 0 0 0
##$TUNHIN= 0
##$TUNHOUT= 0
##$TUNXOUT= 0
##$USERA1= <user>
##$USERA2= <user>
##$USERA3= <user>
##$USERA4= <user>
##$USERA5= <user>
##$V9= 5
##$VALIST= <valist>
##$VCLIST= <CCCCCCCCCCCCCCC>
##$VD= 0
##$VDLIST= <DDDDDDDDDDDDDDD>
##$VPLIST= <PPPPPPPPPPPPPPP>
##$VTLIST= <TTTTTTTTTTTTTTT>
##$WBST= 1024
##$WBSW= 4
##$XGAIN= (0..3)
0 0 0 0
##$XL= 0
##$YL= 0
##$YMAX_a= 10927627
##$YMIN_a= -8712507
##$ZGOPTNS= <>
##$ZL1= 120
##$ZL2= 120
##$ZL3= 120
##$ZL4= 120
##$ABSF1= 14.96083
##$ABSF2= -5.597352
##$ABSG= 5
##$ABSL= 3
##$ALPHA= 0
##$AQORDER= 0
##$ASSFAC= 0
##$ASSFACI= 0
##$ASSFACX= 0
##$ASSWID= 0
##$AUNMP= <proc_prof1d_extract.lims>
##$AXLEFT= 0
##$AXNAME= <>
##$AXNUC= <1H>
##$AXRIGHT= 0
##$AXTYPE= 0
##$AXUNIT= <>
##$AZFE= 0.1
##$AZFW= 0.1
##$BCFW= 0
##$BC_mod= 0
##$BYTORDP= 0
##$COROFFS= 0
##$CY= 15
##$DATMOD= 1
##$DC= 0
##$DFILT= <>
##$DTYPP= 0
##$F1P= 0
##$F2P= 0
##$FCOR= 0.5
##$FTSIZE= 131072
##$FT_mod= 6
##$GAMMA= 0
##$GB= 0
##$INTBC= 1
##$INTSCL= 1
##$ISEN= 128
##$LB= 0.3
##$LEV0= 0
##$LPBIN= 0
##$MAXI= 10000
##$MC2= 0
##$MEAN= 0
##$ME_mod= 0
##$MI= 0
##$NCOEF= 0
##$NC_proc= -2
##$NLEV= 6
##$NOISF1= 0
##$NOISF2= 0
##$NSP= 0
##$NTH_PI= 0
##$NZP= 0
##$OFFSET= 14.96083
##$PC= 1
##$PHC0= -0.9393311
##$PHC1= 0
##$PH_mod= 1
##$PKNL= yes
##$PPARMOD= 0
##$PPDIAG= 0
##$PPIPTYP= 0
##$PPMPNUM= 2147483647
##$PPRESOL= 1
##$PSCAL= 4
##$PSIGN= 0
##$PYNMP= <proc.py>
##$REVERSE= no
##$SF= 400.020009704377
##$SI= 131072
##$SIGF1= 0
##$SIGF2= 0
##$SINO= 400
##$SIOLD= 131072
##$SPECTYP= <>
##$SREGLST= <1H.CDCl3>
##$SSB= 0
##$STSI= 131072
##$STSR= 0
##$SW_p= 8223.68421052631
##$SYMM= 0
##$S_DEV= 0
##$TDeff= 65536
##$TDoff= 0
##$TI= <>
##$TILT= no
##$TM1= 0
##$TM2= 0
##$TOPLEV= 0
##$USERP1= <user>
##$USERP2= <user>
##$USERP3= <user>
##$USERP4= <user>
##$USERP5= <user>
##$WDW= 1
##$XDIM= 131072
##$YMAX_p= 385989396
##$YMIN_p= -19911
##$CURPLOT= <Network HP LaserJet P1505>
##$CURPRIN= <$Network HP LaserJet P1505>
##$DFORMAT= <normdp>
##$LAYOUT= <+/1D_H.xwp>
##$LFORMAT= <normlp>
##$PFORMAT= <normpl>
##$SURQMSG= 1
$$ End of Bruker specific parameters
$$ ---------------------------------
##NTUPLES= NMR SPECTRUM
##VAR_NAME=  FREQUENCY,     SPECTRUM/REAL,   SPECTRUM/IMAG
##SYMBOL=    X,             R,               I
##VAR_TYPE=  INDEPENDENT,   DEPENDENT,       DEPENDENT
##VAR_FORM=  AFFN,          ASDF,            ASDF
##VAR_DIM=   131072,        131072,          131072
##UNITS=     HZ,            ARBITRARY UNITS, ARBITRARY UNITS
##FACTOR=    0.0627417313425164, 1,          1
##FIRST=     8223.62146879497, 1782,         -57381
##LAST=      0,             2980,            -57517
##MIN=       0,             -19911,          0
##MAX=       8223.62146879497, 385989396,    0
$$ Real data points
##PAGE= N=1
##DATA TABLE= (X++(R..R)), XYDATA
$$ [...]
61738D32870k372j413r61p28k80K60M97M96O64R93J109J057J329K000K401J992
61722D39914J075M16M54J051J766K226K414K618K922K872K028O78m41j050j481
61707D57462j982k427k759l129l522l703l640l562l468l093k422j856j694j867
61693D18338k203k545k657k406k049j917j883j697j580j851k091j630p81n94j197
61678C91257j534j046m87n66q67q56r06j394j729j340q63j114j508q84L60N28
61662C77051r12k395k304r27K40L73q5k89J47R37J449J331R24R03J439K029K161
61645C82072J874J550J446J574J787J870J747J596J587J506R44j13j173j791k063
61630C94413k399k971l528l665l276k669k219j902j435q64o57r85j329j183q01
$$ plain form
61738 432870 430498 429085 428124 427396 427116 427376 427873 428369 429033 430026 431135 432192 433521 435521 437922 439914
61722 439914 440989 441405 441859 442910 444676 446902 449316 451934 454856 457728 459756 460434 459993 458943 457462
61707 457462 455480 453053 450294 447165 443643 439940 436300 432738 429270 426177 423755 421899 420205 418338
61693 418338 416135 413590 410933 408527 406478 404561 402678 400981 399401 397550 395459 393829 393048 392454 391257
61678 391257 389723 388677 388190 387624 386757 385901 384995 383601 381872 380532 379669 378555 377047 376163 376523 377051
61662 377051 376139 373744 371440 370513 370753 371126 371041 370752 370899 371836 373285 374616 375540 376443 377882 379911 382072
61645 382072 383946 385496 386942 388516 390303 392173 393920 395516 397103 398609 399553 399440 398267 396476 394413
61630 394413 392014 389043 385515 381850 378574 375905 373686 371784 370349 369485 368828 367843 366514 365331 364530
61615C64530p32r11q54o04p15j309j880k219k808l916m978n317n012m626m351
61600C24298m006l550l147k812k468k192k109k101j990j860j891k000k064k212
61586B89896k476k364j461l09M8n16j025r26r27j741k735k674j439j33M42N66
61570B72226Q01J161J346J185N60o07j929k576k098r85o8L51N14O23O74O84P22
61553B72584P81P92P01L97j96p55o91P9Q43J015R72J419K219K568K187J604J239
61536B87758R28N50L95N99P97O92N52O56O83J12q96j578j506j095j086j654k201
61519B83706k003j120m51p17j537j855j198r9O49P37K48n47j108q61O9Q42R30
61502B75685P75R63J288J185P87P03R35P51j62j093j204n91o1n9k92k99r6k4j49
$$ plain form
61615 364530 363798 362887 362033 361429 360714 359405 357525 355306 352498 348582 343604 338287 333275 328649 324298
61600 324298 320292 316742 313595 310783 308315 306123 304014 301913 299923 298063 296172 294172 292108 289896
61586 289896 287420 285056 283595 283286 283334 282818 281793 280867 279940 278199 275464 272790 271351 271218 271660 272226
61570 272226 273027 274188 275534 276719 277279 276672 274743 272167 270069 269084 269016 269367 269881 270504 271178 271862 272584
61553 272584 273365 274157 274858 275255 275059 274304 273613 273692 274535 275550 276522 277941 280160 282728 284915 286519 287758
61536 287758 288686 289236 289631 290230 291027 291719 292271 292927 293610 293722 292826 291248 289742 288647 287561 285907 283706
61519 283706 281703 280583 280132 279415 277878 276023 274825 274726 275375 276112 276360 275813 274705 273844 273913 274755 275685
61502 275685 276460 277423 278711 279896 280683 281386 282321 283072 282910 281817 280613 280022 279961 279902 279610 279311 279215 279191 279042
61483B79042j20K79O96O65L74M82J117J576J353R86J302K126K407J631M50k76
61467B94090m94o68q77p21n1O18O15j09q80j008n51j98m07q26p82j47N71R03Q61
61448B89939P11O26P36J144J650J728J166N47P06J682K574K592J891J212J039
61433C09943J362J998K661K839K162R90K08K82Q34J353J850K470K876K571J670
61418C36069Q57O08Q55J306J671J608R59R1m09m41m34o05p28p01q33j281j674
61401C36918j677j498j496j598j515j301j254j385j408j142o98l35k83n58p20
61386C20050j34J160K124J795N75j43L03J051R54J55j08Q21K044K149R71q3M01
61369C34085K229L827L944K825J670J399J987K755K961K309J150K22L5N28J285
$$ plain form
61483 279042 278922 279201 279897 280562 280936 281418 282535 284111 285464 286450 287752 289878 292285 293916 294366 294090
61467 294090 293596 292928 292051 291330 291279 291897 292512 292403 291523 290515 289964 289766 289359 288533 287751 287604 288175 289078 289939
61448 289939 290650 291276 292012 293156 294806 296534 297700 298247 298953 300635 303209 305801 307692 308904 309943
61433 309943 311305 313303 315964 318803 320965 321955 322163 322445 323279 324632 326482 328952 331828 334399 336069
61418 336069 336926 337534 338389 339695 341366 342974 343933 344024 343615 343174 342740 342135 341407 340706 339873 338592 336918
61401 336918 335241 333743 332247 330649 329134 327833 326579 325194 323786 322644 321946 321611 321328 320770 320050
61386 320050 319916 321076 323200 324995 325570 325427 325730 326781 327735 327890 327782 328603 330647 332796 333767 333684 334085
61369 334085 336314 340141 344085 346910 348580 349979 351966 354721 357682 359991 361141 361363 361398 361926 363211
61354C63211J958K493L102M056N295O267O457O088N898O194O494O273N571M703
61340D34060L847L199L045L222K897J594P1m42K47J170J517J332Q62L7j051j753
61324D53854j569r20o48q70q64q6J143K168K850L531M336M946N139N205N613O471
61308D90299P497Q424R217R944J0629J1186J1384J0989J0074Q958P695N932L546
61295F05774J123o66j871k966m049m995o089p661r161r574q830p908p366o795
61281E28966o004n586n723n535m428l206k834k847k111n95P26J404J781J955J633
61266D97596J021P99J127J524J901K779M312N853O797P200P372P452P555P722
61252E61010P521O376M478K834K096J893J536R12K93k31p89j419j979k283k258
$$ plain form
61354 363211 365169 367662 370764 374820 380115 386382 392839 398927 404825 411019 417513 423786 429357 434060
61340 434060 437907 441106 444151 447373 450270 451864 451935 451493 451740 452910 454427 455759 456621 456658 455607 453854
61324 453854 452285 451365 450717 449847 448983 448897 450040 452208 455058 458589 462925 467871 473010 478215 483828 490299
61308 490299 497796 506220 515437 525381 536010 547196 558580 569569 579643 588601 596296 602228 605774
61295 605774 606897 606231 604360 601394 597345 592350 586261 578600 569439 559865 551035 543127 535761 528966
61281 528966 522962 517376 511653 506118 501690 498484 495650 492803 490692 490097 490823 492227 494008 495963 497596
61266 497596 498617 499416 500543 502067 503968 506747 511059 516912 523709 530909 538281 545733 553288 561010
61252 561010 568531 574907 579385 582219 584315 586208 587744 588656 588949 588718 587929 586510 584531 582248 579990
61237E79990k059j972j997j745j046l55j11n7K51O41Q13J258K648M435N308N089
61221E91091N059N996P104P374O979O628O436O228O174O344O209N441M590M222
61207F75875L957L220K397K307K896L498M064M988N929O022N441N604P376R975
61193G43549J2120J3512J4494J4892J4041J1784Q839O118M035K529J394N47L8
61180H47892j76m68j351k926m659n926o667p332q241r236r931j0101r814r353
61166G61711r090r246r675j0079j0490j1352j2822j4287j4878j4369j3211j1761
61154F20451j0043q265o921o035m944l307j827j335j496j285n85m26j440k934
61140E69608l834l966l954m193m396l991k711r18N37J054R82J331K646M559O519
$$ plain form
61237 579990 577931 575959 573962 572217 571171 570816 570705 570648 570899 571540 572353 573611 576259 580694 586002 591091
61221 591091 596150 602146 609250 616624 623603 630231 636667 642895 649069 655413 661622 667063 671653 675875
61207 675875 679832 683052 685449 687756 690652 694150 698214 703202 709131 715153 720594 726198 733574 743549
61193 743549 755669 769181 783675 798567 812608 824392 833231 839349 843384 845913 847307 847854 847892
61180 847892 847716 847248 845897 842971 838312 832386 825719 818387 810146 800910 790979 780878 771064 761711
61166 761711 752621 743375 733700 723621 713131 701779 688957 674670 659792 645423 632212 620451
61154 620451 610408 602143 595222 589187 584243 580936 579109 577774 576278 574993 574408 573982 572542 569608
61140 569608 565774 561808 557854 553661 549265 545274 542563 541645 542182 543236 544218 545549 548195 552754 559273
61125E59273Q490J0632J2688J4250J5381J6526J7906J9323K0547K1573K2483K3327
61113G62399K4100K4763K5173K5120K4425K3061K1298J9715J8739J8115J7043
61102A003951J5029J2321R376O226K666j187m944q478j1957j5313j8060j9868
61090I69762k1041k2153k3339k4215k4431k4089k3488k2772k1952k1106k0227
61079G20949j9091j7577j6045j4933j4073j2880j1253r733q556p264n591m083
61067E79870l304k905k159r81J91J238K341L416M237M958N793O476O714O970P934
61052F20789R445J0785J1885J3229J4694J5618J6136J7225J9134K0872K1744K2406
61040H13962K3818K5966K8265L0365L1995L2743L2798L3254L4973L7513L9855
$$ plain form
61125 559273 567763 578395 591083 605333 620714 637240 655146 674469 695016 716589 739072 762399
61113 762399 786499 811262 836435 861555 885980 909041 930339 950054 968793 986908 1003951
61102 1003951 1018980 1031301 1040677 1046903 1049569 1048382 1043438 1034960 1023003 1007690 989630 969762
61090 969762 948721 926568 903229 879014 854583 830494 807006 784234 762282 741176 720949
61079 720949 701858 684281 668236 653303 639230 626350 615097 605364 596808 589544 583953 579870
61067 579870 576566 573661 571502 570521 570712 571950 574291 577707 581944 586902 592695 599171 605885 612855 620789
61052 620789 630234 641019 652904 666133 680827 696445 712581 729806 748940 769812 791556 813962
61040 813962 837780 863746 892011 922376 954371 987114 1019912 1053166 1088139 1125652 1165507
61029A165507M1703M3466M5299M6870M7914M8673M9851N2426N7186O4353P3938
61018A737186Q6244J01409J18536J36259J54316J73768J95824K21701K53706K94859
61008C473808L46868M09745M83495N68367O63317P67140Q82057J012588J158235
60999I765620J310057J455421J577326J638933J575480J326643Q98451L92392
60991A9940323m3012l02027l70191k98081j50977L836Q0436j3274l16387p66837
60981A7763809j226400j564194j723208j721028j607718j431459j230036j031830
60973F227936q53619p00385n71500m66191l82801l16873k63410k19911j85510
60964B267736j58524j36800j19383j06000r5432q5934p6869o8593o1011n3493
$$ plain form
61029 1165507 1207210 1250676 1295975 1342845 1390759 1439432 1489283 1541709 1598895 1663248 1737186
61018 1737186 1823430 1924839 2043375 2179634 2333950 2507718 2703542 2925243 3178949 3473808
61008 3473808 3820676 4230421 4713916 5282283 5945600 6712740 7594797 8607385 9765620
60999 9765620 11075677 12531098 14108424 15747357 17322837 18649480 19547931 19940323
60991 19940323 19897311 19595284 19225093 18927012 18776035 18779871 18860307 18847033 18530646 17763809
60981 17763809 16537409 14973215 13250007 11528979 9921261 8489802 7259766 6227936
60973 6227936 5374317 4673932 4102432 3636241 3253440 2936567 2673157 2453246 2267736
60964 2267736 2109212 1972412 1853029 1747029 1651597 1565663 1488794 1420201 1359190 1305697
60954A305697m6020l9265l3492k8413k4249k1935k1857k2964k3579k2840k1064
60943A000019j9000j7023j5146j3482j2344j1814j1482j0915j0193r721r628r741
60931H49530r958j0256j0400j0118r429q458p054n202l633l282m062m878m994
60918G57806m727m637m716m661m398m004l499k906k260j497p14m42j055k010k382
60903G13898k094j838j778j391p17o74j605k509k454j981k277l527m809n326n079
60888F75839m599m518n094n923o373o514p002p876q250p660o863o670o746o366
60874E85385n679n335n300n009m361l718l120k377j768j843k535l153l221k791
60860E35175k101j445j213j460j676j509j395j802k195j702o56l83j417k892l898
$$ plain form
60954 1305697 1259677 1220412 1186920 1158507 1134258 1112323 1090466 1067502 1043923 1021083 1000019
60943 1000019 981019 963996 948850 935368 923024 911210 899728 888813 878620 868899 859271 849530
60931 849530 839572 829316 818916 808798 799369 790911 783857 778655 775022 771740 767678 762800 757806
60918 757806 753079 748442 743726 739065 734667 730663 727164 724258 721998 720501 719787 719345 718290 716280 713898
60903 713898 711804 709966 708188 706797 706080 705406 703801 701292 698838 696857 694580 691053 686244 680918 675839
60888 675839 671240 666722 661628 655705 649332 642818 635816 627940 619690 612030 605167 598497 591751 585385
60874 585385 579706 574371 569071 564062 559701 555983 552863 550486 548718 546875 544340 541187 537966 535175
60860 535175 533074 531629 530416 528956 527280 525771 524376 522574 520379 518677 518021 517638 516221 513329 509431
60845E09431m497m948m916m131l229l093l663m084m013m115n052o471p341p165
60831D42713o450n864n335m391l164k418k406k348j431P2J177J342P71j49j134
60816D10985j831j952j618j219r93j036j455k084k293j642n74R7K04J78J01l77
60800C94491j198j724j602j134o66k05J29k6o34j146j363j745k446k770k155j274
60784C74532j254k150k908k741j858q50q2J61m06j595k604k696j926r03q8L97
60768C53029M57rp40j062n50M09R74Q24N21P03J223J426J103P74Q26Q75L59m90
60750C60652q13k30O87J199J290J438J835K279K587K637K044M73j553k770k631
60735C69124k140k680m206n363n260m404l694l260k717j986j327q68o06o67j131
$$ plain form
60845 509431 504934 499986 495070 490939 487710 484617 480954 476870 472857 468742 463690 457219 449878 442713
60831 442713 436263 430399 425064 420673 417509 415091 412685 410337 408906 408978 410155 411497 412268 412119 410985
60816 410985 409154 407202 405584 404365 403372 402336 400881 398797 396504 394862 394288 394385 394589 394767 394868 394491
60800 394491 393293 391569 389967 388833 388167 387962 388091 388065 387431 386285 384922 383177 380731 377961 375806 374532
60784 374532 373278 371128 368220 365479 363621 362771 362689 362850 362444 360849 358245 355549 353623 352720 352632 353029
60768 353029 353486 353477 352737 351675 351125 351534 352508 353332 353853 354556 355779 357205 358308 359082 359908 360783 361142 360652
60750 360652 359839 359609 360296 361495 362785 364223 366058 368337 370924 373561 375605 376078 374525 371755 369124
60735 369124 366984 364304 360098 354735 349475 345071 341377 338117 335400 333414 332087 331219 330613 329946 328815
60720C28815j678j853j590j192q69n94l79l13m34p75j410k161k424j768o35Q4
60704C10824J50J47L78L59k28o60m0J205J595N28q34j059k96P5n85j374j156J0
60686C09039J243K126K945L832M401M357L965L619L351K988K614K533K860L362
60672C53235L608L337K738K296K146J709M14j347k499k621k421k540k646k169
60658C53240j413j126j291j093j32J020J589J446J053R26J299K007K529K380J560
60643C63994M63n78j468k109k371k338k311k451k609k568k271j804j350j195j509
60628C37525k000k075j450n22L7L2q2K74J116J814J753R88J54k18j59l3j49o27
60610C36378j339j850j686q95j8N84J095J655J922J579R48N84N61O90J180K346
$$ plain form
60720 328815 327137 325284 323694 322502 321633 321039 320660 320347 319913 319138 317728 315567 313143 311375 310740 310824
60704 310824 310974 311121 311499 311858 311630 310970 310930 312135 313730 314258 313424 312365 312069 312144 311559 310185 309029 309039
60686 309039 310282 312408 315353 319185 323586 327943 331908 335527 338878 341866 344480 347013 349873 353235
60672 353235 356843 360180 362918 365214 367360 369069 369483 368136 365637 363016 360595 358055 355409 353240
60658 353240 351827 350701 349410 348317 348185 349205 350794 352240 353293 354219 355518 357525 360054 362434 363994
60643 363994 364457 363879 362411 360302 357931 355593 353282 350831 348222 345654 343383 341579 340229 339034 337525
60628 337525 335525 333450 332000 331478 331515 331547 331465 331739 332855 334669 336422 337410 337564 337346 337187 337154 337005 336378
60610 336378 335039 333189 331503 330608 330590 331174 332269 333924 335846 337425 338373 338957 339518 340208 341388 343734
60594C43734L750M396L897K876K015J342O99L33N76J224J682J566Q77j46j093
60579C67728j477j058p0J069K118K989L552L765L952M658O079P774R081R775J0240
60564D30175J0901J1600J1687J0659Q499N417J705j955m500n331n045m809n053
60551D63950n184m590l360j880k58J522L273M792O200P704R176J0327J1207J2115
60537E14994J3029J3490J3251J2658J2029J0889Q369M490M85k495m531o300p590
60524E82768p411n684l932l724m964o238o486n698m310k750j413m64M34J701L174
60509E35003M364N282O389P755R033J0343J2399J5382J8477K1028K3560K6954
60497F95969L1001L4558L6981L8685M0161M1102M0777L8900L5648L0975K4309
$$ plain form
60594 343734 347484 351880 355777 358653 360668 362010 362709 363042 363618 364842 366524 368090 368967 368821 367728
60579 367728 366251 365193 365123 366192 368310 371299 374851 378616 382568 387226 393305 401079 410160 419935 430175
60564 430175 441076 452676 464363 475022 483521 488938 490643 488688 484188 478857 473812 469003 463950
60551 463950 458766 454176 450816 448936 448678 450200 453473 458265 464465 472169 481345 491672 502879 514994
60537 514994 528023 541513 554764 567422 579451 590340 598709 603199 603684 601189 596658 590358 582768
60524 582768 575357 569673 565741 562017 557053 550815 544329 538631 534321 531571 530158 529694 530128 531829 535003
60509 535003 539367 544649 551038 558793 567826 578169 590568 605950 624427 645455 669015 695969
60497 695969 726970 761528 798509 837194 877355 918457 959234 998134 1033782 1064757 1089066
60486A089066J5160M000p762j8759k8514l7130m4290m9056n0809n0023m7848m5065
60474G28970m1787l8019l4143l0640k7539k4413k0888j7129j3790j1517j0459
60463D58646j0166r898r118p827o466n519n097m964m763m216l215k034j328j517
60449C82518k144k286j743j335j668k126j680m28M25J28p51j250j181j022r94
60434C64463q30l88m5k25p60j059q84o39p05q06m80N3J24k74l27L43R97Q44K70
60415C59672K58J017J809J990J522O61j48k13Q43K307K832J862K03q91q40N8J073
60398C74015J628J737J892K291K454K003J465J639K387K870K807K692K732K569
60384D05181K145J930K000J774J099P51J361K457L136L174K937K700K518K451
$$ plain form
60486 1089066 1104226 1108226 1100464 1081705 1053191 1016061 971771 922715 871906 821883 774035 728970
60474 728970 687183 649164 615021 584381 556842 532429 511541 494412 480622 469105 458646
60463 458646 448480 438582 429464 421637 415171 409652 404555 399591 394828 390612 387397 385363 384035 382518
60449 382518 380374 378088 376345 375010 373342 371216 369536 369108 369533 369661 368910 367660 366479 365457 364463
60434 364463 363633 363245 363200 362975 362215 361156 360272 359633 358928 358122 357642 357695 357819 357545 357218 357561 358558 359402 359672
60415 359672 359930 360947 362756 364746 366268 366929 366781 366568 367411 369718 372550 374412 374615 373724 372884 372942 374015
60398 374015 375643 377380 379272 381563 384017 386020 387485 389124 391511 394381 397188 399880 402612 405181
60384 405181 407326 409256 411256 413030 414129 414880 416241 418698 421834 425008 427945 430645 433163 435614
60370D35614K488K532K676L082L448L183K352J753J724J635J016L71K61L55J85
60355D62675J17O15J148R67O23J401L292M800M982M567M574M811M500L656K852
60340E05580J994L19k186m217m519l437k489k526k995l065k774k617k608k516
60326D71944k629l354m191m130l210k644l035l404k674j225j92K18O86J445J965
60311D45570J978J998K636L970N732P724R835J1909J3700J4888J5216J4625J3163
60298E62944J0744P358L485j46l415o861j0578j3668j5220j5355j4707j3373j1105
60285D80103q219n571l709k562j872j408r54m74l05p07j464k226k969l764m368
60270D39531m526m345l888k889j385k45k19q43j046p04o61j340k126k242j551
$$ plain form
60370 435614 438102 440634 443310 446392 449840 453023 455375 457128 458852 460487 461503 461874 462135 462490 462675
60355 462675 462792 463407 464555 465522 466145 467546 470838 475638 480620 485187 489761 494572 499072 502728 505580
60340 505580 507574 507893 505707 501490 496971 493534 491045 488519 485524 482459 479685 477068 474460 471944
60326 471944 469315 465961 461770 457640 454430 451786 448751 445347 442673 441448 441256 441474 442160 443605 445570
60311 445570 447548 449546 452182 456152 461884 469608 479443 491352 505052 519940 535156 549781 562944
60298 562944 573688 581046 584531 584385 580970 574109 563531 549863 534643 519288 504581 491208 480103
60285 480103 471884 466313 462604 460042 458170 456762 455808 455334 455029 454322 452858 450632 447663 443899 439531
60270 439531 435005 430660 426772 423883 422498 422253 422034 421191 420145 419441 418780 417440 415314 413072 411521
60255D11521m75L41K75o74j631j741j189p18l97K18Q77P28k71j064r06j88M93
60238D05199J116J707J822J241N36L28M92N95P00J174K018K874L439L539L121
60223D29901K521K392K944L529L363K541J993K547M173N969O812O335N387N227
60209D85634O179P380P927P803P478P145O695O145N677N403N326N291M997M304
60195E73384L566L231L111K552J441M38J8j21l95p93j355k439l997n076m925m157
60179E64483m062m913n712n570m712l944l729l954m247m262l803k895j776q77
60165E10027o69j236j962k027j386q97j260k054k258j442j44P39P34J33j61N61
60149D96698K013L124L274K951K911L174L360L540M063M771N079M846M566M650
$$ plain form
60255 411521 411046 411387 411662 410988 409357 407616 406427 405709 405312 405530 406407 407135 406864 405800 404894 404706 405199
60238 405199 406315 408022 409844 411085 411621 411949 412441 413036 413736 414910 416928 419802 423241 426780 429901
60223 429901 432422 434814 437758 441287 444650 447191 449184 451731 455904 461873 468685 475020 480407 485634
60209 485634 491813 499193 507120 514923 522401 529546 536241 542386 548063 553466 558792 564083 569080 573384
60195 573384 576950 580181 583292 585844 587285 587723 587741 587620 587225 586432 585077 582638 578641 573565 568640 564483
60179 564483 560421 555508 549796 544226 539514 535570 531841 527887 523640 519378 515575 512680 510904 510027
60165 510027 509358 508122 506160 504133 502747 501850 500590 498536 496278 494836 494692 495431 496165 496298 496137 496698
60149 496698 498711 501835 505109 508060 510971 514145 517505 521045 525108 529879 534958 539804 544370 549020
60135E49020N050N624O341P021P312P106O641O076N316M290L100J823N22n06r01
60120F13835p29m46k40J39Q29J544K037K376K458J764J08j701k522k123j288q55
60104F15186j066j818k879l744l905l580l678m583n431n165l952k872k299j471
60090E68743J57J888K644K319J735J497J516J505J433J378J311J123P58K78q6
60075E88199j99l54j098k425l637m300m974o350q035r022r122r076r222q987p953
60060E03445o602n651n254n195n253n039m077k506j130m13M5O75J233J452J727
60045D67457K492L420L940M060M111M088M064M652O103P319O889N006L291K615
60031E29507K217J130m46j816k906m085n328o192o494o561o861p461p834p306
$$ plain form
60135 549020 554070 559694 566035 573056 580368 587474 594115 600191 605507 609797 612897 614720 615242 614736 613835
60120 613835 613106 612660 612420 612559 613388 614932 616969 619345 621803 623567 623675 621974 619452 617329 616041 615186
60104 615186 614120 612302 609423 605679 601774 598194 594516 589933 584502 579337 575385 572513 570214 568743
60090 568743 568900 570788 573432 575751 577486 578983 580499 582004 583437 584815 586126 587249 588007 588285 588199
60075 588199 588000 587646 586548 584123 580486 576186 571212 564862 556827 547805 538683 529607 520385 511398 503445
60060 503445 496843 491192 485938 480743 475490 470451 466374 463868 462738 462325 462370 463045 464278 465730 467457
60045 467457 469949 473369 477309 481369 485480 489568 493632 498284 504387 511706 518595 523601 526892 529507
60031 529507 531724 532854 532408 530592 527686 523601 518273 512081 505587 499026 492165 484704 476870 469564
60017D69564n967m868m809n121m485k913j947k527l620l663k610j734j793k311
60003D21196k551k351j884j205l91K34K98j84p12o79N8J038J781K418L410M652
59987D25128N399N253M686M288M008L565L113K943K793K159J082K8q76j891l001
59972D58677l832m225m294l944k966j643n98Q4R36K084K892K945K740K903L297
59957D55056L421L233L012K787K467K180J965J422L20p71j134r59r88j265j074
59942D69672k11N90P28M57K43Ln47j305k015k620k976k620j374R0R01J035J236
59925D61287J941K790L243L261L169L165L196L195L283L660M361N154N680N695
59911E13080N112M019K802K102K233K723K790K319J912J891J805J222M73J45K14
$$ plain form
60017 469564 463597 458729 453920 448799 444314 441401 439454 436927 433307 429644 427034 425300 423507 421196
60003 421196 418645 416294 414410 413205 412814 413048 413346 413162 412450 411771 411829 412867 414648 417066 420476 425128
59987 425128 430527 435780 440466 444754 448762 452327 455440 458383 461176 463335 464417 464445 463569 461678 458677
59972 458677 454845 450620 446326 442382 439416 437773 437175 437259 438195 440279 443171 446116 448856 451759 455056
59957 455056 458477 461710 464722 467509 469976 472156 474121 475543 475863 475092 473958 472999 472011 470746 469672
59942 469672 469461 470051 470779 471236 471479 471482 470935 469630 467615 464995 462019 459399 458025 458115 459016 460051 461287
59925 461287 463228 466018 469261 472522 475691 478856 482052 485247 488530 492190 496551 501705 507385 513080
59911 513080 518192 522211 525013 527115 529348 532071 534861 537180 539092 540983 542788 544010 544483 544628 544842
59896E44842J14m35j133j501j296o37P7M83P03J189K021K757L204L800M855N879
59880E64922O236O024N705N272M519L831L759L954L429J899O1j543l055m486n253
59865E95274n024m369m047m094m009l523k767j983j374j011p22k65K58N41O88
59850E63573J242K444L880N044N802O022N219L058j4k928m675m821l697k224j260
59835E76665q54n25k50p10k264m257n652o040n691n044m483m244m133l650k741
59820E26127k093k326l239m207m951n410n253m135k352p75p8l67j332k381k751
59805D84477k020o16M03K00j149k683l241k468j246q12j350j891j784j540j850
59790D62430k404k423j899j451j211p14J45Q31R57P61N79M17J79n9k33l95n09
$$ plain form
59896 544842 544956 544521 543388 541887 540591 539954 540031 540514 541217 542406 544427 547184 550388 554188 559043 564922
59880 564922 571158 577182 582887 588159 592678 596509 600268 604222 607651 609550 609611 608068 605013 600527 595274
59865 595274 590250 585881 581834 577740 573731 570208 567441 565458 564084 563073 562351 562086 562344 562885 563573
59850 563573 564815 567259 571139 576183 581985 588007 593226 596284 596270 593342 588667 583846 580149 577925 576665
59835 576665 575811 575286 575036 574326 572062 567805 562153 556113 550422 545378 540895 536651 532518 528868 526127
59820 526127 524034 521708 518469 514262 509311 503901 498648 494513 492161 491386 491308 490941 489609 487228 484477
59805 484477 482457 481841 482244 482444 481295 478612 475371 472903 471657 470845 469495 467604 465820 464280 462430
59790 462430 460026 457603 455704 454253 453042 452328 452473 453304 454261 455022 455601 456018 456197 456138 455905 455510 455001
59773D55001l93mN05J044J570J833J542Q48L52M65J036J729K419L071L561L894
59757D78473M327N029N742O019N784N421N359N763O614P835R152R972R738Q504
59743E73732O996N988N632N525N175M298K838J064m14j139j309j569k293l277
59729F01247m091m373l909k850j900j813k569l375l558l076k220j354r84j447
59715E63728k313k647k139j368r02p17p61j191j694j355J54J944K991L278L256
59700E60264K921K198J627J745K194K293K097K028J925J407Q05P05P42N7j131
59685E81877j584r34l12p49j729j998j201j49J49o07j975l276m221m993n716o178
59669E46404o264o223o089n361l906k617k295k336j542m4Q24M76j94k54K90J161
$$ plain form
59773 455001 454608 454604 455109 456153 457723 459556 461098 461946 462298 462763 463799 465528 467947 471018 474579 478473
59757 478473 482800 487829 493571 499590 505374 510795 516154 521917 528531 536366 545518 555490 565228 573732
59743 573732 580728 586716 592348 597873 603048 607346 610184 611248 610834 609695 608386 606817 604524 601247
59729 601247 597156 592783 588874 586024 584124 582311 579742 576367 572809 569733 567513 566159 565175 563728
59715 563728 561415 558768 556629 555261 554359 553642 552881 551690 549996 548641 548795 550739 553730 557008 560264
59700 560264 563185 565383 567010 568755 570949 573242 575339 577367 579292 580699 581504 582209 582951 583008 581877
59685 581877 580293 579359 579047 578298 576569 574571 573370 573221 573370 572763 570788 567512 563291 558298 552582 546404
59669 546404 540140 533917 527828 522467 518561 515944 513649 511313 509771 509727 510551 511027 510833 510579 510869 512030
59653E12030K330L434L721L182K867L407L968L392J673l09j946l087l615l611
59639E27436l617m073m667m846m692m664m691m140k765j159j60j33q10j639k171
59624D83209k327k359k556k958l324l331k907k462k574l192l472k831j813j383
59610D45720j544j479r10m29l66j69O30J655K285K354J901Q93k93p95l24K68J16
59593D49513m24m75m7J01j66j53M60R68N85n98j868k760l246l377l154k735k413
59576D30211k237j844r48L4J92q16k186k773k348j647j258j002n03J36N46O95
59560D14252Q87J262J528J322O83J33J38O29J185J660K215K728K780K498K780
59545D36680M067N474N925N781O406Q291J0549J2206J3220J4119J5283J6488J6515
$$ plain form
59653 512030 514360 517794 521515 524697 527564 530971 534939 538331 540004 539695 537749 534662 531047 527436
59639 527436 523819 519746 515079 510233 505541 500877 496186 492046 489281 488122 487962 487829 487019 485380 483209
59624 483209 480882 478523 475967 473009 469685 466354 463447 460985 458411 455219 451747 448916 447103 445720
59610 445720 444176 442697 441787 441358 440992 440823 441453 443108 445393 447747 449648 450541 450248 449453 449129 449397 449513
59593 449513 449089 448614 448567 448668 448502 448349 448809 449777 450362 449764 447896 445136 441890 438513 435359 432624 430211
59576 430211 427974 426130 425182 425216 425408 424592 422406 419633 417285 415638 414380 413378 412875 413011 413557 414252
59560 414252 415139 416401 417929 419251 419934 420067 420205 420834 422019 423679 425894 428622 431402 433900 436680
59545 436680 440747 446221 452146 457927 464333 472624 483173 495379 508599 522718 538001 554489 571004
59532E71004J3578P114q55p182j0300j0679r077n913k298J13R79J515K328K460
59518E52787J295j61r11j492k693l943m438m779n926p338p785p390p287p582p363
59503D84994o517n997o145o170n522m534l523k374j286p54n52J74J352J669M26
59488D45241j137j287P2J495J901J647J707K363L018L122L033L598M991O291O532
59473D82587N768M729L730K568J292M04J97M22P40J084J499J916K207K325K430
59458E13898K903L953N131N640N441N508O541P900Q462Q067P386O722N816M660
59444E98028L557K344M20k258m854o607p567q193q656q761q203o824m879l101
59430E34446k152k036k143j790n61J490L704N258O137P229R048J0978J2301J3398
$$ plain form
59532 571004 584582 591696 590841 583659 573359 562680 553603 547690 545392 545505 546484 547999 550327 552787
59518 552787 554082 553921 553010 551518 548825 544882 540444 535665 529739 522401 514616 507226 499939 492357 484994
59503 484994 478477 472480 466335 460165 454643 450109 446586 444212 442926 442172 441620 441794 443146 444815 445241
59488 445241 444104 442817 442889 444384 446285 447932 449639 452002 455020 458142 461175 464773 469764 476055 482587
59473 482587 488355 493084 496814 499382 500674 501078 501275 501697 502437 503521 505020 506936 509143 511468 513898
59458 513898 516801 520754 525885 531525 536966 542474 549015 556915 565377 573444 580830 587552 593368 598028
59444 598028 601585 603929 604349 602091 597237 590630 583063 574870 566214 557453 549250 542426 537547 534446
59430 534446 532294 530258 528115 526325 525764 527254 530958 536216 542353 549582 558630 569608 581909 595307
59416E95307J5003J6848J8075J8620J9186K0078K0962K1356K0252J5777P015l758
59404G84721j2321j6426j7172j6302j3956r853m984p31K481M262L012k569j1005
59391F89157j8542k2384k2576k0818j8510j6152j3727j1135q567o591n594n131
59379E19430m326k893j399m01K08Q32J548K116K445K722L079L310L151K792K864
59364E35478L697M804N366N167M726M633N090O045P299Q422R095R627J0714J2501
59350F32664J4350J5692J6612J7329J7646J7295J6467J5510J4448J3246J2190
59339H03449J1533J0869R450P032M009Q01k498n743q582j0792j2550j4090j5377
59326G77511j6217j6531j6307j5466j4058j2499j1237j0126q532o308m312l459
$$ plain form
59416 595307 610310 627158 645233 663853 683039 703117 724079 745435 765687 781464 788479 784721
59404 784721 772400 755974 738802 722500 708544 698691 693707 692976 695457 699719 702731 700162 689157
59391 689157 670615 648231 625655 604837 586327 570175 556448 545313 536746 530155 524561 519430
59379 519430 515104 512211 510812 510411 510619 511451 512999 515115 517560 520282 523361 526671 529822 532614 535478
59364 535478 539175 543979 549345 554512 559238 563871 568961 575006 582305 590727 599822 609449 620163 632664
59350 632664 647014 662706 679318 696647 714293 731588 748055 763565 778013 791259 803449
59339 803449 814982 825851 835301 842333 846342 847143 844645 838902 830320 819528 806978 792888 777511
59326 777511 761294 744763 728456 712990 698932 686433 675196 665070 656538 650230 645918 642459
59314F42459l536l481k793j993j599j323o24N53K007L719N550O994P828Q531R459
59299F71751J0014R276P078L723q33o484j1941j5431j6464j6003j4825j2834j0140
59286E96887p618n844m427k877j415l48N88J698K777L650M612N752O487O493O495
59271F12910P375Q880R992J0276J0105R793R234Q312P007N159K684R7j814k850
59257F97160l557m457n597o841q112r133r409q776p712o852o260n508m317k867
59243F07762j450j38J020J743J849J692J862K371K672K564K523K822K921K267
59229F32480J119k8j312k965m404m933n054n903p406q242p769o768n984n132l942
59214E63757l022k847k836k231j179k06O35J250J022k12j347j309o68p75j678
$$ plain form
59314 642459 638923 635442 632649 630656 629057 627734 627110 627663 629670 633389 638939 645933 653761 662292 671751
59299 671751 681765 691041 698119 701842 701009 694525 682584 667153 650689 634686 619861 607027 596887
59286 596887 589269 583425 578998 576121 574706 574358 574946 576644 579421 583071 587683 593435 599922 606415 612910
59271 612910 620285 629165 639157 649433 659538 669331 678565 686877 693884 699043 701727 701824 700010 697160
59257 697160 693603 689146 683549 676708 668596 659463 650054 641278 633566 626714 620454 614946 610629 607762
59243 607762 606312 606174 607194 608937 610786 612478 614340 616711 619383 621947 624470 627292 630213 632480
59229 632480 633599 633571 632259 629294 624890 619957 614903 609000 601594 593352 585583 578815 572831 567699 563757
59214 563757 560735 557888 555052 552821 551642 551436 552071 553321 554343 554131 552784 551475 550807 550032 548354
59199E48354k132j524n62M6M38Q54J093J106J311J869K290K209J952J912J916
59184E61132J692J464J608K009K388K891L796M741M926M256L602L719M306M589
59170F07119M439M374M626M860M949N348O366P482P881P347O270N031L788K608
59156F82488J369k92k447m548o096p272q373r008q692p959p812q158p887o615
59142E98698n267m647m534m544m847n416n635n249m818m533l620j799l82o54j875
59127E40878k172j059K66R24J340K114K999L523L819M395N453O692P567P673P168
59112E91580O719O812P281P694P877P763P187O318N798N853N714M622L052K083
59098F76353J837J461N06n46j231j644j937k049k105k385k695k493j840j586k254
$$ plain form
59199 548354 546222 544698 544136 544182 544620 545474 546567 547673 548984 550853 553143 555352 557304 559216 561132
59184 561132 562824 564288 565896 567905 570293 573184 576980 581721 586647 590903 594505 598224 602530 607119
59170 607119 611558 615932 620558 625418 630367 635715 642081 649563 657444 664791 671061 676092 679880 682488
59156 682488 683857 683565 681118 676570 670474 663202 654829 645821 637129 629170 621358 613200 605313 598698
59142 598698 593431 588784 584250 579706 574859 569443 563808 558559 553741 549208 545588 543789 543407 542753 540878
59127 540878 538706 537647 537913 538837 540177 542291 545290 548813 552632 557027 562480 569172 576739 584412 591580
59112 591580 598299 605111 612392 620086 627963 635726 642913 649231 655029 660882 666596 671218 674270 676353
59098 676353 678190 679651 680157 679611 678380 676736 674799 672750 670645 668260 665565 663072 661232 659646 657392
59083F57392l315l968m152m414n090o070p082p866q157p795o954o120n731n761
59069E74917n653m924l865l327l595l976l829l512l674m004l610k489j703j906
59055E24850k458k420j844j516j792k170k024j342o86n10o41n39m1M34N47N20
59039E08368O99R43R30Q58J285K306L369L968M110M093M228M855O171P930R555
59024E63668J0726J1629J2523J3277J3514J3111J2442J2042J1958J1527J0007
59013F96424P373M239J128j729l926m966n046n023n234n055m070k831j793l79
58999F69112J877M086N050N101N428N965N458L709K157J807J967J733J506K043
58985G16999K885K801J426m05j729k169j802r24O6R24J757K779M060N599P384
$$ plain form
59083 657392 654077 650109 645957 641543 636453 630383 623301 615435 607278 599483 592529 586409 580678 574917
59069 574917 569264 564340 560475 557148 553553 549577 545748 542236 538562 534558 530948 528459 526756 524850
59055 524850 522392 519972 518128 516612 514820 512650 510626 509284 508598 508088 507447 506908 506867 507301 507848 508368
59039 508368 509067 510010 510940 511798 513083 515389 518758 522726 526836 530929 535157 540012 546183 554113 563668
59024 563668 574394 586023 598546 611823 625337 638448 650890 662932 674890 686417 696424
59013 696424 703797 708036 709164 707435 703509 698543 693497 688474 683240 678185 674115 671284 669491 669112
58999 669112 670989 675075 680125 685226 690654 696619 702077 705786 707943 709750 711717 713450 714956 716999
58985 716999 719884 722685 724111 723706 721977 719808 718006 717082 717148 718072 719829 722608 726668 732267 739651
58970G39651R189J0583J1408J1912J2276J2362J2133J1900J1789J1347J0129Q398
58958H73077O767N298L541J378p30k541m558p326j0437j2750j3633j3572j3340
58945H11174j3021j2310j1465j1188j1419j1071r373p030n359m629l944k692j429
58932G06244j121j911k923l185k545j695j336j441j510j371j319j524j846k301
58918F80216l055l714l406k022o56k23l23j49K49N32J200K850M752N588N540O221
58902F93600Q266J0290J0898J0603J0946J2402J4001J4671J4222J3173J2119J1447
58890H36638J1354J1960J3237J4785J5975J6522J6713J6701J5963J3953J1061
58879I94862Q201N614K768n88l935o718q950j0969j2981j4913j6313j6531j5408
$$ plain form
58970 739651 748840 759423 770831 782743 795019 807381 819514 831414 843203 854550 864679 873077
58958 873077 879844 885142 888683 890061 889331 886790 882232 874906 864469 851719 838086 824514 811174
58945 811174 798153 785843 774378 763190 751771 740700 731327 724297 718938 714309 710365 707673 706244
58932 706244 705123 703212 700289 697104 694559 692864 691528 690087 688577 687206 685887 684363 682517 680216
58918 680216 677161 673447 670041 668019 667363 667140 666817 666668 666917 667449 668649 671499 676251 681839 687379 693600
58902 693600 701866 712156 723054 733657 744603 757005 771006 785677 799899 813072 825191 836638
58890 836638 847992 859952 873189 887974 903949 920471 937184 953885 969848 983801 994862
58879 994862 1003063 1008677 1011445 1010857 1006922 1000204 991254 980285 967304 952391 936078 919547 904139
58866I04139j3707j2369j1508j0691r898r510r466r265q806q484q437q430q463
58853G75105q774r170r088q394p486o589n663m938m776m960m956m923n560o849
58839F82979p902q248q407q870r328r340q941q308p348o071m746l535k436j654
58825E87845j383j236o39K62R02J445K551L999M673M184L387L033L033L283L991
58810F19330M669M212K582J232J092J312Q04j87j020k005l512m735m731m138m395
58795F10510n671o762o874o382n897n573n353n172m794m061l152k249j151K25
58781E47644J401J920K086K521L247L821M020L883L292K153P79m42j571k857m135
58766E67762m997n298n165m742m267m015l835l129j725l38L14M21O56J286K150
$$ plain form
58866 904139 890432 878063 866555 855864 845966 836456 826990 817725 808919 800435 791998 783568 775105
58853 775105 766331 757161 748073 739679 732193 725604 719941 715003 710227 705267 700311 695388 689828 682979
58839 682979 675077 666829 658422 649552 640224 630884 621943 613635 606287 600216 595470 591935 589499 587845
58825 587845 586462 585226 584587 584849 585751 587196 589747 593746 598419 602603 605990 609023 612056 615339 619330
58810 619330 623999 628211 630793 632025 633117 634429 635233 635046 634026 632021 628509 623774 619043 614905 610510
58795 610510 604839 598077 591203 584821 578924 573351 567998 562826 558032 553971 550819 548570 547419 547644
58781 547644 549045 550965 553051 555572 558819 562640 566660 570543 573835 575988 576767 576325 574754 571897 567762
58766 567762 562765 557467 552302 547560 543293 539278 535443 532314 530589 530251 530565 530986 531642 532928 535078
58751E35078L060L642L292J911L98j64L69J306J982K156J949J852K436L554M250
58736E67071L880K960K415K549L122L976M910N438N335N061N088N141M686L819
58722F25451L054K602K316K162K135K076K010K331L276M469N409N969O052N319
58708F74631L756K044P99j67j361k854m469o267q276j0156j1578j2653j3552j4190
58694E95707j4557j4828j4798j3897j2122j0287q943p796o591n694n275m870m293
58681D71756m062m196l759k442j528k141l402l545k140j13J739L098L685L641
58667D56591L830M690N456N552N860P316R047R398Q216O584M827K410m60k781
58653E26536m184n040n342m921m517n108o236o477n503m255l133j605K37J349
$$ plain form
58751 535078 538138 541780 545072 546983 547381 547217 547586 548892 550874 553030 554979 556831 559267 562821 567071
58736 567071 570951 573911 576326 578875 581997 585973 590883 596321 601656 606717 611805 616946 621632 625451
58722 625451 628505 631107 633423 635585 637720 639796 641806 644137 647413 651882 657291 663260 669312 674631
58708 674631 678387 680431 681230 681063 679702 676848 672379 666112 657836 647680 636102 623449 609897 595707
58694 595707 581150 566322 551524 537627 525505 515218 506275 498479 491888 486194 480919 476049 471756
58681 471756 467694 463498 459739 457297 455769 453628 450226 446681 444541 444428 446167 449265 452950 456591
58667 456591 460421 465111 470567 476119 481979 489295 498342 507740 515956 522540 527367 529777 529317 526536
58653 526536 522352 517312 511970 507049 502532 497424 491188 484711 479208 474953 471820 470215 470452 471801
58639D71801J307Q59O04M14M35J286K803L895M107M162M492M409L371K002J193
58624E07140R97R76R02P11L85K56P05J421J658J427J491J967J922Q63k67j82J171
58607E23543K624K968J881J29r73o96M51J422J765J514N43j101k517k697j869
58592E26987j117p52j65P98J583K157L255N035O685P735Q763J0323J2015J3030
58578E96332J2887J1436Q992O642N501N430N375N048N235O260P451Q534J0282
58565F95405J3061J5868J7689J8929K0562K2551K3978K4371K4035K3284K1886
58554I21619J9303J5196R903M448j67l702o374q063q451p781o853o221o139p032
58540I09686r136j1729j3751j5247j7177j9626k1315k1301k0140j8878j7729j6266
$$ plain form
58639 471801 473108 473967 474571 474985 475420 476706 479509 483404 487511 491673 496165 500574 503945 505947 507140
58624 507140 508137 509113 510015 510726 511111 511367 512072 513493 515151 516578 518069 520036 521958 522821 522554 522372 523543
58607 523543 526167 529135 531016 531145 530172 529476 529927 531349 533114 534628 535171 534070 531553 528856 526987
58592 526987 525870 525118 524953 525751 527334 529491 532746 537781 544466 552201 560964 571287 583302 596332
58578 596332 609219 620655 629647 636289 641790 647220 652595 657643 662878 669138 676589 685123 695405
58565 695405 708466 724334 742023 760952 781514 804065 828043 852414 876449 899733 921619
58554 921619 940922 956118 966021 970469 970302 966600 960226 952163 943712 935931 929078 922857 916718 909686
58540 909686 900550 888821 875070 859823 842646 823020 801705 780404 760264 741386 723657 707391
58528G07391j4245j1780r196p048n673m661l312j786r22r05r38n37k33o07j436
58513F44112k216k820l195l026k146q79K40P79L61j024k673l665l807l584l259
58498F13198k754k181j805j408n92M01R70J172J611K441L333M330N704P025P519
58483F38964P334P454Q300R446J0733J2451J4325J5473J5576J5126J4289J2580
58471G82051R740O090J956k317n870p965q976r729j0021r123p405n958m714k605
58457G25154L52K852M417N950P873R359R883R998R958R074P025M431J641j740
58443H06227n638r059j1297j2327j1946r983p477n921n038l196l31J573J605J408
58429G28600K601M614O182P230Q092Q420Q145Q139Q803R153Q268O401L938O91
$$ plain form
58528 707391 693146 681366 672170 665122 659449 654788 651476 649690 648768 647863 646925 646388 646155 645548 644112
58513 644112 641896 639076 635881 632855 630709 629830 630070 630849 631210 630186 627513 623848 620041 616457 613198
58498 613198 610444 608263 606458 605050 604458 604859 605829 607001 608612 611053 614386 618716 624420 631445 638964
58483 638964 646298 653752 662052 671498 682231 694682 709007 724480 740056 755182 769471 782051
58471 782051 791791 797881 799837 797520 791650 783685 774709 764980 754959 745836 738431 732473 727759 725154
58457 725154 725506 728358 732775 738725 746598 755957 765840 775838 785796 794870 801895 806326 807967 806227
58443 806227 800589 791530 780233 767906 755960 745977 738500 732579 727541 724345 724014 725587 727192 728600
58429 728600 731201 735815 741997 749227 757319 765739 773884 782023 790826 799979 808247 814648 818586 819277
58415H19277k954n689p086q275r888j0861j0271q870p706o672n560n063n461n587
58401G19334m409k526j009J55J351K193K228J816J426J004O49Q30J324J233N41
58386G26140L00P84J052Q11R04J351R71k71o14P71K455L239L881N167O387P026
58370G60354P963R535J0455J0098R819J0578J1273J1076J1193J2550J3845J3846
58358H92585J3578J4134J4294J2617J0104Q459P301N355L111J917J713J584J564
58345I88316J968K232K115K670M382N897O268O732Q431J0256J0950J1471J3052
58332A074740J4674J4884J4460J4884J5615J5256J4079J3111J1993R930P510N603
58320A226739L834J933R89J543K252K295K954M868O179N791N877Q346J1260J1872
$$ plain form
58415 819277 816323 810634 803548 795273 785385 774524 764253 755383 747677 741005 735445 730382 724921 719334
58401 719334 714925 712399 711390 711545 712896 715089 717317 719133 720559 721563 722212 723042 724366 725599 726140
58386 726140 726440 727224 728276 729087 729991 731342 732313 732042 731428 732199 734654 737893 741774 746941 753328 760354
58370 760354 768317 777852 788307 798405 808224 818802 830075 841151 852344 864894 878739 892585
58358 892585 906163 920297 934591 947208 957312 965771 973072 978427 981538 983455 985168 986752 988316
58345 988316 990284 992516 994631 997301 1001683 1007580 1013848 1020580 1029011 1039267 1050217 1061688 1074740
58332 1074740 1089414 1104298 1118758 1133642 1149257 1164513 1178592 1191703 1203696 1213626 1221136 1226739
58320 1226739 1230573 1232506 1233495 1235038 1237290 1239585 1242539 1247407 1253586 1259377 1265254 1273600 1284860 1296732
58306A296732J1024J1294J2763J3834J4491J5408J5663J4512J3774J5165J7117
58295A451777J7315J6600J6996J7916J7823J7767J9508K1940K3017K3502K5070
58284A669231K6629K6444K5982K7503K9665K9887K9272L0648L3274L4295L4178
58273A997008L5835L9265M1716M2616M3826M5671M6939M8168N0816N3902N5436
58262B501198N6238N8477O1638O3807O5573O8458P1172P1678P1357P2689P4636
58251C236921P4856P4580P6448P9698Q2378Q6047R2894J00632J05977J10744J18481
58240D239656J27615J34463J40552J50045J62035J72497J81796J93118K05626
58231E707403K16649K28439K44996K64399K82334L00741L24649L52992L81505
$$ plain form
58306 1296732 1307756 1319050 1331813 1345647 1360138 1375546 1391209 1405721 1419495 1434660 1451777
58295 1451777 1469092 1485692 1502688 1520604 1538427 1556194 1575702 1597642 1620659 1644161 1669231
58284 1669231 1695860 1722304 1748286 1775789 1805454 1835341 1864613 1895261 1928535 1962830 1997008
58273 1997008 2032843 2072108 2113824 2156440 2200266 2245937 2292876 2341044 2391860 2445762 2501198
58262 2501198 2557436 2615913 2677551 2741358 2806931 2875389 2946561 3018239 3089596 3162285 3236921
58251 3236921 3311777 3386357 3462805 3542503 3624881 3710928 3803822 3904454 4010431 4121175 4239656
58240 4239656 4367271 4501734 4642286 4792331 4954366 5126863 5308659 5501777 5707403
58231 5707403 5924052 6152491 6397487 6661886 6944220 7244961 7569610 7922602 8304107
58222H304107M11994M49255M91635N34720N81641O39151P06477P79367Q62046
58213A3760393R62979J082271J216737J374515J570620J811140K096404K434672
58205B6309731K834389L286289L773758M300412M889619N562125O338232P258428
58197F4552983Q372812R707210J1263718J3050611J5079812J7336977J9787027
58190A59151150K2395259K5081054K7635612K9719563L0897198L0541824K7713997
58183C53135657K1428539J1425200j173746j4084851k4920475l2215068l5705663
58176B77889593l5963538l3907907l0490852k6514716k2531723j8853919j5635831
58169I3991107j2932202j0715289q909094p440858o256221n300155m516262l867514
$$ plain form
58222 8304107 8716101 9165356 9656991 10191711 10773352 11412503 12118980 12898347 13760393
58213 13760393 14723372 15805643 17022380 18396895 19967515 21778655 23875059 26309731
58205 26309731 29144120 32430409 36204167 40504579 45394198 50956323 57294555 64552983
58197 64552983 72925795 82633005 93896723 106947334 122027146 139364123 159151150
58190 159151150 181546409 206627463 234263075 263982638 294879836 325421660 353135657
58183 353135657 374564196 385989396 384815650 370730799 345810324 313595256 277889593
58176 277889593 241926055 208018148 177527296 151012580 128480857 109626938 93991107
58169 93991107 81058905 70343616 61434522 53993664 47737443 42437288 37921026 34053512
58161C4053512l335536k898811k530706k217236j956530j740143j551989j385333
58153A6437228j243649j124074j015550r13937q24271p47013o75700o09034n52168
58144H731832n04716m59745m15960l79269l50981l25557l01409k82986k70286
58135E440923k56661k39330k22792k09549j96266j81416j68425j58806j49517
58126C658161j39248j30527j23922j16693j08636j02813r9306r4537q7741q2060
58116B572678p8274p3698o8062o4255o2392n9267n4668n2073n2131n1440m9013
58105A907405m7930m9312n0312m9467m8562m7905m5266m0861l7997l7339l5761
58094A416693l2331l0054l0140k9663k6939k4285k3528k3191k2109k1449k1429
$$ plain form
58161 34053512 30717976 27819165 25288459 23071223 21114693 19374550 17822561 16437228
58153 16437228 15193579 14069505 13053955 12140018 11315747 10568734 9893034 9284000 8731832
58144 8731832 8227116 7767371 7351411 6972142 6621161 6295604 5994195 5711209 5440923
58135 5440923 5184262 4944932 4722140 4512591 4316325 4134909 3966484 3807678 3658161
58126 3658161 3518913 3388386 3264464 3147771 3039135 2936322 2837016 2742479 2654738 2572678
58116 2572678 2494404 2420706 2352644 2288389 2225997 2166730 2112062 2059989 2007858 1956418 1907405
58105 1907405 1859475 1810163 1759851 1710384 1661822 1613917 1568651 1527790 1489793 1452454 1416693
58094 1416693 1384362 1354308 1324168 1294505 1267566 1243281 1219753 1196562 1174453 1153004 1131575
58083A131575k0207j7800j6967j8507j9685j8998j8437j9286j9721j8522j7458
58072I25987j7893j8415j7755j6889j6593j5892j4459j3584j3476j2551j0524
58061G57956r104q733p860o349o149p511q146p295p085q491r592r306r274j0324
58047F42737j0580q957p287p072p165o534o256o913o977n716m869n558o274n862
58033E46717n723p004q204p774o818p053q106q728q868q838q269p323p132p742
58019D39135p579o067m682m348m083l309l042l584l519k350j625k055k119r66
58005C89807r8n14p95J91J142P67R3M21J162J516K110L157L202J503l58j035j332
57988D00939j973j862n48N0j368l056l117k606l247m125l524k279k378l545l941
$$ plain form
58083 1131575 1111368 1093568 1076601 1058094 1038409 1019411 1000974 981688 961967 943445 925987
58072 925987 908094 889679 871924 855035 838442 822550 808091 794507 781031 768480 757956
58061 757956 748852 740119 732259 725910 719761 712250 704104 696809 689724 681233 671641 662335 653061 642737
58047 642737 632157 623200 615913 608841 601676 595142 588886 581973 574996 569280 564411 558853 552579 546717
58033 546717 540994 533990 525786 518012 511194 504141 496035 487307 478439 469601 461332 454009 446877 439135
58019 439135 431556 425489 420807 416459 412376 409067 406025 402441 398922 396572 394947 392892 390773 389807
58005 389807 389709 389195 388400 388591 389733 390500 390593 391014 392176 393692 395802 398959 402161 403664 403306 402271 400939
57988 400939 398966 397104 396556 396606 395238 392182 389065 386459 383212 379087 375563 373284 370906 367361 363420
57973C63420l339k947k983k737k377k587l035k945k482j984q94R65K205J710N14
57958C40504J80N00N10M26O95M24j235l170l771l220k506j392N67K193K133J254
57942C34092J340K306K837K996L850N164N846O232P542R313R670Q254O757O359
57928D12558O431O019M999L412J140j435l535m924n941o744p327p862q242p773
57914C80776o348n191n267n724n174l874l167l309l379l041k877l179l617l970
57900C22659m171l905l185k792l166l424k595j207m04j43L90J151J481J547K019
57885C04255K643K539J760J199J115R02K76l81q06j052j102j099j496k246k460
57870C04047j707r61j154j688j544j096j328j981k068j687j672j805j084L95J445
$$ plain form
57973 363420 360081 357134 354151 351414 349037 346450 343415 340470 337988 336004 335110 336075 338280 339990 340504
57958 340504 340684 341184 341694 342120 342815 343239 342004 338834 335063 331843 329337 327945 328512 330705 332838 334092
57942 334092 335432 337738 340575 343571 347421 352585 358431 364663 372205 381518 391188 399442 406199 412558
57928 412558 418989 425008 430007 433419 434559 433124 429589 424665 418724 411980 404653 396791 388549 380776
57914 380776 374428 369237 363970 358246 353072 349198 346031 342722 339343 336302 333425 330246 326629 322659
57900 322659 318488 314583 311398 308606 305440 302016 299421 298214 297810 297667 298057 299208 300689 302236 304255
57885 304255 306898 309437 311197 312396 313511 314413 314689 314308 313502 312450 311348 310249 308753 306507 304047
57870 304047 302340 301379 300225 298537 296993 295897 294569 292588 290520 288833 287161 285356 284272 284667 286112
57855B86112J746K261L481M557M465L154J306k67r78q79o41o26n17l35q97k418
57839B99524l633l540l012l295l779l066j534r17j592k191j873j165m66N27J663
57824B71651K133J836J640K000K507K905L305L280K087J46j050r14n27j042k357
57809B87600l730m742n207n029m489m072l761l185k467k142k180j967j350r25
57795B42354j116j711k379k941l075k455j238J12J418K629L329L175K573K248
57781B42923K301K390K443K499K227J531J129J621K447K765K785L047L009J794
57767B74911k7j051j237j890l419m748n219n492o181o919p370p907q667q971q310
57752A97503p003n510l744j592O28K546M088N183N709N765N491M720L436K349
$$ plain form
57855 286112 287858 290119 293600 298157 302622 305776 307082 306815 305837 304958 304317 303691 303174 302839 301942 299524
57839 299524 295891 292351 289339 286044 282265 279199 277665 276748 275156 272965 271092 269927 269461 269988 271651
57824 271651 273784 275620 277260 279260 281767 284672 287977 291257 293344 293490 292440 291526 290999 289957 287600
57809 287600 283870 279128 273921 268892 264403 260331 256570 253385 250918 248776 246596 244629 243279 242354
57795 242354 241238 239527 237148 234207 231132 228677 227439 227551 228969 231598 234927 238102 240675 242923
57781 242923 245224 247614 250057 252556 254783 256314 257443 259064 261511 264276 267061 270108 273117 274911
57767 274911 274884 273833 272596 270706 267287 262539 257320 251828 245647 238728 231358 223451 214784 205813 197503
57752 197503 190500 184990 181246 179654 180282 182828 186916 192099 197808 203573 209064 213784 217220 219569
57738B19569K193K667K898K753K748K865K537J755J125Q33N23J26p1j46l82n69
57722B41424m33m98j369k535l045l096l546m146l904k944k323k013j008L64K85
57707B11213j724l740m035l174k529k271j929j639j602j258k06Q51J008M19k05
57692A89179o18q69q35o56r54j811k240j380L13J783K757L662M664N559O423P734
57676B12711R918J2926J6157J8842K0909K3367K7228L2151L6861M0670M3522M4499
57664E39761M1549L3176J9622K399j6154l2654m3633m7837m6957m3516l8807l3204
57652C33745k7334k2009j7633j4349j2198j0722r074p103n542m802m271l347k251
57639A93110j361n74J32L00j20l91r4J30l96j285j762j742j588j398j221j364
$$ plain form
57738 219569 221762 224429 227327 230080 232828 235693 238230 239985 241110 241943 242466 242592 242521 242375 241993 241424
57722 241424 240991 240493 239124 236589 233544 230448 226902 222756 218852 215908 213585 211572 210564 210928 211213
57707 211213 209489 205749 201714 198540 196011 193740 191811 190172 188570 187312 187106 187957 188965 189384 189179
57692 189179 188561 187692 186857 186201 185247 183436 181196 179816 180129 181912 184669 188331 192995 198554 204977 212711
57676 212711 222629 235555 251712 270554 291463 314830 342058 374209 411070 451740 495262 539761
57664 539761 581310 614486 634108 636507 620353 587699 544066 496229 449272 405756 366949 333745
57652 333745 306411 284402 266769 252420 240222 229500 220426 213323 207781 202979 198708 195361 193110
57639 193110 191749 191175 191307 191607 191487 191096 191002 191132 190736 189451 187689 185947 184359 182961 181740 180376
57623A80376j821j960j466r99j246j831j917j404q78p17q65j182j449j340p89
57608A60512j67K34M99O62M79p8o69j107j532j863j762j332j160j398j580j565
57592A48173j833k485k841k524k106k165k450k466k213j861j428j184j586k391
57578A18640k629j930j053p05p27q87j451k364k860k585k176k108j925j296q44
57563I3100r96j062l80M77O94N59Q70J585K153K501K780K690K063J565J874K566
57547A13039K717K135J261L58l83n59j76L2l27n18J76J174J362N62o63j995l206
57530A14989l684l207k564k449k298j325m0M63K08Ro5m82q89m19O88J192O81Q1
57512A00889J35M88N05J30m26j016j385j260p77l23L6M15N72J36o23r34m94J75
$$ plain form
57623 180376 178555 176595 175129 174130 172884 171053 169136 167732 166854 166137 165272 164090 162641 161301 160512
57608 160512 160345 160579 161078 161740 162219 162141 161472 160365 158833 156970 155208 153876 152716 151318 149738 148173
57592 148173 146340 143855 141014 138490 136384 134219 131769 129303 127090 125229 123801 122617 121031 118640
57578 118640 116011 114081 113028 112323 111596 110709 109258 106894 104034 101449 99273 97165 95240 93944 93100
57563 93100 92104 91042 90662 91139 91833 92392 93262 94847 97000 99501 102281 104971 107034 108599 110473 113039
57547 113039 115756 117891 119152 119510 119127 118568 118392 118424 118097 117579 117755 118929 120291 120853 120190 118195 114989
57530 114989 111305 108098 105534 103085 100787 99462 99422 99885 100093 100102 100037 99555 98666 98247 98935 100127 100808 100889
57512 100889 101024 101512 102017 102147 101721 100705 99320 98060 97283 96960 96996 97411 97983 98119 97496 96562 96068 96243
57494I6243L30k72j156j430o31N26P88k8p59n90j13q4r4N95J654K240K295K265
57476A01779K043J285L24k97p91j663k646l113l143l180l037k260j116k24L70
57461H4331Q08O66l60j518j902j704j519j041J17J075P51k06k94L87M23l56n96
57444G9062K35J071J167J049J064P11j3j45O52J375J221N99M8n64j119q80J60
57427H5693P75K21o20o90l23l74p25p45n78q47j450j661j253p37n12l59J54J063
57409G7032J809J703P47j70l04j2j36o36p51l97l80j041j685j693j371j225j084
57392G0406m57P73K249L367L486K517J294P74R05R99J026J552K384K489J539M52
57376I5755j3k56r19j782k204j994j492j191j504k321k837k467j788j693j827
$$ plain form
57494 96243 96573 96301 95145 93715 93084 93610 94398 94370 93611 93021 92908 92824 92730 93325 94979 97219 99514 101779
57476 101779 103822 105107 105431 105134 104343 102680 100034 96921 93778 90598 87561 85301 84185 83961 84331
57461 84331 85139 85805 85445 83927 82025 80321 78802 77761 77878 78953 79704 79498 79204 79591 80014 79658 79062
57444 79062 79297 80368 81535 82584 83648 84359 84346 84201 84853 86228 87449 88048 88096 87532 86413 85533 85693
57427 85693 86468 86689 86069 85379 85056 84682 83957 83212 82634 81787 80337 78676 77423 76686 76174 75815 75969 77032
57409 77032 78841 80544 81291 81121 80817 80805 80669 80033 79282 78885 78505 77464 75779 74086 72715 71490 70406
57392 70406 69949 70722 72971 76338 79824 82341 83635 84409 85314 86313 87339 88891 91275 93764 95303 95755
57376 95755 95742 95486 94567 92785 90581 88587 87095 85904 84400 82079 79242 76775 74987 73294 71467
57361G1467j128K11P68J21n20l91k64o86p02N44K107K487J712J031J131J672K073
57344H1633J922J096J69O7P48J050M95K03J101K205J976O41k28J1N88P99P06M54
57326I5636qm37n02n02j040j923k173j294J36J220J535J179N48K10M80J069J392
57309I5526J256R30P25P71J062J445J694J752J734J541R77L47M22J404K511K993
57293A17090L029L168L386L390L335L554L803L505K564J480P50N48P43Q77L99
57278A51621o38j438j410r49q37j223j648j847j965k201k619l077l193k699k059
57263A23818k095k742k861j812m82o4m11m88O0O77R33R32P40K71l36p87j061j207
57245A13085j015l47L93P36Q54J174J614J786J766J946K283K418K344K292K073
$$ plain form
57361 71467 70339 70550 71318 71439 70919 70528 70264 69578 68876 69420 71527 74014 75726 76757 77888 79560 81633
57344 81633 83555 84651 84820 84887 85635 86685 87180 87383 88484 90689 92665 93306 93078 93089 93677 94476 95182 95636
57326 95636 95628 95191 94689 94187 93147 91224 89051 87757 87893 89113 90648 91827 92375 92585 93065 94134 95526
57309 95526 96782 97712 98437 99208 100270 101715 103409 105161 106895 108436 109413 109760 110182 111586 114097 117090
57293 117090 120119 123287 126673 130063 133398 136952 140755 144260 146824 148304 149054 149602 150345 151222 151621
57278 151621 150983 149545 148135 147186 146349 145126 143478 141631 139666 137465 134846 131769 128576 125877 123818
57263 123818 121723 118981 116120 114308 113826 113762 113351 112863 112923 113600 114533 115465 116205 116476 116140 115353 114292 113085
57245 113085 112070 111723 112116 112852 113706 114880 116494 118280 120046 121992 124275 126693 129037 131329 133402
57230A33402J342M25K02J021K364L526M123L985L284K775L165M170M742M407L781
57215A76714L560L625L412K756K055J822K278L108L587L224K385J987K491L451
57201B16455M126M295M303M531M935N168N055M867N001N496O133O897P899Q810
57187B93971Q983Q434Q189R105J0798J2256J3181J4140J5559J7108J8139J8347
57175D48210J7982J7652J7842J8558J9520K0618K1784K2480K2104K1124K0943
57164F68817K2116K3535K4034K3997K4491K5467K6042K6158K6657K7794K8811
57153I47919K9222K9541L0365L1521L2451L2895L2946L2865L3039L3667L4388
57142A300819L4653L4478L4399L4657L4992L5238L5501L5603L5054L3800L2450
$$ plain form
57230 133402 134744 135169 135371 136392 138756 142282 146405 150390 153674 156449 159614 163784 168526 172933 176714
57215 176714 180274 183899 187311 190067 192122 193944 196222 199330 202917 206141 208526 210513 213004 216455
57201 216455 220581 224876 229179 233710 238645 243813 248868 253735 258736 264232 270365 277262 285161 293971
57187 293971 302954 311388 319577 328682 339480 351736 364917 379057 394616 411724 429863 448210
57175 448210 466192 483844 501686 520244 539764 560382 582166 604646 626750 647874 668817
57164 668817 690933 714468 738502 762499 786990 812457 838499 864657 891314 919108 947919
57153 947919 977141 1006682 1037047 1068568 1101019 1133914 1166860 1199725 1232764 1266431 1300819
57142 1300819 1335472 1369950 1404349 1439006 1473998 1509236 1544737 1580340 1615394 1649194 1681644
57131A681644L1425L0388K8927K7431K6826K7635K9617L2286L5438L9207M3793
57120B034617M9297N5600O2172O7992P2035P4346P6502Q0605Q7647R7273J08944
57109B867030J22580J37984J54719J73354J96189K25842K63548L09651L65307
57100D816204M32757N14065O10812P25165Q60477J020498J208292J425375J670416
57091A3284061J937984K218984K502855K779555L040486L278801L487948L655809
57083C6186483L756539L749034L589437L252452K745580K104955J377923O08126
57075E7370529j67485r14778j601838k203532k704451l096168l372891l531151
57067C9778235l573041l508503l354824l134470k872026k590141k306283k032550
$$ plain form
57131 1681644 1713069 1743457 1772384 1799815 1826641 1854276 1883893 1916179 1951617 1990824 2034617
57120 2034617 2083914 2139514 2201686 2269678 2341713 2416059 2492561 2573166 2660813 2758086 2867030
57109 2867030 2989610 3127594 3282313 3455667 3651856 3877698 4141246 4450897 4816204
57100 4816204 5248961 5763026 6373838 7099003 7959480 8979978 10188270 11613645 13284061
57091 13284061 15222045 17441029 19943884 22723439 25763925 29042726 32530674 36186483
57083 36186483 39943022 43692056 47281493 50533945 53279525 55384480 56762403 57370529
57075 57370529 57203044 56288266 54686428 52482896 49778445 46682277 43309386 39778235
57067 39778235 36205194 32696691 29341867 26207397 23335371 20745230 18438947 16406397
57059A6406397j777652j547819j345891j171110j020950q93073p85358o94954
57051G169590o18329n52365m94939m44497l99614l59241l23033k90864k62004
57042C424704k35241k10051j87062j66821j48457j30453j12616r6265q2247o9675
57032A985816n7075m4109l1506j9821q889J499J0281J4005P611j1715m0413o9261
57020A736423q9550r8489r8560r3189q4429p3810o3113n3712m6120m0370l6205
57009I58876l2966l0039k7400k5270k3477k1751k0273j9313j8626j7846j7096
56998G04819j6560j5967j5119j4390j3958j3199j1661r895q417o614l898j065
56986E74076Q27K294M532P161Q525P937N968K771k071p895j2900j6078j7769j8217
$$ plain form
57059 16406397 14628745 13080926 11735035 10563925 9542975 8649902 7864544 7169590
57051 7169590 6551261 5998896 5503957 5059460 4659846 4300605 3977572 3686708 3424704
57042 3424704 3189463 2979412 2792350 2625529 2477072 2346619 2234003 2137738 2055491 1985816
57032 1985816 1928741 1884632 1853126 1833305 1824416 1825915 1836196 1850201 1857812 1846097 1805684 1736423
57020 1736423 1646873 1548384 1449824 1356635 1272206 1198396 1135283 1081571 1035451 995081 958876
57009 958876 925910 895871 868471 843201 819724 797973 777700 758387 739761 721915 704819
56998 704819 688259 672292 657173 642783 628825 615626 603965 594070 585653 579039 575141 574076
56986 574076 574903 577197 581729 588890 597415 605352 611320 614091 612020 604125 591225 575147 557378 539161
56972E39161j7172j5115j3264j1866r942p215m711k992j197J441M458P174R619
56959D78379J1847J3532J4786J6104J6838J5122J0071K942m600j1927j8414k2499
56947E22181k3152k1330j8813j6329j3750j1133q405m949o50L393O297Q831J2219
56934D34410J6162J9310K1201K2448K3252K2849K0266J4763N969n299j6485k4762
56922E54084k9187l0805l0798k9430k6734k3228j9604j6331j3701j1787j0234
56911C12245q574o871n689n344n425n247m518l440k351j387n64l9k4l39l32M66
56895B62567J848L406N105P026Q937J0700J2658J4891J6586J7072J6998J7275
56883C95069J7122J4656R392K882l256q375j1818j2628j0980q468o186l652l10
$$ plain form
56972 539161 521989 506874 493610 481744 471802 464587 459876 456884 455687 457128 461586 468760 478379
56959 478379 490226 503758 518544 534648 551486 566608 576679 579621 575021 563094 544680 522181
56947 522181 499029 477699 458886 442557 428807 417674 409269 404320 403670 407063 413360 422191 434410
56934 434410 450572 469882 491083 513531 536783 559632 579898 594661 600630 595331 578846 554084
56922 554084 524897 494092 463294 433864 407130 383902 364298 347967 334266 322479 312245
56911 312245 303671 296800 291111 285767 280342 275095 270577 267137 264786 263399 262835 262796 262772 262433 262101 262567
56895 262567 264415 267821 272926 279952 288889 299589 312247 327138 343724 360796 377794 395069
56883 395069 412191 426847 436239 439121 435865 427490 415672 403044 392064 383596 377410 373758 373448
56870C73448L287O531R761J3378J7061K0783K5303L0713L5682L9215M2007M4784
56858F61953M6288M4163L7141K5385R785p520k2880l3073l7508l7545l4355k8609
56846F23225k1537j4612q229j827M977J2253K0284K9056L7606M5048N1915N9336
56834H37495O7042P3164P5599P2491O1924M2772J6361j3351m1311o2962p5416
56823A053808p8621p5272o8518n9771m9284l8031k7613j8583j0155j589P136J5894
56811F49401K4576L2639L9426M4868M9105N1489N0567M4739L2562J3559j0030
56800A022901l2960n0187o0263o4725o4882o0947n3820m5524l7415k9466k1653
56789E01059j4610q547k836K792P800J1956J5812J9622K2793K4708K5071K3055
$$ plain form
56870 373448 376735 383266 393027 406405 423466 444249 469552 500265 535947 575162 617169 661953
56858 661953 708241 752404 789545 814930 824715 817195 794315 761242 723734 686189 651834 623225
56846 623225 601688 587076 578847 577020 581997 594250 614534 643590 681196 726244 778159 837495
56834 837495 904537 977701 1053300 1125791 1187715 1230487 1246848 1233497 1192186 1129224 1053808
56823 1053808 975187 899915 831397 771626 722342 684311 656698 638115 627960 626371 633507 649401
56811 649401 673977 706616 746042 790910 840015 891504 942071 986810 1019372 1032931 1022901
56800 1022901 989941 939754 879491 814766 749884 688937 635117 589593 552178 522712 501059
56789 501059 486449 477902 475066 477858 485658 497614 513426 533048 555841 580549 605620 628675
56777F28675J7321P515m917j7772k9117l7274m1081m0913l8591l5618l2137k7943
56765C48148k3598j9910j6958j4346j1981j0079q767p981p515o938n902m656l823
56752B05694l574l439l037k473j993j654j419j110m74K83L01q74k275k486j451
56737A80019m13j26j60J9K72L88M74N19L09j0j3K61L81L99P53J316J500J411J808
56718A89107K678K959K125R85M44M01L83L60L95K29j16o5O52J451J689J443J009
56701B06129L28o34j418j529r76o7Q41J226O71m52j191j181r61r43r06q35j305
56684A96797k442l243k751j312k1O43R51J145J255J408J747K101K151J826J300
56669B01555P39L43L27O48Q92P05J82l09n31o18j043k206l761m561l780j934l30
$$ plain form
56777 628675 645996 653511 648594 630822 601705 564431 523350 482437 443846 408228 376091 348148
56765 348148 324550 304640 287682 273336 261355 251276 242509 234528 227013 220075 214173 209517 205694
56752 205694 202120 198681 195644 193171 191178 189524 188105 186995 186521 186804 187105 186231 183956 181470 180019
56737 180019 179606 179480 179320 179339 179611 179999 180473 180992 181301 181291 181278 181539 181920 182319 183072 184388 185888 187299 189107
56718 189107 191785 194744 196869 197854 198298 198699 199082 199442 199837 200066 199950 199885 200537 201988 203677 205120 206129
56701 206129 206457 205823 204405 202876 201900 201833 202674 203900 204571 204119 202928 201747 200786 199843 198937 198102 196797
56684 196797 194355 191112 188361 187049 187028 187671 188622 189767 191022 192430 194177 196278 198429 200255 201555
56669 201555 202294 202637 202964 203612 204504 205209 205391 205082 204551 203933 202890 200684 196923 192362 188582 186648 186318
56652A86318L56L93J74j24j52M76J477K049J899J539J485J786K387L149L478K727
56636B09417J191O3R3Q19J290J003J02q05j045o59o01j533k715k949k356k073
56620A99242k384k435j891j462j514j468j049q63j215j391p90J36O62P08N14J85
56604A84985l8J24L79J63k94k65L3l75j317j318J4J042M81o80q87l12j15l90l43
56585A80887R6L06K20L56Q16J261J642K071K222J747J054Q91J316J752J898J968
56569B00503K187K527K900L207L433L831M694N825O682P214P899Q784R237Q899
56555B77822Q039O668M260Q88k231l936m230l726k825j946j660j931j970j372
56541B71850p11n19n69o65j158k096k774k855k885l155l076k449k108k441k461
$$ plain form
56652 186318 186674 187067 187241 187117 186965 187441 188918 190967 192866 194405 195890 197676 200063 203212 206690 209417
56636 209417 210608 210671 210764 211583 212873 213876 213978 213173 212128 211469 210868 209335 206620 203671 201315 199242
56620 199242 196858 194423 192532 191070 189556 188088 187039 186176 184961 183570 182780 182916 183578 184286 184800 184985
56604 184985 184947 185071 185450 185613 185319 185054 185087 184712 183395 182077 182091 183133 183614 182934 182047 181735 181620 181230 180887
56585 180887 180983 181289 181509 181865 182681 183942 185584 187655 189877 191624 192678 193569 194885 196637 198535 200503
56569 200503 202690 205217 208117 211324 214757 218588 223282 229107 235789 243003 250902 259686 268923 277822
56555 277822 285861 292529 296789 297677 295446 291510 287280 283554 280729 278783 277123 275192 273222 271850
56541 271850 271139 270620 270051 269386 268228 266132 263358 260503 257618 254463 251387 248938 246830 244389 241928
56526B41928j491n94r97k077k274j338l08P7k61j342k796l576l148k447k422k410
56510B14524j351Q0K01j187k617l088k893k378j338P3J090J274R19L90j04j73
56494B03422M66J363J760J558J222R77P38O42P62P18K63q2J87N53K55l50k53O04
56476B14805J299J331R95N14j59o06j17J253K524K883K388J542P65K39j07m27
56460B29122n47p0P91J200R07P37J215J563R10k51p69m08K52Q89J386J335O07
56443B38869p7q0J70L0k56k91n25j285j611n80R75J498R55M65K61k37p77n02K92
56424B37294M55j7l1N30N46k59p72m26p6l77p28n27j91k70n40n90m94m46m34n01
56404B32146n87q3J502L426M362M237M196M660M695L817L016L280M058M122L258
$$ plain form
56526 241928 240437 239843 238846 236769 234495 233157 232849 232926 232665 231323 228527 224951 221803 219356 216934 214524
56510 214524 213173 213253 213454 212267 209650 206562 203669 201291 199953 200026 201116 202390 203309 203699 203595 203422
56494 203422 203888 205251 207011 208569 209791 210768 211506 212148 212910 213628 213891 213809 213996 214549 214804 214454 214201 214805
56476 214805 216104 217435 218430 218944 218785 218179 218062 219315 221839 224722 227110 228652 229417 229656 229549 229122
56460 229122 228575 228505 229296 230496 231403 232140 233355 234918 235828 235577 234808 234400 234652 235541 236927 238262 238869
56443 238869 238792 238712 238882 238912 238656 238365 237840 236555 234944 234364 235339 236837 237792 238257 238518 238281 237504 237002 237294
56424 237294 237749 237732 237701 238231 238777 238518 237746 237320 237244 236867 236139 235612 235421 235151 234611 234021 233527 233081 232647 232146
56404 232146 231559 231476 232978 236404 240766 245003 249199 253859 258554 262371 265387 268667 272725 276847 280105
56389B80105K351K105K329K351J838J174R86J236J196N91J15K60L24n40j896k722
56373B91803l039l671m671n217m950m264l382k226j169p70p88m19M25J087J251
56358B60000J181J038Q60R96J639K184J986J398J106J026Q97J312K673L811L302
56343B85409J803J226J918K530K556K898L648L404J541n55j308p51J69R12J347
56328C06747J438J460J832K479K993L313L405K778J326K61O75J703J635N32r6
56313C32481K0l46j399j703n75P99J345J520K098K930L616M167M533M559M677
56298C58722N460O428O554N877N249M690L699K981L820N698O626O130N810O550
56284D34294P336P411P511Q182Q831R139R691J0502J0778J0697J1513J3214J4172
$$ plain form
56389 280105 282456 284561 286890 289241 291079 292253 293239 294475 295671 296262 296377 296637 296961 296421 294525 291803
56373 291803 288764 285093 280422 275205 270255 265991 262609 260383 259214 258444 257656 257237 257662 258749 260000
56358 260000 261181 262219 263079 264075 265714 267898 269884 271282 272388 273414 274311 275623 278296 282107 285409
56343 285409 287212 288438 290356 292886 295442 298340 301988 305392 306933 306378 305070 304319 304488 305400 306747
56328 306747 308185 309645 311477 313956 316949 320262 323667 326445 327771 328032 328707 330410 332045 332577 332481
56313 332481 332501 332155 330756 329053 328478 329277 330622 332142 334240 337170 340786 344953 349486 354045 358722
56298 358722 364182 370610 377164 383041 388290 392980 396679 399660 403480 409178 415804 421934 427744 434294
56284 434294 441630 449041 456552 464734 473565 482704 492395 502897 513675 524372 535885 549099 563271
56271E63271J3829J3723J4976J6796J8394K0370K3054K5509K7379K9884L3748
56260H00933L7838M1114M4238M8169N2779N8039O4820P3318Q2220R0635R9257
56249A493360J08622J17839J26138J33938J41311J47142J50934J53561J55019
56240B727864J53336J47060J36998J24151J07863Q7628O4836M0987J5841j0832
56230C595732l7273o1350q2729j01783j17762j29846j38662j44964j48085j47415
56220B485863j44159j39954j34869j28412j21185j13918j06041r7050q8148q0799
56210A331328p4590o8235o1714n5903n0906m6262m2015l8287l4654l1037k8123
56199G99602k5965k3474k0291j7668j6290j4937j2657j0523r678r346q480p728
$$ plain form
56271 563271 577100 590823 605799 622595 640989 661359 684413 709922 737301 767185 800933
56260 800933 838771 879885 924123 972292 1025071 1083110 1147930 1221248 1303468 1394103 1493360
56249 1493360 1601982 1719821 1845959 1979897 2121208 2268350 2419284 2572845 2727864
56240 2727864 2881200 3028260 3165258 3289409 3397272 3484900 3549736 3590723 3606564 3595732
56230 3595732 3558459 3497109 3414380 3312597 3194835 3064989 2926327 2781363 2633278 2485863
56220 2485863 2341704 2201750 2066881 1938469 1817284 1703366 1597325 1500275 1412127 1331328
56210 1331328 1256738 1188503 1126789 1070886 1019980 973718 931703 893416 858762 827725 799602
56199 799602 773637 750163 729872 712204 695914 680977 668320 657797 648119 638773 630293 622565
56187F22565p891p990o831n149m253l864l121k444k461k354j186J98M56r4k48
56172E75333K07R08J970L159L441K847L195N324P310P230O011N585N934O080O374
56157F40908P532Q863R590J0591J2756J5064J6434J7865K0548K3488K5375K7238
56145H36252L0771L5453L9854M4393N0287N7043O3443O9687P6104Q1127Q3073
56134A467487Q2527Q0502P5824O7223N6598M7394M0805L6112L3206L1781K9409
56123B048868K3647J5237O528k022j1109j9737k6332l1622l7519m4225n1097n9004
56111A811613o8568p7415q2303q3002q1137p6718o9085n9954n1833m4478l6317
56100A080803k8219k2369j8412j4373j0314p589n548k712j09L17l47M73K378L061
$$ plain form
56187 622565 614674 606684 599853 594704 590451 586587 583466 581022 578561 576207 575021 575219 575675 575581 575333
56172 575333 575540 576448 578418 581577 585018 587865 591060 596384 603694 610924 616935 622520 628454 634534 640908
56157 640908 648440 657303 666893 677484 690240 705304 721738 739603 760151 783639 809014 836252
56145 836252 867023 902476 942330 986723 1037010 1094053 1157496 1227183 1303287 1384414 1467487
56134 1467487 1550014 1630516 1706340 1773563 1830161 1877555 1918360 1954472 1987678 2019459 2048868
56123 2048868 2072515 2087752 2094280 2092258 2081149 2061412 2035080 2003458 1965939 1921714 1870617 1811613
56111 1811613 1743045 1665630 1583327 1500325 1419188 1342470 1273385 1213431 1161598 1117120 1080803
56100 1080803 1052584 1030215 1011803 997430 987116 979527 973979 971267 971158 971475 971128 971601 973979 977040
56086I77040K831L924O028O855O517P139Q550Q606P435P191P927P921P646R167
56072A074777J1780J2698J1964J2363J4387J5636J5349J5353J6170J6246J5406
56061A232129J5315J6261J6941J7360J8424J9204J8240J6879J7396J8680J7991
56050A424820J5979J5524J6547J6781J6675J8460K1211K2112K1890K3542K6354
56039A639895K6999K5921K6681K9229L0111K9268L0320L3800L6338L7030L8450
56028A984042M0895M1867M1684M3381M6535M7496M6311M6953N0199N2852N4440
56017B496655N7891O2926O5853O6636O9152P3732P6679P7890Q1392Q7468R1943
56006C308217R4205R8069J03871J07969J10932J17596J27840J36226J41976J50104
$$ plain form
56086 977040 979871 983795 989823 996678 1003195 1010334 1018884 1027490 1034925 1042116 1050043 1057964 1065610 1074777
56072 1074777 1086557 1099255 1111219 1123582 1137969 1153605 1168954 1184307 1200477 1216723 1232129
56061 1232129 1247444 1263705 1280646 1298006 1316430 1335634 1353874 1370753 1388149 1406829 1424820
56050 1424820 1440799 1456323 1472870 1489651 1506326 1524786 1545997 1568109 1589999 1613541 1639895
56039 1639895 1666894 1692815 1719496 1748725 1778836 1808104 1838424 1872224 1908562 1945592 1984042
56028 1984042 2024937 2066804 2108488 2151869 2198404 2245900 2292211 2339164 2389363 2442215 2496655
56017 2496655 2554546 2617472 2683325 2749961 2819113 2892845 2969524 3047414 3128806 3216274 3308217
56006 3308217 3402422 3500491 3604362 3712331 3823263 3940859 4068699 4204925 4346901 4497005
55996D497005J61344J70720J77656J87378K00405K11162K19323K31699K50249
55987F306941K69194K86762L08491L35870L63459L90533M23644M64224N06033
55978I655151N48378N99038O60642P27857Q01649Q91704J001083J124379J265607
55969A7275488J441395J661763J924966K234938K602862L025715L486300L983496
55961C7636923M541456N183266N922515O789431P833799R086424J0544682J2206874
55953I9745370J4087140J6184418J8474831K0939117K3529280K6068906K8227079
55946B47256141K9576599K9534020K7187966K1464270J1912046m60779j3276491
55939C53193772k3950535l0944561l4113890l4188307l2133501k8846630k5067643
$$ plain form
55996 4497005 4658349 4829069 5006725 5194103 5394508 5605670 5824993 6056692 6306941
55987 6306941 6576135 6862897 7171388 7507258 7870717 8261250 8684894 9149118 9655151
55978 9655151 10203529 10802567 11463209 12191066 12992715 13884419 14885502 16009881 17275488
55969 17275488 18716883 20378646 22303612 24538550 27141412 30167127 33653427 37636923
55961 37636923 42178379 47361645 53284160 60073591 67907390 76993814 87538496 99745370
55953 99745370 113832510 130016928 148491759 169430876 192960156 219029062 247256141
55946 247256141 276832740 306366760 333554726 355018996 366931042 366470263 353193772
55939 353193772 329243237 298298676 264184786 229996479 197862978 169016348 143948705
55932A43948705k1313697j7865776j4848350j2307587j0224467q526024p136242
55925E1726562o007177n096890m352269l731703l219341k801905k452716k150491
55917B1914070j892674j677631j491638j324108j178448j057093r50823q52267
55909A1489388p65728o94616o32241n73267n21922m81024m44418m07512l74437
55900F594223l48045l23299k97005k73815k56348k39209k18952k00578j87988
55891D248984j76912j63219j49917j40107j30994j20425j11728j06857j02127
55882C046698r5666r1722r2604r3555r0603q6587q4480q1634p5755p0071o7401
55871B116620o5084o0715n7111n6718n6673n4192n1542n1071n0433m7245m3685
$$ plain form
55932 143948705 122635008 104769232 89920882 77613295 67388828 58862804 51726562
55925 51726562 45719385 40622495 36270226 32538523 29319182 26517277 24064561 21914070
55917 21914070 20021396 18343765 16852127 15528019 14349571 13292478 12341655 11489388
55909 11489388 10723660 10029044 9396803 8823536 8301614 7820590 7376172 6968660 6594223
55900 6594223 6246178 5922879 5625874 5352059 5095711 4856502 4637550 4436972 4248984
55891 4248984 4072072 3908853 3758936 3618829 3487835 3367410 3255682 3148825 3046698
55882 3046698 2951032 2859310 2766706 2673151 2582548 2495961 2411481 2329847 2254092 2184021 2116620
55871 2116620 2051536 1990821 1933710 1876992 1820319 1766127 1714585 1663514 1613081 1565836 1522151
55860A522151m1996m0219l6502l3044l1734l0432k7575k5785k6903k7958k6231
55849A173772k4054k4377k5723k5516k4614k4599k4316k2780k1848k2489k2165
55838I11291j9407j7033j7282j7745j5845j3452j3101j3366j2012j0388j0545
55827G51115j1171j0338r257r583r908q678p690q924j0759j0923j0456j1055j1354
55814F21019r605p469p239p700o585m833m601n075m061j978p29k33O40J412J334
55799E64297J593L215M537L783K205J738J540p4k269l403m189n893p314o837n725
55784E47204n984o723o084n258o857j0415j3030j3599j3216j2118r548o169l709
55771D34494k429j219L05J734L018L737K430j222m885o327o258o355o212m783
$$ plain form
55860 1522151 1480155 1439936 1403434 1370390 1338656 1308224 1280649 1254864 1227961 1200003 1173772
55849 1173772 1149718 1125341 1099618 1074102 1049488 1024889 1000573 977793 955945 933456 911291
55838 911291 891884 874851 857569 839824 823979 810527 797426 784060 772048 761660 751115
55827 751115 739944 729606 720349 710766 700858 692180 684490 675566 664807 653884 643428 632373 621019
55814 621019 611414 603945 596706 589006 582421 577588 572987 567912 563851 561873 561144 560911 561551 562963 564297
55799 564297 565890 569105 573642 577425 579630 581368 582908 582834 580565 577162 572973 567080 559766 552929 547204
55784 547204 541220 534497 528413 523155 516298 505883 492853 479254 466038 453920 444372 438203 434494
55771 434494 432065 430846 431151 432885 435903 439640 442070 440848 435963 429636 423378 417023 410811 406028
55757D06028l109k717k890k354k214m111o715p368o378o456q381j0212j0486r522
55743C23115p816n680m161m104m581m213l367l151l197k650k235k951l788l227
55729B67994k080k142k953k680j531j382k452l109k780k399k194j539q35j072
55715B38846j656j054N60J579J702K071K876L115K730K657K841K304J149L41l32
55700B59729j929m095n334n418n433n533m894l799l464l706l130j710r49j154
55686B09181q64N39J812K052J989K462L260M009M714N033M464L463K915K473J019
55671B48521j170k536k658k730l361l693l131k242j513p69j89l07o79j12J326
55656B24757K148J733J203J388J504O88n21j129j053p80m87j81j48o52j636k902
$$ plain form
55757 406028 402919 400202 397312 394958 392744 388633 381918 374550 368172 361716 353335 343123 332637 323115
55743 323115 315299 309619 305458 301354 296773 292560 289193 286042 282845 280195 277960 275009 271221 267994
55729 267994 265914 263772 260819 258139 256608 255226 252774 249665 246885 244486 242292 240753 239918 238846
55715 238846 237190 236136 236696 238275 239977 242048 244924 248039 250769 253426 256267 258571 259720 260061 259729
55700 259729 257800 253705 248371 242953 237520 231987 227093 223294 219830 216124 212994 211284 210335 209181
55686 209181 208317 208856 210668 212720 214709 217171 220431 224440 229154 234187 238651 242114 245029 247502 248521
55671 248521 247351 244815 242157 239427 236066 232373 229242 227000 225487 224718 224529 224222 223543 223431 224757
55656 224757 226905 228638 229841 231229 232733 233421 232900 231771 230718 229938 229451 229270 229122 228470 226834 223932
55640B23932m169m993n211n246n405n289m557l833l863m264m194l707l396l166
55626A62639k588j957j724j495q43n05j238k126j742m83j0p15j552k045k533k763
55610A38320k152j344j526k274k078r30l07n44m08M16P34J83j9O38R40R4r32j132
55592A27679q65o83l18K74M14m6k71Ok2m75j57J338K490J967O83M68J633K997
55574A37112L543L154K298J737J934K337J967R58M76Q34R42J23q33j220j649k780
55558A50933l902l913k963k169k204k899l732m024l292j900r17q03q82m07N07
55543A17433J325J795J814J354Q37R44J651K170K091J885J971K074J796J138K62
55528A40540o10j036q02n51j064j994k357k174k401l229l858m100m714n787o328
$$ plain form
55640 223932 219763 214770 209559 204313 198908 193619 189062 185229 181366 177102 172908 169201 165805 162639
55626 162639 160051 158094 156370 154875 154032 153527 152289 150163 148421 147938 147928 147213 145661 143616 141083 138320
55610 138320 136168 134824 133298 131024 128946 128016 127709 127165 126757 127173 127907 128090 128071 128709 129649 129743 128811 127679
55592 127679 126814 126131 125813 126087 126501 126455 126184 126190 126168 125693 125536 126874 129364 131331 132014 132482 134115 137112
55574 137112 140655 143809 146107 147844 149778 152115 154082 155040 155516 156350 157292 157415 156582 155362 153713 150933
55558 150933 147031 143118 140155 137986 135782 132883 129151 125127 121835 119935 119018 118215 117333 116926 117433
55543 117433 118758 120553 122367 123721 124558 125502 127153 129323 131414 133299 135270 137344 139140 140278 140540
55528 140540 139930 138894 138092 137541 136477 134483 132126 129952 127551 124322 120464 116364 111650 105863 99535
55513I9535n948n514n439m892l435k030j455j025J8R96R09J65QQ46K099L111L416
55496H1365K742J615J251K063K846K313Q09k54j27Q75K165L218L461K657J276
55481A08275J1q37j272j334j297j567k107k342j982j407j058r79j084j286j181
55466H8553l70P52J285J048O81M52o2q48j126n40K78P16Q86R64P87M00O9m48j529
55447I1948k459j937j91R31N32k16k09j9l32l75O47J799J673N04l82n41m71l12
55429I0590J37N28L01l37p12o55l74J76R85J573J637J557J570J177J57o20m45
55412I7245K9j21n09k32M21M39j80n87o82j143j892j947j030j02O3j26J05P97
55394I0548J394J501J161P00M40M16L46J6m59q48j004p66p3P38J170J201J130
$$ plain form
55513 99535 93587 88073 82634 77742 74307 72277 70822 69797 69815 70811 71720 71885 71893 72739 74838 77949 81365
55496 81365 84107 85722 86973 89036 91882 94195 95004 94750 94623 95498 97663 100881 104342 106999 108275
55481 108275 108286 107449 106177 104843 103546 101979 99872 97530 95548 94141 93083 92104 91020 89734 88553
55466 88553 88183 88935 90220 91268 91949 92401 92339 91491 90365 89825 90103 90819 91705 92669 93456 93856 93925 93477 91948
55447 91948 89489 87552 87361 88292 88824 88608 88399 88380 88048 87673 88320 90119 91792 92296 91914 91373 90902 90590
55429 90590 90727 91255 91556 91219 90507 89852 89478 89654 90639 92212 93849 95406 96976 98153 98310 97690 97245
55412 97245 97274 97153 96644 96412 96833 97272 97092 96505 95823 94680 92788 90841 89811 89709 89772 89646 89751 90548
55394 90548 91942 93443 94604 95304 95744 96160 96506 96522 96063 95215 94211 93445 93372 94110 95280 96481 97611
55377I7611Q08j78j394j725r86k57r2L37J524K296J461k42j187j156j163j492
55361I4165j405o29J28K76o8n80r77q92k60K67M4n90p71l59N2J88L01M19K03l78
55341H9134q37p24k8Q54J274P88k25q13o44m25p27j125j078q93j012j059m96L56
55323H2320R38J445K202K615J904N10l52l11N0L91Q10J053P06P2r2K47M39J99
55305I5146k28q40j728k270j570K22J920K710K675K004P01p18j312q18j7L15K07
55288I6399R7K45O90J304J766J825J540R63q0j416k196j895j200j083j344j064
55272I4551k06L85M62O39J097J142M04n43j053j144j047p79m59l79m33j39N20
55255I3018Q83N80J27J45N01N72Q5o06r49p33k51M8J07K06L74K74j15l03j22r1
$$ plain form
55377 97611 98419 98241 96847 95122 94136 93879 93787 94124 95648 97944 99405 99163 97976 96820 95657 94165
55361 94165 92760 92131 92259 92535 92467 91887 90910 90018 89758 90025 90069 89479 88708 88349 88401 88589 88890 89309 89512 89134
55341 89134 88297 87573 87545 88399 89673 90461 90236 89423 88779 88354 87627 86502 85424 84531 83519 82460 81964 82320
55323 82320 83258 84703 86905 89520 91424 91934 91582 91271 91321 91712 92522 93575 94281 94353 94261 94508 94947 95146
55305 95146 94918 94078 92350 90080 88510 88732 90652 93362 96037 98041 98742 98024 96712 95894 95877 96192 96399
55288 96399 96496 96741 97431 98735 100501 102326 103866 104829 104749 103333 101137 99242 98042 96959 95615 94551
55272 94551 94345 94730 95192 95831 96928 98070 98474 97931 96878 95734 94687 93908 93449 93070 92637 92498 93018
55255 93018 93901 94481 94608 94753 95254 95826 95911 95305 94356 93623 93372 93420 93527 93733 94107 94381 94266 93963 93841 93750
55235I3750m77o17L1Q43Q90L22k4Q2L18P00J273J385M33q68j250p35m76q30r36
55216I3814l23M12P31Q18P92L85l01o73n96m98l64L27J430J947J414M42m06j207
55198I8144j838j661o42K79N42O86J093J113K83n08j98P54R49j9j182j601j268
55181I4926o61q9K95L29Ql76m00Q0O83P61J63n07n75j05L35N08N99O95O93O72
55161I8034P95R52R84J079J384J486R63J56l27n59q73q77k1J084J216M13r7Q1
55143A05873L0o22q43J7R96J000M10J66J80k34r43j198q99o81q82j150j077o32
55125I9511k7M86P77R32J050R62M79r1k40j48n36j477k068j618n29L85P81P62
55107I9391N73O29J189J715J307R9n99J8J203J793J569R76K51l99m49K94J106
$$ plain form
55235 93750 93273 92656 92687 93530 94420 94742 94718 94800 95118 95818 97091 98476 98909 98041 96791 96056 95580 94750 93814
55216 93814 93491 93903 94634 95452 96244 96629 96328 95655 95059 94561 94197 94524 95954 97901 99315 99757 99351 98144
55198 98144 96306 94645 94003 94282 94824 95510 96603 97716 97999 97491 97293 98047 98996 98977 97795 96194 94926
55181 94926 94265 94176 94471 94800 94808 94432 94032 94112 94795 95556 95719 95212 94637 94532 94867 95375 95974 96669 97362 98034
55161 98034 98829 99781 100765 101844 103228 104714 105677 105833 105506 104947 104074 103197 103176 104260 105476 105889 105792 105873
55143 105873 105903 105281 104438 104455 105451 106451 106861 107027 107207 106973 106030 104832 103933 103252 102370 101220 100143 99511
55125 99511 99484 99970 100747 101679 102729 103691 104170 104079 103839 103691 103155 101678 99610 97992 97463 97848 98629 99391
55107 99391 99964 100593 101782 103497 104804 104903 104304 104322 105525 107318 108887 109863 110114 109715 109266 109560 110666
55090A10666J138M72j86m81n56n14k97O4M52P09N82k3o85q55o31n02l77K78J280
55071A10534J742J456J137R79L02q05r58L74J554Q85r16j743r25L52R41P54J54
55054A15817m40n27m7K56j84p92p50l58m51r41j043p10n75o84m79K6J54k78p83
55035A07211j176j682k016j546m47L20M25N76J220J814J779J301P36L5p91j296
55019A06463j199q16n04j47M72J166J554J404O61l99j027o56J85L28m09q77k95
55002A05904N20L66n76j076o20J28N38Q06J239J509J134M17K16Q03J412J186K85
54985A14191l35j12N67J016J070R53P84N17K05l2j88k56j26K03M24L04K8j14k06
54966A18893m21n25j51M91P86O27N97J077J664J698J044Q0p40j117r72n84m10
$$ plain form
55090 110666 111804 112276 112090 111609 111053 110539 110242 110306 110758 111467 112049 112026 111341 110486 109855 109353 108976 109254 110534
55071 110534 112276 113732 114869 115848 116150 115345 114387 114761 116315 117200 116284 114541 113616 113968 114909 115663 115817
55054 115817 115377 114850 114803 115059 114875 114083 113333 112975 112524 111583 110540 109830 109255 108571 108092 108118 108272 107994 107211
55035 107211 106035 104353 102337 100791 100344 100664 101089 101665 102885 104699 106478 107779 108515 108550 107759 106463
55019 106463 105264 104448 103944 103797 104269 105435 106989 108393 109054 108655 107628 106972 107157 107485 107076 106199 105904
55002 105904 106424 106790 106214 105138 104518 104646 105184 105990 107229 108738 109872 110289 110505 111308 112720 113906 114191
54985 114191 113856 113744 114311 115327 116397 117350 118134 118651 118856 118824 118636 118380 118254 118457 118881 119185 119213 119099 118893
54966 118893 118472 117947 117796 118287 119073 119700 120297 121374 123038 124736 125780 125860 125120 124003 123031 122447 122037
54949A22037n46n42n8N01M29k72q11o25j02K6l18n55l39Q0L98O68R19Q37K60l27
54929A21660k65M18J095J407J587J949K507L100L579L796L756L746L989M260M221
54914A60805L950L672L099J730k26j903k833l362l889m351m567m464l909k919
54900A40833k135k252k842k679j499m93o25j403j884j917j723j123n6Q50J090
54885A22142J090J405J734J605J448J957K840L175K811K457K618L228M164N215
54871A57889N714N005L335J614M03m42j302k505m167n764o314n528m344l591k875
54856A37128j631n58p29j739k132j481p67p32j171j817k633l070k375q95N9K2
54840A15479j76j6n4n76q65n28l55r24j383p44M43Q96N02K87P87J524J970K046
$$ plain form
54949 122037 121491 120949 120891 121392 121821 121549 120738 120113 120011 120037 119719 119164 118825 118905 119303 119971 120890 121727 121987 121660
54929 121660 121395 121813 122908 124315 125902 127851 130358 133458 137037 140833 144589 148335 152324 156584 160805
54914 160805 164755 168427 171526 173256 173030 171127 168294 164932 161043 156692 152125 147661 143752 140833
54900 140833 138698 136446 133604 130925 129426 128933 128308 126905 125021 123104 121381 120258 120202 121052 122142
54885 122142 123232 124637 126371 127976 129424 131381 134221 137396 140207 142664 145282 148510 152674 157889
54871 157889 163603 168608 171943 173557 173960 173518 172216 169711 165544 159780 153466 147938 143594 140003 137128
54856 137128 135497 134939 134210 132471 130339 128858 128091 127359 126188 124371 121738 118668 116293 115398 115457 115479
54840 115479 115303 115287 115233 114657 113792 113264 112909 111985 110602 109858 110301 111197 111699 111986 112773 114297 116267 118313
54822A18313J677P29m05r18n31J74N26M41J50k90q53j199r71l46M3q4k28K18J061
54803A17507J492J163O08L90L31k6o05r81j039q72k86Q74J988K120J245L68J78
54786A24455L19K49J73N80J365J963K078J863J523J196J140J646K682L868M821
54771A49921N427N714N710N587N852P061R034J0582J0462Q698O496M766L290J583
54757B40183r2j239k156l642n809p906r305r983j0062r544q599p578o573n453
54743A52242m356l650l312k875k153j506j185q61q5J050J939J977J026l60j174
54728A36717p35O21J847K229J979J864K412L455M267M345L983L834L866L389K344
54713A76417J624J536Q78j403m244n557m966m088m089m400m135l486l012k585
$$ plain form
54822 118313 119990 120719 120314 119396 118865 119039 119565 120006 120156 119866 119013 117814 116843 116497 116540 116456 116228 116446 117507
54803 117507 118999 120162 120770 121160 121491 121465 120860 119879 118840 117968 117682 118556 120544 122664 123909 124277 124455
54786 124455 124774 125023 125196 125776 127141 129104 131182 133045 134568 135764 136904 138550 141232 145100 149921
54771 149921 155348 161062 166772 172359 178211 185272 194306 204888 215350 224048 230544 235310 238600 240183
54757 240183 240091 238852 236696 233054 227245 219339 210034 200051 189989 180445 171846 164268 157695 152242
54743 152242 147886 144236 140924 138049 135896 134390 133205 132344 132259 133309 135248 137225 138251 137891 136717
54728 136717 135982 136603 138450 140679 142658 144522 146934 150389 154656 159001 162984 166818 170684 174073 176417
54713 176417 178041 179577 180455 179052 174808 169251 164285 160197 156108 151708 147573 144087 141075 138490
54699A38490j836r93o24q69j386j687j356m12L80K13n57o90J68P87L1j530k391
54682A25738k032j286r83r95o54K75J285J681J318O77J43m58j273j783j418n27
54666A19708QQ9L68Q89Q24j31j014r20k54l6m71r03q44m14J3K00J71K07N84J074
54646A19148J094M15n06j019q02J25J395K288K261J587R98O99K97k79o43p51j034
54629A25273j430j208j59Q20Q92L56l2k13o36j335j750j379k33J089J690J117
54613A22862j5o09l80LN4jJ06K50M27Q72J328J118K39m22m07l01n57o77j82M84
54593A24192P31P42R06J099J160J312J415P11r22k258k225j376q88q57o02m3L62
54576A23459N82Q39Q88M62M4J96M81J63m43m21K01N22K46j0J58M59O22O91O18
$$ plain form
54699 138490 136654 135661 135037 134168 132782 131095 129739 129327 129707 129920 129363 128673 128841 129628 129659 128129 125738
54682 125738 123706 122420 121437 120442 119788 120063 121348 123029 124347 125024 125167 124709 123436 121653 120235 119708
54666 119708 119716 119805 120173 121062 121886 121755 120741 119821 119567 119531 119060 118157 117313 116899 116912 117112 117283 117490 118074 119148
54646 119148 120242 120657 120151 119132 118330 118455 119850 122138 124399 125986 126984 127683 127980 127701 127058 126307 125273
54629 125273 123843 122635 122476 123296 124188 124544 124512 124299 123663 122328 120578 119199 118966 120055 121745 122862
54613 122862 122847 122238 121858 121861 121915 121914 122020 122270 122697 123569 124897 126015 126254 125832 125425 125124 124567 123890 123708 124192
54593 124192 124923 125665 126571 127670 128830 130142 131557 132268 131346 129088 126863 125487 124599 123742 123140 123097 123459
54576 123459 124041 124880 125768 126230 126274 126470 126951 127114 126671 126250 126451 126973 127219 127209 127367 127826 128448 129139 129757
54557A29757L27J01K14L00j16p10p70l64j39j75K6N09P68P24Q18J135J289J206
54539A34900J234J363J183O78K91J50k1k37k34r0q2lN04J027P47k57r89r63o93
54520A38508o61p62r21j310j658j350n24j06l58l95L74J274J437J035O77L49k36
54503A35373p69p31l27k49n82p44m45j73m66j094j256m97P44J651J892J727J321
54486A35375N43l41m86M22J327J009k14q84l85M58Q25Q99J112J274R59K24m86
54469A41631q03n57J66R18J243J109P26R5o88j012m21M41N88J94K77Q67Q59o7
54451A45566q06o66m37p74q62J01J176Q82n47j545j505j231j217r14J6Q63Q39
54434A38939J26m67m63K5N80P50L41l36p27o25l02o8Mk5m4K03R46J943K469J997
$$ plain form
54557 129757 130084 130185 130399 130699 130583 129873 129103 128739 128600 128425 128451 128960 129728 130452 131270 132405 133694 134900
54539 134900 136134 137497 138680 139358 139649 139799 139778 139541 139307 139217 139135 139132 139636 140663 141410 141153 140164 139201 138508
54520 138508 137847 137085 136164 134854 133196 131846 131322 131216 130858 130463 130837 132111 133548 134583 135260 135609 135373
54503 135373 134604 133873 133546 133297 132715 131971 131526 131353 130887 129793 128537 128040 128784 130435 132327 134054 135375
54486 135375 135918 135577 135091 135513 136840 137849 137635 136751 136366 136824 137649 138548 139660 140934 141893 142117 141631
54469 141631 140828 140271 140437 141355 142598 143707 144433 144528 143840 142828 142407 142848 143436 143630 143907 144774 145633 145566
54451 145566 144760 144094 143657 142883 142021 142122 143298 144180 143633 142088 140583 139352 138135 137221 137237 138100 138939
54434 138939 139065 138598 138135 138160 138740 139490 139831 139495 138768 138143 137841 137773 137777 137752 137708 137911 138857 140800 143269 145266
54414A45266Q15j83l27K52Q13P64J86l61m53j35K78N42O30O64P37P63N96L52L65
54395A51564O49P41L98J73O58J405J338K94o58o10J24P12Q58O76J44o72j183q02
54377A55809J07M99j13j026j165k00J174J870J352N4j045j286q06j90J46K21L45
54360A55746Q01J544K170K340K171K045K067K019J792J502J209R43J024J813K986
54345A82172L611L243K441J815J076l67k177l211k948k234k330l454m593m611
54331A68433l374j705m56J61L68L12J9l87p58j152j683k155k200j777j232q31
54315A51583n82m11k98j45P9J39k16p31p96j80O49J034O69k85j287j652j089l5
54297A46446Q53J410J772J747J002j36q44q23n85n29m85l19k99n22n65p4P39J447
$$ plain form
54414 145266 146081 145898 145571 145823 146636 147400 147586 147225 146772 146637 146915 147457 148087 148751 149488 150251 150847 151199 151564
54395 151564 152213 152954 153352 153525 154183 155588 156926 157220 156562 155952 156076 156788 157646 158322 158466 157794 156611 155809
54377 155809 155916 156415 156302 155276 154111 153911 155085 156955 158307 158361 157316 156030 155224 155034 155180 155401 155746
54360 155746 156547 158091 160261 162601 164772 166817 168884 170903 172695 174197 175406 176349 177373 179186 182172
54345 182172 185783 189026 191467 193282 194358 193991 191814 188603 185655 183421 181091 177637 173044 168433
54331 168433 165059 163354 162898 163059 163427 163739 163758 163371 162613 161461 159778 157623 155423 153646 152414 151583
54315 151583 151001 150590 150292 150147 150226 150365 150149 149418 148622 148442 149091 150125 150794 150509 149222 147570 146481 146446
54297 146446 147299 148709 150481 152228 153230 153094 152250 151427 150842 150313 149828 149509 149210 148688 148123 148049 148788 150235
54279A50235J808J632Q56j7j91L29N83l7q90j019m30J07J27k32o04o00Q2J291
54261A53030K339K695K441J922J300P48N05M24k3q20j129m50M66N92Nl98k90j95
54243A63162m71q21q33n50k71k06l36m90n75p68j301j913j989j344n11L8M26Q93
54225A52140J270J273R08K60o12j238q69M46J569J607R86O10O02N41L52J35l41
54208A59639j096j385o21N20Q50K54m08o39o10l83M3J90l58r59n73N66J111N23
54190A56664l07n62n23o48p17m48j60k45n34o93p32p17m46J89R50J515J674J212
54172A55472J54q18r22l63j15m64o29j57K63o4p07p98k91K04L49K06j78p08j030
54153A49404r29p09o89n53J66J265J964J837J208P01O92J029J172P09m4l17Q1
$$ plain form
54279 150235 152043 153675 154531 154514 154323 154652 155235 155198 154308 153289 152859 152966 153093 152861 152257 151657 151739 153030
54261 153030 155369 158064 160505 162427 163727 164475 164980 165404 165381 164561 163432 162982 163448 164040 164045 163647 163357 163162
54243 163162 162691 161870 161037 160487 160216 160010 159674 159184 158609 157841 156540 154627 152638 151294 150783 150821 151247 152140
54225 152140 153410 154683 155591 155851 155239 154001 153132 153578 155147 156754 157740 158350 158952 159493 159845 159980 159639
54208 159639 158543 157158 156537 157057 157907 158161 157753 157114 156504 156121 156164 156354 155996 155037 154464 155030 156141 156664
54190 156664 156357 155795 155272 154624 153907 153459 153299 153054 152520 151827 151095 150378 149932 150121 151071 152586 154260 155472
54172 155472 155626 154808 153886 153523 153408 152944 152315 152158 152421 152357 151650 150852 150561 150765 151114 151320 151142 150434 149404
54153 149404 148475 147766 147077 146524 146690 147955 149919 151756 152964 153665 154357 155386 156558 157267 157223 156906 156987
54136A56987M41J11o35j122j165r61n20J72P22P30M61M59O48M45k50p76n76J56
54118A55327Q11R69O09J25J04P00J258J048L36P1M77O96J91l31j9P25P96R3l04
54099A63682K73J132J227M58m48r19q25j59R49J941K107J334K39m73n41r3N27
54082A70411Q07M57q3LP61J150L63r19j199J8J679K483K200J599J542K327L551
54065A87150M372M192L327K775L208M345N441O093O322O129N308L701J388j226
54051B42525l456m528m136k777j413o12j71M43J384K278K717K793K961L426L858
54036B45292L867L694M082N331O752P326O772N672M584L519K455J847K089K602
54022C05884K185M83j420k242j934j439j330j385j422j815k892m295n365n913
$$ plain form
54136 156987 157428 157539 156904 155782 154617 153656 153136 153308 154030 154760 155221 155680 156328 156773 156523 155747 155171 155327
54118 155327 156138 157107 157716 157841 157945 158645 159903 160951 161287 161358 161835 162531 162722 162391 162372 163097 163893 163986 163682
54099 163682 163955 165087 166314 166772 166324 165405 164580 164421 165370 167311 169418 170752 170991 170518 169977 169884 170411
54082 170411 171218 171675 171592 171595 172356 173506 173869 172950 171751 171769 173448 175931 178131 179730 181272 183599 187150
54065 187150 191522 195714 199041 201816 205024 209369 214810 220903 227225 233354 238662 242363 243751 242525
54051 242525 239069 234541 230405 227628 226215 225603 225432 225875 227259 229537 232254 235047 238008 241434 245292
54036 245292 249159 252853 256935 262266 269018 276344 283116 288788 293372 296891 299346 301193 303282 305884
54022 305884 308069 308552 307132 304890 302956 301517 300187 298802 297380 295565 292673 288378 283013 277100
54008B77100o207o402o333n882n259m829m708m640m256l475k536j609n63N72J183
53993B22156O12q78k146k371j807j221r70q66o54k70J25K13j52n86m47L78J335
53976B12451J938K236K379K248J833J493J482J550J416J217J145J085R72J083
53962B34528J472J565Q19n20j743k398k266j250J37O87k36j628j847m79J401K617
53946B30859K806K282J751J969K961L792L813L732M542N836O325N836N484N842
53932B87830O223O107N977O288O668O777P043P868Q907R646J0044J0083R484Q476
53918C97421Q042Q725R856J0614J1208J2239J3428J3924J3503J2591J1334R319
53906E32204O169J802l602r269j3759j5977j6209j5598j4750j3456j1679r964
$$ plain form
54008 277100 270893 264491 258158 252276 247017 242188 237480 232840 228584 225109 222573 220964 220401 220973 222156
53993 222156 222768 221890 219744 217373 215566 214345 213375 212509 211855 211585 211710 211923 211771 211185 210738 211116 212451
53976 212451 214389 216625 219004 221252 223085 224578 226060 227610 229026 230243 231388 232473 233445 234528
53962 234528 236000 237565 238384 237864 236121 233723 231457 230207 230344 231031 230795 229167 227320 226841 228242 230859
53946 230859 233665 235947 237698 239667 242628 246420 250233 253965 258507 264343 270668 276504 281988 287830
53932 287830 294053 300160 306137 312425 319093 325870 332913 340781 349688 359334 369378 379461 388945 397421
53918 397421 405463 414188 424044 434658 445866 458105 471533 485457 498960 511551 522885 532204
53906 532204 538373 540175 536573 527304 513545 497568 481359 465761 451011 437555 425876 415912
53894D15912q743p919p349p260p837q764r414r391q703p682o790o344o239o091
53880C07386n686n218m986m957m815m421m130m413n163n602n130m082l302l029
53866B42452k733k140j830k416l453l731k673j054j89n74j492j886j521j091j247
53851B14422j761j909j434q56p80j229j644j447n92K57L01m54j051p00K69R58
53835B02350J079R39O12o6p36p20j20J26m19j010p80K19J389K350K887K753K034
53818B12887J283Q85O96O11Q79J535K119K454L033M026M606M007K837K450L313
53803B47621M700N745O130N905N396N167N469N733N139L675K151J296J228J643
53789C06998K024J833J009J41l03o69j535k707l475l674l781l983l976l697l582
$$ plain form
53894 415912 407169 399250 391901 384641 376804 368040 358626 349235 340532 332850 326060 319716 313477 307386
53880 307386 301700 296482 291496 286539 281724 277303 273173 268760 263597 257995 252865 248783 245481 242452
53866 242452 239719 237579 235749 233333 229880 226149 223476 222422 222233 221659 220167 218281 216760 215669 214422
53851 214422 212661 210752 209318 208462 207682 206453 204809 203362 202770 203027 203328 202874 201823 201123 201392 202350
53835 202350 203429 204368 204980 204914 204178 203458 203338 203464 203045 202035 201255 201474 202863 205213 208100 210853 212887
53818 212887 214170 215055 215751 216362 217241 218776 220895 223349 226382 230408 235014 239021 241858 244308 247621
53803 247621 252321 258066 264196 270101 275497 280664 286133 291866 297005 300680 302831 304127 305355 306998
53789 306998 309022 310855 311864 312005 311702 311033 309498 306791 303316 299642 295861 291878 287902 284205 280623
53774B80623l844m134m120l996m088m374m540m299l569k640k068k091k260k075
53760B32525j901k521l809m564l984k614j435o66rM22J18r27j955k210j588n56
53744B04326L58Q57R65Q96Q22P38O17N31M97L05k42r43j308j101n49O7P36J448
53726B09020J845J583R62O90R94J365J372J237J351J621J777J820J781J407O96
53711B29521L77J018J981K199J849K141L300M056L546K599K367K691K743K520
53697B62908K565K729K338J460R43J204J766K096K174K052J529N02o78j424j398
53682B80766q48o22j424k812l357k301o45K3n79j425j719j499r28j0P84O00o53
53665B63351j912k130j328k66M97Q18P10K89k63q44j417j694j294l05O50J170
$$ plain form
53774 280623 276779 272645 268525 264529 260441 256067 251527 247228 243659 241019 238951 236860 234600 232525
53760 232525 230624 228103 224294 219730 215746 213132 211697 211031 211022 211444 211562 210635 208680 206470 204882 204326
53744 204326 204684 205541 206506 207402 208224 208962 209579 210110 210607 210912 210670 209727 208419 207318 206769 206836 207572 209020
53726 209020 210865 212448 213410 214100 215094 216459 217831 219068 220419 222040 223817 225637 227418 228825 229521
53711 229521 229898 230916 232897 235096 236945 239086 242386 246442 249988 252587 254954 257645 260388 262908
53697 262908 265473 268202 270540 272000 272943 274147 275913 278009 280183 282235 283764 284266 283588 282164 280766
53682 280766 279918 279296 277872 275060 271703 269402 268757 268780 268201 266776 265057 263558 262630 262620 263404 264004 263351
53665 263351 261439 259309 257981 257715 258212 259030 259740 260029 259766 258922 257505 255811 254517 254212 254862 256032
53649B56032J483J871K048J515L97n18n78J30R64J432J523J484J439J381J426
53634B72029J767K302K638K621K524K477K130J251L79L63J326K509L103K930K416
53619C02765K219K718L591L999L541K778K490K691K831K718K635K762L005L340
53605C44083L746L931L736L590L951M389M084L172K705L104L541L210K326J412
53591C90980L28j220k773l529l426l132l075l013k608j986j565j651k273l191
53577C57866l961m118l503k448j560j187j153j063q32o53n32l01j64o70j681j997
53561C32043o98J458K776K653K029J802J687J012p0p29m64M85J470J976J919J660
53545C51009J592J724J895K293L290M654N466N090L969L230L681N278P192Q319
$$ plain form
53649 256032 257515 259386 261434 262949 263346 262828 262250 262380 263344 264776 266299 267783 269222 270603 272029
53634 272029 273796 276098 278736 281357 283881 286358 288488 289739 290118 290481 291807 294316 297419 300349 302765
53619 302765 304984 307702 311293 315292 318833 321611 324101 326792 329623 332341 334976 337738 340743 344083
53605 344083 347829 351760 355496 359086 363037 367426 371510 374682 377387 380491 384032 387242 389568 390980
53591 390980 391308 390088 387315 383786 380360 377228 374153 371140 368532 366546 364981 363330 361057 357866
53577 357866 353905 349787 346284 343836 342276 341089 339936 338873 338041 337388 336856 336555 336391 335721 334040 332043
53561 332043 331345 332803 335579 338232 340261 342063 343750 344762 344692 343963 343499 343984 345454 347430 349349 351009
53545 351009 352601 354325 356220 358513 361803 366457 371923 377013 380982 384212 387893 393171 400363 408682
53531D08682Q095P078O546P246Q754J0112J0815J1054J1258J1678J2308J3011
53519E26637J3702J4350J4806J4812J4453J4433J5519J7649J9915K1445K2071
53508G09792K2157K2175K2471K3022K3336K2882K1773K0824K0700K1207K1506
53497I51845K0956J9716J8466J7598J6839J5829J4939J4889J5615J6201J6156
53486A139049J6036J6327J6523J6036J5331J5214J5450J5156J4206J3242J2420
53475A304990J1186R271O951M376J547j089k998m533o497q780j0436j1244j1956
53462A280788j2873j3375j3252j3310j4029j4763j4963j5274j6562j8528k0073
53451A113786k0495j9767j8227j6570j5635j5588j5669j5101j3844j2251j0594
$$ plain form
53531 408682 416777 423855 430401 437647 446401 456513 467328 478382 489640 501318 513626 526637
53519 526637 540339 554689 569495 584307 598760 613193 628712 646361 666276 687721 709792
53508 709792 731949 754124 776595 799617 822953 845835 867608 888432 909132 930339 951845
53497 951845 972801 992517 1010983 1028581 1045420 1061249 1076188 1091077 1106692 1122893 1139049
53486 1139049 1155085 1171412 1187935 1203971 1219302 1234516 1249966 1265122 1279328 1292570 1304990
53475 1304990 1316176 1325447 1332398 1336774 1338321 1337232 1334234 1329701 1323204 1314424 1303988 1292744 1280788
53462 1280788 1267915 1254540 1241288 1227978 1213949 1199186 1184223 1168949 1152387 1133859 1113786
53451 1113786 1093291 1073524 1055297 1038727 1023092 1007504 991835 976734 962890 950639 940045
53440I40045r138q042o868m943k456l91Q45J817K779L207L094L508N019O657P378
53425I42511P662Q565J0064J1407J2409J3299J3911J4195J4933J6751J8880K0078
53413A104665K0476K1307K3056K5002K6571K7969K9488L1071L2672L4300L5816
53402A412393L7245L9029M1267M3135M4019M4780M6666M9243N0706N0328M9314
53391A908125M8929M9058M8984M8589M8037M7098M5514M3556M1579L9375L6479
53380B405323L2939K9402K6396K3758K0770J6910J2394P881L541j114o268j1252
53368B560680j5467j9396k4051k9669l5580m1069m5682m8950n0639n1211n1284
53357B147682n0812m9470m7682m6318m5382m3983m1830l9789l8617l7888l6749
$$ plain form
53440 940045 930907 922865 915997 911054 908598 908207 909052 910869 913648 916855 919949 923457 928476 935133 942511
53425 942511 950173 958738 968802 980209 992618 1005917 1019828 1034023 1048956 1065707 1084587 1104665
53413 1104665 1125141 1146448 1169504 1194506 1221077 1249046 1278534 1309605 1342277 1376577 1412393
53402 1412393 1449638 1488667 1529934 1573069 1617088 1661868 1708534 1757777 1808483 1858811 1908125
53391 1908125 1957054 2006112 2055096 2103685 2151722 2198820 2244334 2287890 2329469 2368844 2405323
53380 2405323 2438262 2467664 2494060 2517818 2538588 2555498 2567892 2575773 2579314 2578200 2571932 2560680
53368 2560680 2545213 2525817 2501766 2472097 2436517 2395448 2349766 2300816 2250177 2198966 2147682
53357 2147682 2096870 2047400 1999718 1953400 1908018 1864035 1822205 1782416 1743799 1705911 1669162
53346A669162l5204l4057l3833l4153l4078l2916l0717k8093k5537k3134k0943
53335A336497j9208j7873j6326j4162j1867j0128q842p554o560o685p979r456
53323A199857j0296j0570j0698j0793j0797j0673j0348r736q904p888o541m940
53311A087673l582k639j451M65K364L163L143L554M720N713O109O692Q167J0299
53297A134390J2788J5801J9027K1300K2042K2212K2972K4074K4463K3920K3184
53286A366173K2675K1956K0424J8004J5133J2473J0457Q880P055M617J874q14
53274A508907l620o872j0318j3218j5051j5991j6731j7956j9736k1524k2878k4009
53262A321003k5258k6298k6559k6298k6402k7017k7301k6801k6201k6193k6344
$$ plain form
53346 1669162 1633958 1599901 1566068 1531915 1497837 1464921 1434204 1406111 1380574 1357440 1336497
53335 1336497 1317289 1299416 1283090 1268928 1257061 1246933 1238091 1230537 1223977 1217292 1209313 1199857
53323 1199857 1189561 1178991 1168293 1157500 1146703 1136030 1125682 1115946 1107042 1099154 1092613 1087673
53311 1087673 1084091 1081452 1080001 1080466 1082830 1085993 1089136 1092690 1097410 1103123 1109232 1115924 1124091 1134390
53297 1134390 1147178 1162979 1182006 1203306 1225348 1247560 1270532 1294606 1319069 1342989 1366173
53286 1366173 1388848 1410804 1431228 1449232 1464365 1476838 1487295 1496175 1503230 1507847 1509721 1508907
53274 1508907 1505287 1498415 1488097 1474879 1459828 1443837 1427106 1409150 1389414 1367890 1345012 1321003
53262 1321003 1295745 1269447 1242888 1216590 1190188 1163171 1135870 1109069 1082868 1056675 1030331
53251A030331k5758k4315k2655k1339k0573k0424k0759k1148k1218k0877k0019
53240G91246j8473j6513j4997j4461j4437j4069j3060j1642r990q218o678n800
53228F42908n657n981o461o819o921p024p617q753r899j0676j1314j2129j2973
53215E30684j3520j3707j3530j2864j1799j0783j0024r211q237p646p813q173
53203D03377p909p121o625o821p407q044q628q988q868q309p582o764n767m727
53189B99817l976l616l422l158k768k290j847j591j525j467j389j537k031k567
53175B66633k749k418j593l84P31J085N92n7l66o78j361j942j767j134q85j152
53159B52555j333j249j307j475j070N5R12N56o82j644j729j325j056j131j376
$$ plain form
53251 1030331 1004573 980258 957603 936264 915691 895267 874508 853360 832142 811265 791246
53240 791246 772773 756260 741263 726802 712365 698296 685236 673594 663604 655386 648708 642908
53228 642908 637251 631270 624809 617990 611069 604045 596428 587675 577776 567100 555786 543657 530684
53215 530684 517164 503457 489927 477063 465264 454481 444457 435246 427009 419363 411550 403377
53203 403377 395468 388347 381722 374901 367494 359450 350822 341834 332966 324657 317075 310311 304544 299817
53189 299817 295841 292225 288803 285645 282877 280587 278740 277149 275624 274157 272768 271231 269200 266633
53175 266633 263884 261466 259873 259489 260220 261305 261897 261840 261474 260796 259435 257493 255726 254592 253707 252555
53159 252555 251222 249973 248666 247191 246121 246176 247088 247644 246962 245318 243589 242264 241208 240077 238701
53144B38701j549j520j242p08O2R49J667J928J711J269Q30M19jl39m59m34n17
53127B40767p36o41K42J595K315J671L20k59N72J953K543J860M71p48j231r10
53111B49784j64M54N94K55l61r67j315j444j742k345k615j798k12R05Q76K81j06
53094B40080k57m46n56m22l05l90k89K86P98N76j19n03m56m76o39m70R3M22J00
53075B37027n18q65p46k69L39O79L96l48r59j128j045q87n46q4N4l67q91q86l87
53056B28569k2j90o25q32p06n30m96m64k89j26j56j57K57R41J233Q17K05Q2N28
53037B28039J143J648J891J596N69p95j724j786j197m71L2J96J22rj66m71q23
53020B27794p75r5P65J067O60J42J30O25J154J377J482J897K574K757J829L52
$$ plain form
53144 238701 237152 235632 234390 233682 233744 234693 236360 238288 239999 241268 242098 242517 242516 242177 241718 241284 240767
53127 240767 240031 239390 239632 241227 243542 245213 245533 245274 245846 247799 250342 252202 252673 251925 250694 249784
53111 249784 249620 250074 250668 250923 250562 249595 248280 246836 245094 242749 240134 238336 238124 239029 239905 240186 240080
53094 240080 239823 239377 238821 238399 238094 237704 237415 237701 238499 239075 238956 238453 237997 237521 236882 236412 236505 236927 237027
53075 237027 236509 235644 234898 234629 234968 235647 236043 235695 234736 233608 232563 231676 231130 231046 231100 230733 229842 228956 228569
53056 228569 228547 228357 227732 226900 226194 225664 225168 224704 224415 224289 224133 223976 224233 225174 226407 227224 227429 227511 228039
53037 228039 229182 230830 232721 234317 234886 234091 232367 230581 229384 228913 228945 229141 229263 229254 229088 228617 227794
53020 227794 227019 226924 227689 228756 229416 229558 229688 230313 231467 232844 234326 236223 238797 241554 243383 243735
53004B43735l48J82R07O70l10r09o95l18m20q34j019p97l90L5N62J252J813J762
52986B44878J088N10O46J111J006K93p5M22J123J288J081R23O68J79P6R19K126
52969B58262K644K372J952J605J093O71Q14J180Q94Qm86k57j68q13j644k028k245
52952B63854k726l052k554j492q57j188k116k915l076k453j310j80N83J048J377
52937B42943J468J131M98j7j42m5j37o26j233j511j434j472j881k225j915j018
52921B32384j46L32N82Q98J306J549J229J87j033j458p98J27M76M69P08R77O09
52904B38398k12o04l35nJ51N56J242J574J326J046R06K58j073k035j748q51n36
52887B38058p83o80q8J82j83m43l7N27N59K96M93J133J416R94N27N68N98r3r21
$$ plain form
53004 243735 243387 243569 244476 245146 244836 243927 243232 242914 242494 241660 240641 239844 239454 239489 240051 241303 243116 244878
52986 244878 245966 246476 247122 248233 249239 249532 249457 249879 251002 252290 253371 254294 254962 255141 255217 256136 258262
52969 258262 260906 263278 265230 266835 267928 268599 269413 270593 271487 271495 271009 270752 270584 269771 268127 266099 263854
52952 263854 261128 258076 255522 254030 253173 251985 249869 246954 243878 241425 240115 239935 240518 241566 242943
52937 242943 244411 245542 246040 246023 245881 245836 245699 245073 243840 242329 240895 239423 237542 235317 233402 232384
52921 232384 232238 232570 233152 234050 235356 236905 238134 238321 237288 235830 235032 235159 235635 236104 236812 237789 238398
52904 238398 238186 237582 237247 237242 237393 237949 239191 240765 242091 243137 244043 244301 243228 241193 239445 238594 238058
52887 238058 237275 236595 236507 236689 236506 236063 236026 236553 237112 237408 237901 239034 240450 241444 241971 242539 243137 243044 242123
52868B42123m79J406L174L537K981K586K224J085o37j817j960j557r97k16N45
52853B51998O28j30j259k435l606m396m314l621l014k482j547o05o23j378j435
52838B21781l72M85K01l52j81J48l22j192j486j282j152p11P78K651L272K156
52822B24422M94n22q85j135j472j685j411l35J277K421K267J235N84R45J781K242
52806B30223K032J437R12O80N35J04n98j246j838k673l403k972j136O58P82o44
52790B22853k089k458j833p80J24M05Q5j27K87R76J419J801K347K476J678P37
52774B27901P81J415J214r6j310j700j803j995j711o95K10K87QJ11L98K63k10
52757B23068m66m06l86n17m88j0Q78J786K192J884J259Q49O64M39L80R66J931
$$ plain form
52868 242123 241644 243050 246224 249761 252742 255328 257552 258637 258000 256183 254223 252666 251669 251453 251998
52853 251998 252626 252496 251237 248802 245196 240800 236486 232865 229851 227369 225822 225217 224594 223216 221781
52838 221781 221409 221894 222095 221743 221562 221710 221388 220196 218710 217428 216276 215565 216343 218994 222266 224422
52822 224422 224916 224394 223509 222374 220902 219217 217806 217471 218748 221169 223436 224671 225255 226200 227981 230223
52806 230223 232255 233692 234604 235284 235819 235923 235325 234079 232241 229568 226165 223193 222057 222715 223497 222853
52790 222853 220764 218306 216473 215693 215817 216222 216307 216180 216467 217443 218862 220663 223010 225486 227164 227901
52774 227901 228682 230097 231311 231215 229905 228205 226402 224407 222696 222001 222211 222498 222506 222617 223015 223278 223068
52757 223068 222602 222196 221810 221293 220805 220795 221673 223459 225651 227535 228794 229643 230307 230746 231126 232092 234023
52740B34023K334J828J162J058J345J559J644J656J355O85P7j39k20m04l87J16
52724B47692P23Q41L80l83j275k019k052j165k3M78K05l42q59j349j663j469p73
52707B36947l1K48j15q06j151p09P2K96j02j34P36J631J500P22M94R56J155P39
52689B42448M42O57O49j69j087j045j36O27P14L96q4p74j384j296n89k65q85j506
52671B36713q38P69J528N29j021j403m53O57J174J343J427J189N78J25K83Q60
52655B43460J412J762J863J660J362J332J449R98l52j966k932k949k165p73P11
52640B44872J302N14q23j476j236p78l92J70P55P51J71j43K67Q40R98R90J192
52623B47974J249O75j56m47k12k69r44j514j207k88K35j57r45j222p00L1K13k91
$$ plain form
52740 234023 236357 238185 239347 240405 241750 243309 244953 246609 247964 248649 248726 248587 248367 247963 247576 247692
52724 247692 248415 249256 249636 249253 247978 245959 243907 242742 242719 243197 243402 243060 242201 240852 239189 237720 236947
52707 236947 236916 237164 237049 236243 235092 234383 234455 234751 234649 234515 235251 236882 238382 239104 239598 240554 241709 242448
52689 242448 242890 243547 244196 244027 242940 241895 241759 242386 243100 243496 243412 242638 241254 239958 239369 239104 238219 236713
52671 236713 235875 236644 238172 238701 237680 236277 235824 236481 237655 238998 240425 241614 242192 242317 242600 243460
52655 243460 244872 246634 248497 250157 251519 252851 254300 255298 254946 252980 250048 247099 244934 244161 244872
52640 244872 246174 246688 245865 244389 243153 242375 241983 242153 242908 243659 243830 243687 243954 244794 245792 246782 247974
52623 247974 249223 249898 249742 249295 249083 248814 247870 246356 245149 244861 245096 244939 243994 242772 242072 242103 242316 242025
52605B42025r64j229r05j59O50J105J035P76Q09J041Q48N2o94q08o16p01q03j91
52587B41271R48J455P06n00r94n56K25R06J354J332O62k79p60n52j76j72n61r73
52569B43336j054n85M45J670K424K203J049m56j530j659r89k55q6m52q90j164
52553B42007j370j516j428j118p92m51P9O62Q63N74K07O9J4l1K44R41J488J239
52535B41681K95o83j190j029j63J059J807J494M76l89o78n19o7M50N18r7o85k57
52517B42023J061K103K172J763J628J875K260K649K831K522J935J744K077K154
52503B70797J417L73k37n98j317k294k868k957l132l606l895l587k810j812o67
52488B42807L88R04P73M51L07J47k94p00m38O04J791K367K152J646J495J849K192
$$ plain form
52605 242025 241061 239832 238927 238768 239418 240523 241558 242334 243143 244184 245032 245084 244390 243582 242966 242265 241462 241271
52587 241271 242219 243674 244380 243880 242886 242330 242555 243461 244815 246147 246809 246530 245770 245218 245042 244870 244309 243336
52569 243336 242282 241697 242142 243812 246236 248439 249488 249032 247502 245843 244854 244599 244513 244061 243171 242007
52553 242007 240637 239121 237693 236575 235783 235332 235411 236073 236936 237510 237717 237786 237800 237769 238013 238954 240442 241681
52535 241681 241976 241293 240103 239074 238911 239970 241777 243271 243747 243358 242680 242161 242094 242544 243062 242965 242280 242023
52517 242023 243084 245187 247359 249122 250750 252625 254885 257534 260365 262887 264822 266566 268643 270797
52503 270797 272214 272587 272350 271752 270435 268141 265273 262316 259184 255578 251683 248096 245286 243474 242807
52488 242807 243195 244099 244872 245323 245630 245777 245483 244783 244345 244949 246740 249107 251259 252905 254400 256249 258441
52471B58441J910J044K90K31P21J190J347J402J657K120K567K801K774K479J834
52456B82808P84n41j800k722l309l667l698l247k496j962j878j870j480q55n78
52441B53489q59j284j380j106o44o2N65R29P35J03m89o83m91j34J24J06q3p7L43
52422B49102Q89J107R85R26J131J400J542J607J674J787K239L334M707N387M953
52407B82770M201M318N620P470Q949R201P682M714J512j050l312n766p625p597
52393C11087o012m776m866n128m232k671j807j751j417l55P23J217J406J700J992
52378B85110K071K022J887J486R82J101K286L974N184N627N726N724N363M511
52364C33054L510K678J829O86n13j181j127p75o25q19j183j451j311n45O65J802
$$ plain form
52471 258441 260351 261395 261685 261916 262637 263827 265174 266576 268233 270353 272920 275721 278495 280974 282808
52456 282808 283592 283051 281251 278529 275220 271553 267855 264608 262112 260150 258272 256402 254922 254067 253489
52441 253489 252630 251346 249966 248860 248216 248154 248719 249648 250383 250486 249997 249314 248823 248689 248813 248919 248836 248759 249102
52422 249102 249991 251098 252083 253009 254140 255540 257082 258689 260363 262150 264389 267723 272430 277817 282770
52407 282770 286971 291289 296909 304379 313328 322529 330211 334925 336437 335387 332075 326309 318684 311087
52393 311087 305075 300299 295433 290305 286073 283402 281595 279844 278427 278072 278795 280012 281418 283118 285110
52378 285110 287181 289203 291090 292576 293558 294659 296945 300919 306103 311730 317456 323180 328543 333054
52364 333054 336564 339242 341071 341757 341244 340063 338936 338161 337536 336717 335534 334083 332772 332227 332892 334694
52348C34694K509K891L170L360L470L754M386N111N560N803O200O807P399P973
52334D03087Q758R634J0188J0482J1270J3057J5354J7193J8163J8576J8940J9613
52322E74315K0747K2137K3176K3372K2882K2306K1900K1389K0552J9666J9185
52311H11627J9233J9577J9941K0117J9882J9034J7631J6042J4640J3492J2392
52300A003608J1165R795Q320O766N167L550J738n37l302o188q779j0912j2470
52287A007921j3125j2616j1239r753q727q152p617o680n161l272j394L98K468
52274I23051N042P644R523J0491J1061J1828J3016J4459J5678J6045J5401J4424
52262A067663J3960J4084J4246J4188J4019J3516J2174J0128Q204O889N895M949
$$ plain form
52348 334694 337203 340094 343264 346624 350094 353848 358234 363345 368905 374708 380908 387715 395114 403087
52334 403087 411845 421479 431667 442149 453419 466476 481830 499023 517186 535762 554702 574315
52322 574315 595062 617199 640375 663747 686629 708935 730835 752224 772776 792442 811627
52311 811627 830860 850437 870378 890495 910377 929411 947042 963084 977724 991216 1003608
52300 1003608 1014773 1024568 1032888 1039654 1044821 1048371 1050109 1049572 1046270 1040082 1031303 1020391 1007921
52287 1007921 994796 982180 970941 961188 952461 944309 936692 930012 924851 921579 920185 920583 923051
52274 923051 928093 935737 945260 955751 966812 978640 991656 1006115 1021793 1037838 1053239 1067663
52262 1067663 1081623 1095707 1109953 1124141 1138160 1151676 1163850 1173978 1182182 1189071 1194966 1199915
52250A199915M153L167J050k462o248r180j1548j4232j7049j8988j9815k0379
52238A088384k1253k2014k2115k1687k1154k0596j9789j8612j7153j5698j4576
52227H73737j3855j3163j2129j0875r724q601p227n823n011m905m778l913k393
52214G71340q23M01J247J794K099K320K717L416M225M749M733M230L413K349J195
52199H09405M71O37J376J773J444R58R53J423K210L484N096O018N351L549J866
52184H46014Q10j9q96j763k906m751o852q113q229p977p826p256n932m521l714
52169G76069l192k293j105j51N04J148J843K636L860N547O871O997O195N383M837
52154H15149M115L154K457K165J828J343J284K002K951L480L676M010M543N042
$$ plain form
52250 1199915 1204068 1207235 1208285 1205823 1199575 1190395 1178847 1164615 1147566 1128578 1108763 1088384
52238 1088384 1067131 1045117 1023002 1001315 980161 959565 939776 921164 904011 888313 873737
52227 873737 859882 846719 834590 823715 813991 805390 798163 792340 787329 782424 777646 773733 771340
52214 771340 770517 770918 772165 773959 776058 778378 781095 784511 788736 793485 798218 802448 805861 808210 809405
52199 809405 809876 810513 811889 813662 815106 816064 817017 818440 820650 824134 829230 835248 840599 844148 846014
52184 846014 846824 846805 845909 844146 841240 836489 829637 821524 813295 805318 797492 790236 784304 779783 776069
52169 776069 772877 770584 769479 769328 769832 770980 772823 775459 779319 784866 791737 798734 804929 810312 815149
52154 815149 819264 822418 824875 827040 828868 830211 831495 833497 836448 839928 843604 847614 852157 857199
52140H57199N535O190O776O856O521O453P107Q270R617J1337J3751J6571J8939
52127I81122K0383K1460K3268K6336L0033L3011L4282L4016L3300L3002L2896
52116A303109L2069L0168K7834K5801K3981K1836J9267J6609J3882J0757P317
52105A532630M209J781l30k397l910m335m269n079p258r746j1197j1628j2347
52092A466124j4357j7119j9221k0025k0321k1137k2344k2823k1941k0148j7953
52081A248735j5068j1153o963l833k033m26K029N037P606R396J0890J2533J4297
52068A271047J5965J7369J8281J8516J8177J7552J6723J5643J4547J3781J3205
52057A450806J2286J1016J0060R587Q570O005K406p39k913n065q088j1653j4842
$$ plain form
52140 857199 862734 868924 875700 882556 889077 895530 902637 910907 920524 931861 945612 962183 981122
52127 981122 1001505 1022965 1046233 1072569 1102602 1135613 1169895 1203911 1237211 1270213 1303109
52116 1303109 1335178 1365346 1393180 1418981 1442962 1464798 1484065 1500674 1514556 1525313 1532630
52105 1532630 1536839 1538620 1538290 1535893 1531983 1527648 1523379 1518300 1511042 1501296 1490099 1478471 1466124
52092 1466124 1451767 1434648 1415427 1395402 1375081 1353944 1331600 1308777 1286836 1266688 1248735
52081 1248735 1233667 1222514 1215551 1211718 1209685 1209259 1211288 1216325 1223931 1233327 1244217 1256750 1271047
52068 1271047 1287012 1304381 1322662 1341178 1359355 1376907 1393630 1409273 1423820 1437601 1450806
52057 1450806 1463092 1474108 1484168 1493755 1502325 1508330 1510736 1509997 1507084 1502019 1493931 1482278 1467436
52044A467436j7283j9193k0873k2579k4410k5967k6546k6105k5505k5304k4856
52033A208815k3265k0842j8768j7538j6562j5340j4195j3591j3382j3114j2680
52022A029538j2348j2332j2512j2496j1934j0962j0169r901r701q864p376n945
52010I04998n192n239o017p414r059j0396j1129j1310j1119j0890j1146j2035
51998G94052j2921j3107j2787j2521j1979j0317p830o033n689n870n637n490o289
51985F77582p620q364q370q441q969r582j0013j0368j0604j0517j0260j0122r860
51972E54492q984p613o300n040l299j131O31J526K060K855L939N217O863Q639
51958E53855R521Q644O314L499P41j838l882n010n510o042o540o201m700k747
$$ plain form
52044 1467436 1450153 1430960 1410087 1387508 1363098 1337131 1310585 1284480 1258975 1233671 1208815
52033 1208815 1185550 1164708 1145940 1128402 1111840 1096500 1082305 1068714 1055332 1042218 1029538
52022 1029538 1017190 1004858 992346 979850 967916 956954 946785 936884 927183 918319 910943 904998
52010 904998 899806 894567 888550 881136 872077 861681 850552 839242 828123 817233 806087 794052
51998 794052 781131 768024 755237 742716 730737 720420 712590 706557 700868 694998 689361 683871 677582
51985 677582 669962 661598 653228 644787 635818 626236 616223 605855 595251 584734 574474 564352 554492
51972 554492 545508 537895 531595 526555 523256 522125 522756 524282 526342 529197 533136 538353 545216 553855
51958 553855 563376 572020 578334 581833 582574 580736 576854 571844 566334 560292 553752 547551 542851 540104
51944E40104j063N68K685N049O854P892Q748R773J0546J0624J0278R961R439Q015
51930F39473N526K555l93l436o833j0284j2980j4289j4273j3593j2899j2268j1361
51917E34945j0190r319r026q543o887m230j711J07J738L577N193O298P431Q924
51903E18307R988R859R172Q970Q730O789K850j335m207o123q239j0643j2544j3668
51889E17906j4389j4754j4228j2516j0008p334m889k838j207J17J263K304L460
51876D42887N121P241Q929R209Q253P236O776O110M299J726k69j128j691k963
51862E01736m771o058o086n030l622k601k297k282j571L73K744M009L486J887
51848D79917K49j137k491l824m957n832o355o193n297m385m261m756m947m417
$$ plain form
51944 540104 539041 539609 542294 547343 554197 562089 570837 580610 591156 601780 612058 622019 631458 639473
51930 639473 644999 647554 647161 643725 636892 626608 613628 599339 585066 571473 558574 546306 534945
51917 534945 524755 515436 506410 497867 490980 486750 485039 485146 486884 490461 495654 501952 509383 518307
51903 518307 528295 538154 547326 556296 565026 571815 574665 573330 569123 563000 554761 544118 531574 517906
51889 517906 503517 488763 474535 462019 452011 444677 439788 436950 435743 435860 437123 439427 442887
51876 442887 448008 455249 464178 473387 481640 488876 495652 501762 506061 507787 507518 506390 504699 501736
51862 501736 496965 490907 484821 479791 476169 473568 471271 468989 467418 467791 470535 474544 478030 479917
51848 479917 480166 479029 476538 472714 467757 461925 455570 449377 444080 439695 435434 430678 425731 421314
51834D21314l672l193k703j640J9J744K881K939J803M1j298j623j427j662k586
51819D10937l476l532k765j918j606j682j476n58Q39K190L257M032M332L809K449
51804D14832P51p04j644k050j962j531j020o14l16j85m07j071j986k814l302l288
51788C92689k766j985j318q16k17N61J150J160O65P7k51j41M43J249J787J864
51772C94151J937K639M000N480O677P690Q703R542R839R515Q895Q256P403N828
51758D90555L465J010q44k350m395p110r386j0119r495q492p533o345m936l817
51744D20208l111k236q72L78Q22Q14J401K964M726N773O094O427P139P580O712
51729D64819M345J598q8l11J35M21N32Q04J065P64k82j734l270m787o000o422
$$ plain form
51834 421314 417642 414449 411746 410106 410125 411869 414750 417689 419492 419533 418235 416612 415185 413523 410937
51819 410937 407461 403929 401164 399246 397640 395958 394482 393924 394763 396953 400210 404242 408574 412383 414832
51804 414832 415583 414879 413235 411185 409223 407692 406672 406058 405742 405557 405150 404079 402093 399279 395977 392689
51788 392689 389923 387938 386620 385804 385587 386148 387298 388458 389123 389200 388949 388808 389251 390500 392287 394151
51772 394151 396088 398727 402727 408207 414884 422574 431277 440819 450658 460173 469068 477324 484727 490555
51758 490555 494020 495030 494186 491836 487441 480331 470945 460826 451331 442839 435306 428961 424025 420208
51744 420208 417097 414861 413989 414367 415189 416003 417404 420368 425094 430867 436961 443388 450527 458107 464819
51729 464819 469164 470762 470674 470363 470498 470919 471451 472255 473320 474084 473802 472068 468798 464011 458011 451589
51713D51589n958n189m703m459m137l808l757l781l290k210j178o53l15K47P70
51698D09168P22K14j27p7M5J24N34J414K246K413J815O60r16k636l911m349m147
51681D03192l631k737j392j13N06O90J206K207L068L392L529L901M472N107N899
51666D29296O842P644Q201Q702Q977Q293O213L187j56l675p093r338r412p608
51652D50073n026k214Q05L398M461L891K791J831M22j967m594o383p305q019q532
51637D23632q286p231n990m988m179l665l714m057l878k793j341k26M37Q85J150
51622C75756J142R36O11L5q10j470j367n33L00L96l21j241j637j281o58m05n33
51605C68920l92N15J903L148M027M704N116M992M565M638N687P176Q196Q431Q024
$$ plain form
51713 451589 445631 440442 435739 431280 427143 423335 419578 415797 412507 410297 409119 408466 408151 408398 409168
51698 409168 409890 410104 409977 409900 409945 410069 410603 412017 414263 416676 418491 419151 418235 415599 411688 407339 403192
51681 403192 399561 396824 395432 395319 395825 396515 397721 399928 402996 406388 409917 413818 418290 423397 429296
51666 429296 436138 443782 451983 460685 469662 477955 484168 487355 487199 483524 476431 467093 457681 450073
51652 450073 445047 442833 443638 447036 451497 455388 458179 460010 460432 458465 453871 447488 440183 432164 423632
51637 423632 415346 408115 402125 397137 392958 389293 385579 381522 377644 374851 373510 373284 373721 374606 375756
51622 375756 376898 377834 378445 378480 377670 376200 374833 374300 374600 374996 374675 373434 371797 370516 369858 369453 368920
51605 368920 368528 369043 370946 374094 378121 382825 387941 392933 397498 402136 407823 414999 423195 431626 439650
51590D39650O743M077L03l244n423o337o668o436n144k924o82J087K819M991P303
51575D30115R224J0767J2283J3764J4902J5556J5815J5828J5975J6742J7985J8780
51563F07736J8618J8401J9437K1776K4449K7145L0446L4199L6822L6800L4069
51552I09898K9365K3073J5433P202q59q775j6807k4376l0425l4660l7574l9313
51540G92182l9415l7855l5556l3360l1094k8165k4649k1264j8417j5883j3458
51529D93066j1372r882q764p625o567o040n984n625m481l179k725l153l547l301
51515D10821k671k030j278m00J88K37J81M64Q94J169J520K101K245J195n65j699
51499D12372j657j121p97n99k79l2r4k70k56j00k0j68o68j550k458k902k953l236
$$ plain form
51590 439650 446393 450470 450773 447529 442106 435769 429101 422665 417521 414597 413915 415002 417821 422812 430115
51575 430115 439339 450106 462389 476153 491055 506611 522426 538254 554229 570971 588956 607736
51563 607736 626354 644755 664192 685968 710417 737562 768008 802207 839029 875829 909898
51552 909898 939263 962336 977769 984971 984112 975337 958530 934154 903729 869069 831495 792182
51540 792182 752767 714912 679356 645996 614902 586737 562088 540824 522407 506524 493066
51529 493066 481694 471812 463048 455423 448856 442816 436832 431207 426726 423547 420822 417669 414122 410821
51515 410821 408150 406120 404842 404442 404630 404867 405048 405512 406406 407575 409095 411196 413441 414636 414071 412372
51499 412372 410715 409594 408797 408198 407919 407887 407793 407523 407267 407167 407147 406979 406311 404761 402303 399401 396448 393212
51481C93212l989m679m788m495m224m014l726l450l265k971k518k313k671l217
51467C42892l328k937k402j808j023k18K23L14M77R27J448J817K016K079K049
51452C42526K157K599L219L741M276N079N915O272O322O992Q766J0892J2165J2067
51438D32988J0868Q948O516L756Q56j937m142n210n255n226n884o909p492p533
51424D14344p520p391o438m552k736j969k087k267k105j704j057r0R02J464J666
51409C78460K032K726L306L421L280L257L325L190K735K105J566J391J718K347
51395D14859K855L128L546M507N949P602R429J1443J3251J4318J4796J5734J8086
51382E39503K1770K5922K9987L4138L8549M2725M5913M8007M9460N0140M8782
$$ plain form
51481 393212 389223 384544 379756 375261 371037 367023 363297 359847 356582 353611 351093 348780 346109 342892
51467 342892 339564 336627 334225 332417 331394 331176 331399 331713 332190 333117 334565 336382 338398 340477 342526
51452 342526 344683 347282 350501 354242 358518 363597 369512 375784 382106 389098 397864 408756 420921 432988
51438 432988 443856 452804 459320 463076 463932 461995 457853 452643 447388 442162 436278 429369 421877 414344
51424 414344 406824 399433 392995 388443 385707 383738 381651 379384 377279 375575 374518 374428 375330 376794 378460
51409 378460 380492 383218 386524 389945 393225 396482 399807 402997 405732 407837 409403 410794 412512 414859
51395 414859 417714 420842 424388 428895 434844 442446 451875 463318 476569 490887 505683 521417 539503
51382 539503 561273 587195 617182 651320 689869 732594 778507 826514 875974 926114 974896
51371I74896M4034L5834K5402J4139K984p318j6175k3739l0898l8161m4743m9208
51359H87047n0983n0820m9796m8169m5362m0928l5320k9618k4578k0249j6500
51348D74724j3594j1780j0608r239p522o186n838o219o606o492n710m418l214
51335C77298k688k618k186j289r46j839l249m033m128m080l745k597j043k36m68
51320C42153q08n36j3K16K64L94M55L35M40J092J854J985J362N96L45P93J636
51303C52563K352K646K692K808K915K639J921J122M79j33p92j335j731k195k713
51288C63238k916k581k029j689j584j340n06J115L126M509M448L246J988J337
51274C70362J090Q86O46K92k42n37j9J063J713J593J438J667J599P31j48j06L50
$$ plain form
51371 974896 1018930 1054764 1080166 1094305 1097289 1089971 1073796 1050057 1019159 980998 936255 887047
51359 887047 836064 785244 735448 687279 641917 600989 565669 536051 511473 491224 474724
51348 474724 461130 449350 438742 429503 421981 415795 409957 403738 397132 390640 384930 380512 377298
51335 377298 374610 371992 369806 368517 367571 365732 362483 358450 354322 350242 346497 343900 342857 342621 342153
51320 342153 341345 340809 340796 341012 341276 341670 342125 342460 342900 343992 345846 347831 349193 349789 350134 350927 352563
51303 352563 354915 357561 360253 363061 365976 368615 370536 371658 372137 372004 371212 369877 368146 365951 363238
51288 363238 360322 357741 355712 354023 352439 351099 350593 351708 354834 359343 363791 367037 369025 370362
51274 370362 371452 372338 372984 373276 373034 372497 372478 373541 375254 376847 378285 379952 381551 382282 382134 382028 382378
51257C82378n9j524k961l485l124k234j164n07q44j956k960l316l234l040k695
51242C49275k011r46L77J582K062J519M57k43k84j07k27p37j342j576j142l56
51226C46301N4j20k46M1P9p50j685j422J3J274J555J307J088P99L84K69O56J180
51208C50777J635K264L015L332L134L081L433L522K978K539K838L149K397Q25
51194C88919m06q91j144j355j146n61l16p80j497j949k136k177k016j715j558
51179C69272j537j281o78r2K54N18O05nj263j997j115R02K476K788K442K263K284
51162C75836K171K034K176K409K200J417M96j38m58o60q95j291j879k413k466
51147C78539j928j210p72n82k18N57J412J721J158P7p20p26k25J06o8n76j241
$$ plain form
51257 382378 382319 380795 377834 374349 371225 368991 367827 367320 366476 364520 361560 358244 355010 351970 349275
51242 349275 347264 346318 346695 348277 350339 351858 352315 352072 351788 351681 351454 350717 349375 347799 346657 346301
51226 346301 346355 346235 345989 346030 346109 345359 343674 342252 342265 343539 345094 346401 347489 348288 348672 348941 349597 350777
51208 350777 352412 354676 357691 361023 364157 367238 370671 374193 377171 379710 382548 385697 388094 388919
51194 388919 388513 387622 386478 385123 383977 383416 383100 382320 380823 378874 376738 374561 372545 370830 369272
51179 369272 367735 366454 365776 365684 365938 366456 367061 367056 365793 363796 362681 363583 366059 368847 371289 373552 375836
51162 375836 378007 380041 382217 384626 386826 388243 388739 388601 388143 387483 386588 385297 383418 381005 378539
51147 378539 376611 375401 374629 374047 373829 374386 375798 377519 378677 378754 378034 377308 377083 377189 377121 376545 375304
51130C75304k020k616k478j544n39o7J90Q56J751K088J715J407J759K394K597
51115C80797K274J871J674J631J723K084K756L512L959L792K997J999J415J538
51101D14022K102K612K839K859K721K295J543P39K45Q1j39p21j486k009k182k271
51085D23250k411k367j969j439j084q69o05l55l14n20q83j348j677j365j96J262
51069D07110K278K910L711M720N358N581O224P914J0150J1950J2974J3598J4170
51056E08648J4609J4467J3211J0742P989O529P204R269J1277J2472J2924J2689
51044F42030J1588R772P766N647K741j471o304j0128j1708j1177r764q759q863
51031F11370j0235j2617j5164j6555j5918j3663j1058q915p169n596m236k867
$$ plain form
51130 375304 373284 370668 368190 366646 366107 366040 366230 367086 368837 370925 372640 374047 375806 378200 380797
51115 380797 383071 384942 386616 388247 389970 392054 394810 398322 402281 406073 409070 411069 412484 414022
51101 414022 416124 418736 421575 424434 427155 429450 430993 431732 431977 432058 431919 431198 429712 427703 425521 423250
51085 423250 420839 418472 416503 415064 413980 413111 412506 412151 411837 411317 410434 409086 407409 406044 405848 407110
51069 407110 409388 412298 416009 420729 426087 431668 437892 445806 455956 467906 480880 494478 508648
51056 508648 523257 537724 550935 561677 569666 576195 583399 592668 603945 616417 629341 642030
51044 642030 653618 663390 671156 676803 679544 678073 671769 661641 649933 638756 628992 620233 611370
51031 611370 601135 588518 573354 556799 540881 527218 516160 507245 500076 494480 490244 487377
51019D87377q81J753M000M978N152N646O601P212P195P260P963Q944R672J0115
51005E72987J0351J0127R418Q896R182R961J0445J0546J0916J1841J2725J2847
50993G00242J2148J1061R918Q886Q257Q342R024R638R553Q835Q246Q522R702J1289
50979H33663J2879J4436J5884J6880J7252J7567J8866K1775K6064L1143L6693
50968A063102M2633M8718N4466N9553O4025O8010P1424P4119P6161P7689P8466
50957A778366P7903P5648P1885O6818O0179N1731M2100L2404K2951J2972K121
50946B295078q490j7371k4401l0518l5917l9606m1086m1457m2228m3653m4952
50935A925399m5622m5811m5564m4590m2839m0737l8706l6881l5418l4630l4717
$$ plain form
51019 487377 486496 488249 492249 497227 502379 508025 514626 521838 529033 536293 544256 553200 562872 572987
51005 572987 583338 593465 602883 611779 620961 630922 641367 651913 662829 674670 687395 700242
50993 700242 712390 723451 733369 742255 750512 758854 767878 777516 787069 795904 804150 812672 822374 833663
50979 833663 846542 860978 876862 893742 910994 928561 947427 969202 995266 1026409 1063102
50968 1063102 1105735 1154453 1208919 1268472 1332497 1400507 1471931 1546050 1622211 1699900 1778366
50957 1778366 1856269 1931917 2003802 2070620 2130799 2182530 2224630 2257034 2279985 2292957 2295078
50946 2295078 2286588 2269217 2244816 2214298 2178381 2138775 2097689 2056232 2014004 1970351 1925399
50935 1925399 1879777 1833966 1788402 1743812 1700973 1660236 1621530 1584649 1549231 1514601 1479884
50924A479884l5580l6926l8334l9316l9659l9664l9604l9108l7516l4814l1731
50913A067632k8908k6526k4616k3086k1379j8935j6115j3967j2779j1708j0163
50902H59450q706p978p520o524n231m609m960n538n507m549k764n98J197K073
50888G98236K161J922J613J515K120L460M681N080N128N635O348O524O627Q045
50874H59095J0944J3722J5053J5343J5722J6571J7804J9637K2176K4845K7035
50863A057947K9101L1936L5913M0738M6091N1778N7509O3232O9576P7380Q6720
50852A647921R6717J06454J15762J25115J34841J44507J53155J60247J66200J71653
50842C022572J76261J78743J78049J73908J66127J54141J37627J16955R2689O5296
$$ plain form
50924 1479884 1444304 1407378 1369044 1329728 1290069 1250405 1210801 1171693 1134177 1099363 1067632
50913 1067632 1038724 1012198 987582 964496 943117 924182 908067 894100 881321 869613 859450
50902 859450 850744 842766 835246 828722 823491 818882 813922 808384 802877 798328 795564 794966 796163 798236
50888 798236 800397 802319 803932 805447 807567 811027 815708 820788 825916 831551 837899 844423 851050 859095
50874 859095 870039 883761 898814 914157 929879 946450 964254 983891 1006067 1030912 1057947
50863 1057947 1087048 1118984 1154897 1195635 1241726 1293504 1351013 1414245 1483821 1561201 1647921
50852 1647921 1744638 1851092 1966854 2091969 2226810 2371317 2524472 2684719 2850919 3022572
50842 3022572 3198833 3377576 3555625 3729533 3895660 4049801 4187428 4304383 4397072 4462368
50832D462368L5824O180k1965m8145p2273r3318j09678j20716j27068j29460j27902
50821C653847j22291j13237j02013r0061p8712o9167o2430n9107n9077o1421o4959
50810B771372o9075p3755p8805q3569q7556r0873r3530r4918r4448r2250q8619
50799A823974q3319p6244o8388o1174n4898m8717m2132l5547k9327k3274j7318
50788A283636j1955p610m230j769l63K93R89J883K123J121m16j481k162l172m467
50773A252420n415o139p467r453j1081j1817j2482j3909j5598j6496j6593j6752
50761A109218j7230j7341j6582j5182j3387j0995q006n068k760q67J254L952P211
50748A014217J0844J4345J7102J9293K2085K6349L1514L6409M0813M5341N0186
$$ plain form
50832 4462368 4498192 4504372 4482407 4434262 4361989 4268671 4158993 4038277 3911209 3781749 3653847
50821 3653847 3531556 3418319 3316306 3226245 3147533 3078366 3015936 2956829 2897752 2836331 2771372
50810 2771372 2702297 2628542 2549737 2466168 2378612 2287739 2194209 2099291 2004843 1912593 1823974
50799 1823974 1740655 1664411 1596023 1534849 1479951 1431234 1389102 1353555 1324228 1300954 1283636
50788 1283636 1271681 1264071 1259841 1258072 1257709 1258002 1258991 1260874 1262997 1264118 1263702 1262221 1260059 1256887 1252420
50773 1252420 1247005 1240866 1233399 1223946 1212865 1201048 1188566 1174657 1159059 1142563 1125970 1109218
50761 1109218 1091988 1074647 1058065 1042883 1029496 1018501 1010495 1005427 1002667 1001800 1003054 1007006 1014217
50748 1014217 1025061 1039406 1056508 1075801 1097886 1124235 1155749 1192158 1232971 1278312 1328498
50737A328498N5003N9958O5684P2053P8027Q3036Q7458R1363R3903R4565R4076
50726B203624R3238R1680Q8664Q4476P9897P4742O7984N9102M8290L5378J9666
50715B946741J102j9059l9001n7129p2068q2727q8917r1470r1233q8159q1741
50704B236339p2295o1532n1667m3951l8096l3190k9093k6613k6347k7845l0224
50693A795486l3230l7174m1984m6771n0293n1712n1007m8919m6295m3268l9303
50682A305530l4150k8390k2703j7072j1236n508m92L828Q063J2548J6994K1027
50670A248439K4531K7445K9635L0944L1169L0037K7563K4305K0999J8066J5721
50659A528854J4223J3534J3096J2445J1881J1940J2487J2895J2981J3164J3742
$$ plain form
50737 1328498 1383501 1443459 1509143 1581196 1659223 1742259 1829717 1921080 2014983 2109548 2203624
50726 2203624 2296862 2388542 2477206 2561682 2641579 2716321 2784305 2843407 2891697 2927075 2946741
50715 2946741 2947843 2928784 2889783 2832654 2760586 2677859 2588942 2497472 2406239 2318080 2236339
50704 2236339 2164044 2102512 2050845 2006894 1968798 1935608 1906515 1879902 1853555 1825710 1795486
50693 1795486 1762256 1725082 1683098 1636327 1586034 1534322 1483315 1434396 1388101 1344833 1305530
50682 1305530 1271380 1242990 1220287 1203215 1191979 1186471 1185979 1189807 1197870 1210418 1227412 1248439
50670 1248439 1272970 1300415 1330050 1360994 1392163 1422200 1449763 1474068 1495067 1513133 1528854
50659 1528854 1543077 1556611 1569707 1582152 1594033 1605973 1618460 1631355 1644336 1657500 1671242
50648A671242J4726J6228J8448K1227K4206K7421L1129L5060L8550M1419M4131
50637A983787M6897M9234N0505N0429M9022M6525M3539M0665L7897L4746L0939
50626B464185K6467K0920J3407L415q537k0970l1857l9198m2055m1121l7837l3007
50614B273812k6844k0158j4390j0281p274m572k180p66j141l997r341j5969k2403
50601B134496k8571l5733m4337n2889n9561o4028o6969o8487o8093o5838o2460
50590A517530n8452n3756m8454m3114l8252l3824k9449k5039k1109j8366j6911
50579A130804j6003j4794j3174j1511r847p948n999m457l063q65K436N855Q207
50566A059641R373J0140J1311J3242J5769J8218K0009K1391K3164K5470K7567
$$ plain form
50648 1671242 1685968 1702196 1720644 1741871 1766077 1793498 1824627 1859687 1898237 1939656 1983787
50637 1983787 2030684 2079918 2130423 2180852 2229874 2276399 2319938 2360603 2398500 2433246 2464185
50626 2464185 2490652 2511572 2524979 2528394 2519857 2498887 2467030 2427832 2385777 2344656 2306819 2273812
50614 2273812 2246968 2226810 2212420 2202139 2194865 2190293 2188113 2187347 2186206 2182209 2172868 2156899 2134496
50601 2134496 2105925 2070192 2025855 1972966 1913405 1849377 1782408 1713921 1645828 1579990 1517530
50590 1517530 1459078 1405322 1356868 1313754 1275502 1241678 1212229 1187190 1166081 1147715 1130804
50579 1130804 1114801 1100007 1086833 1075322 1065475 1057527 1051528 1047071 1044008 1043143 1045579 1051434 1059641
50566 1059641 1069014 1079154 1090465 1103707 1119476 1137694 1157703 1179094 1202258 1227728 1255295
50555A255295K8915K9769L0359L0416K9931K9535K9461K8872K7000K4399K2322
50544A566274K1338K1190K1642K2801K4924K8321L3066L8484M3597M8418N4008
50533A924063O0650O7005P1904P6082Q0998Q6695R2084R6749J01084J04950J07649
50522B869913J09108J09737J09052J05653R8934Q9735P9047O6883N2755L6479
50512C727296J8321r33j9911l7398n3223o7711q0370q9980r6045r8987r8732r4291
50500C008036q5346p3327o0124m6454l2192j7680l844Q669J9619K8528L4448L6484
50488B816817L4252K7763J7065K120j6799l8336n9922p8883r3823j04646j11497
50477B394111j14420j14039j11631j08064j03212r6815q9357q1630p3887o6032
$$ plain form
50555 1255295 1284210 1313979 1344338 1374754 1404685 1434220 1463681 1492553 1519553 1543952 1566274
50544 1566274 1587612 1608802 1630444 1653245 1678169 1706490 1739556 1778040 1821637 1870055 1924063
50533 1924063 1984713 2051718 2123622 2199704 2280702 2367397 2459481 2556230 2657314 2762264 2869913
50522 2869913 2979021 3088758 3197810 3303463 3402397 3492132 3571179 3638062 3690817 3727296
50512 3727296 3745617 3744684 3724773 3687375 3634152 3566441 3486071 3396091 3300046 3201059 3102327 3008036
50500 3008036 2922690 2849363 2789239 2742785 2710593 2692913 2689069 2697738 2717357 2745885 2780333 2816817
50488 2816817 2851069 2878832 2895897 2898017 2881218 2842882 2782960 2704077 2610254 2505608 2394111
50477 2394111 2279691 2165652 2054021 1945957 1842745 1745930 1656573 1574943 1501056 1435024
50467A435024n8338n1391m5390l9959l4585k9053k3527j8445j4230j0872p917
50456A101317m950j910J131M198P183R707J1435J2372J2736J2730J2609J2607
50444A191165J2620J2236J1366J0469R860R146P871O412N643N723N794N046L642
50431A296993K337J645J670K476M088O125P952R389J1006J3388J6269J8835K0803
50418A412976K2838K5667K9212L2840L6218L9501M2816M5951M8610N0669N2139
50407A839437N3032N3254N2544N0562M7307M3276L8952L4206K8536K1803J4394
50396B277303O541k119j2107k3364l5026m5833n4717o1292o5771o8352o8694o6293
50384A780276o1340n4839m7704m0016l1386k1959j2649m434K468Q469J3783J7808
$$ plain form
50467 1435024 1376686 1325295 1279905 1239946 1205361 1176308 1152781 1134336 1120106 1109234 1101317
50456 1101317 1096367 1094457 1095588 1099786 1106969 1116676 1128111 1140483 1153219 1165949 1178558 1191165
50444 1191165 1203785 1216021 1227387 1237856 1247716 1256862 1264733 1271145 1276788 1282511 1288305 1293351 1296993
50431 1296993 1299330 1300975 1302645 1305121 1309209 1315334 1323286 1332675 1343681 1357069 1373338 1392173 1412976
50418 1412976 1435814 1461481 1490693 1523533 1559751 1599252 1642068 1688019 1736629 1787298 1839437
50407 1839437 1892469 1945723 1998267 2048829 2096136 2139412 2178364 2212570 2241106 2262909 2277303
50396 2277303 2283844 2281725 2269618 2246254 2211228 2165395 2110678 2049386 1983615 1915263 1846569 1780276
50384 1780276 1718936 1664097 1616393 1576377 1544991 1523032 1510383 1505949 1508417 1516886 1530669 1548477
50372A548477J9532J8414J4661Q780J214p456j6373k4753l2251l8813m4306m8487
50360A398639n1086n1789n0468m7674m4582m2083m0083l7984l5530l2868l0116
50349I34376k7336k4700k2166j9280j5769j2165r217o901m565j954N60K809N140
50336G98832P820J0547J2809J4260J4830J4832J4958J5562J5884J4513J0929O170
50324I51946J859j132k974m233n176n566n102m075l254k986k832k488k489l322
50310I08176m400m811m604m316l621j832M43J681J691J897L033M064M148M133
50296I05682N083O556P629Q561J0007J1395J1624J0923J0622J1274J2281J3211
50284A024848J4093J4388J2843Q750K522n089j3363k1008k6165k7689k6049k2708
$$ plain form
50372 1548477 1568009 1586423 1601084 1609864 1611078 1603622 1587249 1562496 1530245 1491432 1447126 1398639
50360 1398639 1347553 1295764 1245296 1197622 1153040 1110957 1070874 1032890 997360 964492 934376
50349 934376 907040 882340 860174 840894 825125 812960 803743 796842 792277 790323 790883 793692 798832
50336 798832 806652 817199 830008 844268 859098 873930 888888 904450 920334 934847 945776 951946
50324 951946 953805 952673 949699 945466 940290 934724 929622 925547 922293 919307 916475 913987 911498 908176
50310 908176 903776 898965 894361 890045 886424 884592 885035 886716 888407 890304 893337 897401 901549 905682
50296 905682 910765 917321 924950 933511 943518 954913 966537 977460 988082 999356 1011637 1024848
50284 1024848 1038941 1053329 1066172 1074922 1077444 1072355 1058992 1037984 1011819 984130 958081 935373
50272I35373j9039j5864j3331j0924q085n129l100k492k560k257j438p92q49j366
50258H48147j633j179j79P95J406J866K520L425M518N877P442Q823R878J1226
50244I02932J3458J6034J7736J8323J8844K0035K1144K1004J9708J8508J8195
50233A105921J8087J6815J3853J0185P424O215N581M036J157k276n566q930j2897
50220A159605j7397k1813k5541k8119k9133k8402k6261k3335k0162j7083j4322
50209I08037j1913r806q242p844r000j1340j4057j6577j8620j9818j9824j8775
50197G42221j7246j5580j3662j1470r523q463q310q417q107p251o238n595n628
50184F16731o259o996p176o421n001l682l102l208l359k933j840n18M41O54K01
$$ plain form
50272 935373 916334 900470 887139 876215 868130 863001 859901 857409 854849 852592 851154 850362 849513 848147
50258 848147 846514 845335 845156 845951 847357 849223 851743 855168 859686 865563 873005 881828 891706 902932
50244 902932 916390 932424 950160 968483 987327 1007362 1028506 1049510 1069218 1087726 1105921
50233 1105921 1124008 1140823 1154676 1164861 1172285 1178500 1184081 1188117 1189274 1186998 1181432 1172502 1159605
50220 1159605 1142208 1120395 1094854 1066735 1037602 1009200 982939 959604 939442 922359 908037
50209 908037 896124 886318 878076 870232 861232 849892 835835 819258 800638 780820 760996 742221
50197 742221 724975 709395 695733 684263 674740 666277 657967 649550 641443 634192 627954 622359 616731
50184 616731 610472 603476 596300 589879 584878 581196 578094 574886 571527 568594 566754 566236 566677 567331 567532
50169E67532l50l83J59P16Q37Q56J502K918M371N063M886M274L692L545M228N770
50153F09616P509Q567Q774Q669Q635Q438P751O675N465M084K497J102M24M52P35
50138F89393J089J867L386N436P563R673J2147J5345J9030K2391K4828K6707K8983
50125H67838L1952L4836L6913L8591M0736M3181M4671M4366M2715M0659L8647
50114A305105L6690L4763L2713L0171K7046K3671K0063J5433R027J213o926j4880
50102A514089k2893l0818l7583m2214m4882m6464m7290m6929m5094m2180l8739
50091A069003l4874l0566k6319k2895k0388j8055j5313j2525j0493r431q873q398
50079H50873q043q032q324q617q555p981p134o421n901n277m623m669n811p145
$$ plain form
50169 567532 567182 566799 566958 567674 568511 569367 570869 573787 578158 583221 588107 592381 596073 599618 603846 609616
50153 609616 617125 625692 634466 643135 651770 660208 667959 674634 680099 684183 686680 687782 688206 688658 689393
50138 689393 690482 692349 695735 701171 708734 718407 730554 745899 764929 787320 812148 838855 867838
50125 867838 899790 934626 971539 1010130 1050866 1094047 1138718 1183084 1225799 1266458 1305105
50114 1305105 1341795 1376558 1409271 1439442 1466488 1490159 1510222 1525655 1534682 1535895 1528969 1514089
50102 1514089 1491196 1460378 1422795 1380581 1335699 1289235 1241945 1195016 1149922 1107742 1069003
50091 1069003 1034129 1003563 977244 954349 933961 915906 900593 888068 877575 868144 859271 850873
50079 850873 842830 834798 826474 817857 809302 801321 794187 787766 781865 776588 771965 767296 761485 754340
50065G54340p274o007m617m334n167o336p121p153o477n551m811m024k661r18
50051F81889L73R68J521K344K827K665K676L648N083O021O543P334Q250Q404P667
50036G48213O908O689O608O173N575N242N221N284N294N188M934M604M207L450
50022H23590K050K91j085j596j371q15k96n0kL37J366K838M149N179O370Q020
50006H48975R944J1943J4160J6860K0038K3353K6213K8060K8879K9324K9890L0119
49994A117758K9038K6366K2811J9206J5860J2651R204M896p10p312j4243k1327
49982A214198k8760l6061m1932m5462m6862m6670m4956m1756l7705l3575k9558
49971G80901k5500k1563j8133j5324j3034j1290j0080r043p767o275m865l608
$$ plain form
50065 754340 747066 741059 736442 732108 726941 720605 713484 706331 699854 694303 689492 685468 682807 681889
50051 681889 682262 683230 684751 687095 689922 692587 695263 698911 703994 710015 716558 723892 732142 740546 748213
50036 748213 755121 761810 768418 774591 780166 785408 790629 795913 801207 806395 811329 815933 820140 823590
50022 823590 825640 825931 824846 823250 821879 821064 820768 820718 820716 821053 822419 825257 829406 834585 840955 848975
50006 848975 858919 870862 885022 901882 921920 945273 971486 999546 1028425 1057749 1087639 1117758
49994 1117758 1146796 1173162 1195973 1215179 1231039 1243690 1252894 1257790 1257080 1249768 1235525 1214198
49982 1214198 1185438 1149377 1107445 1061983 1015121 968451 923495 881739 844034 810459 780901
49971 780901 755401 733838 715705 700381 687347 676057 665977 656934 649167 642892 638027 634419
49959F34419k404j336m73M96J958L710N109O018P068Q810J0908J2395J2511J1155
49945G10344Q819O339M535L750L564L111J748m38k703m271n073n939p814j0734
49931G05238j3701j5666j6469j6608j6310j5284j3367j0973q665o614m706l028
49919E63847j811j018l36L59Q95J184J493K161L219M342N063N128M843N040O248
49904F00657P985R244R775J0325J1472J2772J3454J3433J3089J2374J0735P934
49892G33249M502J345r13k370l782n860q393j0371j1239j1606j2364j3554j4533
49879F44111j4887j4570j3491j1690r775q424p518o345m677l079k076j613j336
49866E44630q95J06J871L935N426N965O014O300P215Q668J0156J1094J1418J1728
$$ plain form
49959 634419 632015 630679 630206 630702 632660 636370 641479 647497 654565 663375 674283 686678 699189 710344
49945 710344 719163 725502 730037 733787 737351 740462 742210 741772 739069 734798 729725 723786 715972 705238
49931 705238 691537 675871 659402 642794 626484 611200 597833 586860 578195 571581 566875 563847
49919 563847 562036 561018 560682 561041 561936 563120 564613 566774 569993 574335 579398 584526 589369 594409 600657
49904 600657 608642 617886 627661 637986 649458 662230 675684 689117 702206 714580 725315 733249
49892 733249 737751 739096 738183 735813 732031 726171 717778 707407 696168 684562 672198 658644 644111
49879 644111 629224 614654 601163 589473 579698 571274 563756 557411 552734 549655 547579 545966 544630
49866 544630 543735 543841 545712 549647 555073 561038 567052 573352 580567 589235 599391 610485 621903 633631
$$ [...]
##END NTUPLES=NMR SPECTRUM
##END=
