
##TITLE=AC1352_CHIAH12170_6672572_iBDQRKUdyq
##JCAMPDX= 6.0         $$ Bruker NMR JCAMP-DX V2.0
##DATA TYPE= NMR SPECTRUM
##DATA CLASS= NTUPLES
##ORIGIN= BRUKER
##OWNER= Administrator
$$ 1.72 TOPSPIN		Version 2.1
$$ 2012-12-14 02:48:35.042 -0500  Administrator@X
$$ Compression mode = diff/dup
##.OBSERVE FREQUENCY= 400.02188249412
##.OBSERVE NUCLEUS= ^1H
##.ACQUISITION MODE= SIMULTANEOUS (DQD)
##.ACQUISITION SCHEME= undefined
##.AVERAGES= 64
##.DIGITISER RES= 22
##SPECTROMETER/DATA SYSTEM= spect
##.PULSE SEQUENCE= noesygpps1d.comp
##.SOLVENT NAME= COFFEE_meoh
##.SHIFT REFERENCE= INTERNAL, COFFEE_meoh, 1, 14.96093
##AUDIT TRAIL= $$ (NUMBER, WHEN, WHO, WHERE, PROCESS, VERSION, WHAT)
$$ ##TITLE= Audit trail, TOPSPIN		Version 2.1
$$ ##JCAMPDX= 5.01
$$ ##ORIGIN= Bruker BioSpin GmbH
$$ ##OWNER= Administrator
$$ $$ E:\/data/COFFEE/nmr/AC1352_CHIAH12170_6672572_iBDQRKUdyq/22/pdata/1/auditp.txt
$$ ##AUDIT TRAIL=  $$ (NUMBER, WHEN, WHO, WHERE, PROCESS, VERSION, WHAT)
(   1,<2012-12-14 02:48:29.198 -0500>,<Administrator>,<X>,<go>,<TOPSPIN 2.1>,
      <created by zg
	started at 2012-12-14 02:36:59.495 -0500,
	POWCHK enabled, PULCHK disabled,
       configuration hash MD5:
       86 BA 57 50 F2 9D 5C 9B 26 00 A9 28 5F 66 2E 89
       data hash MD5: 64K
       BB 95 93 E2 C2 5D E6 C5 F9 EC 42 77 50 9A AF FC>)
(   2,<2012-12-14 02:48:32.214 -0500>,<Administrator>,<X>,<proc1d>,<TOPSPIN 2.1>,
      <Start of raw data processing
       efp LB = 0.3 FT_mod = 6 PKNL = 1 PHC0 = 0 PHC1 = 0 SI = 128K 
       data hash MD5: 128K
       82 31 6A 4B F9 22 59 30 D1 23 61 E2 60 80 B1 95>)
(   3,<2012-12-14 02:48:33.261 -0500>,<Administrator>,<X>,<proc1d>,<TOPSPIN 2.1>,
      <pk PHC0 = -76.0144 PHC1 = 0 
       data hash MD5: 128K
       78 C2 1B 34 68 CB 9E AC B4 8B C8 34 28 3D 0E 01>)
(   4,<2012-12-14 02:48:33.948 -0500>,<Administrator>,<X>,<proc1d>,<TOPSPIN 2.1>,
      <abs ABSG = 1 
       data hash MD5: 128K
       4C F6 C8 6D 3E DC 5D 19 15 36 77 13 21 AB B8 5D>)
(   5,<2012-12-14 02:48:34.105 -0500>,<Administrator>,<X>,<proc1d>,<TOPSPIN 2.1>,
      <abs ABSG = 2 
       data hash MD5: 128K
       97 6C 0E 09 39 68 16 CC EE B8 A5 A1 39 A5 41 9D>)
(   6,<2012-12-14 02:48:34.292 -0500>,<Administrator>,<X>,<proc1d>,<TOPSPIN 2.1>,
      <abs ABSG = 3 
       data hash MD5: 128K
       6C 5D 5B 8B 9E 75 59 8E C0 1D DE 76 0F 05 B3 A7>)
(   7,<2012-12-14 02:48:34.480 -0500>,<Administrator>,<X>,<proc1d>,<TOPSPIN 2.1>,
      <abs ABSG = 4 
       data hash MD5: 128K
       7C 08 15 BF 44 E0 5F 41 C3 36 BA 9C 76 43 07 A0>)
(   8,<2012-12-14 02:48:34.683 -0500>,<Administrator>,<X>,<proc1d>,<TOPSPIN 2.1>,
      <abs ABSG = 5 
       data hash MD5: 128K
       69 9D 39 71 45 1C EC 4D 4D E6 6B ED 56 3F F5 00>)
$$ ##END=
$$ 
$$ $$ hash MD5
$$ $$ 6C 50 2A 4D EB FB BA B7 41 30 07 46 A2 80 D5 02
##$RELAX= 
##$RELAX= 
##$RELAX= 
##$RELAX= 
##$RELAX= 
##$RELAX= 
##$RELAX= 
##$RELAX= 
$$ Bruker specific parameters
$$ --------------------------
##$DU= <E:\>
##$EXPNO= 22
$$ [...]
150 150 150 150 150 150 150 150
##$TP07= 0
##$TPNAME0= <>
##$TPNAME1= <>
##$TPNAME2= <>
##$TPNAME3= <>
##$TPNAME4= <>
##$TPNAME5= <>
##$TPNAME6= <>
##$TPNAME7= <>
##$TPOAL= (0..7)
0.5 0.5 0.5 0.5 0.5 0.5 0.5 0.5
##$TPOFFS= (0..7)
0 0 0 0 0 0 0 0
##$TUNHIN= 0
##$TUNHOUT= 0
##$TUNXOUT= 0
##$USERA1= <user>
##$USERA2= <user>
##$USERA3= <user>
##$USERA4= <user>
##$USERA5= <user>
##$V9= 5
##$VALIST= <valist>
##$VCLIST= <CCCCCCCCCCCCCCC>
##$VD= 0
##$VDLIST= <DDDDDDDDDDDDDDD>
##$VPLIST= <PPPPPPPPPPPPPPP>
##$VTLIST= <TTTTTTTTTTTTTTT>
##$WBST= 1024
##$WBSW= 4
##$XGAIN= (0..3)
0 0 0 0
##$XL= 0
##$YL= 0
##$YMAX_a= 5914577
##$YMIN_a= -13016574
##$ZGOPTNS= <>
##$ZL1= 120
##$ZL2= 120
##$ZL3= 120
##$ZL4= 120
##$ABSF1= 14.96093
##$ABSF2= -5.597252
##$ABSG= 5
##$ABSL= 3
##$ALPHA= 0
##$AQORDER= 0
##$ASSFAC= 0
##$ASSFACI= 0
##$ASSFACX= 0
##$ASSWID= 0
##$AUNMP= <proc_prof1d_extract.lims>
##$AXLEFT= 0
##$AXNAME= <>
##$AXNUC= <1H>
##$AXRIGHT= 0
##$AXTYPE= 0
##$AXUNIT= <>
##$AZFE= 0.1
##$AZFW= 0.1
##$BCFW= 0
##$BC_mod= 0
##$BYTORDP= 0
##$COROFFS= 0
##$CY= 15
##$DATMOD= 1
##$DC= 0
##$DFILT= <>
##$DTYPP= 0
##$F1P= 0
##$F2P= 0
##$FCOR= 0.5
##$FTSIZE= 131072
##$FT_mod= 6
##$GAMMA= 0
##$GB= 0
##$INTBC= 1
##$INTSCL= 1
##$ISEN= 128
##$LB= 0.3
##$LEV0= 0
##$LPBIN= 0
##$MAXI= 10000
##$MC2= 0
##$MEAN= 0
##$ME_mod= 0
##$MI= 0
##$NCOEF= 0
##$NC_proc= -2
##$NLEV= 6
##$NOISF1= 0
##$NOISF2= 0
##$NSP= 0
##$NTH_PI= 0
##$NZP= 0
##$OFFSET= 14.96093
##$PC= 1
##$PHC0= -76.0144
##$PHC1= 0
##$PH_mod= 1
##$PKNL= yes
##$PPARMOD= 0
##$PPDIAG= 0
##$PPIPTYP= 0
##$PPMPNUM= 2147483647
##$PPRESOL= 1
##$PSCAL= 4
##$PSIGN= 0
##$PYNMP= <proc.py>
##$REVERSE= no
##$SF= 400.020009664183
##$SI= 131072
##$SIGF1= 0
##$SIGF2= 0
##$SINO= 400
##$SIOLD= 131072
##$SPECTYP= <>
##$SREGLST= <1H.CDCl3>
##$SSB= 0
##$STSI= 131072
##$STSR= 0
##$SW_p= 8223.68421052631
##$SYMM= 0
##$S_DEV= 0
##$TDeff= 65536
##$TDoff= 0
##$TI= <>
##$TILT= no
##$TM1= 0
##$TM2= 0
##$TOPLEV= 0
##$USERP1= <user>
##$USERP2= <user>
##$USERP3= <user>
##$USERP4= <user>
##$USERP5= <user>
##$WDW= 1
##$XDIM= 131072
##$YMAX_p= 441095107
##$YMIN_p= -13347
##$CURPLOT= <Network HP LaserJet P1505>
##$CURPRIN= <$Network HP LaserJet P1505>
##$DFORMAT= <normdp>
##$LAYOUT= <+/1D_H.xwp>
##$LFORMAT= <normlp>
##$PFORMAT= <normpl>
##$SURQMSG= 1
$$ End of Bruker specific parameters
$$ ---------------------------------
##NTUPLES= NMR SPECTRUM
##VAR_NAME=  FREQUENCY,     SPECTRUM/REAL,   SPECTRUM/IMAG
##SYMBOL=    X,             R,               I
##VAR_TYPE=  INDEPENDENT,   DEPENDENT,       DEPENDENT
##VAR_FORM=  AFFN,          ASDF,            ASDF
##VAR_DIM=   131072,        131072,          131072
##UNITS=     HZ,            ARBITRARY UNITS, ARBITRARY UNITS
##FACTOR=    0.0627417313425164, 1,          1
##FIRST=     8223.62146879497, 64,           -56299
##LAST=      0,             1516,            -56598
##MIN=       0,             -13347,          0
##MAX=       8223.62146879497, 441095107,    0
$$ Real data points
##PAGE= N=1
##DATA TABLE= (X++(R..R)), XYDATA
$$ [...]
$$ plain form
63927 5429292 5337601 5207932 5043626 4849249 4629899 4390908 4138416 3879468 3620576 3366182
63917 3366182 3119021 2881718 2657258 2447965 2254848 2078100 1917576 1772722 1642813
63908 1642813 1527506 1426523 1338588 1261493 1193590 1134562 1084233 1041329 1004039 971282 942698
63897 942698 917724 895398 874874 855548 836855 818571 801199 785440 771277 758136 745950
63886 745950 735511 727623 722371 719445 718835 720903 725916 733721 743927 756420 771709 790570 813214
63873 813214 838946 866809 896418 927871 961019 995154 1029416 1063225 1096308 1128486 1159454
63862 1159454 1188606 1215115 1238279 1257672 1272911 1283537 1289403 1290930 1288621 1282402 1271716 1256165
63850 1256165 1235841 1211262 1183283 1152836 1120370 1085712 1048830 1010468 971521 932029 891499
$$ packed form
63927E429292r1691j29669j64306j94377k19350k38991k52492k58948k58892k54394
63917C366182k47161k37303k24460k09293j93117j76748j60524j44854j29909
63908A642813j15307j00983q7935p7095o7903n9028n0329m2904l7290l2757k8584
63897I42698k4974k2326k0524j9326j8693j8284j7372j5759j4163j3141j2186
63886G45950j0439p888n252k926o10K068N013P805J0206J2493J5289J8861K2644
63873H13214K5732K7863K9609L1453L3148L4135L4262L3809L3083L2178L0968
63862A159454K9152K6509K3164J9393J5239J0626N866J527k309o219j0686j5551
63850A256165k0324k4579k7979l0447l2466l4658l6882l8362l8947l9492m0530
$$ plain form
63839 891499 850136 809059 769213 730804 693940 659115 626693 596530 568514 543027 520419
63828 520419 500382 482204 465277 449049 432989 417171 402589 390270 380145 371219 362706 354629
63816 354629 347423 341373 336375 331870 327116 321880 316832 312888 310189 307979 305343 301775 297279 292406
63802 292406 288055 284668 281626 277970 273747 270035 267542 265814 264106 262369 260901 259564 257992 256306
63788 256306 254952 253926 252708 251003 249090 247424 246280 245809 245989 246342 246172 245354 244565 244445 244798 244923
63772 244923 244518 243843 243140 242373 241564 240968 240697 240520 240239 240035 240134 240317 240105 239331 238240 237057 235844 234829
63754 234829 234500 235123 236446 238083 239909 241759 243027 243149 242522 242420 243762 246265 249022 251595 254191
63739 254191 257003 259813 262261 264145 265406 266145 266753 267783 269545 271963 274878 278274 282069 285932 289536
$$ packed form
63839H91499m1363m1077l9846l8409l6864l4825l2422l0163k8016k5487k2608
63828E20419k0037j8178j6927j6228j6060j5818j4582j2319j0125q926q513q077
63816C54629p206o050m998m505m754n236n048l944k699k210k636l568m496m873
63802B92406m351l387l042l656m223l712k493j728j708j737j468j337j572j686
63788B56306j354j026j218j705j913j666j144m71J80L53j70q18p89j20L53J25
63772B44923m05o75p03p67q09n96k71j77k81k04R9J83k12p74j091j183j213j015
63754B34829l29O23J323J637J826J850J268J22o27j02J342K503K757K573K596
63739B54191K812K810K448J884J261P39O08J030J762K418K915L396L795L863L604
$$ plain form
63724 289536 292874 296137 299443 302864 306548 310479 314073 316328 316516 314743 311863 308992 306921 305671
63710 305671 304536 302824 300629 298695 297483 296692 295838 295053 295000 296066 297889 299708 301093 302344 304244
63695 304244 307355 311491 315892 319883 323213 325840 327704 328846 329493 329808 329757 329383 328977 328741 328505 328076
63679 328076 327635 327413 327135 326254 324768 323411 322963 323645 325200 327195 329136 330672 331805 332657 332954 332130
63663 332130 330095 327499 324941 322242 318870 314856 310822 307205 303892 300707 297923 295975 294778 293584
63649 293584 291663 289112 286881 285930 286481 288143 290510 293327 296248 298944 301537 304494 307887 311252 314503
63634 314503 318534 324402 332098 340608 349045 357209 365183 373093 381513 391540 404009 418730 434712
63621 434712 450989 467175 483522 500816 520072 541964 566344 592348 618990 645698 672427
$$ packed form
63724B89536L338L263L306L421L684L931L594K255J88j773k880k871k071j250
63710C05671j135j712k195j934j212p91q54p85n3J066J823J819J385J251J900
63695C04244L111M136M401L991L330K627J864J142O47L15n1l74m06k36k36m29
63679C28076m41k22k78q81j486j357m48O82J555J995J941J536J133Q52K97q24
63663C32130k035k596k558k699l372m014m034l617l313l185k784j948j197j194
63649B93584j921k551k231r51N51J662K367K817K921K696K593K957L393L365L251
63634C14503M031N868P696Q510Q437Q164P974P910Q420J0027J2469J4721J5982
63621D34712J6277J6186J6347J7294J9256K1892K4380K6004K6642K6708K6729
$$ plain form
63610 672427 699323 726204 752191 775796 795325 809268 816612 817286 812502 804347 794678 784347 773580
63597 773580 762810 752666 743135 733209 721732 708435 693800 678040 660622 640940 619234 596637
63585 596637 574458 553589 534453 517204 501872 488434 476846 467068 459165 453461 450454 450352 452711
63572 452711 456694 461680 467464 473971 481077 488710 496848 505363 514152 523534 534188 546510 560301
63559 560301 575212 591234 608514 627118 647366 670136 696315 725991 758524 793191 829186
63548 829186 864956 898065 925925 946426 958018 959942 952896 939156 921609 902606 883741 866208
63536 866208 850830 837747 826427 816061 805795 794658 781572 765602 746253 723580 698178
63525 698178 671026 643212 615622 588793 562977 538366 515245 493901 474368 456471 440288
$$ packed form
63610F72427K6896K6881K5987K3605J9529J3943P344O74m784q155r669j0331j0767
63597G73580j0770j0144r531r926j1477j3297j4635j5760j7418j9682k1706k2597
63585E96637k2179k0869j9136j7249j5332j3438j1588r778p903n704l007j02K359
63572D52711L983M986N784O507P106P633Q138Q515Q789R382J0654J2322J3791
63559E60301J4911J6022J7280J8604K0248K2770K6179K9676L2533L4667L5995
63548H29186L5770L3109K7860K0501J1592J924p046j3740j7547j9003j8865j7533
63536H66208j5378j3083j1320j0366j0266j1137j3086j5970j9349k2673k5402
63525F98178k7152k7814k7590k6829k5816k4611k3121k1344j9533j7897j6183
$$ plain form
63514 440288 426351 415032 405693 396860 387395 377397 367879 359812 353543 348770 344793 340973 337197 333863
63500 333863 331308 329426 327976 327044 326904 327476 328163 328275 327619 326748 326610 327736 329702 331666 333445 335707
63484 335707 338900 342438 345345 347400 349169 351132 353303 355626 358166 360769 362939 364244 364621 364194 362971
63469 362971 360816 357611 353522 349194 345523 342935 341029 339159 337131 335013 332674 330200 328538 328861
63455 328861 331214 334587 338525 343752 350743 358621 366284 374058 383250 394337 406542 419271 433163
63442 433163 449495 469096 492042 517946 546191 576026 606568 636544 664142 687452 705272
63431 705272 717516 725126 729887 734041 739359 746436 755333 766925 782993 804660 831236 860931 892221
63418 892221 923969 954599 981953 1004109 1019961 1029069 1031499 1028018 1020026 1008944 995750 981185
$$ packed form
63514D40288j3937j1319r339q833r465r998r518q067o269m773l977l820l776l334
63500C33863k555j882j450r32j40N72O87J12o56q71j38J126J966J964J779K262
63484C35707L193L538K907K055J769J963K171K323K540K603K170J305L77m27j223
63469C62971k155l205m089m328l671k588j906j870k028k118k339k474j662L23
63455C28861K353L373L938N227O991P878P663P774R192J1087J2205J2729J3892
63442D33163J6332J9601K2946K5904K8245K9835L0542K9976K7598K3310J7820
63431G05272J2244P610M761M154N318P077Q897J1592J6068K1667K6576K9695L1290
63418H92221L1748L0630K7354K2156J5852R108K430l481p992j1082j3194j4565
$$ plain form
63406 981185 966085 951106 936230 920867 904463 886702 867133 844993 819760 791803 762241
63395 762241 732269 702779 674391 647465 622055 598212 576329 556839 539627 524260 510945
63384 510945 500619 493657 489067 485611 483299 483066 485225 489146 494380 501170 509602 519124 529405 541005
63370 541005 554634 570212 587245 605778 626388 649437 674877 702631 732558 764063 796289
63359 796289 828751 861270 893137 922781 948561 969606 985600 995995 999956 997277 989102 977459
63347 977459 964038 949623 934658 919845 905660 891474 875847 857819 837469 815102 790635
63336 790635 764181 736662 709177 682146 655783 631114 609660 592046 577615 565640 556326 550346
63324 550346 547736 547508 547989 547272 543662 536121 524480 509313 491712 473050 454551 436953 420685
$$ packed form
63406I81185j5100j4979j4876j5363j6404j7761j9569k2140k5233k7957k9562
63395G62241k9972k9490k8388k6926k5410k3843k1883j9490j7212j5367j3315
63384E10945j0326o962m590l456k312k33K159L921N234O790Q432R522J0281J1600
63370E41005J3629J5578J7033J8533K0610K3049K5440K7754K9927L1505L2226
63359G96289L2462L2519L1867K9644K5780K1045J5994J0395L961k679q175j1643
63347I77459j3421j4415j4965j4813j4185j4186j5627j8028k0350k2367k4467
63336G90635k6454k7519k7485k7031k6363k4669k1454j7614j4431j1975r314n980
63324E50346k610k28M81p17l610p541j1641j5167j7601j8662j8499j7598j6268
$$ plain form
63311 420685 406215 393942 383781 375216 367838 361627 356687 352981 350266 348054 345772 343336 341371
63298 341371 340351 339680 338320 336287 334683 333998 333270 331463 328940 326825 325431 324133 322527 320908 319605
63283 319605 318528 317481 316507 315781 315481 315728 316336 316702 316308 315381 314736 314976 316111 317887 320101 322542 324942
63266 324942 327117 329045 330842 332826 335406 338637 341996 344983 347837 351268 355570 360413 365538 371137
63252 371137 377380 383973 390420 396472 402236 408198 415234 424167 435007 446943 459423 472960 488542
63239 488542 506474 526285 547637 570787 596019 623023 651136 679969 709540 739824 770428
63228 770428 800836 830907 860974 891350 921737 951372 979891 1007940 1036666 1066526 1096870
63217 1096870 1126742 1155789 1183999 1210772 1234734 1254447 1268815 1276698 1276835 1268700 1253021 1230861
$$ packed form
63311D20685j4470j2273j0161q565p378o211m940l706k715k212k282k436j965
63298C41371j020o71j360k033j604o85p28j807k523k115j394j298j606j619j303
63283C19605j077j047r74p26l00K47O08L66l94r27o45K40J135J776K214K441K400
63266C24942K175J928J797J984K580L231L359K987K854L431M302M843N125N599
63252C71137O243O593O447O052N764N962P036Q933J0840J1936J2480J3537J5582
63239D88542J7932J9811K1352K3150K5232K7004K8113K8833K9571L0284L0604
63228G70428L0408L0071L0067L0376L0387K9635K8519K8049K8726K9860L0344
63217A096870K9872K9047K8210K6773K3962J9713J4368P883J37q135j5679k2160
$$ plain form
63205 1230861 1202441 1167609 1127333 1083834 1039094 993968 949032 905434 864302 825961 790559
63194 790559 759086 732870 712086 695505 681825 670762 662733 657986 656238 656862 659265 663267 669120
63181 669120 676969 686367 696568 707114 717806 728296 738221 747666 756937 765896 774160 781985 790203
63168 790203 798866 806569 811649 813744 813676 812013 808226 801235 790437 776208 759644 741859 723342
63155 723342 703930 683434 662290 641584 622484 605530 590327 576002 562180 549471 538767
63144 538767 530168 522900 516228 510041 504551 499895 496196 493584 491888 490631 489527 488750 488607 489265 490865
63129 490865 493471 496686 499835 502794 506250 510743 515875 520847 525401 529734 533869 537727 541650 546169
63115 546169 551246 556218 560563 564321 567765 571034 574138 577015 579498 581512 583255 584917 586301 587022
$$ packed form
63205A230861k8420l4832m0276m3499m4740m5126m4936m3598m1132l8341l5402
63194G90559l1473k6216k0784j6581j3680j1063q029m747j748O24K403M002N853
63181F69120P849R398J0201J0546J0692J0490R925R445R271Q959Q264P825Q218
63168G90203Q663P703N080K095o8j663l787o991j0798j4229j6564j7785j8517
63155G23342j9412k0496k1144k0706j9100j6954j5203j4325j3822j2709j0704
63144E38767q599p268o672o187n490m656l699k612j696j257j104p77j43O58J600
63129D90865K606L215L149K959L456M493N132M972M554M333M135L858L923M519
63115E46169N077M972M345L758L444L269L104K877K483K014J743J662J384P21
$$ plain form
63101 587022 587084 586869 586506 585640 583961 581737 579681 578392 577977 578053 578103 578017 578284 579542 581885 584716 587200
63084 587200 588865 590031 591805 595373 600938 607530 614089 620494 627179 634189 641335 649105 658513 669882
63070 669882 682458 695508 709205 724052 740025 756848 774733 794354 816263 840787 868288
63059 868288 899122 933440 971404 1013459 1059994 1110792 1165226 1222986 1284197 1348754 1415949
63048 1415949 1484920 1555213 1626679 1699013 1771612 1843813 1915088 1985071 2053562 2120599 2186519
63037 2186519 2251926 2317442 2383257 2448713 2512348 2572397 2627180 2674972 2713695 2741076 2755231
63026 2755231 2754947 2739336 2707601 2659598 2596657 2521432 2436677 2344330 2245948 2143690 2040505
63015 2040505 1939356 1842585 1751915 1668600 1593336 1526314 1467594 1417398 1375850 1342554 1316562
$$ packed form
63101E87022O2k15l63q66j679k224k056j289m15P6N0q6K67J258K343K831K484
63084E87200J665J166J774L568N565O592O559O405O685P010P146P770R408J1369
63070F69882J2576J3050J3697J4847J5973J6823J7885J9621K1909K4524K7501
63059H68288L0834L4318L7964M2055M6535N0798N4434N7760O1211O4557O7195
63048A415949O8971P0293P1466P2334P2599P2201P1275O9983O8491O7037O5920
63037B186519O5407O5516O5815O5456O3635O0049N4783M7792L8723K7381J4155
63026B755231k84j5611l1735m8003o2941p5225q4755r2347r8382j02258j03185
63015B040505j01149r6771r0670q3315p5264o7022n8720n0196m1548l3296k5992
$$ plain form
63004 1316562 1296790 1282438 1273067 1268342 1267671 1270165 1275113 1282464 1292568 1305260 1319404 1333627 1347397
62991 1347397 1361151 1375352 1389795 1403957 1417763 1431512 1445011 1457029 1465796 1469957 1468897 1462392
62979 1462392 1450345 1432985 1410986 1385104 1355740 1323043 1287408 1249713 1211040 1172253 1133831
62968 1133831 1096060 1059409 1024671 992596 963318 936315 910993 887109 864549 843055 822490
62957 822490 803127 785205 768315 751676 735066 719014 704001 689877 676273 663186 650879
62946 650879 639505 629095 619685 611086 602715 594025 585110 576612 569065 562540 556891 552013 547783 544001
62932 544001 540546 537471 534815 532462 530307 528498 527270 526499 525605 524055 521906 519743 518076 516933 515958
62917 515958 514709 512863 510451 507995 506124 504809 503275 500957 498273 496074 494550 493201 491769 490556
$$ packed form
63004A316562j9772j4352r371m725o71K494M948P351J0104J2692J4144J4223J3770
62991A347397J3754J4201J4443J4162J3806J3749J3499J2018Q767M161j060o505
62979A462392j2047j7360k1999k5882k9364l2697l5635l7695l8673l8787l8422
62968A133831l7771l6651l4738l2075k9278k7003k5322k3884k2560k1494k0565
62957H22490j9363j7922j6890j6639j6610j6052j5013j4124j3604j3087j2307
62946F50879j1374j0410r410q599q371q690q915q498p547o525n649m878m230l782
62932E44001l455l075k656k353k155j809j228p71q94j550k149k163j667j143r75
62917E15958j249j846k412k456j871j315j534k318k684k199j524j349j432j213
$$ plain form
62903 490556 489742 489001 488068 487161 486509 485884 484967 483866 482901 482183 481777 481998 483012 484321 485113 485129 484812 484697
62885 484697 484967 485573 486339 486974 487304 487509 487873 488358 488741 489041 489352 489350 488552 487190 486191 486036 486153 485786 484961
62866 484961 484113 483227 482037 480902 480693 481694 483200 484473 485608 487123 489015 490672 491648 492155 492780 493924
62850 493924 495602 497578 499570 501343 502714 503510 503602 502991 501770 499978 497620 494959 492673 491491 491573 492393
62834 492393 493272 493918 494464 495173 496195 497479 498773 499794 500542 501400 502842 505103 508213 512125 516610 521152
62818 521152 525225 528774 532274 536309 541168 546765 552716 558551 564121 569814 576177 583350 591072 599237
62804 599237 608112 617930 628621 640085 652418 665663 679657 694400 710349 728075 747908 770267
62792 770267 796083 826368 861383 900702 944165 992375 1046152 1105914 1171868 1244516 1324556
$$ packed form
62903D90556q14p41r33r07o52o25r17j101r65p18m06K21J014J309P92J6l17j15
62885D84697K70O06P66O35L30K05L64M85L83L00L11kp98j362r99j55J17l67q25
62866D84961q48q86j190j135k09J001J506J273J135J515J892J657R76N07O25J144
62850D93924J678J976J992J773J371P96R2o11j221j792k358k661k286j182Q2Q20
62834D92393Q79O46N46P09J022J284J294J021P48Q58J442K261L110L912M485M542
62818E21152M073L549L500M035M859N597N951N835N570N693O363P173P722Q165
62804E99237Q875R818J0691J1464J2333J3245J3994J4743J5949J7726J9833K2359
62792G70267K5816L0285L5015L9319M3463M8210N3777N9762O5954P2648Q0040
$$ plain form
62781 1324556 1412238 1506991 1607710 1713340 1823188 1936634 2052510 2168733 2282605 2391302
62771 2391302 2491929 2581222 2655714 2712564 2750228 2768243 2766498 2744924 2703804 2644204 2568089
62760 2568089 2478209 2377875 2270557 2159273 2046163 1932636 1820004 1709940 1604296 1504556
62750 1504556 1411569 1325678 1246787 1174266 1107185 1045042 988114 936798 890733 848954 810905
62739 810905 776857 747201 721707 699702 680590 663867 648934 635396 623432 613396 605053 597655
62727 597655 590861 585104 580808 577658 575025 572844 571511 570998 570652 570165 570307 572274 576444 582179 588823
62712 588823 596515 605851 617075 629990 644582 661298 680566 702246 725868 751273 778765 808621
62700 808621 840803 875285 912372 952343 994906 1039262 1084589 1130080 1174564 1216596 1255088
$$ packed form
62781A324556Q7682R4753J00719J05630J09848J13446J15876J16223J13872J08697
62771B391302J00627Q9293P4492N6850L7664J8015j745k1574m1120n9600p6115
62760B568089q9880j00334j07318j11284j13110j13527j12632j10064j05644r9740
62750A504556r2987q5891p8891p2521o7081o2143n6928n1316m6065m1779l8049
62739H10905l4048k9656k5494k2005j9112j6723j4933j3538j1964j0036q343p398
62727E97655o794n757m296l150k633k181j333n13l46m87J42J967M170N735O644
62712E88823P692R336J1224J2915J4592J6716J9268K1680K3622K5405K7492K9856
62700H08621L2182L4482L7087L9971M2563M4356M5327M5491M4484M2032L8492
$$ plain form
62689 1255088 1289358 1318285 1339950 1352693 1356278 1351463 1338675 1317778 1289123 1254067 1214191 1170608
62677 1170608 1124337 1076706 1028872 981421 934931 890552 849340 811291 775727 742546 712421
62666 712421 685761 662221 641372 623152 607273 592839 579092 566175 554609 544299 534577 525086
62654 525086 515992 507377 499058 491139 484176 478449 473460 468582 463938 460177 457527 455552 453909 452842
62640 452842 452707 453360 454284 455088 455513 455161 453672 451281 448838 447109 446216 445846 445778 446032 446691 447834 449613
62623 449613 452246 455838 460206 464825 469069 472737 476410 481078 487281 494694 502584 510468 518279 526214
62609 526214 534689 544321 555726 569328 585378 603937 624765 647554 672473 700257 731532 766338
62597 766338 804594 846643 892820 942700 995283 1049799 1105771 1162330 1217935 1270739 1318740
$$ packed form
62689A255088L4270K8927K1665J2743L585m815j2788k0897k8655l5056l9876m3583
62677A170608m6271m7631m7834m7451m6490m4379m1212l8049l5564l3181l0125
62666G12421k6660k3540k0849j8220j5879j4434j3747j2917j1566j0310r722r491
62654E25086r094q615q319p919o963n727m989m878m644l761k650j975j643j067
62640D52842j35O53R24Q04M25l52j489k391k443j729q93l70o8K54O59J143J779
62623D49613K633L592M368M619M244L668L673M668O203P413P890P884P811P935
62609E26214Q475R632J1405J3602J6050J8559K0828K2789K4919K7784L1275L4806
62597G66338L8256M2049M6177M9880N2583N4516N5972N6559N5605N2804M8001
$$ plain form
62586 1318740 1359717 1391797 1414306 1427492 1431221 1424619 1407280 1380170 1344926 1302836 1255012 1202995
62574 1202995 1148486 1092825 1037305 983541 932743 884873 839368 796598 757711 723013 691469
62563 691469 662151 635382 611924 591723 574027 558281 544240 531530 519817 509303 500416 493014
62551 493014 486460 480543 475748 472394 469972 467688 465349 463308 461682 460070 458116 456052 454462 453583
62537 453583 453006 452096 450679 449232 448411 448519 449513 451388 454266 458059 462388 467062 472475 479269 487695
62522 487695 497532 508594 521023 535096 551055 569174 589664 612274 636247 660954 686458 713249
62510 713249 741543 770962 800657 829455 856114 879888 900787 918896 933508 943460 948430 949416
62498 949416 947760 944202 939235 933909 929685 927685 928547 932805 940831 952467 967335 985599 1007901
$$ packed form
62586A318740M0977L2080K2509J3186L729o602j7339k7110l5244m2090m7824n2017
62574A202995n4509n5661n5520n3764n0798m7870m5505m2770l8887l4698l1544
62563F91469k9318k6769k3458k0201j7696j5746j4041j2710j1713j0514q887p402
62551D93014o554n917m795l354k422k284k339k041j626j612j954k064j590q79
62537D53583n77r10j417j447q21J08R94J875K878L793M329M674N413O794Q426
62522D87695R837J1062J2429J4073J5959J8119K0490K2610K3973K4707K5504K6791
62510G13249K8294K9419K9695K8798K6659K3774K0899J8109J4612R952M970R86
62498I49416j656l558m967n326m224k000Q62M258Q026J1636J4868J8264K2302
$$ plain form
62485 1007901 1034316 1063907 1095590 1128857 1163084 1196428 1226146 1250070 1267363 1277899 1281469
62474 1281469 1277815 1266942 1248938 1223699 1191228 1152176 1107827 1059569 1008642 956398 904479
62463 904479 854552 807876 765106 726387 691590 660561 633271 609736 589822 573216 559496
62452 559496 548182 538808 531174 525496 522011 520442 520058 520345 521380 523465 526728 531178 536743 542901
62438 542901 548582 552905 555974 558529 560856 562325 561964 559179 554006 547067 539329 531469 523332 514348
62424 514348 504499 494544 485260 476932 469679 463630 458459 453395 448257 444003 441501 440032 437853 434167
62410 434167 429768 425659 421962 418562 415942 414593 414049 413364 412402 411886 412167 412742 413247 414202 416210 418869
62394 418869 421142 422638 423906 425429 427022 428454 430196 433043 437180 442032 447011 452108 457766 464406
$$ packed form
62485A007901K6415K9591L1683L3267L4227L3344K9718K3924J7293J0536L570
62474A281469l654j0873j8004k5239l2471l9052m4349m8258n0927n2244n1919
62463I04479m9927m6676m2770l8719l4797l1029k7290k3535j9914j6606j3720
62452E59496j1314r374p634n678l485j569l84K87J035K085L263M450N565O158
62438E42901N681M323L069K555K327J469l61k785n173o939p738p860q137q984
62424E14348r849r955r284q328p253o049n171n064n138m254k502j469k179l686
62410D34167m399m109l697l400k620j349n44o85r62n16K81N75N05R55K008K659
62394D18869K273J496J268J523J593J432J742K847M137M852M979N097N658O640
$$ plain form
62380 464406 472116 480590 489317 497966 506644 515740 525536 536027 547016 558324 570106 583168 598705
62367 598705 617380 638782 662223 687961 717116 750357 787300 827427 870967 918337 969014
62356 969014 1021426 1073739 1124364 1171842 1214756 1251749 1281472 1302758 1315285 1319909 1317910 1309955
62344 1309955 1296197 1277125 1253646 1226298 1195094 1160499 1124002 1087338 1051463 1016608 982946
62333 982946 950870 920889 893650 869730 848999 830435 813078 796916 782239 768284 753451
62322 753451 737018 719842 702889 685766 667489 648267 629588 612500 596618 581189 566426
62311 566426 553234 541957 532009 522722 514098 506645 500770 496472 493339 490703 487947 484884 481875 479507
62297 479507 478128 477682 477930 478781 480343 482624 485320 488126 491205 495033 499626 504286 508399 512180 516253
$$ packed form
62380D64406P710Q474Q727Q649Q678R096R796J0491J0989J1308J1782J3062J5537
62367E98705J8675K1402K3441K5738K9155L3241L6943M0127M3540M7370N0677
62356I69014N2412N2313N0625M7478M2914L6993K9723K1286J2527M624j999p955
62344A309955j3758j9072k3479k7348l1204l4595l6497l6664l5875l4855l3662
62333I82946l2076k9981k7239k3920k0731j8564j7357j6162j4677j3955j4833
62322G53451j6433j7176j6953j7123j8277j9222j8679j7088j5882j5429j4763
62311E66426j3192j1277r948r287q624p453n875m298l133k636k756l063l009k368
62297D79507j379m46K48Q51J562K281K696K806L079L828M593M660M113L781M073
$$ plain form
62282 516253 520732 525245 529666 534246 539018 543793 548905 555301 563512 573063 583379 594849 608484
62269 608484 624810 643599 664527 687588 713011 741269 773230 809883 851797 898950 950876
62258 950876 1006656 1064924 1124325 1184005 1243328 1301093 1355276 1403520 1443702 1474272 1494524
62247 1494524 1504662 1505300 1496942 1480053 1455381 1423737 1385541 1341083 1291208 1237321 1180798 1122889
62235 1122889 1065112 1009058 955565 904634 856440 811966 772361 738032 708596 683335 661461
62224 661461 642302 625525 610908 597807 585405 573675 563488 555352 548597 542339 536641 531996
62212 531996 528101 524148 520164 517050 515118 513468 511289 509135 508349 509544 512079 514864 517322 519692
62198 519692 522724 527082 532826 539407 546160 552808 559574 567002 575632 585574 596261 606869 617106
$$ packed form
62282E16253M479M513M421M580M772M775N112O396Q211R551J0316J1470J3635
62269F08484J6326J8789K0928K3061K5423K8258L1961L6653M1914M7153N1926
62258I50876N5780N8268N9401N9680N9323N7765N4183M8244M0182L0570K0252
62247A494524J0138O38q358j6889k4672l1644l8196m4458m9875n3887n6523n7909
62235A122889n7777n6054n3493n0931m8194m4474l9605l4329k9436k5261k1874
62224F61461j9159j6777j4617j3101j2402j1730j0187q136o755o258n698m645
62212E31996l895l953l984l114j932j650k179k154p86J195K535K785K458K370
62198E19692L032M358N744O581O753O648O766P428Q630R942J0687J0608J0237
$$ plain form
62185 617106 627387 638110 649005 659494 669425 679062 688419 697079 704892 712523 721046 731188 743270
62172 743270 757739 775333 796649 821816 850686 883008 918190 955189 992955 1030771 1067802
62161 1067802 1102438 1132556 1156494 1173557 1183740 1187490 1185764 1179628 1169420 1154700 1135386 1112557
62149 1112557 1087681 1061333 1033220 1003338 972594 942258 913298 886375 862121 841185 824106
62138 824106 811179 802263 796660 793285 791008 788936 786646 784416 783032 782992 783962 785313 787107 790146 795049
62123 795049 801736 809957 819850 831657 845079 859161 872666 884382 893289 898856 901260 901232 899571
62110 899571 896764 892892 887768 881167 872935 862875 850643 836053 819677 803097 788362 777043
62098 777043 769627 765631 764222 764805 767149 771155 776654 783354 790725 797898 804078 809351 814744 821080
$$ packed form
62185F17106J0281J0723J0895J0489R931R637R357Q660P813P631Q523J0142J2082
62172G43270J4469J7594K1316K5167K8870L2322L5182L6999L7766L7816L7031
62161A067802L4636L0118K3938J7063J0183L750j726o136j0208j4720j9314k2829
62149A112557k4876k6348k8113k9882l0744l0336k8960k6923k4254k0936j7079
62138H24106j2927q916n603l375k277k072k290k230j384m0R70J351J794L039M903
62123G95049O687Q221R893J1807J3422J4082J3505J1716Q907N567K404k8j661
62110H99571k807l872n124o601q232j0060j2232j4590j6376j6580j4735j1319
62098G77043p416l996j409N83K344M006N499O700P371P173O180N273N393O336
$$ plain form
62084 821080 827952 834299 839843 845391 851679 858596 865827 873720 883048 894249 907350 922382 939392
62071 939392 958075 977859 998451 1020054 1042994 1067319 1092823 1119140 1145560 1170783 1193099
62060 1193099 1210975 1223556 1230585 1232020 1227982 1219062 1206286 1190440 1171631 1149866 1125791 1100272
62048 1100272 1073321 1044133 1012425 979185 945805 912986 880907 849934 820544 792830 766694
62037 766694 742374 720191 699811 680365 661439 643560 627596 613991 602598 592836 583906 575211
62025 575211 566742 558781 551162 543237 534704 526070 517994 510514 503325 496519 490518 485318 480373 475483
62011 475483 471409 469203 469040 470069 471398 472911 475022 478056 482161 487432 493541 499382 503762 506612
61997 506612 509024 511822 514622 516647 517907 518975 519903 520051 518874 516292 512295 506807 500041 492557 484846
$$ packed form
62084H21080O872O347N544N548O288O917P231P893R328J1201J3101J5032J7010
62071I39392J8683J9784K0592K1603K2940K4325K5504K6317K6420K5223K2316
62060A193099J7876J2581P029J435m038q920j2776j5846j8809k1765k4075k5519
62048A100272k6951k9188l1708l3240l3380l2819l2079l0973k9390k7714k6136
62037G66694k4320k2183k0380j9446j8926j7879j5964j3605j1393r762q930q695
62025E75211q469p961p619p925q533q634q076p480p189o806o001n200m945m890
62011D75483m074k206j63J029J329J513K111L034M105N271O109N841M380K850
61997E06612K412K798K800K025J260J068R28J48j177k582l997n488o766p484p711
$$ plain form
61982 484846 477222 470108 463910 458522 453478 448692 444554 441137 437887 434386 430926 427972 425515 423371
61968 423371 421620 420274 418895 417168 415595 414956 415197 415517 415537 415720 416438 417245 417522 417532 418394 421062 425539
61951 425539 431023 436639 442033 447503 453739 461402 470809 481887 494398 508250 523525 540097 557387
61938 557387 574742 592013 609423 626844 643621 659260 673886 687693 700318 711126 719879 726671
61926 726671 731466 734207 735245 735034 733337 729291 722537 713990 705386 698315 693729 691898 692563 695348 700331
61911 700331 708065 718928 732574 748102 764515 780907 796388 810133 821429 829691 834526 835827
61899 835827 833691 828231 819659 808518 795581 781426 766374 750917 735874 721876 708863 696304
61887 696304 683804 671332 658994 646797 634688 622764 611390 600986 591537 582434 573082 563600
$$ packed form
61982D84846p624p114o198n388n044m786m138l417l250l501l460k954k457k144
61968D23371j751j346j379j727j573o39K41L20K0J83P18Q07K77J0Q62K668M477
61951D25539N484N616N394N470O236P663R407J1078J2511J3852J5275J6572J7290
61938E57387J7355J7271J7410J7421J6777J5639J4626J3807J2625J0808Q753O792
61926G26671M795K741J038k11j697m046o754q547q604p071m586j831O65K785M983
61911G00331P734J0863J3646J5528J6413J6392J5481J3745J1296Q262M835J301
61899H35827k136n460q572j1141j2937j4155j5052j5457j5043j3998j3013j2559
61887F96304j2500j2472j2338j2197j2109j1924j1374j0404r449r103r352r482
$$ plain form
61875 563600 554637 546540 539155 532480 526990 523055 520524 519197 519325 521236 524801 529716 536023 543898
61861 543898 553172 563606 575446 589108 604425 620904 638776 659058 682296 707823 734649 762578
61849 762578 791886 822163 852083 880324 906259 929640 949999 966631 978967 986743 989903 988583
61837 988583 983238 974618 963601 951218 938874 928221 920441 915748 913854 914859 919224 926843 936631
61824 936631 947279 957970 967952 975848 979964 979195 973228 962003 945534 924238 898973 870716 840592
61811 840592 810141 780860 753258 726792 701020 676381 653618 632948 614229 597532 582980
61800 582980 570270 558945 549081 541138 535022 529778 524462 519066 514309 510652 507817 505270 502974 501453
61786 501453 501027 501143 500708 499167 497074 495435 494660 494349 493943 493259 492399 491476 490607 489909 489301 488448 487179
$$ packed form
61875E63600q963q097p385o675n490l935k531j327J28J911L565M915O307P875
61861E43898R274J0434J1840J3662J5317J6479J7872K0282K3238K5527K6826K7929
61849G62578K9308L0277K9920K8241K5935K3381K0359J6632J2336P776L160j320
61837I88583n345q620j1017j2383j2344j0653p780m693j894J005M365P619R788
61824I36631J0648J0691R982P896M116p69n967j1225j6469k1296k5265k8257l0124
61811H40592l0451k9281k7602k6466k5772k4639k2763k0670j8719j6697j4552
61800E82980j2710j1325r864p943o116n244n316n396m757l657k835k547k296j521
61786E01453m26J16m35j541k093j639p75l11m06o84q60r23q69o98o08q53j269
$$ plain form
61769 487179 485957 485709 487044 489704 492890 496065 499350 503106 507275 511280 514617 517386 520100 523011
61755 523011 525778 527911 529357 530393 530929 530251 527733 523690 519209 515136 511537 508132 504899 501971 499245
61740 499245 496492 493857 491877 490918 490702 490479 489649 488281 487073 486719 487275 488243 489287 490553 492173 493849
61724 493849 495277 496732 498794 501561 504522 507103 509012 510153 510699 511182 512002 512835 513039 512640 512303 512185
61708 512185 511462 509333 505928 501875 497454 492700 487920 483506 479463 475591 472026 469130 466976 465263
61694 465263 463579 461439 458312 454163 449880 446644 444847 443929 443208 442418 441390 439763 437340 434554 432309
61679 432309 431260 431176 431033 429946 428125 426648 426100 425739 424383 421838 418998 416716 415067 413651 412168
61664 412168 410711 409869 410406 412310 414311 414999 414422 413904 414191 414608 414388 413987 414388 415628 416854 417655 418609
$$ packed form
61769D87179j222k48J335K660L186L175L285L756M169M005L337K769K714K911
61755E23011K767K133J446J036N36o78k518m043m481m073l599l405l233k928k726
61740D99245k753k635j980r59k16k23q30j368j208l54N56R68J044J266J620J676
61724D93849J428J455K062K767K961K581J909J141N46M83Q20Q33K04l99l37j18
61708E12185p23k129l405m053m421m754m780m414m043l872l565k896k154j713
61694D65263j684k140l127m149m283l236j797r18p21p90j028j627k423k786k245
61679D32309j049q4j43j087j821j477n48l61j356k545k840k282j649j416j483
61664D12168j457q42N37J904K001O88n77n18K87M17k20m01M01J240J226Q01R54
$$ plain form
61647 418609 420462 423330 426811 430397 433638 436284 438500 440679 442816 444277 444395 443189 441223 438824
61633 438824 435733 431646 426864 422192 418255 415140 412583 410210 407572 404356 400807 397718 395721 394727
61619 394727 394243 394013 394106 394591 395441 396520 397265 396636 393945 389724 385294 381474 378148 374990 371933 368834
61603 368834 365349 361513 357950 355151 352913 350714 348233 345230 341486 337310 333681 331307 329796 328230
61589 328230 326296 324355 322632 321020 319653 319007 319247 319885 320307 320356 320257 320200 320162 319957 319315 318050 316312 314699
61571 314699 313963 314444 315692 316746 317009 316781 316735 316988 317112 317071 317530 318937 320777 322219 323132 323932 324705 325074
61553 325074 324891 324503 324306 324443 325007 326106 327577 328959 329889 330425 330931 331750 332969 334384 335834 337583
61537 337583 340042 342953 345249 346158 346098 346020 346205 346267 345967 345301 344027 342027 340028 339007 338731 337875 335884
$$ packed form
61647D18609J853K868L481L586L241K646K216K179K137J461J18j206j966k399
61633D38824l091m087m782m672l937l115k557k373k638l216l549l089j997r94
61619C94727m84k30R3M85Q50J079P45o29k691m221m430l820l326l158l057l099
61603C68834l485l836l563k799k238k199k481l003l744m176l629k374j511j566
61589C28230j934j941j723j612j367o46K40O38M22M9r9n7l8k05o42j265j738j613
61571C14699p36M81J248J054K63k28m6K53J24m1M59J407J840J442R13Q00P73L69
61553C25074j83l88j97J37N64J099J471J382R30N36N06Q19J219J415J450J749
61537C37583K459K911K296R09o0p8J85O2l00o66j274k000j999j021k76q56j991
$$ plain form
61520 335884 333757 332529 331902 331091 330179 329732 329574 328972 327801 326625 325733 324915 324214 324094 324653 325284 325395
61503 325395 324993 324405 323853 323509 323549 323868 324063 324014 324227 325362 327494 330014 332110 333277 333556 333462 333545 333890
61485 333890 334160 334211 334428 335286 336720 338135 338933 338890 338205 337440 337253 337827 338576 338724 338276 338082 338779 339988
61467 339988 340846 341076 341104 341247 341328 341228 341297 341873 342731 343410 343870 344393 345016 345576 346328 347915 350448 353019 354512
61448 354512 354713 354347 354215 354656 355720 357477 359975 363063 366371 369484 372198 374651 377071 379341 380989
61433 380989 381794 382291 383398 385527 388212 390610 392215 393096 393669 394380 395483 396975 398669 400319 401700
61418 401700 402640 403146 403500 404141 405254 406398 406650 405339 402754 399996 397975 396661 395478 394244 393337 392937
61402 392937 392547 391556 389969 388263 386698 385065 383133 381081 379424 378584 378539 378829 378944 378761 378521 378396 378302
$$ packed form
61520C35884k127j228o27q11r12m47j58o02j171j176q92q18p01j20N59O31J11
61503C25395m02n88n52l44M0L19J95m9K13J135K132K520K096J167K79r4Q3L45
61485C33890K70N1K17Q58J434J415P98m3o85p65j87N74P49J48m48j94O97J209
61467C39988Q58K30K8J43Q1j00O9N76Q58O79M60N23O23N60P52J587K533K571J493
61448C54512K01l66j32M41J064J757K498L088L308L113K714K453K420K270J648
61433C80989Q05M97J107K129K685K398J605Q81N73P11J103J492J694J650J381
61418D01700R40N06L54O41J113J144K52j311k585k758k021j314j183j234r07m00
61402C92937l90r91j587j706j565j633j932k052j657q40m5K90J15j83k40j25r4
$$ plain form
61385 378302 378213 378421 379308 380982 383277 385946 388766 391636 394709 398144 401587 404266 405901 407102 408496
61370 408496 409848 410627 411157 412388 414579 416991 419043 421023 423314 425631 427657 429965 433591 438801 444845
61355 444845 450980 457291 464333 472297 480748 489157 497457 505903 514346 521875 527516 531321 534409 537795
61341 537795 541457 544755 547435 549811 552082 553905 554714 554291 552932 551141 549144 546664 543230 538817 534060
61326 534060 529717 526053 522944 520505 519291 519768 521744 524492 527398 530424 533901 537980 542461 547214
61312 547214 552560 558967 566452 574654 583508 593491 604940 617423 630010 641910 652530 661175 667251
61299 667251 670838 672660 673321 672791 670808 667498 663292 658317 652214 644754 636423 628064 619947 611591 602788
61284 602788 594476 588067 583962 581217 578758 576431 574731 574063 574644 576580 579482 582337 584418 586199 588810
$$ packed form
61385C78302q9K08Q87J674K295K669K820K870L073L435L443K679J635J201J394
61370D08496J352P79N30J231K191K412K052J980K291K317K026K308L626N210O044
61355D44845O135O311P042P964Q451Q409Q300Q446Q443P529N641L805L088L386
61341E37795L662L298K680K376K271J823Q09m23j359j791j997k480l434m413m757
61326E34060m343l664l109k439j214M77J976K748K906L026L477M079M481M753
61312E47214N346O407P485Q202Q854R983J1449J2483J2587J1900J0620Q645O076
61299F67251L587J822O61n30j983l310m206m975o103p460q331q359q117q356q803
61284F02788q312o409m105k745k459k327j700o68N81J936K902K855K081J781K611
$$ plain form
61269 588810 592672 597173 601654 606090 610762 615863 621614 628281 635802 643734 651808 660149 668730 676903
61255 676903 683780 688813 691869 693083 692886 691882 690303 687801 684084 679611 675250 671291 667104 661847
61241 661847 655409 648667 642917 638986 636741 635481 634720 634414 634489 634610 634631 634974 636225 638604 642060 646578
61225 646578 651960 657572 662859 668058 673913 680645 687639 694194 700188 705879 711519 717392 723830 730767
61211 730767 737426 742790 746444 748880 751124 754135 758373 763661 769493 775700 782815 791686 802791 816018
61197 816018 830984 847292 864414 881545 897801 912599 925816 937549 947738 955975 961750 964941
61185 964941 966094 966118 965633 964588 962477 958780 953180 945558 936048 925134 913480 901570 889534 877280
61171 877280 864555 850924 836056 820292 804619 789717 775250 760440 745213 730286 716271
$$ packed form
61269E88810L862M501M481M436M672N101N751O667P521P932Q074Q341Q581Q173
61255F76903O877N033L056J214j97j004j579k502l717m473m361l959m187n257
61241F61847o438o742n750l931k245j260p61l06P5J21K1L43J251K379L456M518
61225F46578N382N612N287N199N855O732O994O555N994N691N640N873O438O937
61211G30767O659N364L654K436K244L011M238N288N832O207P115Q871J1105J3227
61197H16018J4966J6308J7122J7131J6256J4798J3217J1733J0189Q237N775L191
61185I64941J153K4m85j045k111l697n600p622r510j0914j1654j1910j2036j2254
61171H77280j2725j3631j4868j5764j5673j4902j4467j4810j5227j4927j4015
$$ plain form
61160 716271 703246 691279 680756 671946 664742 659108 655246 652984 651570 650621 650769 652633 655389 657138
61146 657138 656664 654149 650253 645333 639750 634101 628697 623337 618091 613874 611731 611809 613512 616508 621059
61131 621059 627392 635209 644042 653916 665479 679406 695649 713356 731722 750880 771705 794634
61119 794634 818962 843496 867700 891971 916974 942897 969224 995073 1019767 1043154 1065208
61108 1065208 1085376 1102706 1116765 1128054 1137222 1144176 1148220 1148745 1145390 1137865 1126167 1110876 1092737
61095 1092737 1072067 1049032 1024394 999339 974542 949950 925650 902316 880536 860157 840739
61084 840739 822327 805330 789912 775980 763665 753337 745051 738283 732393 727195 722922 719794 717754
61071 717754 716643 716479 717406 719399 722224 725765 730179 735568 741702 748390 755962 764971 775424 786724
$$ packed form
61160G16271j3025j1967j0523q810p204n634l862k262j414r49J48J864K756J749
61146F57138m74k515l896m920n583n649n404n360n246m217k143P8J703K996M551
61131F21059O333P817Q833R874J1563J3927J6243J7707J8366J9158K0825K2929
61119G94634K4328K4534K4204K4271K5003K5923K6327K5849K4694K3387K2054
61108A065208K0168J7330J4059J1289R168O954M044N25l355p525j1698j5291j8139
61095A092737k0670k3035k4638k5055k4797k4592k4300k3334k1780k0379j9418
61084H40739j8412j6997j5418j3932j2315j0328q286o768n890n198m273l128k040
61071G17754j111j64R27J993K825L541M414N389O134O688P572R009J0453J1300
$$ plain form
61057 786724 798495 811048 824926 840348 857244 875430 894529 914170 934656 957019 981960
61046 981960 1009044 1037382 1066776 1097596 1129769 1162693 1196181 1230797 1266990 1304430 1342462
61035 1342462 1380864 1419917 1460110 1501989 1545952 1591895 1639286 1687696 1736946 1786775 1837036
61024 1837036 1888656 1943844 2004848 2072852 2148631 2233837 2330867 2441708 2567849 2711637 2877319
61013 2877319 3070898 3299780 3572806 3899835 4290695 4754776 5302029 5944346 6696443
61004 6696443 7576755 8608450 9818015 11227996 12842811 14630615 16508114 18338682
60996 18338682 19953545 21196352 21975526 22298628 22269924 22052381 21812447 21668410 21655064
60987 21655064 21711357 21696870 21438598 20794737 19707473 18219394 16450277 14553460 12675063
$$ packed form
61057G86724J1771J2553J3878J5422J6896J8186J9099J9641K0486K2363K4941
61046I81960K7084K8338K9394L0820L2173L2924L3488L4616L6193L7440L8032
61035A342462L8402L9053M0193M1879M3963M5943M7391M8410M9250M9829N0261
61024A837036N1620N5188O1004O8004P5779Q5206R7030J10841J26141J43788J65682
61013B877319J93579K28882K73026L27029L90860M64081N47253O42317P52097
61004F696443Q80312J031695J209565J409981J614815J787804J877499J830568
60996A8338682J614863J242807P79174L23102k8704k17543k39934j44037j3346
60987B1655064N6293j4487k58272o43861j087264j488079j769117j896817j878397
$$ plain form
60978 12675063 10927670 9379065 8053752 6944262 6026200 5270106 4647648 4134259 3710083
60969 3710083 3359095 3067215 2821701 2612287 2431785 2274884 2136858 2013728 1902909
60960 1902909 1802914 1712658 1631440 1559044 1495219 1439146 1389685 1345771 1306183 1269320 1233712
60949 1233712 1198544 1163417 1128129 1093148 1059742 1028855 1000128 972662 946398 921967 899431
60938 899431 878100 857550 837916 819037 800187 780991 761933 743695 726565 710751 696645
60927 696645 684327 673263 662870 653021 643768 635040 626954 619966 614313 609631 605419 601538 597961
60914 597961 594532 591299 588638 586606 584689 582710 581460 581681 582849 583817 584387 585278 586561 587161 586226 584172
60898 584172 581919 579728 577265 574304 570810 566690 562045 557507 553822 551139 549007 546988 544977 543004
$$ packed form
60978A2675063j747393j548605j325313j109490r18062p56094o22458n13389m24176
60969C710083l50988k91880k45514k09414j80502j56901j38026j23130j10819
60960A902909r9995r0256q1218p2396o3825n6073m9461m3914l9588l6863l5608
60949A233712l5168l5127l5288l4981l3406l0887k8727k7466k6264k4431k2536
60938H99431k1331k0550j9634j8879j8850j9196j9058j8238j7130j5814j4106
60927F96645j2318j1064j0393r849r253q728q086o988n653m682m212l881l577
60914E97961l429l233k661k032j917j979j250K21J168R68N70Q91J283O00r35k054
60898E84172k253k191k463k961l494m120m645m538l685k683k132k019k011j973
$$ plain form
60884 543004 541034 538958 536525 533301 528921 523475 517513 511676 506386 501758 497612 493625 489705 486228
60870 486228 483734 482358 481710 481374 481401 482242 484274 487412 491142 494881 498269 501060 502888 503409 502812 501911
60854 501911 501469 501532 501693 501871 502448 503611 504867 505356 504468 502177 499034 495901 493386 491338 489021 485874
60838 485874 481903 477343 472345 467226 462639 459063 456281 453699 451028 448338 445631 442856 440294 438409
60824 438409 437212 436213 435120 434205 433772 433652 433439 432861 431663 429496 426353 422874 419832 417446 415481 413806
60808 413806 412377 410856 408784 406229 403830 402094 400957 400093 399222 398007 396140 393888 392207 391847 392444
60793 392444 392812 392114 390486 388610 387005 385784 384806 383913 383131 382673 382605 382560 382013 380934 379945 379659 380034 380537
60775 380537 380860 381219 381983 383161 384338 385017 385133 385358 386762 389856 393872 397256 399037 399548 399755 400270
$$ packed form
60884E43004j970k076k433l224m380n446n962n837n290m628m146l987l920l477
60870D86228k494j376o48l36K7Q41K032L138L730L739L388K791J828N21n97r01
60854E01911m42O3J61J78N77J163J256M89q88k291l143l133k515k048k317l147
60838D85874l971m560m998n119m587l576k782k582k671k690k707k775k562j885
60824D38409j197r99j093r15m33j20k13n78j198k167l143l479l042k386j965j675
60808D13806j429j521k072k555k399j736j137q64q71j215j867k252j681l60N97
60793C92444L68o98j628j876j605j221r78q93p82m58o8m5n47j079r89k86L75N03
60775C80537L23L59P64J178J177O79J16K25J404L094M016L384J781N11K07N15
$$ plain form
60759 400270 401220 402647 404435 405963 406431 405738 404671 404073 404145 404671 405517 406639 407924 409340 411063 413164
60743 413164 415320 417039 417970 417796 416143 412963 408783 404170 399060 393099 386572 380520 375806 372390 369616
60728 369616 366914 364143 361568 359656 358708 358549 358645 358619 358551 358831 359778 361270 362608 362926 362014 360574 359376
60711 359376 358418 357323 356319 356123 356857 357741 358071 357934 357799 357928 358466 359547 360966 362186 362983 363632 364136
60694 364136 363932 362939 362303 363309 365793 368395 370261 371739 373422 375304 377174 379262 382086 385830 390047
60679 390047 393878 396651 398461 400077 401993 403800 404853 405294 405743 406126 405609 403841 401439 398934 396055
60664 396055 392624 389446 387464 386380 385011 382920 380844 379469 378635 378087 378303 379875 382410 384749 386289
60649 386289 387587 389520 392179 394838 396768 397753 397842 396997 395214 392859 390560 388604 386604 383993 380799
$$ packed form
60759D00270R50J427J788J528M68o93j067n98P2N26Q46J122J285J416J723K101
60743D13164K156J719R31j74j653l180m180m613n110n961o527o052m714l416k774
60728C69616k702k771k575j912r48j59R6k6o8K80R47J492J338L18r12j440j198
60711C59376r58j095j004j96P34Q84L30j37j35J29N38J081J419J220P97O49N04
60694C64136k04r93o36J006K484K602J866J478J683J882J870K088K824L744M217
60679C90047L831K773J810J616J916J807J053M41M49L83n17j768k402k505k879
60664C96055l431l178j982j084j369k091k076j375q34n48K16J572K535K339J540
60649C86289J298J933K659K659J930R85Q9q45j783k355k299j956k000k611l194
$$ plain form
60634 380799 377734 375469 374064 373239 372900 373070 373432 373461 373126 373084 373915 375439 377043 378413 379574 380459 380908
60617 380908 381025 381061 380916 380249 379177 378407 378417 378932 379459 379957 380626 381337 381753 381868 382035 382488 383212 384227 385709
60598 385709 387814 390581 393975 397802 401675 405302 408755 412183 415336 417661 418921 419422 419600 419582 419262
60583 419262 418656 418040 417792 418140 419082 420618 422908 425953 429189 431954 434575 438463 444634 452587 461194
60568 461194 470322 480733 492635 505241 517750 529760 540476 548643 553840 556989 558779 558312 554356
60555 554356 547543 540175 533859 528397 523287 519256 517598 518517 520967 524033 527859 533129 540157 548839
60541 548839 559203 571595 586229 602837 620869 639803 658989 677317 693398 706262 715699 721826
60529 721826 724558 723750 719716 713327 705528 696914 687836 678794 670571 663851 658633 654132 649424 644310
$$ packed form
60634C80799l065k265j405q25l39J70L62K9l35m2Q31J524J604J370J161Q85M49
60617C80908J17L6j45o67j072p70J0N15N27M98O69P11M16J15J67M53P24J015J482
60598C85709K105K767L394L827L873L627L453L428L153K325J260N01J78j8l20
60583D19262o06o16k48L48R42J536K290L045L236K765K621L888O171P953Q607
60568D61194R128J0411J1902J2606J2509J2010J0716Q167N197L149J790m67l956
60555E54356o813p368o316n462n110m031j658R19K450L066L826N270P028Q682
60541E48839J0364J2392J4634J6608J8032J8934J9186J8328J6081J2864R437O127
60529G21826K732q08m034o389p799q614r078r042q223o720n218m501m708n114
$$ plain form
60515 644310 639504 636072 634809 636001 639335 643886 648692 653745 660226 669394 681425 695803 712650
60502 712650 733041 757873 787071 820263 857725 900027 946920 997109 1049100 1101711 1153554
60491 1153554 1202504 1246082 1282233 1309481 1326469 1331733 1324055 1303124 1269987 1226916 1176527 1120803
60479 1120803 1061091 999215 938081 880615 828153 780449 737205 698844 665633 636854 611467
60468 611467 589158 570118 554104 540320 528075 517020 506907 497684 489658 482989 477069 471091
60456 471091 465245 460562 457436 455008 452330 449432 446720 443956 440568 436667 433015 430100 427832 426139
60442 426139 425284 425422 426229 427144 427771 427938 427599 426794 425527 423621 420864 417419 413929 411108 409298 408462
60426 408462 408533 409517 411213 412987 414082 414207 413689 413021 412481 412337 413075 414973 417565 419955 421706 423076
$$ packed form
60515F44310m806l432j263J192L334M551M806N053O481R168J2031J4378J6847
60502G12650K0391K4832K9198L3192L7462M2302M6893N0189N1991N2611N1843
60491A153554M8950M3578L6151K7248J6988N264p678k0931l3137m3071n0389n5724
60479A120803n9712o1876o1134n7466n2462m7704m3244l8361l3211k8779k5387
60468F11467k2309j9040j6014j3784j2245j1055j0113r223q026o669n920n978
60456D71091n846m683l126k428k678k898k712k764l388l901l652k915k268j693
60442D26139q55J38Q07R15O27J67l39q05j267j906k757l445l490k821j810q36
60426D08462P1R84J696J774J095J25n18o68n40j44P38J898K592K390J751J370
$$ plain form
60410 423076 424379 425583 426602 427487 428101 428098 427537 427116 427400 428152 428809 429339 430182 431534 433151 434728 436165
60393 436165 437565 439305 441881 445304 448860 451841 454353 456934 459618 461934 463763 465551 467621 469871
60379 469871 472253 475022 478211 481323 483809 485589 486906 487957 488834 489537 489911 489813 489470 489330 489451 489442 489204
60362 489204 489269 490129 491623 493377 495531 498530 502395 506648 510943 515351 520017 524854 529696 534478 539171
60347 539171 543578 547205 549307 549255 547045 543402 539235 535088 531112 527249 523263 518907 514479 510934 508929
60332 508929 507860 506360 503754 500510 497239 493985 490792 488275 486934 486270 485286 483898 483199 484171 486539
60317 486539 489138 491178 492940 495438 499531 505262 511938 518894 526226 534636 544628 556070 568571 581860
60303 581860 595584 609038 621397 632129 640877 647070 649915 648708 643045 633018 619616 604781
$$ packed form
60410D23076J303J204J019Q85O14ln61m21K84P52O57N30Q43J352J617J577J437
60393D36165J400J740K576L423L556K981K512K581K684K316J829J788K070K250
60379D69871K382K769L189L112K486J780J317J051Q77P03L74r8l43j40J21rk38
60362D89204O5Q60J494J754K154K999L865M253M295M408M666M837M842M782M693
60347E39171M407L627K102n2k210l643m167m147l976l863l986m356m428l545k005
60332E08929j069j500k606l244l271l254l193k517j341o64r84j388o99R72K368
60317D86539K599K040J762K498M093N731O676O956P332Q410R992J1442J2501J3289
60303E81860J3724J3454J2359J0732Q748O193K845j207n663j0027j3402j4835
$$ plain form
60291 604781 590523 577782 566420 556171 547074 539006 531497 524438 518439 513958 510391 506616 502253
60278 502253 497800 493620 489424 484957 480627 477149 474804 473297 472095 470696 468789 466504 464391 462909
60264 462909 461903 460811 459375 457979 457257 457455 458225 458935 459179 459058 459058 459581 460550 461503 462087 462412 462853 463599
60246 463599 464488 465290 465950 466516 466979 467279 467424 467488 467544 467690 467999 468348 468460 468388 468844 470696 474105 478406 482898
60227 482898 487390 491884 496164 500010 503582 507208 510965 514780 518839 523509 528865 534603 540453 546394
60213 546394 552412 558391 564424 570972 578361 586149 593282 599088 604008 609090 614689 619920 623687 626083
60199 626083 628337 631332 634647 637282 638787 639286 638726 636821 633675 629896 625899 621574 616864 612272 608480
60184 608480 605614 603174 600631 597839 594867 591669 588102 584349 581144 579289 578760 578517 577455 575510 573600
$$ packed form
60291F04781j4258j2741j1362j0249r097q068p509p059n999m481l567l775m363
60278E02253m453m180m196m467m330l478k345j507j202j399j907k285k113j482
60264D62909j006j092j436j396p22J98P70P10K44j21%N23R69R53N84L25M41P46
60246D63599Q89Q02O60N66M63L00J45O4N6J46L09L49J12p2M56J852L409M301M492
60227D82898M492M494M280L846L572L626L757L815M059M670N356N738N850N941
60213E46394O018N979O033O548P389P788P133N806M920N082N599N231L767K396
60199F26083K254K995L315K635J505M99n60j905l146l779l997m325m710m592l792
60184F08480k866k440k543k792k972l198l567l753l205j855n29k43j062j945j910
$$ plain form
60169 573600 572518 572192 571986 571410 570397 569187 568219 568023 568911 570686 572667 574091 574619 574550 574498 574799 575266
60152 575266 575615 575967 576728 578109 580048 582534 585668 589295 592932 596242 599425 602942 607023 611631 616794
60137 616794 622692 629415 636801 644630 652788 661062 668833 675290 680164 684028 687528 690377 691612 690976
60123 690976 689566 688750 688742 688700 687957 686633 685142 683712 682465 681446 680318 678415 675402 671687 667934 664370
60107 664370 660717 656648 652101 647257 642383 637715 633387 629448 625935 622916 620548 619136 618969 619935 621497
60092 621497 623281 625509 628481 631800 634584 636511 638137 640016 641938 643283 643857 644033 644194 644283 643939 642908
60076 642908 641242 639004 635869 631343 625515 619192 612947 606395 598987 591186 584041 577689 571187 564005
60062 564005 556793 550330 544555 539281 535093 532676 531558 530393 528503 526564 525728 526446 528212 530118 531696
$$ packed form
60169E73600j082l26k06n76j013j210r68j96Q88J775J981J424N28o9n2L01M67
60152E75266L49L52P61J381J939K486L134L627L637L310L183L517M081M608N163
60137F16794N898O723P386P829Q158Q274P771O457M874L864L500K849J235o36
60123F90976j410q16qm2p43j324j491j430j247j019j128j903l013l715l753l564
60107F64370l653m069m547m844m874m668m328l939l513l019k368j412j67R66J562
60092F21497J784K228K972L319K784J927J626J879J922J345N74J76J61Q9l44j031
60076F42908j666k238l135m526n828o323o245o552p408p801p145o352o502p182
60062E64005p212o463n775n274m188k417j118j165j890j939q36P18J766J906J578
$$ plain form
60047 531696 533376 536038 540045 544947 550233 555904 562000 568013 573297 577650 580903 582264 580977 577621
60033 577621 573985 571314 569171 566256 561878 556287 549958 543106 535954 529078 523173 518423 514209 509625
60019 509625 504250 498333 492342 486670 481755 477902 474771 471516 467842 464503 462265 460798 459159 457122
60005 457122 455249 453836 452620 451608 451375 452202 453552 454797 455991 457506 459367 461408 463794 466764 469986
59990 469986 472727 474771 476793 479596 483167 486701 489413 491102 491916 491825 490597 488243 485209 482033 479025
59975 479025 476396 474462 473390 472919 472596 472302 472281 472735 473645 475000 476886 479309 482160 485454 489426 494252
59959 494252 499691 505029 509346 512023 513214 513718 514135 514207 513254 511208 508855 506967 505560 504139 502455
59944 502455 500721 499165 497589 495507 492662 489335 486043 482990 480109 477653 476382 476794 478456 480511
$$ packed form
60047E31696J680K662M007M902N286N671O096O013N284M353L253J361j287l356
60033E77621l636k671k143k915m378n591o329o852p152o876n905m750m214m584
60019E09625n375n917n991n672m915l853l131l255l674l339k238j467j639k037
60005D57122j873j413j216j012k33Q27J350J245J194J515J861K041K386K970L222
59990D69986K741K044K022K803L571L534K712J689Q14r1j228k354l034l176l008
59975D79025k629j934j072m71l23k94k1M54R10J355J886K423K851L294L972M826
59959D94252N439N338M317K677J191N04M17P2r53k046k353j888j407j421j684
59944E02455j734j556j576k082k845l327l292l053k881k456j271M12J662K055
$$ plain form
59930 480511 482704 485408 488734 492188 495393 498669 502580 507228 512265 517346 522251 526742 530633 534030
59916 534030 537283 540688 544318 548105 551985 555976 560198 564836 570006 575619 581346 586770 591670 596139
59902 596139 600314 604026 606877 608744 609902 610592 610736 610272 609473 608674 608042 607959 609248 612384 616643 620625
59886 620625 623614 625958 628259 630867 634198 638748 644363 650038 654870 658911 662754 666620 670151 672854
59872 672854 674372 674480 673108 670417 666829 663075 660050 658253 657320 656502 655580 654895 654465 653764 652579 651464
59856 651464 650901 650587 650106 649902 650986 653951 658757 665190 672841 680739 687614 692652 695709 696897 696430
59841 696430 694834 692869 691092 689606 688129 686068 682748 677928 671971 665212 657444 648509 639185 630873
59827 630873 624417 619710 616385 614204 612649 610794 607981 604272 600007 595316 590336 585520 581374 577984
$$ packed form
59930D80511K193K704L326L454L205L276L911M648N037N081M905M491L891L397
59916E34030L253L405L630L787L880L991M222M638N170N613N727N424M900M469
59902E96139M175L712K851J867J158O90J44m64p99p99o32q3J289L136M259L982
59886F20625K989K344K301K608L331M550N615N675M832M041L843L866L531K703
59872F72854J518J08j372k691l588l754l025j797r33q18r22o85m30p01j185j115
59856F51464n63l14m81k04J084K965M806O433P651P898O875N038L057J188m67
59841F96430j596j965j777j486j477k061l320m820n957o759p768q935r324q312
59827F30873o456m707l325k181j555j855k813l709m265m691m980m816m146l390
$$ plain form
59813 577984 575010 571957 568361 564011 559232 554812 551411 549181 547965 547577 547688 547769 547411 546612 545606 544555
59797 544555 543472 542171 540288 537727 535250 534096 534621 535689 535891 535072 534102 533407 532469 530849 528962 527536
59781 527536 526675 525890 524817 523669 523028 523341 524498 525866 526824 527312 527806 528891 531060 534687 539683 545157
59765 545157 549959 553778 557362 561459 565998 570644 575680 581789 589084 596845 604248 611055 617627 624561
59751 624561 632297 640852 649914 659262 668907 678673 687971 696317 703815 710733 716859 721759 725509 728560
59737 728560 730931 732105 731756 730056 727201 723216 718327 712987 707392 701472 695488 690048 685321 680855
59723 680855 676408 672353 668876 665471 661742 658179 655527 653795 652406 650970 649380 647590 645835 644677
59709 644677 644224 643761 642824 642185 642941 644998 647473 650256 654011 658636 662941 666166 668797 671416 673690
$$ packed form
59813E77984k974l053l596m350m779m420l401k230j216l88J11Q1l58p99j006j051
59797E44555j083j301j883k561k477j154N25J068K02q19r70o95r38j620j887j426
59781E27536q61p85j073j148o41L13J157J368R58M88M94J085K169L627M996N474
59765E45157M802L819L584M097M539M646N036O109P295P761P403O807O572O934
59751F24561P736Q555R062R348R645R766R298Q346P498O918O126M900L750L051
59737G28560K371J174l49j700k855l985m889n340n595n920n984n440m727m466
59723F80855m447m055l477l405l729l563k652j732j389j436j590j790j755j158
59709F44677m53m63r37o39P56K057K475K783L755M625M305L225K631K619K274
$$ plain form
59694 673690 675086 675870 676640 677323 677237 675947 673639 670905 668497 667022 666484 666244 665653 664517 662841 660465
59678 660465 657132 652690 647130 640744 634233 628216 622532 616660 610905 606467 603939 602375 600380 597610
59664 597610 594692 592136 589999 588329 587327 587194 588190 590562 594006 597510 600268 602483 604800 607266 609373
59649 609373 610805 611479 611074 609311 606652 603913 601096 597276 591882 585530 579356 574000 569534 565958 563391
59634 563391 561867 561165 560744 559919 558325 556170 553727 550711 546666 541950 537678 534348 531115 526920 521934
59619 521934 517237 513282 509458 505354 501655 499260 497947 496678 495152 494334 495131 497119 499053 500287 501153
59604 501153 502239 503895 506294 509281 512024 513532 513761 513673 513992 514500 514829 515324 516530 518355 520308 522240
59588 522240 524223 525921 526720 526389 525153 523205 520626 517667 514636 511495 507969 504019 499924 496019 492638
$$ packed form
59694F73690J396P84P70O83q6j290k308k734k408j475n38k40n91j136j676k376
59678F60465l333m442n560o386o511o017n684n872n755m438k528j564j995k770
59664E97610k918k556k137j670j002j33R96K372L444L504K758K215K317K466K107
59649F09373J432O74m05j763k659k739k817l820n394o352o174n356m466l576k567
59634E63391j524p02m21q25j594k155k443l016m045m716m272l330l233m195m986
59619E21934m697l955l824m104l699k395j313j269j526q18P97J988J934J234Q66
59604E01153J086J656K399K987K743J508K29q8L19N08L29M95J206J825J953J932
59588E22240J983J698P99l31j236j948k579k959l031l141l526l950m095l905l381
$$ plain form
59573 492638 490134 488531 487340 486110 484936 484024 483113 481977 481230 481834 483743 485746 486753 486669 485973 485182
59557 485182 484901 485653 487257 488898 490241 492035 495217 499744 504723 509464 514068 519116 525153 532496 541371
59542 541371 552161 565372 581171 598964 617595 635763 651916 663966 669898 669111 662995 654040
59530 654040 644561 636191 630024 626684 626157 627708 630113 632320 634126 636000 637998 639174 638503 636047 632525
59515 632525 628024 621986 614379 605932 597067 587630 578047 569672 563284 557965 552288 546089 540349 535710
59501 535710 531905 528448 525198 522358 520412 519868 520610 521712 522414 522991 524140 525753 527032 527673 528200 529081
59485 529081 530198 531390 532954 535377 538873 543301 548200 552909 557153 561543 566968 573281 579088 583102
59471 583102 585355 586779 587993 588918 589313 589247 589075 589299 590432 592689 595774 599262 603263 608458 615315 623484
$$ packed form
59573D92638k504j603j191j230j174r12r11j136p47O04J909K003J007q4o96p91
59557D85182k81P52J604J641J343J794L182M527M979M741M604N048O037P343Q875
59542E41371J0790J3211J5799J7793J8631J8168J6153J2050N932p87o116q955
59530F54040r479q370o167l340n27J551K405K207J806J874J998J176o71k456l522
59515F32525m501o038p607q447q865r437r583q375o388n319n677o199n740m639
59501E35710l805l457l250k840j946n44P42J102P02N77J149J613J279O41N27Q81
59485E29081J117J192J564K423L496M428M899M709M244M390N425O313N807M014
59471E83102K253J424J214R25L95o6j72K24J133K257L085L488M001N195O857Q169
$$ plain form
59455 623484 632182 641055 650299 659877 669013 676797 683109 688505 693212 696605 697811 696468 692729 686866
59441 686866 679263 670637 661871 653567 645980 639337 633942 629905 626975 624737 622922 621533 620826 621242 623272
59426 623272 627238 633100 640487 649074 659101 671417 686776 705053 725359 746976 769924 794537
59414 794537 820708 847516 873075 894479 908348 912295 906253 892486 874453 855676 839206 827417
59402 827417 821837 822846 829168 837628 844007 844881 838816 825881 806727 782792 756986 732917 712881
59389 712881 696984 684303 674253 666476 660162 654389 649106 645132 643004 642188 641631 640847 640297 640762 642521
59374 642521 645109 647782 650075 651954 653597 655251 657204 659654 662552 665805 669682 674721 681011 687845
59360 687845 694402 700703 707632 716021 725977 737072 748921 761524 775244 790514 807384 825303
$$ packed form
59455F23484Q698Q873R244R578R136P784O312N396M707L393J206j343l739n863
59441F86866p603q626q766q304p587o643n395m037k930k238j815j389p07M16K030
59426F23272L966N862P387Q587J0027J2316J5359J8277K0306K1617K2948K4613
59414G94537K6171K6808K5559K1404J3869L947o042j3767j8033j8777j6470j1789
59402H27417n580J009O322Q460O379Q74o065j2935j9154k3935k5806k4069k0036
59389G12881j5897j2681j0050p777o314n773n283l974k128q16n57p84n50M65J759
59374F42521K588K673K293J879J643J654J953K450K898L253L877N039O290O834
59360F87845O557O301O929Q389R956J1095J1849J2603J3720J5270J6870J7919
$$ plain form
59348 825303 843562 861965 880746 899728 917926 934283 948445 960432 969781 975661 977845 977018
59336 977018 973892 968414 960109 948852 934984 918926 901083 882080 862791 844085 826593 810582
59324 810582 795942 782463 770232 759505 750082 741220 732540 724631 718243 713088 708061 702539 696957
59311 696957 692133 688683 687102 687664 689939 692981 696419 700994 707712 716797 727661 739270 749968 757312
59297 757312 758935 753852 742869 727911 711190 694670 679614 666345 654648 644501 636390 630920
59285 630920 628241 627778 628502 629677 631423 634408 638933 644667 651347 659325 668960 679863 691171 702434
59271 702434 713789 725416 737243 749076 760489 770610 778593 784431 788894 792417 794437 794026 790936
59258 790936 785772 779381 772391 765216 758159 751366 744784 738309 732063 726602 722730 720922 720900 721882 723268
$$ packed form
59348H25303J8259J8403J8781J8982J8198J6357J4162J1987R349N880K184q27
59336I77018l126n478q305j1257j3868j6058j7843j9003j9289j8706j7492j6011
59324H10582j4640j3479j2231j0727r423q862q680p909o388n155n027n522n582
59311F96957m824l450j581N62K275L042L438M575O718R085J0864J1609J0698P344
59297G57312J623n083j0983j4958j6721j6520j5056j3269j1697j0147q111n470
59285F30920k679m63P24J175J746K985M525N734O680P978R635J0903J1308J1263
59271G02434J1355J1627J1827J1833J1413J0121P983N838M463L523K020m11l090
59258G90936n164o391o990p175p057o793o582o475o246n461l872j808k2R82J386
$$ plain form
59243 723268 724965 727099 729641 732450 735493 738860 742646 746935 751805 757086 762092 765813 767565 767414
59229 767414 765817 762903 758334 751905 744022 735438 726634 717646 708346 698683 688766 678975 669899 661893
59215 661893 654745 647976 641431 635282 629608 624394 619872 616375 613724 611300 608885 606984 606043 605770 605547
59200 605547 605195 605009 605293 606079 607062 607643 607457 607121 607993 610758 614607 618230 621287 624444 628312 632927
59184 632927 638120 643773 649702 655622 661195 665970 669648 672783 676772 682460 689006 694794 699320 703476
59170 703476 708090 712971 717489 721391 724799 727932 730995 733942 736286 737594 738149 738450 738058 735643 730420
59155 730420 722895 713931 703779 692491 680654 669098 658209 648013 638639 630236 622672 615753 609527
59142 609527 604019 598910 593906 589193 585081 581369 577541 573519 569757 566555 563762 561295 559587 559222
$$ packed form
59243G23268J697K134K542K809L043L367L786M289M870N281N006L721J752j51
59229G67414j597k914m569o429p883q584q804q988r300r663r917r791r076q006
59215F61893p148o769o545o149n674n214m522l497k651k424k415j901r41k73k23
59200F05547l52j86K84P86R83N81j86l36Q72K765L849L623L057L157L868M615
59184F32927N193N653N929N920N573M775L678L135L989N688O546N788M526M156
59170G03476M614M881M518L902L408L133L063K947K344J308N55L01l92k415n223
59155G30420p525q964j0152j1288j1837j1556j0889j0196r374q403p564o919o226
59142F09527n508n109n004m713m112l712l828m022l762l202k793k467j708l65
$$ plain form
59128 559222 560232 561983 563828 565769 568367 571974 576285 580836 585824 592047 599947 609077 618656 628335
59114 628335 638193 648283 658513 668861 679385 689968 700161 709285 716735 722444 727132 731783 736654
59101 736654 740973 743765 744703 743966 741642 737758 732750 727457 722595 718482 715203 712701 710752 709131 707835
59086 707835 706877 705874 704229 701791 698960 696009 692564 688046 682348 675865 669023 662112 655494 649610
59072 649610 644678 640555 636914 633376 629516 625074 620363 616172 612982 610353 607380 603714 599849 596445
59058 596445 593668 591244 588829 586185 583259 580312 577773 575775 574016 572220 570481 568971 567629 566455
59044 566455 565860 566252 567378 568493 569166 569592 570194 571318 573232 575936 578950 581761 584608 588389 593651
59029 593651 600135 607547 616240 626688 638658 651529 665284 680561 697550 715208 731863 746363
$$ packed form
59128E59222J010J751J845J941K598L607M311M551M988O223P900R130R579R679
59114F28335R858J0090J0230J0348J0524J0583J0193R124P450N709M688M651M871
59101G36654M319K792R38p37k324l884n008n293m862m113l279k502j949j621j296
59086G07835r58j003j645k438k831k951l445m518n698o483o842o911o618n884
59072F49610m932m123l641l538l860m442m711m191l190k629k973l666l865l404
59058E96445k777k424k415k644k926k947k539j998j759j796j739j510j342j174
59044E66455n95L92J126J115O73M26O02J124J914K704L014K811K847L781N262
59029E93651O484P412Q693J0448J1970J2871J3755J5277J6989J7658J6655J4500
$$ plain form
59017 746363 758388 767713 773632 775368 773002 767677 760768 753038 744721 736164 728098 721303 716283 713231
59003 713231 712050 712417 714052 716889 720817 725328 729738 733743 737416 740666 743086 744454 745041 745291 745445
58988 745445 745613 745856 746017 745751 745030 744407 744472 745196 746122 747152 748841 751867 756410 762226 769210 777631 787673
58971 787673 798853 810169 820926 831206 841350 851245 860487 869123 877771 886872 896027 904177 910317
58958 910317 913975 915199 914134 910665 904595 896159 885987 874342 860847 845405 829056 813328 798903
58945 798903 785540 773154 762256 753302 746284 741061 737363 734319 730761 726402 722140 718876 716557
58932 716557 714755 713540 713297 714074 715622 717668 719733 721061 721220 720469 719135 717009 713842 710074 706450
58917 706450 703123 699731 696295 693541 692306 692968 695343 698898 703147 708052 713908 720716 728067 735929
$$ packed form
59017G46363J2025R325N919J736k366n325o909p730q317q557q066o795n020l052
59003G13231j181L67J635K837L928M511M410M005L673L250K420J368N87K50J54
58988G45445J68K43J61k66p21o23O5P24R26J030J689L026M543N816O984Q421J0042
58971G87673J1180J1316J0757J0280J0144R895R242Q636Q648R101R155Q150O140
58958I10317L658J224j065l469o070q436j0172j1645j3495j5442j6349j5728j4425
58945G98903j3363j2386j0898q954p018n223l698l044l558m359m262l264k319
58932G16557j802j215k43P77J548K046K065J328J59p51j334k126l167l768l624
58917G06450l327l392l436k754j235O62K375L555M249M905N856O808P351P862
$$ plain form
58903 735929 745080 756244 769112 782727 796520 810304 823527 835354 845676 855478 866051 878223
58891 878223 892381 908705 927031 946720 966891 986788 1005896 1023829 1040032 1053557 1063362 1069048
58879 1069048 1071093 1070096 1066065 1058776 1048611 1036479 1022989 1008208 992361 976322 961243 947897
58867 947897 936425 926486 917594 909465 902128 895645 889755 883894 877463 870056 861662 852779 844071 835727
58853 835727 827452 819260 811865 805890 801026 796433 791701 786835 781529 775147 767473 758947 750011 740646
58839 740646 730680 720264 709884 700100 691228 683139 675509 668473 662785 659021 656850 655499 654681 654631
58825 654631 655480 657200 659957 663777 667928 671430 674293 677557 681821 686459 690596 694191 697623 700647
58811 700647 702431 702507 701228 699308 697259 695243 693212 691028 688453 685042 680223 673772 666279 658904 652484
$$ packed form
58903G35929R151J1164J2868J3615J3793J3784J3223J1827J0322R802J0573J2172
58891H78223J4158J6324J8326J9689K0171J9897J9108J7933J6203J3525R805N686
58879A069048K045r97m031p289j0165j2132j3490j4781j5847j6039j5079j3346
58867I47897j1472r939q892q129p337o483n890n861o431p407q394q883q708q344
58853H35727q275q192p395n975m864m593m732m866n306o382p674q526q936r365
58839G40646r966j0416j0380r784q872q089p630p036n688l764k171j351q18n0
58825F54631Q49J720K757L820M151L502K863L264M264M638M137L595L432L024
58811G00647J784P6j279j920k049k016k031k184k575l411m819o451p493p375o420
$$ plain form
58796 652484 646998 641930 637007 632450 628583 625352 622344 619390 616998 615860 615923 616415 617002 618394 621294
58781 621294 625191 628917 632127 635458 639263 643028 646153 648556 650150 650404 648888 645853 641879 637312
58767 637312 632358 627354 622526 617762 613005 608707 605482 603445 602191 601413 601254 602021 603755 606123 608708
58752 608708 611373 614242 617247 619855 621494 622166 622408 622714 623324 624519 626617 629539 632801 636154 639930
58737 639930 644533 649801 655096 659845 663944 667918 672741 679103 686593 693899 700098 705505 710939 716359
58723 716359 720658 722889 723485 724142 726490 730824 736114 741207 745895 750651 755531 759729 762270 762858 761939
58708 761939 760168 757872 754826 750405 744068 735721 725485 713317 699262 684019 668748 654118 639932
58695 639932 625883 612271 599662 588236 577943 569023 561808 555979 550554 544870 539333 534821 531423
$$ packed form
58796F52484n486n068m923m557l867l231l008k954k392j138O3M92N87J392K900
58781F21294L897L726L210L331L805L765L125K403J594K54j516l035l974m567
58767F37312m954n004m828m764m757m298l225k037j254p78j59P67J734K368K585
58752F08708K665K869L005K608J639O72K42L06O10J195K098K922L262L353L776
58737F39930M603N268N295M749M099L974M823O362P490P306O199N407N434N420
58723G16359M299K231N96O57K348M334N290N093M688M756M880M198K541N88r19
58708G61939j771k296l046m421o337q347j0236j2168j4055j5243j5271j4630j4186
58695F39932j4049j3612j2609j1426j0293q920p215n829n425n684n537m512l398
$$ plain form
58682 531423 528145 524021 519288 515168 512619 511618 511598 512110 512925 514006 515704 518633 523005 528383 534423
58667 534423 541452 549968 559934 571056 583302 596404 609154 619940 627901 632944 634888 633504 629358
58654 629358 623677 617165 609686 601274 592689 584764 577929 572528 568793 566233 563911 561719 560559 560821
58640 560821 561552 561720 561574 561993 563176 564755 566602 568569 569806 569350 567315 564692 562028 558997 555359
58625 555359 551661 548808 547319 547098 547605 548334 549424 551721 555957 561976 569101 576961 585376 593550 600108
58610 600108 604257 606516 608036 609414 610381 610480 609814 609031 608659 608590 608318 607499 606033 603849 601120 598741 597850
58593 597850 598531 599556 599911 600170 601842 605711 611433 618478 626717 636131 646576 657966 670155 682487
58579 682487 693968 704094 713210 721843 730025 737487 744336 751258 759122 768528 779645 792395 806791
$$ packed form
58682E31423l278m124m733m120k549j001k0N12Q15J081J698K929M372N378O040
58667E34423P029Q516R966J1122J2246J3102J2750J0786P961N043J944j384m146
58654F29358n681o512p479q412q585p925o835n401l735k560k322k192j160K62
58640E60821P31J68j46M19J183J579J847J967J237m56k035k623k664l031l638
58625E55359l698k853j489k21N07P29J090K297M236O019P125P860Q415Q174O558
58610F00108M149K259J520J378R67R9o66p83l72o9k72q19j466k184k729k379q91
58593E97850O81J025L55K59J672L869N722P045Q239R414J0445J1390J2189J2332
58579F82487J1481J0126R116Q633Q182P462O849O922P864R406J1117J2750J4396
$$ plain form
58566 806791 823123 841815 863100 886782 912226 938581 964997 990644 1014474 1035196 1051775
58555 1051775 1063971 1072099 1076333 1076634 1073523 1068461 1063063 1058012 1052980 1047436 1041285 1034708 1027531 1018830
58541 1018830 1007276 992112 973854 953840 933085 911848 890276 869039 849124 831282 815867
58530 815867 802916 792155 783150 775710 769982 765999 763250 760894 758362 755716 753523 752245 751518 750129
58516 750129 747112 742825 738593 735279 732672 730205 727686 725166 722676 720386 718562 717123 715659 714125
58502 714125 713053 712748 712718 712171 710788 708812 706797 705499 705539 706853 708811 711070 713909 717621 722129 727435
58486 727435 733903 741764 750876 761250 773225 786817 801520 817089 833817 851511 868775 883904
58474 883904 895985 904642 909367 909815 906316 899486 889719 877674 864836 852904 842900 835262 830277
$$ packed form
58566H06791J6332J8692K1285K3682K5444K6355K6416K5647K3830K0722J6579
58555A051775J2196Q128M234L01l111n062n398n051n032n544o151o577p177q701
58541A018830j1554j5164j8258k0014k0755k1237k1572k1237j9915j7842j5415
58530H15867j2951j0761r005p440n728l983k749k356k532k646k193j278p27j389
58516G50129l017m287m232l314k607k467k519k520k490k290j824j439j464j534
58502G14125j072l05l0n47j383j976k015j298M0J314J958K259K839L712M508N306
58486G27435O468P861R112J0374J1975J3592J4703J5569J6728J7694J7264J5129
58474H83904J2081Q657M725M48l499o830r767j2045j2838j1932j0004p638m985
$$ plain form
58461 830277 827812 827126 827768 830337 835725 843917 854117 865625 877855 889866 900634 909576 916224
58448 916224 919753 919555 915973 909808 901467 891319 880520 870569 862266 855880 851952 850939 852129 853982
58434 853982 855706 857756 860664 864204 867981 872248 877809 885289 894544 904550 914036 922410 929815 936010
58420 936010 939783 940020 936923 931596 924791 916724 907752 898425 889069 879877 871165 863010 855066 847358
58406 847358 840754 835903 832221 828797 825859 824369 824525 825683 827490 830018 832956 835788 838774 842736
58392 842736 847760 852868 857042 859911 861608 862727 864213 866469 868684 869870 870347 871314 873216 875542 878074
58377 878074 881256 885362 890335 896485 904343 913718 923743 933923 944382 955176 966237 977867 990344
58364 990344 1003139 1015460 1027521 1040250 1053779 1067212 1079899 1091833 1102718 1111645 1118023 1122216
$$ packed form
58461H30277k465o86O42K569N388Q192J0200J1508J2230J2011J0768Q942O648
58448I16224L529j98l582o165q341j0148j0799r951q303o386l928j013J190J853
58434H53982J724K050K908L540L777M267N561P480R255J0006R486Q374P405O195
58420I36010L773K37l097n327o805q067q972r327r356r192q712q155p944p708
58406H47358o604m851l682l424k938j490J56J158J807K528K938K832K986L962
58392H42736N024N108M174K869J697J119J486K256K215J186M77R67J902K326K532
58377H78074L182M106M973O150P858R375J0025J0180J0459J0794J1061J1630J2477
58364I90344J2795J2321J2061J2729J3529J3433J2687J1934J0885Q927O378M193
$$ plain form
58352 1122216 1125165 1127874 1130927 1133850 1135401 1135349 1135452 1137682 1142151 1148001 1155532 1165725 1178120 1191112
58338 1191112 1204323 1218942 1235601 1253562 1272048 1290724 1308735 1325023 1339819 1354136 1367537
58327 1367537 1378168 1385294 1390046 1393352 1395058 1395608 1396630 1398972 1401839 1404664 1408245 1413289 1419511 1426944
58313 1426944 1436416 1447771 1459335 1470263 1481913 1495719 1511190 1527239 1544068 1562296 1581365
58302 1581365 1600245 1618947 1638106 1657662 1676971 1695700 1713986 1732336 1751700 1772739 1794730
58291 1794730 1816268 1837379 1859660 1884066 1909961 1936750 1964780 1994073 2023919 2054442 2086915
58280 2086915 2121730 2157696 2194113 2231809 2271279 2311703 2352847 2396015 2441832 2488894 2535985
58269 2535985 2584014 2634377 2687000 2741377 2797959 2857141 2918339 2981364 3047140 3115714 3185232
$$ packed form
58352A122216K949K709L053K923J551n2J03K230M469N850P531J0193J2395J2992
58338A191112J3211J4619J6659J7961J8486J8676J8011J6288J4796J4317J3401
58327A367537J0631P126M752L306J706N50J022K342K867K825L581N044O222P433
58313A426944R472J1355J1564J0928J1650J3806J5471J6049J6829J8228J9069
58302A581365J8880J8702J9159J9556J9309J8729J8286J8350J9364K1039K1991
58291A794730K1538K1111K2281K4406K5895K6789K8030K9293K9846L0523L2473
58280B086915L4815L5966L6417L7696L9470M0424M1144M3168M5817M7062M7091
58269B535985M8029N0363N2623N4377N6582N9182O1198O3025O5776O8574O9518
$$ plain form
58258 3185232 3254246 3323437 3393761 3464712 3535938 3608814 3684720 3763463 3844982 3930914 4022740
58247 4022740 4120064 4222349 4330652 4445920 4567434 4694747 4829409 4972903 5124634 5283835
58237 5283835 5451681 5629710 5818015 6016882 6228212 6453442 6692186 6944965 7214951
58228 7214951 7504829 7814273 8142894 8493398 8869442 9272967 9706344 10174648 10683022
58219 10683022 11234297 11832056 12483497 13196547 13977266 14833337 15777171 16822496 17981664
58210 17981664 19270440 20712446 22335658 24169336 26250097 28628838 31369594 34549748
58202 34549748 38270870 42668035 47903889 54157531 61622232 70502876 81002797 93318277
58194 93318277 107660911 124291332 143536966 165797902 191541041 221218051 255020363
$$ packed form
58258C185232O9014O9191P0324P0951P1226P2876P5906P8743Q1519Q5932R1826
58247D022740R7324J02285J08303J15268J21514J27313J34662J43494J51731J59201
58237E283835J67846J78029J88305J98867K11330K25230K38744K52779K69986
58228G214951K89878L09444L28621L50504L76044M03525M33377M68304N08374
58219A0683022N51275N97759O51441P13050P80719Q56071R43834J045325J159168
58210A7981664J288776J442006J623212J833678K080761K378741K740756L180154
58202C4549748L721122M397165N235854O253642P464701Q880644J0499921J2315480
58194I3318277J4342634J6630421J9245634K2260936K5743139K9677010L3802312
$$ plain form
58187 255020363 292478541 332043790 370852235 404872812 429581334 441095107 437361154
58180 437361154 418809830 388139624 349421466 307026011 264774208 225442038 190608595
58173 190608595 160804483 135851286 115215069 98245919 84301443 72810309 63300011
58166 63300011 55390023 48771095 43194801 38468426 34440843 30986870 28003674 25412063
58158 25412063 23149843 21163080 19406329 17845955 16456048 15212185 14092664 13082258
58150 13082258 12169566 11342528 10590263 9906474 9286533 8723076 8208110 7737112 7306908
58141 7306908 6911342 6543050 6198082 5875166 5571836 5285074 5014781 4762958 4529777
58132 4529777 4313213 4111889 3925507 3752940 3592358 3442855 3303909 3173919 3051275
$$ packed form
58187B55020363L7458178L9565249L8808445L4020577K4708522J1513773l733953
58180D37361154j8551324l0670206l8718158m2395455m2251803l9332170l4833443
58173A90608595k9804112k4953197k0636217j6969150j3944476j1491134r510298
58166F3300011p909988o618928n576294m726375m027583l453973k983196k591611
58158B5412063k262220j986763j756751j560374j389907j243863j119521j010406
58150A3082258r12692q27038p52265o83789o19941n63457n14966m70998m30204
58141G306908l95566l68292l44968l22916l03330k86762k70293k51823k33181
58132D529777k16564k01324j86382j72567j60582j49503j38946j29990j22644
$$ plain form
58123 3051275 2936112 2829076 2729084 2634179 2543764 2458202 2377051 2299535 2225893 2156378 2089810
58112 2089810 2025019 1962927 1905214 1851504 1799718 1748713 1698892 1650688 1604145 1559604 1517315
58101 1517315 1476669 1437039 1398782 1362224 1326439 1290423 1254764 1220781 1188740 1158332 1130108
58090 1130108 1104862 1082218 1061355 1042553 1026414 1012066 997679 982456 966743 950628 933842
58079 933842 916666 899547 882120 863900 845526 828011 811197 794348 777808 762601 748641
58068 748641 734902 721269 708790 698009 688338 679208 670776 663385 657226 652460 648751 644808 639325
58055 639325 632286 624585 616611 608169 599500 591358 584138 577755 572161 567158 561998 556033 549487 542788
58041 542788 535596 527452 518888 510821 503267 495781 488731 482817 477664 472301 466827 462172 458232 453727
$$ packed form
58123C051275j15163j07036r9992r4905r0415q5562q1151p7516p3642o9515o6568
58112B089810o4791o2092n7713n3710n1786n1005m9821m8204m6543m4541m2289
58101A517315m0646l9630l8257l6558l5785l6016l5659l3983l2041l0408k8224
58090A130108k5246k2644k0863j8802j6139j4348j4387j5223j5713j6115j6786
58079I33842j7176j7119j7427j8220j8374j7515j6814j6849j6540j5207j3960
58068G48641j3739j3633j2479j0781r671r130q432p391o159m766l709l943n483
58055F39325p039p701p974q442q669q142p220o383n594n003n160n965o546o699
58041E42788p192q144q564q067p554p486p050n914n153n363n474m655l940m505
$$ plain form
58027 453727 448076 441960 435683 428381 419507 409988 401205 393688 387419 382587 379247 376760 374350 371945
58013 371945 369977 368511 367098 365489 364180 363976 364947 366024 366030 365110 364644 365562 367340 368934 370000 370665
57997 370665 370824 370405 369835 369428 368719 367142 365033 363189 361780 360413 358955 357541 356124 354666 353425
57982 353425 352304 350420 347169 343240 339653 336269 332318 328005 324410 321994 320390 319461 319366 319578 319027
57967 319027 317416 315459 313773 312433 311567 311416 311799 312449 313738 315998 318242 318849 317656 316134 315265 314495
57951 314495 313073 311158 309115 306875 304694 303572 304242 306413 309512 313469 318340 323892 330034 336971
57937 336971 344601 352500 360808 370172 380307 389500 396246 400611 403358 404515 403579 400547 395835 389556
57923 389556 381687 372735 363577 354788 346590 339208 332757 326947 321363 315991 311186 307325 304714 303581
$$ packed form
58027D53727n651o116o277p302q874r519q783p517o269m832l340k487k410k405
58013C71945j968j466j413j609j309k04R71J077Or20m66R18J778J594J066O65
57997C70665J59m19n70m07p09j577k109j844j409j367j458j414j417j458j241
57982C53425j121j884l251l929l587l384l951m313l595k416j604r29r5K12n51
57967C19027j611j957j686j340q66j51L83O50J289K260K244O07j193j522q69p70
57951C14495j422j915k043k240k181j122O70K171L099L957M871N552O142O937
57937C36971P630P899Q308R364J0135R193O746M365K747J157r36l032m712o279
57923C89556p869q952r158q789q198p382o451n810n584n372m805l861k611j133
$$ plain form
57909 303581 303850 305124 307093 309789 313284 317406 321839 326135 329539 331280 331373 330793 330568 330941 331511 331870
57893 331870 331893 331758 331927 332851 334505 336380 337887 338551 337986 336216 334020 332336 331179 329656 327117 323788
57877 323788 320187 316531 312874 309258 305503 301418 297379 294128 291875 290251 289301 289731 291892 295227 299091
57862 299091 303374 307958 312391 316721 321931 328762 336561 343948 350258 355726 360603 364740 367866 369746
57848 369746 370223 369478 368074 366422 364454 362018 359214 356097 352467 348293 343868 339277 334259 328998 324506
57833 324506 321664 320303 319672 319337 319058 318303 316662 314565 312983 312526 313133 314267 314996 314358 312248 309640
57817 309640 307403 305318 302705 299492 295873 291437 285602 278692 271659 264844 257889 250825 244307 238681
57803 238681 233715 229454 226419 224569 222869 220557 218382 217914 219766 223043 226513 229868 233655 238254
$$ packed form
57909C03581K69J274J969K696L495M122M433M296L404J741R3n80k25L73N70L59
57893C31870K3j35J69R24J654J875J507O64n65j770k196j684j157j523k539l329
57877C23788l601l656l657l616l755m085m039l251k253j624r50M30K161L335L864
57862B99091M283M584M433M330N210O831P799P387O310N468M877M137L126J880
57848C69746M77p45j404j652j968k436k804l117l630m174m425m591n018n261m492
57833C24506k842j361o31l35k79p55j641k097j582m57O07J134P29o38k110k608
57817C09640k237k085k613l213l619m436n835o910p033o815o955p064o518n626
57803B38681m966m261l035j850j700k312k175m68J852L277L470L355L787M599
$$ plain form
57789 238254 243245 247826 251608 254815 257937 261563 266429 273012 280856 288781 296060 303009 310189 317463
57775 317463 324209 329960 334381 337098 338145 338262 338092 337325 335260 331963 328199 324310 319911 314712 308993
57760 308993 303182 297530 292266 287545 283184 278983 275418 273397 273092 273498 273476 272877 272354 272379 272875 273683 275004
57743 275004 277169 280019 282737 284470 285135 285336 285515 285517 285163 284739 284620 284789 285160 286004 287546 289417 291049
57726 291049 292412 293770 294925 295385 295220 295128 295563 296308 296909 297009 296295 294670 292545 290410 288093 284983
57710 284983 281052 277046 273467 269939 265905 261461 257185 253469 250341 247689 245414 243462 241873 240688
57696 240688 239890 239560 239928 240836 241251 239877 236485 232278 228790 226625 225359 224439 223996 224840 227572 231800
57680 231800 236639 242154 249705 260426 274023 289824 308340 330691 356963 386615 420465 460630
$$ packed form
57789B38254M991M581L782L207L122L626M866O583P844P925P279O949P180P274
57775C17463O746N751M421K717J047J17j70p67k065l297l764l889m399n199n719
57760C08993n811n652n264m721m361m201l565k021l05M06k2n99n23K5M96Q08J321
57743B75004K165K850K718J733O65K01J79Kl54m24j19J69L71Q44J542J871J632
57726B91049J363J358J155M60j65r2M35P45O01J00p14j625k125k135k317l110
57710B84983l931m006l579l528m034m444m276l716l128k652k275j952j589j185
57696B40688p98l30L68R08M15j374l392m207l488k165j266r20m43Q44K732M228
57680B31800M839N515P551J0721J3597J5801J8516K2351K6272K9652L3850M0165
$$ plain form
57668 460630 507811 559592 611687 659497 697915 721299 725588 710435 678749 634757 583232 529555
57656 529555 478744 433920 396082 365049 340046 319875 303581 290943 281735 274841 268945 263852
57644 263852 260113 257398 254337 250225 245981 242955 241399 240502 239406 237790 235853 234093 232905 232157 231417
57629 231417 230643 230283 230567 231058 231154 230672 229715 228268 226261 223862 221473 219508 218241 217666 217390 216877 215971
57612 215971 215004 214348 214055 214052 214404 215121 215908 216381 216462 216329 215993 215082 213179 210329 207177 204532 202725 201387
57594 201387 199920 198086 196023 193813 191335 188662 186310 184900 184545 184681 184446 183242 181028 178259 175567
57579 175567 173428 171947 170750 169155 166716 163778 161266 159687 158578 157238 155731 154659 154010 152963
57565 152963 151066 149025 147872 147727 147918 148090 148574 149616 150842 151708 152124 152367 152650 153101 153979 155551 157694
$$ packed form
57668D60630M7181N1781N2095M7810L8418K3384M289j5153l1686m3992n1525n3677
57656E29555n0811m4824l7838l1033k5003k0171j6294j2638r208o894n896n093
57644B63852l739k715l061m112m244l026j556q97j096j616j937j760j188p48p40
57629B31417p74l60K84M91R6m82r57j447k007k399k389j965j267n75k76n13r06
57612B15971r67o56k93lL52P17P87M73Q1j33l36r11j903k850l152k645j807j338
57594B01387j467j834k063k210k478k673k352j410l55J36k35j204k214k769k692
57579A75567k139j481j197j595k439k938k512j579j109j340j507j072o49j047
57565A52963j897k041j153j45J91J72M84J042J226Q66M16K43K83M51Q78J572K143
$$ plain form
57548 157694 159907 161817 163532 165390 167500 169693 171884 174326 177356 180951 184607 187680 189817 190986
57534 190986 191230 190583 189314 188016 187212 186922 186862 187000 187582 188534 189236 189198 188740 188690 189547 191249 193636 196646
57516 196646 199997 203162 205873 208386 210975 213411 215278 216623 217965 219645 221456 222929 223787 224008 223670
57501 223670 222893 221836 220545 218794 216339 213448 210956 209488 208688 207551 205627 203492 201885 200832 200041
57486 200041 199718 200261 201292 201738 201032 199651 198355 197520 197393 198252 199785 200895 200751 199715 198636 197603
57470 197603 196076 193997 191978 190381 188945 187467 186236 185548 185276 185186 185298 185645 186100 186765 188210 190831
57454 190831 194059 196634 197833 198224 199074 200992 203319 204935 205611 206281 207879 210221 212331 213667 214616
57439 214616 215877 217849 220626 224046 227510 230188 231804 232998 234607 236706 238653 239949 240730 241436 242316
$$ packed form
57548A57694K213J910J715J858K110K193K191K442L030L595L656L073K137J169
57534A90986K44o47j269j298q04k90o0J38N82R52P02l8m58n0Q57J702K387L010
57516A96646L351L165K711K513K589K436J867J345J342J680J811J473Q58K21l38
57501B23670p77j057j291j751k455k891k492j468q00j137j924k135j607j053p91
57486B00041l23N43J031M46p06j381j296q35j27Q59J533J110j44j036j079j033
57470A97603j527k079k019j597j436j478j231o88k72r0J12L47M55O65J445K621
57454A90831L228K575J199L91Q50J918K327J616O76O70J598K342K110J336R49
57439B14616J261J972K777L420L464K678J616J194J609K099J947J296P81P06Q80
$$ plain form
57424 242316 243325 244331 245254 246106 247012 248215 249891 251850 253510 254382 254634 254979 255940 257419 259080 260831
57408 260831 262715 264659 266725 269350 272794 276439 279238 280887 282018 283158 284135 284736 285341 286418 287879
57393 287879 289412 291160 293548 296656 300172 303822 307437 310797 313847 316984 320650 324718 328641 332144
57379 332144 335365 338415 341319 344299 347553 350672 352928 354376 356101 358951 362456 365517 367828 370080
57365 370080 372953 376470 380403 384696 389175 393214 396155 398059 399781 402182 405386 408888 412326 415951
57351 415951 420212 425021 429723 433908 438003 442810 448517 454422 459654 463982 467864 471866 476177 480611
57337 480611 484973 489336 493927 498689 503190 507229 511423 516706 523129 529615 535307 540707 546945 554134
57323 554134 561219 567471 573295 579308 585347 591048 596758 603094 609825 616072 621593 627110 633200 639541
$$ packed form
57424B42316J009J006R23Q52R06J203J676J959J660Q72K52L45R61J479J661J751
57408B60831J884J944K066K625L444L645K799J649J131J140R77O01O05J077J461
57393B87879J533J748K388L108L516L650L615L360L050L137L666M068L923L503
57379C32144L221L050K904K980L254L119K256J448J725K850L505L061K311K252
57365C70080K873L517L933M293M479M039K941J904J722K401L204L502L438L625
57351D15951M261M809M702M185M095M807N707N905N232M328L882M002M311M434
57337D80611M362M363M591M762M501M039M194N283O423O486N692N400O238P189
57323E54134P085O252N824O013O039N701N710O336O731O247N521N517O090O341
$$ plain form
57309 639541 645541 651186 656934 663199 670215 677983 685996 693443 700121 706782 714120 721730 728675 734850
57295 734850 741126 748158 755661 763058 770300 777727 785470 793302 800957 808336 815487 822589 829981 838112
57281 838112 847290 857422 868013 878693 889842 902393 916771 932260 947803 963231 979267 996430
57269 996430 1014493 1033040 1051942 1071057 1090024 1108730 1127603 1147043 1166880 1186855 1207296
57258 1207296 1228724 1250825 1272412 1292647 1311959 1331530 1352099 1373425 1394703 1415215 1434670
57247 1434670 1453259 1471627 1490632 1510845 1532088 1553587 1574707 1595552 1616769 1638945 1662338
57236 1662338 1686980 1712651 1738775 1764808 1790850 1817560 1845325 1873879 1902901 1932518 1962770
57225 1962770 1993020 2022501 2051335 2080453 2110443 2141034 2171784 2202797 2234502 2267130 2300732
$$ packed form
57309F39541O000N645N748O265P016P768Q013P447O678O661P338P610O945O175
57295G34850O276P032P503P397P242P427P743P832P655P379P151P102P392Q131
57281H38112R178J0132J0591J0680J1149J2551J4378J5489J5543J5428J6036J7163
57269I96430J8063J8547J8902J9115J8967J8706J8873J9440J9837J9975K0441
57258A207296K1428K2101K1587K0235J9312J9571K0569K1326K1278K0512J9455
57247A434670J8589J8368J9005K0213K1243K1499K1120K0845K1217K2176K3393
57236A662338K4642K5671K6124K6033K6042K6710K7765K8554K9022K9617L0252
57225A962770L0250K9481K8834K9118K9990L0591L0750L1013L1705L2628L3602
$$ plain form
57214 2300732 2335417 2371218 2407844 2444844 2481942 2518954 2555549 2591436 2626880 2662749 2699855
57203 2699855 2738246 2777123 2815313 2851872 2886499 2919731 2952657 2986184 3020359 3054480 3087939
57192 3087939 3120876 3153971 3187755 3222341 3257698 3293907 3331056 3369171 3408393 3449053 3491376
57181 3491376 3535133 3579732 3624647 3669696 3714947 3760364 3805482 3849466 3891686 3932279 3972010
57170 3972010 4011500 4050733 4089343 4127155 4164336 4201252 4238321 4275743 4313196 4350047 4386063
57159 4386063 4421651 4457056 4491602 4524146 4554106 4581601 4606688 4629068 4648704 4666252 4682572
57148 4682572 4697941 4711947 4723966 4733563 4740465 4744272 4744358 4740146 4731482 4718584 4701695 4681128 4657791
57135 4657791 4633274 4609091 4586095 4564869 4546405 4531965 4522529 4518769 4521303 4530418 4545583 4565519
$$ packed form
57214B300732L4685L5801L6626L7000L7098L7012L6595L5887L5444L5869L7106
57203B699855L8391L8877L8190L6559L4627L3232L2926L3527L4175L4121L3459
57192C087939L2937L3095L3784L4586L5357L6209L7149L8115L9222M0660M2323
57181C491376M3757M4599M4915M5049M5251M5417M5118M3984M2220M0593L9731
57170C972010L9490L9233L8610L7812L7181L6916L7069L7422L7453L6851L6016
57159D386063L5588L5405L4546L2544K9960K7495K5087K2380J9636J7548J6320
57148D682572J5369J4006J2019R597O902L807Q6m212q664j2898j6889k0567k3337
57135D657791k4517k4183k2996k1226j8464j4440r436l760K534R115J5165J9936
$$ plain form
57123 4565519 4588554 4612537 4634853 4653198 4666333 4673866 4675984 4674227 4672134 4674151 4683907 4704159
57111 4704159 4737700 4786919 4852424 4933435 5029886 5143584 5277829 5437662 5631019 5868609
57101 5868609 6162572 6526497 6976898 7533125 8215251 9042758 10034011 11203202 12555476
57092 12555476 14085549 15780849 17623716 19590723 21653857 23784452 25953657 28129180
57084 28129180 30277296 32368725 34369249 36208803 37761897 38879056 39457786 39491323
57076 39491323 39052037 38232351 37098571 35683959 34006061 32085741 29959450 27683235
57068 27683235 25326958 22962431 20654187 18456088 16409457 14540435 12859987 11367978
57060 11367978 10057433 8916267 7928616 7077388 6346059 5718508 5179069 4713991 4312269
$$ packed form
57123D565519K3035K3983K2316J8345J3135P533K118j757k093K017R756K0252
57111D704159L3541M9219O5505Q1011R6451J13698J34245J59833J93357K37590
57101E868609K93963L63925M50401N56227O82126Q27507R91253J169191J352274
57092A2555476J530073J695300J842867J967007K063134K130595K169205K175523
57084B8129180K148116K091429K000524J839554J553094J117159N78730L3537
57076C9491323m39286q19686j133780j414612j677898j920320k126291k276215
57068B7683235k356277k364527k308244k198099k046631j869022j680448j492009
57060A1367978j310545j141166r87651q51228p31329o27551n39439m65078m01722
$$ plain form
57051 4312269 3964623 3662476 3398304 3165988 2960182 2776000 2609639 2458449 2319881
57042 2319881 2191117 2070155 1956523 1850354 1751304 1658806 1572803 1493770 1422499 1360161
57032 1360161 1308051 1266792 1235985 1214607 1201101 1192764 1185467 1174278 1154224 1121106 1073082 1012228
57020 1012228 943949 874183 807175 745464 690624 643178 602433 567205 536555 509640 485516
57009 485516 463650 444200 427323 412580 399430 387838 377940 369404 361558 353910 346237 338574 331421
56996 331421 325657 321898 320084 319727 320170 320609 320617 320857 322672 326683 332505 340016 349919 362363 375757
56981 375757 387663 396263 400373 398909 391445 378947 363163 345619 327842 311744 298577 287792
56969 287792 278040 269216 262501 258639 257301 258203 261683 267944 276676 287771 301528 317756 335379
$$ packed form
57051D312269l47646l02147k64172k32316k05806j84182j66361j51190j38568
57042B319881j28764j20962j13632j06169r9050r2498q6003p9033p1271o2338
57032A360161n2110m1259l0807k1378j3506q337p297j1189k0054l3118m8024o0854
57020A012228o8279o9766o7008o1711n4840m7446m0745l5228l0650k6915k4124
57009D85516k1866j9450j6877j4743j3150j1592r898q536p846p648p673p663p153
56996C31421n764l759j814l57M43M39QK40J815M011N822P511R903J2444J3394
56981C75757J1906Q600M110j464p464j2498j5784j7544j7777j6098j3167j0785
56969B87792r752q824o715l862j338R02L480O261Q732J1095J3757J6228J7623
$$ plain form
56956 335379 353245 370569 386131 397708 402907 400375 390134 373416 352576 330603 309995 292059
56944 292059 277227 265586 256993 251263 248590 249366 253390 259931 268997 281888 299808 322308 347733
56931 347733 374783 402665 429647 452291 466681 470288 462741 445334 420285 390283 358182 326556
56919 326556 297201 270939 247952 228243 211686 197799 185906 175703 167357 160888 155729 151180
56907 151180 147076 143696 141172 139396 138394 138389 139396 141099 143246 145913 149302 153539 158831 165619 174323
56892 174323 185121 198191 214008 233055 255222 279871 306564 335305 365552 395066 420115
56881 420115 437171 444563 442869 434249 421522 407409 393982 382450 373400 367197 364233 365009 370130
56868 370130 380121 395084 414614 438300 466386 499863 539799 586440 638781 694731 751297 804273
$$ packed form
56956C35379J7866J7324J5562J1577N199k532j0241j6718k0840k1973k0608j7936
56944B92059j4832j1641q593n730k673P76M024O541R066J2891J7920K2500K5425
56931C47733K7050K7882K6982K2644J4390L607p547j7407k5049l0002l2101l1626
56919C26556k9355k6262k2987j9709j6557j3887j1893j0203q346o469n159m549
56907A51180m104l380k524j776j002nJ007J703K147K667L389M237N292O788Q704
56892A74323J0798J3070J5817J9047K2167K4649K6693K8741L0247K9514K5049
56881D20115J7056P392j694q620j2727j4113j3427j1532r050o203k964P76N121
56868C70130R991J4963J9530K3686K8086L3477L9936M6641N2341N5950N6566N2976
$$ plain form
56856 804273 847914 875852 883585 870693 840629 798508 749397 698334 650507 610168 579380 558340
56844 558340 546828 544909 552494 569054 594072 627556 670152 723042 787561 864210 951619 1046345
56832 1046345 1143156 1234773 1311516 1362629 1379639 1359586 1305863 1226659 1132414 1033423 938074
56821 938074 852088 778655 718899 672468 638436 616176 605359 605226 614477 632301 659164 696139
56809 696139 743525 800332 864491 932557 998881 1055683 1094701 1109400 1096546 1056915 995272
56798 995272 919313 837616 757581 684434 621166 568720 526380 492772 467105 449445 439805 437365
56786 437365 440992 450307 465765 487659 515381 547607 582603 617860 649552 672727 682532 675886
56774 675886 652792 616347 571254 521977 472031 424296 380995 343050 310130 281792 258115
$$ packed form
56856H04273M3641K7938P733j2892l0064m2121m9111n1063m7827m0339l0788k1040
56844E58340j1512j919P585J6560K5018L3484M2596N2890O4519P6649Q7409R4726
56832A046345R6811R1617P6743N1113J7010k0053n3723p9204r4245r8991r5349
56821I38074q5986p3433n9756m6431l4032k2260j0817j33R251J7824K6863L6975
56809F96139M7386N6807O4159O8066O6324N6802L9018J4699j2854l9631o1643
56798I95272p5959q1697q0035p3147o3268n2446m2340l3608k5667j7660r640k440
56786D37365L627R315J5458K1894K7722L2226L4996L5257L1692K3175R805o646
56774F75886k3094l6445m5093m9277m9946m7735m3301l7945l2920k8338k3677
$$ plain form
56763 258115 238907 223006 209102 196926 186891 178826 171843 165409 159773 155225 151582 148551 146025
56750 146025 143834 141610 139085 136159 132652 128481 124179 120739 118708 117768 117286 116877 116317 115421 114245
56735 114245 113070 112094 111462 111584 112790 114525 115563 115402 114888 114994 115536 115587 114806 113735 113036 113049 113998 115983
56717 115983 118645 121188 122893 123570 123585 123606 124162 125205 126186 126650 126586 126073 124933 123132 121285 120326 120615
56700 120615 121644 122645 123235 123490 123605 123640 123527 123239 122844 122381 121828 121355 121469 122594 124570 126870 129256
56683 129256 131807 134317 136210 137251 137833 138378 138952 139690 140992 142819 144298 144654 144234 144018 144351 144773
56667 144773 145013 145421 146333 147517 148495 149158 149848 150994 152698 154590 156095 156927 157254 157371 157408 157487 157831 158457
56649 158457 159035 159316 159532 160042 160791 161454 161971 162598 163520 164677 165843 166545 166105 164228 161558 159382 158668
$$ packed form
56763B58115j9208j5901j3904j2176j0035q065o983o434n636m548l643l031k526
56750A46025k191k224k525k926l507m171m302l440k031r40m82m09n60q96j176
56735A14245j175r76o32J22J206J735J038j61n14J06N42N1p81j071o99J3R49J985
56717A15983K662K543J705O77J5K1N56J043R81M64o4n13j140j801j847r59K89
56700A20615J029J001N90K55J15L5j13k88l95m63n53m73J14J125J976K300K386
56683A29256K551K510J893J041N82N45N74P38J302J827J479L56m20k16L33M22
56667A44773K40M08R12J184R78O63O90J146J704J892J505Q32L27J17L7P9L44O26
56649A58457N78K81K16N10P49O63N17O27R22J157J166P02m40j877k670k176p14
$$ plain form
56632 158668 159488 161162 162704 163319 162850 161724 160314 158550 156360 154155 152404 150895 148984 146564 144289
56617 144289 142796 142073 141737 141577 141699 142265 143207 144116 144482 144202 143731 143564 143723 143869 143709 143121 142180 141345
56599 141345 141264 142024 142932 143451 143974 145048 146222 146484 145757 145124 145430 146444 147576 148694 149779 150352 149812
56582 149812 148228 146439 145420 145607 146710 148136 149678 151647 154133 156424 157697 158134 158786 160374 162805
56567 162805 165825 169433 173499 177707 182215 187713 194380 201354 207647 213145 218214 222796 226411 228746
56553 228746 229693 229172 227487 225647 224664 224518 224263 223182 221385 219382 217537 216064 215048 214236 213130 211545
56537 211545 209897 208718 208004 207260 206131 204770 203463 202097 200198 197509 194317 191087 188050 185437 183845
56522 183845 183799 184852 185671 185376 184441 183950 184217 184623 184629 184367 184181 184102 184078 184378 185350 186906 188587 190146 191777
$$ packed form
56632A58668Q20J674J542O15m69j126j410j764k190k205j751j509j911k420k275
56617A44289j493p23l36j60J22N66R42R09L66k80m71j67J59J46j60n88r41q35
56599A41345q1P60R08N19N23J074J174K62p27o33L06J014J132J118J085N73n40
56582A49812j584j789j019J87J103J426J542J969K486K291J273M37O52J588K431
56567A62805L020L608M066M208M508N498O667O974O293N498N069M582L615K335
56553B28746R47n21j685j840r83j46k55j081j797k003j845j473j016q12j106j585
56537B11545j648j179p14p44j129j361j307j366j899k689l192l230l037k613j592
56522A83845m6J053Q19k95r35m91K67M06Ok62j86p9k4L00R72J556J681J559J631
$$ plain form
56503 191777 193686 195629 197012 197368 196668 195320 193983 193163 192799 192375 191634 191019 191056 191441 191235 189994 188320
56486 188320 187128 186815 187278 188251 189302 189895 189915 189872 190198 190596 190489 189872 189278 189090 189320 189935 190852 191733 192248
56467 192248 192579 193234 194327 195389 195841 195390 194051 192218 190618 189774 189499 189259 188901 188674 188708 188999 189754
56450 189754 191106 192563 193395 193632 194018 194914 195878 196472 196760 196847 196604 196198 196205 196770 197227 197005 196396 195972 195730
56431 195730 195419 195321 196028 197570 199275 200510 201194 201670 202365 203522 205035 206555 207860 208894 209449 209168
56415 209168 208104 206901 206118 205667 205259 205050 205421 206310 207328 208450 210111 212535 215319 217856 219923 221695
56399 221695 223299 224569 225277 225483 225527 225655 225819 225898 225931 225927 225655 224934 224079 223742 224302 225530 226755 227161 226248
56380 226248 224416 222918 222747 223667 224733 225506 226150 226646 226796 226957 227879 229583 231214 232236 232985 233825 234578
$$ packed form
56503A91777J909J943J383L56p00j348j337q20l64m24p41o15L7L85k06j241j674
56486A88320j192l13M63R73J051N93K0m3L26L98j07o17n94j88K30O15R17Q81N15
56467A92248L31O55J093J062M52m51j339j833j600q44k75k40l58k27L4K91P55
56450A89754J352J457Q32K37L86Q96R64N94K88Q7k43m06PN65M57k22o09m24k42
56431A95730l11r8P07J542J705J235O84M76O95J157J513J520J305J034N55k81
56415B09168j064j203p83m51m08k09L71Q89J018J122J661K424K784K537K067J772
56399B21695J604J270P08K06M4J28J64P9L3mk72p21q55l37N60J228J225M06r13
56380B26248j832j498j71R20J066P73O44M96J50J61R22J704J631J022P49Q40P53
$$ plain form
56363 234578 235227 236340 238245 240464 242523 244609 246840 248553 249121 249011 249238 250078 251018 251691 252182 252565
56347 252565 252767 252842 252964 253325 254296 256319 259185 261848 263513 264615 266231 268869 272383 276600 281238 285518
56331 285518 288668 290823 292805 295102 297598 300122 302586 304737 306467 308311 310899 313897 316184 317206
56317 317206 317508 317775 318055 318237 318676 319862 321780 324053 326552 329503 332994 336687 340153 343465 347276
56302 347276 352202 358153 364488 370748 376951 383125 388963 394144 398725 403013 407338 412052 417393 423131
56288 423131 428768 434270 440221 447047 454609 462751 471631 481101 490503 499631 509325 520424 532710 545638
56274 545638 559562 575294 592770 611154 630194 650559 672869 697207 723670 752630 784350
56263 784350 819007 857242 900066 948080 1001310 1059986 1125011 1197565 1278676 1369256 1470084
$$ packed form
56363B34578O49J113J905K219K059K086K231J713N68j10K27Q40R40O73M91L83
56347B52565K02P5J22L61R71K023K866K663J665J102J616K638L514M217M638M280
56331B85518L150K155J982K297K496K524K464K151J730J844K588K998K287J022
56317C17206L02K67K80J82M39J186J918K273K499K951L491L693L466L312L811
56302C47276M926N951O335O260O203O174N838N181M581M288M325M714N341N738
56288D23131N637N502N951O826P562Q142Q880R470R402R128R694J1099J2286J2928
56274E45638J3924J5732J7476J8384J9040K0365K2310K4338K6463K8960L1720
56263G84350L4657L8235M2824M8014N3230N8676O5025P2554Q1111R0580J00828
$$ plain form
56252 1470084 1581449 1702988 1833846 1972882 2118958 2271278 2429095 2590700 2753012
56243 2753012 2912674 3067030 3213282 3347098 3463227 3557663 3628439 3674284 3693568 3685158
56233 3685158 3649694 3589463 3507324 3406106 3288767 3158650 3019428 2874706 2727502 2580091
56223 2580091 2434373 2292215 2155250 2024533 1900679 1784184 1675429 1574625 1481988 1397623
56213 1397623 1320952 1250685 1185724 1125778 1070800 1020420 974417 933043 896127 862427 830778
56202 830778 801506 775783 753871 734899 718064 703028 689300 676251 663796 652236 641464
56191 641464 631192 621794 613943 607396 601116 594730 588927 584315 580761 578040 576175 574839 573258 571112
56177 571112 568919 567279 566343 566156 566858 568327 570223 572506 575357 578554 581647 584809 588798 593935 599780
$$ packed form
56252A470084J11365J21539J30858J39036J46076J52320J57817J61605J62312
56243B753012J59662J54356J46252J33816J16129R4436P0776M5845J9284q410
56233C685158l5464o0231q2139j01218j17339j30117j39222j44722j47204j47411
56223B580091j45718j42158j36965j30717j23854j16495j08755j00804r2637q4365
56213A397623p6671p0267o4961n9946n4978n0380m6003m1374l6916l3700l1649
56202H30778k9272k5723k1912j8972j6835j5036j3728j3049j2455j1560j0772
56191F41464j0272r398p851o547o280o386n803m612l554k721j865j336j581k146
56177E71112k193j640r36j87P02J469J896K283K851L197L093L162L989N137N845
$$ plain form
56162 599780 605950 612652 620335 629349 639866 651471 663077 674170 686050 700847 719270 740315
56150 740315 763210 788578 817506 850694 888938 933408 984851 1043300 1108968 1182631 1264556
56139 1264556 1353499 1446934 1541611 1633808 1720022 1798036 1866914 1926078 1975351 2016115 2051283
56128 2051283 2083364 2112844 2138475 2158330 2170393 2173181 2166576 2151733 2129967 2102006 2067981 2027125
56116 2027125 1977491 1917039 1845596 1765252 1678975 1589655 1500402 1414568 1335022 1263907 1202775
56105 1202775 1151931 1109831 1074404 1044986 1021800 1003821 988925 976316 967051 961659 958845 957164
56093 957164 956431 956770 957684 958903 960919 963957 967550 971671 976993 983400 989680 995362 1001551 1009208 1018030
56078 1018030 1027695 1038645 1050691 1062386 1072910 1083298 1094801 1107322 1120481 1134801 1150629
$$ packed form
56162E99780O170O702P683R014J0517J1605J1606J1093J1880J4797J8423K1045
56150G40315K2895K5368K8928L3188L8244M4470N1443N8449O5668P3663Q1925
56139A264556Q8943R3435R4677R2197Q6214P8014O8878N9164M9273M0764L5168
56128B051283L2081K9480K5631J9855J2063K788o605j4843k1766k7961l4025m0856
56116B027125m9634o0452p1443q0344q6277q9320q9253q5834p9546p1115o1132
56105A202775n0844m2100l5427k9418k3186j7979j4896j2609r265n392k814j681
56093I57164p33L39R14J219K016L038L593M121N322O407O280N682O189P657Q822
56078A018030R665J0950J2046J1695J0524J0388J1503J2521J3159J4320J5828
$$ plain form
56067 1150629 1167170 1183777 1200938 1218829 1236230 1252258 1267953 1284747 1302436 1319980 1337199
56056 1337199 1354239 1370467 1385510 1400522 1416879 1434265 1451412 1468086 1485133 1503237 1522797
56045 1522797 1544263 1567452 1591246 1615020 1639577 1665734 1693021 1720874 1750023 1781394 1814587
56034 1814587 1848673 1883614 1919669 1956318 1993085 2030628 2069859 2110714 2152744 2196045 2240767
56023 2240767 2286699 2334211 2384455 2437870 2493741 2551837 2612922 2676980 2742914 2810882 2882705
56012 2882705 2958835 3037337 3117377 3201178 3290691 3384897 3482573 3585154 3694330 3809214 3928742
56001 3928742 4054698 4189164 4330879 4477385 4629263 4789042 4957273 5132943 5316692
55992 5316692 5510602 5715818 5933177 6165108 6414160 6680688 6964517 7267580 7592601
$$ packed form
56067A150629J6541J6607J7161J7891J7401J6028J5695J6794J7689J7544J7219
56056A337199J7040J6228J5043J5012J6357J7386J7147J6674J7047J8104J9560
56045A522797K1466K3189K3794K3774K4557K6157K7287K7853K9149L1371L3193
56034A814587L4086L4941L6055L6649L6767L7543L9231M0855M2030M3301M4722
56023B240767M5932M7512N0244N3415N5871N8096O1085O4058O5934O7968P1823
56012B882705P6130P8502Q0040Q3801Q9513R4206R7676J02581J09176J14884J19528
56001C928742J25956J34466J41715J46506J51878J59779J68231J75670J83749
55992E316692J93910K05216K17359K31931K49052K66528K83829L03063L25021
$$ plain form
55983 7592601 7940941 8314474 8717678 9155179 9629291 10142889 10702385 11314918 11985386
55974 11985386 12719757 13528524 14423341 15413868 16512719 17740665 19122943 20684895 22457813
55965 22457813 24487001 26830291 29555365 32748515 36525140 41025877 46405994 52833799
55957 52833799 60490352 69556893 80205743 92618508 107018933 123690625 142982138
55950 142982138 165309512 191107932 220649118 253709666 289184144 324797338 357103406
55943 357103406 381966204 395555897 395531107 381805838 356485959 323095045 285580032
55936 285580032 247507221 211573465 179413004 151677306 128317786 108913587 92905869
55929 92905869 79721479 68839093 59822582 52318618 46037023 40741619 36248738 32415857
$$ packed form
55983G592601L48340L73533M03204M37501M74112N13598N59496O12533O70468
55974A1985386P34371Q08767Q94817R90527J098851J227946J382278J561952J772918
55965B2457813K029188K343290K725074L193150L776625M500737N380117O427805
55957E2833799P656553R066541J0648850J2412765J4400425J6671692J9291513
55950A42982138K2327374K5798420K9541186L3060548L5474478L5613194L2306068
55943C57103406K4862798J3589693k4790j3725269k5319879l3390914l7515013
55936B85580032l8072811l5933756l2160461k7735698k3359520j9404199j6007718
55929I2905869j3184390j0882386r016511p503964o281595n295404m492881l832881
$$ plain form
55921 32415857 29125794 26282518 23813092 21661037 19776377 18115805 16647428 15346891
55913 15346891 14189788 13152931 12220028 11379532 10618509 9924099 9289056 8709880 8180412
55904 8180412 7692333 7240901 6825098 6442618 6089219 5762553 5462283 5186413 4931204
55895 4931204 4694590 4476368 4275159 4088249 3914208 3752919 3603397 3464137 3335060
55886 3335060 3216529 3106972 3003833 2906059 2813134 2722604 2631467 2539601 2449277 2361723 2276675
55875 2276675 2194758 2117499 2044941 1975596 1908850 1845446 1785756 1729532 1677151 1629135 1584590
55864 1584590 1541855 1500491 1460960 1422790 1384876 1347209 1310500 1274465 1238432 1203309 1171012
55853 1171012 1141951 1114828 1088804 1064164 1040930 1018507 996751 975861 955236 933838 911694
$$ packed form
55921C2415857l290063k843276k469426k152055j884660j660572j468377j300537
55913A5346891j157103j036857r32903q40496p61023o94410o35043n79176n29468
55904H180412m88079m51432m15803l82480l53399l26666l00270k75870k55209
55895D931204k36614k18222k01209j86910j74041j61289j49522j39260j29077
55886C335060j18531j09557j03139r7774r2925r0530r1137r1866r0324q7554q5048
55875B276675q1917p7259p2558o9345o6746o3404n9690n6224n2381m8016m4545
55864A584590m2735m1364l9531l8170l7914l7667l6709l6035l6033l5123l2297
55853A171012k9061k7123k6024k4640k3234k2423k1756k0890k0625k1398k2144
$$ plain form
55842 911694 889753 868482 847857 828426 810872 794647 778461 762101 746567 732573 720060
55831 720060 708888 698783 688946 678995 669883 662634 656574 650202 643314 636709 630252 622980 614916 607043
55817 607043 599499 591437 582769 574464 567032 560207 554245 549967 547288 545185 543438 543030 544450 546943
55803 546943 549880 553617 558460 563864 569126 573942 577795 579688 578963 575740 570306 562814 553821 544393
55789 544393 535373 527085 519767 513685 508750 504584 500847 496924 491665 484455 476534 470473 468357 471058
55775 471058 478757 491042 506516 523301 539882 554610 564741 567256 560896 546624 526445 502862
55763 502862 479124 458168 440723 425482 411441 399049 388852 380293 372533 365574 359859 355274
55751 355274 350967 345784 338816 330093 320820 312357 304970 298181 292078 287378 284262 282107 280401 278967
$$ packed form
55842I11694k1941k1271k0625j9431j7554j6225j6186j6360j5534j3994j2513
55831G20060j1172j0105r837r951r112p249o060o372o888o605o457p272q064p873
55817F07043p544q062q668q305p432o825n962m278k679k103j747m08J420K493
55803E46943K937L737M843N404N262M816L853J893p25l223n434p492q993r428
55789E44393r020q288p318o082m935m166l737l923n259p210p921o061k116K701
55775D71058P699J2285J5474J6785J6581J4728J0131K515o360j4272k0179k3583
55763E02862k3738k0956j7445j5241j4041j2392j0197q559p760o959n715m585
55751C55274m307n183o968q723r273q463p387o789o103m700l116k155j706j434
$$ plain form
55737 278967 277240 274416 270527 266454 262652 258781 254833 251655 249930 249355 249050 248139 245888 242152 237919
55722 237919 234569 232401 230592 228655 226980 225954 225635 226521 229521 234763 241351 248457 255513 261067 262964
55707 262964 260544 255665 250705 246395 242300 238441 235262 232600 229711 226115 221771 216795 211559 206668
55693 206668 202327 198163 194161 191229 190202 190790 192070 193631 195570 197805 200123 202751 206197 210551
55679 210551 215364 220133 224548 228384 231458 233652 234874 235167 234884 234352 233326 231224 228081 224742 221940
55664 221940 219742 218114 217361 217587 218323 219202 220520 222618 225097 227173 228513 229300 229790 230251 230964 231800
55648 231800 232072 231227 229407 226911 223431 218426 212044 205124 198357 191926 185914 180528 175800 171402 166986
55633 166986 162620 158771 155916 154086 152779 151339 149461 147348 145466 144252 143819 143679 142977 141345 139393
$$ packed form
55737B78967j727k824l889m073l802l871l948l178j725n75l05r11k251l736m233
55722B37919l350k168j809j937j675j026l19Q86L000N242O588P106P056N554J897
55707B62964k420m879m960m310m095l859l179k662k889l596m344m976n236m891
55693B06668m341m164m002k932j027N88J280J561J939K235K318K628L446M354
55679B10551M813M769M415L836L074K194J222K93k83n32j026k102l143l339k802
55664B21940k198j628p53K26P36Q79J318K098K479K076J340P87M90M61P13Q36
55648B31800K72q45j820k496l480n005o382o920o767o431o012n386m728m398m416
55633A66986m366l849k855j830j307j440j878k113j882j214m33j40p02j632j952
$$ plain form
55618 139393 137965 137112 136273 135242 134224 133012 130972 128075 125193 123042 121421 119834 118262 116952 115922
55603 115922 115101 114541 114105 113348 112080 110726 109799 109348 109171 109206 109375 109423 109219 108944 108757 108551 108238 107904 107562
55584 107562 107213 107313 108605 111197 114248 116866 118909 120712 122578 124819 127710 131040 134267 137430 141260
55569 141260 145961 150505 153729 155514 156303 156087 154637 152256 149491 146412 142927 139481 136626 134121 131290
55554 131290 128147 125381 123307 121632 120315 119777 119994 120089 119338 118186 117864 119139 121679 124490 126804 128528
55538 128528 129997 131406 132676 133812 135051 136490 137832 138683 138777 137763 135269 131654 128263 126245 125214
55523 125214 123666 120673 116654 112543 108806 105503 102747 100678 99176 97949 96900 96178 95854 95656 95200
55508 95200 94478 93925 93847 93908 93526 92693 92023 91796 91359 89783 86949 83727 81146 79503 78254 76768 75198
$$ packed form
55618A39393j428q53q39j031j018j212k040k897k882k151j621j587j572j310j030
55603A15922q21n60m36p57j268j354r27m51j77L5J69M8k04k75j87k06l13l34l42
55584A07562l49J00J292K592L051K618K043J803J866K241K891L330L227L163L830
55569A41260M701M544L224J785P89k16j450k381k765l079l485l446k855k505k831
55554A31290l143k766k074j675j317n38K17R5p51j152l22J275K540K811K314J724
55538A28528J469J409J270J136J239J439J342Q51R4j014k494l615l391k018j031
55523A25214j548k993m019m111l737l303k756k069j502j227j049p22l24j98m56
55508I5200p22n53p8O1l82q33o70k27m37j576k834l222k581j643j249j486j570
$$ plain form
55491 75198 74469 75183 76766 78110 78849 79448 80108 80387 80073 79692 79809 80431 81397 82727 84180 85138 85444 85748
55473 85748 86456 86843 85913 83711 81203 79225 78167 78246 79248 80241 80354 79770 79345 79412 79645 79961 80711 81868
55455 81868 82742 82800 82367 82273 83007 84295 85371 85767 85920 86649 87877 88349 87130 84921 83292 82957 83509 84489
55437 84489 85745 86829 87057 86391 85546 84987 84435 83614 82840 82593 82939 83662 84569 85425 85994 86424 87277 88906
55419 88906 90976 92771 93839 94305 94738 95734 97382 99119 100252 100531 100057 98931 97364 95891 94896 94091
55403 94091 92986 91760 91048 90901 90647 89857 88785 87694 86449 85105 84298 84496 85286 85797 85673 85255 85036
55386 85036 85209 85597 85789 85461 84751 84211 84301 84995 85879 86421 86236 85399 84559 84408 84977 85712 86297 87013 88160
55367 88160 89515 90577 91167 91588 92327 93613 95041 95679 94850 92907 90933 89685 89139 89007 89120 89158 88601
$$ packed form
55491G5198p29P14J583J344P39N99O60K79l14l81J17O22R66J330J453R58L06L04
55473H5748P08L87r30k202k508j978j058P9J002R93J13n84m25O7K33L16P50J157
55455H1868Q74N8m33r4P34J288J076L96J53P29J228M72j219k209j629l35N52R80
55437H4489J256J084K28o66q45n59n52q21p74k47L46P23R07Q56N69M30Q53J629
55419H8906K070J795J068M66M33R96J648J737J133K79m74j126j567j473r95q05
55403I4091j105j226p12j47k54p90j072j091j245j344q07J98P90N11j24m18k19
55386H5036J73L88J92l28p10n40R0O94Q84N42j85q37q40j51N69P35N85P16J147
55367H8160J355J062N90M21P39J286J428O38q29j943j974j248n46j32J13L8n57
$$ plain form
55350 88601 87394 86311 86190 86932 87642 87661 87171 86793 86878 87247 87454 87148 86221 84765 83108 81825 81373 81558
55332 81558 81653 81316 81129 81890 83663 85854 87880 89255 89455 88528 87627 87973 89186 89592 88401 86687 85852
55315 85852 86044 86650 87487 88656 89846 90650 91247 91952 92407 92070 91296 91007 91273 91074 89749 87967 86901
55298 86901 86913 87374 87409 86519 84790 82857 81493 80983 80953 80945 81011 81603 83026 85092 87216 88716 89204 88871 88362
55279 88362 88188 88249 88000 87069 85681 84508 84162 84775 85976 87271 88437 89521 90481 90966 90672 89886 89472
55262 89472 90137 91754 93482 94561 94873 94795 94644 94347 93544 92080 90431 89582 90158 91573 92359 91615 90007
55245 90007 89058 89507 90650 91310 91066 90316 89409 88170 86381 84420 83091 82886 83692 85194 87192 89314
55229 89314 90807 91065 90201 88679 86565 83772 81027 79765 80689 82937 85102 86598 87666 88522 89177 89796
$$ packed form
55350H8601j207j083j21P42P10J9m90l78Q5L69K07l06r27j456j657j283m52J85
55332H1558R5l37j87P61J773K191K026J375K00r27r01L46J213M06j191j714q35
55315H5852J92O06Q37J169J190Q04N97P05M55l37p74k89K66j99j325j782j066
55298H6901J2M61L5q90j729j933j364n10l0qO6N92J423K066K124J500M88l33n09
55279H8362j74O1k49r31j388j173l46O13J201J295J166J084R60M85k94p86m14
55262H9472O65J617J728J079L12p8j51k97q03j464j649q49N76J415P86p44j608
55245I0007r49M49J143O60k44p50r07j239j789j961j329k05Q06J502J998K122
55229H9314J493K58q64j522k114k793k745j262R24K248K165J496J068Q56O55O19
$$ plain form
55213 89796 90626 91611 92504 93177 93441 92826 91183 89335 88517 89089 90301 91308 91879 92137 92149 92006 91923 92048
55195 92048 92388 92945 93643 94183 94287 94063 93782 93399 92698 91819 91204 90994 90886 90612 90246 90109 90637 92089 93977
55176 93977 95101 94762 93669 92958 92655 92018 91118 90840 91284 91498 91188 91419 92886 94643 95440 95492 95847 96628
55158 96628 96981 96461 95451 94352 93273 92481 92442 93259 94591 96104 97578 98639 98894 98371 97515 96793 96548
55141 96548 96989 97903 98575 98420 97622 96751 95961 94985 93800 92832 92509 92940 93953 95149 96077 96672 97380 98516
55123 98516 99749 100581 101070 101530 101805 101460 100617 99965 99882 100000 99723 98794 97388 96071 95631 96437 97926 99181
55105 99181 100009 100949 102242 103414 104011 104138 104015 103642 103220 103356 104269 105147 104930 103629 102349 102056 102754 103923
55087 103923 105227 106554 107653 108175 108043 107518 106917 106442 106343 106921 108130 109353 109877 109607 109056 108714 108720 109073
$$ packed form
55213H9796Q30R85Q93O73K64o15j643j848q18N72J212J007N71K58J2j43q3J25
55195I2048L40N57O98N40J04k24k81l83p01q79o15k10j08k74l66j37N28J452J888
55176I3977J124l39j093p11l03o37r00k78M44K14l10K31J467J757P97N2L55P81
55158I6628L53n20j010j099j079p92l9Q17J332J513J474J061K55n23q56p22k45
55141I6548M41R14O72j55p98q71p90r76j185r68l23M31J013J196R28N95P08J136
55123I8516J233Q32M89M60K75l45q43o52q3J18k77r29j406j317m40Q06J489J255
55105I9181Q28R40J293J172N97J27j23l73m22J36R13Q78k17j301j280k93O98J169
55087A03923J304J327J099N22j32n25o01m75r9N78J209J223N24k70n51l42OL53
$$ plain form
55069 109073 109707 110255 110209 109546 108767 108054 106902 105060 103388 103045 104025 105157 105589 105593 105811 106340 106839 107044
55051 107044 106788 105860 104279 102547 101275 100604 100199 99726 99219 99036 99622 101094 102847 103746 103088 101445 100207
55034 100207 100177 100863 101315 101333 101393 101629 101541 100859 100115 99949 100261 100520 100617 100859 101339 101994 103158 105302 108038
55015 108038 110142 110875 110738 110601 110675 110771 111006 111605 112339 112713 112546 111982 111126 110082 109070 108091 106771 105042
54997 105042 103669 103507 104387 105322 105741 105885 106089 106285 106432 106825 107691 108800 109706 110160 110145 109733 109051 108305
54979 108305 107782 107819 108603 109908 111232 112335 113381 114365 114808 114395 113638 113410 113964 114849 115611 116141 116473 116693
54961 116693 116962 117255 117262 116933 116814 117317 117979 118109 117908 118123 118738 118926 118371 117774 117789 118252 118744 119216 119660 119786
54941 119786 119467 119063 118988 119329 120073 121177 122210 122598 122580 123314 125556 128745 131849 134631 137539 140793 144245
$$ packed form
55069A09073O34N48m6o63p79p13j152j842j672l43R80J132M32MK18N29M99K05
55051A07044k56r28j581j732j272o71m05m73n07j83N86J472J753Q99o58j643j238
55034A00207l0O86M52J8O0K36q8o82p44j66L12K59R7K42M80O55J164K144K736
55015A08038K104P33j37j37P4R6K35N99P34L74j67n64q56j044j012r79j320j729
54997A05042j373j62Q80R35M19J44K04J96J47L93Q66J109R06M54j5m12o82p46
54979A08305n23L7P84J305J324J103J046R84M43m13p57k28N54Q85P62N30L32K20
54961A16693K69K93Pl29j19N03O62J30k01K15O15J88n55n97J5M63M92M72M44J26
54941A19786l19m04p5L41P44J104J033L88j8P34K242L189L104K782K908L254L452
$$ plain form
54924 144245 147892 151927 156386 161114 165927 170394 173703 175197 174934 173352 170587 166592 161755 156838
54910 156838 152269 147856 143338 138883 134945 131778 129220 126919 124822 123399 123212 124168 125425 126197 126384
54895 126384 126292 126036 125580 125165 125311 126426 128576 131526 134781 137746 140176 142485 145371 149116 153383 157695
54879 157695 161955 166419 171180 175674 178776 179569 178048 175033 171496 168105 165176 162593 159740 155978
54865 155978 151367 146646 142415 138712 135418 132565 130079 127659 125213 123001 121099 119168 117068 115255
54851 115255 114151 113539 113008 112617 112620 112838 112890 112844 113101 113762 114517 115031 115012 114107 112274 110173 108684 108045 107782
54832 107782 107393 106728 105888 105199 105201 106162 107670 109069 110190 111220 112098 112662 113270 114520 116254 117507 117653
54815 117653 117030 116187 115149 113808 112557 111992 112167 112533 112616 112552 112948 114284 116293 118020 118688 118480 118224
$$ packed form
54924A44245L647M035M459M728M813M467L309J494k63j582k765l995m837m917
54910A56838m569m413m518m455l938l167k558k301k097j423j87R56J257P72J87
54895A26384r2k56m56m15J46J115K150K950L255K965K430K309K886L745M267M312
54879A57695M260M464M761M494L102P93j521l015l537l391k929k583k853l762
54865A55978m611m721m231l703l294k853k486k420k446k212j902j931k100j813
54851A15255j104o12n31l91LK18N2m6K57O61P55N14j9r05j833k101j489o39k63
54832A07782l89o65q40o89KR61J508J399J121J030Q78N64O08J250J734J253J46
54815A17653o23q43j038j341j251n65J75L66Q3o4L96J336K009J727O68k08k56
$$ plain form
54798 118224 118436 119043 119911 121048 122228 123039 123560 124369 125591 126501 126540 126248 126542 127430 128076 128008 127639 127581 128087
54779 128087 129270 131336 134230 137369 140083 142239 144277 146748 149993 154160 159263 165094 171138 176750
54765 176750 181505 185350 188315 190050 189869 187387 183060 177924 172802 167869 162965 158120 153648 149786
54751 149786 146415 143203 140018 137132 135028 134028 134073 134722 135340 135430 134987 134490 134437 134920 135774 136936 138353
54734 138353 139592 140033 139718 139723 141281 144577 148672 152593 156217 160007 164150 168205 171625 174363 176774
54719 176774 178903 180172 179933 178193 175464 171973 167468 162028 156582 152197 148969 146070 142875 139630
54705 139630 136998 135331 134542 134287 133985 132993 131148 129029 127375 126369 125793 125675 126290 127425 128170 127724
54689 127724 126168 124220 122511 121364 121016 121603 122933 124577 126228 127723 128770 128982 128310 127143 125833
$$ packed form
54798A18224K12O07Q68J137J180Q11N21Q09J222R10L9k92K94Q88O46o8l69n8N06
54779A28087J183K066K894L139K714K156K038K471L245M167N103N831O044N612
54765A76750M755L845K965J735j81k482m327n136n122m933m904m845m472l862
54751A49786l371l212l185k886k104j000M5O49O18R0m43m97n3M83Q54J162J417
54734A38353J239M41l15NJ558L296M095L921L624L790M143M055L420K738K411
54719A76774K129J269k39j740k729l491m505n440n446m385l228k899l195l245
54705A39630k632j667p89k55l02r92j845k119j654j006n76j18O15J135P45m46
54689A27724j556j948j709j147l48N87J330J644J651J495J047K12o72j167j310
$$ plain form
54674 125833 124258 122057 119225 116398 114538 114291 115429 116929 117777 117820 117678 117814 117960 117610 116787 116053 115844
54657 115844 116135 116766 117787 119308 121131 122723 123643 123928 123957 123957 123782 123244 122485 121805 121246 120642 120029 119655
54639 119655 119515 119250 118709 118253 118231 118437 118434 118218 118177 118483 118885 119125 119245 119419 119735 120182 120632 120808 120495 119863
54619 119863 119409 119494 120041 120712 121212 121401 121287 121000 120687 120334 119785 118957 117990 117194 116948 117535 118856 120306
54601 120306 121158 121199 120880 120781 121067 121538 121980 122303 122467 122546 122868 123805 125270 126523 126719 125741 124388 123624 123700
54582 123700 124083 124181 123907 123537 123279 123194 123382 124003 125084 126436 127777 128852 129437 129383 128736 127768 126846 126260
54564 126260 126163 126653 127758 129225 130377 130505 129678 128903 129123 130113 130804 130714 130513 131012 132161 133441 134743
54547 134743 136243 137701 138606 138998 139515 140557 141904 143267 144611 145716 145943 144991 143559 142759 142875 143165
$$ packed form
54674A25833j575k201k832k827j860k47J138J500Q48M3j42J36J46l50q23p34k09
54657A15844K91O31J021J521J823J592R20K85K9%j75n38p59o80n59o04o13l74
54639A19655j40k65n41m56k2K06lk16m1L06M02K40J20J74L16M47M50J76l13o32
54619A19863m54Q5N47O71N00J89j14k87l13l53n49q28r67p96k46N87J321J450
54601A20306Q52M1l19r9K86M71M42L23J64P9L22R37J465J253J96r78j353p64P6
54582A23700L83R8k74l70k58q5J88O21J081J352J341J075N85n4o47r68r22n86
54564A26260r7M90J105J467J152J28q27p75K20R90O91r0k01M99J149J280J302
54547A34743J500J458R05L92N17J042J347J363J344J105K27r52j432q00J16K90
$$ plain form
54531 143165 142880 142066 141173 140229 138896 137256 136035 135693 135645 134869 133216 131626 130961 131161 131727 132447 133185
54514 133185 133499 133124 132561 132462 132552 131884 130159 128126 126556 125568 125125 125438 126417 127311 127539 127477 127882 128802 129653
54495 129653 130136 130469 130769 130859 130803 131106 132065 133276 134119 134506 134831 135244 135319 134560 133111 131787 131429 132276 133944
54476 133944 135892 137823 139753 141823 144068 146278 148075 149222 149782 149964 149896 149687 149625 150029 150879 151741 152136
54459 152136 151918 151276 150540 149920 149284 148195 146346 143979 141716 140050 139133 138972 139442 140100 140330 139831 138828
54442 138828 137742 136909 136550 136693 137029 137195 137287 137664 138198 138253 137727 137551 138608 140454 141774 141968 141700 141842
54424 141842 142461 143052 143338 143489 143752 144174 144683 145291 146128 147312 148722 149937 150489 150251 149606 149139 149149 149426
54406 149426 149544 149366 149141 149140 149430 150108 151414 153253 154861 155502 155466 155794 156933 158245 159055 159553 160289 161278
$$ packed form
54531A43165k85q14q93r44j333j640j221l42m8p76j653j590o65K00N66P20P38
54514A33185L14l75n63r9R0o68j725k033j570r88m43L13R79Q94K28o2M05R20Q51
54495A29653M83L33L00R0n6L03R59J211Q43L87L25M13P5p59j449j324l58Q47J668
54476A33944J948J931J930K070K245K210J797J147N60J82o8k09o2M04Q50Q62L95
54459A52136k18o42p36o20o36j089j849k367k263j666r17j61M70O58K30m99j003
54442A38828j086q33l59J43L36J66R2L77N34N5n26j76J057J846J320J94k68J42
54424A41842O19N91K86J51K63M22N09O08Q37J184J410J215N52k38o45m67J0K77
54406A49426J18j78k25jK90O78J306J839J608O41l6L28J139J312Q10M98P36R89
$$ plain form
54388 161278 162155 162756 162980 162427 160895 159099 158219 158625 159557 160103 160017 159538 158983 158664 158801 159287 159822 160366
54370 160366 161143 162166 163232 164584 167083 171271 176515 181507 185509 188838 192165 195732 199311 202633
54356 202633 205505 207539 208075 206697 203772 200135 196115 191275 185384 179327 174506 171448 169528 168012
54342 168012 166740 165624 164119 161716 158670 155801 153723 152547 152214 152717 153944 155504 156820 157388 157061
54327 157061 156129 155075 154233 153800 154057 155211 156933 158419 159096 159026 158481 157514 156199 154876 153716 152371
54311 152371 150549 148718 147634 147277 146918 146332 146240 147214 148691 149560 149436 148867 148440 148204 148033 148098 148716 149870
54293 149870 151085 151818 151865 151446 150987 150894 151412 152499 153811 154947 155817 156670 157651 158500 158881 158786 158367 157505
54275 157505 156054 154458 153581 153712 154221 154536 154950 155981 157291 157979 157911 158034 159215 161246 163284 164825
$$ packed form
54388A61278Q77O01K24n53j532j796q80M06R32N46q6m79n55l19J37M86N35N44
54370A60366P77J023J066J352K499M188N244M992M002L329L327L567L579L322
54356B02633K872K034N36j378k925l637m020m840n891o057m821l058j920j516
54342A68012j272j116j505k403l046k869k078j176l33N03J227J560J316N68l27
54327A57061r32j054q42m33K57J154J722J486O77p0n45r67j315j323j160j345
54311A52371j822j831j084l57l59n86r2R74J477Q69j24n69m27k36j71O5O18J154
54293A49870J215P33M7m19m59r3N18J087J312J136Q70Q53R81Q49L81r5m19q62
54275A57505j451j596q77J31N09L15M14J031J310O88o8J23J181K031K038J541
$$ plain form
54259 164825 165914 166740 167466 168318 169444 170637 171424 171484 170897 170039 169315 168925 168748 168455 167808 166811 165649 164596
54241 164596 163900 163520 163014 161987 160706 159860 159601 159294 158495 157647 157383 157600 157837 158227 159240 160673 161722
54224 161722 162188 162790 164023 165400 166191 166360 166288 166014 165235 163795 161770 159316 156774 154662 153213 152150
54208 152150 151243 150762 150964 151419 151398 150800 150216 150105 150357 150597 150543 150091 149458 149228 149847 151040 152069 152554 152674
54189 152674 152663 152592 152675 153246 154258 155223 155831 156190 156342 155976 154963 153762 153013 153025 153903 155714 158070 159924
54171 159924 160422 159872 159362 159429 159619 159379 158891 158758 159245 160081 160811 161073 160721 159871 158761 157426 155652 153436
54153 153436 151349 150123 149904 150172 150439 150777 151522 152735 154194 155745 157357 158869 160065 161119 162673
54138 162673 165201 168363 171171 172763 172980 172297 171376 170660 170303 170396 171142 172546 173936 174180 172802 170691
$$ packed form
54259A64825J089Q26P26Q52J126J193P87O0n87q58p24l90j77k93o47r97j162j053
54241A64596o96l80n06j027j281q46k59l07p99q48k64K17K37L90J013J433J049
54224A61722M66O02J233J377P91J69p2k74p79j440k025k454k542k112j449j063
54208A52150r07m81K02M55k1n98n84j11K52K40n4m52o33k30O19J193J029M85J20
54189A52674j1p1Q3N71J012R65O08L59J52l66j013j201p49J2Q78J811K356J854
54171A59924M98n50n10O7J90k40m88j33M87Q36P30K62l52q50j110j335j774k216
54153A53436k087j226k19K68K67L38P45J213J459J551J612J512J196J054J554
54138A62673K528L162K808J592K17o83r21p16l57R3P46J404J390K44j378k111
$$ plain form
54122 170691 169361 169492 170559 171860 173380 175357 177416 178671 178697 178068 177756 178213 179117 179865 180121 179910 179451
54105 179451 179003 178803 178959 179436 180227 181525 183495 185974 188572 191141 193925 197202 201096 205841 211810
54090 211810 218920 226263 232692 237601 240726 241540 239520 235073 229553 224104 218913 213752 208711 204032
54076 204032 199636 195372 191573 188943 187856 188020 188779 189565 190171 190763 191635 192801 193950 194925 196010 197452
54060 197452 198904 199755 200069 200830 203096 207081 212093 217151 221554 225074 227942 230654 233590 236634 239186
54045 239186 240670 241074 240948 240838 240865 241017 241713 243797 247863 253770 260850 268387 275757 282429 288143 293036
54029 293036 297364 301092 303940 305788 306881 307660 308508 309625 310908 311888 311945 310675 308119 304651 300729
54014 300729 296720 292789 288902 284950 280919 276909 272968 268941 264543 259612 254313 249009 243934 239025
$$ packed form
54122A70691j330J31J067J301J520J977K059J255K6o29l12M57R04P48K56k11m59
54105A79451m48k00J56M77P91J298J970K479K598K569K784L277L894M745N969
54090B11810P110P343O429M909L125Q14k020m447n520n449n191n161n041m679
54076B04032m396m264l799k630j087J64P59P86O06N92Q72J166J149R75J085J442
54060A97452J452Q51L14P61K266L985N012N058M403L520K868K712K936L044K552
54045B39186J484M04j26j10K7J52O96K084M066N907P080P537P370O672N714M893
54029B93036M328L728K848J848J093P79Q48J117J283R80N7j270k556l468l922
54014C00729m009l931l887l952m031m010l941m027m398m931n299n304n075m909
$$ plain form
54000 239025 234187 229655 225876 223021 220781 218711 216659 214777 213225 212021 211086 210349 209766 209302 208890
53985 208890 208428 207824 207024 206004 204870 203995 203810 204248 204646 204566 204472 205094 206277 207125 207351 207684 208576 209253
53967 209253 208736 207373 206662 207766 210747 214953 219452 223226 225788 227803 230539 234551 239389 244683 250868
53952 250868 258573 267788 278073 289268 301570 314971 328802 341650 351668 357355 358393 355689
53940 355689 350527 343863 336507 329464 323647 319385 316543 315046 314981 316237 318297 320500 322438 324171 326078
53925 326078 328440 331149 333936 336864 340349 344661 349709 355401 361891 369228 377089 385097 393158 401168
53911 401168 408649 415010 420004 423584 425569 425922 425282 424635 424309 423640 421742 418312 413681 408438 403169
53896 403169 398200 393359 388110 382039 375063 367227 358669 349917 341775 334553 327662 320306 312420 304597
$$ packed form
54000B39025m838m532l779k855k240k070k052j882j552j204r35p37n83m64m12
53985B08890m62o04q00j020j134q75j85M38L98q0r4O22J183Q48K26L33Q92O77
53967B09253n17j363p11J104K981M206M499L774K562K015K736M012M838N294O185
53952B50868P705R215J0285J1195J2302J3401J3831J2848J0018N687J038k704
53940C55689n162o664p356p043n817m262k842j497o5J256K060K203J938J733J907
53925C26078K362K709K787K928L485M312N048N692O490P337P861Q008Q061Q010
53911D01168P481O361M994L580J985L53o40o47l26o69j898l430m631n243n269
53896D03169m969m841n249o071o976p836q558q752q142p222o891p356p886p823
$$ plain form
53882 304597 297284 290491 284287 279056 275010 271702 268338 264513 260479 256759 253637 251020 248636 246332
53868 246332 244215 242441 240853 238929 236335 233468 231207 229940 229003 227272 224320 220833 217935 216270
53854 216270 215687 215561 215306 214721 214004 213393 212810 212033 211265 211157 211980 212948 212815 211228 209174 207940 207846 208213
53836 208213 208388 208464 208901 209690 210232 210103 209751 210146 211735 214016 216214 218087 219787 221171 221749 221418 220891
53819 220891 221182 222775 225348 228130 230477 232244 233750 235301 236835 238192 239692 242061 245651 250054
53805 250054 254687 259487 264748 270502 276408 282129 287505 292464 297055 301503 305952 310159 313724 316544
53791 316544 318772 320402 321288 321560 321595 321433 320594 318678 315861 312597 309095 305306 301182 296663 291613 286057
53775 286057 280402 275167 270572 266571 263108 260054 257005 253565 249885 246541 243805 241317 238671 235980
$$ packed form
53882C04597p313o793o204n231m046l308l364l825m034l720l122k617k384k304
53868B46332k117j774j588j924k594k867k261j267r37j731k952l487k898j665
53854B16270n83j26k55n85p17o11n83p77p68j08Q23R68j33j587k054j234r4L67
53836B08213J75P6M37P89N42j29l52L95J589K281K198J873J700J384N78l31n27
53819B20891K91J593K573K782K347J767J506J551J534J357J500K369L590M403
53805B50054M633M800N261N754N906N721N376M959M591M448M449M207L565K820
53791C16544K228J630Q86K72L5j62q39j916k817l264l502l789m124m519n050n556
53775B86057n655n235m595m001l463l054l049l440l680l344k736k488k646k691
$$ plain form
53761 235980 233620 231655 229846 228133 226722 225627 224461 222857 220923 219116 217812 217139 217032 217175 216985
53746 216985 216026 214508 213117 212244 211651 211002 210413 210251 210619 211326 212158 212897 213308 213507 214126 215571 217217
53729 217217 217991 217815 217772 218597 219719 220306 220638 221695 223679 225758 227214 228222 229332 230767 232454 234330
53713 234330 236342 238370 240325 242172 243836 245290 246799 248777 251344 254240 257248 260444 263949 267699
53699 267699 271560 275414 279018 282039 284383 286292 287980 289388 290392 291011 291251 290943 289944 288361 286496
53684 286496 284711 283382 282678 282286 281662 280789 280330 280772 281750 282619 283385 284507 285898 286710 286307 285043 283814
53667 283814 283073 282504 281560 280157 278837 278297 278764 279810 280741 281030 280418 278946 277132 275844 275563 275826 275718
53650 275718 274936 274041 273656 273811 274222 274831 275751 276840 277700 278170 278678 279968 282418 285585 288481 290388 291393
$$ packed form
53761B35980k360j965j809j713j411j095j166j604j934j807j304o73j07J43j90
53746B16985r59j518j391q73n93o49n89j62L68P07Q32P39M11J99O19J445J646
53729B17217P74j76m3Q25J122N87L32J057J984K079J456J008J110J435J687J876
53713B34330K012K028J955J847J664J454J509J978K567K896L008L196L505L750
53699B67699L861L854L604L021K344J909J688J408J004O19K40l08r99j583j865
53684B86496j785j329p04l92o24q73m59M42R78Q69P66J122J391Q12m03j264j229
53667B83814p41n69r44j403j320n40M67J046R31K89o12j472j814j288k81K63j08
53650B75718p82q95l85J55M11O09R20J089Q60M70N08J290K450L167K896J907J005
$$ plain form
53633 291393 292119 293132 294745 297176 300436 304086 307496 310532 313649 317139 320633 323691 326589 330049
53619 330049 334227 338433 342039 345335 349194 353992 359174 363854 367630 370694 373418 376093 378962 382082
53605 382082 384990 386828 387173 386650 386420 387041 388041 388649 388629 388367 388359 388787 389384 389553 388761 387023 384958 383269
53587 383269 382164 381331 380362 379117 377733 376386 375046 373488 371591 369578 367804 366328 364894 363303 361533
53572 361533 359483 356998 354354 352406 351863 352556 353700 354718 355528 356213 356828 357482 358225 358792 358839 358577 358753
53555 358753 359769 361084 361824 361879 362061 363178 365195 367429 369350 370962 372457 373799 374888 376029 377925
53540 377925 381040 385174 389820 394747 399989 405453 410903 416367 422171 428531 435412 442932 451507 461304
53526 461304 471797 482235 492442 502847 513833 525445 537732 550968 565282 580333 595668
$$ packed form
53633B91393P26J013J613K431L260L650L410L036L117L490L494L058K898L460
53619C30049M178M206L606L296L859M798N182M680L776L064K724K675K869L120
53605C82082K908J838L45n23k30O21J000O08k0k62qM28N97J69p92j738k065j689
53587C83269j105q33r69j245j384j347j340j558j897k013j774j476j434j591j770
53572C61533k050k485k644j948n43O93J144J018Q10O85O15O54P43N67M7k62J76
53555C58753J016J315P40N5J82J117K017K234J921J612J495J342J089J141J896
53540C77925L115M134M646M927N242N464N450N464N804O360O881P520Q575R797
53526D61304J0493J0438J0207J0405J0986J1612J2287J3236J4314J5051J5335
$$ plain form
53515 595668 611334 627878 645697 664575 683958 703605 723792 744893 766895 789428 812163
53504 812163 834987 857803 880320 902136 922956 942720 961699 980473 999570 1018982 1038159
53493 1038159 1056670 1074656 1092419 1109823 1126492 1142529 1158581 1175127 1192095 1209301 1226779
53482 1226779 1244344 1261251 1276846 1291464 1306168 1321474 1336642 1350308 1361548 1370227 1376679 1381325
53470 1381325 1384472 1386159 1386130 1384017 1379608 1372900 1364075 1353580 1342136 1330461 1318799 1306764 1293700
53457 1293700 1279258 1263688 1247653 1231696 1215772 1199241 1181408 1162185 1142246 1122527 1103600
53446 1103600 1085570 1068402 1052110 1036605 1021650 1007222 993816 982161 972648 965215 959702 956058
53434 956058 954197 953880 954816 956591 958522 960039 961494 964214 969328 976709 985404 994845 1005168 1016540
$$ packed form
53515E95668J5666J6544J7819J8878J9383J9647K0187K1101K2002K2533K2735
53504H12163K2824K2816K2517K1816K0820J9764J8979J8774J9097J9412J9177
53493A038159J8511J7986J7763J7404J6669J6037J6052J6546J6968J7206J7478
53482A226779J7565J6907J5595J4618J4704J5306J5168J3666J1240Q679O452M646
53470A381325L147J687k9k113m409o708q825j0495j1444j1675j1662j2035j3064
53457A293700j4442j5570j6035j5957j5924j6531j7833j9223j9939j9719j8927
53446A103600j8030j7168j6292j5505j4955j4428j3406j1655r513p433n513l644
53434I56058j861l17R36J775J931J517J455K720N114P381Q695R441J0323J1372
$$ plain form
53420 1016540 1028839 1042135 1056920 1073566 1091884 1111440 1131965 1153273 1175142 1197566 1220859
53409 1220859 1245234 1270568 1296853 1324570 1354249 1385900 1419295 1454541 1491917 1531285 1572234
53398 1572234 1614717 1659037 1705216 1752921 1802112 1853107 1905707 1958801 2011265 2062942 2114363
53387 2114363 2165784 2216906 2267249 2316266 2363246 2407626 2449498 2489355 2527280 2562714 2595040
53376 2595040 2623979 2649232 2670213 2686488 2698120 2705178 2707103 2703099 2693152 2678173 2658955 2635311
53364 2635311 2606419 2571781 2531709 2487192 2439675 2390721 2341400 2291848 2241654 2190729 2139609
53353 2139609 2088951 2039134 1990509 1943632 1898905 1856156 1814859 1774732 1735751 1697681 1660002
53342 1660002 1622490 1585673 1550466 1517436 1486577 1457766 1431271 1407694 1387358 1369823 1354097
$$ packed form
53420A016540J2299J3296J4785J6646J8318J9556K0525K1308K1869K2424K3293
53409A220859K4375K5334K6285K7717K9679L1651L3395L5246L7376L9368M0949
53398A572234M2483M4320M6179M7705M9191N0995N2600N3094N2464N1677N1421
53387B114363N1421N1122N0343M9017M6980M4380M1872L9857L7925L5434L2326
53376B595040K8939K5253K0981J6275J1632P058J925m004r947j4979j9218k3644
53364B635311k8892l4638m0072m4517m7517m8954m9321m9552n0194n0925n1120
53353B139609n0658m9817m8625m6877m4727m2749m1297m0127l8981l8070l7679
53342A660002l7512l6817l5207l3030l0859k8811k6495k3577k0336j7535j5726
$$ plain form
53331 1354097 1339479 1326095 1314531 1304996 1296935 1289382 1281468 1272639 1262651 1251563 1239659 1227355
53319 1227355 1215199 1203779 1193381 1183722 1174381 1165522 1157820 1151510 1146022 1140941 1136953 1135132 1135442
53306 1135442 1136627 1137739 1139145 1141755 1145917 1151538 1158843 1168253 1179667 1192504 1206507 1221950 1238998
53293 1238998 1257408 1277064 1298307 1321330 1345589 1370133 1394217 1417329 1438949 1458760 1476958
53282 1476958 1493885 1509468 1523403 1535775 1546940 1556725 1564249 1568749 1570258 1569254 1565872 1559665 1549994
53269 1549994 1536583 1519853 1500797 1480354 1458874 1436320 1412734 1388080 1361803 1333273 1302911
53258 1302911 1272268 1242617 1213955 1185684 1157651 1129968 1102412 1074866 1048085 1023105 999860
53247 999860 977112 953853 930173 906670 883683 861423 840238 820361 801679 784020 767371
$$ packed form
53331A354097j4618j3384j1564r535q061p553p914q829r988j1088j1904j2304
53319A227355j2156j1420j0398r659r341q859p702o310n488n081l988j821L10
53306A135442J185J112J406K610M162N621P305R410J1414J2837J4003J5443J7048
53293A238998J8410J9656K1243K3023K4259K4544K4084K3112K1620J9811J8198
53282A476958J6927J5583J3935J2372J1165R785P524M500J509j004l382o207r671
53269A549994j3411j6730j9056k0443k1480k2554k3586k4654k6277k8530l0362
53258A302911l0643k9651k8662k8271k8033k7683k7556k7546k6781k4980k3245
53247I99860k2748k3259k3680k3503k2987k2260k1185j9877j8682j7659j6649
$$ plain form
53236 767371 751665 736760 722895 710670 700192 690598 680921 671224 662391 654889 648228 641633 634840
53223 634840 628034 621269 614182 606241 597192 587230 576699 565676 554045 542013 530255 519298 508952
53210 508952 498649 488225 478000 468206 458754 449695 441436 434217 427605 420887 413816 406640 399453
53197 399453 391948 383918 375654 367583 359695 351659 343435 335508 328458 322484 317381 312773 308345 303993
53183 303993 299806 295826 291894 287951 284402 281832 280310 279316 278422 277598 276726 275350 273280 271032 269212
53168 269212 267844 266764 266258 266619 267300 267252 266101 264325 262347 260246 258440 257715 258161 258778 258667 258110 257892
53151 257892 257958 257400 255606 252924 250257 248332 247375 247183 247456 248081 248925 249405 248751 246950 245055 244177 244464
53134 244464 245314 246231 247036 247570 247792 248098 249079 250874 253072 255168 256842 257981 258788 259804 261391 263185
$$ packed form
53236G67371j5706j4905j3865j2225j0478r594r677r697q833p502o661o595o793
53223F34840o806o765p087p941r049r962j0531j1023j1631j2032j1758j0957j0346
53210E08952j0303j0424j0225r794r452r059q259p219o612o718p071p176p187
53197C99453p505q030q264q071p888q036q224p927p050n974n103m608m428m352
53183C03993m187l980l932l943l549k570j522r94q94q24q72j376k070k248j820
53168B69212j368j080n06L61O81m8j151j776j978k101j806p25M46O17j11n57k18
53151B57892O6n58j794k682k667j925r57j92K73O25Q44M80o54j801j895q78K87
53134B44464Q50R17Q05N34K22L06R81J795K198K096J674J139Q07J016J587J794
$$ plain form
53118 263185 264400 264695 264483 264401 264748 265381 265839 265554 264265 262341 260479 259058 257929 256762 255380 253830
53102 253830 252372 251379 250964 250764 250331 249706 249315 249342 249544 249650 249615 249369 248716 247688 246731 246323 246511 246995 247561
53083 247561 248248 249078 249749 249760 248969 247935 247467 247751 248196 248248 248036 247981 248081 248026 247758 247437 246920 245821 244177
53064 244177 242633 241751 241389 240867 239578 237445 235000 233085 232261 232466 233349 234765 236644 238631 240289 241655
53048 241655 243101 244558 245339 244925 243613 242258 241608 241944 242990 244030 244485 244561 245048 246319 247818 248673
53032 248673 248586 247947 247434 247638 248739 250242 251266 251357 250878 250432 250164 249858 249453 249149 249107 249314 249686 250128 250580
53013 250580 251112 251887 252913 253997 255069 256329 257961 259805 261428 262371 262312 261282 259858 258823 258427 258207
52997 258207 257691 256991 256469 256175 255955 255898 256301 257303 258790 260520 262075 262935 262959 262671 262719 263192 263789 264446
$$ packed form
53118B63185J215K95k12q2L47O33M58k85j289j924j862j421j129j167j382j550
53102B53830j458r93m15k00m33o25l91K7K02J06l5k46o53j028r57m08J88M84N66
53083B47561O87Q30O71J1p91j034m68K84M45N2k12n5J00n5k68l21n17j099j644
53064B44177j544q82l62n22j289k133k445j915q24K05Q83J416J879J987J658J366
53048B41655J446J457P81m14j312j355o50L36J046J040M55P6M87J271J499Q55
53032B48673q7o39n13K04J101J503J024R1m79m46k68l06m05l04m2K07L72M42M52
53013B50580N32P75J026J084J072J260J632J844J623R43n9j030j424j035l96k20
52997B58207n16p00n22k94k20n7M03J002J487J730J555Q60K4k88M8M73N97O57
$$ plain form
52979 264446 265349 266493 267726 269218 271299 273706 275568 276405 276729 277344 278421 279634 280886 282351 283905
52964 283905 285011 285356 285222 285050 284829 284208 283043 281586 280087 278464 276481 274160 271852 269916 268397
52949 268397 267022 265443 263529 261516 259847 258782 258168 257643 257055 256544 256330 256544 257266 258488 259920 260991
52933 260991 261202 260514 259397 258501 258205 258315 258233 257622 256855 256578 256830 256928 256389 255596 255250 255374 255349 254900 254625
52914 254625 255237 256558 257591 257613 256945 256478 256609 256826 256313 254744 252470 250207 248690 248353 249004 249879 250309
52897 250309 250359 250699 251836 253607 255343 256346 256337 255678 255174 255455 256521 257923 259208 260015 260078 259564 259208 259615
52879 259615 260486 260987 260760 260110 259308 258400 257739 257911 258931 260162 261338 263007 265610 268700 271475 273542
52863 273542 274788 275124 274881 274835 275172 274922 273111 270009 266516 262778 258410 253789 250059 247754 246308 245100
$$ packed form
52979B64446R03J144J233J492K081K407J862Q37L24O15J077J213J252J465J554
52964B83905J106L45j34j72k21o21j165j457j499j623j983k321k308j936j519
52949B68397j375j579j914k013j669j065o14n25n88n11k14K14P22J222J432J071
52933B60991K11o88j117q96k96J10q2o11p67k77K52R8n39p93l46J24k5m49k75
52914B54625O12J321J033K2o68m67J31K17n13j569k274k263j517l37O51Q75M30
52897B50309N0L40J137J771J736J003ro59n04K81J066J402J285Q07O3n14l56M07
52879B59615Q71N01k27o50q02r08o61J72J020J231J176J669K603L090K775K067
52863B73542J246L36k43m6L37k50j811l102l493l738m368m621l730k305j446j208
$$ plain form
52847 245100 244146 243559 243060 242417 241819 241464 241220 240983 240999 241504 242360 243205 243738 243751 243274 242766 242789 243292 243616 243415
52827 243415 243153 243429 244145 244707 244771 244462 244028 243617 243403 243667 244711 246703 249530 252776 255914 258587 260568
52810 260568 261567 261304 259851 257657 255170 252524 249615 246347 242852 239646 237423 236388 235848 234864 233324
52795 233324 232059 231804 232386 233047 233291 233270 233531 234472 235830 236740 236573 235713 235210 235655 236724 237807 238641 239200
52777 239200 239444 239409 239288 239246 239353 239704 240295 240745 240564 239792 238945 238243 237345 236042 234724 233934 233799 234074 234382
52758 234382 234308 233743 233262 233608 234627 235403 235705 236446 238223 240293 241855 243623 246965 251742 256132 258712
52742 258712 259851 260936 262856 265414 267616 268388 267508 265997 265173 265327 265789 266158 266783 267916 269138 269903
52726 269903 270125 269899 269126 267716 265845 263745 261580 259709 258597 258153 257600 256382 254899 253982 253921 254350
$$ packed form
52847B45100r54n87m99o43n98l55k44k37J6N05Q56Q45N33J3m77n08K3N03L24k01
52827B43415k62K76P16N62O4l09m34m11k14K64J044J992K827L246L138K673J981
52810B60568R99k63j453k194k487k646k909l268l495l206k223j035n40r84j540
52795B33324j265k55N82O61K44k1K61R41J358R10j67q60n03M45J069J083Q34N59
52777B39200K44l5j21m2J07L51N91M50j81p72q47p02q98j303j318p90j35K75L08
52758B34382p4n65m81L46J019P76L02P41J777K070J562J768L342M777M390K580
52742B58712J139J085J920K558K202P72q80j511q24J54M62L69O25J133J222P65
52726B69903K22k26p73j410j871k100k165j871j112m44n53j218j483r17o1M29
$$ plain form
52710 254350 254820 255066 254936 254531 254310 254699 255580 256511 257377 258483 259974 261504 262555 262887 262597 261941 261181
52693 261181 260450 259696 258850 257999 257285 256623 255794 254838 254123 253824 253561 252828 251696 250733 250211 249782 249128 248591
52675 248591 248677 249152 249235 248820 248905 250361 252699 254539 255191 255206 255460 256242 257420 258935 260766 262641 264161
52658 264161 265218 266111 267255 268788 270332 271203 271072 270436 270178 270559 270927 270572 269578 268573 267934 267597 267471
52641 267471 267595 267840 267851 267397 266601 265701 264788 263915 263285 263177 263690 264612 265514 265904 265413 264003 262037 260078
52623 260078 258499 257289 256253 255397 254985 255225 255985 256890 257560 257721 257295 256606 256297 256719 257454 257811 257751 257921
52605 257921 258631 259286 259130 258197 257204 256796 257264 258669 260652 262246 262518 261567 260419 259781 259330 258477 257366
52588 257366 256689 256774 257351 258160 259271 260675 261944 262612 262741 262816 263123 263491 263712 263902 264220 264420 264099 263385
$$ packed form
52710B54350M70K46j30m05k21L89Q81R31Q66J106J491J530J051L32k90o56p60
52693B61181p31p54q46q51p14o62q29r56p15k99k63p33j132r63n22m29o54n37
52675B48591Q6M75Q3m15Q5J456K338J840O52J5K54P82J178J515J831J875J520
52658B64161J057Q93J144J533J544Q71j31o36k58L81L68l55r94j005o39l37j26
52641B67471J24K45J1m54p96r00r13q73o30j08N13R22R02L90m91j410j966j959
52623B60078j579j210j036q56m12K40P60R05O70J61m26o89l09M22P35L57o0J70
52605B57921P10O55j56r33r93m08M68J405J983J594K72r51j148o38m51q53j111
52588B57366o77Q5N77Q09J111J404J269O68J29P5L07L68K21J90L18K00l21p14
$$ plain form
52570 263385 262939 263057 263062 261971 259621 256832 254565 253271 252966 253450 254261 254777 254665 254110 253529 253213 253288 253706
52552 253706 254143 254166 253725 253211 252872 252441 251683 250989 250988 251716 252583 253157 253550 253999 254519 255090 255885 257057 258490
52533 258490 259928 261180 262136 262758 263200 263760 264557 265396 266064 266608 267206 267874 268503 269098 269855 271012 272742
52516 272742 275058 277711 280236 282255 283766 285097 286553 288180 289827 291370 292797 294020 294634 293974 291597
52501 291597 287681 282875 277823 273006 268905 265916 264017 262788 261926 261516 261638 262007 262241 262306 262407 262621
52485 262621 262885 263290 264087 265383 266999 268618 269968 270918 271533 271915 271951 271453 270714 270623 271817 273885 275850
52468 275850 277354 278924 281104 283835 286792 289808 292613 294562 295040 294094 292353 290370 288236 285752 282808
52453 282808 279519 276117 272807 269813 267544 266477 266604 267090 266827 265365 263141 260859 259023 258091 258520
$$ packed form
52570B63385m46J18Nj091k350k789k267j294l05M84Q11N16j12n55n81l16P5M18
52552B53706M37K3m41n14l39m31p58o94jP28Q67N74L93M49N20N71P95J172J433
52533B58490J438J252R56O22M42N60P97Q39O68N44N98O68O29N95P57J157J730
52516B72742K316K653K525K019J511J331J456J627J647J543J427J223O14o60k377
52501B91597l916m806n052m817m101k989j899j229q62m10J22L69K34O5J01K14
52485B62621K64M05P97J296J616J619J350R50O15L82L6m98p39r1J194K068J965
52468B75850J504J570K180K731K957L016K805J949M78r46j741j983k134k484k944
52453B82808l289l402l310k994k269j067J27M86k63j462k224k282j836r32M29
$$ plain form
52438 258520 260259 262509 264323 265344 265749 265702 265208 264375 263392 262288 261035 259914 259435 259744 260362 260730 260923
52421 260923 261685 263748 267115 271000 274475 277244 279820 282975 287142 292307 298241 304642 311224 318001
52407 318001 325457 334058 343399 351963 357922 360191 358768 354273 347465 339172 330365 321961 314496 308136
52393 308136 303038 299482 297491 296489 295636 294539 293432 292666 292246 292003 291897 291991 292273 292752 293657 295309 297832
52376 297832 301060 304661 308226 311398 314159 316957 320324 324290 328316 331840 334784 337487 340194 342639
52362 342639 344149 344287 343422 342548 342401 342863 343390 343918 345056 347332 350452 353403 355229 355738 355590 355796 357019
52345 357019 359233 361992 364965 368165 371777 375869 380370 385273 390759 397051 404112 411654 419553 428143
52331 428143 437768 448096 458347 468452 479610 493225 509470 527222 545303 563277 581078 598481
$$ packed form
52438B58520J739K250J814J021M05m7m94q33r83j104j253j121m79L09O18L68J93
52421B60923P62K063L367L885L475K769K576L155M167N165N934O401O582O777
52407C18001P456Q601R341Q564N959K269j423m495o808q293q807q404p465o360
52393C08136n098l556j991j002q53j097j107p66m20k43j06R4K82M79R05J652K523
52376B97832L228L601L565L172K761K798L367L966M026L524K944K703K707K445
52362C42639J510J38q65q74j47M62N27N28J138K276L120K951J826N09j48K06J223
52345C57019K214K759K973L200L612M092M501M903N486O292P061P542P899Q590
52331D28143R625J0328J0251J0105J1158J3615J6245J7752J8081J7974J7801J7403
$$ plain form
52319 598481 615274 631662 648155 665157 682857 701388 720865 741268 762400 783963 805656
52308 805656 827305 848928 870531 891822 912324 931954 951242 970692 989905 1007541 1022246
52297 1022246 1033533 1041823 1047814 1051895 1054040 1054036 1051747 1047242 1040829 1033015 1024347 1015174 1005549 995484
52283 995484 985313 975735 967468 960874 955912 952298 949670 947716 946329 945733 946380 948657 952643 958117
52269 958117 964768 972382 980881 990281 1000651 1012132 1024872 1038878 1053933 1069671 1085761 1102041
52257 1102041 1118498 1135125 1151706 1167721 1182517 1195702 1207278 1217263 1225166 1230043 1231252 1229069
52245 1229069 1224370 1217713 1209023 1198256 1186043 1173225 1159815 1144929 1127963 1109410 1090244 1070836
52233 1070836 1051013 1030959 1011426 992935 975293 958119 941461 925657 910926 897372 885106
$$ packed form
52319E98481J6793J6388J6493J7002J7700J8531J9477K0403K1132K1563K1693
52308H05656K1649K1623K1603K1291K0502J9630J9288J9450J9213J7636J4705
52297A022246J1287Q290N991M081K145mk289m505o413p814q668r173r625j0065
52283I95484j0171r578q267o594m962l614k628j954j387n96O47K277L986N474
52269I58117O651P614Q499R400J0370J1481J2740J4006J5055J5738J6090J6280
52257A102041J6457J6627J6581J6015J4796J3185J1576R985P903M877J209k183
52245A229069m699o657q690j0767j2213j2818j3410j4886j6966j8553j9166j9408
52233A070836j9823k0054j9533j8491j7642j7174j6658j5804j4731j3554j2266
$$ plain form
52222 885106 874075 864020 854870 846921 840350 834874 830259 826901 825317 825179 825418 825353 825182 825229 825258 824899
52206 824899 824391 824438 825398 826994 828866 831108 834128 838101 842759 847718 852841 858149 863441 868219 872042
52191 872042 874778 876444 876988 876382 874752 872163 868433 863327 856903 849466 841360 833063 825352 818894 813591
52176 813591 808670 803595 798724 794944 792739 791745 791113 790276 789404 789172 790029 791793 793997 796480 799475 803213
52160 803213 807677 812642 817719 822413 826361 829574 832309 834812 837368 840353 843883 847504 850662 853478
52146 853478 856624 860388 864283 867725 870588 872894 874461 875336 876305 878468 882330 887672 894257 902293 912064
52131 912064 923410 935903 949541 965074 983479 1005040 1029090 1054673 1081350 1109230 1138347
52120 1138347 1168265 1198283 1227826 1256659 1284900 1312892 1340877 1368676 1395705 1421194 1444351
$$ packed form
52222H85106j1031j0055r150p949o571n476m615l358j584j38K39o5j71M7K9l59
52206H24899n08M7R60J596J872K242L020L973M658M959N123N308N292M778L823
52191H72042K736J666N44o06j630k589l730n106o424p437q106q297p711o458n303
52176H13591m921n075m871l780k205r94o32q37q72k32Q57J764K204K483K995L738
52160H03213M464M965N077M694L948L213K735K503K556K985L530L621L158K816
52146H53478L146L764L895L442K863K306J567Q75R69K163L862N342O585Q036R771
52131I12064J1346J2493J3638J5533J8405K1561K4050K5583K6677K7880K9117
52120A138347K9918L0018K9543K8833K8241K7992K7985K7799K7029K5489K3157
$$ plain form
52109 1444351 1464552 1481705 1496424 1509594 1521720 1532780 1542508 1550499 1556182 1559113 1559348 1557250 1552891
52096 1552891 1545912 1535902 1522609 1505930 1486150 1464225 1441395 1418438 1395668 1373509 1352513
52085 1352513 1332814 1314213 1296963 1281780 1268840 1257461 1247134 1238262 1231385 1226282 1222435 1219997
$$ packed form
52109A444351K0201J7153J4719J3170J2126J1060R728P991N683K931K35k098m359
52096A552891o979j0010j3293j6679j9780k1925k2830k2957k2770k2159k0996
52085A352513j9699j8601j7250j5183j2940j1379j0327q872o877n103l847k438
$$ [...]
##END NTUPLES=NMR SPECTRUM
##END=
