
##TITLE=AC1352_CHIAH12170_6647970_0TLZOeHOTL
##JCAMPDX= 6.0         $$ Bruker NMR JCAMP-DX V2.0
##DATA TYPE= NMR SPECTRUM
##DATA CLASS= NTUPLES
##ORIGIN= BRUKER
##OWNER= Administrator
$$ 1.72 TOPSPIN		Version 2.1
$$ 2012-08-10 22:26:07.562 -0500  Administrator@TOPSPIN
$$ Compression mode = diff/dup
##.OBSERVE FREQUENCY= 400.02188249412
##.OBSERVE NUCLEUS= ^1H
##.ACQUISITION MODE= SIMULTANEOUS (DQD)
##.ACQUISITION SCHEME= undefined
##.AVERAGES= 8
##.DIGITISER RES= 22
##SPECTROMETER/DATA SYSTEM= spect
##.PULSE SEQUENCE= zg30
##.SOLVENT NAME= COFFEE_meoh
##.SHIFT REFERENCE= INTERNAL, COFFEE_meoh, 1, 14.98509
##AUDIT TRAIL= $$ (NUMBER, WHEN, WHO, WHERE, PROCESS, VERSION, WHAT)
$$ ##TITLE= Audit trail, TOPSPIN		Version 2.1
$$ ##JCAMPDX= 5.01
$$ ##ORIGIN= Bruker BioSpin GmbH
$$ ##OWNER= Administrator
$$ $$ C:\Bruker\TOPSPIN/data/COFFEE/nmr/AC1352_CHIAH12170_6647970_0TLZOeHOTL/10/pdata/1/auditp.txt
$$ ##AUDIT TRAIL=  $$ (NUMBER, WHEN, WHO, WHERE, PROCESS, VERSION, WHAT)
(   1,<2012-08-10 22:25:59.765 -0500>,<Administrator>,<TOPSPIN>,<go>,<TOPSPIN 2.1>,
      <created by zg
	started at 2012-08-10 22:24:52.875 -0500,
	POWCHK enabled, PULCHK disabled,
       configuration hash MD5:
       6B 1B 68 BB D9 2E 58 E2 7F 35 AD 54 07 DF 0E 41
       data hash MD5: 64K
       D1 8A 37 BF 1F 09 06 E9 BE EE B9 3B 2C ED 39 C2>)
(   2,<2012-08-10 22:26:03.234 -0500>,<Administrator>,<TOPSPIN>,<proc1d>,<TOPSPIN 2.1>,
      <Start of raw data processing
       efp LB = 0 FT_mod = 6 PKNL = 1 PHC0 = 0 PHC1 = 0 SI = 32K 
       data hash MD5: 32K
       A1 15 D7 81 8C 78 0A D2 55 AF B2 83 BC 96 AA 79>)
(   3,<2012-08-10 22:26:03.546 -0500>,<Administrator>,<TOPSPIN>,<proc1d>,<TOPSPIN 2.1>,
      <pk PHC0 = 182.9388 PHC1 = 0 
       data hash MD5: 32K
       58 8F 7C 18 EB 7B 4E E2 28 A8 4A 12 61 12 58 B3>)
(   4,<2012-08-10 22:26:03.609 -0500>,<Administrator>,<TOPSPIN>,<proc1d>,<TOPSPIN 2.1>,
      <abs ABSG = 1 
       data hash MD5: 32K
       EE FC 62 63 92 57 9B 0E 15 93 79 25 4D 00 CB 1C>)
(   5,<2012-08-10 22:26:03.640 -0500>,<Administrator>,<TOPSPIN>,<proc1d>,<TOPSPIN 2.1>,
      <abs ABSG = 2 
       data hash MD5: 32K
       61 DC 40 5F 02 86 4A A9 62 38 6C DB EF 5F 86 50>)
(   6,<2012-08-10 22:26:03.671 -0500>,<Administrator>,<TOPSPIN>,<proc1d>,<TOPSPIN 2.1>,
      <abs ABSG = 3 
       data hash MD5: 32K
       79 3A 54 24 5E 37 DF A3 80 C7 F1 27 67 2A 21 0E>)
(   7,<2012-08-10 22:26:03.703 -0500>,<Administrator>,<TOPSPIN>,<proc1d>,<TOPSPIN 2.1>,
      <abs ABSG = 4 
       data hash MD5: 32K
       3E 6E F4 E6 E6 6F 4F DD E6 EC F8 A3 70 FC 8C 75>)
(   8,<2012-08-10 22:26:03.859 -0500>,<Administrator>,<TOPSPIN>,<proc1d>,<TOPSPIN 2.1>,
      <abs ABSG = 5 
       data hash MD5: 32K
       75 DF 0F CB 2D 0C 19 BD 4C 13 D4 1D 86 14 DB E1>)
$$ ##END=
$$ 
$$ $$ hash MD5
$$ $$ 87 2D D8 68 65 90 EB 5E F0 CE 03 6D 8C 96 ED 63
##$RELAX= 
##$RELAX= 
##$RELAX= 
##$RELAX= 
##$RELAX= 
##$RELAX= 
##$RELAX= 
$$ Bruker specific parameters
$$ --------------------------
$$ [...]
150 150 150 150 150 150 150 150
##$TP07= 0
##$TPNAME0= <>
##$TPNAME1= <>
##$TPNAME2= <>
##$TPNAME3= <>
##$TPNAME4= <>
##$TPNAME5= <>
##$TPNAME6= <>
##$TPNAME7= <>
##$TPOAL= (0..7)
0.5 0.5 0.5 0.5 0.5 0.5 0.5 0.5
##$TPOFFS= (0..7)
0 0 0 0 0 0 0 0
##$TUNHIN= 0
##$TUNHOUT= 0
##$TUNXOUT= 0
##$USERA1= <user>
##$USERA2= <user>
##$USERA3= <user>
##$USERA4= <user>
##$USERA5= <user>
##$V9= 5
##$VALIST= <valist>
##$VCLIST= <CCCCCCCCCCCCCCC>
##$VD= 0
##$VDLIST= <DDDDDDDDDDDDDDD>
##$VPLIST= <PPPPPPPPPPPPPPP>
##$VTLIST= <TTTTTTTTTTTTTTT>
##$WBST= 1024
##$WBSW= 4
##$XGAIN= (0..3)
0 0 0 0
##$XL= 0
##$YL= 0
##$YMAX_a= 487421
##$YMIN_a= -643660
##$ZGOPTNS= <>
##$ZL1= 120
##$ZL2= 120
##$ZL3= 120
##$ZL4= 120
##$ABSF1= 14.98509
##$ABSF2= -5.573092
##$ABSG= 5
##$ABSL= 3
##$ALPHA= 0
##$AQORDER= 0
##$ASSFAC= 0
##$ASSFACI= 0
##$ASSFACX= 0
##$ASSWID= 0
##$AUNMP= <proc_prof1d_extract_pilot.lims>
##$AXLEFT= 0
##$AXNAME= <>
##$AXNUC= <1H>
##$AXRIGHT= 0
##$AXTYPE= 0
##$AXUNIT= <>
##$AZFE= 0.1
##$AZFW= 0.1
##$BCFW= 0
##$BC_mod= 0
##$BYTORDP= 0
##$COROFFS= 0
##$CY= 15
##$DATMOD= 1
##$DC= 0
##$DFILT= <>
##$DTYPP= 0
##$F1P= 0
##$F2P= 0
##$FCOR= 0.5
##$FTSIZE= 32768
##$FT_mod= 6
##$GAMMA= 0
##$GB= 0
##$INTBC= 1
##$INTSCL= 1
##$ISEN= 128
##$LB= 0
##$LEV0= 0
##$LPBIN= 0
##$MAXI= 10000
##$MC2= 0
##$MEAN= 0
##$ME_mod= 0
##$MI= 0
##$NCOEF= 0
##$NC_proc= -8
##$NLEV= 6
##$NOISF1= 0
##$NOISF2= 0
##$NSP= 0
##$NTH_PI= 0
##$NZP= 0
##$OFFSET= 14.98509
##$PC= 1
##$PHC0= 182.9388
##$PHC1= 0
##$PH_mod= 1
##$PKNL= yes
##$PPARMOD= 0
##$PPDIAG= 0
##$PPIPTYP= 0
##$PPMPNUM= 2147483647
##$PPRESOL= 1
##$PSCAL= 4
##$PSIGN= 0
##$PYNMP= <proc.py>
##$REVERSE= no
##$SF= 400.02
##$SI= 32768
##$SIGF1= 0
##$SIGF2= 0
##$SINO= 400
##$SIOLD= 32768
##$SPECTYP= <>
##$SREGLST= <1H.CDCl3>
##$SSB= 0
##$STSI= 32768
##$STSR= 0
##$SW_p= 8223.68421052631
##$SYMM= 0
##$S_DEV= 0
##$TDeff= 65536
##$TDoff= 0
##$TI= <>
##$TILT= no
##$TM1= 0
##$TM2= 0
##$TOPLEV= 0
##$USERP1= <user>
##$USERP2= <user>
##$USERP3= <user>
##$USERP4= <user>
##$USERP5= <user>
##$WDW= 1
##$XDIM= 32768
##$YMAX_p= 452681393
##$YMIN_p= -653417
##$CURPLOT= <Network HP LaserJet P1505>
##$CURPRIN= <$Network HP LaserJet P1505>
##$DFORMAT= <normdp>
##$LAYOUT= <+/1D_H.xwp>
##$LFORMAT= <normlp>
##$PFORMAT= <normpl>
##$SURQMSG= 1
$$ End of Bruker specific parameters
$$ ---------------------------------
##NTUPLES= NMR SPECTRUM
##VAR_NAME=  FREQUENCY,     SPECTRUM/REAL,   SPECTRUM/IMAG
##SYMBOL=    X,             R,               I
##VAR_TYPE=  INDEPENDENT,   DEPENDENT,       DEPENDENT
##VAR_FORM=  AFFN,          ASDF,            ASDF
##VAR_DIM=   32768,         32768,           32768
##UNITS=     HZ,            ARBITRARY UNITS, ARBITRARY UNITS
##FACTOR=    0.250966925370066, 1,           1
##FIRST=     8223.43324360094, -113728,      165239
##LAST=      0,             -22073,          -123216
##MIN=       0,             -653417,         0
##MAX=       8223.43324360094, 452681393,    0
$$ Real data points
##PAGE= N=1
##DATA TABLE= (X++(R..R)), XYDATA
$$ [...]
$$ plain form
19446 -415525 -70963 310726 -31147 221468 188961 140537 -80736 -139509 246988 -59235 -364509
19435 -364509 15718 -215085 -162572 -51681 197240 -216865 38766 -105489 -61092 -143174 -94572
19424 -94572 -16657 -352954 -112040 -135664 -2440 158043 -157252 -172908 -43412 -63863 172383
19412 -29130 -91056 -121710 -115180 -214707 -17638 -123978 -84329 -135390 -180340 -2726 139110 84739
19400 84739 50941 -38685 59404 203691 79123 381981 -191308 13268 100471 6011 57098
19389 57098 -174620 -296139 -67956 86639 -242359 59331 -209379 -115773 -224684 -375175
19379 -375175 104620 68655 -29220 -200553 -211186 -20271 56451 -101048 184465 -34774 229959
19367 -137875 419610 -166118 62822 125789 2330 101614 -198066 -108058 772 -107305 81104
$$ packed form
19446d15525g0963C10726c1147B21468l2507m8424h0736n8773B46988e9235l05274
19435c64509A5718b15085N2513e1681A97240b16865C8766a05489M4397q2082M8602
19424i4572a6657l36297a12040k3624b440A58043a57252j5656d3412k0451A72383
19412b9130o1926l0654O530r9527a7638j06340L9649n1061m4950b726A39110n4371
19400H4739l3798c8685E9404J44287G9123L02858a91308A3268Q7203F011N1087
19389E7098a74620j21519f7956H6639b42359E9331b09379R3606j08911j50491
19379c75175A04620l5965b9220j71333j0633b0271E6451a01048A84465c4774B29959
19367a37875D19610a66118F2822O2967B330R9284a98066R0008G72a07305H1104
$$ plain form
19355 78859 -144968 -59357 122282 -288931 135345 90591 -176507 -12177 -107153 -89174 -346745
19344 -346745 -359661 62985 -111460 -112792 43458 -481524 -15708 -18613 -131766 -281441 175219
19332 150709 -98443 -148351 -216986 135159 -73874 136456 -166077 -242871 -66617 -381134 -278484
19321 -278484 -326934 76361 454272 -49109 -97774 -186436 -78989 -36071 52081 24823 -62838
19309 -19684 118733 -64036 15386 -150856 -41118 68781 -263537 181246 -41554 131756 -318824
19297 5674 5399 -239819 -144603 -293356 -161948 366358 196952 -185798 -174880 -137918 -18440
19285 -187026 -285535 -275855 -75406 -207792 -172043 -440256 -250851 -456572 -200960 18225 -61814
19273 194634 122319 -38905 -75333 21638 -209482 -35397 -94411 -39532 -119163 -68546 -142044
$$ packed form
19355G8859a44968e9357A22282b88931A35345m4754a76507a2177r4976J7979k57571
19344c46745j2916F2985a11460j332D3458d81524a5708k905j13153j49675A75219
19332A50709i8443m9908o8635A35159g3874A36456a66077p6794f6617l14517J02650
19321b78484m8450G6361L77911d9109m8665q8662g8989c6071E2081B4823f2838
19309a9684A18733f4036A5386a50856d1118F8781b63537A81246d1554A31756c18824
19297E674k75b39819R5216j48753J31408C66358j69406a85798J0918L6962a8440
19285a87026r8509R680g5406j32386L5749k68213J89405k05721b00960A8225f1814
19273A94634p2315c8905l6428B1638b09482c5397n9014c9532p9631N0617p3498
$$ plain form
19262 -142044 22817 -206415 -139367 165036 32318 -22018 -427204 -12902 -161557 -372768
19252 -372768 -65661 -396105 -113256 -233032 302676 50835 -22433 -299925 -1301 -386270
19242 -386270 -76755 -25913 265666 -138933 -135651 -370729 188114 79249 88045 -60719 -100433
19231 -100433 -11288 -426490 -209692 -117229 22256 -114659 13549 -130068 -149294 -96170 248935
19219 -196921 -153504 74286 8387 -167316 148639 -117636 -131047 -414515 -112879 30627 -140223
19207 -79360 -193398 -288664 -195562 -293629 107218 -213907 -165659 -215591 190732 15402 185408
19196 185408 18853 75766 -19153 162556 -91131 -37231 14882 46966 224372 -148143 -171717
19185 -171717 48074 -6280 18916 -106875 -251358 172852 -193010 -86074 89560 -150745 -293594
$$ packed form
19262a42044B2817b06415O7048A65036C2318b2018m05186a2902j48655k11211
19252c72768f5661l30444a13256j19776C02676E0835b2433k77492a301l84969
19242c86270g6755b5913B65666a38933L282k35078A88114G9249Q796f0719l9714
19231a00433a1288m15202b09692R2463B2256a14659A3549a30068j9226N3124B48935
19219a96921M3417G4286H387a67316A48639a17636j3411k83468a12879C0627a40223
19207g9360j14038r5266R3102r8067A07218b13907M8248m9932A90732A5402J70006
19196A85408A8853N6913a9153A62556i1131c7231A4882L2084J77406a48143k3574
19185a71717D8074f280A8916a06875j44483A72852a93010h6074H9560a50745j42849
$$ plain form
19174 -293594 -120034 -31713 77397 -236442 121286 -17744 252408 261042 -196658 84184 -184618
19162 98104 -51224 -56878 253202 92353 -156308 -26608 -112494 -259285 -262378 -41017 -238075
19151 -238075 238386 324756 -73441 -36596 -89875 -54588 -172064 98271 -128127 -243125 -151692
19140 -151692 165041 23736 -170157 -408398 -229640 -66581 -86852 32458 57408 14078 87018
19129 87018 -206270 417973 28078 -175072 -48273 -38718 198437 134478 -90229 118943 -24381
19117 30751 -39871 -95184 297476 -388231 -128075 184140 -58522 6089 127432 -129238 145731
19105 175526 -198641 178819 -170229 -97287 -173250 -201879 -166484 -289117 -142466 -106710
19095 -106710 272979 -94171 -140216 -193859 -167725 -119440 -51757 71183 -55931 -3338 -218171
$$ packed form
19174b93594a20034c1713G7397b36442A21286a7744B52408Q634a96658H4184a84618
19162I8104e1224n654B53202I2353a56308b6608q5886j46791l093d1017j97058
19151b38075B38386Q6370g3441c6596n3279L5287j17476I8271a28127j14998R1433
19140a51692A65041B3736a70157k38241J78758f6581k0271C2458K4950A4078P2940
19129H7018b06270D17973B8078a75072d8273R555A98437o3959i0229A18943b4381
19117C0751c9871n5313B97476c88231a28075A84140e8522F089J21343a29238A45731
19105A75526a98641A78819a70229P2942p5963k8629L5395j22633a42466L5756
19095a06710B72979i4171m6045n3643K6134M8285e1757G1183e5931c338k14833
$$ plain form
19084 -218171 -217417 306991 -269967 94185 8465 14641 -143556 -73509 37939 -242631 -34828
19072 129160 257864 111545 -225858 112893 11813 157746 -206701 41379 206299 97376
19061 215871 -375659 527602 248407 -96286 -288583 108485 -473098 -401921 -14276 -193362
19051 -193362 -152719 -14762 -72405 -188785 -27258 69841 -2046 73938 -18885 -249529 101144
19039 -47674 -224853 -194906 131540 -232115 100428 -110071 5956 -48198 134969 362522
19029 362522 -81266 -117405 -151817 179336 -58403 32934 60901 70855 -42686 -45777 -110131 126744
19016 160519 -76086 -113365 -620322 105479 -76984 16616 282156 227206 -86731 333472 -14997
19004 -16685 -239148 219380 45646 -100300 39777 308393 -196383 940 -71200 -164703 -163483
$$ packed form
19084b18171P54C06991b69967I4185H465O176a43556P0047C7939b42631c4828
19072A29160J28704A11545b25858A12893A1813J45933b06701D1379J64920I7376
19061B15871c75659E27602B48407i6286j92297A08485d73098P1177a4276j79086
19051a93362M0643a4762n7643j16380b7258F9841b046G3938a8885k30644A01144
19039d7674j77179K9947A31540b32115A00428a10071E956d8198A34969K27553
19029C62522h1266l6139l4412A79336e8403C2934K7967R954d2686l091o4354A26744
19016A60519g6086l7279n06957A05479g6984A6616K65540n4950h6731C33472a4997
19004a6685k22463B19380D5646a00300C9777K68616a96383I40g1200r3503J220
$$ plain form
18993 -163483 -76889 116764 323899 22593 -205126 -42205 26046 -117861 -307223 49492
18982 -311104 -142668 -46211 267532 -117593 195252 43146 8500 326442 87551 279061
18972 279061 361223 358247 47624 133279 -40969 165271 218381 -260064 163756 83563 -34598
18960 -118902 -70677 -37386 -331126 -157957 35701 -76125 -86269 51005 -59236 146170 -376868
18948 -113280 26561 -230917 -234827 550 -14837 -236212 237014 -124094 123914 138784 -29903
18936 163072 -119304 -238265 -141731 98751 -307514 113923 -78010 -89634 232306 122090
18926 122090 129635 -88423 -217464 72600 -66807 -236234 117952 -78667 274890 115863 158070
18915 158070 -263922 -254605 16395 42079 6306 159028 765302 453013 101958 66294 -100579
$$ packed form
18993a63483g6889A16764K07135B2593b05126d2205B6046a17861j89362D9492
18982c11104a42668d6211B67532a17593A95252D3146H500L17942H7551J91510
18972B79061Q2162k976D7624Q5655d0969A65271N3110b60064A63756q0193c4598
18960a18902M8225L3291k93740a57957C5701g6125j0144E1005e9236A46170c76868
18948a13280B6561b30917l910E50a4837k21375B37014a24094A23914J4870b9903
18936A63072a19304j18961R6534I8751c07514A13923g8010j1624B32306j10216
18926A22090P545h8423j29041G2600f6807j69427A17952g8667B74890A15863M2207
18915A58070b63922R317A6395K5684F306J52722O06274l12289A01958l5664a00579
$$ plain form
18903 -368646 30298 69578 133367 -229847 72598 42485 -124845 -136056 -97180 -38871 -279968
18892 -279968 -312984 30426 -237377 -14738 -4968 62182 -143309 -8770 -141391 399993 -75216
18880 -170640 200651 353443 45795 -104334 -570934 -2283 -18922 -84096 90553 -81503 33650
18868 -201203 -274176 -113767 -456179 -118087 341100 -79392 -26306 -304324 -122282 -190657
18858 -190657 -272927 -43 45719 -54089 -361312 -155605 -326352 271045 163819 -63020 58336
18846 71900 273866 158179 -40074 391894 -169811 -151493 -173740 201172 53553 25546 11919
18834 -373201 -314859 -148295 172095 29329 207720 -263919 352190 -178389 -148802 -185813
18824 -185813 -149623 -259061 -65116 -206033 259143 -74095 195717 27345 22368 -72778 488682
$$ packed form
18903c68646C0298L9280O3789b29847G2598l0113a24845j1211L8876c8871k41097
18892b79968l3016C0426b37377a4738d968F2182a43309h770j32621C99993g5216
18880a70640B00651J52792D5795a04334m66600b283j6639o5174I0553h1503C3650
18868b01203p2973a13767l42412a18087C41100g9392b6306k78018a22282o8375
18858a90657q2270d3D5719e4089l07223a55605j70747B71045j07226f3020E8336
18846G1900K01966j15687d0074C91894a69811J8318k2247B01172E3553B5546A1919
18834c73201N8342a48295A72095B9329J78391b63919C52190a78389K9587l7011
18824a85813L6190j09438f5116j40917B59143g4095A95717B7345m977g2778D88682
$$ plain form
18812 13493 -80709 385489 433378 314306 59768 134398 17784 230503 179611 -37343 76335
18800 94673 -313272 -585 -172339 -287013 -293860 251553 -38799 37352 2860 -212542 -427601
18789 -427601 97541 362091 -15087 -191231 -24462 -288311 -174163 281139 -30171 -364619
18779 -364619 -47853 -179212 -81291 -126144 -102676 -96434 39182 -224124 319267 -137853 -195017
18768 -195017 -333859 -119648 195158 -327294 49063 20312 231553 -22837 -145251 -278933
18758 -278933 83867 -45656 74984 195491 252247 -361630 -144290 -207421 231029 150187 -115344
18746 -275761 -456715 -111831 -52699 -110583 -111319 57641 -114374 -148109 -197621 -231651 -33637
18734 -98967 147592 222376 -9935 55992 -104452 -59700 -321090 -133339 71835 127008 -327387
$$ packed form
18812A3493h0709C85489M7889j19072E9768P4630A7784K12719n0892c7343G6335
18800I4673c13272e85j71754j14674o847B51553c8799C7352B860b12542k15059
18789d27601I7541K64550a5087j76144b4462k63849J14148B81139c0171l34448
18779c64619d7853j31359h1291m4853K3468O242C9182b24124C19267a37853n7164
18768a95017j38842a19648A95158c27294D9063B0312K11241b2837j22414j33682
18758b78933H3867d5656G4984J20507N6756c61630a44290o3131B31029q0842a15344
18746b75761j80954a11831e2699n7884p36E7641a14374l3735m9512l4030c3637
18734i8967A47592P4784i935E5992a04452M4752k61390a33339G1835N5173c27387
$$ plain form
18722 -276525 -89319 -164102 139221 -241887 -144704 -89987 -76651 -171505 114962 -107961 98686
18710 -99325 -19109 -83970 -321014 156436 328788 96801 -207786 -93331 101892 -344372
18699 -145391 -51505 -183190 -151721 -99115 27801 143215 -155934 -204475 75484 90115 39707
18687 76737 -44896 54835 -293342 -172811 -53257 -195689 -98107 -33081 -188747 -126212 -138861
18676 -138861 -259943 -220136 -95657 -91534 -24580 -39004 -78223 -41700 -386827 242732 -104915
18664 -247385 -235980 -66378 495560 359894 74853 -227888 5314 -218865 -59195 36021 -275861
18652 7854 -53172 -103663 -178884 5406 9096 -334811 -230287 -227182 9875 -189573 45412 229651
18640 229651 -74087 140207 100438 20482 20180 41181 -85604 458272 -333124 67344 -27162
$$ packed form
18722b76525h9319p4783A39221b41887R7183N4717J3336r4854A14962a07961I8686
18710i9325a9109o4861k37044A56436J72352I6801b07786i3331A01892c44372
18699a45391e1505j31685L1469N2606B7801J15414a55934m8541G5484J4631C9707
18687G6737d4896E4835b93342J20531e3257j42432R7582c3081j55666O2535j2649
18676a38861j21082L9807i5657M123b4580j4424l9219L6523l45127B42732a04915
18664b47385J1405f6378D95560j35666G4853b27888E314b18865e9195C6021b75861
18652G854e3172n0491p5221E406L690c34811J04524L105I875a89573D5412J84239
18640B29651g4087A40207l9769B0482l02K1001h5604D58272c33124F7344b7162
$$ plain form
18628 -61381 -30190 143228 220308 -214084 -282177 -84638 102289 173617 -369595 -188393 -26242
18616 -292439 -146026 150016 -172603 -13164 127042 41843 -116739 -147251 -169850 -125774
18606 -125774 -278692 -12001 103016 5760 -143113 -225902 73083 83215 -2169 96441 548129
18595 548129 -51897 -29279 48014 -119295 -45842 -130895 -14081 -344957 174327 -165871 39038
18583 198466 -253916 200797 -126033 -166517 -151323 -240801 -373100 -218773 22270 -179175
18572 -42409 -236483 -220588 -97512 -194786 -6036 -38855 363425 -258426 -414364 -116546 38566
18560 -229566 -122208 -3425 -421649 -198890 192802 296077 -127455 10095 -69457 8820 116458
18549 116458 295198 -261662 -176722 -143661 -65199 -135291 95084 -98972 -23507 103405 -95535
$$ packed form
18628f1381c0190A43228P7080b14084o8093h4638A02289P1328c69595J81202b6242
18616b92439a46026A50016a72603a3164A27042D1843a16739l0512k2599M4076
18606a25774j52918a2001A03016E760a43113q2789G3083J0132b169I6441M51688
18595E48129e1897K2618D8014a19295d5842q5053a4081l30876A74327a65871C9038
18583A98466b53916B00797a26033m0484J5194q9478j32299J54327B2270a79175
18572d2409j94074J5895i7512r7274f036l2819C63425b58426j55938a16546C8566
18560b29566J07358c425m18224a98890A92802J03275a27455A0095f9457H820J07638
18549A16458J78740b61662Q4940L3061f5199p0092I5084i8972b3507A03405i5535
$$ plain form
18537 -85490 82033 -97046 -37087 -49779 -126690 -391562 15546 -122654 201958 -269988 -60611
18525 15959 -165212 -335840 28307 249324 67030 165298 -6496 75442 -382180 102321 -218742
18513 10422 -48126 -238522 -214139 91293 193800 -270190 34218 -20111 152009 -71548 183187
18501 37847 174355 -22064 -99528 48296 249407 335503 -154323 70946 117631 -8 -91527 -107559
18489 -107559 70914 -102532 234596 -120161 -503022 -337529 -48549 -325276 66725 197509
18479 197509 -214318 -187870 -33447 -239508 -288818 -135611 94406 -265840 -220623 -783 -549220
18468 -549220 85476 -67517 -67276 100199 -148906 42827 -110416 -112678 -99060 331853 -99466
18456 -385683 -70669 352938 -89497 -200451 -58033 -1794 95978 -91515 219694 -89814 -81318
$$ packed form
18537h5490H2033i7046c7087j2692p6911k64872A5546a22654B01958b69988f0611
18525A5959a65212j70628B8307K21017F7030R8268f496G5442c82180A02321b18742
18513A0422d8126j90396K4383I1293J02507b70190C4218b0111A52009g1548A83187
18501C7847J36508b2064p7464D8296K01111Q6096a54323G0946M6685hr1519j6032
18489a07559G0914a02532B34596a20161l82861J65493d8549k76727F6725J30784
18479A97509b14318K6448c3447k06061m9310a35611I4406b65840M5217g83n48437
18468e49220H5476f7517K41A00199a48906D2827a10416k262J3618C31853i9466
18456c85683g0669C52938h9497j10954e8033a794I5978i1515B19694h9814Q496
$$ plain form
18445 -81318 -43277 -114456 -219296 49835 165998 -107679 -255494 295863 -203526 -227183
18435 -227183 -267833 -162300 201895 -239979 -63753 -185361 52272 -67866 -188268 74999
18424 148078 -88142 -194179 185223 61695 -34731 15931 -96295 -46039 -209765 -36170 -149712
18413 -149712 -159188 -98354 21592 160602 -100501 -52886 -24982 111433 44095 -111837 -103439
18402 -103439 -105680 -115807 295528 -169752 172090 283691 49181 -370345 85168 -116688
18391 -33421 -21355 235670 27930 372142 -90077 -121042 -392431 -90175 201060 155664 -29291
18379 12294 64767 72311 188745 -198180 -252059 81944 -163659 -279864 -223239 14428 -129928
18367 -43253 124102 347374 -133308 132727 -236012 -253108 -88961 17608 292276 -153870
$$ packed form
18445h1318L8041p1179j04840D9835J16163a07679j47815B95863b03526k3657
18435b27183m0650J05533B01895b39979f3753j21608E2272f7866j20402G4999
18424A48078h8142j06037A85223F1695c4731A5931i6295d6039j63726c6170j13542
18413a49712r476O0834B1592J39010a00501M7615b4982A11433D4095a11837Q398
18402a03439k241j0127B95528a69752A72090J11601D9181c70345H5168a16688
18391c3421J2066B35670B7930L44212i0077l0965k71389i0175B01060m5396b9291
18379A2294N2473P544J16434a98180n3879H1944a63659j16205N6625A4428a29928
18367d3253A24102K23272a33308A32727b36012j7096h8961A7608K74668a53870
$$ plain form
18356 -135103 4309 78645 26539 7613 -153987 -143633 185660 -241135 15060 -174231 132342
18344 -184945 19729 51557 -151682 -123272 35167 -179166 338669 -186054 -28815 -365569
18334 -365569 358143 -30411 89292 126317 -51615 -180173 -96668 -27817 135670 -10430 -59062
18323 -59062 202527 -153014 -214852 -416462 20134 -245655 13640 -304141 -144568 -86300
18313 -86300 197092 223841 21731 38121 -248828 -39140 -164645 -133585 -31088 -273545 18249
18301 21472 -117629 -207304 -173621 104532 -52915 -161658 62118 283219 -185355 217078
18290 -176993 -263405 26836 -2070 113725 -3407 52357 205864 117209 -122465 14770 -197991
18278 -48572 2146 206614 143239 -69471 -104899 -219620 202777 -90429 -359509 -144581 303629
$$ packed form
18356a35103D309P4336B6539G613a53987J0354A85660b41135A5060a74231A32342
18344a84945A9729L1828a51682K8410C5167a79166C38669a86054b8815l36754
18334c65569C58143c0411H9292L7025e1615j28558Q3505b7817A35670a0430m8632
18323e9062B02527a53014o1838k01610B0134b45655A3640c04141a44568N8268
18313h6300A97092K6749B1731J6390b48828c9140j25505L1060c1088k42457A8249
18301B1472a17629q9675L3683A04532e2915j08743F2118K21101a85355B17078
18290a76993q6412B6836b070A13725c407E2357J53507q8655a22465A4770a97991
18278d8572B146K04468o3375f9471l5428j14721B02777i0429k69080a44581C03629
$$ plain form
18266 14992 -215394 27130 -180556 -7509 -298886 -205137 118895 -48286 -17629 255926 -108132
18254 -79882 107103 -286932 56612 7509 -32886 -184272 308759 87085 86760 115861 124709 123002
18242 123002 -128200 366656 323017 -2395 -95177 151987 -74791 19858 979 -339417 54073
18230 273223 -117413 799 -62557 -166483 -32167 102523 -199090 144015 -100259 -32116 -197754
18219 -197754 91404 -194276 183200 254580 -12934 -121414 -255482 -91679 -7476 -119489 -205299
18208 -205299 132053 36088 -117535 -321685 -143593 -117243 -54160 -245988 462243 133238
18197 -87470 100005 105989 -40566 -212495 1043 151433 72226 119133 45200 204369 2400
18185 114651 -153267 -155424 4179 67253 155662 -203196 154675 -35063 59699 -3937 -81890
$$ packed form
18266A4992b15394B7130a80556g509k91377R3749A18895d8286a7629B55926a08132
18254g9882A07103b86932E6612G509c2886j51386C08759H7085l25K9101Q848j707
18242A23002a28200C66656m3639b395r2782A51987g4791A9858I79c39417E4073
18230B73223a17413G99f2557j03926c2167A02523a99090A44015a00259c2116j65638
18219a97754I1404a94276A83200P1380a2934j08480j34068i1679g476j12013q5810
18208b05299A32053C6088a17535k04150a43593K6350e4160j91828D62243A33238
18197h7470A00005N984d0566j71929A043J50390G2226M6907D5200J59169B400
18185A14651a53267k157D179O3074Q8409b03196A54675c5063E9699c937p7953
$$ plain form
18174 -81890 89248 -112229 -35616 -18965 -13895 -236288 -30225 -55095 97007 -114878 90502
18162 -206629 -60571 95104 402915 145552 107665 203594 -332442 -13252 -52455 -152349 287320
18150 207628 121443 169613 18715 -145569 289354 296456 203754 -165854 -52376 -13327 30645
18138 67666 -82423 -111711 36878 -208716 16931 -175852 298451 -97142 67360 -151146 -314570
18127 -314570 -98214 31075 449031 190113 304031 176996 89390 -151290 -18006 307361
18116 -53252 -157033 -54911 -197493 -110880 -28890 334411 118180 84108 -230229 216503
18105 36744 8861 -184891 -20830 109613 -40341 495126 -72298 54296 -144297 32974 -60343
18093 -319960 131536 272612 173532 80961 25907 -33274 -121184 119292 -51850 -137666 123323
$$ packed form
18174h1890H9248a12229c5616J6651N070k22393c0225k4870I7007a14878I0502
18162b06629f0571I5104L07811A45552l7887R5929c32442a3252l9203r9894B87320
18150B07628q6185M8170A8715a45569B89354P102r2702a65854e2376a3327C0645
18138F7666h2423k9288C6878b08716A6931a75852B98451i7142F7360a51146j63424
18127c14570i8214C1075M17956A90113J13918j27035q7606a51290a8006C07361
18116e3252j03781e4911j42582Q6613b8890C34411A18180l4072b30229B16503
18105C6744H861a84891b0830A09613d0341D95126g2298E4296a44297C2974f0343
18093c19960A31536J41076r9080H0961B5907c3274q7910A19292e1850q5816A23323
$$ plain form
18081 18010 -280548 -200808 152938 -12965 67175 -310259 -81995 168145 1087 -118126 -373232
18070 -373232 139734 -202809 933 142400 -1727 210688 -63316 -118719 74919 -188665 156392
18058 -75224 16207 205064 -106001 -191678 53040 64299 -511004 16852 -8326 167439 -87970
18046 95920 -81154 -285528 154080 -105397 302268 230933 118855 -156724 -148578 -195912 139745
18034 69922 95589 -3176 47746 163913 -104620 199726 -15102 188495 256516 39409 159961
18023 159961 -178215 -34486 -19762 -284194 -215636 38744 -15442 116882 67436 377660 248766
18012 248766 4066 296631 5476 32008 19573 69330 -163563 107845 58131 113316 -310332
18000 -23687 61685 77755 -24456 132658 -117366 -125651 -62141 70149 315271 119019 177350
$$ packed form
18081A8010b80548P9740A52938a2965F7175c10259h1995A68145A087a18126k55106
18070c73232A39734b02809I33J41467a727B10688f3316n5403G4919a88665A56392
18058g5224A6207J88857a06001q5677E3040J1259e11004A6852h326A67439h7970
18046I5920h1154k04374A54080a05397C02268p1335j12078a56724Q146m7334A39745
18034F9922K5667c176D7746J16167a04620A99726a5102A88495O8021C9409J20552
18023A59961a78215c4486J4724k64432O8558C8744a5442A16882m9446L10224j28894
18012B48766D066K92565E476K6532j2435M9757a63563A07845m9714N5185c10332
18000b3687F1685J6070b4456A32658a17366q285f2141G0149K45122A19019N8331
$$ plain form
17989 177350 149513 -187622 -424764 -89846 102990 170518 161534 118964 174339 141369 67435
17977 -107877 -117663 -32803 -209267 -134421 -121095 304986 57819 -38386 115936 67990 -236550
17965 -102679 -180585 303882 374753 9352 -178334 -105107 204919 -49224 -177797 -125245 -32924
17953 369000 -76698 141264 -263145 -386449 -27814 139528 71666 -46771 -131796 82782 175507
17942 175507 305042 -16248 -241831 -190363 198878 -5312 210335 -118547 261242 -104416
17931 127089 -7511 -98680 187519 -134751 37460 -306256 -303618 -253373 275359 -13528 -251805
17920 -251805 -259438 217156 233363 74426 223999 300981 66603 70769 -111337 287331 -134860
17908 37114 -184491 223059 -123594 -22222 -126424 -397896 -218779 85132 105441 -185073
$$ packed form
17989A77350k7837a87622k37142h9846A02990O7528q984m2570N5375l2970F7435
17977a07877r786c2803j76464P4846J3326C04986E7819c8386A15936m7946b36550
17965a02679p7906C03882P0871I352a78334P3227B04919d9224j28573N2552c2924
17953C69000g6698A41264b63145j23304b7814A39528o7862d6771q5025H2782R2725
17942A75507J29535a6248k25583N1468A98878e312B10335a18547B61242a04416
17931A27089g511r1169A87519a34751C7460c06256K638N0245B75359a3528k38277
17920b51805p633B17156J6207G4426J49573P6982F6603M166a11337B87331a34860
17908C7114a84491B23059a23594b2222j04202k71472J79117H5132K0309a85073
$$ plain form
17897 -1087 4704 276030 203793 152601 37895 -129131 -111262 405428 169977 139238 6753
17885 88010 21235 -77634 -257492 -55673 -2402 69782 -4191 49393 -1737 -3648 48665 -91208
17872 -29498 239372 -193622 130214 6083 102108 25923 -19901 141321 77190 -30010 71238
17860 28272 -223818 153255 -64075 -303444 131220 -88594 53074 90051 76804 -123589 77043
17848 232891 -153319 122238 20556 29875 263840 -28227 -203199 -44981 -26946 -221242 -74769
17836 331652 32920 -13809 272842 -43515 22643 294043 136988 42153 116503 31972 213324
17825 213324 -243496 -30467 -275638 -51533 -191846 57309 162592 -93641 107791 218101
17815 218101 167178 -127256 241196 -241286 -65700 -38124 82398 -93317 267267 -132207
$$ packed form
17897a087D704K71326p2237n1192C7895a29131J7869D05428A69977l0739F753
17885H8010B1235g7634j79858e5673b402F9782d191D9393a737j911D8665i1208
17872b9498B39372a93622A30214F083R6025B5923a9901A41321o4131c0010G1238
17860B8272b23818A53255f4075k39369A31220h8594E3074L6977j3247a23589G7043
17848B32891a53319A22238B0556R319K33965b8227j74972d4981J8035j94296g4769
17836C31652C2920a3809B72842d3515B2643K71400A36988D2153P4350C1972J81352
17825B13324b43496c0467k45171e1533j40313E7309J05283i3641A07791J10310
17815B18101n0923a27256B41196b41286f5700K7576H2398i3317B67267a32207
$$ plain form
17804 -213193 204719 207540 -176961 212687 36273 236643 53413 171931 -97885 -105851 -1200
17792 536712 206292 -17169 40700 329065 -131571 -70937 -59712 -86608 209313 84124 -166871
17780 -72932 267452 -35924 149266 56482 -171596 -113930 81034 193996 -4331 78740 396268
17769 396268 -133172 74464 -187399 -103369 -220489 153356 -152158 61901 382122 78215
17758 196843 56457 214870 149425 -46177 -9214 -75760 177263 259927 21663 49324 219460
17747 219460 216256 127448 -1859 128938 201488 -44214 239269 150411 -81389 -73727 -73137 -4604
17734 10687 76931 -37347 104521 150386 113265 194119 197147 -46456 2611 154026 347267
17723 347267 -50115 -127893 102938 21853 62035 -197700 -189529 342079 -128581 -22815 177082
$$ packed form
17804b13193B04719K821a76961B12687C6273K00370E3413J18518i7885p966a200
17792E36712B06292a7169D0700K88365a31571O0634J1225k6896B09313H4124a66871
17780g2932B67452c5924A49266E6482a71596N7666H1034J12962d331G8740L17528
17769C96268a33172G4464a87399Q4030j17120A53356a52158F1901L20221G8215
17758A96843E6457J58413o5445d6177i214o6546A77263Q2664B1663K7661J70136
17747B19460l204q8808a859A28938P2550d4214B39269q8858h1389P662N90d604
17734A0687O6244c7347A04521M5865l7121Q0854L028d6456B611J51415J93241
17723C47267e0115p7778A02938B1853M0182a97700Q171C42079a28581b2815A77082
$$ plain form
17711 139146 24406 40875 -9270 138261 30394 -32449 119744 148973 327977 300420 49858
17699 -94000 20550 -119359 -19310 348553 184252 -67884 126114 -82558 238097 189326 333252
17688 333252 -83505 111586 122957 -80932 5450 80992 -90754 160302 214491 238333 121822
17677 121822 265251 112972 13458 280434 42379 -137806 123230 228208 6074 -28245
17666 46734 26990 439277 199258 -325555 53145 173087 206395 -133194 133569 48718
17655 319093 -573 -4972 118892 228209 -147127 122491 -18168 151475 281727 50162 181342
17644 181342 29548 7378 88814 88611 -95454 51881 38484 277187 -69533 138932 -86241 2814
17631 5672 -49084 355 180293 -48676 -122221 -168105 38494 357999 -613 151698 -193362 -125719
$$ packed form
17711A39146B4406J6469i270A38261C0394c2449A19744K9229J79004k7557D9858
17699i4000B0550a19359a9310C48553j64301f7884A26114h2558B38097m8771J43926
17688C33252h3505A11586J1371h0932E450P5542i0754A60302N4189K3842j16511
17677A21822J43429A12972A3458K66976D2379a37806A23230J04978F074b8245
17666D6734j9744M12287A99258c25555E3145J19942L3308a33194A33569D8718
17655C19093e73m399A18892J09317a47127A22491a8168A51475J30252E0162J31180
17644A81342B9548G378Q1436k03i5454E1881j3397K38703f9533A38932h6241B814
17631E672d9084C55J79938d8676p3545m5884C8494L19505f13A51698a93362O7643
$$ plain form
17619 -125719 133029 239323 239782 -67525 169575 -106661 -35175 256923 -104599 527604
17608 246254 248158 131990 -44618 156630 136434 79461 35848 404065 200767 306441 87647
17596 129795 132333 160817 273358 129106 92435 457521 -56425 2180 230416 -215157 81848
17584 273777 40085 364763 -131256 420658 369917 279192 77722 485909 10137 451314
17574 451314 308055 -184301 395936 208295 132026 10038 213096 10508 -71922 -140972
17564 -140972 74534 116663 326044 270322 466028 224458 114063 79115 380896 243870
17554 243870 99346 269603 127994 136733 -41394 257781 320165 288938 321586 132201 370659
17543 370659 -12879 -18491 92358 204244 96080 247913 124477 584244 -110349 90629 269094
$$ packed form
17619a25719A33029J06294M59f7525A69575a06661c5175B56923a04599E27604
17608B46254J904j16168d4618A56630k0196n6973C5848L68217B00767J05674H7647
17596A29795K538K8484J12541A29106l6671L65086e6425B180K28236b15157H1848
17584B73777D0085L24678a31256D20658n0741r0725G7722M08187A0137M41177
17574D51314j43259a84301C95936j87641p6269A0038K03058A0508g1922o9050
17564a40972G4534M2129K09381n5722J95706B24458j10395l4948L01781j37026
17554B43870I9346J70257A27994Q739d1394B57781O2384l1227L2648A32201K38458
17543C70659a2879n612I2358J11886I6080J51833j23436M59767a10349I0629J78465
$$ plain form
17532 269094 572083 270411 300671 360368 497477 549792 749362 993422 1079514 1191714
17522 1191714 850798 654723 549512 305504 429287 558858 400843 221053 432375
17513 432375 527174 514320 1349856 1122416 1032436 768374 903269 1076414 317002 383313
17503 383313 559664 479701 646169 189152 300161 298092 228803 -2974 174561 608121 149693
17491 496529 -50398 325441 313411 501640 374158 243493 130876 249068 186090 397652
17481 397652 50243 57813 157693 501699 219060 -150395 120256 224174 4566 402116 349250
17470 349250 67574 198901 204366 -126679 80050 574987 279250 254995 345079 182320 433979
17459 433979 302300 405845 133914 50627 207874 422307 148075 121502 443954 207541
$$ packed form
17532B69094L02989B70411L0260N9697J37109N2315J99570K44060Q6092J12200
17522A191714l40916j96075j05211k44008J23783J29571j58015j79790K11322
17513D32375R4799j2854Q35536k27440q9980k64062J34895J73145C17002O6311
17503C83313J76351p9963J66468A89152J11009k069o9289b974A74561M33560A49693
17491D96529e0398C25441j2030J88229j27482j30665j12617J18192o2978K11562
17481C97652E0243P570R9880L44006B19060a50395A20256J03918D566L97550n2866
17470C49250F7574J31327N465a26679H0050M94937B79250k4255R0084j62759K51659
17459D33979j31679J03545A33914E0627J57247K14433A48075k6573L22452B07541
$$ plain form
17448 494098 526202 723417 350528 208107 476783 315863 515051 262018 655502 446367
17438 446367 37390 234432 320395 338540 262664 104894 331494 252016 235593 309393 313401
17427 313401 371171 131546 285261 345911 -233169 153682 607777 646840 246142 368030
17417 368030 495891 234088 503275 607986 488717 203677 443161 355028 443039 267937
17407 267937 499082 124158 157315 474992 524307 270949 314470 142920 207406 190876
17397 190876 81976 98903 453253 350132 591136 177889 332276 236821 349517 499914
17387 499914 19276 239981 183320 289951 300083 416081 176998 29168 263457 252489
17377 252489 399281 534903 288496 263261 457667 77925 312854 139405 297589 603835
$$ packed form
17448D94098L2104J97215C50528j42421K68676j60920J99188k53033L93484k09135
17438D46367C7390J97042Q5963J8145p5876A04894K26600p9478j6423P3800M008
17427C13401N7770A31546J53715O0650b33169A53682M54095L9063B46142J21888
17417C68030J27861B34088K69187J04711j19269B03677K39484q8133Q8011j75102
17407B67937K31145A24158L3157L17677M9315k53358M3521A42920O4486j6530
17397A90876H1976J6927L54350j03121K41004A77889J54387r5455J12696J50397
17387D99914A9276K20705n6661J06631J0132J15998A76998B9168K34289j0968
17377B52489J46792J35622k46407k5235J94406G7925K34929A39405J58184L06246
$$ plain form
17367 603835 465855 321019 20729 231789 -65737 449945 269765 345100 161599 491259
17357 491259 328485 336577 544380 95023 -61851 373249 465670 -17002 439788 261875 319348
17346 319348 57427 320560 203341 132720 567 -86750 65261 381789 83716 222196 219444
17335 219444 395851 572488 589995 312127 382971 450635 557263 -12757 280404 517145
17325 517145 244259 226661 200172 149826 432286 285503 137957 252447 270904 314969
17315 314969 517441 430172 151220 139163 464518 -90791 234463 168283 287407 66749
17304 186015 39953 296840 480272 284214 334215 355537 237126 314209 122318 449603
17294 449603 327676 -297012 273339 478690 438607 284476 451369 310894 31042 359506
$$ packed form
17367F03835j37980j44836B0729K11060f5737D49945j80180P5335A61599L29660
17357D91259j62774Q092K07803I5023f1851C73249R2421a7002D39788j77913N7473
17346C19348E7427K63133j17219p0621E67h6750F5261L16528H3716J38480k752
17335B19444J76407J76637J7507k77868P0844O7664J06628a2757B80404K36741
17325E17145B44259j7598k6489n0346K82460j46783A37957J14490J8457M4065
17315C14969K02472q7269A51220j2057L25355i0791B34463o6180J19124F6749
17304A86015C9953K56887J83432j96058N0001K1322j18411P7083A22318L27285
17294D49603j21927b97012B73339K05351m0083j54131J66893j40475C1042L28464
$$ plain form
17284 359506 260792 176397 528163 304666 -40048 436923 88324 166778 301945 350878 438359
17273 438359 201556 316944 248065 131647 664801 298747 244869 152193 568793 440192
17263 440192 615877 622088 527782 662616 280848 587653 395489 438390 191126 428305
17253 428305 -81969 199540 354423 412876 236094 479373 691193 480613 493089 90807
17242 538899 467843 187334 292993 112058 99039 185068 246341 229337 326792 134526 483560
17231 483560 458209 309652 492148 371270 338404 291843 531897 298302 415157 460786
17221 460786 473936 557513 612265 217290 154252 264388 806681 664710 574362 470590
17211 470590 547067 499922 322119 565160 670784 171503 398763 485305 499326 266539
$$ packed form
17284C59506r8714q4395L51766k23497d0048D36923H8324P8454J35167M8933Q7481
17273D38359B01556J15388o8879j16418N33154B98747n3878r2676M16600j28601
17263D40192J75685O211r4306J34834B80848L06805j92164M2901A91126K37179
17253D28305h1969A99540J54883N8453j76782K43279K11820k10580J2476I0807
17242E38899p1056A87334J05659A12058j3019Q6029O1273j7004R7455A34526L49034
17231D83560k5351j48557J82496j20878l2866m6561K40054k33595J16855M5629
17221D60786J3150Q3577N4752B17290o3038J10136N42293j41971r0348j03772
17211D70590P6477m7145j77803K43041J05624A71503K27260Q6542J4021k32787
$$ plain form
17201 266539 339420 487693 227131 256311 293333 537654 639317 457322 357737 628685
17191 628685 295595 525979 362960 423543 726963 461899 478671 502042 321904 330256
17181 330256 153256 247656 544329 801046 751590 539071 265899 303710 140988 475928
17171 475928 625411 667232 543837 209335 341527 619631 494363 704939 481734 445922
17161 445922 233503 451752 431389 919721 392458 100490 704842 678179 470119 288181
17151 288181 132583 552063 523884 534679 373923 752071 562668 433611 531240 504680
17141 504680 746787 613238 505485 615465 535132 332450 476202 599795 781372 408771
17131 408771 730776 639749 648800 657642 926007 483615 761519 548731 958006 566244
$$ packed form
17201B66539P2881J48273B27131K9180L7022K44321J01663j81995r9585K70948
17191F28685B95595K30384j63019O0583L03420k65064J6772K3371j80138Q352
17181C30256A53256R4400K96673K56717m9456k12519B65899L7811A40988L34940
17171D75928J49483M1821j23395B09335J32192K78104j25268K10576k23205l5812
17161D45922k12419K18249k0363M88332C92458A00490O04352k6663k08060j81938
17151B88181A32583M19480k8179J0795j60756L78148j89403j29057R7629k6560
17141E04680K42107j33549j07753J09980q0333k02682J43752J23593J81577l72601
17131D08771L22005r1027R051Q842K68365m42392K77904k12788M09275l91762
$$ plain form
17121 566244 722864 543825 610075 863282 557972 709985 566918 796038 877269 963685
17111 963685 741311 664286 383790 515183 704123 569647 684898 353972 742506 361622
17100 823240 821054 811242 370500 734685 794906 679503 744507 547090 592702 732468 765055
17089 765055 72584 642376 962748 763074 595283 999905 910694 685457 778481 542895
17079 542895 863635 763795 704854 648608 891424 756158 962470 1038762 934816 845403
17069 845403 746202 1027959 1167026 1007206 664757 761276 826853 931976 1124115 724383
17059 724383 585159 868100 773439 1117850 925121 1127511 908043 830847 928351 803716
17049 803716 832649 588628 1243741 1050301 1278203 941904 984480 1014389 934694 1290713
$$ packed form
17121E66244J56620j79039O6250K53207l05310J52013j43067K29120Q1231Q6416
17111I63685k22374p7025k80496J31393J88940j34476J15251l30926L88534C61622
17100H23240k186r812C70500L64185O0221j15403O5004j97417M5612J39766L2587
17089G65055G2584N69792L20372j99674j67791M04622q9211k25237R3024k35586
17079E42895L20740r9840n8941n6246K42816j35266K06312P6292j03946q9413
17069H45403r9201K81757J39067j59820l42449R6519O5577J05123J92139l99732
17059G24383j39224K82941r4661L44411j92729K02390k19468p7196R7504j24635
17049H03716K8933k44021O55113j93440K27902l36299M2576K9909p9695L56019
$$ plain form
17039 1290713 1099830 1410474 1044733 1015036 1064645 991064 1155808 1149633 1179241 1053674
17029 1053674 914938 1176053 1138300 1024165 1156150 1127581 992404 1284164 1083350 1070142
17019 1070142 1192060 1084392 1412331 1301246 1004041 1321190 975985 1192458 1158447 1570049
17009 1570049 1204883 824308 1268542 1431687 1033681 1071610 1262158 1115404 1757970 1100109
16999 1100109 1486691 1411169 1430574 1473131 1385258 1237153 1043419 1223414 1226825 1351191
16989 1351191 1746013 1202509 1495033 1276485 1487054 1069959 1703514 1310620 1412950
16980 1412950 1504977 1397430 1813383 1619791 1223488 1612738 1296170 1776433 1854611 1580128
16970 1580128 1825489 2091396 1594095 1595597 1844434 1788345 1729859 1773088 1822484 1846294 1765576
$$ packed form
17039A290713j90883L10644l65741k9697M9609p3581J64744o175K9608j25567
17029A053674j38736K61115l7753j14135J31985k8569j35177K91760k00814j3208
17019A070142J21918j07668L27939j11085k97205L17149l45205K16473l4011M11602
17009A570049l65166l80575M44234J63145l98006L7929J90548j46754O42566o57861
16999A100109L86582p5522J9405M2557q7873j48105j93734J79995L411J24366
16989A351191L94822n43504K92524k18548K10569m17095O33555l92894J02330
16980A412950R2027j07547M15953j93592l96303L89250l16568M80263P8178k74483
16970A580128K45361K65907m97301J502K48837n6089n8486M3229M9396K3810q0718
$$ plain form
16959 1765576 1621099 1830989 1705650 1766758 2000293 2051254 1816320 1762843 2050608 2080574
16949 2080574 2184812 1994308 2005695 2254090 1666298 1931340 1858181 1996938 2113176 2328487
16939 2328487 2149658 2366031 1956320 2150751 2225157 2057665 2241081 2253182 2114343 2428933
16929 2428933 2221548 2444679 2200415 2200317 2472664 2213824 2369408 1963474 2594513 2308632
16919 2308632 2603733 2551110 2480622 2817726 2706229 2799925 2728689 3005946 2654013 2919115
16909 2919115 2736884 2695918 2938465 2678119 2905185 2844612 2827390 3015068 2868504 2876415
16899 2876415 3666643 2722142 3555633 3229070 3040621 3326688 3240619 3326186 3813285 3451514
16889 3451514 3270696 3827168 3546388 3521300 3285474 3713996 3674072 3910748 3733654 3956596
$$ packed form
16959A765576j44477K09890j25339O1108K33535N0961k34934n3477K87765K9966
16949B080574J04238j90504J1387K48395n87792K65042p3159J38757J16238K15311
16939B328487j78829K16373m09711J94431P4406j67492J83416J2101j38839L14590
16929B428933k07385K23131k44264r8K72347k58840J55584m05934O31039k85881
16919B308632K95101n2623p0488L37104j11497R3696p1236K77257l51933K65102
16909B919115j82231m0966K42547k60346K27066o0573j7222J87678j46564P911
16899B876415P90228r44501Q33491l26563j88449K86067q6069Q5567M87099l61771
16889C451514j80818N56472k80780k5088k35826M28522l9924K36676j77094K22942
$$ plain form
16879 3956596 3932119 3898243 4067450 4172325 3993206 3801258 4153471 4133846 4213241 4396999
16869 4396999 4534274 4213782 4585281 4538988 4481515 4311251 4780718 4816362 4922329 4786350
16859 4786350 4814733 5199549 5339823 5216657 5284286 5600008 5339175 5495486 5280377 6084798
16849 6084798 5770366 5930162 5582051 5993986 6400345 5979375 6296895 6066328 6430932
16840 6430932 6741931 6723663 6841837 7021169 6963707 7028844 7080123 7387182 7419794 7334731
16830 7334731 7588260 7702598 8017946 8374942 8581858 8755090 8793710 8900763 8935591 9097385
16820 9097385 9091288 9421984 9654086 10017452 10345278 10190946 10463597 11003353 10709752 10941966
16810 10941966 11157893 11636983 11704818 11930151 12368194 12435322 12656160 12881340 13302016 13872928
$$ packed form
16879C956596k4477l3876J69207J04875j79119j91948L52213j9625P9395J83758
16869D396999J37275l20492L71499m6293n7473j70264M69467L5644J05967j35979
16859D786350K8383L84816J40274j23166O7629L15722k60833J56311k15109Q04421
16849F084798l14432J59796l48111M11935M06359m20970L17520k30567L64604
16840F430932L10999j8268J18174J79332n7462O5137N1279L07059L2612q5063
16830G334731K53529J14338L15348L56996K06916J73232L8620J07053L4828J61794
16820I097385o097L30696K32102L63366L27826j54332K72651N39756k93601K32214
16810A0941966K15927M79090O7835K25333M38043O7128K20838K25180M20676N70912
$$ plain form
16800 13872928 13893315 14383195 14206510 15228399 14973985 15507158 15421364 16131607 16363000
16791 16363000 17023104 17602469 17745583 17876440 18676600 19044632 19612721 20284838 20805144
16782 20805144 21255209 21891304 22387338 23046529 23329067 24348293 24766725 25434234 26477101
16773 26477101 27181114 28059354 28516251 29637718 30381665 31211332 32528118 33450933 34231934
16764 34231934 35066710 36494631 37698034 38577328 40033595 41292429 42594004 43973690
16756 43973690 45739212 46890045 48651201 50324966 51811380 53696218 55704093 57596025
16748 57596025 59646059 61690290 63730599 65694670 67995974 70035574 72452114 74806814
16740 74806814 77202713 79517165 81899464 84438850 86999006 89294306 91546026 93971443
$$ packed form
16800A3872928K0387M89880j76685J021889k54414N33173q5794P10243K31393
16791A6363000O60104N79365J43114J30857Q00160L68032N68089O72117N20306
16782B0805144M50065O36095M96034O59191K82538J019226M18432O67509J042867
16773B6477101P04013Q78240M56897J121467P43947Q29667J316786R22815P81001
16764C4231934Q34776J427921J203403Q79294J456267J258834J301575J379686
16756D3973690J765522J150833J761156J673765J486414J884838K007875J891932
16748E7596025K050034K044231K040309J964071K301304K039600K416540K354700
16740G4806814K395899K314452K382299K539386K560156K295300K251720K425417
$$ plain form
16732 93971443 95982914 98228441 100472713 102595729 104235185 105989334 107534998 108636842
16724 108636842 109596860 110642876 111371123 111490016 111704807 111735994 111241864 110798417 110090618
16715 110090618 108644933 107540550 105966312 104696223 102933266 100874581 98967240 96781403
16707 96781403 94506753 92524329 89891459 87564566 85190155 82247213 80229437 77707495
16699 77707495 75342919 73021977 70879241 68200808 66170253 64206852 61999741 60222210
16691 60222210 58090016 56247278 53934156 52620906 50656332 48859083 47201233 45687893
16683 45687893 44509257 42778708 41309613 40338231 39249281 37376329 36406618 35479673
16675 35479673 34255942 33174972 32208765 31269886 30086194 29330750 28214302 27890291 26809066
$$ packed form
16732I3971443K011471K245527K244272K123016J639456J754149J545664J101844
16724A08636842R60018J046016P28247J18893K14791L1187m94130m43447p07799
16715A10090618j445685j104383j574238j270089j762957k058685j907341k185837
16707I6781403k274650j982424k632870k326893k374411k942942k017776k521942
16699G7707495k364576k320942k142736k678433k030555j963401k207111j777531
16691F0222210k132194j842738k313122j313250j964574j797249j657850j513340
16683D5687893j178636j730549j469095r71382j088950j872952r69711r26945
16675C5479673j223731j080970r66207r38879j183692p55444j116448l24011j081225
$$ plain form
16666 26809066 25805223 25095993 24561820 23732986 23262664 22227049 22047911 21684675 20629798
16657 20629798 20305080 19771607 18990679 18586067 18247604 17936038 17557659 16906334 16530974
16648 16530974 16016523 15729557 15239291 14808131 14384625 14128944 14219678 13450724 13555063
16639 13555063 13269605 12959278 12720175 12537989 11951558 11940368 11706023 11219569 11065814
16630 11065814 10813258 10696971 10678449 10097010 10188787 9584148 9649599 9706255 9127543 9065333
16620 9065333 8755554 8724545 8115950 8265115 8372783 8107746 8004553 7933755 7672369 7744844
16610 7744844 7590584 7400982 6964477 7220665 6736053 6927514 6801038 6599755 6487813
16601 6487813 6465949 6391909 6517572 6012398 5818570 5758407 5901065 5837542 5786191 5416254
$$ packed form
16666B6809066j003843p09230n34173q28834m70322j035615j79138l63236j054877
16657B0629798l24718n33473p80928m04612l38463l11566l78379o51325l75360
16648A6530974n14451k86966m90266m31160m23506k55681R0734p68954J04339
16639A3555063k85458l10327k39103j82186n86431j1190k34345m86454j53755
16630A1065814k52556j16287j8522n81439R1777o04639O5451N6656n78712o2210
16620I065333l09779l1009o08595J49165J07668k65037j03193p0798k61386P2475
16610G744844j54260j89602m36505K56188m84612J91461j26476k01283j11942
16601F487813k1864p4040J25663n05174j93828o0163J42658o3523n1351l69937
$$ plain form
16591 5416254 5638316 5481428 5212304 5318349 5159895 4954777 4985919 4831140 4858546 4973475
16581 4973475 4649571 4500798 4358459 4665294 4537174 4346771 4152810 4161012 4228575 3968570
16571 3968570 4226208 4052050 3702677 4127745 3879163 3822866 4065519 3547029 4200745 3715762
16561 3715762 3865564 3477921 3641981 3220571 3404500 3476722 3383107 3286484 3285988 3296083 3420869
16550 3420869 3125592 2902746 3226266 3338393 3154722 2883743 2967148 2875967 2930709 2905621
16540 2905621 2762253 2852769 2682690 2892879 2866027 2656877 2602047 2749928 2533502 2720208
16530 2720208 2607290 2647970 2490661 2285416 2513063 2265898 2158007 2348084 2490566 2368316
16520 2368316 2245093 2144525 2270530 1995657 1753070 2205271 2170317 1920289 2060260 2397905
$$ packed form
16591E416254K22062j56888k69124J06045j58454k05118L1142j54779K7406J14929
16581D973475l23904j48773j42339L06835j28120j90403j93961Q202O7563k60005
16571C968570K57638j74158l49373M25068k48582n6297K42653n18490O53716m84983
16561C715762J49802l87643J64060m21410J83929P2222r3615r6623m96J0095J24786
16550C420869k95277k22846L23520J12127j83671k70979Q3405r1181N4742k5088
16540B905621j43368R0516j70079K10189k6852k09150n4830J47881k16426J86706
16530B720208j12918M0680j57309k05245K27647k47165j07891J90077J42482j22250
16520B368316j23223j00568J26005k74873k42587M52201l4954k50028J39971L37645
$$ plain form
16510 2397905 2319288 2115043 2104662 1852512 2320561 2127990 1868951 1687390 2122806 1710582
16500 1710582 2051428 2057101 2150688 1962544 1701056 2043168 1796083 1761897 1832031 1865197
16490 1865197 1713771 1754679 1790058 1923126 1459571 1421559 1657559 1914599 1700309 1759580
16480 1759580 1655351 1916336 1684778 1648745 1574789 1439762 1487942 1388114 1477674 1351298
16470 1351298 1242520 1355596 1670606 1406136 1296542 1587141 1149749 1375517 1295630 1416363
16460 1416363 1439034 1372913 1083356 1529458 1353802 1108793 1204364 1174685 1378635 1036738
16450 1036738 1141478 1385979 1242906 1574440 1385395 1082639 1328675 1316926 1150311 1304513
16440 1304513 1296160 1216664 1359098 1356205 1217466 1100497 1034364 1207973 1173493 1364538 804874
$$ packed form
16510B397905p8617k04245j0381k52150M68049j92571k59039j81561M35416m12224
16500A710582L40846N673R3587j88144k61488L42112k47085l4186P0134L3166
16490A865197j51426M0908L5379J33068m63555l8012K36000K57040k14290N9271
16480A759580j04229K60985k31558l6033p3956j35027M8180r9828Q9560j26376
16470A351298j08778J13076L15010k64470j09594K90599m37392K25768p9887J20733
16460A416363K2671o6121k89557M46102j75656k45009R5571k9679K03950l41897
16450A036738J04740K44501j43073L31534j89045l02756K46036j1749j66615J54202
16440A304513q353p9496J42434k893j38739j16969o6133J73609l4480J91045n59664
$$ plain form
16429 804874 1338236 1250898 1149523 865840 1348423 929952 985364 1147450 1058740 1298772
16419 1298772 923290 1121692 1038236 1289530 1106339 1394165 1342099 728629 1083163 1001862
16409 1001862 780765 1268050 884491 815167 896843 956025 898626 762487 935771 1230031
16399 1230031 582174 852126 735990 908033 973111 646910 682819 622254 849656 712113
16389 712113 656123 753448 601388 1033074 827958 951601 874445 616142 718668 452184
16379 452184 546094 830008 986956 860049 803730 958263 795853 865837 985439 491066
16368 807599 1029103 495829 278766 875652 716914 709597 768507 465192 707819 696692
16358 696692 818952 668179 632518 742184 937871 576576 706742 815600 688894 837974
$$ packed form
16429H04874N33362q7338j01375k83683M82583m18471N5412J62086q8710K40032
16419A298772l75482J98402q3456K51294j83191K87826n2066o13470L54534q1301
16409A001862k21097M87285l83559o9324Q1676N9182n7399j36139J73284K94260
16399A230031E82174K69952j16136J72043O5078l26201L5909o0565K27402j37543
16389G12113n5990R7325j52060M31686k05116J23643p7156k58303J02526k66484
16379D52184R3910K83914J56948j26907n6319J54533j62410O9984J19602D91066
16368H07599K21504D95829k17063N96886j58738p317N8910l03315K42627j1127
16358F96692J22260j50773l5661J09666J95687l61295J30166J08858j26706J49080
$$ plain form
16348 837974 663663 591214 642136 742884 493339 729480 885974 650682 163285 560320
16338 560320 533566 960999 383988 587855 544053 681580 293408 602834 534688 647717
16328 647717 680943 636595 881990 382694 714338 479106 542899 659840 447520 447060 474067
16317 474067 527521 513589 572436 724382 570331 222682 581655 379139 794246 400410
16307 400410 453089 420901 495228 563244 801831 420749 412876 566820 -11346 560020 664537
16296 664537 519248 570557 666797 157384 163003 748664 536079 680906 706830 591969
16286 591969 545182 288866 430910 145118 285243 606272 478016 551899 293612 421571
16276 421571 813006 277150 531344 305896 520144 636619 491591 572355 275596 708803
$$ packed form
16348H37974j74311p2449N0922J00748k49545K36141J56494k35292A63285L97035
16338E60320k6754M27433C83988K03867m3802J37527B93408L09426o8146J13029
16328F47717L3226m4348K45395C82694L31644k35232O3793J16941k12320m60K7007
16317D74067N3454j3932N8847J51946j54051B22682L58973k02516M15107l93836
16307D00410N2679l2188P4327O8016K38587l81082p873J53944a1346E60020J04517
16296F64537j45289N1309R6240A57384N619N85661k12585J44827K5924j14861
16286E91969m6787k56316J42044A45118J40125L21029j28256P3883k58287J27959
16276D21571L91435B77150K54194k25448K14248J16475j45028Q0764B75596M33207
$$ plain form
16266 708803 155407 351071 510416 203530 139079 306066 280655 528552 365847 365531
16256 365531 367508 248921 233611 394587 406608 569681 381334 348022 421164 528538 463631
16245 463631 132173 175977 262503 293802 462834 222287 249291 167716 360912 416990 345016
16234 345016 169326 92554 179032 266283 380022 387997 394233 751825 390440 625789 217469
16222 48136 653314 448179 419516 576725 181796 238483 3338 339034 675395 490006
16212 490006 387685 447037 254496 77152 431157 261447 388665 59475 237823 185918
16202 185918 376075 412730 346539 95450 167878 143654 369211 116011 353469 187425
16192 187425 191378 210982 185588 206591 285380 314232 227993 209284 274554 192472 432963
$$ packed form
16266G08803A55407J95664J59345B03530o4451J66987k5411K47897j62705l16
16256C65531J977j18587j5310J60976J2021J63073j88347l3312P3142J07374o4907
16245D63631A32173M3804Q6526L1299J69032B22287K7004q1575J93196N6078p1974
16234C45016A69326p6772Q6478Q7251J13739P975O236L57592l61385K35349B17469
16222D8136O05178k05135k8663J57209A81796N6687C338L35696L36361j85389
16212D90006j02321N9352j92541G7152L54005j69710J27218E9475J78348n1905
16202A85918J90157L6655o6191I5450P2428k4224K25557A16011K37458j66044
16192A87425L953J9604k5394K1003P8789K8852q6239j8709O5270q2082K40491
$$ plain form
16181 432963 -320656 166611 135747 241030 439790 107322 -55445 -56211 176781 115559 1304
16169 568802 353072 431124 553525 267424 295264 338144 429855 42378 -117473 193455
16158 328682 86892 222466 177992 260740 -14357 193770 287270 366342 253817 205210 50414
16146 301878 409429 237342 52773 133990 60239 121702 391516 79234 339947 -63927 119780
16134 177147 -299115 91977 86805 -33964 134425 -90370 8499 67804 -150605 73351 101788
16123 101788 55378 367840 5564 108344 168009 290895 84735 352770 175174 187016 182110
16112 182110 288284 286764 341692 59761 -28508 183860 83880 72755 -146324 31861 149616
16101 149616 485604 141750 325230 106896 -6973 329559 224067 33287 2524 200273
$$ packed form
16181D32963c20656A66611l0864J05283J98760A07322e5445p66A76781o1222A304
16169E68802k15730P8052J22401B67424K7840M2880R1711D2378a17473A93455
16158C28682H6892J35574m4474Q2748a4357A93770R3500P9072j12525m8607E0414
16146C01878J07551j72087E2773Q1217F0239O1463K69814G9234K60713f3927A19780
16134A77147b99115I1977n172c3964A34425i0370H499N9305a50605G3351K8437
16123A01788m6410L12462E564J02780N9665J22886H4735K68035A75174J1842m906
16112A82110J06174j520N4928E9761b8508A83860H3880j1125a46324C1861J17755
16101A49616L35988A41750J83480A06896f973C29559j05492C3287B524J97749
$$ plain form
16091 200273 263955 42628 311461 67040 243555 328953 147397 -155744 -17467 -94072 384719
16079 -118835 -95819 -137887 5300 -241417 295296 140560 260427 77571 324581 141904
16068 350300 78204 -3876 327151 -17706 98593 312855 331179 242813 243887 93916 164004
16057 164004 44604 197842 -70033 69459 54091 194467 246746 78680 55368 397668 21844
16045 198411 -140621 96579 536927 139192 -13697 288609 52723 234230 56730 129424
16035 129424 46706 103127 383381 397439 -68333 89628 40309 159211 191600 -185188 61983
16023 32711 55333 93699 34186 39823 75224 87140 325178 132537 32032 231382 258263
16012 258263 26701 293610 20838 157758 122347 -238187 -63039 108847 22432 141048
$$ packed form
16091B00273O3682D2628K68833F7040J76515Q5398A47397a55744a7467p6605C84719
16079a18835K3016m2068E300b41417B95296A40560J19867G7571K47010A41904
16068C50300G8204c876C27151a7706I8593K14262J8324q8366J074I3916P0088
16057A64004D4604J53238g0033F9459j5368J40376N2279G8680k3312L42300B1844
16045A98411a40621I6579M40348A39192a3697B88609E2723J81507E6730P2694
16035A29424D6706N6421K80254J4058f8333H9628D0309J18902L2389a85188F1983
16023C2711K2622L8366C4186N637L5401J1916K38038A32537C2032J99350K6881
16012B58263B6701K66909B0838J36920l5411b38187f3039A08847B2432J18616
$$ plain form
16002 141048 -72197 5746 208769 -116348 111801 -71226 243433 75233 -121198 301081
15991 180880 266417 414051 238960 639066 712601 1146909 868494 1145470 1010753 736745
15981 736745 840941 348880 478121 -30917 583206 88535 -88916 75979 66557 201058 -171005
15969 -280418 -83886 308058 223926 -125638 -280801 -13046 8911 37453 -119878 -353335 -115643
15957 -253225 142944 146450 47367 158995 -27066 -65329 -439940 -212916 215384 67205 -283783
15945 -144592 212251 -17072 -304072 275056 -4901 -168042 -90655 -26993 34767 193321 -223079
15933 -229514 -84768 160614 209080 394674 128435 -1636 -241455 203728 -298218 -121653
15922 272773 54761 54141 303332 393007 -146760 33032 194646 256897 -119644 127679 -41684
$$ packed form
16002A41048g2197E746K03023a16348A11801g1226B43433G5233a21198C01081
15991A80880Q5537J47634j75091M00106P3535M34308k78415K76976j34717k74008
15981G36745J04196C48880J29241c0917E83206H8535h8916G5979r422J34501a71005
15969b80418h3886C08058q4132a25638j55163a3046H911K8542a19878k33457a15643
15957b53225A42944L506D7367J11628b7066l8263l74611b12916B15384F7205b83783
15945a44592B12251a7072k87000B75056d901j63141P7387b6993C4767J58554b23079
15933b29514h4768A60614M8466J85594A28435a636k39819B03728b98218a21653
15922B72773E4761o20K49191Q9675a46760C3032J61614O2251a19644A27679d1684
$$ plain form
15910 -212753 -189696 304110 97322 -90690 -48817 73113 -129939 -144327 -205964 247969 -276509
15898 71340 198727 55299 105810 337513 152476 -82347 -139031 14 -275900 154172 -170337
15886 -60252 -10262 -236522 -29027 218022 32757 323884 -73708 -306505 -232618 -173159 -108898
15875 -108898 -312286 -27245 218185 -17126 -45119 -154493 128414 -257266 47635 58254
15865 58254 -104483 21245 -4024 81856 -78710 -53887 73978 -360631 -151939 -131299 35740
15853 133726 -83995 -102066 -69634 56848 -40135 112086 -6166 66489 -132803 -7171 54888
15841 33645 226044 -195992 -3931 296033 -61811 -40869 -126090 -68188 -416623 63518 -14049
15829 -232847 -153036 -155073 -41563 -98447 -46638 -193556 438312 261411 -112184 -15011 66315
$$ packed form
15910b12753K3057C04110I7322i0690M1873G3113a29939j4388o1637B47969b76509
15898G1340J27387E5299N0511K31703A52476h2347n6684A4b75900A54172a70337
15886f0252a0262k26260b9027B18022C2757K91127g3708k32797P3887N9459O4261
15875a08898k03388b7245B18185a7126k7993j09374A28414b57266D7635J0619
15865E8254a04483B1245d024H1856g8710K4823G3978c60631a51939K0640C5740
15853A33726h3995j8071L2432E6848d0135A12086f166F6489a32803g171E4888
15841C3645J92399a95992c931B96033f1811K0942q5221N7902l48435F3518a4049
15829b32847P9811k037d1563n6884d6638j46918D38312j76901a12184a5011F6315
$$ plain form
15817 363908 293428 -96543 204007 17149 -50931 -227236 -132896 -111064 -152989 -404560 291153
15805 -409438 229736 106139 289608 131136 -143529 -42283 -215362 -173664 -74015 -33580
15794 162586 36573 -96206 241531 23531 467758 -126916 -398298 197029 81897 130279
15784 130279 73161 62343 36755 1709 301683 -15367 -379877 -317386 -331933 -107872 -45422
15772 -120119 -60963 129661 90485 25212 -189148 183702 -137029 -269186 -80153 -172294
15762 -172294 -41310 -34536 6951 136879 452444 76920 206843 35854 -57396 -184521 189937
15750 65958 206259 186406 205711 456583 207671 39565 236394 -24241 -209817 -190807 415249
15738 222384 48024 -43302 -140878 -86099 74753 54687 103012 47563 111677 213282 -50751
$$ packed form
15817C63908p0480i6543B04007A7149e0931j76305R4340K1832m1925k51571B91153
15805d09438B29736A06139J83469A31136a43529d2283j73079M1698g4015c3580
15794A62586C6573i6206B41531B3531M44227a26916k71382A97029H1897M8382
15784A30279n7118j0818k5588A709K99974a5367l64510O2491j4547a07872d5422
15772a20119N9156A29661l9176B5212a89148A83702a37029j32157h0153r2141
15762a72294d1310O774F951J29928L15565G6920J29923C5854e7396j27125A89937
15750F5958J40301j9853J9305K50872B07671C9565J96829b4241j85576J9010D15249
15738B22384D8024d3302r7576N4779G4753k0066M8325D7563O4114J01605e0751
$$ plain form
15726 -245470 -351166 -115623 -169498 -40334 62703 -196918 -132452 -313604 -30971 77697 -26804
15714 -203285 75550 77156 61069 177499 159623 291081 207495 -126890 19885 120370 -102849
15702 -8515 53053 42768 292992 30876 -72683 -135790 -161732 159107 -443963 -87463 117833
15690 175667 -128581 90753 93569 111771 86211 241441 77446 157960 -204275 231614 -232178
15678 49007 131036 65838 -248863 -39389 130288 -80955 303807 -119107 1364 15825 276429
15667 276429 99755 46309 -212449 134456 -25037 159893 -154582 -19564 -207771 -326972
15657 -326972 62266 -52613 -80875 85033 -80413 -117554 129858 -232427 69955 -41761 94672
15645 146748 294531 -122026 -81870 165297 -249790 -223049 -416176 174111 35850 -144061
$$ packed form
15726b45470j05696a15623n3875d0334F2703a96918O4466j81152c0971G7697b6804
15714b03285G5550J606j6087J16430j7876J31458q3586a26890A9885J00485a02849
15702h515E3053j0285K50224C0876g2683o3107k5942A59107d43963h7463A17833
15690A75667a28581I0753K816J8202k5560J55230G7446Q0514b04275B31614b32178
15678D9007Q2029o5198b48863c9389A30288h0955C03807a19107A364J4461K60604
15667B76429I9755D6309b12449A34456b5037A59893a54582a9564j88207j19201
15657c26972F2266e2613k8262H5033h0413l7141A29858b32427F9955d1761I4672
15645A46748J47783a22026M0156A65297b49790K6741j93127A74111C5850a44061
$$ plain form
15634 -62438 -67227 73925 242444 -3881 46154 -214208 32535 17633 -237675 -576439 -128890
15622 29368 149842 -187513 29539 -495192 -33297 -222502 -310569 -32925 2348 207648 -59602
15610 -272788 46886 122716 -309730 -146764 174095 26103 205119 -185751 -221046 29923
15599 56472 -40625 53024 -82410 -74237 26866 -3813 121487 -327804 58719 -71693 231835
15587 -257645 -36615 -162853 -334845 38708 -127912 -16482 41427 232509 62516 -144862
15576 27126 -224094 -151850 -280125 143159 -184904 189369 -257115 -58210 202732 -88875
15565 -244941 -122878 -130588 -197894 84208 -155918 237018 346795 -189981 4453 -3416 59531
15553 63070 167252 -156273 -101908 -326891 9397 1609 -155362 189878 248312 14232 -181389
$$ packed form
15634f2438m789G3925J68519c881D6154b14208C2535j4902b37675l38764a28890
15622B9368J20474a87513B9539d95192c3297j89205q8067c2925B348K05300e9602
15610b72788D6886P5830c09730a46764A74095B6103J79016a85751l5295B9923
15599E6472d0625E3024h2410Q173B6866c813A21487c27804E8719g1693B31835
15587b57645c6615j26238j71992C8708a27912a6482D1427J91082F2516a44862
15576B7126b24094P2244j28275A43159a84904A89369b57115e8210B02732h8875
15565b44941J22063p710o7306H4208a55918B37018J09777a89981D453c416E9531
15553F3070J04182a56273N4365k24983I397A609a55362A89878N8434A4232a81389
$$ plain form
15541 168376 -224581 -269389 -178594 127634 199429 63809 14139 -112861 313691 -86518 68196
15529 -158110 55019 4167 247461 -273671 123844 300050 50262 162134 41585 -40756 91382
15517 98044 -23731 386117 194109 260042 124999 265608 462957 123714 141702 189808
15507 189808 7593 117833 -20268 -370993 520998 -27922 111079 -38065 -88687 171645 370209
15496 370209 134947 -185395 181177 -134772 40830 -3201 232827 91910 127835 -101750
15485 108337 195629 -17084 -32207 50394 114336 224048 315252 112141 13932 242960 492342
15474 492342 630722 785597 638677 304088 185361 81879 208255 16113 -81368 -200585
15464 -200585 120035 207858 120667 -38880 74454 -96189 37977 154507 38402 -18832 2247
$$ packed form
15541A68376b24581m4808R0795A27634P1795F3809A4139a12861C13691h6518F8196
15529a58110E5019D167K43294b73671A23844J76206E0262J11872D1585d0756I1382
15517I8044b3731C86117j92008O5933A24999J40609J97349A23714J7988M8106
15507A89808G593J10240b0268l50725E20998b7922A11079c8065n0622A71645J98564
15496C70209A34947a85395A81177a34772D0830c201B32827I1910L5925a01750
15485A08337Q7292a7084j5123E0394O3942J09712R1204A12141A3932K29028K49382
15474D92342J38380J54875j46920C04088j18727H1879J26376A6113h1368j19217
15464b00585A20035Q7823q7191c8880G4454i6189C7977J16530C8402a8832B247
$$ plain form
15452 -16176 106045 -67595 -35949 351284 170449 383277 146494 419787 181080 733268
15442 733268 987909 1505445 1244093 1017576 738164 719951 496728 -46957 224763 165149
15432 165149 73846 68005 -276803 138129 -92803 -120820 151971 -48484 31996 93026 37903
15420 494487 147597 57998 112682 -22023 199014 -1171 -293492 256969 8348 -27232 141870
15408 116991 -207269 486922 -157661 299607 -50221 92928 297734 -22814 -256917 245437
15397 -27626 140477 196297 -60359 -172141 -11595 -8918 -180865 153973 76362 -85071 163984
15385 396160 -98976 405382 358281 -96696 -238767 31389 -233056 30220 169299 322843
15375 322843 51096 26704 78274 478804 111663 224813 -1297 168556 142629 122112 71905
$$ packed form
15452a6176A06045f7595L1646C51284A70449K12828A46494K73293A81080N52188
15442G33268K54641N17536k61352k26517k79412j8213k23223d6957B24763n9614
15432A65149G3846n841b76803A38129i2803k8017A51971d8484C1996O1030C7903
15420D94487A47597E7998N4684b2023A99014a171k92321B56969H348b7232A41870
15408A16991b07269D86922a57661B99607e0221I2928K04806b2814k34103B45437
15397b7626A40477N5820f0359j11782a1595K677j71947A53973G6362h5071A63984
15385C96160i8976D05382m7101i6696j42071C1389b33056C0220J39079J53544
15375C22843E1096k4392N1570M00530A11663J13150a297A68556k5927k0517n0207
$$ plain form
15364 71905 304202 249681 -100046 306334 328009 199877 272740 135933 -22488 46355 203802
15353 203802 265244 179376 241919 -12161 81227 -93677 168693 -107992 94059 7663 150478
15342 150478 363358 714515 683243 465162 326883 475540 277380 57509 157790 240061
15332 240061 295951 236862 -68784 -53698 547106 133222 235975 -56386 185303 353730
15322 353730 239737 106249 309775 -17746 -58913 301055 -77980 55499 -160361 -101867
15312 -101867 126361 143936 180716 -53164 104870 312262 95227 204258 227997 255200 168900
15301 168900 -145939 243412 -78691 90559 264236 -102918 227173 375257 18066 161293
15291 161293 71765 -190623 32423 -127716 67877 46736 -153032 101798 13692 -104825
$$ packed form
15364G1905K32297n4521a00046C06334K1675j28132P2863A35933b2488D6355J57447
15353B03802O1442q5868O2543a2161H1227i3677A68693a07992I4059G663J42815
15342A50478K12880L51157l1272k18081j38279J48657j98160E7509J00281Q2271
15332B40061N5890n9089f8784J5086E47106A33222J02753e6386A85303J68427
15322C53730j13993A06249K03526a7746m1167C01055g7980E5499a60361N8494
15312a01867A26361J7575L6780e3164A04870K07392I5227J09031K3739K7203q6300
15301A68900a45939B43412g8691I0559J73677a02918B27173J48084A8066J43227
15291A61293G1765a90623C2423a27716F7877k1141a53032A01798A3692a04825
$$ plain form
15280 -188515 -126834 37660 199597 -248282 -196072 20855 -158557 -6039 -190501 36449 -135215
15268 -35745 -170978 219408 97309 -93164 138096 -102564 73934 -227340 10565 -97549 -6243
15256 -168052 31107 87028 -231648 127334 3302 -122052 371159 503683 259224 208034
15246 208034 127047 158298 335450 701075 1562151 1017463 1394669 1428315 808661 364476
15235 317588 561727 341899 201692 375842 91133 140354 237522 -115045 193460 167819
15225 167819 -97618 -37459 121509 9067 -259150 204491 32798 252254 -190643 179370
15214 129079 -12278 89718 -6240 -195883 267685 17379 -52693 -110070 -159629 120762 165516
15203 165516 -7320 -107669 534443 71531 290601 116953 71599 -363452 36244 172254
$$ packed form
15280a88515O1681C7660J61937b48282N2210B0855a58557f039j84462C6449a35215
15268c5745j35233B19408I7309i3164A38096a02564G3934b27340A0565i7549f243
15256a68052C1107N5921b31648A27334C302a22052C71159J32524k44459n1190
15246B08034q0987L1251J77152L65625Q61076n44688L77206L3646o19654C64476
15235C17588K44139k19828j40207J74150I1133M9221R7168a15045A93460k5641
15225A67819i7618c7459A21509I067b59150B04491C2798K19456a90643A79370
15214A29079a2278H9718f240j89643B67685A7379e2693n7377m9559A20762M4754
15203A65516g320j00349E34443G1531K19070A16953m5354c63452C6244J36010
$$ plain form
15193 172254 -179104 206032 391691 239471 -67545 198896 237849 92626 238095 162176
15183 162176 -14752 -53893 29806 47431 354664 10039 34299 9966 248081 -92485 228545
15171 127874 -211301 6087 -66838 175250 -234300 198917 18814 -204680 140329 -165889
15160 3605 298104 323966 227474 18729 318095 291675 173979 -21024 128826 6117 -51693
15148 205174 -31561 89575 229028 326857 150995 146023 60231 -38579 132059 394239 159377
15136 126645 64183 19997 -74501 -136468 389842 -35677 13173 257116 173820 -199617 103498
15124 -19902 312612 166467 98653 306911 -17567 488234 523959 524714 174056 -250633 103430
15112 89621 31429 228880 391041 -313131 1587 121727 63681 -154252 307805 59831 -121078
$$ packed form
15193A72254a79104B06032J85659j52220f7545A98896L8953I2626J45469p5919
15183A62176a4752l9141B9806J7625L07233A0039K4260I966K38115i2485B28545
15171A27874b11301F087f6838A75250b34300A98917A8814b04680A40329a65889
15160C605K94499K5862r6492A8729K99366k6420j17696b1024A28826F117e1693
15148B05174c1561H9575J39453R7829A50995m972F0231c8579A32059K62180A59377
15136A26645o2462A9997g4501o1967C89842c5677A3173K43943q3296a99617A03498
15124a9902C12612j46145o7814K08258a7567D88234L5725P55A74056b50633A03430
15112H9621C1429J97451J62161c13131A587J20140n8046a54252C07805E9831a21078
$$ plain form
15100 193366 203424 -51492 383852 335300 39313 303205 211184 46012 321825 -57420 150735
15088 242879 -116620 20600 90917 24587 61626 -13372 185418 -80227 335618 245513 53995
15076 258653 227310 261203 82153 148528 128827 259696 179756 183069 75362 100833 223133
15065 223133 237585 432720 126466 95180 152979 421314 298715 189893 167647 461851
15055 461851 -5892 -126797 282012 214378 258265 136687 518703 270589 196346 418560
15045 418560 383034 693385 453912 389870 352081 70274 568077 412043 533540 506079
15035 506079 534502 373167 634851 395753 681319 738120 897997 1190353 614132 771444
15025 771444 643978 389934 474266 372299 718152 535444 1005896 215549 477934 529343
$$ packed form
15100A93366J0058e1492C83852m8552C9313K63892r2021D6012K75813e7420A50735
15088B42879a16620B0600P0317B4587L7039a3372A85418h0227C35618r0105E3995
15076B58653l1343L3893H2153O6375j9701J30869p9940L313G5362K5471J22300
15065B23133J4452J95135A26466l1286N7799K68335j22599j08822k2246K94204
15055D61851e892j20905B82012o7634M3887j21578L82016k48114p4243K22214
15045D18560l5526L10351k39473o4042l7789G0274M97803j56034J21497k7461
15035E06079K8423j61335K61684k39098K85566N6801J59877K92356n76221J57312
15025G71444j27466k54044Q4332j01967L45853j82708M70452B15549K62385N1409
$$ plain form
15015 529343 424663 453109 95315 514978 619891 594674 456582 196952 550079 150934
15004 293391 348333 575828 444163 456780 583140 488837 257991 812733 567226 533459
14994 533459 185793 361570 503914 396923 651681 423472 717706 628567 418387 499380
14984 499380 636690 620897 714427 1036971 793025 868944 576269 452763 349982 172124
14973 557733 698886 1004084 569454 656391 537037 315436 583623 365492 211425 468840
14963 468840 515965 430115 367819 438286 344746 163850 414849 314278 368674 673589 245946
14951 301774 284744 330971 859233 546612 385590 478337 646026 502937 674220 909017
14941 909017 538156 558735 664196 153118 504386 688791 434970 663145 829213 804492
$$ packed form
15015E29343j04680K8446I5315M19663J04913k5217j38092A96952L53127A50934
15004B93391N4942K27495j31665J2617J26360r4303k30846N54742k45507l3767
14994E33459A85793J75777J42344j06991K54758k28209K94234q9139k10180Q0993
14984D99380J37310j5793R3530L22544k43946P5919k92675j23506j02781A72124
14973E57733J41153L05198m34630Q6937j19354k21601K68187k18131j54067K57415
14963D68840M7125q5850o2296P0467r3540A63850K50999j00571N4396L04915B45946
14951C01774j7030M6227N28262l12621j61022R2747J67689j43089J71283K34797
14941I09017l70861K0579J05461A53118L51268J84405k53821K28175J66068k4721
$$ plain form
14931 804492 906803 1136540 1233427 1567015 1388818 1758597 1453218 1656365 1691869 1531283
14921 1531283 1589798 1660154 2118938 2128295 2417421 2725945 1855194 1851250 1844297 1498624 1149955
14910 1149955 1124515 920234 774663 607139 507353 297123 333610 575744 432334 290773
14900 290773 179176 475924 388891 290948 657197 546815 245889 503664 617059 625450
14890 625450 260590 398990 578857 323167 643137 890297 1085560 1082120 1098724 988956
14880 988956 709759 893860 715108 1105926 382926 672691 660161 519909 380584 427438
14870 427438 450107 543155 877105 898837 643035 892199 807713 629250 588333 987977
14860 987977 731820 494181 611649 538064 341847 465570 694522 578421 571318 385815
$$ packed form
14931H04492J02311K29737R6887L33588j78197L69779l05379K03147L5504j60586
14921A531283N8515P0356M58784R357K89126L08524q70751l944o953l45673l48669
14910A149955k5440k04281j45571j67524r9786k10230L6487K42134j43410j41561
14900B90773j11597K96748q7033r7943L66249j10382B45889K57775J13395Q391
14890F25450B60590J38400J79867k55690L19970K47160J95263l440J6604j09768
14880I88956k79197J84101j78752L90818C82926K89765j2530j40252j39325M6854
14870D27438K2669R3048L33950K1732k55802K49164q4486j78463m0917L99644
14860I87977k56157k37639J17468p3585j96217J23723K28952j16101p103j85503
$$ plain form
14850 385815 325333 422314 462023 644352 762875 671465 663253 948950 1015749 1099959 1242355
14839 1242355 1094900 731438 799956 1096890 936562 836157 604579 334857 151289 364311
14829 364311 809556 393930 687299 388276 743031 441469 834066 616272 731130 373202
14819 373202 642275 759725 571978 763815 589155 791482 834827 851661 632439 778013
14809 778013 811682 940196 728817 889162 714790 916942 1177972 668345 624538 785581
14799 785581 754029 674286 536434 694965 464507 549744 779941 311092 677062 588404
14789 588404 543456 483714 873436 663422 732128 777178 683711 1001942 610099 745746
14779 745746 919503 981163 896012 669099 1132888 905369 949241 1031262 883885 667352
$$ packed form
14850C85815o0482R6981L9709J82329J18523r1410q212K85697O6799Q4210J42396
14839A242355j47455l63462O8518K96934j60328j00405k31578k69722A51289K13022
14829C64311M45245C93930K93369k99023L54755l01562L92597k17794J14858l57928
14819C73202K69073J17450j87747J91837j74660K02327M3345J6834k19222J45574
14809G78013L3669J28514k11379J60345j74372K02152K61030n09627m3807J61043
14799G85581l1552p9743j37852J58531k30458Q5237K30197C11092L65970q8658
14789E88404m4948n9742L89722k10014O8706M5050r3467L18231l91843J35647
14779G45746J73757O1660q5151k26913M63789k27519M3872Q2021j47377k16533
$$ plain form
14769 667352 885278 804854 551472 926952 413412 927885 695914 575678 675198 498952
14759 498952 699446 800260 696990 447824 525427 805383 718704 652241 742847 873639
14749 873639 902453 584886 113264 414261 983201 833701 1005120 791230 838338 809290
14739 809290 854180 446019 986507 694180 898603 693278 795736 760667 1157804 1108345
14729 1108345 1583703 1874526 1867704 1906118 1723421 1574900 1451186 1371426 832435 1024712
14719 1024712 1077474 1204236 940365 871196 926771 855478 893636 1256343 932804 767968
14709 767968 918894 935951 1197148 1027799 1480237 1435789 1365818 1599628 1861622 1955242
14699 1955242 1655787 1450826 1261485 1137485 1621516 1029198 1057218 1012481 1168631 582967
$$ packed form
14769F67352K17926q0424k53382L75480D13412N14473k31971j20236R9520j76246
14759D98952K00494J00814j03270k49166P7603K79956q6679o6463R0606J30792
14749H73639K8814l17567A13264L00997N68940j49500J71419k13890M7108k9048
14739H09290M4890m08161N40488k92327K04423k05325J02458l5069L97137m9459
14729A108345M75358K90823o822L8414j82697j48521j23714p9760n38991J92277
14719A024712N2762J26762k63871o9169N5575p1293L8158L62707l23539j64836
14709G67968J50926J7057K61197j69349M52438m4448o9971K33810K61994R3620
14699A955242k99455k04961j89341j24000M84031n92318K8020m4737J56150E82967
$$ plain form
14688 866110 800902 985584 1037747 959045 864462 945891 913699 840675 1025987 892433 1132512
14677 1132512 967737 974054 832976 921238 1017398 1198227 675080 857749 847912 1293681
14667 1293681 1026716 1204932 1160036 1067344 929692 1037795 1050346 1160638 1129040 878789
14657 878789 1149504 1232095 1370036 1021618 1362505 1488451 1153081 1198204 1412696 1327074
14647 1327074 1221522 1162730 1212654 1339552 1098149 1066868 1324479 1202574 818399 1307119
14637 1307119 1308433 1289937 1127458 1316496 899611 1250543 1291517 1105982 1136687 1680656
14627 1680656 1309218 1390280 1203193 1321509 1397265 1297778 1129487 1084558 1541100 1252552
14617 1252552 1424911 1175145 1624480 1327189 1437418 1335736 1372433 1613085 1785610 1315796
$$ packed form
14688H66110o5208J84682N2163p8702r4583Q1429l2192p3024J85312j33554K40079
14677A132512j64775O317j41078Q8262R6160J80829n23147J82669r837M45769
14667A293681k66965J78216m4896r2692j37652J08103J2551J10292l1598k50251
14657H78789K70715Q2591J37941l48418L40887J25946l35370M5123K14492q5622
14647A327074j05552n8792M9924J26898k41403l1281K57611j21905l84175M88720
14637A307119J314j8496j62479J89038m16885L50932M0974j85535L0705N43969
14627A680656l71438Q1062j87087J18316P5756r9487j68291m4929M56542k88548
14617A252552J72359k49766M49335k97291J10229j01682L6697K40652J72525m69814
$$ plain form
14607 1315796 1436663 1713778 1379107 1487187 1374726 1378765 1456808 1680610 1477257 1749853
14597 1749853 1938185 1710588 1435295 1719584 1965488 1470295 1896812 2062630 1658761
14588 1658761 1434162 1734994 1974255 1775458 1817954 1719364 1937610 2162490 1948288 2177156
14578 2177156 2169199 1842264 1891773 2085452 2184456 1980188 2272190 2044457 2196929 2179885
14568 2179885 2124509 2305453 2189902 2480747 2683430 2472529 2340888 2439869 2643519 2655978
14558 2655978 2794775 2594982 3158558 2846853 3532513 3363286 3748650 4336648 5227986
14549 5227986 7362591 11043773 17952543 32540536 38060680 19306254 10560210 6877748
14541 6877748 4910813 4494270 4730395 5619929 4337786 3094804 2836345 2716195 2196116
$$ packed form
14607A315796J20867K77115l34671J08080j12461M039P8043K23802k03353K72596
14597A749853J88332k27597k75293K84289K45904m95193M26517J65818m03869
14588A658761k24599L00832K39261j98797M2496r8590K18246K24880k14202K28868
14578B177156p957l26935M9509J93679R9004k04268K92002k27733J52472j7044
14568B179885n5376J80944j15551K90845K02683k10901j31641R8981K03650J2459
14558B655978J38797j99793N63576l11705O85660j69227L85364N87998Q91338
14549E227986K134605L681182O908770J4587993N520144j8754426q746044l682462
14541F877748j966935m16543K36125Q89534j282143j242982k58459j20150n20079
$$ plain form
14532 2196116 2400180 2730112 2536815 2600529 2296993 2228203 2320540 2678271 2544228 2386101
14522 2386101 2648885 2545099 2602309 2739235 2463608 2762598 2895299 2340069 2650198 2784714
14512 2784714 2785523 2997750 2661715 2831695 2617391 2694484 3191987 3103041 2965650 3158906
14502 3158906 3042522 3132568 3127203 2913614 3088075 3216481 3087247 3329489 3344715 3297474
14492 3297474 3198777 3300685 3560628 3677212 3392757 3668703 3717193 3338624 3617003 3538042
14482 3538042 3572008 3532462 3990226 4065708 3872028 3770034 3986323 4192965 4325363 3861140
14472 3861140 4267355 4330106 4574244 4263138 4112925 4272535 4346426 4595672 4682089 4659824
14462 4659824 4722394 4720144 4767289 5164156 5112286 4876609 5080254 5328962 5286737 5242299 5217749
$$ packed form
14532B196116K04064L29932j93297O3714l03536o8790R2337L57731j34043j58127
14522B386101K62784j03786N7210J36926k75627K98990J32701n55230L10129J34516
14512B784714Q09K12227l36035J69980k14304P7093M97503q8946j37391J93256
14502C158906j16384R0046n365k13589J74461J28406j29234K42242J5226m7241
14492C297474r8697J01908K59943J16584k84455K75946M8490l78569K78379p8961
14482C538042L3966l9546M57764P5482j93680j01994K16289K06642J32398m64223
14472C861140M06215O2751K44138l11106j50213J59610P3891K49246Q6417k2265
14462D659824O2570k250M7145L96867n1870k35677K03645K48708m2225m4438k4550
$$ plain form
14451 5217749 5119899 5035181 5563860 5283335 5760449 5596231 5731323 5614767 5677268 5763859
14441 5763859 5907416 5983100 6105552 6299695 6165503 6304326 6716315 6640054 6862099 6842349
14431 6842349 6507530 6967205 7306705 7116332 7471094 7201560 7049048 7482060 7884107
14422 7884107 7830173 8118603 8088658 8407920 8255617 8478890 8770088 8465504 8605390 8873759
14412 8873759 9004885 8896362 9255563 9155106 9395061 9876702 9977716 10043939 10007014 10578670
14402 10578670 10304898 10649531 10684898 10496739 10866110 10858824 10902981 11488149 11384414 11520151
14392 11520151 11984390 12492312 12135369 12705531 12992539 13004776 13126305 13489660 13837585
14383 13837585 14322982 14253142 14628750 15075977 14996081 15559592 15296724 15488528 15990593 16549349
$$ packed form
14451E217749r7850q4718N28679k80525M77114j64218J35092j16556O2501Q6591
14441E763859J43557P5684J22452J94143j34192J38823M11989p6261K22045j9750
14431F842349l34819M59675L39500j90373L54762k69534j52512M33012M02047
14422G884107n3934K88430k9945L19262j52303K23273K91198l04584J39886K68369
14412H873759J31126j08523L59201j00457K39955M81641J01014O6223l6925N71656
14402A0578670k73772L44633L5367j88159L69371p286M4157N85168j03735J35737
14392A1520151M64239N07922l56943N70162K87008J2237J21529L63355L47925
14383A3837585M85397o9840L75608M47227p9896N63511k62868J91804N02065N58756
$$ plain form
14373 16549349 16600004 16856530 17344702 17796971 18189219 18817759 19172367 19773518 19745850 20088713
14363 20088713 20299130 20587128 21100998 21462051 21880395 22568859 22875970 23663282 24009914
14354 24009914 24885323 25188521 25638681 26174752 27131856 27362771 28408404 28770777 29526861
14345 29526861 30605388 31117637 32137554 32803652 33445361 34437220 35744184 36605544 37388948
14336 37388948 38746135 39694098 40771776 42312662 43377629 44399110 46038298 47418875
14328 47418875 48364321 50348087 52009608 53661178 54911306 57099395 59260396 61174724
14320 61174724 63365666 65638270 67636174 69863001 72237400 74753491 77838751 80880794
14312 80880794 83826182 87144061 90411036 94302728 98184569 102308888 106046403 110792131
$$ packed form
14373A6549349N0655K56526M88172M52269L92248O28540L54608O01151k7668L42863
14363B0088713K10417K87998N13870L61053M18344O88464L07111P87312L46632
14354B4009914Q75409L03198M50160N36071R57104K30915J045633L62373P56084
14345B9526861J078527N12249J019917O66098O41709R91859J306964Q61360P83404
14336C7388948J357187R47963J077678J540886J064967J021481J639188J380577
14328D7418875R45446J983766J661521J651570J250128K188089K161001J914328
14320F1174724K190942K272604J997904K226827K374399K516091L085260L042043
14312H0880794K945388L317879L266975L891692L881841M124319L737515M745728
$$ plain form
14304 110792131 115669916 120853409 126187469 131886168 137922943 144331220 151265133 158441669
14296 158441669 165782456 174180787 182797509 192059782 201801584 211797137 222949573 234156228
14288 234156228 246125157 258663648 272221002 285731411 300220807 314855126 330147779
14281 330147779 345717091 360981325 376586599 391686197 406581339 420377290 432762647
14274 432762647 441022140 445240865 447949664 450249528 452681393 452015179 447688203 439955104
14266 439955104 430650600 422175896 412297915 402397532 392800943 382265836 371139671 358500850
14258 358500850 345790199 332925038 319695208 306416555 294101488 283071811 271295019
14251 271295019 259803629 248537437 237318553 226902096 216562283 206089880 196219204
$$ packed form
14304A10792131M877785N183493N334060N698699O036775O408277O933913P176536
14296A58441669P340787Q398331Q616722R262273R741802R995553J1152436J1206655
14288B34156228J1968929J2538491J3557354J3510409J4489396J4634319J5292653
14281C30147779J5569312J5264234J5605274J5099598J4895142J3795951J2385357
14274D32762647Q259493M218725K708799K299864K431865o66214m326976p733099
14266D39955104r304504q474704r877981r900383r596589j0535107j1126165j2638821
14258C58500850j2710651j2865161j3229830j3278653j2315067j1029677j1776792
14251B71295019j1491390j1266192j1218884j0416457j0339813j0472403r870676
$$ plain form
14244 196219204 187332395 178515690 170189356 161963000 154192443 147162565 140339932 134225930
14236 134225930 128255633 122336463 117229338 111788800 107165599 103106004 99202162 94382605
14228 94382605 90763070 87025854 83815119 80499396 77708782 74476485 71682860 69367314
14220 69367314 67167354 64753973 62008301 60141316 58170081 56192733 54414205 52908265
14212 52908265 51294529 49540619 47916791 46441153 45242079 44462332 43035425 41537123
14204 41537123 40411168 39000781 38320489 36953986 36758483 35634698 34260675 33262562
14196 33262562 32455846 31616166 31159551 30427601 29369625 28714674 28256558 27494880 26475688
14187 26475688 25757578 25480231 25041100 24428248 23670179 22894037 22780167 22028682 21555380
$$ packed form
14244A96219204q886809q816705q326334q226356p770557p029878o822633o114002
14236A34225930n970297n919170n107125n440538m623201m059595l903842m819557
14228I4382605l619535l737216l210735l315723k790614l232297k793625k315546
14220F9367314k199960k413381k745672j866985j971235j977348j778528j505940
14212E2908265j613736j753910j623828j475638j199074p79747j426907j498302
14204D1537123j125955j410387o80292j366503j95503j123785j374023r98113
14196C3262562q06716q39680m56615p31950j057976o54951m58116p61678j019192
14187B6475688p18110k77347m39131o12852p58069p76142j13870p51485m73302
$$ plain form
14178 21555380 21434719 20526507 20547009 20078667 19489826 19160198 18689955 18542390 18280301
14169 18280301 17653541 17366009 16972009 16679639 16443407 15984079 15803475 15325089 14931810
14160 14931810 15113539 14533549 14656843 14109277 14253967 13770433 13281925 13316445 13294847 12790136
14150 12790136 12430824 12532250 12155160 12210046 11837590 11943085 11300061 11261667 11297666 10949692
14140 10949692 10597353 10327918 10502555 10161438 10589901 10065513 10156764 9543342 9677852
14131 9677852 9322147 9226130 9163340 9159882 8862925 8915979 8732197 8198726 8466444 8234498
14121 8234498 8037529 8046123 7831241 7938191 7728795 7505571 7590165 7260463 7536458 7599153
14111 7599153 7294191 6789387 7181127 7019715 6669771 6387453 6828801 6503550 6799071
$$ packed form
14178B1555380j20661r08212K0502m68342n88841l29628m70243j47565k62089
14169A8280301o26760k87532l94000k92370k36232m59328j80604m78386l93279
14160A4931810J81729n79990J23294n47566J44690m83534m88508L4520k1598n04711
14150A2790136l59312J01426l77090N4886l72456J05495o43024l8394L5999l47974
14140A0949692l52339k69435J74637l41117M28463n24388R1251o13422J34510
14131I677852l55705r6017o2790l458k96957N3054j83782n33471K67718k31946
14121H234498j96969Q594k14882J06950k09396k23224Q4594l29702K75995O2695
14111G599153l04962n04804L91740j61412l49944k82318M41348l25251K95521
$$ plain form
14102 6799071 6444616 6303618 6608857 5842114 6364680 5912470 6200997 5737719 6098100
14093 6098100 6058739 5636003 5373958 5660749 5644830 5581326 5360223 5196192 5388119 5205363
14083 5205363 4968513 5008154 4999599 5068970 4959080 4743272 4696218 4805888 4318211 4360282
14073 4360282 4734872 4490935 4237428 4782999 4491870 4516766 4692911 4476008 4068039 4245618
14063 4245618 4354922 4353298 4246180 4094866 4248990 4140851 3787582 3975519 4053773 3891941
14053 3891941 3887022 3690123 3658002 3723451 3779064 3761148 3429896 3686507 3105013 3378775
14043 3378775 3263255 3301168 3728536 3571147 3558750 3252542 3400620 3143785 3225575 3185396
14033 3185396 3040569 3153259 3171689 3409787 2890927 3234057 2918010 2797323 3071748 3152835
$$ packed form
14102F799071l54455j40998L05239p66743N22566m52210K88527m63278L60381
14093F098100l9361m22736k62045K86791j5919o3504k21103j64031J91927j82756
14083E205363k36850L9641q555O9371j09890k15808m7054J09670m87677M2071
14073D360282L74590k43937k53507N45571k91129K4896J76145k16903m07969J77579
14063D245618J09304j624j07118j51314J54124j08139l53269J87937P8254j61832
14053C891941m919j96899l2121O5449N5613j7916l31252K56611n81494K73762
14043C378775j15520L7913M27368j57389j2397l06208J48078k56835Q1790m0179
14033C185396j44827J12690J8430K38098n18860L43130l16047j20687K74425Q1087
$$ plain form
14023 3152835 2876168 2899429 2642586 2904435 2686360 2857644 2618788 2481058 2872647 2440072
14013 2440072 2631385 2871525 2495404 2732004 2612097 2540986 2672023 2453388 2407710 2450452
14003 2450452 2452987 2176053 2476970 2430930 2052562 2097126 2091074 1927611 1976615 2094266 2317488
13992 2317488 2072826 2227383 2874324 3588945 6260895 11893653 25603267 39977967
13984 39977967 25148959 15356170 10104411 7822298 6002305 5420203 4527715 4230361
13976 4230361 4134150 3628489 3703524 3364804 3136830 3071111 2916615 2970463 2502710 2793853
13966 2793853 2622342 2709237 2321735 2765319 2240222 2546209 2304934 2356398 2368670 2223819
13956 2223819 2246255 2230360 1921722 2279826 1786853 2174908 2356914 1955737 2140147 1932587
$$ packed form
14023C152835k76667K3261k56843K61849k18075J71284k38856j37730L91589m32575
14013B440072J91313K40140l76121K36600j19907p1111J31037k18635m5678M2742
14003B450452K535k76934L00917m6040l78368M4564o052j63463M9004J17651K23222
13992B317488k44662J54557O46941P14621K671950N632758J3709614J4374700
13984C9977967j4829008r792789n251759k282113j819993n82102q92488k97354
13976D230361r6211n05661P5035l38720k27974o5719j54496N3848m67753K91143
13966B793853j71511Q6895l87502M43584n25097L05987k41275N1464J2272j44851
13956B223819K2436j5895l08638L58104m92973L88055J82006m01177J84410k07560
$$ plain form
13946 1932587 1876246 1752211 2053602 1621513 1949599 1698488 1692494 1852454 2089930 2069795
13936 2069795 1818877 2012807 2076504 1638138 1576861 1630279 1906258 1511861 1611750 1725053
13926 1725053 1765328 1590365 1643492 1774767 1700183 1477881 1509725 1488622 1332644 1835652
13916 1835652 1459174 1402845 1785783 1212105 893511 1390618 1648849 1882040 1338852 1265160
13906 1265160 1440178 1675056 1629951 1263469 1506672 1550200 1428017 1336033 1171655 1299681
13896 1299681 1596469 1730010 1410201 1556238 1543994 1408302 1111780 1662685 1348880 1293957
13886 1293957 1496527 1465521 1422245 1469233 1320878 1269536 1514346 1243589 1146095 1351573
13876 1351573 1785598 1071418 1112710 1029345 1227849 1417871 1010086 1514554 1470641 943302
$$ packed form
13946A932587n6341j24035L01391m32089L28086k51111n994J59960K37476k0135
13936B069795k50918J93930O3697m38366o1277N3418K75979l94397R9889J13303
13926A725053M0275j74963N3127J31275p4584k22302L1844k1103j55978N03008
13916A835652l76478n6329L82938n73678l18594M97107K58231K33191n43188p3692
13906A265160J75018K34878m5105l66482K43203M3528j22183r1984j64378J28026
13896A299681K96788J33541l19809J46037j2244j35692k96522N50905l13805n4923
13886A293957K02570l1006m3276M6988j48355n1342K44810k70757r7494K05478
13876A351573M34025p14180M1292q3365J98504J90022m07785N04468m3913n27339
$$ plain form
13866 943302 1211014 1094293 1140602 1323804 1024408 1495704 1220067 1134048 1180132 1117061
13856 1117061 997694 1157170 881654 1313913 1277047 1034803 844789 1115504 1152750 1009237
13846 1009237 806663 980219 964417 980853 926958 971895 1036858 744567 620853 435214
13836 435214 1041425 1159507 789860 950790 949930 830026 1034332 886260 1228573 959577
13826 959577 831915 1043116 845569 871243 827239 960437 849944 787177 1103087 805100
13816 805100 758281 825884 1014878 960258 462185 889642 1012331 1004527 827670 553157
13806 553157 789919 745873 1043389 693829 986232 713487 917044 671537 956035 1007663
13796 1007663 772227 862577 817349 886344 599832 674984 940020 940976 711553 753337 641039
$$ packed form
13866I43302K67712j16721M6309J83202k99396M71296k75637q6019M6084o3071
13856A117061j19367J59476k75516M32259l6866k42244j90014K70715L7246j43513
13846A009237k02574J73556j5802J6436n3895M4937O4963k92291j23714j85639
13836D35214O06211J18082l69647J60930q60j19904K04306j48072L42313k68996
13826I59577j27662K11201j97547K5674m4004J33198j10493o2767L15910k97987
13816H05100m6819O7603J88994n4620D62185M27457J22689p804j76857k74513
13806E53157K36762m4046K97516l49560K92403k72745K03557k45507K84498N1628
13796A007663k35436R0350m5228O8995k86512P5152K65036R56k29423M1784j12298
$$ plain form
13785 641039 777222 784812 642285 733843 819668 872064 524044 506343 1037898 936977 545307
13774 545307 704616 738039 641603 806239 794568 565642 807579 630170 701049 613528
13764 613528 614144 695628 535297 619400 825042 756281 350226 614926 903422 965288 1037988
13753 1037988 714702 786749 338143 785707 446906 447822 751466 859549 681365 586460
13743 586460 622260 945440 607298 817042 800177 767674 621667 316983 526510 600907
13733 600907 670695 475644 707284 628526 869209 769646 650208 562835 481785 375226
13723 375226 587867 659832 726326 587555 356752 552217 363880 450547 668271 723942
13713 723942 738345 777133 217040 709739 731597 568522 467096 761334 300955 647540
$$ packed form
13785F41039J36183P590j42527R1558Q5825N2396l48020j7701N31555j00921l91670
13774E45307J59309L3423r6436J64636j1671k28926K41937j77409P0879q7521
13764F13528O16Q1484j60331Q4103K05642o8761C50226K64700K88496O1866P2700
13753A037988l23286P2047C38143M47564l38801R16L03644J08083j78184r4905
13743E86460L5800L23180l38142K09744j6865l2503j46007l04684K09527P4397
13733F00907O9788j95051K31640p8758K40683r9563j19438q7373q1050j06559
13723C75226K12641P1965O6494j38771k30803J95465j88337Q6667K17724N5671
13713G23942J4403L8788B17040M92699K1858j63075j01426K94238C00955L46585
$$ plain form
13703 647540 425476 300523 154459 618188 755010 619746 519272 465872 802235 564835
13693 564835 509023 572332 677172 456563 654055 349950 396875 253266 400388 648437
13683 648437 433515 765789 550646 620491 280663 493004 522018 568217 286005 233241
13673 233241 563509 549905 403330 445886 507516 494359 487186 399624 665463 642694 502507
13662 502507 464271 513226 396321 493338 196028 329527 329239 608576 361314 788086 290669
13650 468575 495766 6438 523613 531040 485083 531680 490072 872886 202782 388289 588438
13639 588438 337537 76410 641049 288200 239522 677215 451199 577661 113031 551557
13629 551557 109227 491604 507783 517059 476556 391395 349788 501249 540209 367485 345708
$$ packed form
13703F47540k22064j24953j46064M63729J36822j35264j00474n3400L36363k37400
13693E64835n5812O3309J04840k20609J97492l04105M6925j43609J47122K48049
13683F48437k14922L32274k15143O9845B80663K12341K9014M6199k82212n2764
13673B33241L30268j3604j46575M2556O1630j3157p173q7562K65839k2769j40187
13662E02507l8236M8955j16905R7017A96028J33499k88K79337k47262M26772B90669
13650D68575K7191F438N17175P427m5957M6597m1608L82814B02782J85507K00149
13639E88438k50901G6410N64639B88200m8678M37693k26016J26462A13031M38526
13629E51557A09227L82377J6179R276m0503q5161m1607J51461L8960j72724k1777
$$ plain form
13618 345708 573426 307648 423898 363139 232190 551723 436443 455282 409333 343949
13608 343949 289478 475381 211308 453423 356116 766383 405235 118404 535479 262631
13597 315079 452097 440471 438647 582066 220033 559712 493124 293457 565878 417739
13587 417739 349178 370105 277988 444252 245808 233918 434641 313984 213593 284590
13577 284590 54550 664277 484540 359367 451527 538416 588670 234985 270010 334897 264633
13566 264633 264833 394287 321227 244762 272039 181855 261379 557375 394303 319876 474089
13555 474089 753405 320026 229744 151841 333349 5361 426745 497003 336944 275042 291819
13544 291819 239267 640583 202395 367091 64851 482543 548235 322242 490936 470879
$$ packed form
13618C45708K27718k65778J16250o0759j30949L19533j15280J8839m5949o5384
13608C43949n4471J85903B11308K42115r7307M10267l61148A18404M17075B62631
13597C15079J37018j1626j824J43419B20033L39679o6588j99667K72421j48139
13587D17739o8561K0927r2117J66264j98444j1890K00723j20657j00391P0997
13577B84590E4550O09727j79737j25173R2160Q6889N0254B34985L5025O4887p0264
13566B64633K00J29454p3060p6465K7277r0184P9524K95996j63072p4427J54213
13555D74089K79316C20026r0282p7903J81508E361M21384P0258j60059o1902J6777
13544B91819n2552M01316B02395J64696F4851M17692O5692k25993J68694k0057
$$ plain form
13534 470879 506992 90551 -109527 163807 68886 381003 104942 30832 326895 303946
13524 303946 636233 101209 130697 238815 572711 493412 292526 382823 130122 138919
13514 138919 345398 176112 238560 122016 524251 478376 452342 367673 500692 387139
13504 387139 218230 548526 336229 63351 345700 191322 411384 382884 383246 88717 24839
13492 228653 322452 180861 369715 184334 264186 80290 122257 558671 252361 216723
13482 216723 493389 85432 144514 319364 -83301 259573 60697 219574 558362 385418
13472 385418 375383 434557 110546 5409 187817 97776 188045 292966 -129466 358994 78547
13460 297040 526607 404125 19851 267650 -103003 -57423 184282 257129 58287 63335 393352
$$ packed form
13534D70879L6113I0551a09527A63807F8886L12117A04942C0832K96063k2949
13524C03946L32287A01209K9488J08118L33896p9299k00886R0297A30122Q797
13514A38919K06479j69286O2448j16544M02235m5875k6034q4669J33019j13553
13504C87139j68909L30296k12297F3351K82349j54378K20062k8500L62H8717B4839
13492B28653R3799j41591J88854A84334P9852H0290M1967M36414B52361l5638
13482B16723K76666H5432N9082J74850h3301B59573F0697J58877L38788j72944
13472C85418j0035N9174A10546E409J82408r0041R0269J04921a29466C58994G8547
13460B97040K29567j22482A9851K47799a03003M5580A84282P2847E8287N048L30017
$$ plain form
13449 393352 301474 108316 541573 447913 144120 125668 254456 114794 220693 204476
13439 204476 463398 363237 52874 275986 96004 195657 227445 171547 440984 -110542
13428 62027 420464 76423 121887 -28329 164054 470761 399951 100525 287653 354165 327828
13417 327828 367578 359289 78159 452391 233377 305259 292692 159126 8464 220488 97714
13405 -130925 225407 265393 152086 277285 76246 488670 462743 -44123 415655 130622
13394 279485 -7490 446844 162529 203448 259376 39122 283077 -56164 149700 129426 304310
13383 304310 -256963 286854 112273 307867 362291 385168 260696 316510 343807 65722
13372 152285 429482 536128 -40996 343732 449251 29041 -51210 48265 259621 513059
$$ packed form
13449C93352r1878A08316M33257r3660A44120j8452J28788A14794J05899j6217
13439B04476K58922j00161E2874K23112I6004R9653L1788n5898K69437a10542
13428F2027L58437G6423M5464b8329A64054L06707p0810A00525J87128O6512k6337
13417C27828L9750q289G8159L74232k19014P1882j2567j33566H464K12024I7714
13405a30925B25407L9986j13307J25199G6246M12424k5927d4123D15655A30622
13394B79485g490D46844A62529M0919N5928C9122K43955e6164A49700k0274J74884
13383C04310b56963B86854A12273J95594N4424K2877j24472N5814K7297F5722
13372A52285K77197J06646d0996C43732J05519B9041e1210D8265K11356K53438
$$ plain form
13362 513059 537956 -80812 254768 -173779 401886 171674 71218 125431 373128 271138
13352 271138 164090 201095 389510 374204 346583 426644 104461 145797 347659 391756 398043
13341 398043 426345 170346 368217 236627 362335 296549 -56693 60979 42690 7733 145476
13330 145476 215732 -5613 337966 488249 47522 366458 6817 112286 106250 401689 339651
13319 339651 162858 78137 226984 455923 543375 229606 -72964 -60859 73140 104404 25492
13307 217812 73287 181212 411521 16683 184868 91188 136452 166788 138376 233812 526952
13296 526952 95918 37714 -40380 122863 3505 186006 341377 420499 -90968 -141667 173737
13284 140543 15327 398747 405324 209929 364974 146388 115203 166610 454042 -6214 232275
$$ packed form
13362E13059K4897h0812B54768a73779D01886A71674G1218N4213K47697j01990
13352B71138j07048L7005J88415j5306k7621Q0061A04461M1336K01862M4097O287
13341C98043K8302A70346J97871j31590J25708o5786e6693F0979j8289G733J37743
13330A45476P0256e613C37966J50283D7522L18936F817J05469o036K95439o2038
13319C39651A62858G8137J48847K28939Q7452B29606g2964J2105G3140L1264B5492
13307B17812G3287J07925K30309A6683J68185I1188M5264L0336k8412R5436K93140
13296E26952I5918C7714d0380A22863C505J82501J55371P9122i0968n0699A73737
13284A40543A5327L83420O577j95395J55045A46388l1185N1407K87432f214B32275
$$ plain form
13272 -166934 -120625 306437 205450 46367 116271 54109 418687 13050 226348 201418 38408
13260 38242 106726 67995 -109075 -21971 -249015 75087 -22943 366169 17318 377570 -70833
13248 228469 185236 364823 6287 195513 7195 -251348 180787 575186 -2893 389687 -235540
13236 306550 117957 279302 -51328 444083 243186 145325 -68880 181135 -139879 -263625
13226 -263625 399935 34455 107087 -47681 96556 258441 296787 271388 17332 -1707 155182
13214 142158 282497 284260 -98258 -59745 257857 -88723 97585 92782 260940 177620 243841
13203 243841 17250 -12835 54722 -127675 -318577 -157688 232321 176965 15093 -198598
13192 19615 -192163 262855 204048 56313 56344 -272381 41277 207131 99347 189493 -75107
$$ packed form
13272a66934M6309C06437j00987D6367O9904E4109L64578A3050K13298k4930C8408
13260C8242O8484l8731a09075b1971k27044G5087b2943C66169A7318L60252g0833
13248B28469m3233J79587F287J89226G195b51348A80787L94399b893C89687b35540
13236C06550A17957J61345e1328D44083k00897r7861f8880A81135a39879j23746
13226b63625C99935C4455P2632d7681I6556J61885L8346k5399A7332a707A55182
13214A42158J40339J763i8258L8513B57857h8723I7585m803J68158q3320O6221
13203B43841A7250a2835E4722a27675j90902a57688B32321n5356A5093a98598
13192A9615a92163B62855n8807E6313L1b72381D1277J65854I9347R0146g5107
$$ plain form
13180 298133 410060 -32833 170547 -62720 326555 268203 -31019 -64970 35221 309036 303779
13169 303779 89830 -84890 -210655 -243784 275204 -70890 16943 82388 45346 147130 16889
13157 39822 122366 283662 171358 26177 290518 -48920 333030 436350 281415 -60033
13146 195886 116932 42254 104946 213334 156343 305832 -34673 104015 -152004 41764 239616
13135 239616 259798 186575 114002 290155 115830 235377 270250 424446 -17416 42578 64807
13124 64807 97753 -156335 48306 177648 -10282 210995 567670 64090 57932 18262 -175566
13112 31710 -153091 -177175 33518 -118902 57426 215249 -26914 160391 181725 493555 22939
13100 -315829 3148 -42781 77958 101421 -2900 84828 89073 33387 -10512 -236861 376832 120158
$$ packed form
13180B98133J11927c2833A70547f2720C26555n8352c1019l3951C5221K73815n257
13169C03779H9830h4890j25765l3129B75204g0890A6943O5445l7042J01784A6889
13157C9822Q2544J61296j12304B6177K64341d8920C33030J03320j54935f0033
13146A95886p8954D2254O2692J08388n6991J49489c4673A04015a52004D1764J97852
13135B39616K0182p3223p2573J76153A15830J19547L4873J54196a7416D2578K2229
13124F4807L2946a56335D8306J29342a0282B10995L56675F4090o158A8262a75566
13112C1710a53091k4084C3518a18902E7426J57823b6914A60391K1334L11830B2939
13100c15829C148d2781G7958K3463b900H4828M245C3387a0512k26349C76832A20158
$$ plain form
13087 118408 36377 234521 165588 154542 157016 225098 -158403 24492 80177 -232881 -33474
13075 39637 -86603 281277 238414 80778 436820 28547 -140630 93220 12904 144348 44684
13063 172100 276988 30997 133543 22825 -74226 38512 127861 153457 313682 -24057 68787
13051 111079 109344 92257 185453 -263135 -14558 35253 328980 -70202 58966 245049 369856
13040 369856 416453 94899 116994 -262530 200339 -329631 -177114 -126951 331833 20884
13029 -195349 -246365 130805 298679 328068 65745 -133381 -146868 140004 -378144 387284
13018 85301 -175604 194923 62147 35787 72050 68733 181908 -182499 327161 130730 -26694
13006 -195083 -3436 281127 -117520 139446 295475 144542 -15434 118756 -73002 -37699
$$ packed form
13087A18408C6377J98144o8933j1046K474O8082a58403B4492N5685b32881c3474
13075C9637h6603B81277m2863H0778L56042B8547a40630I3220A2904J31444D4684
13063A72100J04888C0997J02546B2825g4226C8512Q9349K5596J60225b4057F8787
13051A11079j735j7087R3196b63135a4558C5253K93727g0202E8966J86083J24807
13040C69856M6597I4899K2095b62530B00339c29631J52517N0163C31833B0884
13029a95349n1016A30805J67874K9389F5745a33381j3487A40004c78144C87284
13018H5301a75604A94923F2147k6360L6263l317J13175a82499C27161A30730b6694
13006a95083c436B81127a17520A39446J56029A44542a5434A18756g3002L5303
$$ plain form
12996 -37699 -106001 101690 -1496 -68771 258724 399895 -191351 44278 147060 215900 -227026
12984 298433 152017 35077 -165715 154803 -79045 -72648 -190710 -78436 83563 81181 216077
12973 216077 66939 224631 130713 86036 165784 220797 -29419 -56985 266761 -398832 254437
12961 -292119 -255410 349194 51919 4291 -229815 142715 7237 256511 24982 -295532 357620
12949 58684 390466 23054 -27740 -70011 28804 231681 -69242 -140071 -173183 160751 54921
12937 52426 446623 56904 68672 31429 59827 -129217 -141142 -327971 -309473 234847 419556
12926 419556 65880 -203158 -118392 336024 160868 84150 -46709 -68808 178041 80624 68806
12915 68806 114797 120770 141584 -102614 -6190 -62670 194342 -15252 -43420 -146316 320451
$$ packed form
12996c7699o8302A01690a496o7275B58724J41171a91351D4278J02782O8840b27026
12984B98433j46416C5077a65715A54803g9045O397j18062g8436H3563k382J34896
12973B16077F6939J57692r3918m4677P9748N5013b9419k7566B66761c98832B54437
12961b92119L6709C49194E1919D291b29815A42715G237K49274B4982b95532C57620
12949E8684L31782B3054b7740m2271B8804K02877f9242p0829l3112A60751E4921
12937E2426L94197E6904J1768C1429K8398a29217j1925j86829J8498B34847J84709
12926D19556F5880b03158Q4766C36024A60868p6718d6709k2099A78041H0624j1818
12915F8806M5991N973K0814a02614f190n6480A94342a5252k8168j02896C20451
$$ plain form
12903 55200 -52384 -67364 -98012 -177127 -194778 -41149 -48480 -2452 -30501 -15905 -65420 -84171
12891 -84171 -158928 10511 143285 -109813 489575 212111 93237 321328 -380986 -28448
12880 253498 -21649 14657 213920 22017 228161 -43373 -240666 -127876 -118255 110467 -194590
12868 -399851 325614 118206 192332 -160105 172195 125901 272104 344339 -178711 249528
12857 82507 -124463 385223 187178 -24684 170947 89187 68685 74660 198968 -118290 -190967
12846 -190967 -23499 -182848 -25883 -157139 168118 312288 -53984 -314356 -33254 113787
12835 69289 -16500 -124293 -175732 -111350 19535 -88522 -249001 168521 -44498 -74382 -100344
12824 -100344 -98186 -17850 110165 6693 288037 133047 133483 15694 -109446 321732 -24853
$$ packed form
12903E5200e2384j4980l0648p9115j7651d1149p331b452k8049J4596m9515j8751
12891h4171p4757A0511J32774a09813D89575B12111I3237K28091c80986b8448
12880B53498b1649A4657J99263B2017K06144d3373j97293J12790R621A10467a94590
12868c99851C25614A18206P4126a60105A72195m6294J46203P2235a78711B49528
12857H2507a24463C85223A87178b4684A70947q1760k0502N975J24308a18290p2677
12846a90967b3499j59349b5883j31256A68118J44170e3984k60372c3254A13787
12835F9289a6500j07793n1439O4382A9535h8522j60479A68521d4498k9884k5962
12824a00344K158a7850A10165F693K81344A33047M36A5694a09446C21732b4853
$$ plain form
12812 -50260 -102951 292353 -369343 -43786 179007 -28269 309626 64821 -30219 164176 113752
12801 113752 -89250 -98439 156782 26103 113981 -23004 233140 183162 -58707 87863 191837
12790 191837 27617 -106893 138904 -210647 264816 379117 78656 -105811 -16722 -152507
12780 -152507 -157975 -165323 24875 79873 136485 32626 -592739 -72018 33345 261838 -17185
12768 197306 -204902 63530 131945 -1919 86041 -119953 -77957 142946 -10236 99108 84757
12757 84757 34225 -113967 272789 -177977 255814 385250 -177701 -90218 230468 -361981
12746 9006 196920 -179185 -153366 73097 220927 -198363 178786 105243 56856 63228 -7192
12734 -88183 84342 224821 188261 71730 -33839 -68107 247367 -23014 -412845 -31365 294914
$$ packed form
12812e0260n2691B92353c69343d3786A79007b8269C09626F4821c0219A64176n0424
12801A13752h9250r189A56782B6103Q7878b3004B33140m9978e8707H7863J03974
12790A91837B7617a06893A38904b10647B64816J14301G8656a05811a6722j35785
12780a52507n468p348B4875N4998N6612C2626e92739g2018C3345K28493a7185
12768A97306b04902F3530O8415a919H6041a19953M1996A42946a0236I9108j4351
12757H4757C4225a13967B72789a77977B55814J29436a77701Q7483B30468c61981
12746I006J87914a79185K5819G3097J47830a98363A78786p3543m8387O372g192
12734h8183H4342J40479l6560G1730c3839l4268B47367b3014l89831c1365B94914
$$ plain form
12722 170747 -100693 36308 80177 -277853 -135056 40045 -181039 -65850 50928 106689 -6664
12710 200946 401617 96111 312791 -20901 46056 270293 61354 62059 44076 33688 129139
12699 129139 235799 -208814 332016 144475 -313256 38895 3537 26792 -242071 -17186
12688 47740 -36540 -144138 -16708 337708 222546 20097 -149830 15043 203959 118099 -23298
12676 292068 46235 111357 189889 222077 -137466 107617 -18547 -167370 151785 -37097 -60608
12665 -60608 319736 -175368 -62131 -79348 -73451 29708 -75145 15252 203274 -132739 -248596
12654 -248596 116442 52769 -220791 55787 146342 88334 -10490 -304389 -102183 220014
12643 231490 184359 -51195 189593 -39658 -215022 -165104 303311 79080 173413 286307 207620
$$ packed form
12722A70747a00693C6308M3869b77853a35056D0045a81039f5850E0928N5761f664
12710B00946K00671I6111K16680b0901D6056K24237F1354P05j7983j0388R5451
12699A29139J06660b08814C32016A44475c13256C8895C537K3255b42071a7186
12688D7740c6540j07598a6708C37708j15162B0097a49830A5043J88916q5860b3298
12676B92068D6235O5122P8532L2188a37466A07617a8547j48823A51785c7097k3511
12665f0608C19736a75368f2131j7217N897B9708g5145A5252J88022a32739j15857
12654b48596A16442E2769b20791E5787R0555n8008a0490k93899a02183B20014
12643B31490m7131e1195A89593c9658j75364M9918C03311G9080R4333J12894p8687
$$ plain form
12632 207620 -13419 -27159 206124 227695 123115 353604 345139 86995 261143 112637 -51176
12620 72769 122673 136290 138113 -74967 151913 261507 42395 -90058 100521 28880 69861
12609 69861 56918 -136641 336201 424817 242752 -186412 -208320 282614 150827 -11806
12598 -50802 -8958 3161 -81307 -119258 5024 135819 20457 109650 183579 -102888 -440007 281600
12585 -359025 214048 -203453 -40573 314390 108645 -34794 -102789 131832 -40522 136603
12574 195548 153885 616354 145978 273806 240307 94081 259442 -203697 -106209 -239609
12564 -239609 -149394 28215 -242179 -104231 -158630 -89036 36619 -50731 -95364 -16599 -187456
12553 -187456 160663 -172089 -96614 -144889 -255484 -186224 -164578 -77567 -158116 -71110 37608
$$ packed form
12632B07620a3419j3740B06124K1571j04580K30489q465H6995J74148A12637e1176
12620G2769M9904J3617J823g4967A51913J09594D2395i0058A00521B8880M0981
12609F9861j2943a36641C36201Q8616j82065a86412k1908B82614j31787a1806
12598e0802h958C161h1307l7951E024J30795B0457Q9193P3929a02888l37119B81600
12585c59025B14048b03453d0573C14390A08645c4794o7995A31832d0522A36603
12574A95548m1663M62469A45978J27828l3499I4081J65361b03697R7488j33400
12564b39609R0215B8215b42179a04231n4399O9594C6619e0731m4633a6599j70857
12553a87456A60663a72089P5475m8275j10595O9260K1646g7567q0549g1110C7608
$$ plain form
12541 -7985 100933 214003 -85963 15612 161049 192235 249214 105535 -24520 -2846 -89475
12530 -89475 11783 -62951 232556 159816 -19775 -75619 -67488 -34586 -11804 268733 44145
12518 11152 -85032 -51974 153102 170925 -122883 -8599 24209 -104628 -147939 -422546 144723
12506 -84124 302988 184992 -19726 -235588 -100175 282384 11530 282694 294102 118773
12495 397362 100377 201620 -110459 -114965 219497 140837 -47871 60469 44904 163270 -96340
12483 166253 -216924 -160014 28979 91889 46389 152044 59164 -220238 198801 -121165
12472 162910 -80738 87804 134792 -102397 257625 -169605 -158824 4987 219082 140522 -65887
12460 -77008 -362576 142763 91777 36976 -313181 122248 167380 -300638 23739 270446
$$ packed form
12541g985A00933J13070h5963A5612J45437L1186N6979A05535b4520b846q6629
12530h9475A1783f2951B32556p2740a9775n5844Q131L2902a1804B68733D4145
12518A1152h5032L3058A53102J7823a22883h599B4209a04628m3311k74607A44723
12506h4124C02988j17996a9726k15862a00175B82384A1530K71164J1408A18773
12495C97362A00377J01243a10459m506B19497p8660d7871F0469j5565J18366i6340
12483A66253b16924N6910B8979O2910m5500J05655E9164b20238A98801a21165
12472A62910h0738H7804M6988a02397B57625a69605J0781D987K14095p8560f5887
12460g7008k85568A42763n0986C6976c13181A22248M5132c00638B3739K46707
$$ plain form
12450 270446 -117942 368248 -218545 -60505 -305990 -33547 -299808 -16800 34083 85683
12440 85683 96889 18763 50079 -180978 46064 522382 5852 308458 65263 71858 238368
12429 238368 189592 -383138 -179707 -341102 462501 184608 -5480 -215329 -172909 67765
12418 -9667 67253 214906 49057 39947 -35643 -303631 -181986 -456540 -130831 -97057 14725
12406 -118379 -50405 -100009 -179085 219558 144345 -203330 -463281 394536 -212142 -59818
12395 -242810 4458 -12480 -131948 96836 244853 -45987 12310 165161 83847 222495 191643
12384 191643 132906 -49771 -41240 111305 -97881 253250 27520 316434 207566 -43224 45716
12372 106177 -14867 -119370 18745 -21038 24577 -238132 356440 -400330 66847 312286
$$ packed form
12450B70446a17942C68248b18545f0505k45485c3547k66261a6800C4083N1600
12440H5683J1206A8763L1316a80978D6064M76318E852L02606F5263O595J66510
12429B38368m8776c83138a79707j61395D62501A84608e480k09849M2420F7765
12418i667F7253J47653D9057r110c5643k67988J21645k74554a30831L3774A4725
12406a18379e0405m9604p9076B19558p5213b03330k59951C94536b12142e9818
12395b42810D458a2480j19468I6836J48017d5987A2310J52851q1314J38648l0852
12384A91643n8737d9771Q531A11305i7881B53250B7520K88914j08868d3224D5716
12372A06177a4867j04503A8745b1038B4577b38132C56440d00330F6847K45439
$$ plain form
12362 312286 23473 136254 23742 -76585 48629 33074 -114735 -88543 -35758 77047 -88674
12350 161102 89406 326334 -156675 -46986 -91386 136192 12452 308896 162149 241109
12340 241109 -103635 -6380 325114 118780 54655 11636 21657 192880 343808 83791 346651
12329 346651 60204 -52019 -239129 265565 -144818 121387 189215 255278 243272 262090 -51604
12317 143984 277850 180246 -240487 99167 249551 311272 227542 45829 -140553 262882
12306 339114 35801 319413 -182211 452136 -26716 111146 159797 12089 304840 -60275
12295 -38021 44008 -326096 -184663 -366630 310197 -53208 -146971 133314 24524 35923 -30508
12283 -108337 317879 -97048 -276090 -11325 118091 232186 158368 132387 -42994 188058
$$ packed form
12362C12286B3473J12781B3742g6585D8629j5555a14735K6192c5758G7047h8674
12350A61102p1696K36928a56675d6986m4400A36192A2452K96444j46747P8960
12340B41109a03635f380C25114A18780E4655A1636J0021J71223J50928H3791K62860
12329C46651F0204e2019j87110B65565a44818A21387O7828O6063j2006J8818e1604
12317A43984J33866r7604b40487I9167J50384O1721q3730D5829a40553B62882
12306C39114C5801K83612a82211D52136b6716A11146M8651A2089K92751f0275
12295c8021D4008c26096J41433j81967C10197e3208r3763A33314B4524J1399c0508
12283a08337C17879i7048j79042a1325A18091J14095p3818k5981d2994A88058
$$ plain form
12272 131332 449648 108864 43854 -99852 -275654 243494 217560 328612 -22999 448017
12261 353598 288023 237388 75530 275117 312247 161054 -138238 247536 -417712 -89684
12250 438153 20997 -40413 89858 261583 -59763 79603 -132757 216553 49397 307616 66207
12238 185483 -38512 63370 -91621 -31001 48909 101916 335077 184902 243436 -10615 105839
12226 166276 265924 190075 112129 180225 199999 291025 255869 280699 19394 345625 81024
12214 305251 158806 344356 -47718 231948 -59479 464557 48757 -32288 937 -295870 -95765
12202 -86327 -102579 140015 133980 294979 140489 245683 308150 261819 122671 139400 208047
12191 208047 84603 325966 367044 50200 265695 136325 51583 -76273 66686 260760 77501
$$ packed form
12272A31332L18316A08864D3854i9852j75802B43494k5934J11052b2999D48017
12261C53598o5575n0635G5530J99587L7130j51193a38238B47536d17712h9684
12250D38153B0997d0413H9858J71725e9763G9603a32757B16553D9397K58219F6207
12238A85483c8512F3370i1621c1001D8909N3007K33161j50175N8534a0615A05839
12226A66276R9648p5849p7946O8096J9774R1026l5156K4830A9394L26231H1024
12214C05251j46445J85550d7718B31948e9479D64557D8757c2288I37b95870i5765
12202h6327j6252A40015o035J60999A40489J05194O2467m6331A22671J6729O8647
12191B08047H4603K41363M1078E0200K15495j29370E1583g6273F6686J94074G7501
$$ plain form
12179 -106187 340388 2263 135347 445902 124017 387808 200772 -159618 218411 69485
12168 168257 56795 -124853 296120 -107586 421538 220522 265630 -180014 314864 203431
12158 203431 374892 -8461 278857 192566 42897 181357 -41733 10071 134689 42527 184286
12147 184286 -65441 -161997 -48321 309595 65973 29237 -101552 194070 -140869 250800
12136 240277 68069 68937 -141001 500679 262271 176126 356425 348898 259163 46391 175191
12125 175191 98623 199744 171435 -70405 114661 72520 -133983 248060 403784 -16892
12114 293449 254683 -134441 187967 327694 282305 254875 -38424 212688 142847 38767 145744
12103 145744 -210488 145644 21583 212143 238 62133 322904 222781 41844 238450 -73504
$$ packed form
12179a06187C40388B263J33084L10555A24017K63791j87036a59618B18411F9485
12168A68257E6795a24853B96120a07586D21538k01016M5108a80014C14864j11433
12158B03431J71461h461B78857q6291D2897J38460d1733A0071J24618D2527J41759
12147A84286f5441r6556d8321C09595F5973B9237a01552A94070a40869B50800
12136B40277F8069Q68a41001E00679k38408q6145J80299p527q9735D6391J28800
12125A75191p6568J01121k8309g0405A14661m2141a33983B48060J55724a6892
12114B93449l8766a34441A87967J39727m5389k7430c8424B12688o9841C8767J06977
12103A45744b10488A45644B1583J90560B38O1895K60771j00123D1844J96606g3504
$$ plain form
12091 245100 313638 153790 -188284 209180 276185 6748 135442 277821 -161292 350192
12080 85522 109128 88436 -72900 -222763 195253 99712 223985 235914 -81813 160210 -4432
12068 340238 -245086 -32727 -19770 -349341 162999 132270 127419 22918 248654 79100 -215593
12056 -5306 -99965 211649 -109915 165511 25946 -45000 51407 95711 248808 -312508 -165301
12045 -165301 63311 240912 -81890 72301 186029 170742 446805 2976 -191277 -87261 328448
12033 157933 157423 -175841 273785 301678 -92576 -372866 -73399 12232 32138 -58013 63901
12021 -114981 26307 242566 -101668 287776 86695 368986 172615 215317 185375 8717 -33670
12009 -4912 304351 -49886 156254 192104 -98939 1724 -181147 -27212 97872 -69492 -224897
$$ packed form
12091B45100O8538A53790a88284B09180O7005F748J28694J42379a61292C50192
12080H5522K3606k0692g2900j49863A95253r5541J24273J1929h1813A60210d432
12068C40238b45086c2727J2957l29571A62999l0729m851B2918K25736G9100b15593
12056e306r4659B11649a09915A65511B5946d5000E1407M4304J53097c12508J47207
12045a65301F3311J77601h1890G2301J13728j5287K76063B976a91277h7261C28448
12033A57933n10a75841B73785K7893i2576k80290g3399A2232J9906e8013F3901
12021a14981B6307K16259a01668B87776H6695K82291A72615M2702k9942H717c3670
12009d912C04351d9886A56254L5850i8939A724a81147b7212I7872f9492j55405
$$ plain form
11998 -224897 -232738 151601 181445 265285 11694 53054 128851 -127157 115457 -231323 -96392
11986 222117 52002 -351438 113007 135809 -185652 21657 170217 -224548 -260835 166674
11975 126538 -60906 263143 -200663 48210 -49360 -185016 -107104 -17329 -133212 -24211 33242
11963 114639 130254 -87356 -337020 53301 196892 387931 -23720 -140259 -227037 -48696 -12122
11951 -14005 91998 88085 13552 184116 437538 -158570 113417 230864 -433511 134247
11940 -43598 -238032 -134148 -37314 213739 -18245 -185781 -65077 221860 -58693 -102614 82537
11928 -9058 -326899 4993 237121 237851 -412583 -58176 -11440 88898 138950 16775 172941 362110
11916 362110 384823 77207 -30878 231479 -235164 -206648 31302 213572 117224 -16958 -28488
$$ packed form
11998b24897p841A51601K9844Q3840A1694M1360P5797a27157A15457b31323i6392
11986B22117E2002c51438A13007K2802a85652B1657J48560b24548l6287A66674
11975A26538f0906B63143b00663D8210d9360j35656P7912a7329j15883b4211C3242
11963A14639J5615h7356k49664E3301J43591J91039b3720j16539q6778d8696a2122
11951a4005I1998l913A3552J70564K53422a58570A13417J17447d33511A34247
11940d3598j94434J03884c7314B13739a8245j67536f5077B21860e8693m3921H2537
11928i058l17841D993K32128P30d12583e8176a1440H8898N0052A6775J56166J89169
11916C62110K2713G7207c0878B31479b35164K8516C1302J82270r6348a6958j1530
$$ plain form
11905 -28488 -211463 306216 -1290 -262325 31200 9111 -20176 38712 73977 -303991 -336735
11894 -336735 -226310 7740 -397154 -19641 -240919 -314080 32603 232486 28541 -137224 -24880
11882 200820 15781 -133544 -197774 53649 233627 122809 242818 159715 204171 -20786 -370986
11871 -370986 10250 -18054 24936 -40999 -128648 -14765 235051 214573 -85770 107476 11203
11859 -105836 -66793 40074 -56481 106983 293593 -8469 -70728 114494 16381 -274416 65883
11847 -134062 -269137 24477 -34417 -389777 247720 22718 -68438 136792 -83178 55767 -98764
11835 -389051 -13967 217982 -428463 50907 -173477 -17337 -111732 -60554 89632 -35116 -300834
11824 -300834 -117617 -218868 -188293 526436 -149751 -154464 32910 -88564 -8072 -75895 502283
$$ packed form
11905b8488j82975C06216a290k61035C1200I111b0176C8712L5265c03991l2744
11894c36735J10425G740c97154a9641k21278p3161C2603J99883B8541a37224b4880
11882B00820A5781a33544o4230E3649J79978j10818J20009q3103M4456b0786l50200
11871c70986A0250a8054B4936d0999q7649a4765B35051k0478h5770A07476A1203
11859a05836L9043D0074e6481A06983J86610h469o2259A14494A6381b74416F5883
11847a34062j35075B4477c4417l55360B47720B2718f8438A36792h3178E5767i8764
11835c89051a3967B17982d28463E0907a73477a7337r4395N1178H9632c5116k65718
11824c00834a17617j01251L0575E26436a49751m713C2910h8564h072o7823E02283
$$ plain form
11812 134301 -34910 -381447 -269744 -149362 -204296 -401718 42438 -42494 46370 27557 -211452
11800 -90852 -146700 -234761 118323 -123918 121964 -11768 -248211 36984 -159275 154939
11789 232374 90048 -75392 205871 -172819 -76453 49324 133532 32044 -1603 124903 304466
11778 304466 25983 -125374 -215245 5691 31983 110227 172781 483634 219419 84666 55985
11767 55985 -260081 -79999 -227823 -161466 -302956 -24078 -111821 2945 -211960 312930 126430
11755 -228635 -110615 -103577 -136201 -146582 42363 -126577 -80447 -195166 178299 -47851 -191507
11744 -191507 181170 179536 68210 -151276 383066 142843 -232627 45434 -7598 -231472 -48351
11732 -138502 -129112 241918 224219 256332 -8801 -16883 -59367 129489 146769 64618 -112310
$$ packed form
11812A34301c4910l46537J11703J20382n4934j97422D2438d2494D6370j8813b11452
11800i0852n5848q8061A18323a23918A21964a1768k36443C6984a59275A54939
11789B32374I0048g5392B05871a72819g6453D9324Q4208C2044a603A24903J79563
11778C04466B5983a25374q9871E691K6292P8244O2554L10853B19419H4666k8681
11767E5985b60081g9999j47824O6357j41490b4078q7743B945b11960C12930A26430
11755b28635a10615P038l2624j0381D2363a26577M6130j14719A78299d7851j43656
11744a91507A81170j634F8210a51276C83066A42843b32627D5434g598k23874d8351
11732a38502R390B41918j7699L2113h801q082m2484A29489J7280F4618a12310
$$ plain form
11720 16353 49730 -63311 98382 -14006 4654 -12485 -133289 457910 2720 -159652 -59315
11708 -27771 37848 113286 235851 38217 -279297 -100820 -271141 -270190 -53167 295316 -110493
11696 -57470 5830 559657 -281888 142784 -20687 61177 -145650 -125775 -28460 45340 71113
11685 71113 188329 184481 520899 175606 92298 198875 13168 290263 62889 -29507 55192
11673 -138709 12607 401345 -44560 -21311 -211101 -182486 -76067 -512291 -72763 194908 229225
11662 229225 170817 -19576 209371 36686 -72923 -45157 115340 -105563 44698 2951 14076
11651 14076 -144723 -36346 16289 -384386 150184 -351325 -135376 -69714 -235488 -49157
11640 -374463 91035 95853 -253978 -50433 140742 -22023 -167394 20823 155091 -13109 181931
$$ packed form
11720A6353L3377f3311I8382a4006D654a2485j20804D57910B720a59652e9315
11708b7771C7848P5438J22565C8217b79297a00820j70321R51e3167B95316a10493
11696e7470E830N53827b81888A42784b0687F1177a45650J9875b8460D5340K5773
11685G1113J17216l848L36418A75606q3308J06577A3168K77095F2889b9507E5192
11673a38709A2607L88738d4560b1311j89790K8615g6067m36224g2763A94908L4317
11662B29225n8408a9576B09371C6686g2923K7766A15340a05563D4698B951J1125
11651A4076a44723c6346A6289c84386A50184c51325a35376O5662j65774d9157
11640c74463I1035M818b53978e0433A40742b2023j45371B0823J34268a3109A81931
$$ plain form
11628 230319 -6723 -67116 -23778 197524 -364775 -39639 177742 269913 24288 -106371 142286
11616 -60654 -133916 219638 -18472 270916 72550 107370 144590 -197423 -215141 139586 163020
11605 163020 -228667 -44936 -398841 -175929 -85829 -370474 -38862 580439 109646 100709
11595 100709 171415 -90555 314891 -361723 -1580 74406 164056 -257924 123583 227346 -76503
11583 21605 13404 36090 61990 182935 250530 65148 305035 -294597 179240 146869 -248003
11571 -242998 -15407 135847 -158784 -40193 221032 125684 -5589 90335 8666 -271329 561086
11559 -166349 210287 537611 -5775 77255 -53486 30087 -55384 74759 265675 -165404 201961
11547 -97471 174870 379918 11131 156463 43714 45784 -52589 148060 -368068 349000 258245
$$ packed form
11628B30319f723o0393b3778A97524c64775c9639A77742R2171B4288a06371A42286
11616f0654p3262B19638a8472B70916G2550L4820L7220a97423j7718A39586K3434
11605A63020b28667d4936l53905a75929h5829k84645c8862E80439A09646q937
11595A00709P0706i0555C14891c61723a580G4406Q9650b57924A23583J03763g6503
11583B1605q201K2686K5900J20945O7595F5148K39887b94597A79240l2371b48003
11571b42998a5407A35847a58784d0193B21032r5348e589I0335H666b71329E61086
11559a66349B10287L27324e775G7255e3486C0087e5384G4759J90916a65404B01961
11547i7471A74870K05048A1131J45332D3714K070e2589A48060c68068C49000r0755
$$ plain form
11536 258245 -47784 -3445 -109939 -205255 -42227 -191978 98964 157945 -107553 -151720 -176905
11525 -176905 33249 -85782 -275453 -84457 384545 -47934 -30066 -10882 -5742 -40057 -168805
11514 -168805 426529 95180 143666 74642 330327 22068 164953 38360 189310 86287 3707
11502 77484 64101 -125377 -37780 96782 74701 62121 166867 -185433 249046 156138 291089
11491 291089 -348255 123010 445085 41902 211025 183837 406313 -212546 27338 76401
11481 76401 142908 -42692 -152305 208589 85241 149919 262617 259410 -56622 -180292 62905
11469 189017 1639 246026 362465 170248 409279 209163 123810 89903 157774 334510
11459 334510 -52487 -173442 167305 83356 -165 32589 -234361 195212 82095 94429 78023
$$ packed form
11536B58245d7784c445j06494r5316d2227j49751I8964N8981a07553m4167k5185
11525a76905C3249h5782j89671h4457C84545d7934J7868a0882N140l4315j28748
11514a68805D26529I5180M8486o9024K55685B2068J42885C8360J50950H6287C707
11502G7484j3383a25377c7780I6782k2081j2580J04746a85433B49046r2908J34951
11491B91089c48255A23010L22075D1902J69123k7188K22476b12546B7338M9063
11481G6401O6507d2692j09613B08589H5241O4678J12698l207e6622j23670F2905
11469A89017A639K44387J16439A70248K39031k00116q5353l3907O7871J76736
11459C34510e2487j20955A67305H3356a65C2589b34361A95212H2095J2334j6406
$$ plain form
11448 78023 -171050 301516 17208 138946 -16114 255125 -122018 -142603 -67294 244270
11437 1997 -182491 200349 -171827 492971 23013 236093 -98172 -24430 -276937 -142035
11427 -142035 -19740 83271 -311308 483439 -145299 -86 -71616 105280 -146031 364006 -326461
11415 -215666 -113631 84171 459327 5799 -177635 -110468 220995 162465 257788 -180803 -67365
11403 257777 -221679 377646 -291718 26733 255239 15417 259606 235552 136959 62916
11392 49353 39341 192412 -79238 -179143 -172965 -16554 -44331 390680 -60880 -128067 -64993
11381 -64993 167288 -143431 -111548 -132700 -34240 286634 -119706 -207151 -227191 -7228 52504
11369 236654 -169592 32736 -185242 -149095 -195668 266517 -423238 -58362 121077 -37596
$$ packed form
11448G8023a71050C01516A7208J21738a6114B55125a22018k0585f7294B44270
11437A997a82491B00349a71827D92971B3013K13080i8172b4430k52507J34902
11427a42035a9740H3271c11308D83439a45299h6p1530A05280a46031C64006c26461
11415b15666J02035H4171L75156E799a77635O7167B20995n8530R5323a80803f7365
11403B57777b21679C77646b91718B6733K28506A5417K44189k4054r8593F2916
11392D9353j0012J53071g9238r9905O178a6554k7777C90680f0880o7187O3074
11381f4993A67288a43431L1883k1152c4240B86634a19706q7445k0040g228E2504
11369B36654a69592C2736a85242L6147m6573B66517d23238e8362A21077c7596
$$ plain form
11358 228955 9356 213072 151942 -140902 -24838 -71835 -302522 -258856 -59228 -134799 394672
11346 -349318 -30475 86694 201147 -388948 -17164 342466 -133422 -19847 283844 -227682
11335 771 -64885 -121861 137077 177031 138038 -77731 -61481 110742 5874 200965 299622 133087
11322 51538 -281877 -208280 -214082 18853 224322 -2843 13 -303576 253181 80277 -58612 -60276
11310 -60276 -106002 236212 96032 -50090 -20898 -10757 -14645 -303101 15035 -112500 -144743
11299 -144743 -267450 -125657 -415052 47353 -92351 -100183 -90297 232329 71733 -244047 -38119
11287 137810 150672 -261475 -636068 -461478 -14947 -18479 -364543 -242605 292975 -244011
11276 -69862 -184732 119683 -326837 -273211 117166 31194 -172272 -198487 2496 -269274 117812
$$ packed form
11358B28955I356K03716o1130a40902b4838m6997k30687M3666e9228p5571C94672
11346c49318c0475H6694J14453c88948a7164C42466a33422a9847B83844b27682
11335G71f4885n6976A37077L9954l8993g7731J6250A10742E874J95091R8657A33087
11322E1538b81877P3597n802A8853K05469b843A3c03576B53181H0277e8612j664
11310f0276m5726B36212I6032e0090b0898J0141l888k88456A5035a12500l2243
11299a44743j22707a25657k89395D7353i2351p832R886B32329G1733b44047c8119
11287A37810J2862b61475l74593J74590a4947l532l46064J21938B92975b44011
11276f9862j14870A19683c26837N3626A17166C1194a72272k6215B496b69274A17812
$$ plain form
11264 -35348 66884 135599 139744 -56863 -61622 -11686 145116 -325913 -158991 -253257 131743
11252 -27338 -70806 -113835 2354 -115850 -88554 -136186 -116753 -257599 -206969 -127983 129558
11240 228064 -166240 -174985 238053 -255726 6314 -221293 127748 -126214 -140892 -234302 265015
11228 139110 -174136 -35693 -103482 66017 -31463 23533 -112331 -40740 -292900 110931 27360
11216 -120535 -230034 110264 -116104 -117189 -105099 -129936 246779 174051 -55916 -161078 296731
11204 -285005 -153625 170572 118135 -110013 105256 -315328 -84211 -231047 99757 -132823
11193 -112091 -274982 -32179 -1376 -49409 173077 -396520 -48293 -17735 125043 -253753 -468367
11182 -468367 -102622 -239596 87930 -53800 -33030 -183511 -100592 140825 -56790 -38465 125561
$$ packed form
11264c5348F6884O8715M145e6863m759a1686A45116c25913a58991r4266A31743
11252b7338m3468m3029B354a15850K7296m7632J9433j40846N0630P8986A29558
11240B28064a66240q745B38053b55726F314b21293A27748a26214j4678r3410B65015
11228A39110a74136c5693o7789F6017c1463B3533a12331d0740k52160A10931B7360
11216a20535j09499A10264a16104j085J2090k4837B46779p2728e5916j05162B96731
11204b85005J31380A70572n2437a10013A05256c15328h4211j46836I9757a32823
11193a12091j62891c2179a376m8033A73077c96520d8293a7735A25043b53753k14614
11182d68367a02622j36974H7930e3800K0770j50481Q2919A40825e6790J8325A25561
$$ plain form
11170 66877 -149600 -68592 -16969 259229 115794 -181453 -496339 1164 -42911 -222238 -232318
11159 -232318 -222107 113463 80826 13478 -300772 32742 -130819 -372732 -46804 -123373 108105
11147 -186396 -104740 -32252 53565 94264 -42020 -291728 -92671 -130243 84050 42987 201089
11136 201089 -421501 -260770 -72649 96616 -268123 -96150 -331006 124974 74945 -154869
11125 -23244 108717 13104 -95253 -127339 -96700 -65668 -98498 182768 279629 431766 115707
11113 -213125 231877 59909 262104 -9538 15119 -9602 207488 88769 63159 175290 -17351
11101 -17726 -139331 302003 -375748 -81237 82003 222069 -462815 228037 220037 -16096 81379
11089 133748 48090 224650 -88382 189166 -146949 -43893 117935 110623 275588 -22548 545314
$$ packed form
11170F6877a49600f8592a6969B59229A15794a81453l14886A164d2911j79327j0080
11159b32318J0211A13463l2637A3478c00772C2742a30819k41913d6804p6569A08105
11147a86396Q1656c2252E3565M0699d2020k49708i2671l7572H4050m1063J58102
11136B01089d21501J60731g2649I6616b68123i6150k34856A24974n0029a54869
11125b3244A08717A3104i5253l2086L0639L1032l2830A82768R6861J52137A15707
11113b13125B31877E9909K02195i538A5119i602B07488H8769k5610J12131a7351
11101a7726j21605C02003c75748h1237H2003J40066d62815B28037q000a6096H1379
11089A33748D8090J76560h8382A89166a46949d3893A17935p312J64965b2548E45314
$$ plain form
11077 81097 227426 189248 42512 -49843 66311 453929 119043 -72305 66816 488053 202099
11065 238103 537300 339886 54828 314568 35641 536841 207151 387510 106683 315087
11055 315087 604278 345199 445102 193429 639112 785160 556655 821700 637421 820320
11045 820320 586005 638752 494357 598315 857519 491630 552739 500172 514885 391083
11035 391083 847601 564181 387719 556400 604122 702332 659483 764749 582642 578650
11025 578650 837228 989527 440360 615570 703230 401066 567083 772654 935606 366832
11014 570038 498721 593184 577307 507307 714741 308198 761938 353759 434741 638997
11004 638997 259075 900394 593795 497774 765042 669394 656280 605912 617239 755791
$$ packed form
11077H1097J46329l8178D2512d9843F6311L87618A19043g2305F6816M21237B02099
11065B38103K99197j97414E4828K59740C5641N01200B07151J80359A06683K08404
11055C15087K89191k59079R9903A93429M45683J46048k28505K65045j84279J82899
11045H20320k34315N2747j44395J03958K59204l65889O1109n2567J4713j23802
11035C91083M56518k83420j76462J68681M7722R8210m2849J05266j82107l992
11025E78650K58578J52299D40360J75210Q7660l02164J66017K05571J62952C66832
11014E70038p1317R4463j5877p0000K07434C08198M53740C53759Q0982K04256
11004F38997B59075O41319l06599r6021K67268r5648j3114n0368J1327J38552
$$ plain form
10994 755791 441624 688688 550436 879925 738453 853227 673860 574617 563059 606825
10984 606825 865216 544096 754247 842977 790068 873166 954076 785645 1443159 1313641
10974 1313641 1111743 1564866 1442407 1685338 2011874 2189404 2410017 2223353 2202860 2400978
10964 2400978 2229492 1887286 1792972 2059224 1902064 1527176 1500210 1133278 1356076 1541151
10954 1541151 1560738 1714132 1541498 1702604 1540571 1400372 1811396 1476637 1199290 732427
10944 732427 639292 874661 658426 38865 374977 355917 385804 -67350 161198 25543 212627
10933 212627 312964 138944 196456 20147 73967 86345 42560 69266 -178750 100400 -92075
10921 66810 53472 235825 142725 329218 -110783 -7499 8671 229722 27662 -102859 21626
$$ packed form
10994G55791l14167K47064j38252L29489j41472J14774j79367r9243j1558M3766
10984F06825K58391l21120K10151Q8730n2909Q3098Q0910j68431O57514j29518
10974A313641k01898M53123j22459K42931L26536J77530K20613j86664k0493J98118
10964B400978j71486l42206r4314K66252j57160l74888k6966l66932K22798J85075
10954A541151J9587J53394j72634J61106j62033j40199M11024l34759k77347m66863
10944G32427r3135K35369k16235C8865L36112j9060K9887f7350A61198B5543J87084
10933B12627J00337A38944N7512B0147N3820J2378D2560K6706a78750A00400i2075
10921F6810j3338J82353r3100J86493a10783g499H671K21051B7662a02859B1626
$$ plain form
10909 -190552 -113465 137622 -366456 58992 -97720 -112883 100338 173712 291157 106898
10898 141142 88954 -95950 61805 -105567 -28556 -26714 254714 -128166 48751 60445 199086
10887 199086 -65699 -115702 172845 -10748 9801 322319 -234756 29320 333394 -257035 -292372
10876 -292372 -257051 -9684 10518 110243 -39771 268481 -198088 127356 -14532 -147726 -137308
10865 -137308 525486 -20809 -179346 -26062 39134 -71402 -162942 -87986 243636 55977 -203569
10853 -180650 16989 -29442 -105495 182385 -85712 -95157 59453 -60237 -214498 -91758 68245
10841 -505199 -519659 -4102 -229146 -158352 -101897 -246935 177274 -51826 -44050 -17484 49611
10829 70175 -160395 -54093 -421255 -245176 -72820 -169362 -87818 -168492 -175247 -56303 -43237
$$ packed form
10909a90552P7087A37622c66456E8992i7720j5163A00338P3374J17445A06898
10898A41142n2188i5950F1805a05567b8556J842B54714a28166D8751J1694J38641
10887A99086f5699n0003A72845a0748I801L12518b34756B9320L04074b57035l5337
10876b92372L5321i684A0518R9725c9771B68481a98088A27356a4532j33194J0418
10865a37308E25486b0809j58537b6062C9134g1402r1540P4956B43636E5977b03569
10853a80650A6989b9442p6053A82385h5712r445E9453f0237j54261i1758F8245
10841e05199j4460d102k25044P0794N6455j45038A77274e1826P776a7484D9611
10829G0175a60395e4093l67162J76079g2820r6542Q1544q0674o755e6303J3066
$$ plain form
10818 -43237 -142945 -254162 26294 83496 168811 73804 178815 65331 -182887 -53910 -9769
10806 -27048 -158101 -99450 19012 -192804 -292096 182615 -270908 -126316 -128496 112860 149287
10795 149287 107975 -232466 -395814 97786 -239944 -205116 225299 -216775 69778 110386
10785 110386 -61404 -89009 -143690 26596 133494 -27060 -37728 -234523 -60374 -148347 146286
10773 -266142 -146970 -223840 -168001 -70972 -126669 97787 43563 -69258 58142 15066 -45434
10761 -342717 148865 -158555 -16770 37914 28624 -218800 -137576 -61635 243903 -344808 -53876
10749 -114595 -506638 -7609 -29233 -193939 -133445 -110241 -165829 49433 -139725 -73613 201955
10737 -208701 5838 58810 -76985 -239291 -283801 36332 44667 64986 -132590 -198959 26168
$$ packed form
10818d3237r9708j11217B6294N7202Q5315G3804J05011F5331a82887e3910i769
10806b7048j31053N8651A9012a92804r9292A82615b70908a26316k180A12860L6427
10795A49287m1312b32466j63348I7786b39944L4828B25299b16775F9778M0608
10785A10386f1404k7605n4681B6596J06898b7060j0668j96795f0374q7973A46286
10773b66142J19172p6870N5839g0972n5697I7787D3563f9258E8142A5066d5434
10761c42717A48865a58555a6770C7914r290b18800Q1224f1635B43903c44808e3876
10749a14595l92043g609k1624j64706O0494K3204n5588D9433a39725O6112B01955
10737b08701E838N2972g6985j62306m4510C6332Q335K0319a32590o6369B6168
$$ plain form
10725 46935 53305 -204374 -9631 82008 -152119 -6312 -27516 -147446 -165445 -4437 195596 -123336
10712 52389 210701 -208093 2859 113867 9875 -8282 106111 -109485 -210001 -193646 293712
10700 142981 -276911 -80451 -183142 126304 -116725 -328077 -1364 141045 -107629 -312163
10690 -312163 -207853 148363 -125191 -129995 75562 -183203 33501 -195913 103350 -159548
10679 25217 -504751 -383250 -61227 -50906 12321 -483847 139422 -143490 -295318 -96400
10668 110261 112198 -238989 -153057 -94282 -186045 64444 -117692 164927 -277646 -100842 -232752
10657 -232752 -245582 -37167 13188 -306206 -106063 -56222 135267 -38702 166885 86341 -80787
10645 11167 -1447 -25485 -410955 -17202 51450 24008 156840 -249551 -134411 34777 -254339
$$ packed form
10725D6935O370b04374i631H2008a52119f312k1204j19930j7999d437A95596a23336
10712E2389J58312b08093B859J11008I875h282A06111a09485j00516J6355B93712
10700A42981b76911h0451j02691A26304a16725k11352a364A41045a07629k04534
10690c12163J04310A48363a25191m804G5562a83203C3501a95913A03350a59548
10679B5217e04751J21501f1227J0321A2321d83847A39422a43490j51828i6400
10668A10261J937b38989Q5932N8775r1763F4444a17692A64927b77646a00842j31910
10657b32752j2830c7167A3188c06206a06063M9841A35267c8702A66885q0544h0787
10645A1167a447k4038l85470a7202E1450B4008J32832b49551J15140C4777b54339
$$ plain form
10633 232326 -120009 66925 -126944 -12401 111730 -41733 -157384 -161434 -473911 102070
10622 -219278 -170223 -19274 350913 64551 -142684 -297216 75113 257080 -59509 7862 -222073
10610 -84224 -207354 -196415 -89279 -177074 -40513 233823 -33855 28674 -83565 -23788 93671
10598 -6170 -40282 28442 203620 -223891 -65793 -118359 -135326 53703 -166392 -3345 -235097
10587 -235097 -100897 -319352 -180335 -97850 -311019 236516 87961 148938 20981 76891
10577 76891 -248760 -84021 -52765 -98945 -86008 61781 -64586 -66291 85058 -61955 -136728 189771
10564 75116 -122037 16941 -433975 45826 -13241 76984 6805 -114735 -269594 -119146 -388980
10553 -388980 -286329 246541 -47437 49012 203637 84123 59663 100324 -271963 -118483
$$ packed form
10633B32326a20009F6925a26944a2401A11730d1733j15651m050l12477A02070
10622b19278M9055a9274C50913F4551a42684j54532G5113J81967e9509G862b22073
10610h4224j23130J0939h9279q7795d0513B33823c3855B8674h3565b3788I3671
10598f170l4112B8442J75178b23891f5793n2566j6967E3703a66392c345k31752
10587b35097a00897k18455J39017Q2485k13169B36516H7961O0977B0981N5910
10577G6891b48760h4021L1256m6180J2937F1781f4586j705H5058f1955p4773A89771
10564G5116a22037A6941d33975D5826a3241G6984F805a14735j54859a19146k69834
10553c88980J02651B46541d7437D9012J54625H4123k4460M0661b71963a18483
$$ plain form
10542 -208556 -79965 -59758 -126869 92264 341184 -278460 -257636 -185966 53596 227996 416801
10531 416801 -20962 461532 -236400 127137 -87463 -342117 -186 -374204 -93883 -32154 -168136
10520 -168136 -74905 -328241 244414 40988 107369 -92533 -181396 265828 -6820 -44492 -151111
10509 -151111 -110659 208822 -433453 -19086 -75992 -16540 -219033 4359 -117928 -26023 -259822
10498 -259822 -293879 -25833 50372 15651 48490 -106625 58346 210823 355336 -116285 -169111
10487 -169111 173449 72237 366025 41634 -214997 139621 -22396 -152191 -191189 101316
10476 585837 476382 341283 853541 389222 394583 -18908 199411 76251 325173 -61048
10465 -74191 146519 -134729 -26077 76077 69650 -65314 -65741 34087 -154119 -151717 66097 -83552
$$ packed form
10542b08556g9965K0207o7111I2264K48920b78460K0824P1670E3596J74400J88805
10531D16801b0962D61532b36400A27137h7463k54654a86l74018i3883c2154j35982
10520a68136g4905k53336B44414D0988O6381i2533q8863B65828f820l7672j06619
10509a51111M0452B08822d33453a9086n6906a6540k02493D359a17928b6023k33799
10498b59822l4057b5833E0372A5651L2839a06625E8346J52477J44513a16285n2826
10487a69111A73449G2237K93788D1634b14997A39621b2396j29795l8998A01316
10476E85837j09455j35099N12258C89222N361a8908A99411G6251K48922f1048
10465g4191A46519a34729b6077G6077o427f5314m27C4087a54119K402F6097h3552
$$ plain form
10452 -29720 -220101 125741 -273558 241103 -509682 -18026 86299 -184925 188676 41623
10441 96547 18447 -153984 -174073 -289431 51107 -158495 -293754 119377 142223 46233 228604
10430 228604 230294 -103880 -7331 -46442 21627 -101095 -163710 -315274 -113713 -164995 -247577
10419 -247577 86836 75604 -207137 -62750 -20789 62827 207132 -108139 -91370 65330 -5051
10407 -98370 58592 -86696 -142613 273165 -83312 82437 -206563 111994 -18490 97641 -153439
10395 8969 42511 -156089 -15529 -219214 -24306 13314 209803 -56281 45720 -284640 -188343
10384 -188343 -230783 20854 22797 184967 -536 329928 61823 436119 150621 194042 256381
10373 256381 351275 252075 -25218 -117075 350333 105122 140268 364370 605555 239845
$$ packed form
10452b9720j90381A25741b73558B41103e09682a8026H6299a84925A88676D1623
10441I6547A8447a53984k0089j15358E1107a58495j35259A19377K2846D6233J82371
10430B28604J690a03880g331l9111B1627a01095o2615j51564a13713n1282q2582
10419b47577H6836j1232b07137f2750b0789F2827J44305a08139J6769F5330e051
10407i8370E8592h6696n5917B73165h3312H2437b06563A11994a8490I7641a53439
10395H969L3542a56089a5529k03685b4306A3314J96489e6281D5720b84640R6297
10384a88343m2440B0854J943J62170e36C29928F1823L74296A50621M3421O2339
10373B56381R4894r9200b5218r1857C50333A05122L5146K24102K41185B39845
$$ plain form
10362 451042 200438 232337 228679 -112177 102349 234402 343348 193762 114845 16736
10351 -225356 101547 290065 226261 265895 316159 -34068 -28695 20335 495387 320344 317441
10340 317441 204436 500457 66839 233270 -88629 287995 469842 124942 320949 -17121
10329 276251 86451 -26454 352229 -66900 193467 268791 99572 -123219 317265 287967 417189
10318 417189 97727 60889 -160125 -76016 104967 218758 -98056 130893 -87403 -5540 -343113
10307 -343113 129442 169926 140581 -90789 -31417 -202651 -30268 -107016 -284331 92671 -207661
10295 35561 15690 52066 509484 -78408 169250 -113502 -119358 20173 94502 -309094 -161072
10284 -161072 16704 100311 -281330 104063 185905 -37854 -71749 62460 -120905 -162964 128268
$$ packed form
10362D51042B00438L1899l658a12177A02349J32053J08946j49586p8917A6736
10351b25356A01547J88518o3804L9634N0264c4068N373B0335M75052j75043k903
10340C17441j13005K96021F6839J66431h8629B87995J81847A24942J96007a7121
10329B76251H6451b6454C52229f6900A93467P5324I9572a23219C17265k9298J29222
10318D17189I7727l6838a60125g6016A04967J13791i8056A30893h7403e540l37573
10307c43113A29442M0484k9345i0789c1417j71234c0268p6748j77315I2671b07661
10295C5561A5690L6376M57418g8408A69250a13502n856B0173P4329c09094J48022
10284a61072A6704Q3607b81330A04063Q1842c7854l3895F2460a20905m2059A28268
$$ plain form
10272 127962 -145628 -171664 48316 -564938 73205 123228 -18851 52932 -178487 163802 -424783
10260 180925 -37173 71470 29861 -139574 -200890 -108908 63043 -125422 93023 22664 237877
10249 237877 124852 -71640 120511 -143892 -202382 49425 -48657 128629 -380717 168465
10238 258746 219314 116815 146239 -83766 -229793 144141 -133524 -217547 -317115 167185
10227 -277378 -192563 -344173 5584 133718 -182158 -217021 65881 -124509 -54782 139804 -351727
10215 87763 66777 178300 -257314 32492 -62820 -45376 -288063 -260895 -64674 177132 -299977
10203 97440 -179129 101127 240945 -149817 -128742 -245334 82045 -129868 -32927 -1011 101893
10191 142349 125041 -222054 -53344 -79151 -267031 -123089 346875 -103607 166901 253224
$$ packed form
10272A27962a45628k6036D8316e64938G3205N0023a8851E2932a78487A63802d24783
10260A80925c7173G1470B9861a39574o1316R1982F3043a25422I3023B2664K15213
10249B37877j13025g1640A20511a43892n8490D9425d8657A28629c80717A68465
10238B58746l9432j02499K9424h3766j46027A44141a33524q4023r9568A67185
10227b77378Q4815j51610E584J28134a82158l4863F5881a24509e4782A39804c51727
10215H7763k0986J11523b57314C2492f2820J7444k42687K7168f4674A77132b99977
10203I7440a79129A01127J39818a49817K1075j16592H2045a29868c2927a011A01893
10191A42349j7308b22054e3344k5807j87880a23089C46875a03607A66901Q6323
$$ plain form
10181 253224 145028 307920 151129 -41356 -276407 -42197 -144743 -385216 -117036 -257633
10171 -257633 45575 -130923 -89741 126248 -43855 -132638 156290 -231443 -295877 -108838
10160 -275000 -31952 86773 -50904 68961 -408126 45771 -121246 -49834 -88071 179101 -59478
10148 -250124 140056 299645 194911 -63740 87609 -40257 -53719 182178 20409 -163554
10137 168588 30665 -53819 -2610 -226983 42694 -73522 28302 180139 -105624 -57431 -283291
10126 -283291 -74870 67061 -97851 214064 -285566 -245195 29647 -141634 250924 -61362 -329994
10115 -329994 -21422 -270185 163298 -288721 -267154 37408 50095 56698 14033 -7128 -268766
10104 -268766 13396 -182293 -344566 47444 -81527 -116095 21405 -290946 -147599 167037
$$ packed form
10181B53224j08196J62892A51129d1356k35051d2197j02546k40473a17036j40597
10171b57633D5575a30923M1182A26248d3855q8783A56290b31443o4434a08838
10160b75000c1952H6773e0904F8961d08126D5771a21246d9834l8237A79101e9478
10148b50124A40056J59589j04734f3740H7609d0257j3462A82178B0409a63554
10137A68588C0665e3819b610k24373D2694g3522B8302J51837a05624M8193k25860
10126b83291g4870F7061i7851B14064b85566M0371B9647a41634B50924f1362k68632
10115c29994b1422k48763A63298b88721K1567C7408J2687O603A4033g128k61638
10104b68766A3396a82293j62273D7444h1527l4568B1405b90946J43347A67037
$$ plain form
10093 -21135 130194 -525622 137491 -106180 88121 -102688 -193024 -122008 -194677 78922 -77712
10081 -144315 133764 -129035 -420705 181751 -96514 -60822 166314 -508497 -328863 103529
10070 -49580 -109493 -14275 167567 51819 164488 -188248 -442603 -143280 -89627 126380
10059 -67569 -215400 93733 6283 -112473 78418 -292371 100637 -93125 156841 -381705 -63065
10047 -319117 188498 -203361 58001 72719 -320113 -61990 -118315 -152413 -230482 148312 -453814
10035 224163 -45451 325419 64837 -126232 -82368 -27648 242979 -117605 195828 107622
10025 107622 96575 29310 -325595 413248 183368 -110247 9886 -56036 209959 36887 -268514
10013 -37511 -114996 -64780 -58603 154354 113885 -16172 -114772 127713 -259362 -16964 -418366
$$ packed form
10093b1135A30194e25622A37491a06180H8121a02688r0336P1016p2669G8922g7712
10081a44315A33764a29035k91670A81751i6514L5692A66314e08497J79634A03529
10070d9580n9913a4275A67567E1819J12669a88248k54355a43280N3653A26380
10059f7569j47831I3733F283a12473G8418b92371A00637i3125A56841c81705f3065
10047c19117A88498b03361E8001J4718c20113f1990n6325l4098p8069A48312d53814
10035B24163d5451C25419F4837a26232M3864b7648B42979a17605A95828q8206
10025A07622j1047B9310c25595D13248A83368a10247I886e6036B09959C6887b68514
10013c7511p7485N0216O177A54354m0469a6172r8600A27713b59362a6964m01402
$$ plain form
10002 -418366 -107914 127550 11345 -165123 -52716 -59879 -108195 94986 -156986 286978 -264491
9990 34493 -157452 -14093 49623 -147646 123698 260623 58775 -1686 -278692 25078 60184
9979 60184 -184114 -163631 -164201 -122501 -22775 -181472 173787 -97484 -31014 53303 -185199
9967 -74753 -125475 -233811 -56853 -7717 -135326 -172846 156498 -171264 -62732 17152 -145448
9955 -67889 336666 -85507 123860 246492 -89238 7367 -76133 -51916 -151053 59426 -5463 -212135
9943 -212135 -163963 122975 95746 200 102612 -52132 -173083 -63744 -335424 -76909 -208207
9932 -208207 -73064 -143838 55421 -17231 -519640 -94200 -221951 -148939 -180799 97230 -50540
9920 -223036 38350 -510339 -266241 13836 16527 56004 82026 -125915 90973 -47578 393831
$$ packed form
10002d18366a07914A27550A1345a65123e2716p163m8316I4986a56986B86978b64491
9990C4493a57452a4093D9623a47646A23698J36925E8775a686k77006B5078L5106
9979F0184a84114K0483n70M1700b2775j58697A73787i7484c1014E3303a85199
9967g4753n0722j08336e6853g717j27609l7520A56498a71264f2732A7152a45448
9955f7889C36666h5507A23860J22632h9238G367g6133K4217r9137E9426e463k06672
9943b12135M8172A22975k7229B00J02412e2132j20951f3744k71680g6909j31298
9932b08207g3064p0774E5421a7231n02409i4200j27751P3012l1860I7230e0540
9920b23036C8350e10339K44098A3836K691L9477K6022a25915I0973d7578C93831
$$ plain form
9908 -66915 -297843 27761 -245894 -5185 287300 -19469 28431 -215840 -132785 -74888 -176165
9897 -176165 -101047 -107326 5363 -268007 -103922 -144225 -86804 75487 -120432 -297004 -99761
9885 -75110 105196 -465576 -363975 78482 -91439 -252430 -228742 -197261 -47236 -78500 -201838
9874 -201838 98894 41724 -413763 -93306 -89453 25463 145384 -95095 -3659 423568 139978
9862 21247 -59013 190842 -26748 -71611 87265 -119926 -91635 -364436 -55382 79791 -27667
9850 -36117 72738 -317175 -188039 159796 174220 -194812 86785 279027 -350351 -28574 -66623
9839 -66623 37644 -302013 75794 79140 -271703 -182061 -2487 -29477 -217910 -113371 56955
9827 -65011 46727 -50055 -273739 -139544 -105880 -184911 -159062 -9555 -190922 -24070 -107324
$$ packed form
9908f6915k30928B7761b45894e185B87300a9469B8431b15840Q3055N7897j01277
9897a76165P5118o279E363b68007a03922m0303N7421G5487a20432j76572i9761
9885g5110A05196d65576J01601G8482i1439j60991K3688L1481d7236l1264j23338
9874b01838I8894D1724d13763i3306L853B5463J19921i5095c659D23568A39978
9862B1247e9013A90842b6748m4863H7265a19926K8291k72801e5382G9791b7667
9850c6117G2738c17175J29136A59796J4424a94812H6785J92242c50351b8574l8049
9839f6623C7644c02013G5794L346b71703Q9642b487k6990j88433J04539E6955
9827f5011D6727e0055k23684J34195L3664p9031K5849i555j81367b4070q3254
$$ plain form
9816 -107324 29568 219032 -222826 -466157 -60331 -164687 -93554 -271702 -268391 -98244 -168037
9805 -168037 -14270 -28768 -31968 -315828 21129 9130 50933 -379028 177337 -49454 -413218
9794 -413218 -85931 142663 133863 -61242 -47014 -191920 -58190 -170018 -133333 -14196 351015
9782 183876 119349 23711 -578831 13434 118793 -40049 361684 -189931 23002 -129290 190543
9770 -136751 -262221 -166787 -140587 -80387 -7786 -22730 -111186 263351 75779 -124744 -296249
9759 -296249 -121033 -297216 148574 -249939 406067 -26783 20441 266589 -212710 -9720
9748 128984 -193838 -40910 -51626 -1469 131690 131049 1560 -136547 -24416 46821 -325476 -149444
9735 5347 -172654 -425721 -252787 3640 -418947 -204714 -173617 -146511 -254587 -8563 -54992
$$ packed form
9816a07324B9568J89464b22826k43331f0331j04356P1133j78148L311i8244o9793
9805a68037a4270j4498l200k83860B1129I130M1803c79028A77337d9454l63764
9794d13218h5931A42663q800f1242J4228j44906e8190j11828L6685a4196C51015
9782A83876o4527B3711e78831A3434J05359d0049C61684a89931B3002a29290A90543
9770a36751j25470R5434K6200O0200g786j4944q8456B63351G5779a24744j71505
9759b96249a21033j76183A48574b49939D06067b6783B0441K46148b12710i720
9748A28984a93838d0910j0716a469A31690o41A560a36547b4416D6821c25476a49444
9735E347a72654k53067J72934C640d18947b04714L1097K7106j08076h563m6429
$$ plain form
9724 -54992 27424 10430 -77433 42286 -433448 59077 -274956 96574 -439992 -183475 -185440
9713 -185440 383597 -216513 -70143 -144929 -112665 -242685 104707 130954 58359 -353107 -12337
9701 -68539 -301505 155997 -91320 -29964 -255531 130337 -140896 -131069 91684 100044 133094
9690 133094 -213573 5432 -297859 128319 -22469 82970 -3654 -106789 -240985 238672 446086
9679 446086 -308885 -73209 -67759 76592 -81210 -70683 188258 52900 25156 -8342 68894 -154955
9666 -85346 -322726 -246011 -139715 -239340 -146645 73290 -409784 -99379 -26565 -259675 -210677
9655 -210677 22707 -63747 9081 -452678 -237508 -98367 -36804 -320973 410981 46360 -201747
9643 -60916 -178697 28281 -50747 -52760 3598 147384 -31796 75322 75556 94722 176332 -85276
$$ packed form
9724e4992B7424A0430g7433D2286d33448E9077b74956I6574d39992a83475j965
9713a85440C83597b16513g0143p4786L2264j30020A04707K6247E8359c53107a2337
9701f8539k32966A55997i1320b9964k25567A30337a40896R827I1684Q360L3050
9690A33094b13573E432b97859A28319b2469H2970c654j03135j34196B38672K07414
9679D46086c08885g3209N450G6592h1210J0527A88258E2900B5156h342F8894a54955
9666h5346k37380P6715J06296r9625R2695G3290d09784i9379b6565k33110M8998
9655b10677B2707f3747I081d52678K15170i8367c6804k84169D10981D6360b01747
9643f0916j17781B8281e0747k013C598J43786c1796G5322K34J9166Q1610h5276
$$ plain form
9630 -152718 -45085 319164 -451164 53176 -149134 -127713 -120092 -316091 -128465 -291131 -409619
9619 -409619 139127 135164 20961 -165661 27858 -282638 -58476 -246254 29027 -84634 110995
9607 -105908 -14770 -139337 407498 -123298 -286888 -14329 -177468 52132 219193 94322
9596 164147 -125730 -18915 -306010 -318568 -140904 -45066 -173168 -139158 -50384 -40292 -335265
9585 -335265 -20164 -40866 -332392 169430 43499 32065 126504 -73540 -281561 -348698 -331779
9574 -331779 -45724 221316 -223144 1697 -66133 -266908 43321 -171608 -172123 195676 -115514
9562 11627 -67478 29377 -210329 -119464 57450 -88673 -177185 -152322 -220986 -51499 55812 -4925
9549 79506 -38349 -34582 3147 -201281 -86624 58861 -175325 101191 -144106 90083 -219653
$$ packed form
9630a52718d5085C19164d51164E3176a49134K1421P621j95999a28465j62666j18488
9619d09619A39127l963B0961a65661B7858b82638e8476j87778B9027h4634A10995
9607a05908a4770j24567D07498a23298j63590a4329j63139E2132J67061I4322
9596A64147a25730a8915k87095j2558a40904d5066j28102L4010e0384J0092k94973
9585c35265b0164k0702k91526A69430D3499j1434R4439g3540k08021o7137J6919
9574c31779d5724B21316b23144A697f6133k00775D3321a71608n15A95676a15514
9562A1627f7478B9377b10329R0865E7450h8673q8512K4863o8664e1499E5812d925
9549G9506c8349L767C147b01281h6624E8861a75325A01191a44106I0083b19653
$$ plain form
9537 79992 -3629 -252799 -322187 -256349 115490 88735 16617 -179088 63471 110860 -248995
9525 -24244 209662 -239805 28865 -13288 -312742 -44923 -297670 68217 179207 -300908 -84731
9513 -94608 -322218 -5063 -159989 -210701 187247 -122720 -135846 -64402 -30428 -40490 -50399
9502 -50399 29229 -12826 91741 -233545 -279509 64534 -416304 -88549 -194437 -134413 20459
9490 -60902 51593 127992 -113655 -150399 -207360 -19525 -138653 -79261 -262446 -63035 203701
9478 -77844 -100736 259493 131573 -22846 -308711 3047 -154025 -133453 348109 -333037 -158487
9466 -68864 -18426 -16866 -304936 201000 84719 -59505 -232391 -121028 130268 -3897 -249178
9455 -249178 141458 -118166 167258 -154130 82330 -181414 -136204 303933 -940 213503 37651
$$ packed form
9537G9992c629k49170o9388O5838A15490k6755A6617a79088F3471M7389b48995
9525b4244B09662b39805B8865a3288k99454d4923k52747F8217J10990c00908h4731
9513i4608k27610e063j54926n0712A87247a22720j3126f4402c0428j0062r909
9502e0399B9229a2826I1741b33545m5964F4534d16304h8549j05888O0024B0459
9490f0902E1593P6399a13655l6744n6961a9525j19128N9392j83185f3035B03701
9478g7844k2892B59493j27920b2846k85865C047a54025K0572C48109c33037a58487
9466f8864a8426J560k88070B01000H4719e9505j72886J11363A30268c897k45281
9455b49178A41458a18166A67258a54130H2330a81414M5210C03933i40B13503C7651
$$ plain form
9443 -123061 -419741 -218180 -250038 -264855 -165284 -523 8791 -218789 30241 -99014 84650 -320176
9430 188474 -91588 317832 11267 213300 -230785 -186339 -29136 -248197 -212387 -144409 -74468
9419 -74468 -97456 15898 -186382 -64955 -331520 -91418 -161803 107592 -43377 -233576 -96321
9407 -146176 -117871 55823 90188 20345 20369 -23075 -436405 -234371 -54828 73810 83500 -607927
9394 25991 -176768 -61929 161710 -196555 -4902 -25046 -76671 -338502 205924 87106 -183222
9382 -196111 88189 205077 -132591 127566 -308190 88957 -342969 -107315 -19093 -28717 -183356
9371 -183356 -401808 -140490 -239090 125306 25221 -314323 22327 -158555 -70128 -85020 -83863
9360 -83863 -38735 -270510 49491 52559 61460 150007 -56321 40397 -161149 -318533 22399 -167262
$$ packed form
9443a23061k96680K01561l1858j4817R9571e23H791b18789C0241i9014H4650c20176
9430A88474i1588C17832A1267K02033b30785M4446b9136k19061L5810O7978O9941
9419g4468k2988A5898a86382f4955k66565i1418p0385A07592d3377j90199i6321
9407a46176K8305E5823L4365B0345K4b3075m13330K02034e4828G3810R690f07927
9394B5991a76768f1929A61710a96555d902k0144n1625k61831B05924H7106a83222
9382a96111H8189J16888a32591A27566c08190H8957c42969a07315a9093r624j54639
9371a83356k18452a40490r8600A25306B5221c14323B2327a58555g0128j4892J157
9360h3863c8735k31775D9491L068Q901Q8547e6321D0397a61149j57384B2399a67262
$$ plain form
9347 103781 -277769 35214 -326638 -41204 -325516 -356030 62052 -272648 84458 5462 266515
9336 266515 -203906 145371 -195616 281287 -175674 -178796 -33954 -66845 35927 271516 -54194
9324 -15261 -102843 49604 215085 118046 -174160 243063 -111260 -42095 88745 134874 -136051
9312 -66104 -36246 61479 -72390 245474 -292493 270107 -343511 52209 -119212 -47408 -207851
9301 -207851 -35312 -74572 198261 -418283 -139885 -129637 166297 -147364 -98939 -12032 201533
9289 -117654 -121081 -167842 -10069 133455 -220587 41054 -27294 134732 -154974 29369 -257290
9277 -337483 -142252 -168456 197913 -237257 -97505 294791 -434830 -257454 174361 -72507
9266 -75288 -14851 -115553 -89422 -35793 174883 -193130 -291430 37436 895 110974 265584
$$ packed form
9347A03781b77769C5214c26638d1204k84312l0514F2052b72648H4458E462K61053
9336B66515b03906A45371a95616B81287a75674l122c3954l2891C5927K35589e4194
9324a5261q7582D9604J65481r7039a74160B43063a11260d2095H8745M6129a36051
9312f6104K9858F1479g2390B45474b92493B70107c43511E2209a19212d7408j60443
9301b07851c5312l9260A98261d18283a39885J0248A66297a47364M8425a2032B01533
9289a17654l427m6761a0069A33455b20587D1054b7294A34732a54974B9369b57290
9277c37483a42252k6204A97913b37257i7505B94791d34830J77376A74361g2507
9266g5288a4851j00702K6131c5793A74883a93130r8300C7436H95J10079J54610
$$ plain form
9255 265584 -125888 167181 -67461 -271703 138545 103863 -108407 178602 -304156 -136005
9244 -41593 -314224 -143970 -326431 -24416 -144141 -152544 43970 -124449 -24153 -127355 -36066
9232 -174016 -184763 206165 -7170 65435 -40288 -267308 -127367 -180489 327166 -167389 -217597
9221 -217597 -180383 90693 -8066 103533 -50766 -248551 30591 -101592 -140264 -28680 72929
9209 -388173 56224 -273570 79725 -168077 -304643 -199168 42444 -257741 59865 87892 -88185
9197 -203013 129870 -120548 -34460 -359552 19445 1996 -259763 -143512 61023 -36628 -94343
9186 -94343 -55828 -85965 102388 -258332 42389 129804 -50940 -201994 31838 -23141 56934
9174 -208880 -323954 32816 18730 103572 141915 180971 71054 312411 -529053 -28480 -160100
$$ packed form
9255B65584a25888A67181f7461k04242A38545l4682a08407A78602c04156a36005
9244d1593k72631a43970j82461b4416j19725q403D3970a24449b4153j03202c6066
9232a74016j0747B06165g170F5435d0288k27020a27367n3122C27166a67389n0208
9221b17597L7214I0693h066A03533e0766j97785C0591a01592l8672b8680G2929
9209c88173E6224b73570G9725a68077j36566J05475D2444b57741E9865K8027h8185
9197b03013A29870a20548c4460l25092A9445A996b59763J16251F1023c6628n7715
9186i4343L8515l0137A02388b58332D2389Q7415e0940j51054C1838b3141E6934
9174b08880j15074C2816j4086Q4842L8343L9056G1054K41357e29053b8480j31620
$$ plain form
9163 -160100 -20526 -92710 -35437 -227036 18691 -138500 -46372 -63771 -220359 -78651 -195886
9152 -195886 101632 -152752 183954 -22079 -207972 -126473 -101032 -112611 17297 244951 -134836
9140 24852 -113871 -76884 39344 211858 43606 164094 -185054 118331 43358 -229034 -17322
9128 -204657 -117316 -175457 -147342 -163737 -267240 -76751 -98504 -323657 -160626 193021 85693
9116 157460 41550 112457 147569 -285128 -134327 147899 -340499 300213 -273226 -86625
9105 26753 -71933 -217371 -326252 77146 -1275 181380 -269038 25181 178360 -13139 83996
9093 58430 -231488 -74922 172270 -162864 12494 14595 -63095 -146083 92873 42745 66746
9082 66746 -89886 -169563 -169307 -43350 -144435 226176 -170150 -151991 -177106 -23628 -112699 -176904
$$ packed form
9163a60100b0526p2184c5437j91599A8691a38500d6372j7399j56588g8651j17235
9152a95886A01632a52752A83954b2079j85893Q1499K5441j1579A7297K27654a34836
9140B4852a13871L6987C9344J72514D3606J20488a85054A18331D3358b29034a7322
9128b04657Q7341n8141K8115j6395j03503g6751k1753k25153a60626A93021H5693
9116A57460D1550P0907L5112b85128a34327A47899c40499C00213b73226h6625
9105B6753g1933j45438j08881G7146a275A81380b69038B5181J53179a3139H3996
9093E8430b31488g4922A72270a62864A2494K101f3095q2988I2873D2745K4001
9082F6746h9886p9677K56d3350j01085B26176a70150J8159k5115b3628q9071o4205
$$ plain form
9070 -176904 -400450 59945 -472220 -86700 -469006 -51834 231582 -945 190916 -278950 -281289
9059 -281289 59657 251192 -131128 43018 -96917 -237927 -1466 -31674 -293873 -62328 -391331
9048 -391331 236238 -169279 135222 184999 -279339 24968 68627 -42377 -232129 -19939 -59015
9037 -59015 -300346 -231106 -32941 94314 209590 -237330 -104584 -10677 99124 -231162 -145078
9026 -145078 335640 -22375 48337 -95714 -82974 82571 85461 20552 -98560 -411689 -231739
9015 -231739 26567 173006 144163 -12546 -10231 -173872 -107772 -241428 -202037 -13194 23190
9003 -142797 -326283 108076 -24303 -155911 -191994 -183833 -183769 -6898 -131098 -394555 -69082 -10375
8990 15588 187107 -141781 199282 230846 -238621 -154343 -187681 47748 62680 15017 80699
$$ packed form
9070a76904k23546E9945d72220h6700l82306e1834B31582i45A90916b78950k339
9059b81289E9657J91535a31128D3018i6917j41010a466l0208k62199f2328l29003
9048c91331B36238a69279A35222M9777b79339B4968M3659d2377j89752a9939l9076
9037e9015k41331O9240c2941I4314J15276b37330a04584a0677I9124b31162Q6084
9026a45078C35640b2375D8337i5714J2740H2571K890B0552i8560l13129J79950
9015b31739B6567J46439k8843a2546K315j63641O6100j33656L9391a3194B3190
9003a42797j83486A08076b4303j31608l6083Q161O4f898j24200k63457f9082a0375
8990A5588J71519a41781A99282L1564b38621Q4278l3338D7748J4932A5017O5682
$$ plain form
8979 80699 -49229 -17308 -201617 -63538 105898 82767 -116976 228325 -156867 -144799 -7978
8967 92820 -180304 -1041 261021 -260183 -79601 -191096 -18982 -48727 104087 -139363 -255623
8956 -255623 222137 -345019 -239714 5832 -279842 -39671 133930 -54288 194193 -236823
8945 -187622 -80007 -140794 1978 222283 -248398 196030 -231075 346737 -246666 -232039 -25278
8933 -353480 178584 335242 212312 -65994 -196336 328753 53125 -334571 163385 285178
8923 285178 228034 629479 1775426 4152840 12001784 7425462 2999889 1836195 959280
8914 959280 715296 511039 452163 172048 147276 190668 12463 45459 72684 227600 126074
8903 126074 -286225 -17980 152286 179687 107621 -319389 -143340 236820 10874 58175 286331
$$ packed form
8979H0699d9229a7308j84309f3538A05898k3131a16976B28325a56867J2068g978
8967I2820a80304a041B61021b60183g9601j11495a8982k9745A04087a39363j16260
8956b55623B22137c45019J05305E832b79842c9671A33930e4288A94193b36823
8945a87622h0007o0787A978K20305b48398A96030b31075C46737b46666J4627b5278
8933c53480A78584J56658j22930f5994j30342C28753E3125c34571A63385J21793
8923B85178n7144M01445J145947K377414P848944m576322B999889j163694q76915
8914I59280k43984k04257n8876A72048k4772M3392A2463L2996K7225J54916j01526
8903A26074b86225a7980A52286K7401p2066c19389a43340B36820A0874M7301K28156
$$ plain form
8892 286331 135986 -173832 185982 -3453 -155270 -217189 -485880 -78902 -104618 -337841 131914
8880 -253641 -139542 186869 -123448 114132 85235 147248 -253759 -85484 -144513 408597
8869 -372780 -199279 -121147 -38356 109674 -24802 -55038 -203482 -164610 49916 -78755 126685
8857 31421 -128206 235391 -395614 62716 -53712 -118280 -57293 -97727 -69618 -121096 -216761
$$ packed form
8892B86331A35986a73832A85982c453j51817o1919k68691g8902k5716k33223A31914
8880b53641J14099A86869a23448A14132k8897O2013b53759h5484n9029D08597
8869c72780J73501P8132c8356A09674b4802l0236j48444L8872D9916g8755A26685
8857C1421a28206B35391c95614F2716e3712o4568e7293m0434K8109n1478r5665
$$ [...]
##END NTUPLES=NMR SPECTRUM
##END=
