
##TITLE=AC1352_CHIAH12170_6647970_0TLZOeHOTL
##JCAMPDX= 6.0         $$ Bruker NMR JCAMP-DX V2.0
##DATA TYPE= NMR SPECTRUM
##DATA CLASS= NTUPLES
##ORIGIN= BRUKER
##OWNER= Administrator
$$ 1.72 TOPSPIN		Version 2.1
$$ 2012-08-10 22:39:10.921 -0500  Administrator@TOPSPIN
$$ Compression mode = diff/dup
##.OBSERVE FREQUENCY= 400.02188249412
##.OBSERVE NUCLEUS= ^1H
##.ACQUISITION MODE= SIMULTANEOUS (DQD)
##.ACQUISITION SCHEME= undefined
##.AVERAGES= 64
##.DIGITISER RES= 22
##SPECTROMETER/DATA SYSTEM= spect
##.PULSE SEQUENCE= noesygpps1d.comp
##.SOLVENT NAME= COFFEE_meoh
##.SHIFT REFERENCE= INTERNAL, COFFEE_meoh, 1, 14.96258
##AUDIT TRAIL= $$ (NUMBER, WHEN, WHO, WHERE, PROCESS, VERSION, WHAT)
$$ ##TITLE= Audit trail, TOPSPIN		Version 2.1
$$ ##JCAMPDX= 5.01
$$ ##ORIGIN= Bruker BioSpin GmbH
$$ ##OWNER= Administrator
$$ $$ C:\Bruker\TOPSPIN/data/COFFEE/nmr/AC1352_CHIAH12170_6647970_0TLZOeHOTL/12/pdata/1/auditp.txt
$$ ##AUDIT TRAIL=  $$ (NUMBER, WHEN, WHO, WHERE, PROCESS, VERSION, WHAT)
(   1,<2012-08-10 22:39:05.859 -0500>,<Administrator>,<TOPSPIN>,<go>,<TOPSPIN 2.1>,
      <created by zg
	started at 2012-08-10 22:27:35.609 -0500,
	POWCHK enabled, PULCHK disabled,
       configuration hash MD5:
       6B 1B 68 BB D9 2E 58 E2 7F 35 AD 54 07 DF 0E 41
       data hash MD5: 64K
       BC DB 6E 53 99 5A 11 85 CD B3 D1 00 04 C3 8D FB>)
(   2,<2012-08-10 22:39:08.812 -0500>,<Administrator>,<TOPSPIN>,<proc1d>,<TOPSPIN 2.1>,
      <Start of raw data processing
       efp LB = 0.3 FT_mod = 6 PKNL = 1 PHC0 = 0 PHC1 = 0 SI = 128K 
       data hash MD5: 128K
       F9 F4 24 03 E8 21 4A 4C C7 10 C6 88 F3 8B B2 85>)
(   3,<2012-08-10 22:39:09.921 -0500>,<Administrator>,<TOPSPIN>,<proc1d>,<TOPSPIN 2.1>,
      <pk PHC0 = 4.910889 PHC1 = 0 
       data hash MD5: 128K
       59 42 1A D8 DC 8B 4C 45 89 A1 42 D4 9E 02 54 38>)
(   4,<2012-08-10 22:39:10.546 -0500>,<Administrator>,<TOPSPIN>,<proc1d>,<TOPSPIN 2.1>,
      <abs ABSG = 1 
       data hash MD5: 128K
       59 00 F1 BC 49 BD 08 9D EC E8 EA D3 98 E0 1F 5A>)
(   5,<2012-08-10 22:39:10.656 -0500>,<Administrator>,<TOPSPIN>,<proc1d>,<TOPSPIN 2.1>,
      <abs ABSG = 2 
       data hash MD5: 128K
       45 55 66 DE F0 FD E5 7E EA 83 21 F6 60 3C 66 FD>)
(   6,<2012-08-10 22:39:10.718 -0500>,<Administrator>,<TOPSPIN>,<proc1d>,<TOPSPIN 2.1>,
      <abs ABSG = 3 
       data hash MD5: 128K
       C3 E9 7B AE 69 BF BE CD E1 F8 08 BF 7D C3 50 A5>)
(   7,<2012-08-10 22:39:10.796 -0500>,<Administrator>,<TOPSPIN>,<proc1d>,<TOPSPIN 2.1>,
      <abs ABSG = 4 
       data hash MD5: 128K
       90 23 8F 6E A2 0A 14 6F 7F D9 A5 1F D7 A1 5D E5>)
(   8,<2012-08-10 22:39:10.843 -0500>,<Administrator>,<TOPSPIN>,<proc1d>,<TOPSPIN 2.1>,
      <abs ABSG = 5 
       data hash MD5: 128K
       F1 BE 99 66 E5 6A AD 4C B1 F0 86 7F 3E 1F 9D 2B>)
$$ ##END=
$$ 
$$ $$ hash MD5
$$ $$ 06 C3 D7 E9 9A 7A 0F D5 5E 3F 32 21 08 9A CE 5D
##$RELAX= 
##$RELAX= 
##$RELAX= 
##$RELAX= 
##$RELAX= 
##$RELAX= 
##$RELAX= 
##$RELAX= 
$$ Bruker specific parameters
$$ [...]
150 150 150 150 150 150 150 150
##$TP07= 0
##$TPNAME0= <>
##$TPNAME1= <>
##$TPNAME2= <>
##$TPNAME3= <>
##$TPNAME4= <>
##$TPNAME5= <>
##$TPNAME6= <>
##$TPNAME7= <>
##$TPOAL= (0..7)
0.5 0.5 0.5 0.5 0.5 0.5 0.5 0.5
##$TPOFFS= (0..7)
0 0 0 0 0 0 0 0
##$TUNHIN= 0
##$TUNHOUT= 0
##$TUNXOUT= 0
##$USERA1= <user>
##$USERA2= <user>
##$USERA3= <user>
##$USERA4= <user>
##$USERA5= <user>
##$V9= 5
##$VALIST= <valist>
##$VCLIST= <CCCCCCCCCCCCCCC>
##$VD= 0
##$VDLIST= <DDDDDDDDDDDDDDD>
##$VPLIST= <PPPPPPPPPPPPPPP>
##$VTLIST= <TTTTTTTTTTTTTTT>
##$WBST= 1024
##$WBSW= 4
##$XGAIN= (0..3)
0 0 0 0
##$XL= 0
##$YL= 0
##$YMAX_a= 17778847
##$YMIN_a= -9664477
##$ZGOPTNS= <>
##$ZL1= 120
##$ZL2= 120
##$ZL3= 120
##$ZL4= 120
##$ABSF1= 14.96258
##$ABSF2= -5.595602
##$ABSG= 5
##$ABSL= 3
##$ALPHA= 0
##$AQORDER= 0
##$ASSFAC= 0
##$ASSFACI= 0
##$ASSFACX= 0
##$ASSWID= 0
##$AUNMP= <proc_prof1d_extract.lims>
##$AXLEFT= 0
##$AXNAME= <>
##$AXNUC= <1H>
##$AXRIGHT= 0
##$AXTYPE= 0
##$AXUNIT= <>
##$AZFE= 0.1
##$AZFW= 0.1
##$BCFW= 0
##$BC_mod= 0
##$BYTORDP= 0
##$COROFFS= 0
##$CY= 15
##$DATMOD= 1
##$DC= 0
##$DFILT= <>
##$DTYPP= 0
##$F1P= 0
##$F2P= 0
##$FCOR= 0.5
##$FTSIZE= 131072
##$FT_mod= 6
##$GAMMA= 0
##$GB= 0
##$INTBC= 1
##$INTSCL= 1
##$ISEN= 128
##$LB= 0.3
##$LEV0= 0
##$LPBIN= 0
##$MAXI= 10000
##$MC2= 0
##$MEAN= 0
##$ME_mod= 0
##$MI= 0
##$NCOEF= 0
##$NC_proc= -2
##$NLEV= 6
##$NOISF1= 0
##$NOISF2= 0
##$NSP= 0
##$NTH_PI= 0
##$NZP= 0
##$OFFSET= 14.96258
##$PC= 1
##$PHC0= 4.910889
##$PHC1= 0
##$PH_mod= 1
##$PKNL= yes
##$PPARMOD= 0
##$PPDIAG= 0
##$PPIPTYP= 0
##$PPMPNUM= 2147483647
##$PPRESOL= 1
##$PSCAL= 4
##$PSIGN= 0
##$PYNMP= <proc.py>
##$REVERSE= no
##$SF= 400.020009004415
##$SI= 131072
##$SIGF1= 0
##$SIGF2= 0
##$SINO= 400
##$SIOLD= 131072
##$SPECTYP= <>
##$SREGLST= <1H.CDCl3>
##$SSB= 0
##$STSI= 131072
##$STSR= 0
##$SW_p= 8223.68421052631
##$SYMM= 0
##$S_DEV= 0
##$TDeff= 65536
##$TDoff= 0
##$TI= <>
##$TILT= no
##$TM1= 0
##$TM2= 0
##$TOPLEV= 0
##$USERP1= <user>
##$USERP2= <user>
##$USERP3= <user>
##$USERP4= <user>
##$USERP5= <user>
##$WDW= 1
##$XDIM= 131072
##$YMAX_p= 374298468
##$YMIN_p= -12557
##$CURPLOT= <Network HP LaserJet P1505>
##$CURPRIN= <$Network HP LaserJet P1505>
##$DFORMAT= <normdp>
##$LAYOUT= <+/1D_H.xwp>
##$LFORMAT= <normlp>
##$PFORMAT= <normpl>
##$SURQMSG= 1
$$ End of Bruker specific parameters
$$ ---------------------------------
##NTUPLES= NMR SPECTRUM
##VAR_NAME=  FREQUENCY,     SPECTRUM/REAL,   SPECTRUM/IMAG
##SYMBOL=    X,             R,               I
##VAR_TYPE=  INDEPENDENT,   DEPENDENT,       DEPENDENT
##VAR_FORM=  AFFN,          ASDF,            ASDF
##VAR_DIM=   131072,        131072,          131072
##UNITS=     HZ,            ARBITRARY UNITS, ARBITRARY UNITS
##FACTOR=    0.0627417313425164, 1,          1
##FIRST=     8223.62146879497, -3972,        -60593
##LAST=      0,             -2311,           -61796
##MIN=       0,             -12557,          0
##MAX=       8223.62146879497, 374298468,    0
$$ Real data points
##PAGE= N=1
##DATA TABLE= (X++(R..R)), XYDATA
$$ [...]
60915A423819n5029n1161m7370m3832m0605l7732l5190l2844l0659k8683k6835
60904I93879k5004k3323k1897k0428j8646j6972j5972j5319j4144j2388j0839
60893G98947r790q594o914n341m412l823l073k200j451q94o65j001j676k103k299
60878G44711k937m138m964m750m075l826l891l573k796k152k029k322k812l306
60864F97140l596l713l980m362m089k545l06J279J575J229J210J784K594L301
60850F87521L887M506N353O577Q039R233R726R785J0212J1300J2229J1902J0237
60837H00507Q155O487N408M925N098N597N773N501N342N474N184L977K453J441
60823H71322R35O22Q02J775K824K905K143J561J439R78l39j997l252l912m193
$$ plain form
60915 1423819 1368790 1317629 1270259 1226427 1185822 1148090 1112900 1080056 1049397 1020714 993879
60904 993879 968875 945552 923655 903227 884581 867609 851637 836318 822174 809786 798947
60893 798947 789157 780563 773649 768308 763896 760073 757000 754800 753349 752455 751790 750789 749113 747010 744711
60878 744711 741774 737636 732672 727922 723847 720021 716130 712557 709761 707609 705580 703258 700446 697140
60864 697140 693544 689831 685851 681489 677400 674855 674549 675828 677403 678632 679842 681626 684220 687521
60850 687521 691408 695914 701267 707844 715883 725116 734842 744627 754839 766139 778368 790270 800507
60837 800507 808662 815149 820557 825482 830580 836177 841950 847451 852793 858267 863451 867428 869881 871322
60823 871322 872257 872879 873681 875456 878280 881185 883328 884889 886328 887306 886967 884970 881718 877806 873613
60808H73613m392m800n368n573n187m896n408o246o345n741n480n862n958n238
60794G97119m447m276m123l003j085N22J217J476K055L117M194M856N270N922
60780H08814O839P458P587P926R012J0161J0283R443Q670Q388Q112P577P035O296
60766I23601M751K697J536K002L078L332K618J814J483J420J140L14r62j986j977
60751I44861r93O6O01Q63J212J548J791K143K387J719j42k269l600m166m578m807
60735I36636m347l305k468k354k776l372l944m276m035l160k073j339j227j570
60721H96390k003k269k297k086j698j477j935l095m221m629m610n033o126p221
60707H47690p665p443o874o253n859n728n394m447l288k768k936k931k210j207
$$ plain form
60808 873613 869221 864421 859053 853480 848293 843397 837989 831743 825398 819657 814177 808315 802357 797119
60794 797119 792672 788396 784273 781270 780185 780707 781924 783400 785455 788572 792766 797622 802892 808814
60780 808814 815653 823111 830698 838624 847636 857797 868080 877523 886193 894581 902693 910270 917305 923601
60766 923601 928352 931049 932585 934587 937665 940997 943615 945429 946912 948332 949472 949786 948824 946838 944861
60751 944861 943868 943934 944535 945398 946610 948158 949949 952092 954479 956198 956056 953787 950187 946021 941443 936636
60735 936636 932289 928984 926516 924162 921386 918014 914070 909794 905759 902599 900526 899187 897960 896390
60721 896390 894387 892118 889821 887735 886037 884560 882625 879530 875309 870680 866070 861037 854911 847690
60707 847690 840025 832582 825708 819455 813596 807868 802474 798027 794739 791971 789035 786104 783894 782687
60693G82687n48l35m59r25j543j911k026k352l033l660m077m705n763o759p229
60678G37362p290p133o588n702n025m802m499l642k629k092k018k081k300k715
60664F78846k814k066p65K66O37N45K90J53M26J055J481J380J310K034L386M346
60648F90510M207L283K494K564L438M223L925K585J369J268K092L090M056N181
60634G34285O203O512O050N480N395N861O748P970R223J0019J0183J0087J0161
60621H34177J0377J0359R959R487R306R230Q578O972M980L586L107K980K647K230
60607I27975K083K102J811J009M2n49n81m82r67k316m105n792p290q598r242q720
60591H86380p406o284n741n204m119k669j448r69j497k715l526k976j502n42p27
$$ plain form
60693 782687 782139 781804 781345 780420 778877 776966 774940 772588 769555 765895 761818 757113 751350 744591 737362
60678 737362 730072 722939 716351 710649 705624 700822 696323 692681 690052 687960 685942 683861 681561 678846
60664 678846 676032 673966 673201 673467 674104 674649 674939 675092 675518 676573 678054 679434 680744 682778 686164 690510
60648 690510 694717 698000 700494 703058 706496 710719 714644 717229 718598 719866 721958 725048 729104 734285
60634 734285 740488 747000 753050 758530 763925 769786 776534 784504 793727 803746 813929 824016 834177
60621 834177 844554 854913 864872 874359 883665 892895 901473 908445 913425 917011 920118 923098 925745 927975
60607 927975 930058 932160 933971 934980 935022 934473 933892 933410 932443 930127 926022 920230 912940 904342 895100 886380
60591 886380 878974 872690 866949 861745 857626 854957 853509 852540 851043 848328 844802 841826 840324 839782 839055
60576H39055j332j637j831k130k056j273l49Q7K79P94J639K519L384L997L641
60561H44787K061K37n60j83N69J161J655K192K828L725M923O149P303Q729J0655
60546H96231J2809J5050J7747K1022K4270K7159L0443L4945M0273M5454N0198
60535A215601N4430N6958N5845N0226M0828K8818J5018L05j4080k6735l6226m1315
60523A399673m1921l9588l6227l2389k7488k1458j5211r563m676n49K779N586
60511A178968Q159J0185J1271J2016J3482J5635J7474J8945K1502K6286L2885
60500A366808M0588M9756O0962P3556Q6303R9128J13244J29412J46818J63798
60490B330373J79248J93307K06981K21346K37025K54299K73206K92582L08486
$$ plain form
60576 839055 837723 836086 834255 832125 830069 828796 828447 828534 828813 829607 831246 833765 837149 841146 844787
60561 844787 846848 847085 846525 846342 846911 848072 849727 851919 854747 858472 863395 869544 876847 885576 896231
60546 896231 909040 924090 941837 962859 987129 1014288 1044731 1079676 1119949 1165403 1215601
60535 1215601 1270031 1326989 1382834 1433060 1473888 1502706 1517724 1518029 1503949 1477214 1440988 1399673
60523 1399673 1357752 1318164 1281937 1249548 1222060 1200602 1185391 1175828 1171152 1170603 1173382 1178968
60511 1178968 1187127 1197312 1208583 1220599 1234081 1249716 1267190 1286135 1307637 1333923 1366808
60500 1366808 1407396 1457152 1518114 1591670 1677973 1777101 1890345 2019757 2166575 2330373
60490 2330373 2509621 2702928 2909909 3131255 3368280 3622579 3895785 4188367 4496853
60481D496853L14078L02059K67996K11812J36946M8931m5123j36631k16555k77704
60471E102662l16933l35554l37563l27333l08499k84228k57634k31396k06973
60462B496549j84439j63320j43686j26357j11940r9960q9328p9599p1180o4263
60452A362477n8270n2662m7673m3709m0489l7434l4501l1967k9694k7397k5409
60441I33272k4310k3823k2945k1313j9626j8486j7527j6140j4482j3182j2393
60430G29045j1635j0480q966p412o111n252m915m965m992m472l221j670n85l14
60416F54055n25o79n81k91K03Q76J461J640J410J061R36J316K249L289L768L559
60400F73747L305L511L909M030M023M248M480M236L637L209K940K315J248K73
$$ plain form
60481 4496853 4810931 5112990 5380986 5592798 5729744 5778675 5733552 5596921 5380366 5102662
60471 5102662 4785729 4450175 4112612 3785279 3476780 3192552 2934918 2703522 2496549
60462 2496549 2312110 2148790 2005104 1878747 1766807 1666847 1577519 1497920 1426740 1362477
60452 1362477 1304207 1251545 1203872 1160163 1119674 1082240 1047739 1015772 986078 958681 933272
60441 933272 908962 885139 862194 840881 821255 802769 785242 769102 754620 741438 729045
60430 729045 717410 706930 697964 690552 684441 679189 674274 669309 664317 659845 656624 654954 654369 654055
60416 654055 653530 652851 652270 651979 652182 653058 654519 656159 657569 658630 659566 660882 663131 666420 670188 673747
60400 673747 677052 680563 684472 688502 692525 696773 701253 705489 709126 712335 715275 717590 718838 719111
60386G19111l32q95j672k364k560k209j498p04k75n69j393k108k325k121j600
60371F96486p83PK62m8l71l44j70J1M84J371K118K139J685J600K261L164L560
60354G13432L242K704K713L690N333O773P268O848O334O592P622Q447Q116O756
60340G95870N407M752M431L765K756J956J638J536J291P72J49p4O99K499M493
60325H31940N717N959N630N015M073K814J383j50j696k982l817m356m737m706
60311H40087m054l138k436j846j047k70l3k33k62L9K74L19M51O91P39O51Q56J393
60293H32181J853K182K672L104K747J599O58N98R38J106J423K357L490M102M359
60278H65369N006O146P171P757Q235Q880R480R837J0147J0777J1885J3359J4913
$$ plain form
60386 719111 718779 717884 716212 713848 711288 709079 707581 706877 706602 706033 704640 702532 700207 698086 696486
60371 696486 695703 695710 695972 695924 695553 695209 695039 695050 695534 696905 699023 701162 702847 704447 706708 709872 713432
60354 713432 716674 719378 722091 725781 731114 737887 745155 752003 758337 764929 772551 780998 789114 795870
60340 795870 801277 806029 810460 814225 816981 818937 820575 822111 823402 824174 824323 824249 824948 827447 831940
60325 831940 837657 843616 849246 854261 858334 861148 862531 862381 860685 857703 853886 849530 844793 840087
60311 840087 836033 832895 830459 828613 827566 827296 827263 827030 826768 826807 827081 827400 827851 828542 829281 829932 830788 832181
60293 832181 834034 836216 838888 841992 844739 846338 846996 847594 848532 849638 851061 853418 856908 861010 865369
60278 865369 870375 876521 883692 891449 899684 908564 918044 927881 938028 948805 960690 974049 988962
60265I88962J6218J7271J8567K0626K3259K5631K7289K8837L1317L5037L9276
60254A272290M3209M6714N0200N3960N8135O3097O9248P6325Q3398Q9891R6139
60243B002606J02642J09186J15158J20328J24729J27960J29238J28121J24684
60234C084652J19082J11408J01971R1183P9147O5852N1749L7562K3510R375m533
60223C770958j7009k6855l3741l7970l9795l9321l6747l2329k6274j8798j0162
60212C451957n06J0157K1725L3940M6587N9498P2325Q4536R5787J06078J15377
60201D097461J23206J28677J30956J29780J25489J18395J08254R4731P8420O0758
60191E196127M2618K3746M031j5367l3039m8819o3271p6033q5847r2095r5089
$$ plain form
60265 988962 1005180 1022451 1041018 1061644 1084903 1110534 1137823 1166660 1197977 1233014 1272290
60254 1272290 1315499 1362213 1412413 1466373 1524508 1587605 1656853 1733178 1816576 1906467 2002606
60243 2002606 2105248 2214434 2329592 2449920 2574649 2702609 2831847 2959968 3084652
60234 3084652 3203734 3315142 3417113 3508296 3587443 3653295 3705044 3742606 3766116 3775491 3770958
60223 3770958 3753949 3727094 3693353 3655383 3615588 3576267 3539520 3507191 3480917 3462119 3451957
60212 3451957 3451451 3461608 3483333 3517273 3563860 3623358 3695683 3780219 3876006 3982084 4097461
60201 4097461 4220667 4349344 4480300 4610080 4735569 4853964 4962218 5056949 5135369 5196127
60191 5196127 5238745 5262491 5266522 5251155 5218116 5169297 5106026 5029993 4944146 4852051 4756962
60180D756962r4867r1003q3870p4867o4812n3148l9348k4140q644O883K2550L7757
60168D289453N1485O3224P2732P9302Q2160Q1439P7870P1671O2591N1131L8715
60157E021773K6395J4089J628j0094j9652k6504l1099l3565l2975k8332j9827
60146D861837q638M299J8765L4638N1479O8922Q7039J06055J26126J47509J70404
60135E668435J94345K18410K42429K67337K93636L20046L44391L65393L82721
60126H297143L95764M03433M05145M00917L90420L72860L48049L16813K80091
60117A1610635K38252J91635J41143Q8072L3699k0819p4531j26669j76174k21313
60107A1683930k60172k91343l13800l26679l30006l25219l13922k96374k72284
$$ plain form
60180 4756962 4662095 4571092 4487222 4412355 4347543 4294395 4255047 4230907 4222263 4229146 4251696 4289453
60168 4289453 4340938 4404162 4476894 4556196 4638356 4719795 4797665 4869336 4931927 4983058 5021773
60157 5021773 5048168 5062257 5063885 5053791 5034139 5007635 4976536 4942971 4909996 4881664 4861837
60146 4861837 4853199 4857498 4876263 4910901 4962380 5031302 5118341 5224396 5350522 5498031 5668435
60135 5668435 5862780 6081190 6323619 6590956 6884592 7204638 7549029 7914422 8297143
60126 8297143 8692907 9096340 9501485 9902402 10292822 10665682 11013731 11330544 11610635
60117 11610635 11848887 12040522 12181665 12269737 12303436 12282617 12208086 12081417 11905243 11683930
60107 11683930 11423758 11132415 10818615 10491936 10161930 9836711 9522789 9226415 8954131
60098H954131k42909k10862j77789j43592j08236p2938l9001o793K3331N0242
60088H025584P2943R1318J05146J13212J14421J09078R8232Q2429O2020L8178
60078H912561J2676j3094l8239o1999q3987j04486j23786j41447j56729j69428
60068H032042j79690j87408j92351j94571j94155j90879j84516j75189j63012
60059F370271j47950j30574j12329r4332p6293n7300l7309j7075K966K2941M2725
60048E765741O1649P9081R4671J07996J18337J24853J26703J23293J14733J01894
60038F818951Q5716O6638M4994K1527k911k7799n2622p6369r7864j16437j31862
60027F531962j43786j51684j55196j54288j49331j41204j30938j18936j04976
$$ plain form
60098 8954131 8711222 8500360 8322571 8178979 8070743 7997805 7958804 7952011 7975342 8025584
60088 8025584 8098527 8189845 8294991 8408203 8522624 8631702 8729934 8812363 8874383 8912561
60078 8912561 8925237 8912143 8873904 8811905 8727918 8623432 8499646 8358199 8201470 8032042
60068 8032042 7852352 7664944 7472593 7278022 7083867 6892988 6708472 6533283 6370271
60059 6370271 6222321 6091747 5979418 5885086 5808793 5751493 5714184 5697109 5700075 5723016 5765741
60048 5765741 5827390 5906471 6001142 6109138 6227475 6352328 6479031 6602324 6717057 6818951
60038 6818951 6904667 6971305 7016299 7037826 7034915 7007116 6954494 6878125 6780261 6663824 6531962
60027 6531962 6388176 6236492 6081296 5927008 5777677 5636473 5505535 5386599 5281623
60018E281623q9219p2681n6220l9656k2441m719J3011L0886M9533O9098Q9088
60007E248303J08923J28024J45488J60438J72627J82037J87828J88351J82459
59998F704478J70399J53292J32132J07565Q0308N1439K2141o828l5322o3244q9740
59987G226620j13163j31929j45252j53107j55823j53788j47287j36548j22166
59978E967557j05325q7165o7980m7725k7136p527J0687K8254M5562O1645P5321
59967E846168Q6466R5525J02404J06658J08338J07865J05274J00216R2553Q2618
59957F834085P1104N8996M7242L6189K5767J6388R080M474K394K969P274J6242
59945G132204K9511M6155O5963Q9354J16403J46651J79515K14289K50171K86824
$$ plain form
60018 5281623 5192404 5119723 5063503 5023847 5001406 4996687 5009698 5040584 5090117 5159215 5248303
60007 5248303 5357226 5485250 5630738 5791176 5963803 6145840 6333668 6522019 6704478
59998 6704478 6874877 7028169 7160301 7267866 7348174 7399613 7421754 7414926 7379604 7316360 7226620
59987 7226620 7113457 6981528 6836276 6683169 6527346 6373558 6226271 6089723 5967557
59978 5967557 5862232 5775067 5707087 5659362 5632226 5624699 5635386 5663640 5709202 5770847 5846168
59967 5846168 5932634 6028159 6130563 6237221 6345559 6453424 6558698 6658914 6751467 6834085
59957 6834085 6905189 6964185 7011427 7047616 7073383 7089771 7098851 7103325 7105719 7108688 7115962 7132204
59945 7132204 7161715 7207870 7273833 7363187 7479590 7626241 7805756 8020045 8270216 8557040
59935H557040L24351L62034L97578M28239M52208M68210M74293M67869M46681
59926A2378503M09248L55036K85174K02808J12140J7460p6515j64416k41648l05774
59916A2972016l55839l90990m10954m17329m13006m00168l79814l53011l21554
59907I529351k87295k51632k15611j79653j43299j06092o8733l2632J599L4362
59897H280365O5881R5611J22833J46830J66388J79831J85800J83469J72088J51001
59887I750097J20217Q0469L2994k0089p5458j29531j79857k24919k62959k92086
59877H798878l11704l22783l26518l23410l13996k99569k81723k61712k40535
59868F116928k19172j98302j78094j58667j40641j25074j12839j04002r7743r3079
$$ plain form
59935 8557040 8881391 9243425 9641003 10069242 10521450 10989660 11463953 11931822 12378503
59926 12378503 12787751 13142787 13427961 13630769 13742909 13760369 13683854 13519438 13277790 12972016
59916 12972016 12616177 12225187 11814233 11396904 10983898 10583730 10203916 9850905 9529351
59907 9529351 9242056 8990424 8774813 8595160 8451861 8345769 8277036 8244404 8246003 8280365
59897 8280365 8346246 8441857 8564690 8711520 8877908 9057739 9243539 9427008 9599096 9750097
59887 9750097 9870314 9950783 9983777 9963688 9888230 9758699 9578842 9353923 9090964 8798878
59877 8798878 8487174 8164391 7837873 7514463 7200467 6900898 6619175 6357463 6116928
59868 6116928 5897756 5699454 5521360 5362693 5222052 5096978 4984139 4880137 4782394 4689315
59858D689315q9663q7581q6322q4619q1626p7617p3110o7912o1582n4259m6403
59847C878621l8314l0622k4596k1203k0283k1361k4562k9881l6263m2542m8663
59836C540331n4754n9486o0886n8661n4429m9632m4420l8567l2204k5341j7685
59825C044266r261n49Q073J6279K3362K8755L2971L7223M2106M7399N2872N8382
59813C381878O3290O6790O8606O8508O5468N8613M8836L8297K8313J8925J0397
59802C917921L724n67k839l291j522K548Q481J6258K6352L8662N2328O6880Q2571
59789D207506R9554J17851J38249J61908J88749K17425K47229K78835L12605L47248
59779F317159L80392M09073M28783M33013M14785L69036K94591J96011Q4177k6676
$$ plain form
59858 4689315 4599652 4512071 4425749 4341130 4259504 4181887 4108777 4040865 3979283 3925024 3878621
59847 3878621 3840307 3809685 3785089 3763886 3743603 3722242 3697680 3667799 3631536 3588994 3540331
59836 3540331 3485577 3426091 3365205 3306544 3252115 3202483 3158063 3119496 3087292 3061951 3044266
59825 3044266 3035005 3034456 3042529 3058808 3082170 3110925 3143896 3181119 3223225 3270624 3323496 3381878
59813 3381878 3445168 3511958 3580564 3649072 3714540 3773153 3821989 3860286 3888599 3907524 3917921
59802 3917921 3921645 3921078 3918239 3914948 3913426 3915974 3924455 3940713 3967065 4005727 4058055 4124935 4207506
59789 4207506 4307060 4424911 4563160 4725068 4913817 5131242 5378471 5657306 5969911 6317159
59779 6317159 6697551 7106624 7535407 7968420 8383205 8752241 9046832 9242843 9327020 9300344
59769I300344j24398k02189k57672k90919l04194l01868k88835k68942k45043
59760G016284k19428j93415j67333j41623j17231r4540p2894n1893l2188j4193
59750E911546L072K0879L9141N6907P3979R1180J09298J28537J48913J70560J93701
59739F947713K18498K44852K72381L00950L31175L63851L98918M35681M73891
59730I987910N13665N54339N94251O31730O65203O92334P10329P17553P13953
59721A5781267O99727O75074O41821O04144N66992N34585N10595M98174M98741
59712B1011120N11473N34578N66112O03098O41125O75604P02617P17998P17067
59703B6680792O96341O54756N92692N11208M13369L05241J94258Q7010j0875r4110
$$ plain form
59769 9300344 9175946 8973757 8716085 8425166 8120972 7819104 7530269 7261327 7016284
59760 7016284 6796856 6603441 6436108 6294485 6177254 6082714 6009820 5957927 5925739 5911546
59750 5911546 5914618 5935497 5974638 6031545 6105524 6196704 6306002 6434539 6583452 6754012 6947713
59739 6947713 7166211 7411063 7683444 7984394 8315569 8679420 9078338 9514019 9987910
59730 9987910 10501575 11055914 11650165 12281895 12947098 13639432 14349761 15067314 15781267
59721 15781267 16480994 17156068 17797889 18402033 18969025 19503610 20014205 20512379 21011120
59712 21011120 21522593 22057171 22623283 23226381 23867506 24543110 25245727 25963725 26680792
59703 26680792 27377133 28031889 28624581 29135789 29549158 29854399 30048657 30135667 30124792 30030682
59693C0030682j58543k02171k24459k25457k06292j69550j17941n3166K3104J08184
59683B8804391J99486K95862L96783N00932O06669P12826Q17353R15633J001275
59674C4251210J068003J109365J117206J082417R97788Q59924O69756M33500J63712
59665D1752881j21959m04196o65055q89602j067233j192772j266283j292004j277458
59656C3576319j232333j166589j089374j010096r39669q89041q65741q71545r02113
59647B4609818r47725r95425j033057j053063j053185j034696j000852r56041
59639A6535774r04440q48784p90815p32508o75950o22272n71743n24688m81432
59630A0383142m41527m04141l69156l37015l07650k80527k55572k32981k12132
$$ plain form
59693 30030682 29872139 29669968 29445509 29220052 29013760 28844210 28726269 28673103 28696207 28804391
59683 28804391 29003877 29299739 29696522 30197454 30804123 31516949 32334302 33249935 34251210
59674 34251210 35319213 36428578 37545784 38628201 39625989 40485913 41155669 41589169 41752881
59665 41752881 41630922 41226726 40561671 39672069 38604836 37412064 36145781 34853777 33576319
59656 33576319 32343986 31177397 30088023 29077927 28138258 27249217 26383476 25511931 24609818
59647 24609818 23662093 22666668 21633611 20580548 19527363 18492667 17491815 16535774
59639 16535774 15631334 14782550 13991735 13259227 12583277 11961005 11389262 10864574 10383142
59630 10383142 9941615 9537474 9168318 8831303 8523653 8243126 7987554 7754573 7542441
59621G542441j91912j72254j54392j39335j26964j16755j08606j02664r9108r8249
59611F232202j00181j04121j08759j13481j18554j23976j28829j32071j33434
59602E168796j33112j31026j26823j20525j12877j04935r7245q9461q0994p1931
59592D099867o2927n4165m5224l6214k8215k1918j6482j0553m029J914O318R320
59580C837692J1724J4151J6518J8093J8471J8700K0631K4807K9836L4471L9395
59569D084489M6031N4473O3656P3020Q2843R3414J04901J17610J31471J45707
59559D997615J60022J75454J92982K11818K30329K48159K66008K83771L00357
59550G066515L15108L27870L37780L43516L44874L42744L37406L28286L15532
$$ plain form
59621 7542441 7350529 7178275 7023883 6884548 6757584 6640829 6532223 6429559 6330451 6232202
59611 6232202 6132021 6027900 5919141 5805660 5687106 5563130 5434301 5302230 5168796
59602 5168796 5035684 4904658 4777835 4657310 4544433 4439498 4342253 4252792 4171798 4099867
59592 4099867 4036940 3982775 3937551 3901337 3873122 3851204 3834722 3824169 3820140 3822054 3828372 3837692
59580 3837692 3849416 3863567 3880085 3898178 3916649 3935349 3955980 3980787 4010623 4045094 4084489
59569 4084489 4130520 4184993 4248649 4321669 4404512 4497926 4602827 4720437 4851908 4997615
59559 4997615 5157637 5333091 5526073 5737891 5968220 6216379 6482387 6766158 7066515
59550 7066515 7381623 7709493 8047273 8390789 8735663 9078407 9415813 9744099 10059631
59541A0059631L00382K83759K65893K47610K30322K14033J96773J77108J56344
59532A2131855J37554J23206J14368J10997J11888J14742J17202J17664J14681
59523A3194157J06181Q9995O4965L1165j0537n8713j11390j66320k21159k73394
59513A2644950l20549l60799l93121m16798m31325m37063m35552m28705m17735
59504I003303m02966l84448l62590l38438l13396k88524k64120k40023k16236
59495F192562j93004j70609j49407j29843j11988r5150p8436o1573m4846k8347
59485E129359j1729N387K3130M1458O0237P9293R8599J18244J38102J57879J77553
59474F017512J97206K16279K33635K48603K61023K69922K73213K69421K58565
$$ plain form
59541 10059631 10360013 10643772 10909665 11157275 11387597 11601630 11798403 11975511 12131855
59532 12131855 12269409 12392615 12506983 12617980 12729868 12844610 12961812 13079476 13194157
59523 13194157 13300338 13390333 13455298 13486463 13475926 13417213 13305823 13139503 12918344 12644950
59513 12644950 12324401 11963602 11570481 11153683 10722358 10285295 9849743 9421038 9003303
59504 9003303 8600337 8215889 7853299 7514861 7201465 6912941 6648821 6408798 6192562
59495 6192562 5999558 5828949 5679542 5549699 5437711 5342561 5264125 5202552 5157706 5129359
59485 5129359 5117630 5123017 5146147 5187605 5247842 5327135 5425734 5543978 5682080 5839959 6017512
59474 6017512 6214718 6430997 6664632 6913235 7174258 7444180 7717393 7986814 8245379
59465H245379K40468K13494J76484J31070Q0521K6949k8684q4293j36523j82895
59455H681970k22519k54613k78117k93188l01461l04208l01580k94078k83394
59446F148812k70979k56908k41063k24457k08555j93814j79688j65618j51490
59437D256240j37530j24180j11816j00395q9665p9676p0585o2055n3561m5257
59427C381520l7710l0802k3806j6642j0172m942n70L430P046J0363J3886J7776
59415C309377K1581K5235K9658L5591M2098M6813M7862M5587M2624M2144M5780
59404C734350N3119O3129P5399Q9775J05733J22845J41051J59511J76228J90347
59394D911487K04270K21804K44382K70732K99980L32915L69773M08726M47598
$$ plain form
59465 8245379 8485847 8699341 8875825 9006895 9087416 9114365 9085681 9001388 8864865 8681970
59455 8681970 8459451 8204838 7926721 7633533 7332072 7027864 6726284 6432206 6148812
59446 6148812 5877833 5620925 5379862 5155405 4946850 4753036 4573348 4407730 4256240
59437 4256240 4118710 3994530 3882714 3782319 3692654 3612978 3542393 3480338 3426777 3381520
59427 3381520 3343810 3313008 3289202 3272560 3262388 3257446 3256876 3260306 3267352 3277715 3291601 3309377
59415 3309377 3330958 3356193 3385851 3421442 3463540 3510353 3558215 3603802 3646426 3688570 3734350
59404 3734350 3787469 3850598 3925997 4015772 4121505 4244350 4385401 4544912 4721140 4911487
59394 4911487 5115757 5337561 5581943 5852675 6152655 6485570 6855343 7264069 7711667
59385G711667M85580N22215N55723N83385O02891O12672O11656N99481N76592
59376A2861862N43946N03285M57634M10458L63885L18513K74890K33881J95262
59367A6163616J57348J18630P8680L6970p681n5628j05428j55129k03301k47876
59357A5780201k85315l12498l28972l36365l36296l30154l20320l10199l02799
59348A2917283k99775l01694l08452l19529l34146l50968l67511l80677l88506
59339I866025l91040l89061l82711l71962l57644l41037l22805l03085k82306
59330F724374k61165k40012k18979j98646j79873j62965j47406j32494j18000
59321E064834j04214r1554q0164o9765n9974n0571m1345l2014k2737j4283p067
$$ plain form
59385 7711667 8197247 8719462 9275185 9858570 10461461 11074133 11685789 12285270 12861862
59376 12861862 13405808 13909093 14366727 14777185 15141070 15459583 15734473 15968354 16163616
59367 16163616 16320964 16439594 16518274 16555244 16547563 16491935 16386507 16231378 16028077 15780201
59357 15780201 15494886 15182388 14853416 14517051 14180755 13850601 13530281 13220082 12917283
59348 12917283 12617508 12315814 12007362 11687833 11353687 11002719 10635208 10254531 9866025
59339 9866025 9474985 9085924 8703213 8331251 7973607 7632570 7309765 7006680 6724374
59330 6724374 6463209 6223197 6004218 5805572 5625699 5462734 5315328 5182834 5064834
59321 5064834 4960620 4869066 4788902 4719137 4659163 4608592 4567247 4535233 4512496 4498213 4491146
59310D491146l18O994J4621K1376K6868L1754L6321M0039M2759M5052M6959M7563
59298D851134M6459M4479M2441M0171L7598L5708L5501L6671L8360M0658M4492
59287E293672N0374N7972O6719P6256Q6476R7515J09396J21471J32591J41860
59277F234302J48704J52218J51394J46197J37384J24846J07090Q3003N3482K0916
59267G359536j2144m3285p0225r1468j06673j16049j20008j19606j16430j11367
59257F452281j04164r4631q3529p1783n9652m7266l5295k4382j4552n639K425
59246E913813J0097J8239K7094L6096M5144N5244O7367Q1581R7816J16475J37649
59235F606615J60700J85342K12175K41326K71379L00361L26851L49325L65452
$$ plain form
59310 4491146 4490828 4497822 4512443 4533819 4560687 4592441 4628762 4668801 4711560 4756612 4803571 4851134
59298 4851134 4897593 4942072 4984513 5024684 5062282 5097990 5133491 5170162 5208522 5249180 5293672
59287 5293672 5344046 5402018 5468737 5544993 5631469 5728984 5838380 5959851 6092442 6234302
59277 6234302 6383006 6535224 6686618 6832815 6970199 7095045 7202135 7285138 7338620 7359536
59267 7359536 7347392 7304107 7233882 7142414 7035741 6919692 6799684 6680078 6563648 6452281
59257 6452281 6348117 6253486 6169957 6098174 6038522 5991256 5955961 5931579 5917027 5911388 5913813
59246 5913813 5923910 5942149 5969243 6005339 6050483 6105727 6173094 6254675 6352491 6468966 6606615
59235 6606615 6767315 6952657 7164832 7406158 7677537 7977898 8304749 8654074 9019526
59226I019526L73044L70844L57515L30930K89773K35177J69684R5367J4271o9909
59216A1186222j52148k28127k95168l51551l95978m27776m46901m53920m50367
59207G984286m38652m20982l98790l73535l47174l21163k95700k70766k47127
59198D870397k25583k05929j87680j71037j56281j42922j30563j19801j11125
59189C419476j03543r5689q7754q1022p5677p0516o4754n8953n3953m9820m6039
59178B631756m2111l7808l3304k9022k5077k1042j6591j1925p289k672J666N108
59166B411689P691J0425J4004J7908K1475K4977K8935L3092L6972M0742M4649
59155B692559M8386N1732N5110N8625O1519O3418O5193O7429O9102O9012O7606
$$ plain form
59226 9019526 9392570 9763414 10120929 10451859 10741632 10976809 11146493 11241860 11256131 11186222
59216 11186222 11034074 10805947 10510779 10159228 9763250 9335474 8888573 8434653 7984286
59207 7984286 7545634 7124652 6725862 6352327 6005153 5683990 5388290 5117524 4870397
59198 4870397 4644814 4438885 4251205 4080168 3923887 3780965 3650402 3530601 3419476
59189 3419476 3315933 3220244 3132490 3051468 2975791 2905275 2840521 2781568 2727615 2677795 2631756
59178 2631756 2589645 2551837 2518533 2489511 2464434 2443392 2426801 2414876 2407587 2404915 2406581 2411689
59166 2411689 2419380 2429805 2443809 2461717 2483192 2508169 2537104 2570196 2607168 2647910 2692559
59155 2692559 2740945 2792677 2847787 2906412 2967931 3031349 3096542 3163971 3233073 3302085 3369691
59144C369691O5887O3449N9203N3468M7619M2045L6096K9722K3653J8122J2958
59133C821913Q861P001P326Q651J0615J4264K0439K8734L8232M8290N8586O9326
59121D142238Q1416R5516J11038J26910J43083J60121J77708J94729K10692K25640
59111E669091K38693K48078K52771K52825K47734K35623K14554J83877J44263
59102G687509R7546M6826m167n2395r5799j32575j61250j81716j95257k03292
59092F805430k06745k06732k04904k02555j99942j96743j92812j88320j83614
59083E023063j79017j74537j69842j64838j59910j55236j50353j44912j39360
59074C585058j34139j28736j22363j15261j08383j02110r6097r0129q4247p8239
$$ plain form
59144 3369691 3435578 3499027 3558230 3611698 3659317 3701362 3737458 3767180 3790833 3808955 3821913
59133 3821913 3830774 3837775 3845101 3853752 3864367 3878631 3899070 3927804 3966036 4014326 4072912 4142238
59121 4142238 4223654 4319170 4430208 4557118 4700201 4860322 5038030 5232759 5443451 5669091
59111 5669091 5907784 6155862 6408633 6661458 6909192 7144815 7359369 7543246 7687509
59102 7687509 7785055 7831881 7827714 7775319 7679520 7546945 7385695 7203979 7008722 6805430
59092 6805430 6598685 6391953 6187049 5984494 5784552 5587809 5394997 5206677 5023063
59083 5023063 4844046 4669509 4499667 4334829 4174919 4019683 3869330 3724418 3585058
59074 3585058 3450919 3322183 3199820 3084559 2976176 2874066 2777969 2687840 2603593 2525354
59064B525354p1869o5421n9325n3532m7948m3054l9256l6156l3374l1422l0771
59053B013226l0598k9855k9173l0184l3055l6054l7633l7733l6931l5565l3947
59042A642498l2381l0592k7988k4733k1822j9909j8659j7276j5173j2185q769
59031A413011n795l613j613P08K814L981M485M991N261M605L162J657K43j256
59017A432641k295k080r48r3P0K21R85K351M102N915P259Q060R120J0935J2552
59002A488795J2659J1357R798Q506P213N924M917M082L341L271M167N191N629
58989A574850O224P850R726J0650J1169J2534J4224J4775J4606J5525J7540J8686
58977A728359J8373J8475K0405K3254K5614K7460K9314L1168L3134L5763L9037
$$ plain form
59064 2525354 2453485 2388064 2328739 2275207 2227259 2184205 2144949 2108793 2075419 2043997 2013226
59053 2013226 1982628 1952773 1923600 1893416 1860361 1824307 1786674 1748941 1712010 1676445 1642498
59042 1642498 1610117 1579525 1551537 1526804 1504982 1485073 1466414 1449138 1433965 1421780 1413011
59031 1413011 1407216 1403603 1401990 1402698 1405512 1409493 1413978 1418969 1424230 1428835 1431997 1433654 1433897 1432641
59017 1432641 1430346 1428266 1427318 1427225 1427295 1427516 1428501 1430852 1434954 1440869 1448128 1456188 1465308 1476243 1488795
59002 1488795 1501454 1512811 1522609 1531115 1538328 1544252 1549169 1553251 1556592 1559863 1564030 1569221 1574850
58989 1574850 1581074 1588924 1598650 1609300 1620469 1633003 1647227 1662002 1676608 1692133 1709673 1728359
58977 1728359 1746732 1765207 1785612 1808866 1834480 1861940 1891254 1922422 1955556 1991319 2030356
58966B030356M2113M4615M6851M8517M8652M7280M5759M4978M4600M4427M5025
58955B533173M6515M8203M9975N2652N6452O0507O4476O9280P5593Q2876R0500
58944C230202R8621J07408J16562J26174J36897J48759J60971J73348J86829K02186
58934D687957K19348K38341K59633K83141L08127L34467L62955L94068M27548
58925G515585M63383N01892N42645N84613O27472O71232P14529P54873P90778
58916A3167002Q21662Q45230Q56851Q52208Q28897P84819P17276O24976N09825
58907B0008746L75930K28289P3189q1778k29480l64425m81998n78323o51851p03848
58897A7594451p36502p51625p51587p39799p19247o91750o59194o23967n87418
$$ plain form
58966 2030356 2072469 2117084 2163935 2212452 2261104 2308384 2354143 2399121 2443721 2488148 2533173
58955 2533173 2579688 2627891 2677866 2730518 2786970 2847477 2911953 2981233 3056826 3139702 3230202
58944 3230202 3328823 3436231 3552793 3678967 3815864 3964623 4125594 4298942 4485771 4687957
58934 4687957 4907305 5145646 5405279 5688420 5996547 6331014 6693969 7088037 7515585
58925 7515585 7978968 8480860 9023505 9608118 10235590 10906822 11621351 12376224 13167002
58916 13167002 13988664 14833894 15690745 16542953 17371850 18156669 18873945 19498921 20008746
58907 20008746 20384676 20612965 20686154 20604376 20374896 20010471 19528473 18950150 18298299 17594451
58897 17594451 16857949 16106324 15354737 14614938 13895691 13203941 12544747 11920780 11333362
58888A1333362n49476n10665m73041m38188m05841l75439l47758l23875l03740
58879G605339k86627k71873k58476k45242k32106k20007k08862j97182j84301
58870E500663j71314j59077j47121j35461j25462j17577j10001j01073r1516q2831
58860D259230p5009o7294n9810n2864m5872l8536l1845k6411k0957j3984n915
58849C820733J949R536J7518K5640L3095L9943M6856N4184O2330P2066Q3289R4385
58837D361524J04242J14003J25554J39113J53626J68728J84893K02286K20796
58828E774765K40802K62853K87026L13359L42219L73583M06766M41648M79151
58819H922172N19712N62321O05813O49860O93637P34670P70143P98201Q16903
$$ plain form
58888 11333362 10783886 10273221 9800180 9361992 8956151 8580712 8232954 7909079 7605339
58879 7605339 7318712 7046839 6788363 6543121 6311015 6091008 5882146 5684964 5500663
58870 5500663 5329349 5170272 5023151 4887690 4762228 4644651 4534650 4433577 4342061 4259230
58860 4259230 4184221 4116927 4057117 4004253 3958381 3919845 3888000 3861589 3840632 3826648 3820733
58849 3820733 3822682 3832218 3849736 3875376 3908471 3948414 3995270 4049454 4111784 4183850 4267139 4361524
58837 4361524 4465766 4579769 4705323 4844436 4998062 5166790 5351683 5553969 5774765
58828 5774765 6015567 6278420 6565446 6878805 7221024 7594607 8001373 8443021 8922172
58819 8922172 9441884 10004205 10610018 11259878 11953515 12688185 13458328 14256529 15073432
58810A5073432Q22920Q12466P82587P30754O54611N53754M31050K91530J40912
58801B0294016j4102j65889l07764m34995n43525o29668o92426p34458p59129
58792A6012060p68011p62527p46061p22358o93183o59607o24189n89633n56211
58783I890280n22803m89714m58451m29291m01223l73979l48333l24690l02915
58774F238881k83223k65841k50153k35430k21846k09611j97936j86119j74780
58765D213942j64670j55173j45383j35721j26973j18723j10229j01938r4506q7364
58755B973262p9925p3177o8247o4304n9794n4926n0918m7594m3875m0053l7442
58744B353007l6085l4803l3221l1932l0972k9914k9191k9540l0393l0520l0049
$$ plain form
58810 15073432 15896352 16708818 17491405 18222159 18876770 19430524 19861574 20153104 20294016
58801 20294016 20279914 20114025 19806261 19371266 18827741 18198073 17505647 16771189 16012060
58792 16012060 15244049 14481522 13735461 13013103 12319920 11660313 11036124 10446491 9890280
58783 9890280 9367477 8877763 8419312 7990021 7588798 7214819 6866486 6541796 6238881
58774 6238881 5955658 5689817 5439664 5204234 4982388 4772777 4574841 4388722 4213942
58765 4213942 4049272 3894099 3748716 3612995 3486022 3367299 3257070 3155132 3060626 2973262
58755 2973262 2893337 2820160 2751913 2687609 2627815 2572889 2521971 2474377 2430502 2390449 2353007
58744 2353007 2316922 2282119 2248898 2216966 2185994 2156080 2126889 2097349 2066956 2036436 2006387
58733B006387l0118l0746l0798l0002k9349k9484l0100l0938l2050l3151l3831
58722A665820l4245l4638l4572l3646l2398l1406l0259k8551k7024k6344k5622
58711A327115k3777k1481k0136j9591j8634j7147j5980j5233j4328j3388j2930
58700A134490j2613j1837j1068j1097j1431j1014j0072r733j0237j0879j1275
58689A013234j1408j1107j0613j0840j1859j2255j1310j0396j0572j0432q436
58678H94006n917n135n569m899k873j367j068q89m44m69p97l82O11J037J116K251
58662H69212M421N998O292O165O024N222L805K942L256M260N555P101Q458R291
58648I48002J0329J2310J4483J5761J6721J8672K1419K3933K6485K9834L3060
$$ plain form
58733 2006387 1976269 1945523 1914725 1884723 1855374 1825890 1795790 1764852 1732802 1699651 1665820
58722 1665820 1631575 1596937 1562365 1528719 1496321 1464915 1434656 1406105 1379081 1352737 1327115
58711 1327115 1303338 1281857 1261721 1242130 1223496 1206349 1190369 1175136 1160808 1147420 1134490
58700 1134490 1121877 1110040 1098972 1087875 1076444 1065430 1055358 1045625 1035388 1024509 1013234
58689 1013234 1001826 990719 980106 969266 957407 945152 933842 923446 912874 902442 894006
58678 894006 888089 882954 877385 872486 869613 868246 867178 866289 865845 865376 864579 864197 864808 865845 866961 869212
58662 869212 873633 879631 885923 892088 898112 903334 907139 910081 913337 917597 923152 930253 938711 948002
58648 948002 958331 970641 985124 1000885 1017606 1036278 1057697 1081630 1108115 1137949 1171009
58637A171009L4773L6013L9264M4720N0206N4817N9976O6594P3775Q0894Q8777
58626A800818R8195J08959J20946J34310J48480J62622J77055J92659K08952K24485
58616C377481K38675K51338K60611K63402K57728K42886K17890J82088J37066
58607E429165Q5948L1231k4635p7355j22305j57840j84825k03501k13417k15941
58597D346525k13727k07770j97817j85468j73657j62933j51395j38656j26756
58588B788346j16680j07049r7147q8279q1154p4576o7709o1297n5763n0368m5032
58577A943292m0864l8220l6313l5110l5352l6351l6159l4410l2578l1120k8853
58566A557962k5722k3491k2988k3039k2763k2626k2699k2258k1670k2226k3567
$$ plain form
58637 1171009 1205782 1241795 1281059 1325779 1375985 1430802 1490778 1557372 1631147 1712041 1800818
58626 1800818 1899013 2007972 2128918 2263228 2411708 2574330 2751385 2944044 3152996 3377481
58616 3377481 3616156 3867494 4128105 4391507 4649235 4892121 5110011 5292099 5429165
58607 5429165 5515113 5546344 5521709 5444354 5322049 5164209 4979384 4775883 4562466 4346525
58597 4346525 4132798 3925028 3727211 3541743 3368086 3205153 3053758 2915102 2788346
58588 2788346 2671666 2564617 2467470 2379191 2298037 2223461 2155752 2094455 2038692 1988324 1943292
58577 1943292 1902428 1864208 1827895 1792785 1757433 1721082 1684923 1650513 1617935 1586815 1557962
58566 1557962 1532240 1508749 1485761 1462722 1439959 1417333 1394634 1372376 1350706 1328480 1304913
58555A304913k3737k2243k0661j9721j8376j6235j4359j3054j1459r840r622j0637
58543A114969j0976j0162r751j0256j0294r430r048r644j0054j0054j0910j2578
58531I91812j3243j2422j1745j1930j1851j1276j1530j2580j2615j1365j0782
58520H60473j1454j1557j0351r451r533r017p302o030n818n010l069j913k363
58507G67605k552j504r70j919k437j086O49J282J685K649K996K132J711K688L482
58492G76411K908K323K904L513L146K812L109K745J296O54J737K593J787Q98J501
58477H10337K453K361K032K265J793k78k387l113l515m889o482p310p886q415
58463G76966p819o193n570o557p076o079n412o142o364m782l252l390l812l115
$$ plain form
58555 1304913 1281176 1258933 1238272 1218551 1200175 1183940 1169581 1156527 1145068 1135228 1125606 1114969
58543 1114969 1103993 1093831 1084080 1073824 1063530 1054100 1045052 1035408 1025354 1015300 1004390 991812
58531 991812 978569 966147 954402 942472 930621 919345 907815 895235 882620 871255 860473
58520 860473 849019 837462 827111 817660 808127 799110 791808 785778 779960 774950 771881 769968 767605
58507 767605 765053 763549 762579 760660 758223 757137 757786 759068 760753 763402 766398 768530 770241 772929 776411
58492 776411 779319 781642 784546 788059 791205 794017 797126 799871 801167 801821 803558 806151 807938 808836 810337
58477 810337 812790 815151 817183 819448 821241 820963 818576 815463 811948 807059 800577 793267 785381 776966
58463 776966 769147 762954 757384 750827 743751 737672 732260 726118 719754 714972 711720 708330 704518 701403
58449G01403k497k934k885j329j02n69j006J36J363J142P34J438K007J469J399
58434F99769K728L461K350J493K431L127J961J136K601M119L234J878K863M842
58420G37993N032M253M890O171N811M393M008M278L621K787L331M240L687K544
58406G97039K742L689L623K969L133L613L257K721K805K332M14j246j170q64j919
58391H23138k928k244j231j552j813k95J484J357L54N54J472J785K211L494M129
58376H29915L186K748M332N861N345M463N098N731M871M608O711Q654P701N611
58362I04835N096M999L411K137L319M901M312L392M752O486N696M086M780O470
58348I68672O127M715M860N560M602L502M690O480O139N234O501Q295P693O238
$$ plain form
58449 701403 698906 695972 693087 691758 691656 691087 690081 690217 691580 692722 693456 694894 696901 698370 699769
58434 699769 702497 705958 708308 709801 712232 715359 717320 718456 721057 725176 728410 730288 733151 737993
58420 737993 743025 747278 752168 758339 764150 768543 772551 776829 780450 783237 786568 790808 794495 797039
58406 797039 799781 803470 807093 810062 813195 816808 820065 822786 825591 827923 828337 827091 825921 825057 823138
58391 823138 820210 817966 816735 815183 813370 813075 814559 815916 816270 816824 818296 820081 822292 825786 829915
58376 829915 833101 835849 840181 846042 851387 855850 860948 866679 871550 876158 882869 891523 899224 904835
58362 904835 909931 914930 918341 920478 923797 928698 933010 936402 941154 947640 953336 957422 962202 968672
58348 968672 974799 979514 984374 989934 994536 998038 1002728 1009208 1015347 1020581 1027082 1035377 1043070 1049308
58334A049308O976Q659Q600Q293J0276J2414J1459R390R948J1723J1062R053R102
58321A176263J0339R993R525J1685J4292J3786J2166J3332J5444J4253J1234J0822
58309A323134J2180J1499R991J1594J4872J5334J3818J4642J7298J7902J7049
58298A479313J8251K0443J9997J8249J9067K1014K0055J7870J9032K2202K2645
58287A698138K1298K2602K5584K6068K5404K7840L1570L1917L0905L3781L8517
58276B013624L9136L7119L8616M2530M2566L9454L9586M2836M3391M1482M2609
58265B462949M6061M6016M3304M4229M8412M9578M7788M8904N2752N3888N3182
58254B997063N6332O2022O4136O4326O9291P7272Q0964Q2030Q8191R7665J01833
$$ plain form
58334 1049308 1056284 1064943 1073543 1081836 1092112 1104526 1115985 1125375 1135323 1147046 1158108 1167161 1176263
58321 1176263 1186602 1196595 1206120 1217805 1232097 1245883 1258049 1271381 1286825 1301078 1312312 1323134
58309 1323134 1335314 1346813 1356804 1368398 1383270 1398604 1412422 1427064 1444362 1462264 1479313
58298 1479313 1497564 1518007 1538004 1556253 1575320 1596334 1616389 1634259 1653291 1675493 1698138
58287 1698138 1719436 1742038 1767622 1793690 1819094 1846934 1878504 1910421 1941326 1975107 2013624
58276 2013624 2052760 2089879 2128495 2171025 2213591 2253045 2292631 2335467 2378858 2420340 2462949
58265 2462949 2509010 2555026 2598330 2642559 2690971 2740549 2788337 2837241 2889993 2943881 2997063
58254 2997063 3053395 3115417 3179553 3243879 3313170 3390442 3471406 3553436 3641627 3739292 3841125
58243C841125J01901J06838J16044J20736J21562J27529J38099J44190J46509
58234D964533J54538J67715J76664J82723J96275K15895K30064K39597K56582
58225F784586K80861L00557L16310L40849L73777M02157M27213M63643N11131
58216A0201084N54974N96781O54352P28997Q05138Q85123R90119J123393J269872
58207A7809833J436379J652942J929821K255363K638857L105534L643968M216048
58199C8688745M831303N554198O429099P464921Q701300J0205225J1987905J4029404
58191A07892100J6415121J9326531K2845548K6873359L1189887L5206889L7403962
58184B97153397L5414925K7481160J4248986j052002j4510212k3748489k8564086
$$ plain form
58243 3841125 3943026 4049864 4165908 4286644 4408206 4535735 4673834 4818024 4964533
58234 4964533 5119071 5286786 5463450 5646173 5842448 6058343 6288407 6528004 6784586
58225 6784586 7065447 7366004 7682314 8023163 8396940 8799097 9226310 9689953 10201084
58216 10201084 10756058 11352839 12007191 12736188 13541326 14426449 15416568 16539961 17809833
58207 17809833 19246212 20899154 22828975 25084338 27723195 30828729 34472697 38688745
58199 38688745 43520048 49074246 55503345 62968266 71669566 81874791 93862696 107892100
58191 107892100 124307221 143633752 166479300 193352659 224542546 259749435 297153397
58184 297153397 332568322 360049482 374298468 373246466 358736254 334987765 306423679
58177C06423679l0014667k9321668k7426922k4970067k2308382j9595425j6946673
58170A35839875j4507318j2364794j0501714q880131p499646o342656n341698
58163G0401918m446289l661380k980795k341802j688280j023818l58731L26718
58155E4227541R79396J364378J169835K81363j063474k412643l389638l873119
58147D7283639l959383l810656l545568l227251k894555k573961k274578j996620
58139B3001067j747060j535580j359160j205600j070748r58477q65600p82272
58131A3476570p07218o47572o02723n62851n24782m94855m73882m53318m29273
58122H580096m07182l89302l70192l47963l27929l11616k93450k71830k52672
$$ plain form
58177 306423679 276409012 247087344 219660422 194690355 172381973 152786548 135839875
58170 135839875 121332557 108967763 98466049 89585918 82086272 75743616 70401918
58163 70401918 65955629 62294249 59313454 56971652 55283372 54259554 53900823 54227541
58155 54227541 55206937 56571315 57741150 58022513 56959039 54546396 51156758 47283639
58147 47283639 43324256 39513600 35968032 32740781 29846226 27272265 24997687 23001067
58139 23001067 21254007 19718427 18359267 17153667 16082919 15124442 14258842 13476570
58131 13476570 12769352 12121780 11519057 10956206 10431424 9936569 9462687 9009369 8580096
58122 8580096 8172914 7783612 7413420 7065457 6737528 6425912 6132462 5860632 5607960
58113E607960k38824k26403k14406k07152k04280j98832j88559j78959j72235
58104C778310j63497j51024j39992j32449j23520j11382j01329r6099r1275q4244
58094B583499p8872p7327p5723p1802o8765o7881o5328n9973n6295n5997n4606
58083A850930n0031m6645m7075m7531m5192m2916m2747m1776l8324l5525l5053
58072A378115l3796l0200k7399k6818k5267k1610j9618k0790k1063j8153j5513
58061A117888j5444j4867j1781r498j0438j1804j1325j1444j3804j5313j3771
58050I78399j1957j2283j2621j1060r545r259p682l924j579k656l791k173j15
58037H89754q0l08Q73J454K66K4K066L017O05k038j927j222k549m004l240k148
$$ plain form
58113 5607960 5369136 5142733 4928327 4721175 4516895 4318063 4129504 3950545 3778310
58104 3778310 3614813 3463789 3323797 3191348 3067828 2956446 2855117 2759018 2667743 2583499
58094 2583499 2504627 2427300 2351577 2279775 2211010 2143129 2077801 2017828 1961533 1905536 1850930
58083 1850930 1800899 1754254 1707179 1659648 1614456 1571540 1528793 1487017 1448693 1413168 1378115
58072 1378115 1344319 1314119 1286720 1259902 1234635 1213025 1193407 1172617 1151554 1133401 1117888
58061 1117888 1102444 1087577 1075796 1066298 1055860 1044056 1032731 1021287 1007483 992170 978399
58050 978399 966442 954159 941538 930478 920933 911674 903992 900068 898489 895833 892042 889869 889754
58037 889754 889674 889366 890239 891693 891959 891983 894049 897066 897671 895633 893706 892484 889935 885931 882691 880543
58021H80543l105m568m545m588o223p301n952m397m894n657m687l875n208o654
58007H08889o013n162o293p409n976l748l562m308l523k156k470l617l532k903
57993G48217l356l859k723j110r43j331l52J526K844L832M905M866L416K799M202
57978G62933N224L903K211K366K745J030j444k240k062k728l350k474j658l000
57964G61456n097n288m181m201n258n477m738m124l241j363J98j38j398j765j510
57949G13875j603j297J01J046K10q64m12L19m71j643j344o86j673l389l737l338
57933F95094m081n339n139l883l423l724l607l609m812o027n388l627k634k011
57919F37790k16K030K774K358K668L732M109L852M163M883N098N312O370P327
$$ plain form
58021 880543 877438 872870 868325 863737 857514 850213 844261 839864 834970 829313 824626 820751 815543 808889
58007 808889 802876 797714 791421 784012 778036 774288 770726 766418 762895 760739 758269 754652 751120 748217
57993 748217 744861 741002 738279 737169 736226 734895 734543 736069 738913 742745 747650 752516 755932 758731 762933
57978 762933 768157 772060 774271 776637 779382 780412 778968 776728 774666 771938 768588 766114 764456 761456
57964 761456 756359 751071 746890 742689 737431 731954 727216 723092 719851 718488 718686 718548 717150 715385 713875
57949 713875 712272 710975 711076 712122 712332 711468 711056 711375 710904 709261 707917 707231 705558 702169 698432 695094
57933 695094 691013 685674 680535 676652 673229 669505 665898 662289 657477 651450 646062 642435 639801 637790
57919 637790 637574 639604 642378 644736 647404 651136 655245 659097 663260 668143 673241 678553 684923 692250
57905F92250P045O627P388P898O238L757L093L598K484k86k083k120k192k978
57891G30719l167k512k498l509m163l970m042m767n086m447l505k648j651p40
57877F84014l07J93J406K634K940K939L744M883N187M885M879M911M432M284N296
57862G36320O314N819M471L740L203J724Q9k95k32j403l150l598l161l787n295
57847G40759n682m687m025m205m043l279k845k637j746q03j344k834l159k061
57833F97409j379j840k337k539l489n198o241o166n992o029n531m700m742n608
57819F35618n931n440n151n071m052k277j455k108k801k556j979j626j208p27
57805E93236n58j65J332L283M167M111M699O184P215P383P768Q640Q921Q320P838
$$ plain form
57905 692250 699295 705922 713310 721208 727446 731203 734296 737894 740378 740092 738009 735889 733697 730719
57891 730719 727552 725040 722542 719033 714870 710900 706858 702091 697005 692558 689053 686405 684754 684014
57877 684014 683707 683900 685306 687940 690880 693819 697563 702446 707633 712518 717397 722308 726740 731024 736320
57862 736320 742634 748453 752924 756664 759867 761591 761680 761385 761153 759750 756600 753002 749841 746054 740759
57847 740759 735077 730390 726365 722160 718117 714838 711993 709356 707610 706807 705463 702629 699470 697409
57833 697409 696030 694190 691853 689314 685825 680627 674386 668220 662228 656199 650668 645968 641226 635618
57819 635618 629687 624247 619096 614025 609973 607696 606241 604133 601332 598776 596797 595171 593963 593236
57805 593236 592678 592513 593845 597128 601295 605406 610105 616289 623504 630887 638655 647295 656216 664536 672374
57790F72374P711O951N486M619M811M874L992K765J779Q73J92K79P26M47m91r49
57774G16439p77r84j713j931j362q32n45J97J296J802J757K208L232L802L769
57759G26358M096M883N208N103N627O662O798N726M772M585M397L961M188N261
57745G97625O114O274O447O769O455N588N269N598N502M979N399O974Q187Q418
57731H85598Q944J0423J1532J1215J0429J0480J1247J2052J2904J4014J5329J7115
57719A031282J9686K2257K3594K4037K5071K6737K7512K7212K7780L0441L4129
57708A319738L7536M0774M4199M7606N1447N6955O4112P1396P8340Q6362R6164
57697A994629J06436J16303J27046J39996J54487J69260J84279J99734K14632
$$ plain form
57790 672374 680085 687036 692522 697141 701952 706826 710818 713583 715362 716235 716427 716706 717432 717879 717388 716439
57774 716439 715662 714678 712965 711034 709672 708840 708295 708492 709788 711590 713347 715555 718787 722589 726358
57759 726358 730454 735337 740545 745648 751275 757937 764735 770461 775233 779818 784215 788176 792364 797625
57745 797625 803739 810013 816460 823229 829684 835272 840541 846139 851641 856620 862019 868993 877180 885598
57731 885598 894542 904965 916497 927712 938141 948621 959868 971920 984824 998838 1014167 1031282
57719 1031282 1050968 1073225 1096819 1120856 1145927 1172664 1200176 1227388 1255168 1285609 1319738
57708 1319738 1357274 1398048 1442247 1489853 1541300 1598255 1662367 1733763 1812103 1898465 1994629
57697 1994629 2101065 2217368 2344414 2484410 2638897 2808157 2992436 3192170 3406802
57688C406802K27688K38327K45650K47590K42082K28048K04764J71877J31041
57679E343869Q6066M0745k235l9989o9295q8830r9768j03167r8526q5930o7977
57668D814963m8972l4305l1028m5361p6740j15763j50354j73330j83592j82860
57658C772658j73958j60631j45907j30566j14474r8541q4000p0807n8363m6891
57648B688520l6748k7259j7716q521j19Q228J7330K6789L6107M5896N6649O7518
57636B856674P7749Q8295J00436J13823J27320J40799J54555J67933J80002J90590
57626D198176J99003K02699J99007J87485J69018J43405J09754O8981K4227k1038
57616E480717o4090j02498j34172j58137j74574j84269j88442j88439j84969j78240
$$ plain form
57688 3406802 3634490 3872817 4118467 4366057 4608139 4836187 5040951 5212828 5343869
57679 5343869 5429935 5470680 5468445 5428456 5359161 5270331 5170563 5067396 4968870 4882940 4814963
57668 4814963 4765991 4731686 4700658 4655297 4578557 4462794 4312440 4139110 3955518 3772658
57658 3772658 3598700 3438069 3292162 3161596 3047122 2948581 2864581 2793774 2735411 2688520
57648 2688520 2651772 2624513 2606797 2598276 2598157 2606385 2623715 2650504 2686611 2732507 2789156 2856674
57636 2856674 2934423 3022718 3123154 3236977 3364297 3505096 3659651 3827584 4007586 4198176
57626 4198176 4397179 4599878 4798885 4986370 5155388 5298793 5408547 5477528 5501755 5480717
57616 5480717 5416627 5314129 5179957 5021820 4847246 4662977 4474535 4286096 4101127 3922887
57606C922887j69280j59902j50808j41000j29968j19013j09391j00612r1898q3896
57596B667119p7450p1948o6412o1123n6554n1943m6653m1827l8776l6686l3895
57585B083852l0563k8080k6506k4649k2325k0402j8970j7227j5156j3532j2346
57574A854096j0787q730o811n120l217j265J19J044K179L643N105O651Q408R859
57560A855174J0669J1625J3519J5790J7608J9559K2607K6099K8597L0262L2598
57549B084107L6176M0389M5136N0931N7433O3761P0230P7964Q6840R5531J03786
57538B812284J12808J23144J33880J44223J54163J63091J69428J72239J71748
57529D157008J67575J57853J40956J17119Q7800N4485J8847j6795n0015p8927
$$ plain form
57606 3922887 3753607 3593705 3442897 3301897 3171929 3052916 2943525 2842913 2751015 2667119
57596 2667119 2589669 2517721 2451309 2390186 2333632 2281689 2235036 2193209 2154433 2117747 2083852
57585 2083852 2053289 2025209 1998703 1974054 1951729 1931327 1912357 1895130 1879974 1866442 1854096
57574 1854096 1843309 1834579 1827768 1822648 1819431 1818166 1818285 1819329 1821508 1825151 1830256 1836907 1845315 1855174
57560 1855174 1865843 1877468 1890987 1906777 1924385 1943944 1966551 1992650 2021247 2051509 2084107
57549 2084107 2120283 2160672 2205808 2256739 2314172 2377933 2448163 2526127 2612967 2708498 2812284
57538 2812284 2925092 3048236 3182116 3326339 3480502 3643593 3813021 3985260 4157008
57529 4157008 4324583 4482436 4623392 4740511 4828311 4882796 4901643 4884848 4834833 4755906
57519D755906j02152j18927j29583j35222j36648j34191j28596j21304j13551
57510C635732j05774r7954q9976q1676p3203o5244n8277n1866m5383l9112l3674
57499B893593k8726k3383j7764j2914r122n523j450K977P743J3196J9006K4072
57487B861705K8033L2076L7570M4524N1939N9192O6561P4664Q3749R3539J03581
57476C537133J13722J24025J34203J43593J51806J58644J63043J62895J56665
57467D845729J44438J26609J02459P1379L5091k632l8382p0360r7592j19243j34868
57456D862628j44511j48539j47873j44070j38407j31121j22299j12895j04014
57447C668899r5654q7221p8872p1310o4607n8380n2716m7906m3578l9231l5218
$$ plain form
57519 4755906 4653754 4534827 4405244 4270022 4133374 3999183 3870587 3749283 3635732
57510 3635732 3529958 3432004 3342028 3260352 3187149 3121905 3063628 3011762 2966379 2927267 2893593
57499 2893593 2864867 2841484 2823720 2810806 2801684 2796161 2794711 2797688 2805431 2818627 2837633 2861705
57487 2861705 2889738 2921814 2959384 3003908 3055847 3115039 3181600 3256264 3340013 3433552 3537133
57476 3537133 3650855 3774880 3909083 4052676 4204482 4363126 4526169 4689064 4845729
57467 4845729 4990167 5116776 5219235 5290614 5325705 5323073 5284691 5214331 5116739 4997496 4862628
57456 4862628 4718117 4569578 4421705 4277635 4139228 4008107 3885808 3772913 3668899
57447 3668899 3573245 3486024 3407152 3335842 3271235 3212855 3160139 3112233 3068655 3029424 2994206
57436B994206l2089k9338k6073k2532j9675j7630j5801j4171j3097j2160j0620
57425B781020q744p277n935l964j828o92l98J92J068J174P18J266L143M734M959
57410B769436M725N128N934O616P403Q374Q845Q650Q824J0008J1216J1225J0406
57397B876790J0178J1201J2800J3896J3957J3398J3163J3633J4097J3822J3295
57386C020230J3480J4232J4636J4619J4891J5383J5266J4586J4364J4922J5522
57375C182131J5870J6427J7023J6813J5935J5653J6365J7053J7205J7626J8700
57364C366801J9482J9288J8709J8264J7572J6650J6491J7389J8209J8241J8367
57353C565463J9302K0191K0163J9879K0263K0931K1199K1480K2190K2509K1649
$$ plain form
57436 2994206 2962117 2932779 2906706 2884174 2864499 2846869 2831068 2816897 2803800 2791640 2781020
57425 2781020 2772276 2764999 2759064 2755100 2753272 2752580 2752182 2752374 2753442 2754616 2755334 2756600 2759743 2764477 2769436
57410 2769436 2774161 2779289 2785223 2791839 2799242 2807616 2816461 2825111 2833935 2843943 2855159 2866384 2876790
57397 2876790 2886968 2898169 2910969 2924865 2938822 2952220 2965383 2979016 2993113 3006935 3020230
57386 3020230 3033710 3047942 3062578 3077197 3092088 3107471 3122737 3137323 3151687 3166609 3182131
57375 3182131 3198001 3214428 3231451 3248264 3264199 3279852 3296217 3313270 3330475 3348101 3366801
57364 3366801 3386283 3405571 3424280 3442544 3460116 3476766 3493257 3510646 3528855 3547096 3565463
57353 3565463 3584765 3604956 3625119 3644998 3665261 3686192 3707391 3728871 3751061 3773570 3795219
57342C795219K0548K0642K1685K2282K2050K1811K2053K2461K2737K2733K2187
57331D036408K1239K0877K1760K3048K3334K2484K1631K1633K2387K3328K3892
57320D282021K3763K3328K3508K4608K5826K6446K6726K7009K6844K5965K5303
57309D561347K5875K7185K7974K8109K8581K9805L1075L1726L1921L2210L2882
57298D888690L3912L5061L6129L7246L8670M0125M0932M1044M1270M2090M2990
57287E318159M3432M3649M3910M3803M2908M1388L9258L5950L1352K6429K1890
57276E732128J7092J1365N580J139k071n352r101j2244j3773j3864j3368j2904
57264E684627j2471j1520r542o951m889l838k978j453M27J896K940L899M535M438
$$ plain form
57342 3795219 3815767 3836409 3858094 3880376 3902426 3924237 3946290 3968751 3991488 4014221 4036408
57331 4036408 4057647 4078524 4100284 4123332 4146666 4169150 4190781 4212414 4234801 4258129 4282021
57320 4282021 4305784 4329112 4352620 4377228 4403054 4429500 4456226 4483235 4510079 4536044 4561347
57309 4561347 4587222 4614407 4642381 4670490 4699071 4728876 4759951 4791677 4823598 4855808 4888690
57298 4888690 4922602 4957663 4993792 5031038 5069708 5109833 5150765 5191809 5233079 5275169 5318159
57287 5318159 5361591 5405240 5449150 5492953 5535861 5577249 5616507 5652457 5683809 5710238 5732128
57276 5732128 5749220 5760585 5766165 5767304 5765233 5759881 5750780 5738536 5724763 5710899 5697531 5684627
57264 5684627 5672156 5660636 5651094 5644143 5639254 5635416 5632438 5630985 5631412 5633308 5636248 5640147 5644682 5649120
57250E649120L965L825M053M183M159M239M302M002L405K927K808L100L695M054
57236E701837L463K049R24Q32J362J926K617L485L965L808L641L767L509K644
57222E739829K329L337M407L858J988L50n87j485k396k845l254m582o591q082
57208E726276q860r967j1867j3804j5217j6434j7662j8492j8878j9560k1089k3066
57196E531380k4718k5651k5957k6074k6559k7516k8407k8826k9105k9675l0275
57185E228617l0465l0396l0313k9979k9368k9258l0075l0819l0325k9075k8477
57174D900067k8811k9165k9062k8818k8503k7902k7315k7208k7214k6599k5602
57163D593868k5124k5348k5768k6262k6936k7249k6639k5770k5781k6550k7070
$$ plain form
57250 5649120 5653085 5656910 5660963 5665146 5669305 5673544 5677846 5681848 5685253 5688180 5690988 5694088 5697783 5701837
57236 5701837 5705300 5707349 5708273 5709105 5710467 5712393 5715010 5718495 5722460 5726268 5729909 5733676 5737185 5739829
57222 5739829 5742158 5745495 5749902 5753760 5755748 5756098 5755511 5754026 5751630 5748785 5745531 5740949 5734358 5726276
57208 5726276 5717416 5707449 5695582 5681778 5666561 5650127 5632465 5613973 5595095 5575535 5554446 5531380
57196 5531380 5506662 5481011 5455054 5428980 5402421 5374905 5346498 5317672 5288567 5258892 5228617
57185 5228617 5198152 5167756 5137443 5107464 5078096 5048838 5018763 4987944 4957619 4928544 4900067
57174 4900067 4871256 4842091 4813029 4784211 4755708 4727806 4700491 4673283 4646069 4619470 4593868
57163 4593868 4568744 4543396 4517628 4491366 4464430 4437181 4410542 4384772 4358991 4332441 4305371
57152D305371k7306k8101k9341k9887k9398k8789k8756k9180l0040l1491l3014
57141C980068l3940l4849l6916l9836m2028m3051m4181m6282m8699n0718n2479
57130C507089n3854n3942n2381m9952m7319m4136l9950l4908k9299k3413j8003
57119C059932j3765j0239o440k570L38K343M681P829J1281J5520K2359L2975M7227
57106C171471O5336Q8482J17292J51684J92665K42499L02465L72302M52272N43889
57096E700357O48272P66182R00101J053334J225846J413333J611053J815083K018019
57087A7151580K206445K363791K471383K505532K443154K281436K050769J796601
57079C5270691J540990J263949R25613N05837K3483m75411r41769j339430j648659
$$ plain form
57152 4305371 4278065 4249964 4220623 4190736 4161338 4132549 4103793 4074613 4044573 4013082 3980068
57141 3980068 3946128 3911279 3874363 3834527 3792499 3749448 3705267 3658985 3610286 3559568 3507089
57130 3507089 3453235 3399293 3346912 3296960 3249641 3205505 3165555 3130647 3101348 3077935 3059932
57119 3059932 3046167 3035928 3029488 3026918 3027256 3029599 3034280 3042109 3053390 3068910 3091269 3124244 3171471
57106 3171471 3236807 3325289 3442581 3594265 3786930 4029429 4331894 4704196 5156468 5700357
57096 5700357 6348629 7114811 8014912 9068246 10294092 11707425 13318478 15133561 17151580
57087 17151580 19358025 21721816 24193199 26698731 29141885 31423321 33474090 35270691
57079 35270691 36811681 38075630 39001243 39507080 39530563 39055152 38113383 36773953 35125294
57070C5125294j863401j987461k030789k005705j924102j796959j635892j454189
57062B0426796j265526j081481r10110p55694o18898m98068l92236l03104k32957
57053A4368722j80684j41194j09356q3466o4355n2012m4159l7815l1355k4758
57043A3599568j8334j1777m571L101J0584J7840K5580L4069M2452M9783N6120
57032A3804415O1915O6769O9555O9814O8795O9398P4932Q6621J01365J12634J15228
57021A4701441J09836J02646R9753J00754R6799P5961L3743j9720o4267q4225
57011A5152721p9615o3817n2150n3432o8984r4539j21809j41719j49128j44340
57001A4183188j29989j08800q6290p3686q3900j22010j79916k41175k91472l25218
$$ plain form
57070 35125294 33261893 31274432 29243643 27237938 25313836 23516877 21880985 20426796
57062 20426796 19161270 18079789 17169679 16413985 15795087 15297019 14904783 14601679 14368722
57053 14368722 14188038 14046844 13937488 13854022 13789667 13737655 13693496 13655681 13624326 13599568
57043 13599568 13581234 13569457 13564886 13567987 13578571 13596411 13621991 13656060 13698512 13748295 13804415
57032 13804415 13866330 13933099 14002654 14072468 14141263 14210661 14285593 14372214 14473579 14586213 14701441
57021 14701441 14811277 14913923 15013676 15114430 15211229 15287190 15320933 15301213 15236946 15152721
57011 15152721 15073106 15009289 14957139 14903707 14834723 14740184 14618375 14476656 14327528 14183188
57001 14183188 14053199 13944399 13858109 13784423 13700523 13578513 13398597 13157422 12865950 12540732
56991A2540732l44326l53125l54998l51948l44807l33257l16688k95915k73648
56982I572020k53029k36102k23738k16105k12539k11575k11731k12038k11596
56973G583567k09450k05472k00766j96426j92339j87716j82251j76149j69565
56964E863433j62768j56358j50556j44631j37756j30058j22324j15102j08768
56955D635112j04023j01479j01046j02198j04401j06750j07864j06965j04651
56946C695735j01888r8804r5184r1386q7837q4278q0426p6881p4286p2149o9649
56935B762967o6991o4771o2439n8878n4346n0545m8942n0207n4959o3277p3200
56924B114412q1226q4962q4483q1007p5403o8466o1419n5369n0659m7061m4122
$$ plain form
56991 12540732 12196406 11843281 11488283 11136335 10791528 10458271 10141583 9845668 9572020
56982 9572020 9318991 9082889 8859151 8643046 8430507 8218932 8007201 7795163 7583567
56973 7583567 7374117 7168645 6967879 6771453 6579114 6391398 6209147 6032998 5863433
56964 5863433 5700665 5544307 5393751 5249120 5111364 4981306 4858982 4743880 4635112
56955 4635112 4531089 4429610 4328564 4226366 4121965 4015215 3907351 3800386 3695735
56946 3695735 3593847 3495043 3399859 3308473 3220636 3136358 3055932 2979051 2904765 2832616 2762967
56935 2762967 2695976 2631205 2568766 2509888 2455542 2404997 2356055 2305848 2250889 2187612 2114412
56924 2114412 2033186 1948224 1863741 1782734 1707331 1638865 1577446 1522077 1471418 1424357 1380235
56913A380235m1316l8565l6603l6084l6352l6004l4702l3403l2715l2031l0653
56902I91807k8783k6933k5099k3053k0920j8965j7245j5689j4240j2772j1229
56891G76879r833q706p453n584l182n92K171M798N776L372k259q831j4084j7366
56877G15106j9086j9625j9222j8081j6084j2991r173n637k926n81K167N679J0046
56864F09592J5262K1034K6932L2997L9618M6370N1212N1125M3756K9072J0092
56853I77062q290k2103l0362l4288l5095l3239k9300k4316j9043j3634q077k351
56841G16964L849J0723J7896K5104L3111M2977N4496O6306P7134Q5384Q7471P8609
56829A300024N6775K5555p614l5741n5137o5517o8625o6660o1423n4376m6852
$$ plain form
56913 1380235 1338919 1300354 1263751 1227667 1191315 1155311 1120609 1087206 1054491 1022460 991807
56902 991807 963024 936091 910992 887939 867019 848054 830809 815120 800880 788108 776879
56891 776879 767046 758340 750887 745303 742121 741529 743700 748498 754274 757646 755387 746556 732472 715106
56877 715106 696020 676395 657173 639092 623008 610017 600844 595207 592281 591700 593867 599546 609592
56864 609592 624854 645888 672820 705817 745435 791805 843017 894142 937898 966970 977062
56853 977062 968772 946669 916307 882019 846924 813685 784385 760069 741026 727392 719315 716964
56841 716964 720813 731536 749432 774536 807647 850624 905120 971426 1048560 1133944 1221415 1300024
56829 1300024 1356799 1382354 1374740 1338999 1283862 1218345 1149720 1083060 1021637 967261 920409
56818I20409l9522l2088k4228j6561r786l261M329J3026K1589K9557L7887M7065
56806I48416N5426N9646N6181M2692J9974o856l0612m6654n4933n7657n6479n2544
56794H76600m7440m2453l7494l1917k5899k0187j4980r928m854K67N632J1293
56782F58640J6821K1782K5969K8549K7536K1096R545m396j7335k7034l3011l5908
56770F92254l6563l5568l3505l1065k8578k5730k2284j8813j6120j4237j2672
56759D17119j1343j0418r582q375p138o577o537o267n676n232m813l969l179l423
56745C24590m444m974m784m907n558n611m626l755l807m031l670l223l196k946
56731B65058j998j226j588k593l175l221l184k997k457j979j988k146j951j501
$$ plain form
56818 920409 880887 848799 824571 808010 798224 794963 799292 812318 833907 863464 901351 948416
56806 948416 1003842 1063488 1119669 1162361 1182335 1175479 1144867 1098213 1043280 985623 929144 876600
56794 876600 829160 786707 749213 717296 691397 671210 656230 646302 641448 641715 647347 658640
56782 658640 675461 697243 723212 751761 779297 800393 809938 805542 788207 761173 728162 692254
56770 692254 655691 620123 586618 555553 526975 501245 478961 460148 444028 429791 417119
56759 417119 405776 395358 385776 377401 370263 363686 357149 350882 345206 339974 335161 331192 328013 324590
56745 324590 320146 315172 310388 305481 299923 294312 289686 285931 282124 278093 274423 271200 268004 265058
56731 265058 263060 261834 260246 257653 254478 251257 248073 245076 242619 240640 238652 236506 234555 233054
56717B33054j007k90N33P72J78n16p98j112j742j994j375o16o28j247j893k503
56701B18816l008k800j750q46q51j200j150j071j513j933j495m73L17P41J000
56686B02784Q19J05l74p9K62j51p37n00K20L47j64m26j63R7R5Qk04o55r96r05
56666A99383p12q09r18p39p28j262j657j047K47J219J585J702J593J036K53l36
56650A98810o97q84o93k54k71r75j644j791j899k188j868n83N58N80Q7j32p00
56633A85456k227l511l000j295k19j43q7J03k94j087j297r88j108j614j463n59
56617A66667K3r5j31K76N05K23k4J28L79N61Q99J348J540J393J004K27p71j034
56599A73118K4J441J868J421J110R52K25p62r02j71K76m3m08k68K01Q90J869K650
$$ plain form
56717 233054 232047 231757 232290 233062 233240 232724 231926 230814 229072 227078 225703 225087 224459 223212 221319 218816
56701 218816 215808 213008 211258 210412 209561 208361 207211 206140 204627 202694 201199 200726 201043 201784 202784
56686 202784 203603 203708 203334 203255 203517 203366 202629 202129 202349 202696 202532 202106 201943 202040 202135 202143 201939 201284 200288 199383
56666 199383 198671 197862 196944 196205 195477 194215 192558 191511 191758 192977 194562 196264 197857 198893 199146 198810
56650 198810 198113 197229 196536 196282 196011 195036 193392 191601 189702 187514 185646 185063 185621 186201 186288 186156 185456
56633 185456 183229 179718 176718 175423 175204 175061 174974 175077 174783 173696 172399 171411 170303 168689 167226 166667
56617 166667 166690 166595 166464 166740 167245 167468 167444 167572 167951 168512 169411 170759 172299 173692 174696 174923 174152 173118
56599 173118 173142 174583 176451 177872 178982 179934 180159 179397 178495 178324 178600 178557 178149 177881 178082 178972 180841 183491
56581A83491K613K090J860J779J184M00L85J078J608J980K944M250M688M046L389
56566B17785L208K870K216K176L272M735N568N547M913M096L816M445N220N119
56552B74986M311L686L283K512J642J450J571Q03q97k305k837l086l406l486l330
56537B74897l182k536q99N79J37j851l123k794k294k638k837j974r60j043j923
56522B47559k471k343j963j731j800k043j947j353j176k275l813m157l282k684
56508B14521k923l060k710k731l347l473k553j491j050q19m27k78m33j74O32J110
56492A90794Q77O37P96Q75P61J115J960K354K019J832K203K443K265K339K828
56477B16098K960K599K648L282L458K859K536K902K926K225K036L022L850L288
$$ plain form
56581 183491 186104 188194 190054 191833 193017 193417 193802 194880 196488 198468 201412 205662 210350 214396 217785
56566 217785 220993 223863 226079 228255 231527 236262 241830 247377 252290 256386 260202 264647 269867 274986
56552 274986 279297 282983 286266 288778 290420 291870 293441 294244 293347 291042 288205 285119 281713 278227 274897
56537 274897 271715 269179 268280 268859 268996 267145 264022 261228 258934 256296 253459 251485 250525 249482 247559
56522 247559 245088 242745 240782 239051 237251 235208 233261 231908 230732 228457 224644 220487 217205 214521
56508 214521 211598 208538 205828 203097 199750 196277 193724 192233 191183 190364 189937 189659 189226 189052 189684 190794
56492 190794 191671 192308 193104 193979 194740 195855 197815 200169 202188 204020 206223 208666 210931 213270 216098
56477 216098 219058 221657 224305 227587 231045 233904 236440 239342 242268 244493 246529 249551 253401 256689
56463B56689K149J814K111K108J823J823K028K020J816J489R15M61Q88J942K312
56448B82388J566P85O98O05nl65J23P78Q85P93Q22M23n48j131q50o98j487k458
56430B82324k579k145k015k333k813l347l642l325k893l283m073l778k329j487
56416B42282j990k370j559o62p53r13K2J309J654J306J257J506J612J797K225
56401B46723K226J494R10J058J187P07M11J030J847J942J516R72J07p20k49J607
56385B62768K983K692K008K405L194L077K457K391K554K091J433J477J985K180
56371B95695K076J856J138P1j16J035K076J697N25l44j032j710j451Q8J434J439
56355C04477J130J736K488K147J247Q83Q08N74J021K617L829L241J952J775K498
$$ plain form
56463 256689 258838 260652 262763 264871 266694 268517 270545 272565 274381 275870 276785 277246 278134 280076 282388
56448 282388 283954 284739 285437 286042 286037 285672 285795 286573 287458 288251 289073 289496 288948 287817 286967 286269 284782 282324
56430 282324 279745 277600 275585 273252 270439 267092 263450 260125 257232 253949 249876 246098 243769 242282
56416 242282 240292 237922 236363 235701 234948 234035 234057 235366 237020 238326 239583 241089 242701 244498 246723
56401 246723 248949 250443 251353 252411 253598 254305 254716 255746 257593 259535 261051 262023 262130 261410 261161 262768
56385 262768 265751 268443 270451 272856 276050 279127 281584 283975 286529 288620 290053 291530 293515 295695
56371 295695 297771 299627 300765 300836 300720 301755 303831 305528 306053 305709 304677 302967 301516 301604 303038 304477
56355 304477 305607 307343 309831 311978 313225 314108 314916 315490 316511 319128 322957 326198 328150 329925 332423
56340C32423L028L686N075O076N505M545M979O151O237N512N619O475O625O153
56326D08089O479P572P845O836N782N534N679N610M956L398J447O87J707K768
56312D74389K136O60K22Q06J117J013J085R18ln33O19K467L068K558K527L163
56296D96212L406L309L879N000N654N808O114O432O606P767J0647J3480J4054
56283E88368J3147J3397J5401J7487J8835K0324K2398K4539K6837K9950L3634
56272H24317L7034M0201M3683M7276N0887N5714O2634P0374P7353Q4302R2830
56261A486605J02500J11768J20790J30626J40598J49049J56035J62541J67777
56252B728289J69897J68857J65800J60227J50479J36594J20020J01094P9395N6151
$$ plain form
56340 332423 335451 339137 344212 350288 355793 360338 365317 371468 377705 383217 388836 395311 401936 408089
56326 408089 414568 422140 429985 436821 442603 448137 453816 459426 464382 467780 469227 469914 471621 474389
56312 474389 476525 477185 477407 478213 479330 480343 481428 482346 482343 481810 482429 484896 487964 490522 493049 496212
56296 496212 499618 502927 506806 511806 517460 523268 529382 535814 542420 550187 560834 574314 588368
56283 588368 601515 614912 630313 647800 666635 686959 709357 733896 760733 790683 824317
56272 824317 861351 901552 945235 992511 1043398 1099112 1161746 1232120 1309473 1393775 1486605
56261 1486605 1589105 1700873 1821663 1952289 2092887 2241936 2397971 2560512 2728289
56252 2728289 2898186 3067043 3232843 3393070 3543549 3680143 3800163 3901257 3980652 4036803
56242D036803L3615J2506p492k5400l9763n1156o1177o9585p5161p8683q2162
56231C592345q5753q8283r0184r2888r5957r7902r9243j01570j04165j04855j03770
56220B527775j02967j02736j01501r9110r6749r4044q9600q4217q0042p6750p2100
56209A527959o6146o1227n7746n3768m8966m5190m2691l9488l5073l1296k8837
56198A017531k6216k3018k0782j9930j8909j7075j5527j4495j2874j0799r721
56187H28185r441q129n687m085l897l475k069p75pJ104K378K545J785J548J817
56172H01797J367N81R29J892J703Q04J159K383K315J199J305K565K680J686K149
56157H26514M426O063O409P641J0380J2487J3192J4480J7338K0333K2800K5926
$$ plain form
56242 4036803 4070418 4082924 4075432 4050032 4010269 3959113 3897936 3828351 3753190 3674507 3592345
56231 3592345 3506592 3418309 3328125 3235237 3139280 3041378 2942135 2840565 2736400 2631545 2527775
56220 2527775 2424808 2322072 2220571 2121461 2024712 1930668 1841068 1756851 1676809 1600059 1527959
56209 1527959 1461813 1400586 1342840 1289072 1240106 1194916 1152225 1112737 1077664 1046368 1017531
56198 1017531 991315 968297 947515 927585 908676 891601 876074 861579 848705 837906 828185
56187 828185 818744 810615 804928 800843 796946 793471 791402 790627 790620 791724 794102 796647 798432 799980 801797
56172 801797 803164 803745 804674 806566 808269 809073 810232 812615 814930 816129 817434 819999 822679 824365 826514
56157 826514 830940 837003 843412 851053 861433 873920 887112 901592 918930 939263 962063 987989
56145I87989K9900L3611L7651M3927N1941N9303O6284P5699Q7828R9586J09110
56134A682829J16834J21647J20682J13870J04458R4339Q3204P2623O5905O2842
56124B639233N9267N2849M4854L5568K3242Q783l593j1921j8233k3920k8411l3441
56112B744277m3113n7823p2867q4608r3313r8872r9273r5021q9841q5089p8409
56101A846048o9412o1461n6146n1191m5536m1183l8446l4753k9857k6764k5850
56090A365449k3700j9425j6323j5514j3907j0405q032p807o697l786k244l016
56078A234593k815n69O17Q6J358M971O612N034M592P199R027Q287Q651J1606J3031
56063A312280J1122J0159J2412J3865J2172J1235J3571J5554J4789J4702J7225
$$ plain form
56145 987989 1017889 1051500 1089151 1133078 1185019 1244322 1310606 1386305 1474133 1573719 1682829
56134 1682829 1799663 1921310 2041992 2155862 2260320 2354659 2437863 2510486 2576391 2639233
56124 2639233 2698500 2751349 2796203 2831771 2855013 2863796 2860203 2848282 2830049 2806129 2777718 2744277
56112 2744277 2701164 2643341 2570474 2485866 2392553 2293681 2194408 2099387 2009546 1924457 1846048
56101 1846048 1776636 1715175 1659029 1607838 1562302 1521119 1482673 1447920 1418063 1391299 1365449
56090 1365449 1341749 1322324 1306001 1290487 1276580 1266175 1258143 1250336 1243639 1239853 1237609 1234593
56078 1234593 1231778 1231209 1231826 1231912 1233270 1238241 1244853 1249887 1254479 1261678 1270705 1278992 1287643 1299249 1312280
56063 1312280 1323402 1333561 1345973 1359838 1372010 1383245 1396816 1412370 1427159 1441861 1459086
56052A459086J8433J6293J5203J7855K0080J8842J7896K0328K2920K3038K3667
56041A673641K6544K8005K6680K7279L1677L4528L3034L2356L5706L8260L6971
56030B024681L7097M2146M6606M5876M4382M6565M8753M7519M7011N0320N2581
56019B533537N0428M9217N3048N6925N6679N6915O1171O4325O3247O4369P1873
56008C181734P9115Q0902Q3178R0888R7840R8897J00495J08252J15949J18004
55998D155254J20837J30209J39704J43737J49170J61525J73011J77356J82838
55989E533641J96825K11643K20174K30540K50105K70414K84066L00554L28321
55980G826283L57910L80889M07905M48895M93944N34084N81608O47994P22335
$$ plain form
56052 1459086 1477519 1493812 1509015 1526870 1546950 1565792 1583688 1604016 1626936 1649974 1673641
56041 1673641 1700185 1728190 1754870 1782149 1813826 1848354 1881388 1913744 1949450 1987710 2024681
56030 2024681 2061778 2103924 2150530 2196406 2240788 2287353 2336106 2383625 2430636 2480956 2533537
56019 2533537 2583965 2633182 2686230 2743155 2799834 2856749 2917920 2982245 3045492 3109861 3181734
56008 3181734 3260849 3341751 3424929 3515817 3613657 3712554 3813049 3921301 4037250 4155254
55998 4155254 4276091 4406300 4546004 4689741 4838911 5000436 5173447 5350803 5533641
55989 5533641 5730466 5942109 6162283 6392823 6642928 6913342 7197408 7497962 7826283
55980 7826283 8184193 8565082 8972987 9421882 9915826 10449910 11031518 11679512 12401847
55971A2401847P95025Q81069R95236J127839J272422J452191J689580J976789
55963B2591998K307545K705628L184865L716225M279686M915862N681429O594036
55955E5977274P671534Q973733J0539978J2346515J4413600J6893320J9942219
55948A46758173K3556432K7594273L1717315L4927056L5237675L0482595K0084504
55941C50358023O087491p847768j8646320k5197759k8053833k8351676k7108501
55934B21239657k5060702k2669023k0157822j7646872j5267712j3134461j1273417
55927I6029648r658646q284801p151928o218464n429391m767687m232779l794180
55919D6491772l410859l074727k794529k556065k335377k133513j962914j814382
$$ plain form
55971 12401847 13196872 14077941 15073177 16201016 17473438 18925629 20615209 22591998
55963 22591998 24899543 27605171 30790036 34506261 38785947 43701809 49383238 55977274
55955 55977274 63648808 72622541 83162519 95509034 109922634 126815954 146758173
55948 146758173 170314605 197908878 229626193 264553249 299790924 330273519 350358023
55941 350358023 356445514 348597746 329951426 304753667 276699834 248348158 221239657
55934 221239657 196178955 173509932 153352110 135705238 120437526 107303065 96029648
55927 96029648 86371002 78086201 70934273 64715809 59286418 54518731 50285952 46491772
55919 46491772 43080913 40006186 37211657 34655592 32320215 30186702 28223788 26409406
55911B6409406j669336j530611j411218j305517j199548j097873j013569r42475
55903A6239259q72064q05319p52268p07711o59975o12635n76212n46888n13905
55894A0192282m79732m53237m30744m02998l73606l52242l36377l17161k96720
55885F749465k82674k72011k57022k41174k32943k29539k22183k12055k05956
55876D593908k01629j92230j80391j73357j68859j59759j48107j40940j36542
55867C092094j28311j18059j12261j09078j01957r2298q6010q1224p1950o0406
55857B130540n3412m9938m4413l9066m0624m7227n0716m9857m9847n0861m8445
55846A606134m3605m1565m1843l9758l6167l5748l7413l6330l3676l4450l7391
$$ plain form
55911 26409406 24740070 23209459 21798241 20492724 19293176 18195303 17181734 16239259
55903 16239259 15367195 14561876 13809608 13101897 12441922 11829287 11253075 10706187 10192282
55894 10192282 9712550 9259313 8828569 8425571 8051965 7699723 7363346 7046185 6749465
55885 6749465 6466791 6194780 5937758 5696584 5463641 5234102 5011919 4799864 4593908
55876 4593908 4392279 4200049 4019658 3846301 3677442 3517683 3369576 3228636 3092094
55867 3092094 2963783 2845724 2733463 2624385 2522428 2430130 2344120 2262896 2190946 2130540
55857 2130540 2077128 2027190 1982777 1943711 1903087 1855860 1805144 1755287 1705440 1654579 1606134
55846 1606134 1562529 1520964 1479121 1439363 1403196 1367448 1330035 1293705 1260029 1225579 1188188
55835A188188l6901l3434l2238l3206l1639k7863k6475k7000k4774k0261j8423
55824H75974j9352j8493j5613j4829j6209j5829j3767j3776j5361j4361j1016
55813G07368r533r982q528n342m442n859n623l520l293n156n508m155m593o994
55799F24840p843o725o647p732p281o012p374j0727j1854j0320r699j0619j0253
55786E11754q569q451r505q448n731n112o417n504j888K24q87k585l811o485j0202
55771D28383j1665j0464r688j0050r082o711n808o462n540k827j889l851n823
55758C38523o388p264q593q061n780m830n864o146m862m308m985m523k569j741
55744B62609k747l254k542k600l816m175l506l803m755l722q98L91p00j347m34
$$ plain form
55835 1188188 1151287 1117853 1085615 1052409 1020770 992907 966432 939432 914658 894397 875974
55824 875974 856622 838129 822516 807687 791478 775649 761882 748106 732745 718384 707368
55813 707368 697835 687853 679325 673983 669541 663682 658059 654539 651246 646090 640582 636427 631834 624840
55799 624840 616997 610272 603625 595893 588612 582600 575226 564499 552645 542325 532626 522007 511754
55786 511754 503185 494734 485229 476781 471050 465938 459521 454017 452129 452353 451466 448881 445070 438585 428383
55771 428383 416718 406254 396566 386516 377434 370723 364915 358453 352913 350086 348197 344346 338523
55758 338523 332135 324871 316278 308217 302437 297607 291743 285597 280735 276427 271442 266919 264350 262609
55744 262609 259862 256608 254066 251466 247650 243475 239969 236166 231411 227689 226791 227182 226482 225135 224701
55729B24701k26j745l077l341l890m790m379l095l249m509m135k193j704l032
55715A81336l169j363k93o88L6K480L775K946K765M584O057N821N828P072P467
55700B24654N948M502M214L259P42j412k103k817m125m251k791k025k880l303
55686B17612k228j463j978k050p06N38R03J745L390M113L594L689M563M014J863
55671B37599Q91J871J954j82j855j185k30q99j571m83R94J154R46J568J956J089
55655B43617J41J55R8p64j133l25m8j637l819m968n353n647n647n697o957q958
55639A93058r501q052o663o480o175m909l834l575l166k589l178m526m299k254
55625A23857j032j733k235j313o96j405j718o93j47j208k208k011j982k795k729
$$ plain form
55729 224701 224475 222730 219653 216312 212422 207632 203253 200158 196909 192400 188265 186072 184368 181336
55715 181336 178167 176804 176511 175823 175859 178339 182114 185060 187825 192409 198466 204287 210115 217187 224654
55700 224654 230602 235104 239318 242577 243319 241907 239804 236987 232862 228611 225820 223795 220915 217612
55686 217612 215384 213921 211943 209893 209187 209725 210628 212373 215763 219876 223470 227159 231722 235736 237599
55671 237599 238490 240361 242315 242133 240278 239093 238863 237964 236393 235910 236904 238058 239004 240572 242528 243617
55655 243617 243758 243913 244011 243247 242114 241789 241741 240104 236285 231317 225964 220317 214670 208973 202016 193058
55639 193058 183557 175505 168842 162362 156187 151278 147444 143869 140703 138114 134936 130410 126111 123857
55625 123857 122825 121092 118857 117544 116848 115443 113725 113032 112885 111677 109469 107458 105476 102681 99952
55610I9952j241o77k133l120j806j93n19j626j654j325j784k028j165o20j412
55595G8649j929r28n0p41j394l52Q55K14j171j219m27l81p83n77l19p70r45k6
55577F7706O30k23j343j234q02j385j999j142L73Q49M91M73O89N48N21J022J205
55560F6379O70N88J500J952J079L88J097J896J408O92J077J649J222P58J466K383
55544H6204K218J807K400L207K892J939J449J216Q86J236K451L025K209J545K133
55529A16817K646J969J366J839J866J80j670k098k340l815n085m422l152l326
55515A00775m158l940l449m119m737l461j441j056j874j845j159j501k572k787
55501F2676k458l017l903l433k076j716k285k155j322j195j747j658r73q79j284
$$ plain form
55610 99952 98711 98034 95901 92781 90975 90782 90263 88637 86983 85658 83874 81846 80681 80061 78649
55595 78649 76720 75792 75742 75001 73607 73255 74110 74324 73153 71934 71507 71126 70343 69766 69447 68677 67732 67706
55577 67706 68336 68113 66770 65536 64734 63349 61350 60208 60581 61430 61921 62394 63083 63631 64152 65174 66379
55560 66379 67049 67637 69137 71089 72168 72556 73653 75549 76957 77649 78726 80375 81597 82355 83821 86204
55544 86204 88422 90229 92629 95836 98728 100667 102116 103332 104218 105454 107905 110930 113139 114684 116817
55529 116817 119463 121432 122798 124637 126503 126683 125013 122915 120575 116760 111675 107253 104101 100775
55515 100775 96617 92677 89228 85109 80372 76911 75470 74414 72540 70695 69536 68035 65463 62676
55501 62676 60218 57201 53298 49865 47789 46073 43788 41633 40311 39116 37369 35711 34738 33859 32575
55486C2575j108n36m94m61P07K331K699J823J035N40l22j063p90k95r13j916j563
55469C2249j04O89M79L24K73m57j364j160j44K33j94m06k90m79o60j16N72M52
55451B9897O5L25M68n79j720j231J44L05o38q12l0J48m29k42R60J642J149M60
55433B9882J42k35n15K0R39J023L53P3K31q7o78l70P37J266Q32M14M84N61M76
55414C5548L64k92j820k991k365n48P08J092J457J662R27j47k39M24N48J39J98
55397C4665N15R2o46l87O07R14M39K29J42p92k037k044r78m34o42m27J74j20j270
55378B8000j847j591j555j704r24M05N24o96j385o71L11Q21J474K363K520J801
55362B7846J190Q73J24p02l84P05O96p52j873j711j226j003k77R91J450N99l29
$$ plain form
55486 32575 31467 30931 30437 29976 30683 33014 35713 37536 38571 39111 38789 37726 36936 36641 35728 33812 32249
55469 32249 32145 32834 33313 33637 33910 33453 32089 30929 30785 31018 30824 30418 30128 29649 28989 28873 29445 29897
55451 29897 29962 30287 30755 30176 28456 27225 27369 27674 27036 26224 26194 26342 25913 25671 26631 28273 29422 29882
55433 29882 30024 29789 29274 29294 30233 31256 31609 31682 31913 31826 31148 30778 31515 32781 33613 34027 34511 35072 35548
55414 35548 35912 35620 33800 30809 28444 27896 28604 29696 31153 32815 33742 33595 33356 33780 34328 34467 34665
55397 34665 35180 35272 34626 34239 34846 35760 36199 36428 36570 35778 33741 31697 30719 30285 29643 29216 29390 29270 28000
55378 28000 26153 24562 23007 21303 20379 20784 21308 20612 19227 18556 18867 19688 21162 23525 26045 27846
55362 27846 29036 29909 30033 29331 28947 29652 30348 29596 27723 26012 24786 23783 23506 24497 25947 26546 26217
55345B6217m73m61o52m17K04J02q38j190l31N26L96r5j45N5K76P75J295J086L80
55326B6710K34O23M22m42p39j74J02l20m48K5M7p32j160n99Oj38n61p89j033j089
55306A9945k99R12J187M32J8L98N04J7N4R42J368O34k13l52l35m24J53J337J629
55287B7907N12m64j34N60M95K24N46Q86N09p7k74n83j407j895j266j87K92J93
55269B5837L6j38k89J6O54O94q9n87L1J049J383R08P0q68j478j217m03q8m85o52
55249B4384j08M54M43J43k48r21j449r30M29J245R17K82l5l18m98M9J015J158
55231B6012L57n9M34P73M10K71Q96J397J169Q22O29j09j276j483m30J75p15j785
55213B7488j590o84j49K92J117J582J009K57L53P80N52r0l71l13j72L85J423K006
$$ plain form
55345 26217 25744 25283 24631 24214 24418 24520 23682 22492 22161 22687 23083 22988 22843 22898 23174 23949 25244 26330 26710
55326 26710 26944 27567 27989 27547 26808 26634 26736 26416 25968 25993 26040 25308 24148 23549 23555 23417 22856 22067 21034 19945
55306 19945 19646 20558 21745 22177 22195 22593 23097 23114 23168 24110 25478 26112 25899 25547 25212 24788 24941 26278 27907
55287 27907 28419 27955 27821 28381 28876 29100 29646 30532 31041 30964 30690 30107 28700 26805 25539 25352 25644 25837
55269 25837 25873 25735 25446 25462 26116 26810 26721 26134 26165 27214 28597 29505 29575 28707 27229 26012 25609 25521 25036 24384
55249 24384 24276 24730 25173 25316 25068 24147 22698 21768 22197 23442 24359 24641 24606 24288 23790 23839 24854 26012
55231 26012 26369 26310 26744 27517 27927 28198 29094 30491 31660 32482 33111 33002 31726 30243 29813 29988 29273 27488
55213 27488 25898 25214 25065 25357 26474 28056 29065 29322 29675 30455 31007 30917 30546 30233 30061 30446 31869 33875
55195C3875J474M43l24r30j396j019K63J167Q50J46L4J22k30n77l85j61m23o21
55177C2308k70L1k25m65k66l59j218j898j487n72r0P2K25j04j015j334k67J199
55159B4265J830J946K291K302J119o11j513j400j051o95j23L14Q6n74j105j416
55143B5665j507j010O1Q91J020J010J302J413J119J161J833K057J008m42j043
55128C4538q96o83k82O27J517J787J764J857J602O08m56q30p99r32j097j037r90
55111C6298r58m70K40J64o26o23O97J753J330M51M22P12M09J94R78J885J501J73
55093D4530p57j028j069n42R08K298K440J695J114O35k17p38P9J657K492K235
55077E5732J656J119M79q0l47o92j282j449q32k23j82L5R78J713J402Q49R89J130
$$ plain form
55195 33875 35349 35792 35468 34538 33142 32123 32386 33553 34403 34549 34583 34705 34475 33898 33513 33352 32929 32308
55177 32308 32038 32069 31844 31379 31113 30754 29536 27638 26151 25579 25489 25561 25786 25682 24667 23333 23066 24265
55159 24265 26095 28041 30332 32634 33753 33142 31629 30229 29178 28483 28360 28674 28760 28186 27081 25665
55143 25665 24158 23148 23209 24100 25120 26130 27432 28845 29964 31125 32958 35015 36023 35581 34538
55128 34538 33642 32959 32677 33304 34821 36608 38372 40229 41831 42439 41983 41153 40354 39422 38325 37288 36298
55111 36298 35340 34870 35110 35274 34648 34025 34722 36475 37805 38256 38678 39390 39799 39993 40971 42856 44357 44530
55093 44530 43773 42745 41676 41134 42042 44340 46780 48475 49589 50224 50007 49269 49348 51005 53497 55732
55077 55732 57388 58507 58986 58906 58559 57867 56585 55136 54304 54081 53899 53934 54912 56625 58027 58876 59865 60995
55059F0995L44o58p98n85r56j387j029n73r92j491q60K49M78J40K97M67k92j058
55041E2291l68R34Q46l98p97m1L05j18l7P55R92M73M54J068R13k60q49q8P45O65
55021E7485M49R40J623J906K165K591K450J334j8q52j200j073j84R51R58n76k253
55004F6696k586j736r11p47r48r76o74m09o70j317j586j176q15j042j206n18N26
54987D9905Q71M82M9k05k89L07J778K982K726J553Q39O69K18l53n7J081K097K674
54969F7327L151L235K407J358J343K280L165M022N673P704Q641Q205P614P603
54955A33728P872Q478R928J1611J2033J0917R445Q090N902K368j575m809p021
54942B06967q184q419q515r245j0011r587q193p255p103o551n066l590k878k530
$$ plain form
55059 60995 61339 60681 59883 59298 58342 56955 55926 55353 54361 52870 52010 52259 52737 52877 53174 53641 53349 52291
55041 52291 51923 52857 53703 53305 52508 52467 52772 52654 52617 53372 54364 54837 55291 56359 57272 57012 56163 56075 56820 57485
55021 57485 57934 58874 60497 62403 64568 67159 69609 70943 70925 70073 68873 67800 67616 68567 69525 68949 66696
55004 66696 64110 62374 61463 60716 59768 58792 58118 57709 57039 55722 54136 52960 52145 51103 49897 49379 49905
54987 49905 50776 51258 51307 51102 50813 51120 52898 55880 58606 60159 60998 61667 61885 61532 61475 62556 64653 67327
54969 67327 70478 73713 76120 77478 78821 81101 84266 88288 93961 101665 110306 118511 126125 133728
54955 133728 141600 150078 160006 171617 183650 194567 204012 212102 218004 220372 218797 213988 206967
54942 206967 198783 190364 181849 172604 162593 153006 144813 137558 130455 123904 118838 115248 112370 109840
54928A09840k102j718j285m29M62N33k4p8O39J296J562J996K762L400M041N294
54912A26189O882P925Q533R558J0742J0938J0090R063P568M457K47k965m616o346
54898A98265q938j0865j0887r987r516r251q476p397o415n363m375m055m075l229
54884I5436j585p82j395j926j424j060j822k607k162j217r75r28r1Q71O29n49
54868G8413j227r30l43N7K41o0j019k045k414k214j900j480r04o36r95j502j599
54851E9443j452j388j198o95k57k32l11j50L9l6k61n12q19r11m26K14J78l48k75
54832E0603N64J107R64J104J909K163J018l28k52J081K288K679K429J719Q10M06
54816G0264R02J683J983J904J974K286K679L159L615L773L833M390N393O082O276
$$ plain form
54928 109840 107738 106020 104735 104306 104768 105301 105277 105199 105838 107134 108696 110692 113454 116854 120895 126189
54912 126189 133071 140996 149529 159087 169829 180767 190857 199920 207488 211945 212192 209227 204611 198265
54898 198265 189327 178462 167575 157588 148072 138821 130345 122948 116533 111170 106795 102740 98665 95436
54884 95436 93851 93069 91674 89748 88324 87264 85442 82835 80673 79456 78481 77553 77462 78333 78962 78413
54868 78413 77186 76256 75913 75970 76211 76151 75132 73087 70673 68459 66559 65079 64175 63539 62544 61042 59443
54851 59443 57991 56603 55405 54710 54453 54221 53910 53760 53799 53763 53502 52990 52171 51260 50834 51048 51226 50878 50603
54832 50603 51167 52274 53238 54342 56251 58414 59432 59104 58852 59933 62221 64900 67329 69048 69858 70264
54816 70264 71166 72849 74832 76736 78710 80996 83675 86834 90449 94222 98055 102445 107838 113920 120196
54801A20196O729P737Q671R294J0244J1532J1921J0664Q611O625M204Q03k652
54788B14579m830n785o468p205p702p910p868p332o381n734n691n505m573l443
54774A28152k879k704k364j844j208j66J104J646J143P30J483K881L817M278M954
54759A39023N921O733P408Q307R419J0444J1156J1219J0247Q462O545M529J822
54746B41235j328l690m899o069p899r563j0326j0718j1089j0558q739p014o526
54733A42817o258m835l100k931m175m797l806k329j751k216k987l291k768j823
54719I5750j314j438j427q55l61m11m94k63m08j275j808j125p7J21j83NM82M86
54701H5405L01N37O16k71j256p48J057K279J864M89q30j516j090M62J961K113
$$ plain form
54801 120196 126925 134662 143333 152627 162871 174403 186324 196988 205599 212224 216428 217231 214579
54788 214579 209749 203964 197496 190291 182589 174679 166811 159479 153098 147364 141673 136168 131595 128152
54774 128152 125273 122569 120205 118361 117153 116987 118091 119737 120880 121610 123093 125974 129791 134069 139023
54759 139023 144944 151677 159085 167392 176811 187255 198411 209630 219877 228339 234884 239413 241235
54746 241235 239907 236217 231318 225249 217350 207787 197461 186743 175654 165096 156357 149343 142817
54733 142817 136559 131724 128624 125693 121518 116721 112915 110586 108835 106619 103632 100341 97573 95750
54719 95750 94436 92998 91571 90716 90355 89944 89450 89187 88779 87504 85696 84571 84494 84615 84432 84437 84919 85405
54701 85405 85706 86243 86859 86588 85332 84584 85641 87920 89784 90273 89443 87927 86837 87299 89260 91373
54685I1373J219O58Q43R81P19O21J009J495J776J808J425P00M30J178K146K230
54669A10611J754J906K774L388L512L800M193L813K663J943K255K732K471J793
54655A49608J474J605J733J545J079O29N63Q58R44M81L2L15J138J794K129K421
54639A68348K553K262J895J975K166J732Q24K38Pp16k257l877m762m835m435l898
54623A57220l524l400l201k662k097j933k009j800j228o09j21K20L51L55M93O66
54607A36721L67l96q44o07l24m98o70n04o82j681k642k565j822j311r72m96n26
54590A20548j623k722k339q81j26p30j781k584l281l769l527k641j835j464j462
54575H9783j975k892l183k064m41J58k81o35p00j207j983j994j220p25o93j32
$$ plain form
54685 91373 92592 93250 94093 95074 95793 96414 97423 98918 100694 102502 103927 104627 105057 106235 108381 110611
54669 110611 112365 114271 117045 120433 123945 127745 131938 135751 138414 140357 142612 145344 147815 149608
54655 149608 151082 152687 154420 155965 157044 157673 158236 159094 160038 160519 160551 160866 162004 163798 165927 168348
54639 168348 170901 173163 175058 177033 179199 180931 181755 181993 182000 181284 179027 175150 170388 165553 161118 157220
54623 157220 153696 150296 147095 144433 142336 140403 138394 136594 135366 134757 134636 134856 135207 135562 136055 136721
54607 136721 137088 136692 135848 135241 134917 134419 133749 133245 132563 130882 128240 125675 123853 122542 121570 121074 120548
54590 120548 118925 116203 113864 112983 112857 112127 110346 107762 104481 100712 97185 94544 92709 91245 89783
54575 89783 87808 84916 81733 79669 79228 79386 79105 78470 77770 76563 74580 72586 71366 70641 69948 69816
54559F9816J146J856J176n8o37l58L17R00Q73L8q27o54L78J040Q36N43P60J067
54541G8212Q92K78m77j088j099l06O95J230J595K375L069K746J806J631K477L129
54525I7165K804J928R21l43j548j896j466j355k038k718k647k004j109QR61R55
54509H7618r4j336k064k230j822q45M5k2q65j485j519j395j162m79L08M98L91
54492G3542Q30J425R38m68j141m53L79M64M89J111J739J772J555J361Q05P7K57
54475H4682J574K631K336J297N00q3o89q41l57j33p70j430j109k05K59J76J04
54458H7942J60J39J68L96N51M70M81O77M85l73j200j235p21m31p03j358k075k425
54440H0948k108j424r01l95N81J644J735P93JK7K16k2k56k1L78P14J289J964J884
$$ plain form
54559 69816 70962 72818 73994 73936 73299 72941 73258 74158 75031 75069 74242 73588 73966 75006 75842 76385 77145 78212
54541 78212 79104 79382 78905 77817 76718 76412 77107 78337 79932 82307 85376 88122 89928 91559 94036 97165
54525 97165 99969 101897 102818 102475 100927 99031 97565 96210 94172 91454 88807 86803 85694 85702 86663 87618
54509 87618 87524 86188 84124 81894 80072 79227 79272 79250 78385 76900 75381 73986 72824 72345 72653 73151 73542
54492 73542 74372 75797 76735 76267 75126 74673 75052 75516 76005 77116 78855 80627 82182 83543 84348 84425 84682
54475 84682 86256 88887 91223 92520 93020 92937 92248 91407 91050 90917 90147 88717 87608 87403 87662 87838 87942
54458 87942 88102 88241 88409 88805 89356 89826 90307 90984 91469 91096 89896 88661 87940 87509 86806 85448 83373 80948
54440 80948 78840 77416 76515 76120 76701 78345 80080 80873 80874 80901 81117 81095 80839 80818 81196 81910 83199 85163 87047
54421H7047Q96J05K85Q20R53R59J249J408J086P86R78J282J344J532J996K071
54405A04797J498J205J876K762K841K357K196K494K876L307L766L849L430L084
54391A42338L094K952K425K135K262J857M25r41j189r69j395k087j937j122r11
54376A46937j730k771l203k842j894r77r65j962k902k917k453k245j938q89M17
54361A17666R33N86R4l34r80j586j466n37N61J308J596J511J394J733K461K834
54345A27774K546K286K586K890K520J805J474J576J874K438L051K859J627M85
54331A57791L21L75l81j369j364o87q04k127l674m678n176n214m706m064l807
54316A20436l627k888j855j377j562j803j888k057k166j942j789k241k766k351
$$ plain form
54421 87047 87943 88048 88333 89153 90106 91065 92314 93722 94808 95594 96572 97854 99198 100730 102726 104797
54405 104797 106295 107500 109376 112138 114979 117336 119532 122026 124902 128209 131975 135824 139254 142338
54391 142338 145432 148384 150809 152944 155206 157063 157488 156547 155358 154389 152994 150907 148970 147848 146937
54376 146937 145207 142436 139233 136391 134497 133520 132555 130593 127691 124774 122321 120076 118138 117249 117666
54361 117666 118599 119185 119279 118945 117965 116379 114913 114376 114937 116245 117841 119352 120746 122479 124940 127774
54345 127774 130320 132606 135192 138082 140602 142407 143881 145457 147331 149769 152820 155679 157306 157791
54331 157791 158112 158487 158106 156737 155373 154686 153882 151755 148081 143403 138227 133013 128307 124243 120436
54316 120436 116809 113921 112066 110689 109127 107324 105436 103379 101213 99271 97482 95241 92475 90124
54302I0124j197o12j176k089k486k339j858j037r6M03K09l63r38j352j494j319
54286G2380j044q57o42m12n83j299j903j742j035k95N57J714K629K638K052J705
54270G3863J661J327N65j74n78n67j0Q69J240P22J84N18J076N86q35j814j758
54253G6875j384j303j235q28k24L49P83Q23L50j71k65k30n52q86n73J23L40rk79
54234G1704k82l40l45J43Q52J032O50K73q0p86j406j026J07O29P7m92k37L28M73
54215G1274M01O04R70J193J334J417J055Q9q82j120n73J89N75M04l5k67k12k10
54197G6206k59K28J345J971J106n16j288q64l16l02m06l22l88o84p25l91j64j59
54179G4072J11O89R12M62j92o71j066j196n91M02N53n58j742j774r75m43m15k05
$$ plain form
54302 90124 88927 88315 87139 85050 82564 80225 78367 77330 77234 77637 77846 77483 76545 75193 73699 72380
54286 72380 71336 70479 69837 69425 68842 67543 65640 63898 62863 62568 63125 64839 67468 70106 72158 73863
54270 73863 75524 76851 77416 77242 76664 76097 76087 76956 78196 78918 79102 79620 80696 81282 80447 78633 76875
54253 76875 75491 74188 72953 72125 71901 72250 73033 73856 74206 74035 73770 73540 72988 72102 71529 71652 71992 71983 71704
54234 71704 71422 71082 70737 70880 71732 72764 73414 73687 73607 72821 71415 70389 70496 71125 71202 70710 70473 70801 71274
54215 71274 71675 72279 73249 74442 75776 77193 78248 78337 77455 76335 75762 75951 76526 76930 76895 76628 76416 76206
54197 76206 75947 76175 77520 79491 80597 80081 78793 77929 77613 77311 76905 76583 76195 75511 74786 74395 74231 74072
54179 74072 74183 74872 75784 76246 76054 75383 74317 73121 72530 72932 73485 72927 71185 69411 68436 67993 67578 67373
54161F7373N36J313J502J089O63P75J302J537J070L66R3J99J91L8O3J68L3n7N04
54142G8758J480J840J154J03n59p58p09n38n56j130k006k392j960j221p46o51
54126G0109q21j045q50R0J264J758J320M79l09q50q10q7N19J21q33j005j27O98
54108F9621P83O54P94Q67O86P72J344J704J245K35q75j930k532k052q10j08m46
54091F9952p35o4Q25P96J10j83O6J78k0j01k6k63q90j375j277o84R9Q37J370J623
54071G0238J562J112L51k33j41M17P56P38Q86J339J492J034N56O38R87J095J098
54054H3925J374J732J638R40j2p13o75K79J546K082J635J082J229J827K217K345
54038A02451K598L031L418L654L712L544L385L752M702N579N882N882N993O081
$$ plain form
54161 67373 67909 69222 70724 71813 72476 73251 74553 76090 77160 77526 77619 77818 78009 78047 78110 78278 78311 78254 78758
54142 78758 80238 82078 83232 83335 82776 82018 81309 80771 80215 79085 77079 74687 72727 71506 70760 70109
54126 70109 69288 68243 67393 67483 68747 70505 71825 72304 71995 71145 70335 70248 70767 70888 70055 69050 68923 69621
54108 69621 70404 71058 71852 72719 73405 74177 75521 77225 78470 78705 77830 75900 73368 71316 70506 70398 69952
54091 69952 69217 69153 69978 70774 70884 70701 70767 70945 70925 70824 70798 70535 69645 68270 66993 66309 66408 67245 68615 70238
54071 70238 71800 72912 73263 73030 72889 73306 74062 74800 75686 77025 78517 79551 80107 80745 81732 82827 83925
54054 83925 85299 87031 88669 89609 89597 88884 88209 88488 90034 92116 93751 94833 96062 97889 100106 102451
54038 102451 105049 108080 111498 115152 118864 122408 125793 129545 134247 139826 145708 151590 157583 163664
54024A63664N909N718N758N678N106M375M043L963L564K812K204J924J645J139
54010B17502N66J41o7n0P2m3o66j620k445k793k518j641n54J0l76j290j929k081
53992B00218k301l047l987m352l922l345l351l758l675k798j941j911k326k192
53978A57312j378p08o84r14q82o02l00r3j43n92j114j166p28k95j1M83J205J597
53960A50987J363R52Q17Q84J006J331J812J980J595J056P64O59O57J059K034L119
53944A72075L760L901L780L488L126K984L218L616L962M245M313L753K504J148
53930B19873L22O6O7J59K95L26Q4m15r58j172o78M74J639K193K266K474L079L923
53912B34017M880N822O281N917N190M848M977N255N759O546O773N502L333J810
$$ plain form
54024 163664 169573 175291 181049 186727 191833 196208 200251 204214 207778 210590 212794 214718 216363 217502
54010 217502 218068 218209 218142 218092 218164 218121 217455 215835 213390 210597 208079 206438 205884 205894 205518 204228 202299 200218
53992 200218 197917 194870 190883 186531 182609 179264 175913 172155 168480 165682 163741 161830 159504 157312
53978 157312 155934 155226 154542 153628 152746 152144 151844 151751 151608 151016 149902 148736 148008 147713 147702 148185 149390 150987
53960 150987 152350 153302 154119 155003 156009 157340 159152 161132 162727 163783 164547 165206 165863 166922 168956 172075
53944 172075 175835 179736 183516 187004 190130 193114 196332 199948 203910 208155 212468 216221 218725 219873
53930 219873 220195 220261 220328 220487 220782 221108 221192 220777 219819 218647 217969 218443 220082 222275 224541 227015 230094 234017
53912 234017 238897 244719 251000 256917 262107 266955 271932 277187 282946 289492 296265 301767 305100 306910
53898C06910J231M22j100k295k405k105k154k219j882j692k270l279m147m976
53884B78039n956o688o808o582o269n709n072n083n853o451o284n863n554m747
53870A95120l174j930k010k808l138k993l069l408l620l859m347m584m078l353
53856A48749l133l085k484j601j274j558j845j966k123k135j790j512j675j736
53842A20832j090l28m24j095j249p51m57o43o47j49L34L68J02j98l81j38O91J645
53824A16422K021J669Q35l95j744k382j789o81j23l8L86J157J517J317J197J435
53808A20804J600J411J102Q81Q64J376K491L494L707L671M374N537N831M825L580
53793A65548L078L191L429L731M061M087L662L107K731K603K753L052K947K011
$$ plain form
53898 306910 308141 308563 307463 305168 302763 300658 298504 296285 294403 292711 290441 287162 283015 278039
53884 278039 272083 265395 258587 252005 245736 240027 234955 229872 224019 217568 211284 205421 199867 195120
53870 195120 191946 190016 188006 185198 182060 179067 175998 172590 168970 165111 160764 156180 152102 148749
53856 148749 145616 142531 140047 138446 137172 135614 133769 131803 129680 127545 125755 124243 122568 120832
53842 120832 119742 119414 118990 117895 116646 115895 115438 114795 114148 113999 114333 114701 114803 114605 114224 114086 114777 116422
53824 116422 118443 120112 120947 120552 118808 116426 114637 113956 113833 113795 114181 115338 116855 118172 119369 120804
53808 120804 122404 123815 124917 125798 126662 128038 130529 134023 137730 141401 145775 151312 157143 161968 165548
53793 165548 168626 171817 175246 178977 183038 187125 190787 193894 196625 199228 201981 205033 207980 209991
53779B09991O64k65o08p84q93p57o97j166j717j458o36n98j816l144l447l001
53763A89668k666k579k366k005j740j527j164p24m44l58l49l44k97k60m72j092
53747A71281j787j981j565r43l97J44O10O12k4q90j366j187n56P7L77L75L51L64
53729A63495J81k01l49j3M63P53J056J536J746J233L37l11o53r13q60j80O97R48
53711A68965M77j19m54o04o23m94l64k03L73J337J790J167L64N62J381J449O29
53694A75633K78J260K892M069M288L492J967O99P31J814K591K360J790J666J902
53679B07432K102K244K348K227J918J747J775J728J519J226O23n01j549j646r23
53664B22270l55k86j97K2j96q31j003l86K08J74p0j14k97p32o69K25R18L06j159
$$ plain form
53779 209991 210655 210390 209782 208998 208105 207348 206651 205485 203768 202310 201674 201076 199260 196116 192669 189668
53763 189668 187002 184423 182057 180052 178312 176785 175621 174897 174453 174095 173746 173402 173105 172845 172373 171281
53747 171281 169494 167513 165948 165005 164608 164752 165362 165974 165950 165060 163694 162507 161951 162028 162405 162780 163131 163495
53729 163495 163676 163475 163126 163113 163576 164329 165385 166921 168667 169900 170237 169926 169273 168360 167500 167320 168017 168965
53711 168965 169442 169323 168869 168265 167642 167148 166784 166581 166954 168291 170081 171248 171612 172174 173555 175004 175633
53694 175633 175911 177171 180063 184132 188420 191912 193879 194578 195309 197123 199714 202074 203864 205530 207432
53679 207432 209534 211778 214126 216353 218271 220018 221793 223521 225040 226266 226889 226388 224839 223193 222270
53664 222270 221915 221629 221432 221454 221258 220427 219424 219038 219246 219420 219350 219236 218939 218207 217538 217763 218681 218987 217828
53645B17828k091j944j308q21o12n93o13m09Q5M89M19kl32l14L7N85J071J198
53627B12673R34N82M29N58R46J439J747J799J969K463K795K495K007K054K339
53612B37229J957J024P41J609K726L143K969K659K252J890K138L136M115M345
53598B71933L970L502L098K831K948L394L683L693L941M579M840M064K666J547
53584C20689J005Q12Q37J044J248J341J486J744J894J833J686J335M95n56r91
53569C35902n55N9K86L99P25R46P70O24R45J317J009M4q55j114p07j4L99J59m55
53550C39884p70n28p7L33P97J279J529J630J869J976J414O04P77K211L562L575
53534C60065K551J592J254J506K163K711K521J857J865K960M125M473M530N126
$$ plain form
53645 217828 215737 213793 212485 211664 211052 210459 209846 209437 209522 210011 210430 210428 210096 209782 209819 210404 211475 212673
53627 212673 213607 214189 214618 215176 216122 217561 219308 221107 223076 225539 228334 230829 232836 234890 237229
53612 237229 239186 240210 240951 242560 245286 248429 251398 254057 256309 258199 260337 263473 267588 271933
53598 271933 275903 279405 282503 285334 288282 291676 295359 299052 302993 307572 312412 316476 319142 320689
53584 320689 321694 322506 323343 324387 325635 326976 328462 330206 332100 333933 335619 336954 337449 336893 335902
53569 335902 335347 335406 335692 336091 336816 337762 338532 339156 340101 341418 342427 342471 341616 340502 339795 339781 340180 340339 339884
53550 339884 339114 338586 338509 338842 339639 340918 342447 344077 345946 347922 349336 349940 350717 352928 356490 360065
53534 360065 362616 364208 365462 366968 369131 371842 374363 376220 378085 381045 385170 389643 394173 399299
53520C99299O007O501O791P383Q033Q201Q067Q123Q280Q303Q569R400J0215J0422
53506E13594J0596J1666J3357J4551J4899J4984J5192J5506J6173J7415J8601
53495F76534J8908J8652J8916J9846K0485K0364K0109K0214K0224J9637J8851
53484H92740J8564J8811J9002J8724J8175J7913J8265J8859J8962J8424J7955
53473A096394J8134J8573J8548J8037J7549J7215J6784J6272J5932J5671J5096
53462A284205J4098J2832J1286R448P726O552N672M409K600O81j042k639m102
53449A351726n239o043o775p701r042j0930j2989j4315j4442j4067j4248j5098
53437A220837j5880j6158j6088j5822j5375j5082j5380j6075j6414j5945j4873
$$ plain form
53520 399299 405306 411807 418598 425981 434014 442215 450282 458405 466685 474988 483557 492957 503172 513594
53506 513594 524190 535856 549213 563764 578663 593647 608839 624345 640518 657933 676534
53495 676534 695442 714094 733010 752856 773341 793705 813814 834028 854252 873889 892740
53484 892740 911304 930115 949117 967841 986016 1003929 1022194 1041053 1060015 1078439 1096394
53473 1096394 1114528 1133101 1151649 1169686 1187235 1204450 1221234 1237506 1253438 1269109 1284205
53462 1284205 1298303 1311135 1322421 1331869 1339595 1346147 1351819 1356228 1358828 1359509 1358467 1355828 1351726
53449 1351726 1346487 1340444 1333669 1325968 1316926 1305996 1293007 1278692 1264250 1250183 1235935 1220837
53437 1220837 1204957 1188799 1172711 1156889 1141514 1126432 1111052 1094977 1078563 1062618 1047745
53426A047745j3578j2328j1352j0607r559p809n827m407l543k596j465p30n51
53413I63393k71N93J789K989M279N626O603P139P932R502J1331J2559J3234J4199
53399A060897J5876J7752J9176K0173K1218K2551K3990K5330K6634K8054K9541
53388A311192L0907L2110L3284L4479L5566L6503L7538L8996M0865M2707M4004
53377A718151M4645M4996M5395M5691M5463M4833M4495M4684M4569M3216M0818
53366B206956L8313L6023L3487L0453K7171K3710J9899J6077J2941J0407P489
53355B462926L669n00m435q318j2331j6050j9201k2192k5269k7844k9406l0442
53343B270607l1787l3626l5740l8022m0067m0983m0462l9377l8595l7792l6369
$$ plain form
53426 1047745 1034167 1021839 1010487 999880 990321 982512 976685 972278 968735 966139 964674 963944 963393
53413 963393 963122 963715 965504 968493 972772 978398 985001 992140 1000072 1009574 1020905 1033464 1046698 1060897
53399 1060897 1076773 1094525 1113701 1133874 1155092 1177643 1201633 1226963 1253597 1281651 1311192
53388 1311192 1342099 1374209 1407493 1441972 1477538 1514041 1551579 1590575 1631440 1674147 1718151
53377 1718151 1762796 1807792 1853187 1898878 1944341 1989174 2033669 2078353 2122922 2166138 2206956
53366 2206956 2245269 2281292 2314779 2345232 2372403 2396113 2416012 2432089 2445030 2455437 2462926
53355 2462926 2466595 2466095 2461660 2453342 2441011 2424961 2405760 2383568 2358299 2330455 2301049 2270607
53343 2270607 2238820 2205194 2169454 2131432 2091365 2050382 2009920 1970543 1931948 1894156 1857787
53332A857787l4833l4176l4340l4351l3728l2738l1475k9699k7554k5577k4055
53321A515261k2920k2180k1745k1058j9569j7448j5298j3441j2010j1369j1737
53310A326486j2657j3392j3649j3429j2670j1605j0913j0816j0551r539q401p970
53298A190894p780o696m645k700j589j115q79o70k35N47J439K360L754N817P893
53283A186395R412J0832J2694J4423J5194J5391J5979J6902J7508J8034J9159
53272A351923K0328K0172J8569J6784J5532J4388J3109J2076J1093R295O655M268
53260A514192K758J538R6j231k198l341n139p410r823j2217j4171j5282j6034
53247A431738j7381j9258k0580k0919k0983k1261k1365k1172k1316k2024k2620
$$ plain form
53332 1857787 1822954 1788778 1754438 1720087 1686359 1653621 1622146 1592447 1564893 1539316 1515261
53321 1515261 1492341 1470161 1448416 1427358 1407789 1390341 1375043 1361602 1349592 1338223 1326486
53310 1326486 1313829 1300437 1286788 1273359 1260689 1249084 1238171 1227355 1216804 1207265 1198864 1190894
53298 1190894 1183114 1176418 1171773 1169073 1167484 1166369 1165490 1164820 1164585 1165132 1166571 1168931 1172685 1178502 1186395
53283 1186395 1195807 1206639 1219333 1233756 1248950 1264341 1280320 1297222 1314730 1332764 1351923
53272 1351923 1372251 1392423 1410992 1427776 1443308 1457696 1470805 1482881 1493974 1503269 1509924 1514192
53260 1514192 1516950 1518488 1518584 1517353 1515155 1511814 1506675 1499265 1489442 1477225 1463054 1447772 1431738
53247 1431738 1414357 1395099 1374519 1353600 1332617 1311356 1289991 1268819 1247503 1225479 1202859
53236A202859k2697k2700k2829k2514k1537k0639k0332k0167j9756j9501j9609
53225I70578j9430j8471j7206j6149j5065j3774j2850j2692j2753j2363j1632
53214H08193j0842r849q776q366q862r353r129q764r067r762j0227j0718j1737
53201F82741j2805j3048j2571j2149j1933j1467j0729j0177r926r761r744j0046
53189E48385j0331j0143r711r653j0009j0247j0164j0084j0254j0571j0910j1176
53177D25132j1143j0651r836q850p593o110m928m562m905n501o063o320n861m692
53163C28117l606l334l616l652l266k953k965l040k997k986l105l183l061k732
53149B83621k247j685j150o82k59m3l12r42j335j108n40n5L29O80P34K73k99k83
$$ plain form
53236 1202859 1180162 1157462 1134633 1112119 1090582 1069943 1049611 1029444 1009688 990187 970578
53225 970578 951148 932677 915471 899322 884257 870483 857633 844941 832188 819825 808193
53214 808193 797351 787502 778726 770360 761498 752145 743016 734252 725185 715423 705196 694478 682741
53201 682741 669936 656888 644317 632168 620235 608768 598039 587862 577936 568175 558431 548385
53189 548385 538054 527911 518200 508547 498538 488291 478127 468043 457789 447218 436308 425132
53177 425132 413989 403338 393502 384652 377059 370949 366021 361459 356554 351053 344990 338670 332809 328117
53163 328117 324511 321177 317561 313909 310643 307690 304725 301685 298688 295702 292597 289414 286353 283621
53149 283621 281374 279689 278539 277857 277598 277555 277243 276301 274966 273858 273318 273263 273592 274272 275006 275279 274980 274697
53131B74697M92J527K270K519K380K062J777J658J698J752J457M38j073k074j848
53116B89732j054j039k103l270l842m196m709m963m593m051l780l373k417j538
53102B44804j678k653l327l076k392k114k593l537m239m070l140k282k061k143
53088B05499j945j531j368j508j549j245q01o38j032j833k394k212j662j607k139
53073A82035k427k003j422j227j147q21n53o47p03l50n0l08p02n58j61l06r89
53056A67661j483j503j402j369j219r19o16k71J32J88l82j023r28j71M47N20L17
53039A57979M8l89r40j304j390j296r48l45K1l21r88j069l49M71P78O53L61n2
53021A50920n03p22o06m13l92m96n19l15J52P46J184J302J147P81K23k53k17K64
$$ plain form
53131 274697 275189 276716 278986 281505 283885 285947 287724 289382 291080 292832 294289 294727 293654 291580 289732
53116 289732 288678 287639 285536 282266 278424 274228 269519 264556 259963 255912 252132 248759 246342 244804
53102 244804 243126 240473 237146 234070 231678 229564 226971 223434 219195 215125 211985 209703 207642 205499
53088 205499 203554 202023 200655 199147 197598 196353 195552 194914 193882 192049 189655 187443 185781 184174 182035
53073 182035 179608 177605 176183 174956 173809 172988 172435 171788 171085 170735 170685 170377 169675 169117 168956 168650 167661
53056 167661 166178 164675 163273 161904 160685 159766 159150 158879 159011 159199 158817 157794 156866 156695 157142 157662 157979
53039 157979 158027 157638 156698 155394 154004 152708 151760 151415 151436 151115 150127 149058 148709 149180 149958 150611 150972 150920
53021 150920 150417 149695 149089 148676 148284 147788 147269 146954 147106 147852 149036 150338 151485 152266 152489 152236 152019 152283
53003A52283M83O2m43l61J27M39O43J240K179K797K695K102J440J042J117J576
52987A69421K003K160K298K556K537K085J926K756L994M368L521K207J131M90
52973B03453M91J252K125K086J003k51j024j449j689j588j325j475k064k296j750
52958A95499j080j085j649k092k081j698j044k95J72J70n4k90o96j329j678j263
52942A79507m03M9k35p67r44o75k33J32K22q8o05p69k73L01P3q30j096J50K018
52923A75534K864K322J465J049P08J33j30K42M75j79j114j152k67M49L45k02o10
52906A81932p32o28l69r7K35R58K030K572J808K77o60m56K73R28J513K001K043
52889A93628J592J141R70P71K94j34l1O22J444J983J940J433J050J240J658J596
$$ plain form
53003 152283 152766 152828 152385 152024 152151 152590 153233 154473 156652 159449 162144 164246 165686 166728 167845 169421
52987 169421 171424 173584 175882 178438 180975 183060 184986 187742 191736 196104 199625 201832 202963 203453
52973 203453 203944 205196 207321 209407 210410 210159 209135 207686 205997 204409 203084 201609 199545 197249 195499
52958 195499 194419 193334 191685 189593 187512 185814 184770 184475 184647 184817 184763 184473 183777 182448 180770 179507
52942 179507 179104 179153 178918 178151 177207 176532 176299 176431 176653 176565 175960 175191 174918 175219 175292 174462 173366 173516 175534
52923 175534 178398 180720 182185 183234 183942 184075 183945 184187 184662 184483 183369 182217 181950 182399 182744 182542 181932
52906 181932 181200 180572 180203 180106 180341 181299 183329 185901 187709 187986 187326 186870 187143 188071 189584 191585 193628
52889 193628 195220 196361 197331 198102 198396 198262 198231 198853 200297 202280 204220 205653 206703 207943 209601 211197
52873B11197J043O87Q65J172J280J472K016K589K737K463J964J267N15L26J204
52858B32797K708L680L460K566K036K305K907L189K951K257J120k92j326j470
52844B58888j164j289j806j784j051p61j700k947l166k512k157k422k596k363
52830B31170k215k364k390k112j911j928j778j387j311j898k739l251l289k935
52816A99662k217j344p54o99r95j317j474j382j137j075j372j643j392p52l49
52801A81760m86r17j328j495j180m11J98M7o15j039j043j112j509j926k024j745
52785A65175j122l95p7l90p99p56o39j057j601j327l59K00o2m10l45k97n90q74
52767A54275r25j113j603j963j965j925j948j689j231j258j917k404k188j704
$$ plain form
52873 211197 212240 212927 213792 214964 216244 217716 219732 222321 225058 227521 229485 230752 231267 231593 232797
52858 232797 235505 239185 242645 245211 247247 249552 252459 255648 258599 260856 261976 261684 260358 258888
52844 258888 257724 256435 254629 252845 251794 251033 249333 246386 243220 240708 238551 236129 233533 231170
52830 231170 228955 226591 224201 222089 220178 218250 216472 215085 213774 211876 209137 205886 202597 199662
52816 199662 197445 196101 195347 194648 193653 192336 190862 189480 188343 187268 185896 184253 182861 182109 181760
52801 181760 181274 180357 179029 177534 176354 175943 176141 176188 175573 174534 173491 172379 170870 168944 166920 165175
52785 165175 164053 163658 163581 163191 162392 161636 160997 159940 158339 157012 156653 156853 156791 156381 156036 155739 155149 154275
52767 154275 153350 152237 150634 148671 146706 144781 142833 141144 139913 138655 136738 134334 132146 130442
52753A30442j403j033m89l74r52j453j186o63p10j167j344j196j159j290j329
52738A14694j326j390j262q21n72q48r81j37J316K253K378K409K719K755K062
52723A23249J102O15O79Q16P33N84N45M72J38k79k33M89J380J830J904J969J805
52706A37798Q72n59j441j377j119j286j380p54J50M19j1m64o71r84j493j784j606
52689A24310j275j163j202j042n03J68M08j71j290k159k290j987j835j930j870
52674A06169j411q13n28o96j013j112r86r06r19p43l44j65m84r18j047j048j113
52657I1923q13J12P54R1j276j726r25j22RK47J034J396N70m61l07P84J347O00
52639I3237q61j850j459K95K073K197O21q47q68j92j05m16j70N35Q20N49K53r8
$$ plain form
52753 130442 129039 128006 127517 127143 126191 124738 123552 122889 122179 121012 119668 118472 117313 116023 114694
52738 114694 113368 111978 110716 109895 109323 108475 107494 107357 108673 110926 113304 115713 118432 121187 123249
52723 123249 124351 124966 125645 126461 127194 127778 128323 128795 128933 128654 128421 128910 130290 132120 134024 135993 137798
52706 137798 138670 138111 136670 135293 134174 132888 131508 130754 130904 131323 131312 130848 130177 129193 127700 125916 124310
52689 124310 123035 121872 120670 119628 119125 119293 119701 119530 118240 116081 113791 111804 109969 108039 106169
52674 106169 104758 103945 103417 102721 101708 100596 99610 98704 97785 97042 96698 96533 96049 95131 94084 93036 91923
52657 91923 91110 91222 91976 92067 90791 89065 88140 88018 88027 88274 89308 90704 91274 90813 90506 91290 92637 93237
52639 93237 92376 90526 89067 89362 91435 93632 94253 93406 92538 92346 92241 91825 91655 92190 93010 93559 93812 93714
52621I3714q38j555j588j266j370j553q08N83J133M11k57J53J034J408J377J432
52605I2010J317N70l96o78j39M57M51j2k87R9R67J602J456P46J56K4J47L04M59
52586I9253M83J92k22l34j17R8L42J080K221K820K200R33R2r8j80l49j26Q07K015
52567A11110K819K937K472J619P34L64P32J288J208M10l10k57M06J065J394J428
52551A29419J196P48L12J08R7K21O53J419K081K251K150K112J841R21j34l17M25
52534A45503J026P94J91j27j32j4K76O19O54N28Q53J549J560L72j053j610j479
52517A49510j437j441r82l08r1j74L48J671K822K766J421m30j768j930j048O0
52501A48989O52N95L4q83j696j595l47J203K108K329K284J901R68o0m25n1N51
$$ plain form
52621 93714 92876 91321 89733 88467 87097 85544 84736 85319 86452 86863 86606 86759 87793 89201 90578 92010
52605 92010 93327 93897 93501 92823 92684 93141 93592 93580 93293 93392 94359 95961 97417 98163 98319 98343 98490 98794 99253
52586 99253 99736 99928 99706 99372 99255 99353 99695 100775 102996 105816 108016 108949 109041 108943 108763 108414 108288 109095 111110
52567 111110 113929 116866 119338 120957 121691 122055 122787 124075 125283 125693 125383 125126 125532 126597 127991 129419
52551 129419 130615 131363 131675 131783 131880 132101 132754 134173 136254 138505 140655 142767 144608 145529 145395 145078 145503
52534 145503 146529 147323 147514 147387 147255 147241 147517 148136 148790 149318 150171 151720 153280 153652 152599 150989 149510
52517 149510 148073 146632 145650 145342 145251 145077 145425 147096 149918 152684 154105 153675 151907 149977 148929 148989
52501 148989 149641 150236 150270 149387 147691 146096 145749 146952 149060 151389 153673 155574 156542 156482 156057 156006 156557
52484A56557J038J309J171O65M18Q38J347J194P17Q20J417J572J080Q16J295J942
52468A74196K180K346K904L407K887J166p91j796j585r07n53m77j76K35N4p47
52452A82343j056p8J459K188J819J208J085J469K047K451K328J743J268J191J077
52437B02542O13L53Q24J473J417Q00M26M17K32k84p96j248j705j804j295q11j001
52420B00153j374j204j058j898l012k689r73J41l72j258j231q14r43j307j176
52405A80985q20q50r99o79j11R7ppP4K2R5N86J140J215R48Q44R10P23J58n10j043
52384A82771j269r15Q7J223J798J665J273J100J210J282R33K22k48kO32R54R06
52367A93622J068J643K153K235K007J581R85P34J502K932L656L048J992J436J135
$$ plain form
52484 156557 157595 158904 160075 160740 161158 161996 163343 164537 165254 166074 167491 169063 170143 170959 172254 174196
52468 174196 176376 178722 181626 185033 187920 189086 188295 186499 184914 184007 183454 182977 182801 183036 183090 182343
52452 182343 181287 181209 182668 184856 186675 187883 188968 190437 192484 194935 197263 199006 200274 201465 202542
52437 202542 203155 203508 204332 205805 207222 208022 208448 208865 209097 208813 208017 206769 205064 203260 201965 201154 200153
52420 200153 198779 197575 196517 194619 191607 188918 187945 188086 187714 186456 185225 184411 183468 182161 180985
52405 180985 180165 179315 178316 177637 177526 177623 177616 177609 177683 177705 177800 178386 179526 180741 181689 182533 183443 184166 184324 183814 182771
52384 182771 181502 180587 180674 181897 183695 185360 186633 187733 188943 190225 191158 191380 191132 191130 191762 192716 193622
52367 193622 194690 196333 198486 200721 202728 204309 205294 206028 207530 210462 214118 217166 219158 220594 221729
52352B21729O14L09P39J300J146P89J412K838L537K905K179K557L459L488K477
52337B51478J603J646K083K109J839J957K491K731K309J745J572J574J428J497
52323B78062K305L388L642K789J757J458J858K489L163L871M479M868N031M915
52309C24075M603M656N608P057P950Q092Q472R743J1139J1593J1228J0953J1075
52296D36244J1174J1171J1661J3046J4881J6268J6698J6515J6590J7463J8648
52285F00359J9058J8265J7095J6768J7714J9342K0695K1122K0569J9500J8391
52274H08878J7274J5933J4435J3068J1793J0298Q655P344O503N688M584L377K213
52261I30043Q88o19j863k575l078l753m488m966n104m946m509m018l782l653l108
$$ plain form
52352 221729 222343 222652 223391 224691 225837 226626 228038 230876 234413 237318 239497 242054 245513 249001 251478
52337 251478 253081 254727 256810 258919 260758 262715 265206 267937 270246 271991 273563 275137 276565 278062
52323 278062 280367 283755 287397 290186 291943 293401 295259 297748 300911 304782 309261 314129 319160 324075
52309 324075 328678 333334 338942 345999 353949 362041 370513 380256 391395 402988 414216 425169 436244
52296 436244 447418 458589 470250 483296 498177 514445 531143 547658 564248 581711 600359
52285 600359 619417 637682 654777 671545 689259 708601 729296 750418 770987 790487 808878
52274 808878 826152 842085 856520 869588 881381 891679 900334 907678 914181 919869 924453 927830 930043
52261 930043 930931 930312 928449 925874 922796 919043 914555 909589 904485 899539 895030 891012 887230 883577 880469
52246H80469k115j295q99l15J023K794M348N563O731Q017R462J1016J2301J2852
52232I49952J2899J3169J3627J3353J2145J1219J1410J1676J0539Q337O641N884
52220A080851M993L259J223m92k054l699n129o083o881p932r210j0489j1694j2804
52206A013859j3744j4578j5390j5986j6107j6004j6255j6918j7313j6933j6020
52195H38611j5032j3970j2620j1131r888r031q520q511r157r990j0046q853p055
52182G04807n681n007m551m107m110m780n401n055l790k539j989k036k301k583
52168F50877k787k828k768k697k498k094j807j987k365k346j942j797k195k740
52154F18026l071l247l261k908k398k376k976l510l478l202l085k943k495j967
$$ plain form
52246 880469 878354 877059 876160 875845 876868 879662 884010 889573 896304 904321 913783 924799 937100 949952
52232 949952 962851 976020 989647 1003000 1015145 1026364 1037774 1049450 1059989 1068326 1074967 1080851
52220 1080851 1085844 1089103 1090326 1089834 1087780 1084081 1078952 1072869 1065988 1058056 1048846 1038357 1026663 1013859
52206 1013859 1000115 985537 970147 954161 938054 922050 905795 888877 871564 854631 838611
52195 838611 823579 809609 796989 785858 775970 766939 758419 749908 740751 730761 720715 711862 704807
52182 704807 699126 694119 689568 685461 681351 676571 671170 666115 662325 659786 657797 655761 653460 650877
52168 650877 648090 645262 642494 639797 637299 635205 633398 631411 629046 626700 624758 622961 620766 618026
52154 618026 614955 611708 608447 605539 603141 600765 597789 594279 590801 587599 584514 581571 579076 577109
52140E77109j647j389j028q57j182j851k595l379m041m148l573k780k153j615
52126E44871j227j379j995k285j856j312j175j014l65L45N81P38J362K055K169
52111E39513K067K560L558M356M887N603O418O924P438Q610J0094J0823J0757
52098F23608J1176J2914J5318J7259J8402J9095J9759K0726K2075K3319K3768
52087H27419K3435K3050K3002K2838K2084K1004K0223J9882J9494J8460J6654
52076A057545J4560J2822J1557J0258Q581O804N235L576J407j056l251n087o860
52063A116091q551r857j0689j1155j1210j0951j0935j1576j2367j2430j1633j0539
52051I84198r498q491p633p031o248m802l073j863j136j06J482L060M365N804
$$ plain form
52140 577109 575462 574073 573045 572188 571006 569155 566560 563181 559140 554992 551419 548639 546486 544871
52126 544871 543644 542265 540270 537985 536129 534817 533642 532628 532263 532608 533189 533927 535289 537344 539513
52111 539513 541580 544140 547698 552054 556941 562544 568962 575886 583324 591934 602028 612851 623608
52098 623608 634784 647698 663016 680275 698677 717772 737531 758257 780332 803651 827419
52087 827419 850854 873904 896906 919744 941828 962832 983055 1002937 1022431 1040891 1057545
52076 1057545 1072105 1084927 1096484 1106742 1115323 1122127 1127362 1130938 1132345 1131289 1128038 1122951 1116091
52063 1116091 1107540 1097683 1086994 1075839 1064629 1053678 1042743 1031167 1018800 1006370 994737 984198
52051 984198 974700 966209 958576 951545 945297 940495 937422 935559 934423 934317 935799 938859 943224 949028
52037I49028P506Q901R602R890J0009R728R058Q644R045J0012J0842J1051J0499
52024A073815R361Q107P062N901M096J932L57l66j114k741n043p210q752r671
52010A075734j0261j1041j2444j4274j5892j7096j8251j9475k0342k0721k1195
51999H94742k2201k3341k3942k3835k3164k2035k0779k0076k0201k0512k0284
51988F54372j9671j9331j9355j9220j8603j7678j6666j5610j4634j3943j3495
51977D66166j3025j2437j1909j1563j1276j0921j0520j0067r392q431p466o891
51965C42268o690o401n709m902m434m288m142m076m547n493o075n629m503l500
51951B71879k890k444k167k355l006l665l880l522k826k298k394k897k967k173
$$ plain form
52037 949028 956534 965435 975037 984927 994936 1004664 1013722 1022366 1031411 1041423 1052265 1063316 1073815
52024 1073815 1083176 1091283 1098345 1104246 1108342 1110274 1110631 1110265 1109151 1106410 1101367 1094157 1085405 1075734
52010 1075734 1065473 1054432 1041988 1027714 1011822 994726 976475 957000 936658 915937 894742
51999 894742 872541 849200 825258 801423 778259 756224 735445 715369 695168 674656 654372
51988 654372 634701 615370 596015 576795 558192 540514 523848 508238 493604 479661 466166
51977 466166 453141 440704 428795 417232 405956 395035 384515 374448 365056 356625 349159 342268
51965 342268 335578 329177 323468 318566 314132 309844 305702 301626 297079 291586 285511 279882 275379 271879
51951 271879 268989 266545 264378 262023 259017 255352 251472 247950 245124 242826 240432 237535 234568 232395
51937B32395j143p62j017j306j491j936k579k790k219j247m58j23k12m86n96m00
51921B13630j51j05k23n19j264k320k818k219j262j053j578j954j883j802j838
51906A92641j700j529j746k035j522k52O42M74k20p35j019j166r96o20o39j258
51890A78320j887j975j629j110m40J59J98l07o67m53LL03N23P12O08K42J36M95
51872A73231Q16O42J39l74p83q31j71Q54J287Q76M56O85J074R39M73K65L91O54
51854A80623J159J926K452K271J668J245J204J420J763J937J580R24P37J146J230
51839B03285L72o42p15k2L57L2l71k86J16L59K02k34n29l22J68K67k55p84o71
51820B00327r1K67L2n62r71p19J12O74K00q66j263n75L03O18O75Q80Q96M51O5
$$ plain form
51937 232395 231252 230490 229473 228167 226676 224740 222161 219371 217152 215905 215447 215324 215112 214626 214030 213630
51921 213630 213479 213374 213151 212632 211368 209048 206230 204011 202749 201696 200118 198164 196281 194479 192641
51906 192641 190941 189412 187666 185631 184109 183857 184499 184973 184753 184018 182999 181833 180837 180217 179578 178320
51890 178320 176433 174458 172829 171719 171279 171438 171636 171329 170662 170209 170212 170515 171038 171750 172358 172600 172736 173231
51872 173231 174047 174689 174828 174454 173671 172840 172669 173523 174810 175686 176142 176827 177901 178840 179313 179578 179969 180623
51854 180623 181782 183708 186160 188431 190099 191344 192548 193968 195731 197668 199248 200172 200909 202055 203285
51839 203285 203657 203015 202300 202278 202635 202667 202296 202010 202126 202485 202687 202453 201924 201602 201770 202037 201782 200998 200327
51820 200327 200236 200503 200535 199973 199002 198283 198395 199069 199269 198403 197140 196565 196868 197486 198161 199041 199937 200388 200453
51801B00453K33N76O09N53O69N04k19p39l48L37K65l74n70j47J42J3o8Q3J18l9
51781B02051k0K56M95O22P96Q47M20l54r44j133j036n92K56J032J155Q12P00R60
51763B06323J087Q21M58K93L49O30J022J135P89M77P52J360J761K080K700L146
51747B25183K548J164L45P51J582J859J588J307J302J654K387L102L126K315J356
51732B51569Q92Q92J065J347J626J597J218R39J051J187Q58K23j15O3L66L41M5
51715B65164m0L05O49L83m28j109j367j692k411k913k484j464q08o83m18K48O60
51698B51592K25p97j694k006j676r82m53m21n75l03M50J097J156P18K63L59J425
51681B48378L199M625M744L725K488J453M19n24q54n45k82l95l25M88J699K477
$$ plain form
51801 200453 200686 201262 201871 202424 203093 203597 203378 202639 202291 202628 202893 202519 201949 201802 201944 201957 201889 201972 202090 202051
51781 202051 202031 202287 202782 203404 204200 205047 205467 205113 204169 203036 202000 201408 201664 202696 203851 204663 205363 206323
51763 206323 207410 208231 208689 208982 209331 209961 210983 212118 212907 213384 214136 215496 217257 219337 222037 225183
51747 225183 227731 228895 229240 229991 231573 233432 235020 236327 237629 239283 241670 244772 247898 250213 251569
51732 251569 252461 253353 254418 255765 257391 258988 260206 261145 262196 263383 264241 264464 264349 264412 264778 265119 265164
51715 265164 265124 265429 266078 266461 266033 264924 263557 261865 259454 256541 254057 252593 251785 251102 250684 250932 251592
51698 251592 251817 251020 249326 247320 245644 244662 244209 243788 243213 242910 243360 244457 245613 246331 246594 246953 248378
51681 248378 251577 256202 260946 264671 267159 268612 269031 268507 267653 267108 266826 266431 266106 266594 268293 270770
51665B70770K418J753R92O03P55J126J262J150J130J293J392J303J054N02l88
51650B87115j107j107q03j168k199k726k087j099q13j118j237j008r22j286j964
51635B66471k698l161l006k323j709j538j507j340j403j990k520k258j515j262
51621B38241j630j741j097l19j64m95o76n23l39l35m71p23j027j042m48N03J066
51604B28780Q22J63k64l28l83o64j009j066o00L99J550K200K023J476J244J380
51588B35723J406J286J540K277K878K960L004L395L632L117K317K208K886L559
51574B72188L735L607L363K922K442K281K342K115J480Q79N32J91j96l06j45k75
51558B97155r25j441j143k30N75J014J363J710J723J168L70j4L63J248K104K710
$$ plain form
51665 270770 273188 274941 275933 276536 277291 278417 279679 280829 281959 283252 284644 285947 287001 287503 287115
51650 287115 286008 284901 284098 282930 280731 278005 275918 274819 274006 272888 271651 270643 269721 268435 266471
51635 266471 263773 260612 257606 255283 253574 252036 250529 249189 247786 245796 243276 241018 239503 238241
51621 238241 236611 234870 233773 233454 233290 232795 232119 231596 231257 230922 230451 229728 228701 227659 227211 227714 228780
51604 228780 229602 229765 229501 229173 228790 228126 227117 226051 225451 225850 227400 229600 231623 233099 234343 235723
51588 235723 237129 238415 239955 242232 245110 248070 251074 254469 258101 261218 263535 265743 268629 272188
51574 272188 275923 279530 282893 285815 288257 290538 292880 294995 296475 297354 297886 298077 297881 297575 297430 297155
51558 297155 296230 294789 293646 293416 293991 295005 296368 298078 299801 300969 301339 301325 301688 302936 305040 307750
51542C07750L236L756L964L673L170K838K612K255J908J845J918J819J688J905
51528C44337K364K559K337J951J448P12J04K25R57J459J379J269J528J662J058
51513C65349r4j054j385j205j033j490k728l936m041l090k285k414k947l090k956
51498C31601k982k931k299j400j125j747k595k955k747k335k084k197k618k980
51484B98606k900k334j506o51J09O92J095J367J490J419J294J356J593J765J876
51469C05271K237K918L505L679L652L782M037M206M304M410M292L673K744K057
51455C54767J883J926J751J342J139J468K029K126J605J239J755K725K956K053
51441C80764Q90M24O30Q90Q61N28j02q79j403j491j484j724j973j813j385j259
$$ plain form
51542 307750 310986 314742 318706 322379 325549 328387 330999 333254 335162 337007 338925 340744 342432 344337
51528 344337 346701 349260 351597 353548 354996 355708 355812 356037 356994 358453 359832 361101 362629 364291 365349
51513 365349 365255 364201 362816 361611 360578 359088 356360 352424 348383 345293 343008 340594 337647 334557 331601
51498 331601 328619 325688 323389 321989 320864 319117 316522 313567 310820 308485 306401 304204 301586 298606
51484 298606 295706 293372 291866 291215 291324 292016 293111 294478 295968 297387 298681 300037 301630 303395 305271
51469 305271 307508 310426 313931 317610 321262 325044 329081 333287 337591 342001 346293 349966 352710 354767
51455 354767 356650 358576 360327 361669 362808 364276 366305 368431 370036 371275 373030 375755 378711 380764
51441 380764 381654 382078 382708 383598 384459 384987 384885 384006 382603 381112 379628 377904 375931 374118 372733 371474
51425C71474j659k271k730k955k977k777k355j827j452j554k297l346l959l573
51411C35742k345j024l23m06q43j086j018r95j155r97l5J335K124J997J581J428
51395C33980J312P89k1o55r55j117j349j736k225k543k445k114k036k307k566
51380C14012k728l233m242n164n432n304n374n626n549n009m445m233m275m214
51366B49184l902l581l674m234m612m066k809j981k251k979l086k389j592j247
51352B06781j316j578j940k253k230j690q27j64k15r81j806j949j337n00J16L98
51336A88509K62k81p58o21j75k98j043j311m21Q88J675K126K828L391K945J705
51320A99421Q51Q94J186J144J084J553K443L206L465L191K603K049J792J771J743
$$ plain form
51425 371474 369815 367544 364814 361859 358882 356105 353750 351923 350471 348917 346620 343274 339315 335742
51411 335742 333397 332373 332050 331644 330801 329715 328697 327702 326547 325550 325515 326850 328974 330971 332552 333980
51395 333980 335292 336081 336060 335405 334450 333333 331984 330248 328023 325480 323035 320921 318885 316578 314012
51380 314012 311284 308051 303809 298645 293213 287909 282535 276909 271360 266351 261906 257673 253398 249184
51366 249184 245282 241701 238027 233793 229181 225115 222306 220325 218074 215095 212009 209620 208028 206781
51352 206781 205465 203887 201947 199694 197464 195774 194947 194783 194568 193587 191781 189832 188495 187995 188111 188509
51336 188509 188771 188490 187732 187111 186936 186638 185595 184284 183863 184751 186426 188552 191380 194771 197716 199421
51320 199421 200272 201166 202352 203496 204580 206133 208576 211782 215247 218438 221041 223090 224882 226653 228396
51305B28396J593J299P59lo61q80p78o76o49o40q15j312j780j722j330j295j750
51288B17756k037j712j247j308j798k069j909j763j996k324k296k015k057k593
51274A90632l074k989k608k493k561k257j616j409k026k802k850k100j139m39
51260A60269j22j35k95l87n59j186k082k379j628n45o8j42r6J68K17P8L17J019
51242A52444J488J172L23m76r78j217j203q97l63K06N36M25k5m26m74k87j38r4
51224A50016o6nJ65N46R50R65N43K08L19N60N18L44L26K66m5j91K87R39R48M62
51204A58055M62J254J963J751P89k03q02r55p58m64k99r8N07J350J697J140J66
51187A65555m62n36l40k05l05p16j308j700j559r08j24L58L06j60p12j168j552
$$ plain form
51305 228396 229989 231288 232047 232044 231383 230503 229725 229049 228400 227760 226945 225633 223853 222131 220801 219506 217756
51288 217756 215719 214007 212760 211452 209654 207585 205676 203913 201917 199593 197297 195282 193225 190632
51274 190632 187558 184569 181961 179468 176907 174650 173034 171625 169599 166797 163947 161847 160708 160269
51260 160269 160147 160012 159717 159330 158771 157585 155503 153124 151496 150951 150883 150741 150645 150813 151030 151108 151425 152444
51242 152444 153932 155104 155427 154951 153973 152756 151553 150656 150293 150499 151035 151460 151435 151009 150535 150248 150110 150016
51224 150016 149950 149945 150110 150656 151606 152571 153114 153322 153641 154201 154719 155063 155389 155655 155610 155419 155706 156645 157593 158055
51204 158055 158517 159771 161734 163485 164274 164071 163269 162314 161556 161092 160793 160695 161202 162552 164249 165389 165555
51187 165555 165093 164557 164217 164012 163707 162991 161683 159983 158424 157516 157392 157750 158056 157896 157184 156016 154464
51170A54464j706j207m6R28Q06j83q51m95L42O82K27o15j340j676j559j114o46
51153A46011m04l76l79l45m93j046j786k019j294j28M34L4o05p39n22m59n06l05
51135A35073R2L26L65M20L97J01k23j50K00M02N61J113J846J934J168L66K65O52
51117A44908R16R07Q60Q87R34R31P07J31n28p59n50n07r50j345j076l25K41M28
51099A45810N32P07Q36R85J409J943K002J415Q48R72J465J391N66j42q6K10o9
51082A60794o14m03O23J196M07j081k004k009j613j148n42J09N29P64J057J304
51066A57369J135N49j8k61k30p2J16J76N1l6J53N15Q32J092J284J109M37k32l01
51047A63668J31M69N08N36P42J039J387J723J752J341R31J007J375J535J540J707
$$ plain form
51170 154464 152758 151551 151505 152433 153239 153056 152205 151710 152052 152734 152961 152346 151006 149330 147771 146657 146011
51153 146011 145607 145231 144852 144507 144014 142968 141182 139163 137869 137741 138175 138209 137604 136865 136343 135884 135378 135073
51135 135073 135165 135491 135856 136276 136673 136774 136551 136401 136601 137003 137564 138677 140523 142457 143625 143991 144256 144908
51117 144908 145824 146731 147591 148478 149412 150343 151050 151181 150653 149894 149344 148837 147887 146542 145466 145141 145382 145810
51099 145810 146342 147049 147885 148870 150279 152222 154224 155639 156487 157459 158924 160315 160881 160739 160653 160863 160794
51082 160794 160180 159777 160400 161596 162003 160922 158918 156909 155296 154148 153606 153715 154244 155008 156065 157369
51066 157369 158504 159053 159035 158774 158544 158472 158588 158764 158815 158779 158932 159447 160279 161371 162655 163764 164201 163969 163668
51047 163668 163799 164268 164776 165312 166054 167093 168480 170203 171955 173296 174227 175234 176609 178144 179684 181391
51031A81391J748J122J86j6P40J451J268M56k23m54l15M2M33P18J031J447J517
51014A92542P99j47k06P20J519J514J355J837K663L070K966K800K786K920L328
50999B20466M028M637M827M836N051N455N889O593P848R287J0056R775Q997Q608
50985C16353R041J0058J1239J2491J4037J5933J7901J9771K1746K4000K6351K8693
50973E27614L1431L4908L8735M2321M5760M9464N3266N6711O0025O3782O7669
50962A071686P0650P2339P3203P3210P1475O7582O2150N5750M8261L9786L1102
50951A737194K2608J3810M514m431j2296j9476k6455l2592l6893l9394m0793m1257
50939A524539m0525l8813l6762l4772l3063l2010l1667l1351l0559k9904l0315
$$ plain form
51031 181391 183139 184261 184447 184431 185171 186622 187890 188346 188123 187669 187354 187396 187829 188547 189578 191025 192542
51014 192542 193341 193194 192988 193708 195227 196741 198096 199933 202596 205666 208632 211432 214218 217138 220466
50999 220466 224494 229131 233958 238794 243845 249300 255189 261782 269630 278917 288973 298748 307745 316353
50985 316353 325394 335452 346691 359182 373219 389152 407053 426824 448570 472570 498921 527614
50973 527614 559045 593953 632688 675009 720769 770233 823499 880210 940235 1004017 1071686
50962 1071686 1142336 1214675 1287878 1361088 1432563 1500145 1562295 1618045 1666306 1706092 1737194
50951 1737194 1759802 1773612 1778126 1773695 1761399 1741923 1715468 1682876 1645983 1606589 1565796 1524539
50939 1524539 1484014 1445201 1408439 1373667 1340604 1308594 1276927 1245576 1215017 1185113 1154798
50928A154798l1531l2393l2507l2751l3929l5660l6841l6726l5470l3865l2602
50917G80523l1651l0404k8574k6587k4877k3215k1164j8793j6561j4736j3383
50906E30578j2505j1860j0967r669q350p205n841m081k543j803j425o28N31J340
50892D55572J522J396J185R13P67R08J111J295K022L708N618O576O587O751P583
50877E03514Q426Q721Q910R633J0778J1849J2782J3929J5524J7552J9849K2122
50865F63589K4124K6087K8736L2566L7224M1808M5802M9714N4696O1523O9846
50854A135715P8646Q7354R6304J05908J15746J24887J32880J40187J47552J55062
50844B320241J61692J65796J66275J63284J57378J48059J33977J14813R2177O8099
$$ plain form
50928 1154798 1123267 1090874 1058367 1025616 991687 956027 919186 882460 846990 813125 780523
50917 780523 748872 718468 689894 663307 638430 615215 594051 575258 558697 543961 530578
50906 530578 518073 506213 495246 485577 477227 470022 464181 460100 457557 455754 454329 453701 454232 455572
50892 455572 457094 458490 459675 460588 461355 462263 463374 464669 466691 470399 476017 482593 489180 495931 503514
50877 503514 511940 520661 529571 539204 549982 561831 574613 588542 604066 621618 641467 663589
50865 663589 687713 713800 742536 775102 812326 854134 899936 949650 1004346 1065869 1135715
50854 1135715 1214361 1301715 1398019 1503927 1619673 1744560 1877440 2017627 2165179 2320241
50844 2320241 2481933 2647729 2814004 2977288 3134666 3282725 3416702 3531515 3623692 3691791
50834C691791M3368J8063o966l0230n0882o8820q3666r4623j01382j04325j03777
50823C108551r9910r3567q6301p9208p2395o5916o0631n7629n7192n8774o1577
50812B315451o4840o7834p0218p2351p4897p7981q0864q2477q2186q0120p6925
50801A484758p3242o9377o5206o0419n4988m9536m5017m1706l8769l5198l1025
50790I20275k7135k3975k1138j8213j5295j2519r864p711o702o603o181m859l696
50777G56384l860m851n215m564l738l330l189l303m021n142n722n209m182l600
50763F96458l751m152m157l500k500j708j175k39J588L832N641P005Q730J1260
50749G13332J4122J6644J8753K0883K3420K6333K9229L1846L4638L8526M3799
$$ plain form
50834 3691791 3735159 3753222 3746256 3716026 3665144 3596324 3512658 3418035 3316653 3212328 3108551
50823 3108551 3008641 2915074 2828773 2749565 2677170 2611254 2550623 2492994 2435802 2377028 2315451
50812 2315451 2250611 2182777 2112559 2040208 1965311 1887330 1806466 1723989 1641803 1561683 1484758
50801 1484758 1411516 1342139 1276933 1216514 1161526 1111990 1066973 1025267 986498 951300 920275
50790 920275 893140 869165 848027 829814 814519 802000 792136 784425 777723 771120 764939 760080 756384
50777 756384 752524 747673 742458 737894 734156 730826 727637 724334 720313 715171 709449 704240 700058 696458
50763 696458 692707 688555 684398 680898 678398 676690 675515 675276 676864 680696 686337 693342 702072 713332
50749 713332 727454 744098 762851 783734 807154 833487 862716 894562 929200 967726 1011525
50738A011525M9591N4809N9300O3723O8741P4723Q1709Q8983R5048R8835J00721
50727A847708J01725J01969J00642R7074R1046Q2248P0461N6211M0389K3292M863
50716B617628j4164l2199m7935o0821p0485p6575p9272p9170p6583p1724o5485
50705A943215n9160n3343m7964m3305l9949l7670l5547l3594l3177l5215l8823
50694A485468m2356m5031m6987m8379m9152m9262m8600m6965m4470m1572l8483
50683I84211l5018l1176k7396k3975k0808j7920j5595j3685j1416q359n014k080
50671G71769L56K563M634O590Q542J0349J1590J2236J2867J3817J4598J4605J4012
50658H98528J3539J3672J4439J5621J6804J7588J7968J8356J9041J9981K1118
$$ plain form
50738 1011525 1061116 1115925 1175225 1238948 1307689 1382412 1464121 1553104 1648152 1746987 1847708
50727 1847708 1949433 2051402 2152044 2249118 2340164 2422412 2492873 2549084 2589473 2612765 2617628
50716 2617628 2603464 2571265 2523330 2462509 2392024 2315449 2236177 2157007 2080424 2008700 1943215
50705 1943215 1884055 1830712 1782748 1739443 1699494 1661824 1626277 1592683 1559506 1524291 1485468
50694 1485468 1443112 1398081 1351094 1302715 1253563 1204301 1155701 1108736 1064266 1022694 984211
50683 984211 949193 918017 890621 866646 845838 827918 812323 798638 787222 778863 773849 771769
50671 771769 772125 774688 779322 785912 794454 804803 816393 828629 841496 855313 869911 884516 898528
50658 898528 912067 925739 940178 955799 972603 990191 1008159 1026515 1045556 1065537 1086655
50647A086655K2477K3947K5504K7619L0640L3783L5721L6498L7753M0488M3663
50636A444748M5748M6685M7297M7520M6524M4170M1150L7777L3684K8805K3774
50625A887882J9148J4865J0662O502K574o93k673l029k169q39O92K620M852O885
50611A947279Q377R336R689R192P890O233M497K465o6k838n565q729j3446k0282
50597A954032k8355l5896m1803m6436n0678n4624n7541n8960n9182n8631n7301
50586A404625n5152n2550m9987m7567m5085m2312l9023l5115l0933k7216k4366
50575I55319k2084j9883j7648j5355j2747r705o664m091j794Q05L756O483Q527
50562H64919J0015J1309J2605J3981J5537J7363J9377K1287K2720K3581K4309
$$ plain form
50647 1086655 1109132 1133079 1158583 1186202 1216842 1250625 1286346 1322844 1360597 1401085 1444748
50636 1444748 1490496 1537181 1584478 1631998 1678522 1722692 1763842 1801619 1835303 1864108 1887882
50625 1887882 1907030 1921895 1932557 1939059 1941633 1940940 1938267 1935238 1933069 1932230 1932922 1935542 1940394 1947279
50611 1947279 1955656 1964992 1974681 1983873 1991763 1997996 2002493 2004958 2004892 2002054 1996489 1987760 1974314 1954032
50597 1954032 1925677 1889781 1847978 1801542 1750864 1696240 1638699 1579739 1520557 1461926 1404625
50586 1404625 1349473 1296923 1246936 1199369 1154284 1111972 1072949 1037834 1006901 979685 955319
50575 955319 933235 913352 895704 880349 867602 857897 851233 847142 845348 846153 849909 856392 864919
50562 864919 874934 886243 898848 912829 928366 945729 965106 986393 1009113 1032694 1057003
50551A057003K5590K7595K9703L1169L1841L2000L1776L1129L0333L0005L0487
50540A388631L1409L2090L2341L2729L4020L6439L9546M2770M5909M9096N2515
50529A817495N6314O0615O5307P0023P4501P8880Q3280Q7303R0240R1699R1683
50518B667340R0178Q7068Q2389P6296O8785N9820M9599L8320K5837J2082k358
50507C255356j6598l0273m3354n5268o5001p2068p6679p8851p8142p4441o8301
50496B596380o0308n0803m0418l0052k0048j0130m71Q000J4697J9941K3861K5527
50484B476176K3804J8457R909j436j4923k9347m3607n7246o9674p9492q5475q7946
50472B059200q8386q7905q6678q4530q1367p7114p1905o6264o0729n5423n0309
$$ plain form
50551 1057003 1082593 1110188 1139891 1171060 1202901 1234901 1266677 1297806 1328139 1358144 1388631
50540 1388631 1420040 1452130 1484471 1517200 1551220 1587659 1627205 1669975 1715884 1764980 1817495
50529 1817495 1873809 1934424 1999731 2069754 2144255 2223135 2306415 2393718 2483958 2575657 2667340
50518 2667340 2757518 2844586 2926975 3003271 3072056 3131876 3181475 3219795 3245632 3257714 3255356
50507 3255356 3238758 3208485 3165131 3109863 3044862 2972794 2896115 2817264 2739122 2664681 2596380
50496 2596380 2536072 2485269 2444851 2414799 2394751 2384621 2384150 2392150 2406847 2426788 2450649 2476176
50484 2476176 2499980 2518437 2528346 2526910 2511987 2482640 2439033 2381787 2312113 2232621 2147146 2059200
50472 2059200 1970814 1882909 1796231 1711701 1630334 1553220 1481315 1415051 1354322 1298899 1248590
50461A248590m5536m1161l6842l2305k7738k3404j9225j5243j1928r455p181m482
50449I74090j646P72K943N353P775R647J1170J3034J5193J6938J8168J9584K1488
50436A114509K3350K4788K6086K7348K7969K7519K6606K6149K6167K5842K4642
50425A400975K2852K1027J9416J8091J7215J6784J6286J5212J4018J4023J5920
50414A591819J8828K1434K3673K6400K9616L2256L3867L5291L7080L8372L8172
50403A926808L6863L5401L3691L0855K6698K1837J6614J0778M106l469j2087k1578
50391B106517l1037l9584m7269n4479o0715o4948o6937o7211o5879o2628n7865
50380A487965n2679m7399m1262l3966k6508j9980j4286q697l025K410P349J1487
$$ plain form
50461 1248590 1203054 1161893 1125051 1092746 1065008 1041604 1022379 1007136 995208 985753 978572 974090
50449 974090 972444 973216 976159 981512 989287 998934 1010104 1023138 1038331 1055269 1073437 1093021 1114509
50436 1114509 1137859 1162647 1188733 1216081 1244050 1271569 1298175 1324324 1350491 1376333 1400975
50425 1400975 1423827 1444854 1464270 1482361 1499576 1516360 1532646 1547858 1561876 1575899 1591819
50414 1591819 1610647 1632081 1655754 1682154 1711770 1744026 1777893 1813184 1850264 1888636 1926808
50403 1926808 1963671 1999072 2032763 2063618 2090316 2112153 2128767 2139545 2143651 2140182 2128095 2106517
50391 2106517 2075480 2035896 1988627 1934148 1873433 1808485 1741548 1674337 1608458 1545830 1487965
50380 1487965 1435286 1387887 1346625 1312659 1286151 1266171 1251885 1243188 1240163 1242573 1249922 1261409
50368A261409J4057J4269J2101Q213L169k855r579j6280k2187k7138l1470l5183
50356A168526l7518l7753l6351l4735l3760l2974l1573k9519k7288k5170k3340
50345H18545k2015k0898j9018j6001j3023j1452j0896r679p204m641l153k466
50333F78099j589q0J845L756N191N902O264P034Q421R817J0563J0632J0485J0695
50319G67035J1678J3263J4569J4852J4487J4485J5067J5492J5322J4960J4658
50308I25868J3892J2228J0162Q529P475O550N378L866K086K90j228k480l765n126
50294I83725o255o983p467p737p591p209p313q388j0083j1716j3007j4051j4941
50281H60984j5709j6322j6500j5930j4915j4435j5143j6541j7497j7379j6414
$$ plain form
50368 1261409 1275466 1289735 1301836 1310049 1313218 1310363 1300784 1284504 1262317 1235179 1203709 1168526
50356 1168526 1131008 1093255 1056904 1022169 988409 955435 923862 894343 867055 841885 818545
50345 818545 796530 775632 756614 740613 727590 716138 705242 695563 688359 683718 680565 678099
50333 678099 676510 676430 678275 682031 687222 693124 699388 706422 714843 724660 735223 745855 756340 767035
50319 767035 778713 791976 806545 821397 835884 850369 865436 880928 896250 911210 925868
50308 925868 939760 951988 962150 970679 978154 984704 990082 993948 996034 996324 995096 992616 988851 983725
50294 983725 977470 970487 963020 955283 947692 940483 933170 924782 914699 902983 889976 875925 860984
50281 860984 845275 828953 812453 796523 781608 767173 752030 735489 717992 700613 684199
50270F84199j5137j3901j2852j2073j1589j1215j0530r189p387n784m810m276
50258E65456l862l647l738l761l310k640k289k244k120k013k311k791k728k001
50244E26001j245q43n31k08k07n61p71o88q16j375j848j869j830k150k572k721
50228E05766k709k681k380j754j402j785k442k579k082j422q82l89J64Q69J797
50213D86089K699L048K705K116J624J064M09J31M94R97J125J043J009O79k77j319
50197E03636j601j103m84j25j2k93j069j879k108j884j846k138k363k547l225
50182D80959m471n490n567m903m246m075m319m606m538l980l174k436j783j086
50168D26285n26m77r33j358j253o91k25l79j271k499l473l947m218m613m988m950
$$ plain form
50270 684199 669062 655161 642309 630236 618647 607432 596902 587713 580326 574542 569732 565456
50258 565456 561594 557947 554209 550448 547138 544498 542209 539965 537845 535832 533521 530730 528002 526001
50244 526001 524756 523913 523382 523174 522967 522406 521635 520947 520131 518756 516908 515039 513209 511059 508487 505766
50228 505766 503057 500376 497996 496242 494840 493055 490613 488034 485952 484530 483648 483259 483423 484292 486089
50213 486089 488788 491836 494541 496657 498281 499345 499754 499885 500379 501376 502501 503544 504553 505232 504955 503636
50197 503636 502035 500932 500448 500323 500311 500018 498949 497070 494962 493078 491232 489094 486731 484184 480959
50182 480959 476488 470998 465431 460528 456282 452207 447888 443282 438744 434764 431590 429154 427371 426285
50168 426285 425759 425282 424349 422991 421738 421047 420822 420443 419172 416673 413200 409253 405035 400422 395434 390484
50152C90484m458l885l546l343k917k030q25J57M39J56p6K8L5n17j330j661j227
50135C65484m66J15L78M74N97Q89J266J375J007N34O38J531K675L427L705L895
50119C87524M187M326M032L504L236L345L439L279L174L366L392K667J557J075
50105D32103J429J663J070K98M75J706K979L322K633J569J028J469K434K959K715
50090D59852K481L093M371N443N833N703N299M782M429M450M660M804N083N846
50076E26129O887P578P765P899Q201Q276P764O971O470O435O591O686O626O272
50062F26550N492M467L770L846M436M673L939K484J101L99N47J442K676L483L330
50047F72635K567J989J705J153K82j51J51L13n44k052l278m024m611m880m531
$$ plain form
50152 390484 386026 382141 378595 375252 372335 370305 369480 369637 370076 370232 370156 370184 370219 369702 368372 366711 365484
50135 365484 365018 365133 365511 365985 366582 367471 368737 370112 371119 371653 372291 373822 376497 379924 383629 387524
50119 387524 391711 396037 400069 403573 406809 410154 413593 416872 420046 423412 426804 429471 431028 432103
50105 432103 433532 435195 436265 436563 437038 438744 441723 445045 447678 449247 450275 451744 454178 457137 459852
50090 459852 462333 465426 469797 475240 481073 486776 492075 496857 501286 505736 510396 515200 520283 526129
50076 526129 533016 540594 548359 556258 564459 572735 580499 587470 593940 600375 606966 613652 620278 626550
50062 626550 632042 636509 640279 644125 648561 653234 657173 659657 660758 661157 661704 663146 665822 669305 672635
50047 672635 675202 677191 678896 680049 680331 680180 680331 680644 680100 678048 674770 670746 666135 661255 656724
50032F56724m143m729o118o886o155m648l589l244l059k722k513k809l559m212
50018E98338m057k915j542r37j172j287n43P32J815K634L684N173O727P894Q571
50003F23115Q915R184R631J0356J1228J2109J3120J4401J5635J6175J5722J4697
49991G74288J3667J2622J1103Q994O785N042L937L504L867M905N858N878M940
49978H65390L763K701J206j399m963q696j2021j4959j7708k0184k2015k2871k2809
49965G25435k2324k1946k1786k1480k0638j9194j7377j5520j3978j2941j2253
49954E25998j1569j0732r898r342r254r649j0145r942q508o332m687m346m904
49941D16690n339m989l887k553j679j598j963k138j982j844j811j486p03P6L71
$$ plain form
50032 656724 652581 647852 641734 634848 628693 624045 620456 617212 614153 611431 608918 606109 602550 598338
50018 598338 594281 591366 589824 588887 587715 586428 585885 586617 588432 591066 594750 599923 606650 614544 623115
50003 623115 632030 641214 650845 661201 672429 684538 697658 712059 727694 743869 759591 774288
49991 774288 787955 800577 811680 820674 827459 832501 836438 839942 843809 848714 854572 860450 865390
49978 865390 869153 871854 873060 871661 866698 858002 845981 831022 813314 793130 771115 748244 725435
49965 725435 703111 681165 659379 637899 617261 598067 580690 565170 551192 538251 525998
49954 525998 514429 503697 493799 484457 475203 465554 455409 445467 436959 430627 425940 421594 416690
49941 416690 411351 406362 402475 399922 398243 396645 394682 392544 390562 388718 386907 385421 384718 384794 385165
49926C85165K97K19K36K59L16M34N93R51J712K598K895K365J635J415J712K126
49910D04928K426K468K121J666J789K679L550L599L074K865L367M244N026N485
49896D49287N639N762O214O975P710Q399R431J0841J2091J3043J4315J6251J8219
49883E84177J9670K1089K3103K5311K6913K7961K8985K9796K9719K8703K7277
49872H72704K5661K3927K2704K2585K3034K2940K2172K1545K1316K0812J9567
49861A118967J7732J5257J1749P360K798j758o767j2068j6578j9682k1961k4193
49849A070856k6354k8112k9509l0583l1033l0740l0088k9367k8384k7057k5772
49838G53857k4750k3585k1948k0183j8826j7842j6798j5393j3593j1576r837q913
$$ plain form
49926 385165 385462 385681 385917 386176 386492 386926 387519 388470 390182 392780 395675 398040 399675 401090 402802 404928
49910 404928 407354 409822 411943 413609 415398 418077 421627 425226 428300 431165 434532 438776 443802 449287
49896 449287 454926 460688 466902 473877 481587 489986 499417 510258 522349 535392 549707 565958 584177
49883 584177 603847 624936 648039 673350 700263 728224 757209 787005 816724 845427 872704
49872 872704 898365 922292 944996 967581 990615 1013555 1035727 1057272 1078588 1099400 1118967
49861 1118967 1136699 1151956 1163705 1171065 1173863 1172105 1165338 1153270 1136692 1117010 1095049 1070856
49849 1070856 1044502 1016390 986881 956298 925265 894525 864437 835070 806686 779629 753857
49838 753857 729107 705522 683574 663391 644565 626723 609925 594532 580939 569363 559526 550613
49826E50613q779q879q832q686q375p644o702o237o454o771o728o458n919m618
49812D49531k703j461j830k968l193k101q38n11j089j816k038j569p89l33m07
49797D25885n15k70l8l32q70r70o89p26j222j501j179q06r68j335j127j84R21
49780D14074J616J768J509J060P47Q38J295J848K368K948L601M151M522M943N689
49765D52977O821Q277R997J1775J3297J4622J6335J8694K0982K2221K2515K2850
49753F41363K3573K3834K2854K0903J8618J6147J3608J1736J1167J1458J1625
49742H26886J1448J1466J1897J2289J2123J1094Q853N139K59n030j0097j4538
49730H81789j7975k0365k2299k4265k5786k5926k4567k2525k0505j8701j7224
$$ plain form
49826 550613 541834 532955 524123 515437 507062 499418 492716 486479 480025 473254 466526 460068 454149 449531
49812 449531 446828 445367 443537 440569 437376 435275 434437 433926 432837 431021 428983 427414 426625 426292 425885
49797 425885 425370 425100 425062 424730 423860 422890 422201 421475 420253 418752 417573 416767 415799 414464 413337 413153 414074
49780 414074 415690 417458 418967 420027 420774 421612 422907 424755 427123 430071 433672 437823 442345 447288 452977
49765 452977 459798 468075 478072 489847 503144 517766 534101 552795 573777 595998 618513 641363
49753 641363 664936 688770 711624 732527 751145 767292 780900 792636 803803 815261 826886
49742 826886 838334 849800 861697 873986 886109 897203 906056 911195 911454 906424 896327 881789
49730 881789 863814 843449 821150 796885 771099 745173 720606 698081 677576 658875 641651
49719F41651j6110j4899j3035j0803r142q426q092p569o835n986n054m341m190
49706E27169m243l697k459j371j073j349j785k224k414j966j023k43Q3K60L42
49691E04007k9p11q86k90K95K18r5KL51M70M21N28P03O13K27k74p20p51kJ190
49671E05267J912J859J787K278K788K553J827J497J840K379K668K641K376K000
49657E35672J688J487J366J571K418L638M409M332L681K688J326R2j12P03J327
49642E66286J069P98J472K540K853K478K480L239M030M106L409K393J725J931
49628F00809K809L493L477L198L190L404L744M483N471N826N249M777N296O117
49614F61343O207N973O422P242P278O635O617P652Q769R276R593J0186J0903J1639
$$ plain form
49719 641651 625541 610642 597607 586804 577662 569236 561144 553575 546740 540754 535700 531359 527169
49706 527169 522926 519229 516770 515399 514326 512977 511192 508968 506554 504588 503565 503322 503405 503665 504007
49691 504007 503978 503267 502381 502091 502386 502604 502509 502511 502862 503332 503753 504281 504984 505597 505824 505550 504830 504079 504077 505267
49671 505267 507179 509038 510825 513103 515891 518444 520271 521768 523608 525987 528655 531296 533672 535672
49657 535672 537360 538847 540213 541784 544202 547840 552249 556581 560262 562950 564276 564368 564256 564959 566286
49642 566286 567355 568153 569625 572165 575018 577496 579976 583215 587245 591351 594760 597153 598878 600809
49628 600809 603618 607111 610588 613786 616976 620380 624124 628607 634078 639904 645153 649930 655226 661343
49614 661343 667550 673523 679945 687187 694465 701100 707717 715369 724138 733414 743007 753193 764096 775735
49600G75735J2603J3623J4167J4336J4838J5738J6180J5704J4992J4958J5790
$$ plain form
49600 775735 788338 801961 816128 830464 845302 861040 877220 892924 907916 922874 938664
$$ [...]
##END NTUPLES=NMR SPECTRUM
##END=
