
##TITLE=AC1354_CPIAH12173_6673713_tQ6Dtiq03W
##JCAMPDX= 6.0         $$ Bruker NMR JCAMP-DX V2.0
##DATA TYPE= NMR SPECTRUM
##DATA CLASS= NTUPLES
##ORIGIN= BRUKER
##OWNER= Administrator
$$ 1.72 TOPSPIN		Version 2.1
$$ 2012-08-14 20:30:59.828 -0500  Administrator@TOPSPIN
$$ Compression mode = diff/dup
##.OBSERVE FREQUENCY= 400.02188249412
##.OBSERVE NUCLEUS= ^1H
##.ACQUISITION MODE= SIMULTANEOUS (DQD)
##.ACQUISITION SCHEME= undefined
##.AVERAGES= 8
##.DIGITISER RES= 22
##SPECTROMETER/DATA SYSTEM= spect
##.PULSE SEQUENCE= zg30
##.SOLVENT NAME= COFFEE_meoh
##.SHIFT REFERENCE= INTERNAL, COFFEE_meoh, 1, 14.98509
##AUDIT TRAIL= $$ (NUMBER, WHEN, WHO, WHERE, PROCESS, VERSION, WHAT)
$$ ##TITLE= Audit trail, TOPSPIN		Version 2.1
$$ ##JCAMPDX= 5.01
$$ ##ORIGIN= Bruker BioSpin GmbH
$$ ##OWNER= Administrator
$$ $$ C:\Bruker\TOPSPIN/data/COFFEE/nmr/AC1354_CPIAH12173_6673713_tQ6Dtiq03W/10/pdata/1/auditp.txt
$$ ##AUDIT TRAIL=  $$ (NUMBER, WHEN, WHO, WHERE, PROCESS, VERSION, WHAT)
(   1,<2012-08-14 20:30:52.937 -0500>,<Administrator>,<TOPSPIN>,<go>,<TOPSPIN 2.1>,
      <created by zg
	started at 2012-08-14 20:29:46.062 -0500,
	POWCHK enabled, PULCHK disabled,
       configuration hash MD5:
       6B 1B 68 BB D9 2E 58 E2 7F 35 AD 54 07 DF 0E 41
       data hash MD5: 64K
       AC D5 30 7A 5E 27 08 0F 7C AB 13 E1 14 90 45 87>)
(   2,<2012-08-14 20:30:55.593 -0500>,<Administrator>,<TOPSPIN>,<proc1d>,<TOPSPIN 2.1>,
      <Start of raw data processing
       efp LB = 0 FT_mod = 6 PKNL = 1 PHC0 = 0 PHC1 = 0 SI = 32K 
       data hash MD5: 32K
       1F E5 36 88 EB D4 53 09 68 4C 8E EB D2 74 3A 00>)
(   3,<2012-08-14 20:30:56.015 -0500>,<Administrator>,<TOPSPIN>,<proc1d>,<TOPSPIN 2.1>,
      <pk PHC0 = 176.012 PHC1 = 0 
       data hash MD5: 32K
       BD A7 76 D7 2B 7F 32 AA 0A 1D 50 DB C0 EA 86 8D>)
(   4,<2012-08-14 20:30:56.171 -0500>,<Administrator>,<TOPSPIN>,<proc1d>,<TOPSPIN 2.1>,
      <abs ABSG = 1 
       data hash MD5: 32K
       20 1A 13 5D 88 EC 7F 75 B5 4F 97 DC AF EC BF D0>)
(   5,<2012-08-14 20:30:56.203 -0500>,<Administrator>,<TOPSPIN>,<proc1d>,<TOPSPIN 2.1>,
      <abs ABSG = 2 
       data hash MD5: 32K
       9F 4A 66 16 D3 E6 8D 6C 13 5F 88 BE FF 88 5D DF>)
(   6,<2012-08-14 20:30:56.234 -0500>,<Administrator>,<TOPSPIN>,<proc1d>,<TOPSPIN 2.1>,
      <abs ABSG = 3 
       data hash MD5: 32K
       AA F8 AE 60 C0 73 2A E3 96 A1 73 94 B8 BC 3B 33>)
(   7,<2012-08-14 20:30:56.265 -0500>,<Administrator>,<TOPSPIN>,<proc1d>,<TOPSPIN 2.1>,
      <abs ABSG = 4 
       data hash MD5: 32K
       7E 3A C0 BE E0 E4 24 C6 1E E1 49 C4 D9 8B 4F E5>)
(   8,<2012-08-14 20:30:56.296 -0500>,<Administrator>,<TOPSPIN>,<proc1d>,<TOPSPIN 2.1>,
      <abs ABSG = 5 
       data hash MD5: 32K
       4A 99 28 94 F5 1D 1E B9 8D B7 BA 7C B9 8A DA 2F>)
$$ ##END=
$$ 
$$ $$ hash MD5
$$ $$ A6 B5 EE E7 2D 55 AE C8 C1 01 6F 14 31 A1 55 9A
##$RELAX= 
##$RELAX= 
##$RELAX= 
##$RELAX= 
##$RELAX= 
##$RELAX= 
##$RELAX= 
$$ Bruker specific parameters
$$ --------------------------
$$ [...]
##$TP= (0..7)
150 150 150 150 150 150 150 150
##$TP07= 0
##$TPNAME0= <>
##$TPNAME1= <>
##$TPNAME2= <>
##$TPNAME3= <>
##$TPNAME4= <>
##$TPNAME5= <>
##$TPNAME6= <>
##$TPNAME7= <>
##$TPOAL= (0..7)
0.5 0.5 0.5 0.5 0.5 0.5 0.5 0.5
##$TPOFFS= (0..7)
0 0 0 0 0 0 0 0
##$TUNHIN= 0
##$TUNHOUT= 0
##$TUNXOUT= 0
##$USERA1= <user>
##$USERA2= <user>
##$USERA3= <user>
##$USERA4= <user>
##$USERA5= <user>
##$V9= 5
##$VALIST= <valist>
##$VCLIST= <CCCCCCCCCCCCCCC>
##$VD= 0
##$VDLIST= <DDDDDDDDDDDDDDD>
##$VPLIST= <PPPPPPPPPPPPPPP>
##$VTLIST= <TTTTTTTTTTTTTTT>
##$WBST= 1024
##$WBSW= 4
##$XGAIN= (0..3)
0 0 0 0
##$XL= 0
##$YL= 0
##$YMAX_a= 472016
##$YMIN_a= -590838
##$ZGOPTNS= <>
##$ZL1= 120
##$ZL2= 120
##$ZL3= 120
##$ZL4= 120
##$ABSF1= 14.98509
##$ABSF2= -5.573092
##$ABSG= 5
##$ABSL= 3
##$ALPHA= 0
##$AQORDER= 0
##$ASSFAC= 0
##$ASSFACI= 0
##$ASSFACX= 0
##$ASSWID= 0
##$AUNMP= <proc_prof1d_extract_pilot.lims>
##$AXLEFT= 0
##$AXNAME= <>
##$AXNUC= <1H>
##$AXRIGHT= 0
##$AXTYPE= 0
##$AXUNIT= <>
##$AZFE= 0.1
##$AZFW= 0.1
##$BCFW= 0
##$BC_mod= 0
##$BYTORDP= 0
##$COROFFS= 0
##$CY= 15
##$DATMOD= 1
##$DC= 0
##$DFILT= <>
##$DTYPP= 0
##$F1P= 0
##$F2P= 0
##$FCOR= 0.5
##$FTSIZE= 32768
##$FT_mod= 6
##$GAMMA= 0
##$GB= 0
##$INTBC= 1
##$INTSCL= 1
##$ISEN= 128
##$LB= 0
##$LEV0= 0
##$LPBIN= 0
##$MAXI= 10000
##$MC2= 0
##$MEAN= 0
##$ME_mod= 0
##$MI= 0
##$NCOEF= 0
##$NC_proc= -8
##$NLEV= 6
##$NOISF1= 0
##$NOISF2= 0
##$NSP= 0
##$NTH_PI= 0
##$NZP= 0
##$OFFSET= 14.98509
##$PC= 1
##$PHC0= 176.012
##$PHC1= 0
##$PH_mod= 1
##$PKNL= yes
##$PPARMOD= 0
##$PPDIAG= 0
##$PPIPTYP= 0
##$PPMPNUM= 2147483647
##$PPRESOL= 1
##$PSCAL= 4
##$PSIGN= 0
##$PYNMP= <proc.py>
##$REVERSE= no
##$SF= 400.02
##$SI= 32768
##$SIGF1= 0
##$SIGF2= 0
##$SINO= 400
##$SIOLD= 32768
##$SPECTYP= <>
##$SREGLST= <1H.CDCl3>
##$SSB= 0
##$STSI= 32768
##$STSR= 0
##$SW_p= 8223.68421052631
##$SYMM= 0
##$S_DEV= 0
##$TDeff= 65536
##$TDoff= 0
##$TI= <>
##$TILT= no
##$TM1= 0
##$TM2= 0
##$TOPLEV= 0
##$USERP1= <user>
##$USERP2= <user>
##$USERP3= <user>
##$USERP4= <user>
##$USERP5= <user>
##$WDW= 1
##$XDIM= 32768
##$YMAX_p= 465723750
##$YMIN_p= -708551
##$CURPLOT= <Network HP LaserJet P1505>
##$CURPRIN= <$Network HP LaserJet P1505>
##$DFORMAT= <normdp>
##$LAYOUT= <+/1D_H.xwp>
##$LFORMAT= <normlp>
##$PFORMAT= <normpl>
##$SURQMSG= 1
$$ End of Bruker specific parameters
$$ ---------------------------------
##NTUPLES= NMR SPECTRUM
##VAR_NAME=  FREQUENCY,     SPECTRUM/REAL,   SPECTRUM/IMAG
##SYMBOL=    X,             R,               I
##VAR_TYPE=  INDEPENDENT,   DEPENDENT,       DEPENDENT
##VAR_FORM=  AFFN,          ASDF,            ASDF
##VAR_DIM=   32768,         32768,           32768
##UNITS=     HZ,            ARBITRARY UNITS, ARBITRARY UNITS
##FACTOR=    0.250966925370066, 1,           1
##FIRST=     8223.43324360094, 155,          -21773
##LAST=      0,             -95577,          -110532
##MIN=       0,             -708551,         0
##MAX=       8223.43324360094, 465723750,    0
$$ Real data points
##PAGE= N=1
##DATA TABLE= (X++(R..R)), XYDATA
$$ [...]
19551D32823a41265l24800M2114c9470a9410j05927j85700c3521k70276D43013
19540G6626k7081n580d4135l1279k0299o8210j1887B04366a23483B39878l5318
19529B04560e662j67104j46308h8489G471J58081a384r0221k8882k6172L8711
19518a07948D9098K46083a8q5396B66416c72927a32155j18357l2336A08551h2194
19506B6405a63781h080o6785a9915j68615C8430a38248B29260b60121m6723N5092
19495b51752J11172j74478R4210A67377f1458A83786E5456a4820k77030d7439
19484a81693r8731a07303B1137b60055h76m82552J84853C34779a98789A08105
19473A19154f253l84751F9366A624c09565b0267E2405K32675a60287B9090J55726
$$ y = [432823, -141265, -466065, -423951, -39470, -19410, -125337, -311037, -33521, -303797, 443013, 76626, 49545, 43965, -44135, -75414, -95713, -163923, -175810, 204366, -123483, 239878, 204560, -5662, -172766, -319074, -88489, 7471, 165552, -1384, -91605, -120487, -146659, -107948, 49098, 295181, -18, -85414, 266416, -372927, -132155, -250512, -282848, 108551, -82194, 26405, -163781, -8080, -74865, -19915, -188530, 38430, -138248, 229260, -260121, -306844, -251752, -140580, -315058, -220848, 167377, -61458, 183786, 55456, -14820, -291850, -47439, -181693, -280424, -107303, 21137, -260055, -876, -483428, -298575, 334779, -198789, 108105, 119154, -6253, -391004, 69366, 1624, -309565, -20267, 52405, 285080, -160287, 29090, 184816]
19462A84816G505d07428F449a18161k05880L9777J32832C8301b9097r5228d3285
19450A92896a5301m3510J7116l10824A54951b81717J11935j75936C7213O7470
19440A04683E248L4438O6409J14791j03570Q796K02029i0279j34527j12503a9251
19428I753b11469J03697n1229f6831j16724d7633B2950J82703a74424j4719A35409
19416b12364A009J13433b44293j71169B7748J61558K37910i0149n6542G6575h8334
19404A76302H395a2686A63137b50995d6131B2880L8774L9820c4756B38659G2568
19392f270j82002b318j22185j58643J06801F8520A3553a28498B11138c64492a46660
19380d51841a35469A32307E2710L8205J84201b19632i9647F9892Q141C980e2299
$$ y = [184816, 7505, -407428, 6449, -118161, -324041, -284264, -151432, 38301, -29097, -124325, -43285, 192896, -15301, -58811, -41695, -352519, 154951, -281717, -169782, -345718, 37213, 104683, 5248, 39686, 106095, 220886, 117316, 126112, 328141, -90279, -224806, -337309, -19251, 9753, -211469, -107772, -159001, -66831, -183555, -47633, 22950, 205653, -174424, -189143, 135409, -212364, 1009, 114442, -244293, -415462, 27748, 189306, 427216, -90149, -146691, 76575, -88334, 176302, 8395, -12686, 163137, -250995, -46131, 22880, 61654, 101474, -34756, 238659, 72568, -6270, -188272, -2318, -124503, -283146, -176345, 68520, 13553, -128498, 211138, -364492, -146660, -451841, -135469, 132307, 52710, 90915, 275116, -219632, -99647, 69892, 78033, 3980, -52299]
19368f83955g6758m6641H2343C1417b9834k22751R9237J474a8163k46204g5642
19356H0173p95b48974P7469j0393j37790B28849b1044r5284j36712o0863F5836
19344b16943f3785k8182j37200a7249C29b45212d9250C1243a85228N7236B8890
19332B8562O1962J55031A20254j5484a26453j0853l3722M647D0316N6354k2586
19321G4084a25320B6063d5049k83194m5295B91447b53368A41628C7518g1670A05172
19309A9393K8312b71352A39853b98119F6618b52495a18869j85748F0842h000l74743
19298c82743a35954l5324A35438C8457b3096A33089K11306D7099b33952J12682
19288a21270j96667C98086a72737n7931a13061j37440Q1336A3078b0599k04121
$$ y = [-683955, -76758, -123399, 82343, 31417, -29834, -252585, -153348, -151874, -18163, -264367, -75642, 80173, 79378, -248974, -171505, -181898, -319688, 228849, -21044, -116328, -253040, -313903, 65836, -216943, -63785, -91967, -229167, -17249, 329, -245212, -49250, 31243, -185228, -127992, 28890, 28562, 90524, 245555, 120254, 104770, -126453, -137306, -171028, -166381, 40316, 96670, 74084, -125320, 26063, -45049, -328243, -373538, 291447, -253368, 141628, 37518, -71670, 105172, 19393, 47705, -271352, 139853, -298119, 66618, -252495, -118869, -304617, 60842, -8000, -382743, -135954, -171278, 135438, 38457, -23096, 133089, 344395, 47099, -233952, -121270, -317937, 398086, -172737, -230668, -113061, -250501, -169165, 13078, -20599, -224720]
19278b24720h7242k45677e9531k16153E1089a68993p3900J20214n0037M5390A74361
19266b86474C94899D7603b59061M6728m2220A49055o4530a53929H1779b0816A23479
19254b84180d3368A5342b5247A93886b18067q2241K9181a01727l1203Q915G6352
19242C93449G2619f1683j46988K4862I7138c75730J21398h2582b6259A20052b3401
19230a77602A19720d8946B78407d03245e7066B29525b2594C5695a08316D71608
19219A87829c80890A06474d9541k9628b1059l71955C9003a91923h2373k02474
19209b84847m5417A43229d22144a2230j60190A18328E2948b64629G6572I264d08901
19197A06615l9942a6936n1149o2034l6652I5361J44614c8219A18241e8601H995
$$ y = [-224720, -87242, -332919, -59531, -275684, 51089, -168993, -242893, -122679, -172716, -127326, 174361, -286474, 394899, 47603, -259061, -212333, -254553, 149055, 84525, -153929, 81779, -20816, 123479, -284180, -43368, 15342, -25247, 193886, -218067, -300308, -271127, -101727, -132930, -124015, 76352, 393449, 72619, -61683, -208671, -183809, 97138, -375730, -254332, -82582, -26259, 120052, -23401, -177602, 119720, -48946, 278407, -403245, -57066, 229525, -22594, 35695, -108316, 471608, 187829, -380890, 106474, -49541, -79169, -21059, -393014, 39003, -191923, -82373, -284847, -330264, 143229, -422144, -12230, -172420, 118328, 52948, -264629, 76572, 9264, -408901, 106615, 66673, -16936, -68085, -130119, -166771, 95361, 239975, -38219, 118241, -58601, 8995]
19185b51462h8807B04528B2828d1029Q872n9487j30459G7237A5624L05237I5188
19173a88925E3351o014c69029C9531a94200A84182a09987j4299l57522a49179
19162H8738b29456k1648a14363d5617j22530m0976a64j68177f8596q6030C30119
19150A8862G575g8698a3811k35922A72900a37384a0033A28091a09814A14393c21998
19138c58900J39971Q145j06058N6464n1841C17893e9987F6334J49100c39364M5804
19127b93560i2417L893r4503n7280J19651G1938d06269a46443b3049k41095C0702
19115b36692j2981h5426A06907b15301A33434d5729m2801B1738J27908a67826
19104c21129j20982b12340j18641a764A84783b4879k10057G7244b02951k45630
$$ y = [-251462, -88807, 204528, 22828, -41029, -32157, -91644, -222103, 77237, 15624, 320861, 95188, -188925, 53351, 47337, -369029, 39531, -194200, 184182, -109987, -124286, -481808, -149179, 88738, -229456, -251104, -114363, -45617, -168147, -209123, -164, -168341, -68596, -154626, 330119, 18862, 7575, -78698, -13811, -249733, 172900, -137384, -10033, 128091, -109814, 114393, -321998, -358900, -218929, -210784, -316842, -260378, -312219, 317893, -59987, 66334, 215434, -339364, -293560, -92417, -88524, -183027, -240307, -120656, 71938, -406269, -146443, -23049, -264144, 30702, -236692, -249673, -85426, 106907, -215301, 133434, -45729, -88530, 21738, 149646, -167826, -321129, -442111, -212340, -330981, -1764, 184783, -24879, -234936, 77244, -202951, -448581]
19094d48581B60737c49815B188d3787A13740L6424C598J77377m1771Q394M746
19083A52344a30273j52683a16924C2025c26520J60757L4586k802b9420A23694
19072B3276b17150j64048A10621D8371d9484o9666k78775C1984J73497H4608a68153
19060E9962N6992c722o846B8448R4974b63745p2226a44504j4528A73066l8496
19049A34570F6114f1338n2673A60084b5498k21986R2927e6338E6517b4600j69025
19038a93625B28566A7561a71736j0259A09220N6228M038k7196d785B75579I9679
19026b1935k20394D5650f9293B55938p1059G5369b56756J15234f9692K6286k32553
19015b75959C7841a99885k08889H308a56021j91557J10461e5714r4796j05653
$$ y = [-448581, 260737, -349815, 2188, -43787, 113740, 150164, 3598, 180975, 139204, 147598, 152344, -130273, -282956, -116924, 32025, -326520, -165763, -131177, -133979, -29420, 123694, 23276, -217150, -381198, 110621, 48371, -49484, -119150, -397925, 31984, 205481, 84608, -168153, 59962, 116954, -3722, -10568, 28448, 123422, -263745, -335971, -144504, -159032, 173066, 134570, 66114, -61338, -114011, 160084, -25498, -247484, -154557, -56338, 56517, -24600, -193625, 228566, 17561, -171736, -181995, 109220, 165448, 169486, 142290, -4785, 275579, 99679, -21935, -242329, 45650, -69293, 255938, 184879, 75369, -256756, -141522, -69692, -43406, -275959, 37841, -199885, -408774, 8308, -156021, -347578, -237117, -55714, -150510, -256163]
19005b56163A97928k3298F5495a4079j42302p3436e5771l23100a05053j97628
18995c02681G5230a66026d1655E2058j1414d46191a20047j84703d2668j21222
18985a63890h0675A83163P850a35438D2092f4750G9157a02234j3350n254J25M6833
18973g3880r8469a3329k36838A34666K24853b86239B5242e4530F0604J22403c9302
18961c60585B80515r8448o4965k4641h651A3213e5411B33405H0923c58333c0363
18949F1056P5514F1353a48466l9239k07099A05819C456L179b7323p6638L8524
18938f5437B48643a10823J0692r1352M829N3946B72633j4471A098Q8198a22311
18926A91444a9918P891j77961e5249A31686J31162a01753j87710b636j49229c4850
$$ y = [-256163, 197928, 174630, 65495, -14079, -156381, -229817, -55771, -378871, -105053, -302681, 75230, -166026, -41655, 52058, 40644, -446191, -120047, -304750, -42668, -163890, -80675, 183163, 191013, -135438, 42092, -64750, 79157, -102234, -115584, -120838, -120713, -73880, -172349, -13329, -250167, 134666, 359519, -286239, 25242, -54530, 60604, 183007, -39302, -360585, 280515, 182067, 117102, 92461, -8651, 13213, -55411, 233405, 80923, -358333, -30363, 61056, 136570, 61353, -148466, -187705, -394804, 105819, 3456, 6635, -27323, -103961, -65437, 248643, -110823, -100131, -191483, -186654, -132708, 272633, 258162, 1098, 89296, -122311, 191444, -19918, -12027, -189988, -55249, 131686, 262848, -101753, -289463, -2636, -151865, -34850]
18914b47539H877c72718b3551j01557e2947r7913B6019J4123g4576A19902b23534
18902f7923C564P7851b67106c0144q3696d7011j0876k15838a07390B07391d5277
18890B14347c57633k6611E732J03926b49035J17235a7144k7497A93236H9958a34078
18878A13262a42500K0429l5086c4322l24353B9432J03005f3842A52864a70942
18867B42235n4423A35b99162C6042a55556O3472H8420c7755p3181n2110K2666
18856a40380F1496d56720c2661j60414f4881A23816F031e2764F1549L6750b42134
18844A9532a91630B4463a45626C566K54313I0845l5344h4190j42418h3071q2791
18833a65862q0799h4753q374c3802A23899d20626c4598j91920B9792A1375K1912
$$ y = [-247539, 8877, -372718, -23551, -125108, -52947, -150860, 26019, 40142, -74576, 119902, -223534, -67923, 3564, 81415, -267106, -30144, -113840, -47011, -57887, -273725, -107390, 207391, -45277, 214347, -357633, -384244, 5732, 109658, -249035, -131800, -17144, -44641, 193236, 89958, -134078, 113262, -142500, -122071, -157157, -34322, -358675, 29432, 132437, -63842, 152864, -170942, 242235, 187812, 135, -299162, 36042, -155556, -92084, 88420, -37755, -110936, -163046, -140380, 61496, -456720, -32661, -193075, -64881, 123816, 6031, -52764, 61549, 98299, -242134, 19532, -191630, 24463, -145626, 3566, 257879, 90845, 55501, -84190, -226608, -83071, -165862, -246661, -84753, -93127, -33802, 123899, -420626, -34598, -226518, 29792, 11375, 33287]
18822C3287a53876G5990P0767m5973N0196D5188N1835a91136C27916A54629E4182
18810D0278L8278c5600B76711a49629N4482l9016C6031i3872A0497N2619P9662
18799A42778B5485c21309a371A28381f8288H7393l3911b38424j04561a15783B84371
18787e2961B58291n2558g6055L6092k54113I0070a64333k27344M1205P8508g0925
18775B26613j3726J21024g8701A8312a90201f9338j14701O616E1255f8638h653
18763A15517c58599D1557b93235A69761b81758J34869b2933l44489F0895e5165
18752B80428d7810g495o7000C6456g3368B80898i1694j71643C19754B0774g2080
18740A45259b09988E6622a03751A67505g9892B88457b6867H5242b78592a35693
$$ y = [33287, -153876, 75990, 146757, 100784, 150980, 45188, 97023, -191136, 327916, 154629, 54182, 40278, 78556, -35600, 276711, -149629, -95147, -134163, 36031, -93872, 10497, 63116, 142778, 25485, -321309, -1371, 128381, -68288, 87393, 53482, -238424, -342985, -115783, 284371, -52961, 258291, 205733, -76055, -39963, -294076, 90070, -164333, -391677, -350472, -271964, -70925, 226613, 212887, 333911, -78701, 18312, -190201, -69338, -184039, -177423, 51255, -68638, -8653, 115517, -358599, 41557, -293235, 169761, -281758, -146889, -22933, -367422, 60895, -55165, 280428, -47810, -7495, -74495, 36456, -73368, 280898, -91694, -263337, 319754, 20774, -72080, 145259, -209988, 56622, -103751, 167505, -79892, 288457, -26867, 85242, -278592, -135693]
18729A96556J7925k8765g4123b1228j83082n04241b71147A28895g7988A70761
18718a37005B3609a1819B33903g9483B8192b2246n2195H484J03644i2618P875
18707h4743G2643J09833e9411E7511b31254g0370l9683k09883I574e6901B56247
18695e3434j77203f661B3984a02504c0184r4646j66101c7525A32284d7657k454
18684e0111j75000C5606b8716B06534a7017k15658g6515l11915a79966f1506j70840
18673b32346K1269B15589a41745E0344J7922b07604P4820B3957a1446j68652O8195
18662a11903A11782a88228A97318b71585C4725c81815h0417k28875M5676c8303
18651c72676E3132d549I0730a33263k33739a75011C19866f7931B36013q0783e42748
$$ y = [196556, 214481, 185716, -74123, -21228, -204310, -708551, -271147, 128895, -77988, 170761, -137005, 23609, -11819, 233903, -79483, 28192, -22246, -74441, 8484, 112128, -92618, -84743, 72643, 182476, -59411, 57511, -231254, -70370, -110053, -319936, 9574, -56901, 256247, -53434, -230637, -6661, 23984, -102504, -30184, -124830, -290931, -37525, 132284, -47657, -50111, -225111, 35606, -28716, 206534, -17017, -232675, -76515, -388430, -179966, -61506, -232346, -211077, 215589, -141745, 50344, 68266, -207604, -132784, 23957, -11446, -180098, -111903, 111782, -188228, 197318, -271585, 34725, -381815, -80417, -309292, -263616, -38303, -372676, 53132, -4549, 90730, -133263, -367002, -175011, 319866, -67931, 236013, 155230, -542748]
18639b20083A23407a1643A71492l5070c53329G6623B4746f2899p5741j1063B52523
18627B4197e2057m2660I7490f8018h530m3829j04238p1043A79218o7588P6292
18616A87922A0158J16167d2823o0361a1633r7633M3830C8684P8018a4396l16640
18605c31036d4166k74344e2851A49589c01667D9219g096F5581b31927j4173F8519
18593B03329E2558K7934J74675J49819c29054J12558P8512B9016b92263J7805
18583b74458R4577q0357a28839A50266m2022f6250B6069b27438D3535L07960A38668
18571g2791b0634j87046b8827j43684b5371k68979A0595a14003A04933c40299
18560b71677f541p6174B46794F2164a58680k27277A11049P9695d332A2150a85170
$$ y = [-220083, 123407, -11643, 171492, 136422, -353329, 76623, 24746, -62899, -138640, -149703, 252523, 24197, -52057, -94717, 97490, -68018, -8530, -52359, -156597, -227640, 179218, 111630, 187922, 10158, 126325, -42823, -103184, -11633, -109266, -65436, 38684, 116702, -14396, -331036, -44166, -318510, -52851, 149589, -301667, 49219, -7096, 65581, -231927, -246100, 68519, 203329, 52558, 80492, 255167, 404986, -329054, -216496, -137984, 29016, -292263, -274458, -179881, -260238, -128839, 150266, 108244, -66250, 26069, -227438, 43535, 351495, 138668, -72791, -20634, -207680, -28827, -172511, -25371, -294350, 10595, -114003, 104933, -340299, -271677, -6541, -82715, 246794, 62164, -158680, -385957, 111049, 190744, -4332, 12150, -185170]
18548a9014j13725j14717B333b29056j28192A738f931A89663l249G0135g8162
18536G1905b78508D4150b25355h5749J384d1955E6295i4528B2836f9240j65807
18525b35047E0359O7712K6820c05318B5095b6871I2161b94308R9780D6768f6645
18513C52228f8022A61054P7379c85390o362A7705K90602g8219A41029n7438d37414
18501b58809O0866j6729g3752A77273a3678j25632A01447b15091F2094J17832
18491A79926a04770j17173R0263j05021g1333K1475A45685f988j78145c2629j04495
18480a37124G6348a5886j03691k28748c8295p4814A6360f5503j10655D200J03635
18469A07835i0099A07936b02190P6428L3474n7714j43783B5820b72428A7196J92630
$$ y = [-19014, -132739, -247456, 2333, -229056, -357248, 1738, -6931, 189663, 186414, 70135, -78162, 71905, -278508, 44150, -225355, -85749, -84365, -41955, 56295, -94528, 22836, -69240, -235047, 50359, 118071, 144891, -305318, 25095, -26871, 92161, -294308, -194528, 46768, -66645, 352228, -68022, 161054, 238433, -385390, -391752, 17705, 308307, -78219, 141029, 83591, -437414, -258809, -197943, -214672, -73752, 177273, -13678, -139310, 101447, -215091, 62094, 179926, -104770, -221943, -131680, -236701, -71333, -49858, 145685, -6988, -185133, -32629, -137124, 76348, -15886, -119577, -348325, -38295, -113109, 16360, -65503, -176158, 4200, 107835, -90099, 107936, -202190, -125762, -92288, -150002, -293785, 25820, -272428, 17196, 209826]
18458B09826C2375c48449D7848a41207f2429a6898j37592H9986I78a88559c0828
18446C5700j1225b72816R4060O4033q2721R8217A68896a47428G3776J73145B9241
18434E9279a3797l6267l5167B31519D878a81425P637C5552L3986b21434f1152
18422c21474a28211B68418a65396A86544e87k35149A35785m2476a45024l1222
18412a76246B67476a22698D8209a21617c3444k9859j24991G0195L0658d0286m0322
18401h0608B44408c64335I9692C8302J30579A1449K10260b49952i8559B47692
18390A64979e0372j07526O7947j7217A12399a88263O8440d1218m2849k0922L2400
18379g2589G1728d53316B0893c27030a48736A5560R6303q764c68982A81021D3498
$$ y = [209826, 32375, -348449, 47848, -141207, -62429, -16898, -154490, 89986, 978, -188559, -30828, 35700, 24475, -272816, -178756, -114723, -197444, -99227, 168896, -147428, 73776, 246921, 29241, 59279, -13797, -50064, -85231, 231519, 4878, -181425, -173788, 35552, 69538, -221434, -61152, -321474, -128211, 268418, -165396, 186544, -587, -235736, 135785, 93309, -145024, -176246, 267476, -122698, 48209, -121617, -33444, -63303, -188294, 70195, 100853, -40286, -80608, 244408, -364335, 99692, 38302, 168881, 11449, 221709, -249952, -98559, 247692, 164979, -50372, -157898, -89951, -107168, 112399, -188263, -119823, -41218, -84067, -104989, -72589, 71728, -453316, 20893, -327030, -148736, 15560, 111863, 103099, -368982, 181021, 43498]
18367c9837A61009a63660E7750c7481j05912o2058h9060K4307F556Q2282a83870
18355G1021B6329H197L4138N4302R678a34392D1195c52263a72162G447b49138
18343f4069j0363D3909a15809H9339B3722b48357J19761p888B73506C3924d5814
18331A28010D0762b92847P4388b3306A51283g6031q8702j41339Q8519j9616a0898
18319C57239a64903C69497e7598l2272B0446K87849B795b19832j6888A83426J27743
18308C11169a20018m8369P0541q1958C49838a07858q7650I0076L0802H76c57186
18296b19397A76261f5582B20081F428J12011a54628b0974o2004C82268c16015
18285b83760A48408B0932h7749k65473L1862A9128d2133B66267b43376O4773P9616
$$ y = [-39837, 161009, -163660, 57750, -37481, -143393, -205451, -89060, -64753, 6556, 88838, -183870, 71021, 26329, 8197, 42335, 96637, 106315, -134392, 41195, -352263, -172162, 7447, -249138, -64069, -74432, 43909, -115809, 89339, 23722, -248357, -128596, -136484, 273506, 33924, -45814, 128010, 40762, -292847, -218459, -23306, 151283, -76031, -164733, -306072, -217553, -237169, -10898, 357239, -164903, 369497, -57598, -89870, 20446, 308295, 2795, -219832, -236720, 183426, 311169, -120018, -168387, -97846, -179804, 349838, -107858, -195508, 90076, 120878, 876, -357186, -219397, 176261, -65582, 220081, 6428, 118439, -154628, -20974, -82978, 382268, -316015, -283760, 148408, 20932, -87749, -353222, -321360, 19128, -42133, 266267, -243376, -178603, -98987]
18274i8987L9552l29155E2936J62061j03682c782k97736i5569H0866K41588A3469
18262B29608G2526C34a95461L2504r3683k6508E6602J38307p9373b45044a12369
18250a9151A22440b2918A83807F6167L3428R6718a03587L9493m6453l318E9064
18238b30272A1902i4175C6292a60267k8378P1770d0983k69850B23920a67478C5099
18226b8390l9705G625J00959d52180a24357a6047F3094b62464c3675D94196a22187
18214e7671q8501o5206k59004c7102R006I5787c8223A31152a82774e7316A62258
18202b0781j86583B769P6482O8993b95621B80143a3122j68285B975b08642f137
18190b85191E0069j045R0204K2858b7409j84070E6369h2369A9041l095c3615j75687
$$ y = [-98987, -59435, -388590, 52936, 214997, 111315, -3782, -301518, -95569, 80866, 322454, 13469, 229608, 72526, 334, -195461, -162957, -256640, -283148, 56602, 194909, 115536, -245044, -112369, -19151, 122440, -22918, 183807, 66167, 99595, 196313, -103587, -64094, -110547, -113865, 59064, -230272, 11902, -94175, 36292, -160267, -188645, -116875, -40983, -310833, 223920, -167478, 35099, -28390, -68095, 7625, 108584, -452180, -124357, -16047, 63094, -262464, -33675, 494196, -122187, -57671, -146172, -211378, -470382, -37102, -28096, 95787, -38223, 131152, -182774, -57316, 162258, -20781, -207364, 2769, 79251, 148244, -295621, 280143, -13122, -181407, 2975, -208642, -6137, -285191, 50069, 49024, 139228, 162086, -27409, -211479, 56369, -82369, 19041, 15946, -33615, -209302]
18178b09302J279B39688e2251r8343A54548m5423l9893B7382j1809K82170c16844
18166b93544H9326e9184A92345a86894C15725k8252e1898A1297K11904A5734K5359
18155D1093e323H9032e389n1479B05352c53403a00548G3942J59323a94668d9207
18143A05826C5172O253J1250b7885k36076O0976C1678K4430g0396D3078h3047
18131I0021a43519l7066F1983J66760d5159o6881G2755L1962a49453C4583a99187
18119a67598f3437A45055d60609b19404Q6759k44630a28546A07339c6678A95227
18108c50476B08162a05890p9387A05550a44831L8346H7842B8971J00599a44912
18097b61394A75713G2646d45326d034j08981B70429b8451k30283B68418B2864
$$ y = [-209302, -208023, 239688, -52251, -150594, 154548, 109125, 69232, 27382, 15573, 297743, -316844, -293544, 89326, -59184, 192345, -186894, 315725, 287473, -51898, 11297, 223201, 15734, 41093, -5323, 89032, -5389, -56868, 205352, -353403, -100548, 73942, 233265, -194668, -49207, 105826, 35172, 41425, 52675, -27885, -263961, -202985, 31678, 56108, -70396, 43078, -83047, 90021, -143519, -180585, 61983, 228743, -45159, -112040, 72755, 104717, -149453, 34583, -199187, -167598, -63437, 145055, -460609, -219404, -132645, -377275, -128546, 107339, -36678, 195227, -350476, 208162, -105890, -185277, 105550, -144831, -106485, 87842, 28971, 129570, -144912, -261394, 175713, 72646, -445326, -4034, -113015, 270429, -28451, -258734, 268418, 22864]
18086B6900h5855B44246F9920c92993E1051J58713B0611b670j60434j35794A89434
18074a28258A96655a9926B46674C0853b43639M4091P1255A94671c21895b8283
18063a91566O0022d8328B1077k395a48344C3997M7918f6736j49586f3531a2243
18051I5459a52737r0675n0265a7098B43174c0424k77529a27879J7891a6722K002
18040a4720G4222J28384r8148L8600k0698a12887q3873A18925M6742Q4355H9869
18028a60782k7784B62081i2086q9988e8015A88113e291n629B88902P3549a03852
18016D36722b18802B26979k460f4965k22021C16620c36050E4552J92224b50791
18005e2715J6127E0481h5036j90821Q4228d9276j30111o981e7670l7554j26474
$$ y = [26900, -85855, 244246, 69920, -392993, 51051, 209764, 20611, -2670, -163104, -298898, 189434, -128258, 196655, -19926, 246674, 30853, -243639, -199548, -128293, 194671, -321895, -28283, -191566, -131544, -48328, 21077, 18682, -148344, 33997, 81915, -66736, -216322, -63531, -12243, 95459, -152737, -243412, -293677, -17098, 243174, -30424, -307953, -127879, -109988, -16722, -14720, 74222, 202606, 104458, 143058, 122360, -112887, -196760, 118925, 165667, 250022, 89869, -160782, -188566, 262081, -92086, -182074, -58015, 188113, -5291, -10920, 288902, 362451, -103852, 436722, -218802, 226979, 224519, -64965, -286986, 316620, -336050, 54552, 246776, -250791, -52715, -36588, 50481, -85036, -275857, -191629, -49276, -179387, -186368, -57670, -95224, -221698]
17994b21698O9292D7032a23149A89848e9361F9378b31200e6415B59715A11643
17983G0969b8499C58042a30044p2044P3214B54983I5819b37675J05567j74798
17973c06906a29077B50599E0308d15018f3235A74215J82734e0706F9033b45826
17962b51537A4535L0867J70705E4054c2473B44775a85274e9167B5297e5846j59635
17951b15481o5899e4702C7815M45629e3891B78950a13682c1713P924E4858K4781
17940G9639a5307I6721A9685Q1242J33025j14727E1395J54718o0773A584i5380
17928a04598e0103j16724A05543B7157c21729D0510a5409j65880A59199J17864
17918B77063d2143J9270D7764c65543E0908c9185j82251L4427j07005Q6767A97251
$$ y = [-221698, -152406, 47032, -123149, 189848, -59361, 69378, -231200, -56415, 259715, 111643, 70969, -28499, 358042, -130044, -202088, -128874, 254983, 95819, -237675, -132108, -306906, -129077, 250599, 50308, -415018, -63235, 174215, 356949, -50706, 69033, -245826, -251537, 14535, 45402, 216107, 54054, -32473, 244775, -185274, -59167, 25297, -55846, -215481, -281380, -54702, 37815, 483444, -53891, 278950, -113682, -31713, -23789, 54858, 79639, -15307, 96721, 19685, 100927, 233952, 119225, 51395, 206113, 145340, 1584, -95380, -104598, -50103, -166827, 105543, 27157, -321729, 40510, -15409, -181289, 159199, 277063, -42143, -22873, 47764, -365543, 50908, -39185, -221436, -187009, -294014, -207247, 197251]
17906a77551C31274A11454L5440d4367j09936F229a32128j84913g1849A48215
17895b21035d6827n1268D0845J39768E9196a15653d8998j58255j10730i497j40319
17884a49816C18464A0043c53135J52976k5B568c45228B097K93166A27855i8321
17872F8059C2735i8756H5918B5892p592i4m06737e9184k1808D2827a25417A28353
17859A49942R8724I7683b20956k3991N2449A6597J06583a6623j44551B3959Q175
17848C2134J37206a12064F5064L6249a95787A15598Q0281a0324C0143L2554O3861
17837A26558e7223D6115A6288M1949L14365i544C04603b8373j3650C5833P5398
17826A11231a92445R4874j67166B41270H7075P5915b96247A12413a96120B9976
$$ y = [-177551, 331274, 111454, 146894, -44367, -154303, 6229, -132128, -317041, -71849, 148215, -221035, -46827, -98095, 40845, 180613, 59196, -115653, -48998, -207253, -317983, -9497, -149816, 318464, 10043, -353135, -200159, -200184, 2568, -345228, 2097, 295263, 127855, -98321, 68059, 32735, -98756, 85918, 25892, 18300, -94, -406831, -59184, -80992, 42827, -125417, 128353, 149942, 248666, 97683, -220956, -244947, -192498, 16597, 123180, -16623, -161174, 23959, 32134, 169340, -112064, 65064, 101313, -195787, 115598, 195879, -10324, 30143, 62697, 126558, -57223, 46115, 16288, 58237, 372602, -9544, 304603, -28373, -42023, 35833, 111231, -192445, -97571, -264737, 241270, 87075, 162990, -296247, 112413, -196120, 29976]
17815I98f1223C3489d4502A45242b88553D7149r01K62025a31497O0939F3100e6900
17802d69327A69468a8853p7038p1174b1429j22667i635A98121K41819f4866G5330
17790c29101J49923A65772b04092A57787l7965b03897F7125f4021j0414l0555
17780a04990A7168K3591c1647o81m2632m0268A7355L83466a60923B22769a79677
17768i5218c7651G5786q650N225e3153A60606e3996j62684A49693O3860b27970
17756C45542A43025a50215F6500a25453A1746c93478c5566O0J1244A18887k9128
17745H9759A4037d4437C89127G2732j2572d67260a87995a903A87093N3928a0354
17733A3325a36465g305m7567k4921B35731b0782l2006F7698i6861d1850k7422
$$ y = [998, -61223, 33489, -44502, 145242, -288553, 47149, 46248, 308273, -131497, -70558, 63100, -56900, -469327, 169468, -18853, -95891, -167065, -21429, -144096, -9635, 198121, 439940, -64866, 75330, -329101, -179178, 165772, -204092, 157787, 119822, -203897, 67125, -64021, -74435, -104990, 17168, 40759, -31647, -32328, -74960, -115228, 17355, 400821, -160923, 222769, -179677, -95218, -37651, 75786, 67136, 72361, -53153, 160606, -53996, -216680, 149693, 213553, -227970, 345542, 143025, -150215, 66500, -125453, 11746, -393478, -35566, -35506, -24262, 118887, 89759, 14037, -44437, 389127, 72732, 60160, -467260, -187995, -1903, 187093, 241021, -10354, 13325, -136465, -7305, -54872, -79793, 235731, -20782, -52788, 67698, -96861, -41850, -69272]
17722f9272m5755k77205D2860k794c56314e2674A67781a56246B5794f5928B5362
17710c4902k16184C70081E8898K74571L9140b0750A27467b91187e4556l436n8716
17699a16708B28161M0943c394A35141m0883K31075q417a542A44645g6899g457
17687E5326K26991a38219A12779M3110d7944j8051j0362p3725I5988h7131l73926
17676d61057g5299I750J59327l3732b21525A1953b44609C05951J8256b4822j82759
17665b07581N0119G2028J12282K00911B2609J25601f7748D0109b15285g8094j65308
17654b43402M1787g4708B2584b89094B59468A05005K00638A42163i5753C67774
17643A24149N6353a72906j82600A14959a80133m7418C70855a00054A25878d7407
$$ y = [-69272, -115027, -392232, 42860, 40066, -356314, -52674, 167781, -156246, 25794, -65928, 25362, -34902, -251086, 370081, 58898, 333469, 372609, -20750, 127467, -291187, -54556, -57992, -116708, 228161, 269104, -3394, 135141, 94258, 325333, 316916, -1542, 144645, -76899, -7457, 55326, 282317, -138219, 112779, 155889, -47944, -65995, -76357, -150082, 95988, -87131, -461057, -75299, 9750, 169077, 135345, -221525, 11953, -244609, 305951, 324207, -24822, -207581, -157462, 72028, 184310, 385221, 22609, 148210, -67748, 40109, -215285, -78094, -243402, -201615, -74708, 22584, -289094, 259468, 105005, 305643, 142163, -95753, 367774, 124149, 180502, -172906, -355506, 114959, -180133, -227551, 370855, -100054, 125878, -47407]
17632B08958a09502c5660B51987F1909L39309o6946m4972j17329b89996A48000
17621a23799A02568a83274B65416B0396b11025A38572Q6330L0256a23366B01642
17610h0531q7415E0050g5757C8174R3970L09282F9024J54509r60l6995m4152i6844
17597B94857d17733O6229f5300q8391F118a25103L6161G5860e5733A98023r3147
17586A04876L7912N6077A8158a01618m238m4855D2077d0613C9200c11939A66451
17574B70679f5158A34303a31286A79201p4658J6457D8874a52327M2943H7400K71817
17563C59217I1646j7825a57949A74308D2254M4731h620B48634h2299I3501f8862
17551e3201r5929l11519D20597a711D1892d0001H6156c87807g1311B34831j11416
$$ y = [208958, -109502, -35660, 251987, 61909, 401218, 334272, 289300, 171971, -289996, 148000, -123799, 102568, -183274, 265416, 20396, -211025, 138572, 224902, 255158, -123366, 201642, -80531, -167946, 50050, -75757, 38174, 132144, 441426, 69024, 223533, 222573, 185578, 141426, -96844, 294857, -417733, -351504, -65300, -153691, 6118, -125103, -88942, 75860, -55733, 198023, 104876, 142788, 198865, 18158, -101618, -105856, -150711, 42077, -40613, 39200, -311939, 166451, 270679, -65158, 134303, -131286, 179201, 104543, 121000, 48874, -152327, -109384, 87400, 359217, 91646, 73821, -157949, 174308, 42254, 86985, -8620, 248634, -82299, 93501, -68862, -53201, -149130, -460649, 420597, -1711, 41892, -40001, 86156, -387807, -71311, 234831, 123415]
17540A23415m8111K15443a04101L7525C86680b4069k71091d0772A33950F1305
17529H8958L8746C0246b82647d7612b694j24101A34314B3240L69133a66302j27287
17518b93589B05887h4332H337J06153R3079c6028m3764C3173d38297B74172b18955
17506A72890o8733D4221R0608O9003n954G9968k3928b53761J06217I675a28034
17494A63655E3324a62468B5635b6693A52106P6402l8961q4213J17996I3418J90928
17483B84346D58J2176d2044C10746l9811j08807O1952I3749R7797F7413L7008
17472A04421e8724A90037c8167A63338j2559j8852J34548c407B94181A08560K05237
17461C13797j15019K77791g2568C96879a31427O0806G7906b0371C06379L5017
$$ y = [123415, 75304, 290747, -104101, -66576, 386680, -24069, -295160, -40772, 133950, 61305, 88958, 127704, 30246, -282647, -47612, -2694, -126795, 134314, 23240, 392373, -166302, -293589, 205887, -84332, 8337, 114490, 207569, -36028, -79792, 33173, -438297, 274172, -218955, 172890, 104157, 44221, 134829, 203832, 197878, 79968, 56040, -253761, -147544, 9675, -128034, 163655, 53324, -162468, 25635, -26693, 152106, 228508, 189547, 105334, 223330, 93418, 284346, 458, 12634, -42044, 310746, 270935, 162128, 224080, 93749, 191546, 67413, 104421, -58724, 190037, -38167, 163338, 150779, 131927, 266475, -3407, 294181, 108560, 313797, 198778, 476569, -72568, 396879, -131427, -70621, 77906, -20371, 306379, 341396]
17451C41396j35043E7598O7171K61406m8564A45209K65124r5054j07190n2437
17441A55652J81340P0686C5423N9222K5054M13125A67146R5264k5993n4905o081
17430A75431h6982F3359B9664a95167B54413a43008B91161q3254J12394A58537
17419B88066l0134J63325A70981J09870J75539A42020a54473B51138C8387A3916
17408D2598A5735J04395Q3385i3691A51408d4332j79j15667B57198r478J9037
17397B66757C3776q81K48512H4678I306l315J67308d6083C74028p4214j48029
17386A51785J23403K93658a31715A33462K2521p7046J09521p8457P6370c09954
17375C84831G7203n775k6189J07734f4537B78827q8598J734j9303L0647p5415
$$ y = [341396, 206353, 57598, 124769, 386175, 337611, 145209, 410333, 315279, 208089, 155652, 336992, 407678, 35423, 94645, 119699, 532824, 167146, 262410, 236417, 181512, 175431, -86982, 63359, 29664, -195167, 254413, -143008, 291161, 207907, 320301, 158537, 288066, 257932, 421257, 170981, 280851, 456390, 142020, -154473, 251138, 38387, 13916, 42598, 15735, 120130, 203515, -93691, 151408, -44332, -44511, -160178, 257198, 247720, 266757, 33776, 32895, 281407, 84678, 9306, 5991, 173299, -46083, 374028, 299814, 151785, 275188, 568846, -131715, 133462, 155983, 78937, 188458, 110001, 186371, -309954, 384831, 77203, 71428, 45239, 152973, -64537, 278827, 190229, 191963, 172660, 203307, 127892]
17364A27892d9588j86250A00025J91385l7292J3029K65528a00924A43331j9024
17354A24307K76315A16828M25216a44001m583C5376J33086g2451c2877E7734c8727
17342c06583A36162j1813a49115B8779a06037L6033C58796j73152o9332a3413
17331c716I5763J21007o6244E7041L3952L8355J77676b6029C66147j51737b63574
17319B50550j3451h1373A55283a1965B16951F7745R9304d91858C87053A75611
17308B52344K5611m3659g4796p8357B51346A05566O3603D6175J17785B2382L9034
17297F1416p896a1185A22429E640K76188A15287C9050L5830N2202J859J23022
17286B51963n7463a08352j6661D12400k7804G5809J49479H7843K95960A50722
$$ y = [127892, -49588, -235838, 100025, 291410, 254118, 267147, 532675, -100924, 143331, 124307, 400622, 116828, 542044, -144001, -148584, 35376, 168462, -72451, -32877, 57734, -38727, -306583, 136162, 124349, -149115, 28779, -106037, -70004, 358796, 185644, 116312, -13413, -3716, 95763, 216770, 150526, 57041, 90993, 129348, 307024, -26029, 366147, 214410, -263574, 250550, 237099, -81373, 155283, -11965, 216951, 67745, 167049, -491858, 387053, 175611, 252344, 277955, 234296, -74796, -153153, 251346, 105566, 169169, 46175, 163960, 22382, 61416, 53520, -11185, 122429, 5640, 281828, 115287, 39050, 74880, 127082, 128941, 251963, 194500, -108352, -125013, 412400, 384596, 75809, 225288, 87843, 383803, 150722]
17275B70459A32703J54136d4934C17605a7902B80680a69195B8297J7988K62287
17265C08572j16928m7614a3907D3842e2934A50213J67461A26541b74148A0605
17254C50770A59926a49290A6698a18437A66893o013K99457G8462C5673J69213
17244B04886R2994j09122f2833C81673c3293F84853A99832K27181j85851O4140
17234C05302D4979g8672A9216M4981L12161A77346J782J88672g6332C16220J67525
17223D83745C4034J39108N1452P2185j14507C456J62175k3931n0988K10512o1898
17212B39326j03143J38107L4654h2796D03412A53361G2756c88D4716L67470J0077
17201D22263r8908j49814A7746K25081K71557j81844C2163a34256C37069k9414
$$ y = [270459, 132703, 286839, -44934, 317605, -17902, 280680, -169195, 28297, 46285, 308572, 191644, 144030, -13907, 43842, -52934, 150213, 317674, 126541, -274148, 10605, 350770, 159926, -149290, 16698, -118437, 166893, 160880, 460337, 78462, 35673, 204886, 297880, 188758, -62833, 381673, -33293, 684853, 199832, 427013, 241162, 305302, 44979, -78672, 19216, 64197, 376358, 177346, 179128, 367800, -76332, 316220, 483745, 34034, 173142, 224594, 296779, 182272, 3456, 165631, 141700, 90712, 301224, 239326, 136183, 274290, 308944, -82796, 403412, 153361, 72756, -388, 44716, 412186, 422263, 323355, 173541, 17746, 242827, 514384, 332540, 32163, -134256, 337069, 307655]
17191C07655a84568D21336A91771G5335F930K0454b47584A65701N3167q7893J54094
17180B85069o6319J21760A1837L61706b56428C38466A33115b33577B16094L57531
17170E73625a3562B80072d362C06276A12299K36624a65214H3393K92608J57413
17160E33414k37206Q501L0745Q7130A45265b25879C01002A15609J20317J15560
17150C51486j31058J1700K14517c4665A75432j4785J67388q0497r9015D4640M18290
17139D62930E7192L9735P5627K06657I3260K29168j20682k0122J86328j17737
17129B50215K76847J6501j09912k15265O2330R7930r140A21627N46379A96446
17118B54229J90204A4428L85326r2658J24957n8863A8065N99524A51620J99449
$$ y = [307655, -184568, 421336, 191771, 75335, 6930, 27384, -247584, 165701, 218868, 130975, 285069, 218750, 340510, 11837, 373543, -256428, 338466, 133115, -233577, 216094, 573625, -13562, 280072, -4362, 306276, 112299, 348923, -165214, 83393, 376001, 533414, 296208, 304709, 335454, 422584, 145265, -225879, 301002, 115609, 235926, 351486, 220428, 232128, 446645, -34665, 175432, 160647, 328035, 247538, 148523, 44640, 462930, 57192, 96927, 172554, 379211, 93260, 322428, 201746, 181624, 367952, 250215, 527062, 543563, 433651, 218386, 280716, 378646, 369506, 121627, 668006, 196446, 254229, 444433, 14428, 399754, 307096, 432053, 373190, 18065, 617589, 151620, 351069]
17108C51069J73725M7095A59723K54222j17379A34637J77700j4063K95473j00863
17098D92884A74863A3373R0076L61528A30837O9438J45722K9608D3713J78861
17088B22574M8283j18899O02381A14224J00371P629M0829K46503L1476Q5343B97433
17076A39198Q7333k9954K86191j91607J23128j65067J1498E7332L24087J00224
17066D81643j00167A24852M65916A17043M41078k6624O8538B69529K15317k4438
17056D60408B05869J67463j8359p8624l5589K84162B61868M37234N6520j85078
17046E70544r14j12465k00903K59991K8940N397R2939n4963J14806k74862l6176
17035C92334J5345j0502Q7159j54153L2354L71086C26296O1847A06708K45641
$$ y = [351069, 524794, 571889, 159723, 413945, 296566, 134637, 312337, 298274, 593747, 492884, 174863, 13373, 103449, 464977, 130837, 200275, 345997, 375605, 43713, 222574, 270857, 151958, 754339, 114224, 214595, 222224, 263053, 509556, 541032, 626375, 297433, 139198, 226531, 196577, 482768, 291161, 414289, 249222, 260720, 57332, 381419, 481643, 381476, 124852, 590768, 117043, 558121, 531497, 600035, 269529, 484846, 460408, 205869, 373332, 354973, 276349, 240760, 524922, 261868, 699102, 755622, 570544, 569630, 457165, 256262, 516253, 545193, 550590, 643529, 588566, 703372, 428510, 392334, 407679, 397177, 484336, 330183, 362537, 733623, 326296, 388143, 106708, 352349]
17025C52349K70867j35618J44113N250J97962k43141N733k36612J11298L67835
17015H40036l79870m7966J32020K09072o2099k77736L31007J5541l20970K21640
17005F60675C06820P825L17817J59567p1096N7050j61446l7601J36379O4688l3103
16994G46900l28924J68342j4248j90446M76924j79216k1633J83528k60927K86055
16984H66355j92116J33863J4997Q9618k14024J23098Q7738l41857n4376L18343
16974H31639k34256K86369l14624K23979M5149o6925K40023M5501l61249K61880
16964I57486l9537q6162K50709k78004k71790L5280K20614j50465K75341l21327
16954E92145K02422N50125l87490K35416k80152l00997L61283j89294o8377J15879
$$ y = [352349, 623216, 487598, 631711, 636961, 834923, 591782, 597515, 360903, 472201, 840036, 460166, 412200, 544220, 753292, 691193, 413457, 744464, 760005, 439035, 660675, 306820, 314645, 632462, 792029, 720933, 777983, 616537, 578936, 715315, 780003, 746900, 417976, 586318, 572070, 381624, 858548, 679332, 657699, 841227, 580300, 866355, 674239, 808102, 823099, 912717, 698693, 821791, 909529, 567672, 513296, 831639, 597383, 883752, 569128, 793107, 838256, 771331, 1011354, 1056855, 695606, 957486, 917949, 831787, 1082496, 804492, 532702, 567982, 788596, 638131, 913472, 592145, 794567, 1344692, 957202, 1192618, 912466, 611469, 972752, 783458, 715081, 830960]
16944H30960K65581N4557j56348P5682L1768j22260K85516k40774J41810m54024
16934G12468L88160M0062o0084p9354j16961M39022j89417k80210J49339O14010
16924A617035m47866r5440L5894m7835Q508l16831J62820K06645K72297k32729
16914A162498L37167j19350J96176Q9813j47948l77616K76080l74677J87397M4138
16904A273678j0627O31095m86096j94347J74591k68550K30246K32365q2712k40593
16894A259050K80301J58324K6571l3269L0148n40103Q12953n72494J56993K27189
16884A805663j56697j29929K80106k17272J63463R4994m2094J10335j67517L99999
16874B141051k61720K95622q1478p5804L916N322J44983N7763r2307J70090j2331
$$ y = [830960, 1096541, 1151098, 994750, 1070432, 1102200, 979940, 1265456, 1024682, 1166492, 712468, 1100628, 1140690, 1080606, 1001252, 884291, 1323313, 1133896, 853686, 1003025, 1617035, 1169169, 1073729, 1109623, 1061788, 1070296, 753465, 916285, 1122930, 1395227, 1162498, 1499665, 1380315, 1576491, 1666304, 1518356, 1140740, 1416820, 1042143, 1229540, 1273678, 1263051, 1894146, 1408050, 1213703, 1388294, 1119744, 1349990, 1582355, 1499643, 1259050, 1539351, 1697675, 1724246, 1690977, 1721125, 1181022, 1993975, 1421481, 1578474, 1805663, 1648966, 1519037, 1799143, 1581871, 1745334, 1840328, 1798234, 1908569, 1741052, 2141051, 1879331, 2174953, 2093475, 2017671, 2021587, 2026909, 2171892, 2229655, 2137348, 2307438, 2295107]
16863B295107l75719M49042m9378j00507L62902m59898L36165L833M45184m58908
16853B447823J29464k97988L54166Q3512L510L08571l53518J36094N15019n38010
16843B788643L65607q6598K284k3763J69151M10263j91397J81310l48448K66863
16833C533915k68447N76375k38610j992J24017L8229L88942j32045K01508k64299
16823C957593M5242K48782n0928L95849R6796o0771k0919j29389P6304K52190
16813D810749M58339L68339J35751k31778K45418j68177j37452Q0807K87971J82582
16803F032549M35237l46611P8966M24722M91381l42885L92330K08129P7003J9220
16793G470041M10213K10928m4397K04844M15734M84707r7545K66330J10142M84194
$$ y = [2295107, 1919388, 2368430, 2319052, 2218545, 2581447, 2121549, 2457714, 2461547, 2906731, 2447823, 2577287, 2279299, 2633465, 2716977, 2720487, 3029058, 2675540, 2811634, 3326653, 2788643, 3154250, 3067652, 3069936, 3046173, 3215324, 3625587, 3434190, 3615500, 3267052, 3533915, 3265468, 3841843, 3603233, 3601241, 3725258, 3763487, 4152429, 4020384, 4221892, 3957593, 4002835, 4251617, 4200689, 4596538, 4693334, 4632563, 4611644, 4482255, 4558559, 4810749, 5269088, 5637427, 5773178, 5541400, 5786818, 5618641, 5481189, 5561996, 5849967, 6032549, 6467786, 6121175, 6200141, 6624863, 7116244, 6773359, 7165689, 7373818, 7450821, 7470041, 7880254, 8091182, 8046785, 8251629, 8667363, 9152070, 9054525, 9320855, 9430997, 9915191]
16783I915191N8709N46149M12699P7076O32503j6023M18975L03190Q84138p1955
16773A3160652M35464N46272N43394K99420P00184N28054Q13763L23824N42578
16764A7893605N09420P67052P71451P07239J060995O23107J143213J002155J153452
16755B5631689R48828J392283J233917J594140J092032J872207J481919J835920
16747C7082935J975798J751922K422245K501104K466166K686679L120585L032979
16739E7040413L455163L747090L779459M592180M905042M612095N703083O205498
16731I4040023O054239O497169P387639P469851P847252Q435753Q526184Q668777
16723A54926887Q454609Q015783Q142715P057206N911497N191855L972634J995086
$$ y = [9915191, 9973900, 10520049, 10932748, 11009824, 11642327, 11626304, 12045279, 12348469, 13232607, 13160652, 13596116, 14142388, 14685782, 14985202, 15685386, 16213440, 17027203, 17351027, 17893605, 18403025, 19170077, 19941528, 20648767, 21709762, 22332869, 23476082, 24478237, 25631689, 26580517, 27972800, 29206717, 30800857, 31892889, 33765096, 35247015, 37082935, 39058733, 40810655, 43232900, 45734004, 48200170, 50886849, 54007434, 57040413, 60495576, 64242666, 68022125, 72614305, 77519347, 82131442, 87834525, 94040023, 100094262, 106591431, 113979070, 121448921, 129296173, 137731926, 146258110, 154926887, 163381496, 171397279, 179539994, 186597200, 192508697, 197700552, 201673186, 203668272]
16715B03668272L85302j163527k437587l960218n490146o575594p384083q116605
16707A68925814q947927q667305q346068q831874q387052q083868p254631p357786
16699A03049303o572522o316274n471322n475762n153925m497390m528902l919689
16691F1113517l672284l138272l403798k553570k873304k239494k877270j710767
16683C8644758j888806k257056j643233j624801j382138j597701j350102j300952
16675B5599969q06257j135810q44886q86223j413726k86307j059839o28490r91943
16666A7546488n14494o36065n24211p71276j6891j213051k13273l44572o63983
16657A2648672m10319m31253j01733l76233n47561l30789l43834k49946j93581
$$ y = [203668272, 204053574, 202890047, 200452460, 196492242, 191002096, 184426502, 177042419, 168925814, 159977887, 151310582, 142964514, 134132640, 125745588, 117661720, 110407089, 103049303, 96476781, 90160507, 84689185, 79213423, 74059498, 69562108, 65033206, 61113517, 57441233, 54302961, 50899163, 48345593, 45472289, 43232795, 40355525, 38644758, 36755952, 34498896, 32855663, 31230862, 29848724, 28251023, 26900921, 25599969, 24793712, 23657902, 22813016, 21926793, 20513067, 20226760, 19166921, 18538431, 17546488, 17031994, 16395929, 15871718, 15100442, 15083551, 13870500, 13657227, 13312655, 12648672, 12238353, 11807100, 11705367, 11329134, 10781573, 10450784, 10106950, 9857004, 9663423]
16648I663423m10383k33158l53409L57773q48122Q8912n06097j69760O5882m68198
16638G186863j56238j34463k88805L8354k30385j31795m0656n34903M30849n92337
16628E546484k58552J35376k62600K59138m03877m8028o30758N25282n35219L35447
16618D662693m54299m6512p6093j56623l29099L52482j37113n7403m85232R43831
16608D216632q12147Q1832j06968J66967j49736P626k38393j52799K79696m48004
16598B844706J58476J94283m45771K30831m43720J00064j51709O567l236k40432
16588B250059J74497J11441k96492L15344k61530K30341r8567j16432m06984j75803
16578A725874K07347k1526L1132J03808k01127j3138K58282k25251j24429K55041
$$ y = [9663423, 9253040, 9019882, 8666473, 9024246, 8176124, 8265036, 7758939, 7589179, 7655061, 7186863, 7030625, 6896162, 6607357, 6645711, 6415326, 6283531, 6242875, 5707972, 6138821, 5546484, 5287932, 5423308, 5160708, 5419846, 5015969, 4967941, 4337183, 4862465, 4327246, 4662693, 4208394, 4161882, 4085789, 3929166, 3600067, 3952549, 3815436, 3758033, 3272801, 4216632, 3404485, 3486317, 3379349, 3546316, 3396580, 3404206, 3165813, 3013014, 3292710, 2844706, 3003182, 3197465, 2751694, 2982525, 2538805, 2638869, 2487160, 2493727, 2490491, 2250059, 2424556, 2535997, 2239505, 2554849, 2293319, 2523660, 2425093, 2308661, 1901677, 1725874, 1933221, 1911695, 1942827, 2046635, 1845508, 1832370, 2090652, 1865401, 1740972, 1996013]
16568A996013k04100k49703J85657k28438K93991N3599m92175L60182l19986R3513
16558A488553M906R9920j0694k63851Q4859L4164K09063m8598K787j12878k15333
16547A272898j18455O930L215K34773k18816K52378j27960k86517k37382L31222
16537A112286J3317J43388J15333j87672m94170Q0899L13213J65701J79099k72708
16527A168686J56516Q4775o85260J61920R5535k93348L60859L93487l81004k77941
16517G84225J76904Q0566k55051j4932j0756j32305J70744j7778j87674L40422
16507I34365J07372k61146r5928q7308L53100J7544l06726J4492Q3221r7700j22551
16496E38735J93920j45178J9997K97949D48890L05085P00k8257j67543K57954
$$ y = [1996013, 1791913, 1542210, 1727867, 1499429, 1793420, 1847019, 1354844, 1715026, 1395040, 1488553, 1493459, 1593379, 1582685, 1318834, 1403693, 1437857, 1646920, 1598322, 1601109, 1488231, 1272898, 1154443, 1161373, 1164588, 1399361, 1180545, 1432923, 1304963, 1018446, 781064, 1112286, 1125603, 1268991, 1384324, 1196652, 702482, 783381, 1096594, 1262295, 1441394, 1168686, 1325202, 1409977, 724717, 886637, 982172, 688824, 1049683, 1443170, 1062166, 784225, 961129, 1041695, 786644, 771712, 760956, 628651, 799395, 781617, 593943, 934365, 1041737, 780591, 684663, 597355, 950455, 967999, 661273, 675765, 758986, 661286, 538735, 732655, 587477, 607474, 905423, 448890, 753975, 754675, 726418, 558875, 816829]
16486H16829k66708K61658C84585K93955r0389J27031J21738k86342L6395K61966
16476H48939l82475J40150K14467k33231k34399J10091r2710K71733n6043P5567
16466F62089l10770j52298K55011j12118K57276j5072o0601n9856q3408J94464
16456E74717J30963N8064o8847j17579k06520K25215B32688L42450j60888J93342
16446F07592k28413K91943k98134k3592J5097N8601j39738J79637K24354l07793
16436C79554n5792L55635J54806C88773P1619J09080j32025K42753B74638K17066
16426D91704A61228K33066j83957M02471p6690J47647l31794o8760l1955K71877
16416E23133p6230h3803H10579D4060N02700k09343k6109j43971P2483k3369K22205
$$ y = [816829, 550121, 811779, 384585, 678540, 588151, 715182, 836920, 550578, 586973, 848939, 466464, 606614, 821081, 587850, 353451, 463542, 370832, 642565, 586522, 662089, 351319, 199021, 454032, 341914, 599190, 584118, 523517, 463661, 380253, 574717, 705680, 763744, 694897, 577318, 370798, 596013, 232688, 575138, 414250, 607592, 379179, 671122, 372988, 349396, 364493, 423094, 283356, 462993, 687347, 379554, 323762, 679397, 834203, 388773, 460392, 569472, 437447, 680200, 274638, 491704, 161228, 394294, 210337, 612808, 536118, 683765, 351971, 283211, 251256, 523133, 446903, -83803, 810579, 44060, 546760, 337417, 311308, 167337, 239820, 216451, 438656]
16405D38656j54899A3721L3170K29031I4117K16291J8254J52763G5304L63037
16395D38341K19384k36820K52918E1639J67096J33559r5537P2501l5529K02804
16385D96533A84775J37220A30473K78452K4250A1701K20333m0537l0812H027B453
16373A08446L5643l6032D6991K84976F4955f4557B77362O8634A37382h6405C12490
16361A02507D3791J56559n2069G3177P0504B8474L25426I6758Q0170l6369K6584
16350A67143Q4345P93a57307B44914A0829a1545A57377K37777r1205Q2060j20191
16339B65818J401j7029M2135j17388H1438k0594K10185A12723K03524a78442P0339
16328a08103E7310d1534D7248A5913L37387m734j40541P3624n6720E228J69152
$$ y = [438656, 283757, 13721, 46891, 275922, 94117, 310408, 328662, 481425, 75304, 438341, 657725, 420905, 673823, 51639, 218735, 352294, 256757, 329258, 293729, 496533, 184775, 321995, 130473, 408925, 433175, 11701, 232034, 191497, 160685, 8027, 2453, 108446, 144089, 108057, 46991, 331967, 64955, -64557, 277362, 345996, 137382, -86405, 312490, 102507, 43791, 200350, 148281, 73177, 143681, 28474, 353900, 96758, 176928, 140559, 167143, 251488, 252281, -157307, 244914, 10829, -11545, 157377, 395154, 303949, 386009, 265818, 267219, 250190, 292325, 174937, 81438, 60844, 271029, 112723, 316247, -178442, -108103, 57310, -41534, 47248, 15913, 353300, 348566, 208025, 281649, 224929, 5228, 174380]
16317A74380e2890B01936K06007E7537K00752J90358M0995j77471J02669E3984
16306C58621c6044C81182A30016D3250a46140D34481a96039E3846K9902a43496
16295d3287p0833n1632A07004a22885A24936m4956g8616C91066A18551J6999b84022
16283A04148K6357J55980K7329H7823J85911G9835K29622A53663O0820r9383E1165
16271A58145F4970J99012L77968a15829D19969j73051I7243J44462c01215A58518
16260A72555a88166c843G9276C1538K7668J9212a52311A71378a26764c2045C29641
16248c1934o4792m8065O6786j12560P9061C49591j67476D6963J62792D6970a46768
16236a39987G299J10155i6550B04099Q2444a27799A20331K65290a16612k5852
$$ y = [174380, -52890, 201936, 407943, 57537, 258289, 448647, 489642, 312171, 414840, 53984, 358621, -36044, 381182, 130016, 43250, -146140, 434481, -196039, 53846, 83748, -143496, -43287, -114120, -165752, 107004, -122885, 124936, 79980, -78616, 391066, 118551, 135550, -284022, 104148, 130505, 286485, 313814, 87823, 273734, 79835, 309457, 153663, 214483, 115100, 51165, 158145, 64970, 263982, 641950, -115829, 419969, 246918, 97243, 241705, -301215, 158518, 172555, -188166, -3843, 79276, 31538, 59206, 78418, -152311, 171378, -126764, -32045, 329641, -31934, -96726, -144791, -78005, -190565, -111504, 349591, 182115, 46963, 209755, 46970, -146768, -139987, 7299, 117454, -96550, 204099, 286543, -127799, 120331, 385621, -116612, -142464]
16226a42464C132L2712a56995J1084r487A21641K37680A5590J56127j7428E966
16214A70928E7870a86525c1450D2022j7240a0823j45611B39334J4327b3902l80096
16203d03998D5925R264J06L40436j72540J99630A14271a4364A39544D5837Q4231
16192A30068b92834g2845k15707A06991d8206K2009A54161E7790Q6233m4217g0502
16180a0788A72601a34800D7449l844f2498n0015A44408P8435g8578B42817B6405
16168E9927b07699A2282c48885A14246e9118m8951l5243l2120P8040j59669A81635
16156i4231n9616A9207L3557b30142E1771L3077L35481A43038L4310l4304f2640
16144i8966A30606N7084N9888c5312j24439q0900A05107Q7062N0819J86288A44533
$$ y = [-142464, 3132, 35844, -156995, -145911, -155398, 121641, 359321, 15590, 171717, 154289, 5966, 170928, 57870, -186525, -31450, 42022, 24782, -10823, -156434, 239334, 253661, -23902, -403998, 45925, 55189, 55295, 395731, 223191, 422821, 114271, -14364, 139544, 45837, 130068, -292834, -72845, -288552, 106991, -48206, -26197, 154161, 57790, 144023, 99806, -70502, -10788, 172601, -134800, 47449, 43605, -62498, -112513, 144408, 222843, -78578, 242817, 26405, 59927, -207699, 12282, -348885, 114246, -59118, -108069, -143312, -175432, -97392, -257061, 181635, -94231, -153847, 19207, 52764, -230142, 51771, 84848, 420329, 143038, 177348, 143044, -62640, -98966, 130606, 187690, 247578, -35312, -159751, -240651, 105107, 192169, 242988, 429276, 144533]
16132B45643p5806b77007R9237j8407B51900J53299d64401i3032A80293C6524
16121A90948q1256b0665j37226b6990D492L6251A012a21077R698A49236c53155
16109f34r6124E6273d32789H5261a13805j8717D22477B7272O0148j9439b17694
16097c4035A58126O4703c2803q9619D6506M2327C7617J03307f244k16339H5324
16085b41763B53051i8683A67436b18603g8282k76837A90168g1332j19606B9181
16074D372J37180a43988P1514j74592b0493C2815J22587a19378C28883L5622b77796
16062d30019A12429f6177a8018m04322h6468o5680A98298I2038b36285C6879c11498
16050I3222h5003A35781d0083C23903a94703D3378R2523M2590a68426l01139C54664
$$ y = [245643, 169837, -277007, -177770, -196177, 251900, 405199, -464401, -93032, 180293, 36524, 190948, 109692, -20665, -157891, -26990, 4492, 40743, 1012, -121077, -111379, 149236, -353155, -634, -96758, 56273, -432789, 85261, -113805, -132522, 422477, 27272, 87420, 67981, -217694, -34035, 158126, 222829, -32803, -122422, 46506, 88833, 37617, 140924, -6244, -222583, 85324, -241763, 253051, -98683, 167436, -218603, -78282, -355119, 190168, -71332, -190938, 29181, 4372, 141552, -143988, -72474, -247066, -20493, 32815, 155402, -119378, 328883, 364505, -277796, -430019, 112429, -66177, -18018, -422340, -86468, -152148, 198298, 92038, -236285, 36879, -311498, 93222, -85003, 135781, -40083, 323903, -194703, 43378, 135901, 178491, -168426, -469565, 354664]
16038D0262a51638B64961I2437c56054M5019E4092a59863e4793B5908O786g2398
16026C0919J10932c2396l45896J84152A03293n0851J11508J56950h1204A42931
16015h8038J2812j17371D1970M913b36263q3522A06347b5368C4315a20671A9703
16003A56346o6331e02580B16370q7371P6049a6686E9040b32898B38734a07916
15992b47700H1996h2018A05653e1014J3654a0712D0423I879N46737A19684Q3391
15981B03075J9508L6314F9871q137b206j68796f9785G4969a28839l72335a44229
15969C70396a09523B01585a00762b0989A1246O5968J54012n1263f4267j83473
15959b47740A29200C1751a26841A78191D3265J2051j0023A0646a18304A22516
$$ y = [40262, -151638, 264961, 92437, -356054, -311035, 54092, -159863, -54793, 25908, 32694, -72398, 30919, 141851, -32396, -378292, -194140, 103293, 52442, 163950, 320900, -81204, 142931, -88038, -75226, -192597, 41970, 46883, -236263, -319785, 106347, -25368, 34315, -120671, 19703, 156346, 90015, -502580, 216370, 128999, 205048, -16686, 59040, -232898, 238734, -107916, -247700, 81996, -82018, 105653, -51014, -37360, -10712, 40423, 9879, 556616, 119684, 203075, 222583, 258897, 69871, 61734, -2206, -171002, -69785, 74969, -128839, -501174, -144229, 370396, -109523, 201585, -100762, -20989, 11246, 77214, 231226, 179963, -64267, -247740, 129200, 31751, -126841, 178191, 43265, 55316, 45293, 10646, -118304, 122516]
15948a48632L2878d1890j12439A35362J18125a70898b6402G2791f9353k51266
15938c20619I1367c08479a43477c5566A45871i1096B90596I7123a06045l42335
15928d48380B07356F0550b65310H709b87354F9827a35214a7370l7462B21751a03220
15916c17661i8978F3892i5757d3580A4326g2346n0447j09438O0467N1829B15985
15904F081N9344j406b80101H1008J6921D582h5378K8298l96291c4554k13943J03161
15892a45336A24932a51044A13459l6895b3934A25262A8205L77978H3759b53978
15881e0273a757j4998D24094b13048g4159k03632d7953j24004b5544A68338a6594
15869A21863a66220K3972j40525N0977a09442j61648P9607J1612j06914a05019
$$ y = [-148632, -115754, -41890, -154329, 135362, 253487, -170898, -26402, 72791, -69353, -320619, 91367, -308479, -143477, -35566, 145871, -91096, 290596, 97123, -106045, -448380, 207356, 60550, -265310, 8709, -287354, 69827, -135214, -17370, -54832, 221751, -103220, -317661, -98978, 63892, -95757, -43580, 14326, -72346, -122793, -232231, -171764, -119935, 215985, 6081, 65425, 64019, -280101, 81008, 97929, 4582, -85378, -57080, -453371, -34554, -248497, -145336, 124932, -151044, 113459, 76564, -23934, 125262, 18205, 396183, 83759, -253978, -50273, -1757, -16755, 424094, -213048, -74159, -277791, -47953, -171957, -25544, 168338, -16594, 121863, -166220, -142248, -282773, -231796, -109442, -271090, -191483, -179871, -286785, -105019]
15858A30901a76031j0573f6240A21602n4412M5541P4117i0882F4976J73123j09456
15847A28643a27834a7059A19516A0535a4503k78042b8777A51201a39431N3994
15837h5437l6756N6759J2541A11988k2080f61334h4792b5783j86602J4950i4054
15825A16724a51792B00387b39137A3571O9196f0409j05446B17110i5133k39824
15815c34957F0638b73329a10103E8469J00537p0587e022l18480g1203j27921H8092
15803a16722m6610j7639D43194b38990m58096a03142J131d258A39554b44157B1423
15791C2245K00462j3015J19710I029M1463e5532C86720e51651H6837c0164n11101
15780e41265A5490a67742E6862P6912a6403j50796A36321a90699j66028B68594
$$ y = [130901, -176031, -186604, -66240, 121602, 67190, 112731, 186848, -90882, 64976, 238099, 128643, -127834, -17059, 119516, 10535, -14503, -292545, -28777, 151201, -139431, -85437, -122193, -65434, -52893, 111988, 89908, -661334, -84792, -25783, -212385, -197435, -94054, 116724, -151792, 200387, -239137, 13571, 82767, -60409, -165855, 217110, -95133, -334957, 60638, -273329, -110103, 58469, 159006, 88419, -5022, -323502, -71203, -199124, 88092, -116722, -163332, -180971, 443194, -238990, -697086, -103142, -102011, -4258, 139554, -244157, 21423, 32245, 232707, 219692, 339402, 9029, 50492, -55532, 386720, -551651, 86837, -30164, -541265, 15490, -167742, 56862, 133774, -16403, -167199, 136321, -190699, -356727, 268594]
15769B4388K24364e8389k29913a34121f2990n6169p237A17406b72811A65705o4092
15758A01613J76880j02937m0678a17564A36124A3067e2845A40070b73941E0547
15747e0847m02557C32758D0298K54949I3570i9043C35715b49523a20211r3851
15737b14062i0704H6817f0213D4254h5717M146j21460A11150c71675A3912a62640
15725a74002o0083b6477m6791k0302k04494a31578A42363M425a3399j57048C101
15713c02430O11a071l3352k57707L29R3993g099k6268k46445C61432H8664f6216
15700C63995H202b96727I5772d33567I3296m5936e0259b2207j45842j68998d1202
15688A1499L38478r2271c16608a56331c0148A09583D2087J91975c5951k43172
$$ y = [24388, 248752, -58389, -288302, -134121, -62990, -119159, -126396, 117406, -272811, 165705, 101613, 278493, 175556, 134878, -117564, 136124, 13067, -52845, 140070, -273941, 50547, -50847, -453404, 332758, 40298, 295247, 93570, -99043, 335715, -249523, -120211, -214062, -90704, 86817, -60213, 44254, -85717, -81571, -203031, 111150, -371675, 13912, -162640, -174002, -234085, -26477, -73268, -93570, -298064, -131578, 142363, 146788, -13399, -170447, 3101, -302430, -301819, -1071, -34423, -292130, -291801, -197808, -7099, -33367, -279812, 361432, 88664, -66216, 363995, 8202, -296727, 95772, -433567, 93296, 47360, -50259, -22207, -168049, -337047, -41202, 11499, 349977, 257706, -316608, -156331, -30148, 109583, 42087, 234062, -35951, -279123]
15678b79123L3680f5608j41870F5339h2231B57816F2032a71887B6868L69010A34587
15666d5751r5900K2969A18150m4760J5819f7587J5469E45169I0732c93945k2565
15655d16510b04212M3620B89033A44373c81515c6892j55254i2693B1488K0125
15645D1613K12785n9686a24528C44063C425K01062a21372q2192i6137q7624B74167
15633a20228a9262l68360a60457K5620f1025m179B96501b29668N7480P5739j03752
15622b00201M9010k24466K5228A55512E5484f1251I9615K8885A9039K3193c59472
15610A51952k8885A6724O9342Q165a71013k9049A23889h5826A98632a14952b5429
15598a42132I4099b95112k4178O5942b6399r5935n8399j15135e0854k53198G1309
$$ y = [-279123, -245443, -65608, -207478, 65339, -82231, 257816, 62032, -171887, 26868, 395878, 134587, -45751, -141651, -118682, 118150, 73390, 89209, -67587, -52118, 545169, 90732, -393945, -416510, -204212, -160592, 289033, 144373, -381515, -36892, -192146, -92693, 21488, 41613, 254398, 194712, -124528, 344063, 3425, 204487, -121372, -203564, -96137, -183761, 274167, -120228, -19262, -387622, -160457, -134837, -61025, -65204, 296501, -229668, -172188, -96449, -200201, -151191, -375657, -350429, 155512, 55484, -61251, 99615, 128500, 19039, 42232, -359472, 151952, 123067, 16724, 86066, 94231, -171013, -200062, 123889, -85826, 198632, -114952, -25429, -142132, 94099, -295112, -319290, -253348, -26399, -122334, -180733, -295868, -50854, -304052, 71309]
15586c70320F3091i1696o4199P1507a0495B24188a06596a686l3898J6028o3510
15575h3066j8945A87694C7028J58968a1557k4608r2678j5056E2826J08595b23206
15563d6244a4980I1936K86667j1538a41856m889C6033j2209a14849B60459A03150
15551b20392a4327m6139p0360m1756A4529a25607I2195a09642L8276k9893k42465
15540c43724B4529f2380G9659J95783a15198k88387Q2066o5623C13136h1523k12794
15529b94317h7599C05176b12747f2453j12324H2073J12065N2235p8550g3421j19990
15518a93411A31920b81020Q7438H3384J32487r9626b33603D6526K28749j29795
15508A45480O4134b33701O4067G3451j8858h9314D4685a54571a305A99442b6264
$$ y = [-370320, 63091, -91696, -155895, -84388, -10495, 224188, -106596, -1686, -35584, -19556, -83066, -102011, 187694, 37028, 195996, -11557, -36165, -128843, -143899, 52826, 161421, -223206, -46244, -14980, 91936, 378603, 367065, -141856, -146745, 36033, 23824, -114849, 260459, 103150, -220392, -14327, -60466, -130826, -172582, 14529, -125607, 92195, -109642, -71366, -101259, -343724, 24529, -62380, 79659, 275442, -115198, -403585, -321519, -387142, 313136, -81523, -294317, -87599, 305176, -212747, -62453, -174777, 82073, 194138, 246373, 167823, -73421, -193411, 131920, -281020, -193582, 83384, 215871, 116245, -233603, 46526, 275275, 145480, 209614, -233701, -169634, 73451, 54593, -89314, 44685, -154571, -1305, 199442, -26264]
15496I022c23490a26683A12810j72a24561i509j52227I50c08472E7022a44164
15484e6904j21500A43090g5773A3056J75125D3373b51128g1754E9721P7746f7440
15472d8889A69216g319A86704Q5121F6731a79313a7246A16032a61293N8857H2510
15460I5476a85014l8623D12269E9270j3939A0572a16267B8916L8191b52632K3497
15449b29135h7320o7858B20321A1419b89459E8380a26065A04680B9011h6393h272
15437c46258E5747d04936a80960c0515A32378f7020D9900a53344B96764j37803
15427A58961c99360I099f5496A8895c10137D6072b63061R8713j667c3018a4477
15415C8199N3055A2993g2636j70509A2803b66j31618C40194A57906h1755n0371
$$ y = [9022, -323490, -126683, 112810, 112638, -124561, -9509, -161736, 950, -308472, 57022, -144164, -56904, -178404, 143090, -75773, 13056, 188181, 43373, -251128, -71754, 59721, 137467, -67440, -48889, 169216, -7319, 186704, 271825, 66731, -179313, -17246, 116032, -161293, -102436, 82510, 95476, -185014, -223637, 412269, 59270, 45331, 10572, -116267, 28916, 67107, -252632, -229135, -87320, -155178, 220321, 11419, -289459, 58380, -126065, 104680, 29011, -86393, -8272, -346258, 55747, -404936, -180960, -30515, 132378, -67020, 49900, -153344, 296764, 158961, -399360, 9099, -65496, 18895, -310137, 46072, -263061, -164348, -166015, -33018, -14477, 38199, 91254, 12993, -72636, -243145, 12803, -266, -131884, 340194, 157906, -81755, -132126]
15404a32126C54320n5625A6941E076a79445J3812L8457M9857A83610a02678K0266
15393h2412a1249k46050J27132F4614h2822B47047a27966k04736a19921q3720
15383b03641R2455n9482K3181e4774D2579b40697A30598c19099A07659L86339
15373D93998B8895h2141K2002K2758D5035i9666j61725a07826k34546J41859l0328
15362b30841C77312A19235M1330c03666i4422A20130J62946F5058J33994I4737
15351A08239b4419l21263a63083B45841N628a78622G1909a08151E65a04781K8570
15340g6211K3612k4975j94319a23772A02478P0525d705j17523k81819B91933A44842
15328d2671A40649O526f7600K1569J4736G5723J6796b90669D59637A33095b16952
$$ y = [-132126, 354320, 298695, 16941, 5076, -179445, -165633, -127176, -77319, 183610, -102678, -82412, -11249, -257299, -130167, 64614, -82822, 247047, -127966, -332702, -119921, -203641, -111186, -170668, -147487, -54774, 42579, -240697, 130598, -319099, 107659, 493998, 28895, -82141, -60139, -37381, 45035, -99666, -261391, -107826, -342372, -200513, -230841, 377312, 119235, 160565, -303666, -94422, 120130, 283076, 65058, 199052, 94737, 108239, -24419, -345682, -163083, 245841, 251469, -178622, 71909, -108151, 565, -104781, -76211, -52599, -77574, -271893, -123772, 102478, 173003, -4705, -122228, -404047, 291933, 144842, -42671, 140649, 147175, -67600, -46031, -31295, 75723, 92519, -290669, 459637, 133095, -216952]
15316a4204A32273i6007E3278O7987R0699l2052D5077a91556A45718L0931E0926
15304a22341A26993R8631J573F8904d0969a6419H9630O9199n9226l2727e7766
15292b96546A86073b30100l4621k3567g7790C97594a25870C11274j14466a42573
15281b9964k00853g3016l12289H3282a25682B56433p7740g0436B57493n046j02367
15270A50080b54852D63497b55949N6989N5826N0663C10982b4851j6220k9171O323
15259f3919C74384d8210K1301B26300o8008o7849J30498c2732B82007K93626L75182
15248I50815L30931m42338K57819D57344j80592I2972B8199P9847K9669J60006
15238B97721l3620g6787J1321A95971P7225F8986J86737j15897a12500A77328
$$ y = [-14204, 132273, -96007, 53278, 121265, 211964, 179912, 45077, -191556, 145718, 176649, 50926, -122341, 126993, 225624, 227197, 68904, -40969, -16419, 89630, 158829, 99603, 66876, -57766, -296546, 186073, -230100, -264721, -288288, -77790, 397594, -125870, 311274, 196808, -142573, -29964, -230817, -73016, -385305, 83282, -125682, 256433, 178693, -70436, 257493, 252447, 150080, -254852, 463497, -255949, -198960, -143134, -92471, 310982, -24851, -41071, -70242, -63919, 374384, -48210, -26909, 226300, 158292, 90443, 220941, -32732, 282007, 575633, 950815, 1281746, 839408, 1097227, 457344, 276752, 92972, 28199, 108046, 137715, 297721, 264101, -76787, -65466, 195971, 273196, 68986, 255723, 139826, -112500, 177328]
15227d32189E8080Q2234f1357A17759a6623A21977M19433i2825E401d13705a56975
15215A30338D0667P1958J04558B9658O5758J15027J34758b83055B14729a27248
15204A04420G355K62006A24597c3909I9044b08487L2093N7500A24593R4277r3278
15193A25592n17A6099g2478E2277J64560c0901l0066B20580f4656q2182A05206
15181F6830J34144j00071J77289O8802a5276A12275D112a38002C62729j21326
15171B41403b8401E1539b43268A43351a25236A56780m3157R6262r5791J5690o228
15160A23556L0074B8072J74841a20056I8524h8173J7303a625n2053K1396I0316
15148C85013A63831A680P8098K62017A17191D8189K09013c9796F1710a30011G85
$$ y = [-432189, 58080, 140314, -61357, 117759, -16623, 121977, 541410, -92825, 5401, -413705, -156975, 130338, 40667, 112625, 217183, 29658, 95416, 210443, 345201, -283055, 214729, -127248, 104420, 7355, 269361, 124597, -33909, 99044, -208487, -176394, -118894, 124593, 218870, 125592, 125075, 16099, -72478, 52277, 216837, -30901, -60967, 220580, -64656, -146838, 105206, 66830, 200974, 100903, 278192, 346994, -15276, 112275, 4112, -138002, 362729, 241403, -28401, 51539, -243268, 143351, -125236, 156780, 113623, 209885, 114094, 129784, 123556, 153630, 28072, 202913, -120056, 98524, -88173, -70870, -1625, -53678, -32282, 90316, 385013, 163831, 1680, 79778, 341795, 117191, 48189, 257202, -39796, 61710, -130011, 785]
15136B56825L2005b8837a3215k52325A96706b71724a1339A49648J74542j58065
15126A66125o6474m863k5836M5628K77893A22318K6280L1844J66422B710J30096
15115A32806H315L8514Q0048l7098a06430l04492A37818c436A04969K04031i5812
15103A22808J42140o9740O4820Q0151g3592A91027b1248A8780L2063K51375F3367
15091B54747H598J73007N4848b21703D5874J6905c1819C53082D1308c0544n0034
15080h0578C12042F8784J63215c009B41906a55565C97785A94801J32467Q6195
15070D13463A4417J08108J3056c38078C0977g6629D61987a1078D6408J18933c8935
15058B17751f9316A34767K4438a72035E7264L53299k04255D0169b13963C21472
$$ y = [256825, 288830, -28837, -13215, -265540, 196706, -271724, -11339, 149648, 324190, 166125, 99651, 94788, 68952, 114580, 392473, 122318, 148598, 180442, 346864, 2710, 132806, 8315, 46829, 126877, 89779, -106430, -410922, 137818, -3436, 104969, 309000, -95812, 122808, 264948, 195208, 260028, 340179, -73592, 191027, -21248, 18780, 50843, 302218, 63367, 254747, 8598, 181605, 236453, -221703, 45874, 62779, -31819, 353082, 41308, -30544, -80578, 312042, 68784, 231999, -3009, 241906, -155565, 397785, 194801, 327268, 413463, 14417, 122525, 135581, -338078, 30977, -76629, 461987, -11078, 46408, 165341, -38935, 217751, -69316, 134767, 159205, -172035, 57264, 410563, 206308, 40169, -213963, 321472]
15047F9527L12754A84412J23500G4905R7045K30368p1584b28268k49321B38727
15036E48142B46709H7212J94350R8019A23250a56319F49557b58801i259A88721
15025B31947I3565J59514r0157K94405B4180K09633f1727A76040J65999m1433
15015C00606O0060H9358O2535C7739J2890J2064J25792a8474G041L79250f5539
15003A25393K47718a47575A39223J65090L01074C1747L08273F904K65806b40163
14992B99031a6342C56265A31035L9672a0036j86695C68230F5336M74296A6752
14981D86708A61205a66613C1771K733J05912K14581c1435B22702C8958M0771K99594
14970C79323o4752k1817p1139K68530A40096J41352M5016K00237A89367M34614
$$ y = [69527, 382281, 184412, 307912, 74905, 171950, 402318, 330734, -228268, -477589, 238727, 548142, 246709, 87212, 281562, 379581, 123250, -156319, 649557, -258801, -9259, 188721, 231947, 93565, 253079, 162922, 457327, 24180, 233813, -61727, 176040, 342039, 300606, 360666, 89358, 151893, 37739, 50629, 62693, 188485, -18474, 7041, 386291, -65539, 125393, 373111, -147575, 139223, 304313, 605387, 31747, 340020, 6904, 272710, -240163, 299031, -16342, 356265, 131035, 170707, -10036, -196731, 368230, 65336, 539632, 16752, 486708, 161205, -166613, 31771, 34504, 140416, 354997, -31435, 222702, 38958, 79729, 379323, 314571, 292754, 221615, 490145, 140096, 281448, 326464, 526701, 189367, 623981]
14960F23981B72265O1830D1210a54148E69675B54666R536p0426b2900A10769K47819
14949C58588b09750I0251c2117D51646B13418m4527J31460A23851l5285J48012
14939B36578j10394J9748L36566q2244m6101r0741C5867j647J03612J08644J3295
14928B59771j01245R2827J40736h2016A82173J48580j31170M7539k2840O087K7843
14917B58212j25018P0498J40563j5345J83919A49504J9101j5407J6616K28414
14907C98228A54139N25370B74669o9196A3362L57411R4558A620K40393N1490K41852
14896E35355H8615J09385J52799k2035E3033J73304J61645P6596q5589J05052
14886D84041B5768N58968k32724L0964j11503J064J33712j60830J99002R1162
$$ y = [623981, 272265, 334095, 41210, -154148, 569675, 254666, 264202, 193776, -22900, 110769, 358588, -209750, 90251, -32117, 451646, 213418, 168891, 300351, 123851, 88566, 236578, 126184, 145932, 482498, 400254, 354153, 263412, 35867, 34220, 137832, 246476, 259771, 158526, 251353, 392089, -82016, 182173, 330753, 199583, 247122, 224282, 230369, 258212, 133194, 203692, 344255, 328910, 512829, 149504, 168605, 153198, 169814, 398228, 154139, 679509, 274669, 205473, 13362, 370773, 465331, 1620, 242013, 293503, 535355, 88615, 198000, 350799, 328764, 53033, 226337, 387982, 464578, 378989, 484041, 25768, 584736, 352012, 382976, 271473, 272537, 406249, 245419, 444421, 535583]
14876E35583m3535L3098O9436j8540j62856A18374a09083B98828K07476A29341
14865C82383j01096j21950A7457L99394r4633J3313Q1709r9700J46386M2956q1154
14854D25728J09835k32898j05726l6329J2262J29827J96586I481J90951O14631
14844H15063B14348Q8485j1980p7741D9798K47326K0495l9056L47397B72607M20345
14833F92952k54695j12412L338L73582A75054J52270L2596q8843N3630n63J06197
14822D30341j6424K5794I2501L26605O2443j1123L5237j03833K10062k40546K25911
14811E97257k55109K30811J94404k48750j40863J55972D350N49812j40757j47108
14801B66297K40219l9116l3145j77920N2074N2201q5157M67923j34584J84j5488
$$ y = [535583, 492048, 525146, 594582, 576042, 413186, 118374, -109083, 298828, 506304, 129341, 382383, 281287, 159337, 17457, 416851, 322218, 335531, 417240, 317540, 463926, 506882, 425728, 535563, 302665, 196939, 160610, 172872, 302699, 499285, 9481, 200432, 815063, 214348, 302833, 290853, 213112, 49798, 297124, 317619, 278563, 625960, 272607, 692952, 438257, 325845, 329183, 702765, 175054, 327324, 359920, 271077, 324707, 324144, 430341, 413917, 439711, 92501, 419106, 481549, 470426, 505663, 401830, 611892, 371346, 597257, 342148, 572959, 767363, 518613, 377750, 533722, 4350, 554162, 413405, 266297, 506516, 467400, 434255, 256335, 308409, 360610, 275453, 743376, 608792, 608976, 593488]
14790E93488k72197L00317q1825j81603J05208R2206J6945A8324O25936j72606
14780D71654J45981k32421l631J93832p6596J84954k06707J313k17528O10537
14770H71388l21689k36777K95523k47287J07921K21253j42745p6320N0127B34774
14759E13549j0932K56208B09939L18846K30055r3312j74475N6897j67657O53789
14749A034082m15606k28840M95586l39655j31870J57986m0940J14122J27222L5978
14739H08065j25619p9048q1634J85993l23192j9663J34436J34445r0612K39840
14729G83011m0205l38037M89933j09446B83867N85745J22146D17731N30104j93732
14719G54103l01121L83383l37852K71453C82966J53777j22818L27024R0873k56267
$$ y = [593488, 321291, 621608, 539783, 358180, 463388, 555594, 572539, 18324, 644260, 471654, 617635, 385214, 381583, 575415, 498819, 683773, 477066, 478379, 260851, 871388, 549699, 312922, 608445, 361158, 469079, 690332, 547587, 471267, 521394, 234774, 513549, 502617, 758825, 209939, 528785, 758840, 665528, 491053, 547950, 380293, 1034082, 618476, 389636, 885222, 545567, 413697, 571683, 530743, 644865, 772087, 808065, 682446, 603398, 521764, 707757, 384565, 364902, 499338, 633783, 543171, 783011, 742806, 404769, 894702, 785256, 283867, 869612, 991758, 417731, 947835, 754103, 452982, 836365, 498513, 769966, 382966, 536743, 413925, 740949, 831822, 575555]
14709E75555K41609K35442D45485K61484J59091j81848K33565m6185j24295J45362
14699H92659k73177J16237J80918j24891j0673J03597j80365K71261k16850L21924
14689A080640k80725J13052k66731N03791k41987J85042q4816J22142k99086J29629
14679I60951J09947j0269j26516Q5880l29626K71003r1122L1926M5871j55060
14669G92985J09970p0604K45534m68500M36458j59896K78157k01909P1699j87891
14659H46003j45773L58461k5220j83530j35554K78477k91682J14849O3240L85545
14649A264816l63683K20703k38919J54193P8532l24969K41654k3018J19655k29194
14639H99770O21401m10678l65861O38934j86052j99907p6535K94092j42978O1522
$$ y = [575555, 817164, 1052606, 445485, 706969, 866060, 684212, 917777, 871592, 747297, 892659, 619482, 735719, 916637, 791746, 781073, 884670, 704305, 975566, 758716, 1080640, 799915, 912967, 646236, 1150027, 908040, 1093082, 1008266, 1130408, 831322, 960951, 1070898, 1060629, 934113, 1019993, 690367, 961370, 870248, 902174, 948045, 792985, 902955, 832351, 1077885, 609385, 1045843, 885947, 1164104, 962195, 1033894, 846003, 700230, 1058691, 1033471, 849941, 714387, 992864, 701182, 816031, 879271, 1264816, 901133, 1121836, 882917, 1037110, 1115642, 790673, 1032327, 1009309, 1128964, 899770, 1521171, 1110493, 744632, 1383566, 1197514, 997607, 921072, 1215164, 1072186, 1133708]
14629A133708K01410k43461J88775l15845J87985J46906k81430L13068K8922K09884
14619A569922j67132k05933Q5394K16598k56299o4960O90881q18874J75159K22955
14609A447711P4858K17264o14707L06967j57970R2405j26187M7623j5942M79922
14599A751944j90710K503l48249K08438K85456k86928J51402m2900o4525k09367
14589A257064L53916j00799J39074k09334N18551l67859j9125L26121k81696O15494
14579B231407K2492l46334o6307k11504N15044p05095N02080L91456o46221N7080
14569A744098o4965J87143L73798m93556K75855K82101j62680j64236M32089P1230
14559B480877o4429J60511m7176N17469k06305P9866N74687n5773Q26010J651647
$$ y = [1133708, 1335118, 1091657, 1280432, 964587, 1152572, 1299478, 1018048, 1331116, 1360038, 1569922, 1402790, 1196857, 1282251, 1498849, 1242550, 1177590, 1868471, 1049597, 1224756, 1447711, 1522569, 1739833, 1125126, 1432093, 1274123, 1366528, 1240341, 1287964, 1272022, 1751944, 1561234, 1563737, 1215488, 1423926, 1709382, 1422454, 1573856, 1530956, 1466431, 1257064, 1610980, 1510181, 1649255, 1439921, 1958472, 1590613, 1571488, 1897609, 1615913, 2231407, 2253899, 1907565, 1841258, 1629754, 2144798, 1439703, 1941783, 2333239, 1687018, 1744098, 1679133, 1866276, 2240074, 1746518, 2022373, 2304474, 2141794, 1977558, 2409647, 2480877, 2416448, 2576959, 2529783, 3047252, 2840947, 2920813, 3495500, 3439727, 4265737, 5917384]
14549E917384K248349M644456Q860633J3824907P802112B1151349G429070C563225
14540C007045o22058m65009l2444l09458L75220m740o1454J76949k11249K98617
14530B151419j70275j89696J67285l2507L43291j90851j7938L18477n44565O76319
14520B510959l20348J77353j50830j81627L55775o0421M24798k08776l08016K13350
14510B452217K39296k29771q4886M01209j65668J8024j3404J77527J23392l31736
14500B586200R5147J94815L31244K0255O0001j68152k89216m7954M49836r4427
14490C137749J5042J76076J28310m41410K46270K49230k21633J65836O855J70379
14480C632704j27171L0528k97708L00639K16168j37576L6668j63257K85796K94057
$$ y = [5917384, 8165733, 12810189, 21670822, 35495729, 43297841, 21151349, 7429070, 3563225, 3007045, 2384987, 1919978, 1887534, 1578076, 1953296, 1948556, 1887102, 2064051, 1852802, 2151419, 1981144, 1791448, 1958733, 1926226, 2269517, 2078666, 2060728, 2379205, 1834640, 2510959, 2190611, 2367964, 2217134, 2035507, 2391282, 2330861, 2755659, 2546883, 2238867, 2452217, 2691513, 2461742, 2376856, 2778065, 2612397, 2630421, 2617017, 2794544, 2917936, 2586200, 2681347, 2876162, 3207406, 3227661, 3287662, 3119510, 2830294, 2782340, 3232176, 3137749, 3152791, 3328867, 3457177, 3015767, 3262037, 3511267, 3289634, 3455470, 3462325, 3632704, 3505533, 3536061, 3238353, 3538992, 3755160, 3617584, 3654252, 3490995, 3776791, 4070848]
14470D070848j60606J90733k51562J85429k69166Q41913m46150M79874l23417
14461D317896L39361l57816m1540M46590l05820O48731o78249J82615P4984L17912
14451D944664L4519J3420k4027k0311J69579o4894N8184q8537m4798N69132J62762
14440E709693l22399R8288j2432L99309j50522J14258L9417J35116K17175K47631
14430F475534j00784K5839M9904L19237j29271o8135Q9281J66852K42501M5352
14420G116310K23824m7755N79679n71308L74028l94613M17068K44795Q5007k76575
14410G750460L32495J90812N1520j08447O16234Q1116n7090N8789K77395M94866
14400I688150q3013J71663K377K42922J49611L06214L36203l08242L95500R220
$$ y = [4070848, 3910242, 4100975, 3849413, 4034842, 3765676, 4607589, 4161439, 4641313, 4317896, 4657257, 4299441, 4257901, 4704491, 4398671, 5047402, 4369153, 4551768, 4626752, 4944664, 4979183, 4992603, 4968576, 4948265, 5117844, 5052950, 5111134, 5022597, 4977799, 5546931, 5709693, 5387294, 5485582, 5473150, 5872459, 5721937, 5836195, 5875612, 6010728, 6227903, 6475534, 6374750, 6400589, 6450493, 6769730, 6640459, 6572324, 6661605, 6828457, 7070958, 7116310, 7340134, 7292379, 7872058, 7300750, 7674778, 7280165, 7697233, 7942028, 8027035, 7750460, 8082955, 8273767, 8325287, 8216840, 8833074, 8914190, 8857100, 8915889, 9193284, 9688150, 9605137, 9776800, 9779177, 10022099, 10171710, 10477924, 10814127, 10505885, 10901385, 10910605]
14390A0910605M19521J02355J06157K96526M23673p6061M34257p6471N37258M23655
14380A3501475l57524N57915K22305L01998L14203J11660M04850L53979K7639
14371A5438500N51767P22882m78210O18033N47506N1661N20899K69305O15316
14362A8857659K11300K70507Q50403L09561K80371M76154P10265M83835M17330
14353B2867385N89351N71469O06843O38208N08773N02554J026760R71254L0111
14344B8312708R38431Q79793N75136J264902P58348J190747Q11963M44449J729327
14335C6905804J085747J037800J221318J081619R63913J251720J801819J447939
14327D6797679J422561J565405J757106J540944K439109J483176K158622J942060
$$ y = [10910605, 11330126, 11432481, 11538638, 11835164, 12258837, 12182776, 12617033, 12540562, 13077820, 13501475, 13143951, 13701866, 13924171, 14226169, 14540372, 14652032, 15056882, 15410861, 15438500, 15990267, 16713149, 16234939, 16852972, 17400478, 17452139, 17973038, 18242343, 18857659, 19068959, 19339466, 20189869, 20499430, 20779801, 21255955, 21966220, 22450055, 22867385, 23456736, 24028205, 24635048, 25273256, 25782029, 26284583, 27311343, 28282597, 28312708, 29251139, 30130932, 30706068, 31970970, 32729318, 33920065, 34732028, 35176477, 36905804, 37991551, 39029351, 40250669, 41332288, 42296201, 43547921, 45349740, 46797679, 48220240, 49785645, 51542751, 53083695, 55522804, 57005980, 59164602, 61106662]
14319F1106662K633754K513049J986206L050248K830262K939912L149132L228913
14311H3438138L589455L491639M175777M305003M429127M714376M879178N527857
14303A18550550N447921O394751O669723O307406P193489Q067230Q325489Q932464
14295A75889023Q967579J0328878J0530467J1244627J1423744J2968353J3211409
14288B54564080J4040310J4474592J5144502J5784286J6274294J6222110J6597212
14281C63101386J6499124J6315939J5711523J4579078J3169164J2263765R109974
14274D60749953L817591J156206n41702k266816j29027k13765l149520o243786
14266D53179134j0100608j2560172j3184778j4486523j4964937j6342144j6995597
$$ y = [61106662, 63740416, 66253465, 68239671, 71289919, 74120181, 77060093, 80209225, 83438138, 87027593, 90519232, 94695009, 99000012, 103429139, 108143515, 113022693, 118550550, 123998471, 130393222, 137062945, 143370351, 150563840, 158631070, 166956559, 175889023, 184856602, 195185480, 205715947, 216960574, 228384318, 241352671, 254564080, 268604390, 283078982, 298223484, 314007770, 330282064, 346504174, 363101386, 379600510, 395916449, 411627972, 426207050, 439376214, 451639979, 460749953, 464567544, 465723750, 465182048, 462915232, 462786205, 462572440, 459422920, 453179134, 443078526, 430518354, 417333576, 402847053, 387882116, 371539972, 354544375]
14259C54544375j7019386j6703094j6188197j5532693j4657205j4255246j3653608
14252B46534946j3052024j2376216j1448872j1238647j0119033r367954r403624
14245A69528576q013768q054100p347204p000002o867559n837810n806150n254862
14237A15347121m995253n036103m761475m362817l969442l603028l095888l628713
14229H1894402l173622l147034l117621k640403k375568k859564k118338k346164
14221F0116088j960549j970273j585480k212716j503708j995299j166987j680644
14213D6040432q74578j664998j120724j809205j170250q66191n83516q14297j322083
14204C5814590j282361j131474r64062m31699o38140p57086j446982n38897p26775
$$ y = [354544375, 337524989, 320821895, 304633698, 289101005, 274443800, 260188554, 246534946, 233482922, 221106706, 209657834, 198419187, 188300154, 178932200, 169528576, 161514808, 153460708, 146113504, 139113502, 132245943, 126408133, 120601983, 115347121, 110351868, 105315765, 100554290, 96191473, 92222031, 88619003, 85523115, 81894402, 78720780, 75573746, 72456125, 69815722, 67440154, 64580590, 62462252, 60116088, 58155539, 56185266, 54599786, 52387070, 50883362, 48888063, 47721076, 46040432, 45165854, 43500856, 42380132, 40570927, 39400677, 38534486, 37950970, 37136673, 35814590, 34532229, 33400755, 32436693, 32004994, 31366854, 30609768, 29162786, 28623889, 27897114]
14195B7897114n79347l33330r04953p13450o23801o18881o48751n20816o52454
14186B2301331k22194p14015l73037m25216m05899n24442n69489j97682k53515
14177A8615842n61778l44662j78044n36167k04328m53476j08999n70582m73777
14168A5184029k6863l39339j33821m33443l19757j92965l07915J17767m01333
14159A3146360P6833p00057q80n03452P4117j75083R6213m72181n45958k44918
14149A0750994l0603j68187j05571k35043J3368k27093j33233l7379J15934n59166
14139I384021J65389n42537R4034n6412m44654L6121m19851j10899k58988q7572
14129G758652L81075l44484J09637j84005k43561M4696q1968o483n5303l61107
$$ y = [27897114, 27317767, 26984437, 26079484, 25366034, 24742233, 24123352, 23474601, 22953785, 22301331, 22079137, 21365122, 20992085, 20566869, 20160970, 19636528, 19067039, 18869357, 18615842, 18054064, 17709402, 17531358, 16995191, 16790863, 16337387, 16228388, 15657806, 15184029, 15157166, 14817827, 14684006, 14250563, 13930806, 13737841, 13429926, 13547693, 13146360, 13223193, 12523136, 12522256, 12018804, 12092921, 11917838, 12014051, 11541870, 10995912, 10750994, 10720391, 10552204, 10446633, 10211590, 10224958, 9997865, 9864632, 9827253, 9943187, 9384021, 9549410, 9006873, 9100907, 9044495, 8599841, 8635962, 8216111, 8105212, 7846224, 7758652, 8139727, 7795243, 7904880, 7720875, 7477314, 7522010, 7440042, 7433559, 7378256, 7017149]
14119G017149j35555j78873J9481O0452R3601k44482j93955j68643o633O5396
14109F327938n6494n03964J89481l18618N583R6870l59033q783J53287m3790N7719
14098E540196l18610q7303K60157n75196J31237J65909k63824L98569j67601k80183
14088D803351k1243J85399m28880K02939p9518l20868J18716j89332R4230O4493
14078D429287j40799k05260K2861j28681K65559q9824l12459K24590J85541p60674
14068C490141K28776p9949N15721k86794l75390K01508J52479k05114L0356K35335
14058C907069j16453k86075J85705o8673k44774K02127k02893N0328k41746K6298
14048C210913J63818n736j72200O1178J3407l27442K5475L73141m53869n2006
$$ y = [7017149, 6881594, 6702721, 6722202, 6782654, 6876255, 6631773, 6437818, 6269175, 6262542, 6327938, 6271444, 5767480, 5956961, 5638343, 5643926, 5740796, 5381763, 5372980, 5526267, 5482477, 5540196, 5221586, 5134283, 5394440, 4819244, 4950481, 5116390, 4852566, 5251135, 5083534, 4803351, 4782108, 4967507, 4538627, 4741566, 4662048, 4341180, 4459896, 4270564, 4364794, 4429287, 4288488, 4083228, 4106089, 3977408, 4242967, 4153143, 3840684, 4065274, 4250815, 3490141, 3718917, 3638968, 4154689, 3867895, 3492505, 3694013, 3846492, 3641378, 3671734, 3907069, 3790616, 3504541, 3690246, 3621573, 3376799, 3578926, 3376033, 3426361, 3184615, 3210913, 3374731, 3368995, 3196795, 3257973, 3271380, 2943938, 2969413, 3342554, 2888685, 2836679]
14038B836679Q054J6721m1086K35001k39666j66250O3416J09448j52742j09872
14028B559703Q027r5229N8275o399l55593L62520j65015J61858l92225L00880
14018B436802K55828k22440k47677J40788l4425K1340l49615P6837M9233K0406
14008B147077R198j68217J38815k12057K02039q6528J21750O7888o10600O30741
13998B240106k76882R5158k97870Q7121j45647O2781r512M61060J060911J178684
13988D455910L168740P386548J4155523J3356206j6598796A2090259m987677j829655
13980E272927j026382j44714p98109m67926J96833n81436L33305j05423k36044
13971B443031j07624j35451r9462R9294m10620L61651j65794K16676m14515K87453
$$ y = [2836679, 2844733, 2861454, 2820368, 3055369, 2815703, 2649453, 2712869, 2822317, 2669575, 2559703, 2567730, 2472501, 2530776, 2524377, 2168784, 2531304, 2366289, 2528147, 2135922, 2436802, 2692630, 2470190, 2222513, 2363301, 2328876, 2350216, 2000601, 2077438, 2126671, 2147077, 2156275, 1988058, 2126873, 1914816, 2116855, 2030327, 2152077, 2219965, 1609365, 2240106, 1963224, 2058382, 1760512, 1847633, 1701986, 1764767, 1755255, 2216315, 3277226, 4455910, 7624650, 15011198, 29166721, 42522927, 25924131, 12090259, 7102582, 5272927, 4246545, 4101831, 3303722, 2835796, 3032629, 2451193, 2784498, 2679075, 2443031, 2335407, 2199956, 2100494, 2199788, 1789168, 2150819, 1985025, 2201701, 1787186, 2074639]
13961B074639k29623o5776L67413m08781j15118K63845L40653l99441J63632k30456
13951A760987k7500K18984j77713q5589J23884J19341l49394J17608n9410o7139
13941A574059J45123j20472j95803L83937k5265J2131k85809o8108L25076J54860
13931A899729m65560K32524j1662N36561p04234L74256m09546j45940j60723L12263
13921A457668J03520P761p1874J61983l01743O4372l17621M32665j94462m890
13911A337379L19139n11721J52089l4172K75714l83395L16859j32719O86665r01303
13901A124535J80903P3886p9906k03493q6981L23403k17328L59848o4511k70044
13891A140312R782j0152l8241J94320k68433k8936L05141k14870m9027m4115R6666
$$ y = [2074639, 1845016, 1779240, 2146653, 1737872, 1622754, 1886599, 2227252, 1827811, 1991443, 1760987, 1733487, 1952471, 1774758, 1689169, 1813053, 1932394, 1583000, 1700608, 1641198, 1574059, 1719182, 1598710, 1402907, 1786844, 1761579, 1773710, 1487901, 1419793, 1744869, 1899729, 1434169, 1666693, 1655031, 2191592, 1487358, 1861614, 1452068, 1306128, 1145405, 1457668, 1561188, 1568949, 1497075, 1659058, 1357315, 1421687, 1104066, 1536731, 1342269, 1337379, 1656518, 1144797, 1296886, 1262714, 1538428, 1155033, 1471892, 1339173, 2025838, 1124535, 1305438, 1379324, 1299418, 1095925, 1008944, 1332347, 1115019, 1474867, 1410356, 1140312, 1150094, 1139942, 1101701, 1296021, 1027588, 998652, 1303793, 1088923, 1039896, 995781, 1092447]
13880A092447K00560l45442N3239J08197j81879Q1404J16593j37003M90113l86628
13870A091601j12833j85493P8618K45434j57487q986N7712k06855L26636l9815
13860A088532j99007Q2231L22341k67642k56987N18665P4167j55116k14016M37301
13850A430469n85339j42768J67622J37519p1622K4434L21724n46632O42631l21692
13840A056346J14043E81478L14242Q105j5174r3176J7467n5897Q7948J4693o9795
13829G89891O094m8745j25026O78867o01943K96465j96040n4013j52317K57615
13819H50848k52148L24098D55925J85049J97374L33753n7297j0732q2898E03567
13808E96276J67770j8015r8791r0394J86382l0839J95496j99377O1358J8910C92880
$$ y = [1092447, 1293007, 947565, 1000804, 1109001, 927122, 1008526, 1125119, 988116, 1478229, 1091601, 978768, 793275, 871893, 1117327, 959840, 950854, 1008566, 801711, 1128347, 1088532, 889525, 971756, 1294097, 1026455, 769468, 1288133, 1362300, 1207184, 993168, 1430469, 845130, 702362, 869984, 1007503, 935881, 960315, 1282039, 735407, 1378038, 1056346, 1170389, 581478, 895720, 903825, 888651, 795475, 812942, 757045, 844993, 859686, 789891, 795985, 747240, 622214, 1301081, 699138, 995603, 799563, 745550, 593233, 850848, 598700, 922798, 455925, 640974, 838348, 1172101, 1114804, 1104072, 1021174, 503567, 596276, 764046, 746031, 647240, 556846, 743228, 712389, 907885, 708508, 769866, 788776, 392880]
13796H77753j88896K09658j1359l6679j86075l7720L51445j1793k65523k03251
13786D97560K43299k35684K02725k12331R4054L106J00085r8425J75776k45135
13776E25030K1397K26256k8177R186p416j62716J93653C61814K04614J38437j14700
13765E90165J37576j94455J08624O7857k27948K4688L7020q6691O1830J2475j2469
13754E18672j49283J58355M28767D15948K01259j91535M72049l30327O6946j8348
13744F15992j36799R8035k26361J71305J5563k17468K95740N5840N0411k90966
13734D31292L97075j98466l8820j39569Q9090r8216M25947k76805j32625J25832
13724E84735r11p8808n3027J19050j52900j40085p9491L07814j6069J05461O1517
$$ y = [877753, 688857, 898515, 887156, 850477, 664402, 626682, 978127, 966334, 700811, 497560, 740859, 505175, 707900, 495569, 589623, 592729, 692814, 594389, 770165, 525030, 546427, 772683, 744506, 753692, 746276, 583560, 777213, 361814, 566428, 704865, 590165, 727741, 533286, 641910, 709767, 481819, 506507, 543527, 456836, 518666, 531141, 518672, 369389, 527744, 956511, 415948, 617207, 425672, 897721, 567394, 634340, 615992, 479193, 577228, 350867, 522172, 537735, 320267, 616007, 671847, 722258, 431292, 828367, 629901, 591081, 451512, 540602, 442386, 868333, 591528, 458903, 584735, 583824, 505016, 451989, 571039, 418139, 278054, 198563, 506377, 490308, 595769, 657286]
13713F57286k15023M5086P5181L20522B93204L67298k29614K0888L20417B77425
13702I10525j78880k60721K52181o7529j61556B34648K52920K2871J10832p3991
13692E47280A80434N4693M7969M30549k58434J60105j73334j42372J78495J71589
13682F49694B71565K08424O6988l582Q0803j46690N1809n0007p8512L90300C54859
13670c750F53441k66520j83812K12488j67675M01837B00906J93704G6553L09566
13660C86119k5789P8111j43917N65L50800j50247j22513L7469e2774G53268N461
13649G58729l51201j86364L8056K81937B30899J21132l678O690A40112J48306
13639B88418e8372B68289m8873Q7405K98525A15418P6548C3042K29655P1367K99875
$$ y = [657286, 442263, 487349, 562530, 883052, 293204, 660502, 430888, 451776, 772193, 277425, 910525, 731645, 470924, 723105, 655576, 494020, 234648, 487568, 510439, 621271, 547280, 180434, 235127, 283096, 713645, 455211, 615316, 441982, 299610, 478105, 649694, 271565, 479989, 546977, 543395, 624198, 477508, 529317, 479310, 400798, 791098, 354859, -3750, 653441, 386921, 203109, 415597, 247922, 649759, 200906, 394610, 76553, 386119, 360330, 438441, 294524, 295089, 645889, 495642, 373129, 410598, -52774, 753268, 758729, 407528, 221164, 259220, 541157, 230899, 352031, 348353, 355043, 140112, 288418, -58372, 268289, 219416, 306821, 605346, 115418, 191966, 33042, 262697, 334064, 633939]
13628F33939j36231j22696Q7712l8207J46755B63717J55955l5450J36398r0168
13618D30452K51852k59682k04432L49610q0882l291n8359J96960j07416B48869
13607E3981Q7760R6062D2153M67284j23537j79076N412J57390L54008C58596n1589
13596C07007p7699O61767B31992A13172M9760H0803L03269o9444j56118K0367
13586A78877J63612J02576P8231j34166j25113p7971O509j3067J3814J13117j30847
13575A75572K07837J134A22823M00649j22569q1382J10624E8791M35854r8456
13565C96189K0985L4146k7953J38884r0574j03347A77542M70894n0847q1090A30516
13553D67242j78739F971L28760a46770g666A49379J17355L42165k65463A27408
$$ y = [633939, 497708, 375012, 462724, 424517, 571272, 263717, 419672, 384222, 520620, 430452, 682304, 422622, 218190, 567800, 486918, 483627, 425268, 622228, 514812, 248869, 53981, 141741, 237803, 42153, 509437, 385900, 206824, 212236, 369626, 723634, 358596, 307007, 229308, 891075, 231992, 113172, 162932, 80803, 384072, 314628, 158510, 178877, 342489, 445065, 523296, 389130, 264017, 186046, 192555, 179488, 193302, 306419, 175572, 383409, 384543, 122823, 523472, 400903, 319521, 430145, 58791, 494645, 396189, 417174, 451320, 423367, 562251, 471677, 368330, 177542, 648436, 597589, 516499, 130516, 467242, 288503, 6971, 335731, -146770, -7666, 149379, 266734, 608899, 343436, 127408]
13542a0759C04103g820B37226K30854j53706n847o1401n5647C6838R6591L66157
13531D99586j44706p4640G3733N50766H6704K63554A63092K66196j39929J40433
13521D29792j41403L6494m5215R5881e8797A54771L6449O3258p3900J94978p1593
13510C03963L35R4820n4000K27928a75354D64389A76482B8460J7495K09625J05404
13499C60984A13848N01010B10367E9072J29129L25833j07796E5180J44258O0837
13489B60275J4917a9720C41880q0588M0382J7395o9473J53532j0145c10582i2287
13477D71601H0336J35731E4784f1748I1724a61921C13887G0611J92915f1271C99268
13465C86369j07866O9351H7215M44900A23368J35909j03283K63172a7964D03538
$$ y = [-10759, 304103, -7820, 237226, 468080, 314374, 308527, 247126, 191479, 36838, 133429, 499586, 354880, 280240, 73733, 624499, 86704, 350258, 163092, 429288, 289359, 429792, 288389, 324883, 279668, 375549, -58797, 154771, 191220, 254478, 180578, 375556, 303963, 304298, 399118, 345118, 573046, -175354, 464389, 176482, 28460, 45955, 255580, 360984, 113848, 614858, 210367, 59072, 188201, 514034, 406238, 55180, 199438, 260275, 275192, -19720, 341880, 261292, 301674, 319069, 249596, 403128, 392983, -310582, -92287, 471601, 80336, 216067, 54784, -61748, 91724, -161921, 313887, 70611, 263526, -61271, 399268, 386369, 278503, 347854, 87215, 532115, 123368, 259277, 155994, 419166, -17964, 403538]
13454F2252q181J52906D2875J22512n8436K65156o2523n5975A23974D347K28744
13443B33091O8944j41617L9720e3892B5340K37990L5353j15396N1593J97173C9686
13431C18977P7074A24524b5791A40138J85762j3568J87048A98102H1125Q9636
13421A70761L362P2898E8457L90800b1094B16753c6580C65811j50061K05859a76108
13409D27701A97157a63000B56234M407A3725K08840O5008R7008A03952b25764
13398G3148f6778B27940G1830a11090A24784f5746D18881F1541N4599b868A44877
13386B77887f2897A67515K1469J25686A31693f4489A11863J54999p635L30994
13376E90221A47550D006P6796K27767A10840R2251D0472b7348B48824l7224L04762
$$ y = [62252, 54071, 206977, 42875, 165387, 106951, 372107, 309584, 253609, 123974, 4347, 233091, 302035, 160418, 200138, -53892, 25340, 263330, 298683, 183287, 234880, 432053, 39686, 318977, 396051, 124524, -25791, 140138, 325900, 312332, 499380, 198102, 81125, 170761, 174123, 247021, 58457, 449257, -21094, 216753, -36580, 365811, 215750, 421609, -176108, 427701, 197157, -163000, 256234, 260641, 13725, 222565, 287573, 384581, 103952, -225764, 73148, -66778, 227940, 71830, -111090, 124784, -65746, 418881, 61541, 116140, -2868, 144877, 277887, -62897, 167515, 188984, 314670, 131693, -64489, 111863, 266862, 259227, 590221, 147550, 4006, 80802, 308569, 110840, 203091, 40472, -27348, 248824, 211600, 516362]
13365E16362A44986J06303R5245J92334A2825d2494A22008O9581N9092M2455J75100
13354D68236j71605b5165A87305J62945l4246K15950C9948f3113C83314A03295
13343c1179C69835N0680R3321A26818k7156M52861j52252A71904K7129J2564a32035
13331f4698D14788I2866a17404M4082A9697J61644O0635r6327J37491l988J80713
13320D59865A66398J22204J4669J53987a86894B00952n1648J05675E4376a2446
13309A84355R7143a3024l5882B05638E4617L04907j9613C0659L04123j00598J02631
13298C36815A21448C8216p885g5679C37079a9835C96945a8575D56210j99166H7016
13286C24369j61735p0512J68500j28123J52316k9430L9114e3333B36577K23854
$$ y = [516362, 144986, 251289, 346534, 538868, 12825, -42494, 122008, 191589, 250681, 293136, 468236, 296631, -25165, 187305, 350250, 316004, 531954, 39948, -63113, 383314, 103295, -31179, 369835, 420515, 513836, 126818, 99662, 552523, 400271, 171904, 199033, 211597, -132035, -64698, 414788, 92866, -117404, -73322, 19697, 181341, 241976, 145649, 283140, 279152, 459865, 166398, 288602, 303271, 457258, -186894, 200952, 149304, 254979, 54376, -12446, 184355, 281498, -13024, -48906, 205638, 54617, 359524, 339911, 30659, 334782, 234184, 336815, 121448, 38216, 30331, -75679, 337079, -19835, 396945, -18575, 456210, 257044, 87016, 324369, 162634, 92122, 260622, 132499, 284815, 255385, 294499, -53333, 236577, 460431]
13276D60431b6375B29857n2544i8274k55861B21448L9101O3980h5256A88623K5570
13265B14193G5928J75711I8396L90q091c2976k4624B17262l1676K7282Q6258b84978
13252A21283b80870A67475E6722Q1354f880k3268A14451O6341K39570H3055M794
13241H7849M4685E1957J40118m5427b90A19921k1795a8777A83140K9252A00804
13229A50752d949B70521k4824r7173J56463j29927L20946G8510a66910j9288A41810
13217d0688B79189J7023R3007A13451j7569l4778M30563A59258a34506b6130A38597
13205B42454i1811D0129J30339f6280k727B30167A06636K84390A2250P1537K02695
13194B86482m3577O6679a06147c0932H4547R838f5365D23126j01186o0264b7261
$$ y = [460431, -26375, 229857, 177313, -98274, -354135, 221448, 260549, 324529, -85256, 188623, 214193, 75928, 251639, 98396, 98786, 90695, -32976, -57600, 217262, 185586, 212868, 299126, -284978, 121283, -280870, 167475, 56722, 138076, -6880, -30148, 114451, 180792, 420362, 83055, 87849, 132534, 51957, 192075, 146648, -290, 119921, 98126, -18777, 183140, 212392, 100804, 150752, -4949, 270521, 245697, 148524, 304987, 175060, 496006, 78510, -166910, -186198, 141810, -40688, 279189, 296212, 389219, 113451, 95882, 61104, 491667, 159258, -134506, -26130, 138597, 242454, -91811, 40129, 170468, -66280, -69007, 230167, 106636, 391026, 12250, 83787, 286482, 242905, 309584, -106147, -30932, 84547, 94385, -65365, 423126, 321940, 261676, -27261]
13182A91375g72G3438R9870G0355P0620i4881B96028a2771j27173f651l73528
13171c80179A54849h2185n4021A76063E8918a4578A72284E0917b1131A08209a10101
13159b7618A10149a26833B4465R8638a72618D04917H9396f1736C9148K82074a40115
13147A59322K10431p5816q7852g2329B4565J48601a78776F4809a72822B11332
13136a26001A46417b263B77496I4863R7098a72474A50755Q4549R7537h161j79850
13125a88011O5146n7220Q0416M6997D4487N7238J44373a24888L1804a6196D09160
13113C4163J67742q0210J37819a32464p014j6292a0580A97850a21304A61623L03202
13102D64825e7658D5856h8070A22552c7182j50332I2432c0681B61024C0694N23841
$$ y = [191375, -772, 73438, 173308, 70355, 140975, -94881, 296028, -12771, -139944, -6651, -380179, 154849, -82185, -136206, 176063, 58918, -14578, 172284, 50917, -21131, 108209, -110101, -27618, 110149, -126833, 24465, 123103, -172618, 404917, 89396, -61736, 39148, 321222, -140115, 159322, 369753, 293937, 206085, -72329, 24565, 173166, -178776, 64809, -172822, 211332, -126001, 146417, -2263, 277496, 94863, 191961, -172474, 150755, 235304, 332841, -8161, -188011, -122865, -180085, -99669, -52672, 44487, 101725, 246098, -124888, -93084, -16196, 409160, 34163, 201905, 121695, 259514, -132464, -139478, -155770, -10580, 197850, -121304, 161623, 464825, -57658, 45856, -88070, 122552, -37182, -187514, 92432, -30681, 261024, 30694, 554535]
13091E54535A57236N2900b28116h113B01544d114k405A50843n7473K5755J36120
13080B55245c7311m3267I3095A7396K08480b44010A6967i1480D9827K21840c29167
13068a79192A95780q3142R1396c3980D4810a45130B63167b45357B18021L14013
13058E32034g6346j15471A25598M8392a64781i186j14441B2872Q9920m9866a5192
13046a43828K0024c9925j2973D8878A7447J23518M1582h3818H6526B7126L2218
13035E9344c3051j02271B96253A3133L59513F9167O143J9837B6876L1268L2364
13024I0508L1306J37743D6850O2964j5926a28147A91160m0469m3177M5782F2624
13012B3887g8890B004J40203J12444F1627J78581A6173J75335D9804L2539K40676
$$ y = [554535, 157236, 210136, -228116, -8113, 201544, -4114, -6519, 150843, 93370, 119125, 255245, -37311, -80578, 93095, 17396, 225876, -244010, 16967, -91480, 49827, 271667, -329167, -179192, 195780, 112638, 204034, -33980, 44810, -145130, 263167, -245357, 218021, 532034, -76346, -191817, 125598, 173990, -164781, -9186, -123627, 22872, 112792, 62926, -15192, -143828, -123804, -39925, -52898, 48878, 17447, 140965, 182547, -83818, 86526, 27126, 59344, -33051, -135322, 296253, 13133, 372646, 69167, 75310, 95147, 26876, 58144, 90508, 121814, 259557, 46850, 109814, 93888, -128147, 191160, 150691, 107514, 153296, 62624, 23887, -78890, 2004, 142207, 254651, 61627, 240208, 16173, 191508, 49804, 82343, 323019]
13001C23019b471j94314A51024E593M26186A4653K03822A5928L11990p9815D2235
12989A28008J37969a57371b3522A45251G975a35030C47888H1641J7392a26701
12978A86051n8041e2136D0597N5629m3415L157J05631A7432K80857A40867g6966
12966a01409I6669b82112a21677N7180k0469B95221a10255J7364A53240P3615
12956B26855d4588A52775F9991J30813P3468a45309A45650i5147C206f0192A6348
12944B16026A5574M51398D3764d18770A67423K35722j61529p1480K5474K63107
12934D58717b4724j65800J6236B5311a22710C3522b10257A43406b12269B0652
12923b51883B79299Q098F4301f9467A48740J459a35639B30965m8630G7454a0219
$$ y = [323019, -2471, -196785, 151024, 5593, 431779, 14653, 218475, 15928, 327918, 248103, 42235, 128008, 265977, -157371, -23522, 145251, 7975, -135030, 347888, 81641, 99033, -126701, 186051, 128010, -52136, 40597, 96226, 52811, 55968, 161599, 17432, 298289, 140867, -76966, -101409, 96669, -282112, -121677, -64497, -84966, 295221, -110255, -92891, 153240, 226855, -44588, 152775, 69991, 200804, 274272, -145309, 145650, -95147, 3206, -60192, 16348, 216026, 15574, 466972, 43764, -418770, 167423, 403145, 241616, 170136, 195610, 458717, -24724, -190524, -174288, 25311, -122710, 33522, -210257, 143406, -212269, 20652, -251883, 279299, 287397, 64301, -69467, 148740, 150199, -135639, 230965, 182335, 77454, -10219]
12911F903J06110J41189F1318a10040A59947r41m1854f7438l63640B00858b10774
12899B84275i8998A50031a37510A81078l3960a12435B44138F8413C1419a90632
12888B17462d2763m1775D5139J1783a33577l0174A50492l4013n3084J30490G3028
12876A40703d7086j98064I7948a74404L5815K6139A45720L7074J40656j6468h2768
12864b45692A09082C5341J23693C3602K0881L1540J28958D3956a80675d5709C49890
12852b70973G5786a73396E7105q149a37705A90384A2425R5346a08946d1318H9727
12840A23295m3576d9561q974B80302A06837j6037b69018B7723K85990A859J38160
12829A40019i1997j9804B43707A13269a75778C45321H2647d8526G9355l6818d5572
$$ y = [6903, 113013, 254202, 61318, -110040, 159947, 159006, 117152, -67438, -431078, 200858, -210774, 284275, -98998, 150031, -137510, 181078, 147118, -112435, 244138, 68413, 31419, -190632, 217462, -42763, -84538, 45139, 56922, -133577, -163751, 150492, 116479, 63395, 193885, 73028, 140703, -47086, -245150, 97948, -174404, -138589, -112450, 145720, 182794, 323450, 306982, -82768, -245692, 109082, 35341, 159034, 33602, 54483, 86023, 214981, 43956, -180675, -45709, 349890, -270973, 75786, -173396, 57105, 48956, -137705, 190384, 12425, 107771, -108946, -41318, 89727, 123295, 79719, -49561, -58535, 280302, 106837, 90800, -269018, 27723, 313713, 1859, 140019, -91997, -111801, 243707, 113269, -175778, 345321, 82647, -48526, 79355, 42537, -45572]
12817B03868a88308Q9488A66775P4942I6791J66705b9219C7649L09410D0Q8766
12806H8806L7687c6146E1600f6074A4869e3370o1189A20461n7397K10435j35819
12795A37680A1549K3522b311l9692C10381i9879M223j71047B01262b01335d5673
12783B31777a25254A43172c4903C5594R6979h3833B12154m2623d5451B12241J45558
12772C57799b64521B55584B5760P3612b67407a07428j75822F8436J94102i5158
12761A25755B6008e0262B37156L2468i009A60379a07188N0289b2745E8261J22403
12750A80664a44979B80509K18497B01548A0893J25269g4627A37610b94488C57604
12739b74001j29278H9520L188j5784M2480k8690R6310o9725L19984i0608A64976
$$ y = [203868, -188308, -98820, 166775, 241717, 96791, 263496, -29219, 37649, 347059, 40, 88806, 126493, -36146, 51600, -66074, 14869, -53370, -114559, 120461, 63064, 273499, 137680, 11549, 35071, -2311, -42003, 310381, -99879, -95656, -266703, 201262, -201335, -45673, 231777, -125254, 143172, -34903, 35594, 132573, -83833, 212154, 169531, -45451, 212241, 357799, -264521, 255584, 25760, 99372, -267407, -107428, -283250, 68436, 262538, -95158, 125755, 26008, -50262, 237156, 269624, -9009, 160379, -107188, -56899, -22745, 58261, 180664, -144979, 280509, 499006, 201548, 10893, 136162, -74627, 137610, -294488, 357604, -274001, -403279, 89520, 92708, 76924, 119404, 90714, 187024, 117299, 437283, -90608, 164976]
12727b31719g8163B19658A02391B0042I923K25489N2315d9126j69632C5324K39650
12716B74974f2345L0477A23992j3831M4243K01848I6933K73589j61685E1635R668
12705F1303J65942D8658L73270A37832K12394a95900C61859i5325m2936j19857
12695b58118Q8233a4916C85041A08684L9919h3542j7425k2020A94510a596A18914
12683G6564j4112c06634C22938E0337L22486F0432c746B72039R7584K56484C1876
12671B30023b97368H2370B3223P4130O866J5250J66162a63370i160B7219L27169
12660C54388j53411a9484B71952b9874C06026b35582m4039C79880A24977c5078
12649B76541h9208A53715J03374d7931B7554J17086n6665f5843B93479a69197
$$ y = [-231719, -78163, 219658, 102391, 20042, 9923, 235412, 287727, -49126, -218758, 35324, 274974, -62345, -31868, 123992, 110161, 154404, 356252, 96933, 370522, 208837, 51635, 61303, 227245, 48658, 421928, 137832, 350226, -195900, 361859, -95325, -138261, -258118, -169885, -14916, 385041, 108684, 148603, -83542, -100967, -122987, 194510, -1596, 118914, 76564, 62452, -306634, 322938, 50337, 372823, 60432, -3746, 272039, 369623, 626107, 31876, 230023, -297368, 82370, 23223, 97353, 104219, 119469, 285631, -163370, -9160, 27219, 354388, 200977, -19484, 271952, -29874, 306026, -235582, -279621, 379880, 124977, -35078, 276541, -89208, 153715, 257089, -47931, 27554, 144640, 87975, -65843, 293479, -169197]
12638d9325j02865B3705J23852K01691A57091m8921L9987F9182J43957K22837
12628D35976j74690L3297b1322C67295q3629H0878J39918b07701B91042h7846
12617I5496j8470L1159a14106j0559A6586b1439H558M1247M3275j8337f6536J9501
12605d7035E8846c1141J4235q609j12794b1533j1885A20850m5032J2450B4279
12593A63528J4407G9530d5891m94A37631D3555E470K37675b383A81731b87078
12581D5575a85232A06396J3824a57432d8548A7077M7899o084c09723H6646b01918
12569B66662Q6093j27552G2914a54597D4591c0426o8606K7949a6161G6014e0607
12557d0637k8953B17003a14859C35070a25361C22367j53522b43619j84833a56543
$$ y = [-49325, -152190, 23705, 147557, 349248, 157091, 108170, 148157, 69182, 213139, 435976, 261286, 294583, -21322, 367295, 283666, 80878, 220796, -207701, 291042, -87846, 95496, 77026, 108185, -114106, -124665, 16586, -21439, 8558, 49805, 93080, 74743, -66536, -47035, 58846, -31141, -16906, -25515, -138309, -21533, -33418, 120850, 75818, 88268, 24279, 163528, 177935, 79530, -45891, -46385, 137631, 43555, 5470, 243145, -2383, 181731, -287078, 45575, -185232, 106396, 120220, -157432, -48548, 17077, 64976, 58892, -309723, 86646, -201918, 266662, 352755, 225203, 72914, -154597, 44591, -30426, -99032, -71083, -16161, 76014, -50607, -40637, -69590, 217003, -114859, 335070, -125361, 322367, 168845, -243619, -428452, -156543]
12546A19862g2555C3138J22797O5650a13258l484l9870C29707o5422b91366F0529
12534G6236d6030G0531c0848A88287L03710A67605b61797B6851a61112g9973H7707
12522d5252j26334C6213E003e5858m9102E22093D7750a2310m8828B58631K5934
12511B84565m9661O8906I3496f6361K6149D7668b12824j88879b0635r5309A97591
12499A18267l973a33811J1294A29566K12513a09065D9049L45667A91369n2841
12489A38528A2621a49973m6901i2670n5459g2862A08984a96662J65C19915a01245
12477B74369r6822R339g2289l22579D8202B3069K65407P0414a5462n0766F4886
12465B0677d09617a51117l1769c3801F6734c37278H2577A0092b2306B21804L7685
$$ y = [119862, -72555, 33138, 155935, 221585, -113258, -116742, -156612, 329707, 264285, -291366, 60529, 76236, -46030, 70531, -30848, 188287, 491997, 167605, -261797, 26851, -161112, -79973, 87707, -45252, -171586, 36213, 5003, -55858, -104960, 522093, 47750, -12310, -61138, 258631, 284565, 234904, 303810, 93496, -66361, -40212, 47668, -212824, -401703, -20635, -115944, 197591, 118267, 114294, -133811, -122517, 129566, 342079, -109065, 49049, 394716, 191369, 138528, 12621, -149973, -196874, -92670, -148129, -72862, 108984, -196662, -196497, 319915, -101245, 274369, 177547, 186886, -72289, -394868, 48202, 23069, 288476, 358890, -15462, -66228, 64886, 20677, -409617, -151117, -182886, -33801, 66734, -337278, 82577, 10092, -22306, 221804, 259489]
12454B59489G8366i8983H3286n655i3696k48438D5729d5982j71538o548A63944
12442d4062B96666r5587n3573a80081Q471k82067g3377B54040E3106K6199j7898
12431F1407c36722A55481b59910i1362j00466c8316r5388L7504C27857A03557
12420F0319J04558a12356A34803c923A45745J00658a56691b574G8753c7923B1966
12408B11010f112j23928G1981b42007J01479o2241H1443J0453h2379A47365F836
12396C4704a95799A58987b0209B6079J49149O7635E263a7208k33123C22702A25824
12384f5200B32810d8457j69518P3228c1779j84l7818A1683i0931H7119a93108
12372A05893a80527A54284f0105j39376L8408A46097d9855j83608D432a10577
$$ y = [259489, 78366, -98983, 83286, 77631, -93696, -342134, 45729, -45982, -217520, -224068, 163944, -44062, 296666, 201079, 147506, -180081, -171610, -453677, -73377, 254040, 53106, 79305, 61407, -336722, 155481, -259910, -91362, -191828, -38316, -133704, -96200, 327857, 103557, 60319, 164877, -112356, 134803, -3923, 145745, 246403, -156691, -2574, 78753, -37923, 21966, 211010, -6112, -130040, 71981, -242007, -140528, -202769, 81443, 91896, -82379, 147365, 6836, 34704, -195799, 158987, -20209, 26079, 175228, 242863, 5263, -17208, -250331, 322702, 125824, -65200, 232810, -48457, -217975, -144747, -31779, -31963, -69781, 11683, -90931, 87119, -193108, 105893, -180527, 154284, -60105, -199481, -161073, 146097, -49855, -233463, 4432, -110577]
12361B75036e4722E891J12342b20162A71896a84305A27489f0984C12122m223g7541
12349i084G1444j4552b10701h2656C64766a28021j2253e9529B27578a20177A31219
12337g1681A5085B249i0389A06077b1976j12977K4297p3352j61000G3089a24689
12325d3808B33344d86670A49691i3499C70779A47817F5977K52595A33456a14539
12314A92479J11468g9422j47871I8662a52520J6268B37330g6247j41015D5067
12303C31988C4208K9856c2568A35934k1536P5662C0702l109M4750b84344A34274
12291A23950A6714a81910L3401P326A81230B0184b59822C42786A01046K02810
12281C03856g675A86065a8778C70827j61913a46479B44546J2031K38459e433C5491
$$ y = [275036, -54722, 5891, 118233, -220162, 171896, -184305, 127489, -60984, 312122, 307899, -77541, -9084, 71444, 56892, -210701, -82656, 364766, -128021, -140274, -59529, 227578, -120177, 131219, -71681, 15085, 2249, -90389, 106077, -21976, -134953, -110656, -184008, -345008, 73089, -124689, -43808, 233344, -486670, 149691, -93499, 370779, 147817, 65977, 318572, 133456, -114539, 192479, 303947, -79422, -227293, 98662, -152520, -136252, 237330, -76247, -217262, 45067, 331988, 34208, 64064, -32568, 135934, 114398, 190060, 30702, 27593, 72343, -284344, 134274, 123950, 16714, -181910, -148509, -141183, 181230, 20184, -259822, 342786, 101046, 303856, -7675, 186065, -18778, 370827, 208914, -146479, 244546, 256577, 495036, -5433, 35491]
12269B70618a0387k15631D42797H0755K06106F4359P891j7586b4976B31088i9723
12257a48352A23574n881a20046G0924L28225j04596I4076a97025F8450a4326n6677
12246g1003p1220A69711J06700A0106g2588I8431R0362q8544a03857l0283A54871
12234i2098A04798e5717B93030j04256G9152P784D0400a34491D58534a17859B92676
12222C48404j56855J260L19377A38751b06228B8663Q9917k4380p163Q7088b06067
12210i3116H1908R9792c5440A10878C3934A0879b5279A10825K83378j97018p2874
12199A24311F0667a13264C33083A14233d153o9111F2385O4767J409b226B33452
12187a7594C79997p2808A18304B1431e6445B92008j7259j07392p6304K2734J95691
$$ y = [270618, -10387, -226018, 442797, 80755, 286861, 64359, 72250, 54664, -24976, 231088, -99723, -148352, 123574, 117693, -120046, 70924, 399149, 294553, 94076, -197025, 68450, -14326, -71003, -142223, 169711, 276411, 10106, -72588, 98431, 188793, 100249, -103857, -134140, 154871, -92098, 104798, -55717, 293030, 188774, 79152, 86936, 40400, -134491, 458534, -117859, 292676, 348404, 191549, 192809, 512186, 138751, -206228, 28663, 118580, 94200, 87037, 174125, -206067, -93116, 81908, 181700, -35440, 110878, 33934, 10879, -25279, 110825, 394203, 197185, 124311, 60667, -113264, 333083, 114233, -4153, -73264, 62385, 127152, 128561, -2226, 233452, -17594, 379997, 307189, 118304, 21431, -56445, 292008, 274749, 167357, 91053, 113787, 309478]
12176C09478N2087r0527b34934g3827j35528i6338B95395Q0353j31705J09822
12166C53865A15348R5259C8513L38098H6988K489L12522c3667j8344H4871K57772
12155C42643d25439A54621J5123N0876m3841O218a71918a9292D16623r6540b4039
12143C32385C9805J8212K44801i129j13107M3003n4455C30780b91455A05150f505
12131a1144B49863J53116e34074a40669A92628f2806E092L92047a50676k82450
12121d33126a43252n5412D0150J36265m2013i2239k02908i1271A85050B6904M0190
12110F7094J02539F1406f5884l5081j31960f2617k7525a0651q8117m6677C0318
12098E4184b20491h7599F8620k0940J70128f5632A58738c42800L3165i5900j5041
$$ y = [309478, 361565, 271038, -234934, -73827, -209355, -96338, 295395, 375748, 244043, 353865, 115348, 210607, 38513, 376611, 86988, 89477, 401999, -33667, -52011, 84871, 342643, -425439, 154621, 169744, 220620, 176779, 182997, -171918, -19292, 416623, 320083, -24039, 332385, 39805, 58017, 302818, -9129, -122236, -79233, -133688, 330780, -291455, 105150, -6505, -11144, 249863, 402979, -534074, -140669, 192628, -62806, 5092, 397139, -150676, -433126, -143252, -198664, 40150, 176415, 134402, -92239, -295147, -91271, 185050, 26904, 67094, 169633, 61406, -65884, -100965, -232925, -62617, -90142, -10651, -98768, -145445, 30318, 54184, -220491, -87599, 68620, 47680, 217808, -65632, 158738, -342800, -309635, -95900, -110941]
12087a10941B08575d5200G6874k4261K38662j19306f8072e386k38998Q4678C9103
12075I04927L59057L40945p70887B65400I7099l8185g9891B16997G1504J09700
12065A81204B0569O0073a96423f9078B24386j06715J65680j3410j17859b13127
12054a72669o9457o9178O9324d2035j48312k0157B025b10407A5482g9350j6457
12043i5807j36798P0384K1221A45465J8676a15015j48394a8007C4757K39710a31505
12031c5715B71660c58915J41181A83193i9920B49903f8324J648B22886a68256
12020g0704J0569I1939a81945j8680A71797J29988l3968B5687b99954B40139a54864
12008a45032c6239A63574J05188d0897A89637b56543R2801D9571P1124b76283
$$ y = [-110941, 208575, -45200, 76874, 52613, 291275, 171969, -68072, -5386, -244384, -159706, 39103, 904927, 1263984, 1604929, 834042, 265400, 97099, 58914, -79891, 216997, 71504, 181204, 20569, 80642, -196423, -69078, 224386, 117671, 283351, 269941, 152082, -213127, -172669, -242126, -311304, -241980, -42035, -190347, -210504, 2025, -210407, 15482, -79350, -95807, -232605, -162221, -141000, 145465, 164141, -115015, -263409, -18007, 34757, 274467, -131505, -35715, 271660, -358915, -217734, 183193, -99920, 249903, -68324, -66676, 222886, -168256, -70704, -60135, 91939, -181945, -200625, 171797, 301785, 267817, 25687, -299954, 240139, -154864, -145032, -36239, 163574, 268762, -40897, 189637, -256543, -163742, 49571, 120695, -276283]
11997G018J56797g3585A98057b79383R9844C7380Q2809c2164B9440J49748g660
11985c67029J82417g4655A82232a1895I3093b33154C38912B3730a34131A32670
11974c5580j22165M051C9252A943N1550f9584B7228b15281C2453a31985B96864
11962a51742a6612k07683B6419O5989K05002g3714A90249a86400N6315J8072q1279
11951a93292A77506m7849i4206C47663b07405A33244d9911D05451a02351B4859
11940A20168E845P8821d1595D0367N1680C6121L1963j5257J5893A7659K19009
11929B36668a80669D8747f6256D2753a21181a4468A8585O4091C7353a96422h7503
11917H6738c30822j2081C22355j47230b27795C6480a61209a1984q960m5455E5202
$$ y = [7018, 163815, -73585, 198057, -279383, -179539, 37380, 120189, -32164, 29440, 179188, -7660, -367029, -184612, -74655, 182232, -11895, 93093, -233154, 338912, 23730, -134131, 132670, -35580, -157745, -153694, 39252, 1943, 53493, -69584, 27228, -215281, 32453, -131985, 296864, -151742, -16612, -224295, 26419, 92408, 297410, -73714, 190249, -186400, -130085, -112013, -193292, 177506, 129657, -94206, 347663, -207405, 133244, -49911, 405451, -102351, 24859, 120168, 5845, 84666, -41595, 40367, 92047, 36121, 68084, 52827, 68720, 17659, 236668, -180669, 48747, -66256, 42753, -121181, -14468, 18585, 82676, 37353, -196422, -87503, 86738, -330822, -342903, 322355, 175125, -227795, 36480, -161209, -11984, -20944, -66399, 55202]
11905B4974b8490A39264K5824Q3386j7722e9262p4913A33068c03526b6457N156
11894b1301D23432l6623h4003D27890a22374j78244A41258o153b24452R3509H0174
11882c69493C922b86724J38312B7868L2101i9822k18318B41158d96835a58706
11871A86179i5230A07981a13914A05479k9856a18634k2612C5565a14393c1021
11860g6484k26678K6328e851D40852A01825K11543E0227i2358c126o7833l08681
11849c79640C950a25152A30575O0665p030b44775c58A47065d43103J85890C27196
11837G2383c6668k49218i4277J1997L5709A63683E7645b2170J0734B40284G2257
11825d7841q3881B61833g1238k86803h7160m6676q1884j04409A5467e7944j26942
$$ y = [24974, -28490, 139264, 165088, 248474, 230752, -59262, -134175, 133068, -303526, -26457, -21301, 423432, 386809, -84003, 427890, -122374, -300618, 141258, 135105, -224452, -130943, 80174, -369493, 3922, -286724, -148412, 27868, 59969, -99822, -318140, 241158, -496835, -158706, 186179, -95230, 107981, -113914, 105479, 75623, -118634, -141246, 35565, -114393, -31021, -76484, -303162, -276834, -5851, 440852, 101825, 313368, 50227, -92358, -3126, -70959, -379640, 3950, -125152, 130575, 191240, 184210, -244775, -358, 147065, -443103, -257213, 327196, 72383, -36668, -285886, -94277, -82280, -46571, 163683, 57645, -22170, -11436, 240284, 72257, -47841, -131722, 261833, -71238, -358041, -87160, -133836, -215720, -320129, 15467, -57944, -184886]
11814a84886a9683j02159F9930d3867j07129C20278Q5423a76821r7436a04943
11803a63311D9141a69961H4877R7765a41426d5236r6195B06097M432I5304O1972
11792A57276k7935a29084j91977I7065c9026B0052a40179B30692a75742A19054
11781a12161j13424B17507c15443J45975J4j00202i3705J7998j04809C01479a4430
11769c0357n3524q3163m0405h918D3435L2950R0483m3347a66429A36036O4855
11758B00891f8797F0690a1989k60565P4868c0717r9782j25781L5117N5783C86573
11746A04334i6906A68107d38329a51176E9255L4643c26364d5613j64915B4633
11735B37852k9791m6876a29834A77759h5022D15710d6108j75504G5142b26893
$$ y = [-184886, -19683, -121842, 69930, -43867, -150996, 320278, 405701, -176821, -274257, -104943, -163311, 49141, -169961, 84877, 182642, -141426, -45236, -141431, 206097, 210529, 95304, 157276, 129341, -129084, -321061, 97065, -39026, 20052, -140179, 230692, -175742, 119054, -112161, -225585, 217507, -315443, -169468, -169454, -269656, -93705, -75707, -180516, 301479, -14430, -30357, -83881, -167044, -207449, -8918, 43435, 76385, 166868, 123521, -166429, 136036, 200891, -68797, 60690, -11989, -272554, -197686, -30717, -130499, -256280, -221163, -165380, 386573, 104334, -96906, 168107, -438329, -151176, 59255, 93898, -326364, -45613, -210528, 24633, 237852, 208061, 161185, -129834, 177759, -85022, 415710, -46108, -221612, 75142, -226893]
11724e8255r3080F4441b35726h1142A34036C0589d2616A33770Q8650k4476e6216
11712H5984M7748a29538A74364a97902c8175A84758B6142J97766b90285A85230
11701I5891a09782E9984O696Q4063a0022A80600E6600a29711n6785A41791a24060
11689b8573A23259J01960D9384a95581i1764C03797c56537J29957B12356C7686
11678A64859J5343n8658k8359K48683j69668e1113k03341B56875C9569g1633B09372
11666A26920c78103C0537K5428K67806A25218E4027J6854b09266p7274A1579O9926
11655H1505a00556p34k0586H8260O4144k1415Q4956A8947b48171C11811A29567
11643B20224c32380B09038a05501D3488e7720j05492m7673q6568A03169j620J67281
$$ y = [-58255, -151335, 64441, -235726, -81142, 134036, 30589, -42616, 133770, 222420, 197944, -56216, 85984, 133732, -129538, 174364, -197902, -38175, 184758, 26142, 223908, -290285, 185230, 95891, -109782, 59984, 66680, 150743, -10022, 180600, 56600, -129711, -186496, 141791, -124060, -28573, 123259, 225219, 49384, -195581, -91764, 303797, -356537, -226580, 212356, 37686, 164859, 180202, 121544, 93185, 341868, 172200, -51113, -254454, 256875, 39569, -71633, 209372, 126920, -378103, 30537, 55965, 323771, 125218, 54027, 70881, -209266, -286540, 11579, 81505, -100556, -101290, -121876, 88260, 152404, 130989, 215945, 18947, -248171, 311811, 129567, 220224, -332380, 209038, -105501, 43488, -57720, -163212, -210885, -297453, 103169, 101549, 268830]
11632B68830c93801A593a73304C46572A40769J76339A34123p116a6379n5463k11082
11621b82924C25563H9420b82623B04073a52416G0603c08012M6847b0058A72959
11610i1551A0896b39990o9186A13332J71549j6921B4119O4274l9623K35976b80655
11598c8666A12200m2479G530R126J4887a82015B13233f3101k39208B08215n0714
11587A57501c48882A68427a53284A8520L90604c6189B72050j12835a71293C8290
11576a35243B24289a74182A08193L479b51051D20002A8236d6627B20565q5686
11566A34879A4812a99455A68028F077a34847c4309C55394c6878j97834h3817a3207
11554a34535E6436j4323J47223a31549b539r0965c8262B59821o2931b77033D7232
$$ y = [268830, -393801, 1593, -173304, 346572, 140769, 317108, 134123, 127007, -16379, -71842, -282924, 325563, 89420, -282623, 204073, -152416, 70603, -308012, -261165, -20058, 172959, -91551, 10896, -239990, -309176, 113332, 284881, 267960, 24119, 88393, 48770, 284746, -280655, -38666, 112200, 69721, 7530, 16656, 31543, -182015, 213233, -63101, -302309, 208215, 157501, -348882, 168427, -153284, 18520, 409124, -36189, 272050, 159215, -171293, 38290, -135243, 224289, -174182, 108193, 111672, -251051, 420002, 18236, -46627, 220565, 134879, 14812, -199455, 168028, 6077, -134847, -34309, 355394, -36878, -234712, -83817, -13207, -134535, 56436, 42113, 189336, -131549, -2539, -93504, -38262, 259821, 196890, -277033, 47232]
11542H1197i8097A66671c51094D0474H94K31987K356g606n8010B1402K13087j07565
11530A26924o888J0831c30545C76423j49085q3450R1451c5858C32796H8577l1429
11519E7148a01770H8526m3475m634i761A17620K72036A82407C7382J67963M3047
11508B48392r6673N020P2556J67290j05224C4930R0890a04918I5379b51772B25428
11496C50900E5254R718b7515j88106D27341B1761P2759J68507A04706f144q1186
11485h7330F6177K28854r4409m8893B5165P5216g5320P68G4340L2883P2858b87011
11472B21469A06885J79827j8796m0185C4931K58566P0044A64556k0275a50534
11461A41259J51213A24333M1428n9890K0919J36684b40687A8087b1690k05463
$$ y = [81197, -98097, 166671, -351094, 40474, 894, 232881, 235237, -7606, -65616, 21402, 234489, 126924, 120036, 130867, -330545, 376423, 227338, 143888, 235339, -35858, 332796, 88577, 57148, -101770, 88526, 45051, 40417, -9761, 117620, 389656, 182407, 37382, 205345, 248392, 151719, 156739, 229295, 396585, 291361, 34930, 125820, -104918, 95379, -251772, 225428, 350900, 55254, 64972, -27515, -215621, 427341, 21761, 94520, 263027, 104706, -6144, -87330, 66177, 295031, 200622, 151729, 25165, 100381, -75320, -74552, 74340, 107223, 180081, -287011, 221469, 106885, 286712, 267916, 227731, 34931, 293497, 363541, 164556, 144281, -150534, 141259, 292472, 124333, 165761, 105871, 126790, 263474, -240687, 18087, -21690, -227153]
11451b27153A0574M06305B5237J24951R7912D9273A7036L4302J19571K4337b796
11439B58805o5592H6325O3786l1445a32814A69940B8512M1246b56782A48342b19700
11427a31863E5193a96972j39266e153j55972B30076A14995b84747m4430I2961
11416A07849c65620a74325p8313A15214d2155A45361h9035F6617M1333e0170a5976
11404A37481b7737D86606b28599D30573C8682J00867d963A83722J07046c39072
11393B52404a65198a2732A19203a09054k04830b3435A78070O1861E2074k2496
11383B9578c1914A96558r6298K8201a35359j1944A4467a67903C23222a01838L5308
11372f6530k756a7500A26266b20174R8650r2612a5818C3502e6992B05540q7048
$$ y = [-227153, 10574, 416879, 25237, 150188, 248100, 49273, 17036, 51338, 170909, 195246, -2796, 258805, 193213, 86325, 150111, 118666, -132814, 169940, 28512, 69758, -256782, 148342, -219700, -131863, 55193, -196972, -336238, -5153, -161125, 230076, 114995, -284747, -329177, 92961, 107849, -365620, -174325, -252638, 115214, -42155, 145361, -89035, 66617, 107950, -50170, -15976, 137481, -27737, 486606, -228599, 430573, 38682, 139549, -4963, 183722, 290768, -339072, 252404, -165198, -12732, 119203, -109054, -313884, -23435, 178070, 239931, 52074, 29578, -31914, 196558, 100260, 128461, -135359, -147303, 14467, -167903, 323222, -101838, -66530, -69286, -17500, 126266, -220174, -121524, -214136, -15818, 33502, -56992, 205540, 118492]
11361A18492J92300A17742b33161J04130e9566F0693a85668l6785p3900D3753
11350a4168A59606e7312A55993a7939c528A35116e9021A29451a12278J7770j66524
11339b61032B03488D814h1894I3956d1761D9364c9311r7633e4873D32715A65139
11327A23325O289c0106B09355E6069f3181k21337A3760J08934P673a5480E03026
11315D8459K96644c01105J01276A06839a34094E0899i5642B17343c85630a11304
11304E7421f6725A82340c00630J43565F3892a52004j13080I2689c76949g8880
11293B39257b91315B26959b3168C1180J399K07078c4396J5588E3810J67781b07814
11281a05819n8036q9223G4870J7394b1529B47068H712J63890a79175j98932a76006
$$ y = [118492, 310792, 117742, -233161, -129031, -59566, 60693, -185668, -222453, -296353, 43753, -14168, 159606, -57312, 155993, -17939, -3528, 135116, -59021, 129451, -112278, -94508, -261032, 203488, 4814, -81894, 93956, -41761, 49364, -39311, -136944, -54873, 432715, 165139, 123325, 129614, -30106, 209355, 56069, -63181, -284518, 13760, 122694, 130367, -15480, 503026, 48459, 345103, -301105, -199829, 106839, -134094, 50899, -95642, 217343, -385630, -111304, 57421, -66725, 182340, -300630, -157065, 63892, -152004, -265084, 92689, -376949, -78880, 239257, -291315, 226959, -23168, 31180, 32579, 239657, -34396, -18808, 53810, 221591, -207814, -105819, -163855, -253078, 74870, 92264, -21529, 247068, 8712, 172602, -179175, -378107, -176006]
11269B17250D3332d6069G7410P5509E0127a56663m3044I049a71536F3595d4119
11257A58732b06467f0458j62405o1302A32588c19751A63983J43192a24092C24305
11246a2411j67161l12171I0870Q8560n3572a44670P0402J2845k36923N6546A80592
11234a62133A93960a02427K1775C13579h2980D898d7824p586a6814C2489b9189
11222a23137B97522d04773B2322b47250L4267d0667I7739A0700h4177A27489a13843
11210A32744d4174k2850j09026L1096l2967f5741j14492a5164l6358B37457b33270
11198G4413i6341J8957n6579k07825A03671b37967h2331l2030p8929j90957A66605
11186b42485P2060G2590N7004A0048b14277R0139m0286A71053k74b7844l43044
$$ y = [217250, 43332, -46069, 77410, 152919, 50127, -156663, -199707, 9049, -171536, 63595, -44119, 158732, -206467, -60458, -222863, -284165, 132588, -319751, 163983, 307175, -124092, 324305, -12411, -179572, -491743, 90870, 179430, 125858, -144670, -74268, -61423, -298346, -241800, 180592, -162133, 193960, -102427, -80652, 313579, -82980, 4898, -47824, -55410, -16814, 32489, -29189, -123137, 297522, -404773, 22322, -247250, -212983, -40667, 97739, 10700, -84177, 127489, -113843, 132744, -44174, -67024, -176050, -144954, -177921, -65741, -180233, -15164, -51522, 237457, -233270, 74413, -96341, -77384, -133963, -341788, 103671, -237967, -82331, -114361, -193290, -384247, 166605, -242485, -170425, 72590, 129594, 10048, -214277, -124138, -164424, 171053, 170779, -27844, -370888]
11175c70888A68183e0316A4035b50119D2696a38637p6609i7725B49758b49586
11164B41539k3962A06014R9539e0301k14685A80268D5465g438B89138e3130F5467
11152E138a41837A70969l712b31326F7426b26422D75564a00099B20703b25826
11141A61218p2748b72904f9131A02106J09808b4269l22264c7460F2479N221d4187
11129B4210b7424I730f5352k8280C15035H9470a54516F9450d14465A69859J49211
11118C19070h707A16547g6069G8038a97840G9430l3582L14798b01504C2446J99186
11107B31632N8955F3943b29319A86505g5513A154c7596j17632B19300q6205g3567
11095B45377A0574L09919o7481n2746J42404c18352F2433O6291n5443R5450K4894
$$ y = [-370888, 168183, -50316, 14035, -250119, 42696, -138637, -215246, -97725, 249758, -249586, 241539, 217577, 106014, 205553, -50301, -264986, 180268, 45465, -7438, 289138, -53130, 65467, 5138, -141837, 170969, 167257, -231326, 67426, -226422, 475564, -100099, 220703, -225826, 161218, 88470, -272904, -69131, 102106, 211914, -24269, -346533, -37460, 62479, 67700, -44187, 24210, -27424, 9730, -65352, -93632, 315035, 89470, -154516, 69450, -414465, 169859, 319070, -8707, 116547, -76069, 78038, -197840, 79430, 45848, 360646, -201504, 32446, 231632, 290587, 63943, -229319, 186505, -75513, 1154, -37596, -155228, 219300, 133095, -73567, 245377, 10574, 320493, 253012, 200266, 342670, -318352, 62433, 128724, 73281, 168731, 193625]
11084A93625m7327Q6899J1772f1330B92289O4722q8488r0283D7786K98094L2147
11073C78027H5665K90893K26496k34826k8492E8073L18378l3836P6744E4544K63982
11062C18526K26797B46319L41432B68598O30165B06229K41402j0627L72169B35879
11051C50130K38468J44670j40600n190m4805M8285k85507N58900D20719K53726
11041F74445J37936A94817O38034k79218K90798k86785J78545j88642L7475j05323
11031D79701N04208m33162K44140k03032J29983l13192N47347j24459l5074k81247
11021E15213j08583R7779B49628L10999n1923L35066j69596B47180K29276L6821
11011E13277j25022O8725j76924K63526k02054L63654k98253J97230L76776C74607
$$ y = [193625, 146298, 233197, 244969, -61330, 292289, 357011, 268523, 178240, 47786, 345880, 378027, 85665, 376558, 603054, 368228, 339736, 58073, 376451, 342615, 419359, 54544, 318526, 545323, 246319, 587751, 268598, 898763, 206229, 447631, 437004, 809173, 235879, 350130, 588598, 733268, 592668, 587478, 542673, 590958, 305451, 864351, 420719, 674445, 812381, 194817, 832851, 553633, 844431, 557646, 736191, 547549, 585024, 479701, 983909, 550747, 794887, 591855, 721838, 408646, 955993, 831534, 796460, 515213, 406630, 504409, 249628, 560627, 508704, 843770, 674174, 247180, 476456, 513277, 388255, 456980, 280056, 543582, 341528, 705182, 406929, 604159, 980935, 374607]
11000G73407l20573K51480k78564J40666K31591C91805P6782K6347J12323j30565
10990D76692K95877K2747j69661k22037N38961k16007K75556m49708N26029L0932
10980A109381K534L16076j12912K63935K29045J09967M12048j85437M91593m28404
10970B207826j85768R7056n66715L19247j14492l39048j52508J25462q005j19106
10960A263949n8816m423K55674j23920O513q4086m3306j21096k91088j15584j51199
10949E32618j1154D8424M90855j21616B04583M08745k36897A31235l1818a30514
10938E5106M1178a58108M0406C42887G5609A9834O3273d3918J2399I7806J13385
10927B11191E5072K12386n4707a88478P8242B22596M0685b43678B90458A06392
$$ y = [773407, 452834, 704314, 425750, 566416, 798007, 391805, 468587, 494934, 607257, 476692, 772569, 795316, 625655, 403618, 942579, 726572, 1002128, 552420, 1078449, 1109381, 1111915, 1427991, 1315079, 1579014, 1808059, 1918026, 2330074, 2144637, 2636230, 2207826, 2022058, 2119114, 1552399, 1871646, 1757154, 1418106, 1265598, 1391060, 1383055, 1263949, 1205133, 1200710, 1456384, 1332464, 1338977, 1254891, 1211585, 1090489, 799401, 683817, 532618, 521464, 48424, 539279, 417663, 204583, 613328, 376431, 131235, 99417, -130514, 55106, 96284, -158108, -117702, 342887, 75609, 19834, 83107, -43918, -31519, 97806, 211191, 55072, 267458, 212751, -188478, -110236, 222596, 263281, -243678, 290458, 106392]
10916A99943F8288B344b34238C0402a32551B61577a39100A72326L5602n0114a48858
10904a67455A00333a32591B09002d0854r0803l2452P2187A40869Q8970e1379j87725
10893b39104b7593l3711a7274A0377J04269J21854C71g9386k2127l7827p6413
10882b15753m9929e6893o1279A08707a96595A29657k5370g8405A0358a4595I0532
10870A94592f3971H0005a2951p4186l2225A11045a05084e1189K4465j32573A198
10858a50844A08878k7211d7774p4953B75614a02518B4649b69731G7628J2555P404
10847I7587j0727C6192a56420D78256B37398a0142m298E7779B5368L0082d5276
10835a50152B68554K65477c2169m7454G7658J99860a36173M506I5852h5785j37971
$$ y = [199943, 68288, 2344, -234238, 30402, -132551, 261577, -139100, 172326, 207928, 157814, -148858, -167455, 100333, -132591, 209002, -40854, -131657, -164109, -91922, 140869, 229839, -51379, -239104, -27593, -61304, -17274, 10377, 114646, 236500, 371, -79386, -101513, -139340, -215753, -265682, -56893, -118172, 108707, -196595, 129657, 104287, -78405, 10358, -14595, 90532, 194592, -63971, 80005, -12951, -87137, -119362, 111045, -105084, -51189, -26724, -159297, 1198, -150844, 108878, 81667, -47774, -122727, 275614, -102518, 24649, -269731, 77628, 90183, 97587, 86860, 36192, -156420, 478256, 237398, -10142, -14440, 57779, 25368, 55450, -45276, -150152, 268554, 534031, -32169, -79623, 77658, 277518, -136173, -131667, 95852, -85785, -223756]
10824b23756M7883Q6576k5870l7729h959D40863a3009o9257A01118C0499a18386
10812b06385k46027E5414K2355J18919N3928a51969E9826b74340H7753b66490
10801H658a40590A04248Q7678b4440n467A01370a84062L6627n9300I8925l3476
10790F5449J22243a7612H9732N146a58586A44285M3836j2887a67336A28544N0263
10779A78807e9127A39405b47693g0153b7951l37830G7872b17138N7080C6507J35483
10768A71990a39993b4380m12007B21845b55476A24293J44737b55715A57704a21164
10757b66847G7507J35740I9823b21533R7036j76046G7089N9236d1095B13970c66611
10745a86308j44729f1263B0679c6975l187a7057j67679E3460b85136a31123j63103
$$ y = [-223756, -175873, -89297, -115167, -152896, -8959, 440863, -13009, -82266, 101118, 30499, -118386, -206385, -452412, 55414, 77769, 196688, 250616, -151969, 59826, -274340, 87753, -266490, 8658, -140590, 104248, 191926, -24440, -29907, 101370, -184062, -147435, -206735, 98925, 65449, 187692, -17612, 89732, 94878, -158586, 144285, 188121, 175234, -167336, 128544, 178807, -59127, 139405, -247693, -70153, -27951, -365781, 77872, -217138, -160058, 36507, 171990, -139993, -24380, -436387, 221845, -255476, 124293, 269030, -255715, 157704, -121164, -266847, 77507, 213247, 99823, -221533, -124497, -300543, 77089, 136325, -41095, 213970, -366611, -186308, -331037, -61263, 20679, -36975, -40162, -17057, -184736, 53460, -285136, -131123, -294226]
10734b94226L5654B06334K2614b98660L1554a06702i86j43731g2216A33521b19610
10722A81514d37662J19777B37576c3289l3065C40807c9766D9872b47237A94137
10711h9929a053E0615b51236j3654G2949A7579c1727I7786h6168j40596i1957
10699a01131E5558M4998b8325k44387l3030A895d00329F2626c57147J42260L8909
10688a75978c6707a4729l23114D0366H28a57908f3559k25B31291b37329B45964
10676B24481G3374c92666A54684C6595J90655a77640A81466b39803J06905O6316
10666f6582l811h962k2963k56997g1568A34473i3335k60551J34008L9419A12672
10654B49082a17400j92198C6214c24495a196j58740H9077j4529J23428c61608
$$ y = [-294226, -258572, 206334, 228948, -298660, -267106, -106702, -986, -144717, -72216, 133521, -219610, 181514, -437662, -317885, 237576, -33289, -66354, 340807, -39766, 49872, -247237, 194137, -89929, -1053, 50615, -251236, -264890, 72949, 17579, -31727, 97786, -86168, -226764, -91957, -101131, 55558, 100556, -28325, -272712, -305742, 1895, -400329, 62626, -357147, -214887, -175978, -36707, -14729, -337843, 40366, 828, -157908, -63559, -63784, 231291, -237329, 245964, 224481, 73374, -392666, 154684, 36595, 227250, -177640, 181466, -239803, -132898, -66582, -70393, -8962, -31925, -288922, -71568, 134473, -93335, -353886, -219878, -180459, 112672, 249082, -117400, -309598, 36214, -324495, -1196, -159936, 89077, 74548, 197976, -361608]
10643H3671D482M0572b35242P6429O3203I6086L8338a9309l16936I011J35231
10632A44242D1243J21322b09481j06957h022A28418b36330i9848G5240a57939
10621e1410q9771J8260j21454o1241B99078a65884P9069B36377D3238J06772a05960
10609b41743i062q0748m6046j45325J19823B06439a70175n3892E0056J12542b86016
10597g1632H4080f0596K9049A12255f7070K7387k16953d609p6393J6093B75414
10585b43398Q7752E775g0075k43275b7539A34143a12835I1211B3338M1443l0063
10574C4718a3288A99925K29925A19442a73774N5571B3950c752H1074A5356c49827
10562C68414j54317C4105a65811P3900i849m71921a45906A98377J00815A2302
$$ y = [83671, 4482, 45054, -235242, -158813, -95610, 96086, 134424, -19309, -336245, 9011, 144242, 41243, 162565, -209481, -316438, -8022, 128418, -236330, -99848, 75240, -157939, -51410, -141181, -122921, -244375, -305616, 299078, -165884, -86815, 236377, 43238, 150010, -105960, -241743, -9062, -89810, -135856, -281181, -161358, 206439, -170175, -224067, 50056, 162598, -286016, -71632, 84080, -60596, -31547, 112255, -67070, -39683, -256636, -4609, -81002, -64909, 275414, -243398, -155646, 5775, -70075, -313350, -27539, 134143, -112835, 91211, 23338, 64781, 34718, -13288, 199925, 429850, 119442, -173774, -118203, 23950, -3752, 81074, 15356, -349827, 368414, 214097, 34105, -165811, -91911, -9849, -481770, -145906, 198377, 299192, 12302]
10551a18330l46340A89505a91469m8337Q3590q7641E0333L5497J69159i5593D8799
10539B39637b73551F6517R1656a65005l935B23669a91825B31767E4307a96407
10528a93100k5684J8145m4820a3474A9556a11034m9624B4242a78111D3905d7448
10516B4055J64936f0716F771O9131a45609c5270k90737M1557B5186K32852a55212
10504D4149c09269J2609O3672C71689j52085C4735b34071H9140c90011g8813c0095
10492a71577C54783F4327P7024a03276G1372K02913j9141G722J96625l792J64138
10481C64693o428N4796F3471f1691C1751J42464b5816B91326j8a00764A61908
10469B1826J59439p6754m6593i0715J9174a2780l50866B0651J6121L2037Q3239
$$ y = [-118330, -464670, 189505, -191469, -239806, -156216, -243857, 50333, 85830, 254989, -95593, 48799, 239637, -273551, 66517, 158173, -165005, -168940, 223669, -191825, 231767, 54307, -196407, -193100, -218784, -200639, -245459, -13474, 19556, -111034, -160658, 24242, -178111, 43905, -47448, 24055, 188991, -60716, 6771, 75902, -145609, -35270, -326007, -284450, 25186, 258038, -155212, 44149, -309269, -296660, -232988, 371689, 219604, 34735, -234071, 89140, -390011, -78813, -30095, -171577, 354783, 64327, 141351, -103276, 71372, 274285, 255144, 7722, 204347, 200555, 364693, 358265, 413061, 63471, -61691, 31751, 174215, -25816, 291326, 291308, -100764, 161908, 21826, 181265, 104511, 57918, -90715, -71541, -12780, -363646, 20651, 36772, 68809, 152048]
10458A52048f7533r2664d9759k61652k2432h1648j34541B1658a18577j30626r8954
10447c48157B8932K53862a61076f3524F4528b09711E7962J33381D1943O4935N0293
10436A57171J9727c44539R6914D9751J49951o4766c0661F1595g5866B12253a72411
10424A82637f629l40808B39042m7243Q8743A05243c24576e9013a119m46828a99677
10412a64434F8322L06955A53848b18391B24802j9410a01533l57715F0492b75868
10401A38811j3110i4113C1699e3279j79912C7654d381A68706K06056h8222F6255
10389A9350a11322D5564K60766H333Q2633i3933B9979J50167c5804A39541E1497
10377C22312b39352C24599j02211J92546A13003J3990J00336J33685j48898L37337
$$ y = [152048, -67533, -160197, -49759, -311411, -333843, -81648, -216189, 21658, -118577, -249203, -348157, 28932, 282794, -161076, -63524, 64528, -209711, 57962, 191343, 41943, 106878, 157171, 176898, -344539, -247625, 49751, 199702, 134936, -30661, 61595, -75866, 212253, -172411, 182637, -6629, -347437, 239042, 191799, 280542, 105243, -324576, -59013, -1119, -447947, -199677, -164434, 68322, 375277, 153848, -218391, 224802, 205392, -101533, -459248, 60492, -275868, 138811, 125701, -94113, 31699, -53279, -233191, 37654, -4381, 168706, 374762, -88222, 66255, 19350, -111322, 45564, 306330, 8333, 90966, -93933, 29979, 180146, -35804, 139541, 51497, 322312, -239352, 324599, 222388, 414934, 113003, 126993, 227329, 361014, 212116, 549453]
10367E49453j58292k3891o6884m9033p6706f1860B24501J18784H341f2151D32312
10355B44050n8948L4877G7045J06345N01353j12433j00060j22106C1927K13104
10345B45031O2993j50137D2704J86164D5653K36525J12838j71116B2731b19224
10334B27440o3716k133B5408J63473o0752C5817J68533m917G8805K64941A45939
10322A43585k5354L170J0305A8510J60221K5045J94419M9376o8477c75607A15645
10310a03903M2922m3070b7606j40926O5869f98A08260b93852A60079O8718j01712
10299A27085b35340l8457a09961C74249j4948Q875a38892B01843M110e6767r1435
10288a48202O5201J7989A14974a68069l11289c8196E8627g4936E7476Q7474C7074
$$ y = [549453, 391161, 367270, 300386, 251353, 174647, -61860, 224501, 343285, 8341, -62151, 432312, 244050, 185102, 219979, 77045, 183390, 684743, 572310, 472250, 350144, 31927, 245031, 308024, 157887, 42704, 228868, 45653, 282178, 395016, 223900, 22731, -219224, 227440, 163724, 161591, 25408, 188881, 128129, 35817, 204350, 199433, 78805, 343746, 145939, 143585, 118231, 121401, 131706, 18510, 178731, 203776, 398195, 447571, 379094, -375607, 115645, -103903, -60981, -104051, -27606, -168532, -102663, -698, 108260, -293852, 160079, 228797, 127085, -235340, -273797, -109961, 374249, 359301, 368176, -138892, 201843, 205953, -56767, -148202, -83001, -65012, 114974, -168069, -479358, -38196, 58627, -74936, 57476, 144950, 37074]
10276c9262j80586j10948E8475J59074a74674B46465a27093a9190A64317a84106
10265E8592J00846a01035F624d6423A57590o8188J21121J723D6277K807L40888
10254C89972I9160J33225a22995j3171k91182H4041i9641A36334H462L24152b18073
10242b09449R0842a6706L35r0557k50167A33083j1418b40801j39244h8831A82450
10230C5323J29822d7012l7311A89670i8401A39810a87252i3157H1097j1229J10399
10219A80267h00D32571c59153g1538k98150J24699a04050A31920A2337c10521
10208c84254f0531k72847J17568f0938F3361d47771G3903c52127A23513g4569
10197B29815b5572F7960f5478k32108i909k58006l9913A71848a73811D2928J5726
$$ y = [-39262, -219848, -330796, 58475, 217549, -174674, 246465, -127093, -19190, 164317, -184106, 58592, 159438, -101035, 6624, -46423, 157590, 89402, 210523, 212246, 46277, 49084, 389972, 99160, 232385, -122995, -136166, -427348, 84041, -99641, 136334, 8462, 332614, -218073, -209449, -118607, -16706, -16371, -106928, -357095, 133083, 121665, -240801, -380045, -88831, 182450, 35323, 165145, -47012, -84323, 189670, -98401, 139810, -187252, -93157, 81097, 69868, 180267, -800, 432571, -359153, -71538, -369688, -244989, -104050, 131920, 12337, -310521, -384254, -60531, -333378, -215810, -60938, 63361, -447771, 73903, -352127, 123513, -74569, 229815, -25572, 67960, -65478, -297586, -9909, -267915, -307828, 171848, -173811, 42928, 58654]
10186E8654a7162A25142c03543g0314n11267B10292b39727l2183J22059E7498
10175I6843d12584J98208J06402K6645C07444n9815p3246i7354k8756d2867k19640
10164b62507l148k3002n933A33970c32870E86Q8904a69766A28341m841g3149A7914
10151a70821k40945B2334b3945H2622c87646a1551F3497a92878j09029l453g174
10139C6027a13023m9786l9212A8307Q7594K02986F6710f1221j50644j74558J58295
10128b28128E9377a0733A38931a75275C11876A9857M46112A42484l8271a97522
10117A74009h8550l7443j31087B31813a11554A156J98227b67583J31686l5996
10107a71893j77774a03411p243B65297a13611B08852h8545I3770b13035A36346
$$ y = [58654, -17162, 125142, -303543, -70314, -581581, 210292, -239727, -271910, -149851, 57498, 96843, -412584, -214376, -107974, -81329, 307444, 247629, 174383, -97354, -126110, -42867, -262507, -265655, -288657, -294590, 133970, -332870, 586, 89490, -169766, 128341, 123500, -73149, 17914, -170821, -411766, 22334, -23945, 82622, -387646, -11551, 63497, -192878, -301907, -305360, -7174, 36027, -113023, -162809, -202021, 18307, 105901, 308887, 66710, -61221, -211865, -386423, -228128, 59377, -10733, 138931, -175275, 311876, 19857, 465969, 142484, 104213, -197522, 174009, -88550, -125993, -257080, 231813, -111554, 1156, 199383, -267583, -135897, -171893, -349667, -103411, -110654, 265297, -113611, 208852, -88545, 93770, -213035, 136346]
10096F9325O7868o0288a28780j8676e7594I9583J31200a25754p2946p4468B426
10084B54872a82328a5510A3212c40647f0194C9096J17009e780j8282C408K40951
10073B44359a73694d1438j61678i2471j09423g1781k4857l2410C42498j53955
10063A88543c01766a29150j17240a11600j3752A26443a54864m1301I5116a3210
10052a42576A72519c8172j58628A8865a69802g786q3358g580A48230a39657a5618
10040c55608f4170a7170l8044j14059n464B1228g4038o8552A08978a49736C1039
10028a27856M5831n8625L3501B24795g6648j11178E3582J71325E6288a8191A34116
10016C5341J06060a21083M2548J2584j04285c3267k48420a22879d1934A14872
$$ y = [69325, 137193, 76905, -128780, -147456, -57594, 99583, 230783, -125754, -198700, -273168, 2426, 254872, -182328, -15510, 13212, -340647, -60194, 39096, 156105, -5780, -24062, 3408, 244359, -173694, -41438, -203116, -92471, -201894, -71781, -96638, -129048, 342498, 188543, -301766, -129150, -246390, -111600, -125352, 126443, -154864, -196165, 95116, -13210, -142576, 172519, -38172, -196800, 18865, -169802, -7786, -91144, -7580, 148230, -139657, -15618, -355608, -64170, -17170, -55214, -169273, -174737, 21228, -74038, -142590, 108978, -149736, 31039, -127856, -82025, -140650, -107149, 224795, -76648, -187826, 53582, 224907, 56288, -18191, 134116, 35341, 141401, -121083, -78535, -65951, -170236, -33267, -281687, -122879, -41934, 114872]
10005B04075i0701A7025P1259i7059j1800A3190b81124g7538D02871b36710N3209
9994a83501j44633A07361a25009j12274N0072B11866i4381K8342b2569k88517
9984c11086c3182n3123A31282E9173J18808i009k71100K7408A08165d97763A16724
9972b78355P2610A2319J70258d5726j00112k3798q1569g916k52252m6535a06721
9960a10377A92903b28671f260l37694f9581F7966a95644g7079H4468L9881E3767
9948i654l8354k6451m0408A97680B3116a22176c1709J701k76673b1028l28920
9937c49948H5645e67904b51706n0282A8619O9767c36679A56919h0215B05718d521
9925f6884G7432L2297A7719R8481c54913e1597C93979c92956a28096M6034D8463
$$ y = [204075, -90701, 17025, 88284, -97059, -108859, 13190, -281124, -77538, 402871, -236710, -183501, -328134, 107361, -125009, -237283, -187211, 211866, -94381, -66039, -22569, -311086, -33182, -86305, 131282, 59173, 177981, -9009, -280109, -252701, 108165, -497763, 116724, -278355, -205745, 12319, 182577, -45726, -145838, -169636, -251205, -7916, -260168, -306703, -106721, -110377, 192903, -228671, -6260, -343954, -69581, 67966, -195644, -77079, 84468, 124349, 53767, -9654, -48008, -74459, -114867, 197680, 23116, -122176, -31709, -30008, -306681, -21028, -349948, 85645, -567904, -251706, -301988, 18619, 88386, -336679, 156919, -80215, 205718, -4521, -66884, 77432, 109729, 17719, 116200, -354913, -51597, 393979, -392956, -128096, -82062, 48463]
9913A14594d6950C5887a94867H9050A651R7359b72939J21365p4374A23591J8629
9902A42220a10600M6398a1204l84184g9078C1354i7988j46506a17243G0471E244
9890b46925I788b54888E8660K70692h2302j41603j0064a6247n7526D12918a41617
9878B63814E1690c9785j7052l14421h2301q9039A28991b82671j05480C86213h2054
9866a32282M1071o6250f9788k21431a36161A90488b77934n2887A08989a2115o454
9855a8569j43105O4145A33103e36205F9514b32155e9220O519q576k61332D404
9843a4617A85296g4914C72015a45906o939A20266b4826j62429E9125g0811j58169
9832b28980a07056j30401B11501h9214n7453A75878f8139k10046F1153k3499h2121
$$ y = [114594, -46950, 35887, -194867, 89050, 1651, 99010, -272939, -151574, -225948, 123591, 142220, -110600, -64202, -11204, -395388, -79078, 31354, -97988, -244494, -117243, 70471, 5244, -246925, 9788, -254888, 58660, 329352, -82302, -223905, -233969, -16247, -73773, 412918, -141617, 263814, 51690, -39785, -56837, -371258, -82301, -171340, 128991, -282671, -388151, 386213, -82054, -132282, -91211, -157461, -69788, -291219, -136161, 190488, -277934, -330821, 108989, -12115, -18569, -161674, -97529, 133103, -536205, 69514, -232155, -59220, -52701, -61277, -322609, 4404, -14617, 185296, -74914, 372015, -145906, -152845, 120266, -24826, -187255, 59125, -70811, -228980, -107056, -237457, 211501, -89214, -146667, 175878, -68139, -278185, 61153, 37654, -82121]
9820E7702b16444i8224A3759h5840k10874O5121F5361J93445f4337k32596c1318
9808A70136a00966j09087g6957l30445a8178B2744J44187b24113B97064b05289
9797a07873j01482o0045q5526J20802J09715F4017c97913B5099a20547F3761h6183
9785c63260q7741H2957J35533b98304j27474K03188h6468j40665k04471a62464
9774I639P2642b08380Q526E5192L0589c06910A48402J7126d45390B3029a94513
9762A75757j8877C2992i721A85688G3561a06111B05292k8305a37635j13739J15401
9751a35973l1618A05638a78150m7628O3407I9102R029J02909D7166K40625a05878
9739B67094h914l1948j08279G3664b44105l5370a28459q849B54173A00887j8630
$$ y = [57702, -216444, -98224, 13759, -85840, -296714, -231593, 65361, 258806, -64337, -296933, -31318, 170136, -100966, -210053, -76957, -407402, -18178, 22744, 166931, -224113, 297064, -205289, -107873, -209355, -269400, -354926, -234124, -124409, 64017, -397913, 25099, -120547, 63761, -86183, -363260, -451001, 82957, 218490, -298304, -425778, -222590, -86468, -227133, -431604, -162464, 9639, 82281, -208380, -199854, 55192, 85781, -306910, 148402, 165528, -445390, 23029, -194513, 175757, 156880, 32992, -9721, 185688, 73561, -106111, 205292, 176987, -137635, -251374, -135973, -167591, 105638, -178150, -225778, -162371, 99102, 108131, 211040, 47166, 287791, -105878, 267094, -8914, -40862, -149141, 73664, -244105, -279475, -128459, -137308, 254173, 100887, 82257]
9728H2257P1118c12291A94426H7236m0999a17890p0379B672K43624C920K53785
9717B57705a0072k48799f7370j41920F9651c00400a03646I7805k2829b55637D331
9705g2242j47104L0693C3664a81936n9576b3090l04264i1340j44701d8389I10
9693A04488J6472c19376C9049c92965a77085j01624B3135c01351n3675A02046
9682i5201k09633E5703h7703q5361j63916n5609a44623A477P5473a79702Q3990
9671i5712j25047N0109A6412c92911a68998C14243B254P2534J3024a17862a3042
9659a1054H0285d82778J58865j07908C48948b5241k05860k0762A42628K4270i3157
9647b08419I0620J39808E4342b00432b6961B34187C3022Q0019k1553a35647N2140
$$ y = [82257, 153375, -312291, 194426, 87236, 46237, -117890, -188269, 2672, 246296, 3920, 257705, -10072, -258871, -67370, -209290, 69651, -300400, -103646, 97805, 74976, -255637, 4331, -72242, -219346, -188653, 33664, -181936, -241512, -23090, -327354, -91340, -236041, -48389, 910, 104488, 120960, -319376, 39049, -392965, -177085, -278709, 23135, -301351, -355026, 102046, -95201, -304834, 55703, -87703, -173064, -336980, -392589, -144623, 1477, 76950, -179702, -95712, -220759, -170650, 16412, -392911, -168998, 314243, 2254, 74788, 87812, -117862, -13042, -11054, 80285, -482778, -323913, -431821, 348948, -25241, -231101, -251863, 142628, 166898, -93157, -208419, 90620, 230428, 54342, -200432, -26961, 234187, 33022, 113041, 91488, -135647, -83507]
9636h3507A29721c29290H7364J47293a99975F9419b77267c0332A07001h8567a9844
9624c9835A19415f5432A31273D5051J66885g4271H0848a97806c959p353o9685
9613h0997j86377a13633a9150k8758A00351m7902a29782k918B68897I7682b62529
9601G6480k5414a15567I7149a55387A78086J16970e4700G5788f0954A72985A7403
9589a54095c6821n23056a65586n1328B43266k5915i5734M957o0003A00286J96534
9578B96820E127a69530E6840K77830A43920b56890A90094M7771a82053A12747
9567a01309r0931h9680M2734l35921m5946J21654J32239F2206a1167F3041b39625
9555a18964A74038i1516K4170j63242g0550k91905K6326J52328C124d14578E8615
$$ y = [-83507, 129721, -329290, 87364, 234657, -199975, 69419, -277267, -30332, 107001, -88567, -19844, -39835, 119415, -65432, 131273, 45051, 211936, -74271, 80848, -197806, -3959, -11312, -80997, -267374, -113633, -19150, -47908, 100351, 52449, -129782, -132700, 268897, 97682, -262529, 76480, 51066, -115567, 97149, -155387, 178086, 295056, -54700, 75788, -60954, 172985, 17403, -154095, -36821, -559877, -165586, -216914, 243266, 217351, -95734, -90777, -150780, 100286, 296820, 5127, -169530, 56840, 334670, 143920, -256890, 190094, 237865, -182053, 112747, -101309, -192240, -89680, -46946, -382867, -428813, -307159, -174920, 62206, -11167, 63041, -239625, -118964, 174038, -91516, -67346, -230588, -70550, -362455, -336129, -183801, 3124, -414578, 58615]
9543A13363n0520P5265m0927k8102N1835A0842a8433j80626f5920k03667H8760
9531a68404B10913r1023k9627b0982F8218C3163K0182h3079j2738b9307E6562
9519f6973k02457f3701a4844k9668C4362K17972c48542N5254e0946j49469j88212
9508c88627C9538b04671N2253L8459c5119C4673a72256B73389a39722O385e5695
9496E2516a84034G864b17488j04182a10352r0899e3348A29711A1555P128a93310
9484a03983j3266C571a06921A00161e15265B7548L5698B4284K08533a07946l2560
9473a40506q6296D02809A9664g0858j95897J17274G189g1172H095a86446I1801
9461g2051K6949p7127A88268B2576a34502l08356A01906b72564A06806e953A25454
$$ y = [113363, 62843, 138108, 97181, 69079, 120914, 10842, -18433, -199059, -65920, -269587, 88760, -168404, 210913, 119890, 90263, -20982, 68218, 33163, 53345, -83079, -95817, -29307, 56562, -66973, -269430, -63701, -14844, -44512, 34362, 252334, -348542, -293288, -50946, -200415, -388627, 39538, -204671, -152418, -113959, -35119, 34673, -172256, 273389, -139722, -133337, -55695, 52516, -184034, 7864, -217488, -321670, -110352, -201251, -53348, 129711, 11555, 18683, -193310, -103983, -117249, 3571, -106921, 100161, -515265, 27548, 63246, 24284, 232817, -107946, -140506, -226802, 402809, 19664, -70858, -266755, -149481, 7189, -71172, 8095, -186446, 91801, -72051, -45102, -122229, 188268, 22576, -134502, -442858, 101906, -272564, 106806, -5953, 125454]
9449H4504Q5915a21281o1380Q9689G6913a09043M1139j66213J09408m2873C4920
9437A67873F1527c40480J03605a07667H1208a54888a576k7744F8630a40196k1965
9426a62161A7087g2307k81881J17740A66054J58807B8844Q4155c16349J16533
9416a99816A56097B5144J5937N8863D3862a40291j5734j37720H0634f7040G4960
9404D1201h4520A36016m7715e3514A291a27471e8483I207d91640c7242j92854
9393b30096B72253c2262q4988H4794M7259j1891a67949C039K10235d946k11395
9382b16341M2587A32922d9260b485q5149k52173B92318A36374b63453b9822C6321
9370a6067j83106j42597H8J72668a31189C1146J72822r7282a55563f6002B47075
$$ y = [84504, 170419, -121281, -182661, -92972, 76913, -109043, -67904, -234117, -124709, -167582, 34920, 167873, 61527, -340480, -236875, -107667, 81208, -154888, -1576, -29320, 68630, -140196, -162161, 17087, -72307, -354188, -236448, 166054, 324861, 28844, 112999, -316349, -199816, 156097, 25144, 41081, 99944, 43862, -140291, -156025, -293745, 80634, -67040, 74960, 41201, -84520, 136016, 88301, -53514, 1291, -127471, -58483, 9207, -491640, -37242, -230096, 272253, -32262, -117250, 84794, 132053, 120162, -167949, 3039, 213274, -4946, -216341, -173754, 132922, -49260, -2485, -87634, -339807, 292318, 136374, -263453, -29822, 36321, -16067, -199173, -341770, 88, 172756, -131189, 31146, 203968, 106686, -155563, -66002, 247075]
9358A02086b33833h0258k45743A41811c58299B78165L2344D4270d42350A7594
9347c4095C57244a54064k5499A17413J87358m9782g1242E6001g928B82962C1902
9335a40913E0056J02650J06834d70858O9356J97843J3812j22428l3232D5776a39975
9323A06269m3010B1394a38641M8139o8727k67118F8077h4456k41816d3682r1397
9312a35079m4282A05024a20968e6828d144q2232F7295b84716B0008P3805K1804
9301A15617a0698I173J5283R553c09324J30068k7441Q4837j37236a24767c3881
9289A74371L2070a60064A9923a8384a501F5030a87217A95809Q6196e5746k0645
9278g6391k4799B52097p3210b39981e8977A58092b55985j2266a33632j53696A0309
$$ y = [102086, -233833, -80258, -326001, 141811, -358299, 278165, 310509, 44270, -442350, 17594, -34095, 357244, -154064, -179563, 117413, 304771, 254989, -71242, 56001, -7928, 282962, 31902, -140913, 50056, 152706, 259540, -470858, -401502, -203659, -189847, -312275, -345507, 45776, -139975, 106269, 63259, 21394, -138641, -90502, -159229, -426347, 68077, -84456, -326272, -43682, -135079, -179361, 105024, -120968, -56828, -4144, -86376, 67295, -284716, 20008, 93813, 115617, -10698, 9173, 24456, 34009, -309324, -179256, -206697, -121860, -259096, -124767, -33881, 174371, 206441, -160064, 19923, -18384, -1501, 65030, -187217, 195809, 282005, -55746, -76391, -101190, 252097, 178887, -239981, -58977, 158092, -255985, -268251, -133632, -287328, 10309]
9266F0381B2549a2505I2502b6224j98304h7410A7763c75167J45953O3848a6075
9254a38272I3431a54095j26780h3552F0571L3973b1414p8624q8482q6359B78246
9242a05752E3174a59399m3256j09355b6439p0412k19513a43805f8354K6311D4343
9230E5761M79787A66221H856K16274a33767o4453J1826I2777b09664B097f2546
9218I2343a59588j96977m8173D52225H2024d2713n7577q66E0175J26578b0165
9206b66868b5119l0261r5477A21867L1655o3147N1311b28879n7582j9495a49660
9194d51980A88455o0046k9277J2659a62908A07624r352d6603j37630E85055c27736
9182I3135n626a37768A96171d1749o0674A5042g5016j48042E6872B7021b75946
$$ y = [60381, 22549, -12505, 92502, -26224, -224528, -87410, 17763, -375167, -229214, -165366, -16075, -138272, 93431, -154095, -280875, -83552, 60571, 94544, -21414, -100038, -188520, -274879, 278246, -105752, 53174, -159399, -202655, -312010, -26439, -96851, -316364, -143805, -68354, -42043, 44343, 55761, 535548, 166221, 8856, 225130, -133767, -198220, -186394, 92777, -209664, 2097, -62546, 92343, -159588, -356565, -404738, 452225, 82024, -42713, -100290, -101156, 50175, 176753, -20165, -266868, -25119, -55380, -150857, 121867, 153522, 90375, 141686, -228879, -286461, -305956, -149660, -451980, 188455, 128409, 99132, 111791, -162908, 107624, 98272, -46603, -184233, 585055, -327736, 93135, 87509, -137768, 196171, -41749, -102423, 15042, -75016, -223058, 56872, 27021, -275946]
9170g9390B1799b7226A04023J22050a34464l1861d5705B33019c3804A88049a18462
9158E9465C351b19787A32680H71L09252h631A73525a68651g7269k53130e4940
9146i947A26666a93271l5175P2103A01159g9699B9974j251b85126D6099a38417
9134c8595j1673k78002N356F736a22144A78233b34558I6863K6736N010e920m0131
9122d6051j31054C72603A51142b3760j868G0534k7589K56322A03210d16864R0349
9111c26515a03906q9683m069C7454a38973M4741b6266j75562L6806e7516j31741
9100a89257h1986I7803a28901e108k72814J20724a2527B3800R7287J57216a55078
9088A7917c81115E2909a71279e7525j82836a2597B6230c30208C9542e9858A71160
$$ y = [-79390, 21799, -27226, 104023, 226073, -134464, -166325, -45705, 233019, -33804, 188049, -118462, 59465, 3351, -219787, 132680, 871, 310123, -8631, 173525, -168651, -77269, -330399, -54940, -9947, 126666, -193271, -228446, -156343, 101159, -79699, 29974, 28723, -285126, 46099, -138417, -38595, -50268, -328270, -322914, 6736, -122144, 178233, -234558, 96863, 123599, 128609, -5920, -46051, -177105, 372603, 151142, -23760, -25628, 70534, 42945, 299267, 103210, -416864, -326515, -103906, -193589, -197658, 37454, -138973, -94232, -26266, -201828, -165022, -57516, -189257, -81986, 97803, -128901, -5108, -277922, -157198, -12527, 23800, 121087, 278303, -155078, 17917, -381115, 52909, -171279, -57525, -240361, -12597, 26230, -330208, 39542, -59858, 171160]
9076I467l069K10531R347A06962g0816B14682C043J6766f7457l73945a28696A34590
9063b67923A70720K6981l3789c4518l47238h7330a4695k1565l4209j96683B38630
9051D2050f9081D8061b16061b44C64963b1628j64466m5679i4814A42993a146p8781
9039g9927A16370b39418B00610b41694e5051j17717P877l77432a30951j97095
9029c28046h9594j2681m9563n1234d6231o7615k18458A21897a30409k66340a39259
9017F3694J73442c92126R4592H0957b20908A70626c6329A4533i948j6208c89q3144
9005h3533C3084H813b0621M743l85429A62520b60049A6055a77346L49g2844o2088
8993a34932I2252a21826j45221c0791E3477J2293a05872m4622a825I3706l2234
$$ y = [9467, 6398, 216929, 226276, 106962, -70816, 214682, 3043, 19809, -67457, -441402, -128696, 134590, -267923, 170720, 197701, 163912, -34518, -381756, -87330, -14695, -36260, -70469, -267152, 238630, 42050, -69081, 48061, -216061, -244, 364963, -21628, -186094, -231773, -94814, 142993, -1146, -79927, 116370, -239418, 200610, -241694, -55051, -172768, -164891, -542323, -130951, -328046, -89594, -102275, -151838, -203072, -46231, -113846, -332304, 121897, -130409, -396749, -139259, 63694, 237136, -392126, -297534, 80957, -220908, 170626, -36329, 14533, -9948, -26156, -389, -83533, 33084, 8813, -20621, -15878, -401307, 162520, -260049, 16055, -177346, -176997, -72844, -134932, 92252, -121826, -267047, -30791, 53477, 65770, -105872, -150494, -1825, 93706, 61472]
8982F1472J16905e6109a0051B31015q5238b17572N1032A97157E1872a52665a8527
8970a26292j15789K9507B7455a50415b2029j3501k30813J5388a01493A03186i6010
8958E0714c14365A01527l278J26872a91362E5563L0419A6689J65285J00369r3100
8947A89243a71201C3981M8391m490K31975A32429E5191j1665a27379A41091J98910
8936C40001D4239a8790A44806b28867A69261D69N0869N9712a18764B47436Q1645
8925C29081O14780J578041L277010P511139n895097A536033E96760j67020A85206
8915I7212d4538B57272E324J77058F2493n344K52663K11799A13787D2564b32894
8903B14112j03103g3887A69098c93096J18337k9380R7191a02834D7008J74919
$$ y = [61472, 178377, -56109, -10051, 231015, 145777, -217572, -166540, 197157, 51872, -152665, -18527, -126292, -242081, -212574, 27455, -150415, -22029, -35530, -266343, -250955, -101493, 103186, -96010, 50714, -314365, 101527, 98249, 225121, -191362, 55563, 85982, 16689, 181974, 282343, 189243, -171201, 33981, 82372, 77882, 309857, 132429, 55191, 43526, -127379, 141091, 340001, 44239, -18790, 144806, -228867, 169261, 469, 51338, 111050, -118764, 247436, 329081, 943861, 2521902, 5798912, 13310051, 7414954, 1536033, 596760, 429740, 185206, 97212, -44538, 257272, 5324, 182382, 62493, 57149, 309812, 521611, 113787, 42564, -232894, 214112, 111009, -73887, 169098, -393096, -274759, -304139, -206948, -102834, 47008, 221927]
8893B21927j0531A5603a45780N3818k13170e4496k30994A05269b7774A85987A9254
8881H5027j8072a47013L3377n1470p5411f3172F6209a13622H7246J3571D9369
8869i3418l4349d221n6583j6012H3914C6089J19279C9352J03070b07342l9625
8858b46967a13422p7239q0442i3069K7875j12763h4755D6291J9043c11001A29845
8846a55573M1555n619j13000J8735k7794q9898a60730A07112a86919k16691a28278
$$ y = [221927, 211396, 15603, -145780, -91962, -305132, -54496, -285490, 105269, -27774, 185987, 19254, 85027, 66955, -147013, -113636, -165106, -240517, -63172, 66209, -113622, 87246, 100817, 49369, -93418, -127767, -4221, -60804, -76816, 83914, 36089, 155368, 39352, 142422, -207342, -246967, -113422, -190661, -271103, -93069, -65194, -177957, -84755, 46291, 65334, -311001, 129845, -155573, -114018, -119637, -232637, -213902, -241696, -331594, -160730, 107112, -186919, -403610, -128278]
$$ [...]
##END NTUPLES=NMR SPECTRUM
##END=
