
##TITLE=AC1354_CPIAH12173_6673713_tQ6Dtiq03W
##JCAMPDX= 6.0         $$ Bruker NMR JCAMP-DX V2.0
##DATA TYPE= NMR SPECTRUM
##DATA CLASS= NTUPLES
##ORIGIN= BRUKER
##OWNER= Administrator
$$ 1.72 TOPSPIN		Version 2.1
$$ 2012-08-14 20:44:06.625 -0500  Administrator@TOPSPIN
$$ Compression mode = diff/dup
##.OBSERVE FREQUENCY= 400.02188249412
##.OBSERVE NUCLEUS= ^1H
##.ACQUISITION MODE= SIMULTANEOUS (DQD)
##.ACQUISITION SCHEME= undefined
##.AVERAGES= 64
##.DIGITISER RES= 22
##SPECTROMETER/DATA SYSTEM= spect
##.PULSE SEQUENCE= noesygpps1d.comp
##.SOLVENT NAME= COFFEE_meoh
##.SHIFT REFERENCE= INTERNAL, COFFEE_meoh, 1, 14.96074
##AUDIT TRAIL= $$ (NUMBER, WHEN, WHO, WHERE, PROCESS, VERSION, WHAT)
$$ ##TITLE= Audit trail, TOPSPIN		Version 2.1
$$ ##JCAMPDX= 5.01
$$ ##ORIGIN= Bruker BioSpin GmbH
$$ ##OWNER= Administrator
$$ $$ C:\Bruker\TOPSPIN/data/COFFEE/nmr/AC1354_CPIAH12173_6673713_tQ6Dtiq03W/12/pdata/1/auditp.txt
$$ ##AUDIT TRAIL=  $$ (NUMBER, WHEN, WHO, WHERE, PROCESS, VERSION, WHAT)
(   1,<2012-08-14 20:44:01.640 -0500>,<Administrator>,<TOPSPIN>,<go>,<TOPSPIN 2.1>,
      <created by zg
	started at 2012-08-14 20:32:31.031 -0500,
	POWCHK enabled, PULCHK disabled,
       configuration hash MD5:
       6B 1B 68 BB D9 2E 58 E2 7F 35 AD 54 07 DF 0E 41
       data hash MD5: 64K
       CE F8 7C 48 9E 4C 1E DC C3 8C 18 6A 4E 12 C4 EE>)
(   2,<2012-08-14 20:44:04.734 -0500>,<Administrator>,<TOPSPIN>,<proc1d>,<TOPSPIN 2.1>,
      <Start of raw data processing
       efp LB = 0.3 FT_mod = 6 PKNL = 1 PHC0 = 0 PHC1 = 0 SI = 128K 
       data hash MD5: 128K
       59 E0 B2 E3 8A 9B E1 FF 97 BC 88 51 06 40 61 54>)
(   3,<2012-08-14 20:44:05.859 -0500>,<Administrator>,<TOPSPIN>,<proc1d>,<TOPSPIN 2.1>,
      <pk PHC0 = -1.988525 PHC1 = 0 
       data hash MD5: 128K
       10 EC 54 E3 C5 CA 45 E5 7F 32 02 BD 93 22 F9 7E>)
(   4,<2012-08-14 20:44:06.328 -0500>,<Administrator>,<TOPSPIN>,<proc1d>,<TOPSPIN 2.1>,
      <abs ABSG = 1 
       data hash MD5: 128K
       38 AC F2 23 7F 1A 34 B4 BD 80 64 69 3E 2A A4 C0>)
(   5,<2012-08-14 20:44:06.390 -0500>,<Administrator>,<TOPSPIN>,<proc1d>,<TOPSPIN 2.1>,
      <abs ABSG = 2 
       data hash MD5: 128K
       D8 13 99 BA A7 68 14 61 78 AD 62 9D D1 B1 50 25>)
(   6,<2012-08-14 20:44:06.453 -0500>,<Administrator>,<TOPSPIN>,<proc1d>,<TOPSPIN 2.1>,
      <abs ABSG = 3 
       data hash MD5: 128K
       BD 21 B3 36 37 90 98 88 4F B1 71 85 FD 7E CE 2F>)
(   7,<2012-08-14 20:44:06.500 -0500>,<Administrator>,<TOPSPIN>,<proc1d>,<TOPSPIN 2.1>,
      <abs ABSG = 4 
       data hash MD5: 128K
       81 83 84 68 9B 9C 9E 5A A9 B7 E8 E7 8D 63 95 38>)
(   8,<2012-08-14 20:44:06.546 -0500>,<Administrator>,<TOPSPIN>,<proc1d>,<TOPSPIN 2.1>,
      <abs ABSG = 5 
       data hash MD5: 128K
       17 8E A9 4D 8B 9A 24 1C 88 90 AA 6F 0F F9 5A 0D>)
$$ ##END=
$$ 
$$ $$ hash MD5
$$ $$ 24 40 BD 55 1B 3B E7 BE 85 38 2E FA 14 0B D0 28
##$RELAX= 
##$RELAX= 
##$RELAX= 
##$RELAX= 
##$RELAX= 
##$RELAX= 
##$RELAX= 
##$RELAX= 
$$ Bruker specific parameters
$$ [...]
150 150 150 150 150 150 150 150
##$TP07= 0
##$TPNAME0= <>
##$TPNAME1= <>
##$TPNAME2= <>
##$TPNAME3= <>
##$TPNAME4= <>
##$TPNAME5= <>
##$TPNAME6= <>
##$TPNAME7= <>
##$TPOAL= (0..7)
0.5 0.5 0.5 0.5 0.5 0.5 0.5 0.5
##$TPOFFS= (0..7)
0 0 0 0 0 0 0 0
##$TUNHIN= 0
##$TUNHOUT= 0
##$TUNXOUT= 0
##$USERA1= <user>
##$USERA2= <user>
##$USERA3= <user>
##$USERA4= <user>
##$USERA5= <user>
##$V9= 5
##$VALIST= <valist>
##$VCLIST= <CCCCCCCCCCCCCCC>
##$VD= 0
##$VDLIST= <DDDDDDDDDDDDDDD>
##$VPLIST= <PPPPPPPPPPPPPPP>
##$VTLIST= <TTTTTTTTTTTTTTT>
##$WBST= 1024
##$WBSW= 4
##$XGAIN= (0..3)
0 0 0 0
##$XL= 0
##$YL= 0
##$YMAX_a= 10582314
##$YMIN_a= -8459868
##$ZGOPTNS= <>
##$ZL1= 120
##$ZL2= 120
##$ZL3= 120
##$ZL4= 120
##$ABSF1= 14.96074
##$ABSF2= -5.597442
##$ABSG= 5
##$ABSL= 3
##$ALPHA= 0
##$AQORDER= 0
##$ASSFAC= 0
##$ASSFACI= 0
##$ASSFACX= 0
##$ASSWID= 0
##$AUNMP= <proc_prof1d_extract.lims>
##$AXLEFT= 0
##$AXNAME= <>
##$AXNUC= <1H>
##$AXRIGHT= 0
##$AXTYPE= 0
##$AXUNIT= <>
##$AZFE= 0.1
##$AZFW= 0.1
##$BCFW= 0
##$BC_mod= 0
##$BYTORDP= 0
##$COROFFS= 0
##$CY= 15
##$DATMOD= 1
##$DC= 0
##$DFILT= <>
##$DTYPP= 0
##$F1P= 0
##$F2P= 0
##$FCOR= 0.5
##$FTSIZE= 131072
##$FT_mod= 6
##$GAMMA= 0
##$GB= 0
##$INTBC= 1
##$INTSCL= 1
##$ISEN= 128
##$LB= 0.3
##$LEV0= 0
##$LPBIN= 0
##$MAXI= 10000
##$MC2= 0
##$MEAN= 0
##$ME_mod= 0
##$MI= 0
##$NCOEF= 0
##$NC_proc= -2
##$NLEV= 6
##$NOISF1= 0
##$NOISF2= 0
##$NSP= 0
##$NTH_PI= 0
##$NZP= 0
##$OFFSET= 14.96074
##$PC= 1
##$PHC0= -1.988525
##$PHC1= 0
##$PH_mod= 1
##$PKNL= yes
##$PPARMOD= 0
##$PPDIAG= 0
##$PPIPTYP= 0
##$PPMPNUM= 2147483647
##$PPRESOL= 1
##$PSCAL= 4
##$PSIGN= 0
##$PYNMP= <proc.py>
##$REVERSE= no
##$SF= 400.02000974114
##$SI= 131072
##$SIGF1= 0
##$SIGF2= 0
##$SINO= 400
##$SIOLD= 131072
##$SPECTYP= <>
##$SREGLST= <1H.CDCl3>
##$SSB= 0
##$STSI= 131072
##$STSR= 0
##$SW_p= 8223.68421052631
##$SYMM= 0
##$S_DEV= 0
##$TDeff= 65536
##$TDoff= 0
##$TI= <>
##$TILT= no
##$TM1= 0
##$TM2= 0
##$TOPLEV= 0
##$USERP1= <user>
##$USERP2= <user>
##$USERP3= <user>
##$USERP4= <user>
##$USERP5= <user>
##$WDW= 1
##$XDIM= 131072
##$YMAX_p= 355591798
##$YMIN_p= -11725
##$CURPLOT= <Network HP LaserJet P1505>
##$CURPRIN= <$Network HP LaserJet P1505>
##$DFORMAT= <normdp>
##$LAYOUT= <+/1D_H.xwp>
##$LFORMAT= <normlp>
##$PFORMAT= <normpl>
##$SURQMSG= 1
$$ End of Bruker specific parameters
$$ ---------------------------------
##NTUPLES= NMR SPECTRUM
##VAR_NAME=  FREQUENCY,     SPECTRUM/REAL,   SPECTRUM/IMAG
##SYMBOL=    X,             R,               I
##VAR_TYPE=  INDEPENDENT,   DEPENDENT,       DEPENDENT
##VAR_FORM=  AFFN,          ASDF,            ASDF
##VAR_DIM=   131072,        131072,          131072
##UNITS=     HZ,            ARBITRARY UNITS, ARBITRARY UNITS
##FACTOR=    0.0627417313425164, 1,          1
##FIRST=     8223.62146879497, 3927,         -53576
##LAST=      0,             4493,            -54070
##MIN=       0,             -11725,          0
##MAX=       8223.62146879497, 355591798,    0
$$ Real data points
##PAGE= N=1
##DATA TABLE= (X++(R..R)), XYDATA
$$ [...]
63936C110740J98601J94019J85967J73700J57307J37234J13737Q7213N8580K8850
63926D445948j466l2100o2279r0762j16774j40512j62361j81687j96847k06516
63916C254644k10769k10663k07030k00195j90662j79410j67263j54444j41018
63907A593190j27363j13880j00657q7790p5795o5226n6107m8144m1261l5620l1137
63896H10210k7494k4527k2235k0479j8958j7497j6157j5007j4062j3347j2885
63885F07562j2681j2718j2763j2158j0228p160m061j788j31J534L205M521N615
63872E48749P014Q788J0515J1988J3404J4811J5928J6565J6793J6663J6216J5716
63860G13150J5378J4878J3645J1672R519P543N623L642J687l41k762n546q205
$$ y = [3110740, 3309341, 3503360, 3689327, 3863027, 4020334, 4157568, 4271305, 4358518, 4417098, 4445948, 4444482, 4412382, 4350103, 4259341, 4142567, 4002055, 3839694, 3658007, 3461160, 3254644, 3043875, 2833212, 2626182, 2425987, 2235325, 2055915, 1888652, 1734208, 1593190, 1465827, 1351947, 1251290, 1163500, 1087705, 1022479, 966372, 918228, 876967, 841347, 810210, 782716, 758189, 735954, 715475, 696517, 679020, 662863, 647856, 633794, 620447, 607562, 594881, 582163, 569400, 557242, 547014, 539854, 535793, 534005, 533874, 535408, 538613, 543134, 548749, 555763, 564551, 575066, 587054, 600458, 615269, 631197, 647762, 664555, 681218, 697434, 713150, 728528, 743406, 757051, 768723, 778242, 785785, 791408, 795050, 796737, 796396, 793634, 788088, 779883]
63847G79883j0370j2077j3434j4490j5568j7136j9136k0937k2123k2868k3364
63836E88380k3470k3223k3071k3177k2965k1841k0062j8380j7064j5731j4030
63825C65366j2165j0734j0161j0254j0243r479q088o703n646m832m370m580n229
63812B62882n486m969m140l320k027j01J315Q97r75k471k475j606j018r86j079
63797B34441j111j272j590j748j469q57l42l75j105k289l465m201m164l250j748
63782B05455l60K77J32k40k90k0P1m73j479k142j753n30N43P50L22q2k31l18l30
63763A99302J03J114K185K509J778N06m10n50l00k94n97p76o56n41o13o02l23
63746B01835n9j3J68P94J462J606J471J812K659L185K902K307K086K251K423K486
$$ y = [779883, 769513, 757436, 744002, 729512, 713944, 696808, 677672, 656735, 634612, 611744, 588380, 564910, 541687, 518616, 495439, 472474, 450633, 430571, 412191, 395127, 379396, 365366, 353201, 342467, 332306, 322052, 311809, 302330, 294242, 287539, 281893, 277061, 272691, 268111, 262882, 257396, 252427, 248287, 244967, 242940, 242839, 244154, 245051, 244076, 241605, 239130, 237524, 236506, 235520, 234441, 233330, 232058, 230468, 228720, 227251, 226394, 226052, 225677, 224572, 222283, 218818, 214617, 210453, 207203, 205455, 205095, 205372, 205504, 205264, 204974, 204954, 205025, 204552, 203073, 200931, 199178, 198648, 199191, 199941, 200263, 200181, 199950, 199632, 199302, 199405, 200519, 202704, 205213, 206991, 207497, 207087, 206537, 206237, 205943, 205346, 204570, 203914, 203373, 202760, 202158, 201835, 201776, 201763, 201931, 202725, 204187, 205793, 207264, 209076, 211735, 214920, 217822, 220129, 222215, 224466, 226889, 229375]
63730B29375K486K257J635R47Q35J537K579L242L238K879K656K688K659K394K206
63715B63613K452K887K808J913N80p09j758k379k291j717j539k274l153k882j347
63700B54204J02K65n03q34j1J332K127K059J699J689K098K637L151L684M092M116
63684B81907L830L655L641L186J862K70n20l25L6k3j47J32N16M37J5j10K66P49
63666B99377J018J155J194Q65jj154k221l054l665m031m111l901l434k932k867
63651B72238l474m252m376l716k889k219j330j38N51J66m76p6J357K575K891K978
63635B59810L691M853N658N632M885L929L530M265N813P136P699Q029Q757R619
63621C43306J0044J0262J1016J2382J3614J4242J4719J5789J7631J9785K1597
$$ y = [229375, 231861, 234118, 235753, 236700, 237535, 239072, 241651, 244893, 248131, 251010, 253666, 256354, 259013, 261407, 263613, 266065, 268952, 271760, 273673, 274253, 273544, 271786, 269407, 267116, 265399, 263860, 261586, 258433, 255551, 254204, 254306, 254571, 254068, 253234, 253223, 254555, 256682, 258741, 260440, 262129, 264227, 266864, 270015, 273699, 277791, 281907, 285737, 289392, 293033, 296219, 298081, 298351, 297831, 297506, 297542, 297519, 297372, 297504, 298020, 298457, 298472, 298362, 298628, 299377, 300395, 301550, 302744, 303609, 303608, 302454, 300233, 297179, 293514, 289483, 285372, 281471, 278037, 275105, 272238, 268764, 264512, 260136, 256420, 253531, 251312, 249982, 249844, 250395, 250561, 250085, 250009, 251366, 253941, 256832, 259810, 263501, 268354, 274012, 279644, 284529, 288458, 291988, 296253, 302066, 309202, 316901, 324930, 333687, 343306, 353350, 363612, 374628, 387010, 400624, 414866, 429585, 445374, 463005, 482790, 504387]
63610E04387K2673K3206K3892K5210K6664K7155K6200K4440K2706K0915J8291
63599G65739J4500J0090N750J504k983p444j0834j2316j2238j1771j1748j2203
63587G16046j3026j4414j6395j8407j9843k0809k1801k2713k2746k1363j8965
63576E05564j6391j4103j2045j0066q173o445m811l069j141P15K159L338M869
63563D40401O973Q876R607R335R272J0190J1585J2597J3187J3898J4911J6029
63551E76861J7411J9566K2421K5064K6719K7632K8557K9690L0553L0752L0169
63540H65395K8330K4267J7566R296J288n377j0721j4829j7197j7473j6288j4816
63528H49441j3804j3460j4012j5746j8466k1456k4120k6394k8410l0109l1233
$$ y = [504387, 527060, 550266, 574158, 599368, 626032, 653187, 679387, 703827, 726533, 747448, 765739, 780239, 790329, 796079, 797583, 794600, 787156, 776322, 764006, 751768, 739997, 728249, 716046, 703020, 688606, 672211, 653804, 633961, 613152, 591351, 568638, 545892, 524529, 505564, 489173, 475070, 463025, 452959, 444786, 438341, 433530, 430461, 429320, 430035, 432194, 435532, 440401, 447374, 456250, 465857, 475192, 484464, 494654, 506239, 518836, 532023, 545921, 560832, 576861, 594272, 613838, 636259, 661323, 688042, 715674, 744231, 773921, 804474, 835226, 865395, 893725, 917992, 935558, 944854, 946142, 940765, 930044, 915215, 898018, 880545, 864257, 849441, 835637, 822177, 808165, 792419, 773953, 752497, 728377, 701983, 673573, 643464, 612231]
63517F12231l1488l0600k8514k5688k2944k0831j9235j7667j5764j3553j1388
63506C74559r652q369p172n897n008m970n347n085l848k476j853j844j773j393
63492C09872r11m47qJ94O1K8O40J684K302J986J101M02M35J314K586L341K975
63475C27555J960J348J464J587J088K34m74j105j919k623k724k376k250k592k988
63460C16185l058k801k222j132L70J663K161J935J532J490K127L527N370O924
63446C34071P613P586P540P967Q858R990J1249J2604J4027J5531J7080J8401J9160
63433D91677J9495K0109K1572K3545K4976K4962K3321K0486J7161J4119J1991
63422G13414J0995J0992J1828J3477J5804J8490K1317K4249K7030K8945K9370
$$ y = [612231, 580743, 550143, 521629, 495941, 472997, 452166, 432931, 415264, 399500, 385947, 374559, 364907, 356538, 349366, 343469, 338461, 333491, 328144, 323059, 319211, 316735, 314882, 313038, 311265, 309872, 308961, 308514, 308506, 308700, 308761, 308789, 309429, 311113, 313415, 315401, 316502, 316904, 317339, 318653, 321239, 324580, 327555, 329515, 330863, 332327, 333914, 335002, 335236, 334762, 333657, 331738, 329115, 326391, 324015, 321765, 319173, 316185, 313127, 310326, 308104, 306972, 307342, 309005, 311166, 313101, 314633, 316123, 318250, 321777, 327147, 334071, 341684, 349270, 356810, 364777, 373635, 383625, 394874, 407478, 421505, 437036, 454116, 472517, 491677, 511172, 531281, 552853, 576398, 601374, 626336, 649657, 670143, 687304, 701423, 713414, 724409, 735401, 747229, 760706, 776510, 795000, 816317, 840566, 867596, 896541, 925911]
63411I25911K8329K6160K2802J7966J1948N655l01n878j0744j3937j5078j5304
63399I77529j6085j7398j8192j8510j9888k3162k7008k9612l0935l2206l3569
63388G10964l3658l1634k8456k5548k3073k0306j7181j4516j2777j1405r651p514
63376D75245n495l699j731N81K798M518O068Q100J0627J2939J4651J6246J8174
63363E59022J9982K0967K1461K2600K4799K7210K8872K9743L0292L0683L0830
63352H46461L0735L0212K8659K5607K1279J6168J0389M040k108o971j0202j2344
63340I81925j3947j5087j5778j6323j7066j8188j9845k2134k4764k7104k8686
63329G63003k9429k9344k8385k6646k4416k1906j9157j6296j3590j1230r282p831
$$ y = [925911, 954240, 980400, 1003202, 1021168, 1033116, 1038771, 1038470, 1032592, 1021848, 1007911, 992833, 977529, 961444, 944046, 925854, 907344, 887456, 864294, 837286, 807674, 776739, 744533, 710964, 677306, 645672, 617216, 591668, 568595, 548289, 531108, 516592, 503815, 492410, 482759, 475245, 469750, 466051, 464320, 464901, 467699, 472217, 478285, 486385, 497012, 509951, 524602, 540848, 559022, 579004, 599971, 621432, 644032, 668831, 696041, 724913, 754656, 784948, 815631, 846461, 877196, 907408, 936067, 961674, 982953, 999121, 1009510, 1013550, 1011442, 1004471, 994269, 981925, 967978, 952891, 937113, 920790, 903724, 885536, 865691, 843557, 818793, 791689, 763003, 733574, 704230, 675845, 649199, 624783, 602877, 583720, 567424, 553834, 542604, 533322, 525491]
63317E25491o854o118n585n776p202r549j1973j4124j6085j7371j6998j4957j2591
63304C80308j0953r620p833n986m995m751m328l460k757k546k531k585k912l304
63290C11747l099k210j408j261j474j608j743j974j939j399q46q52j226j343j105
63275B88260r45j039j056p08r6N26R54J008O82L37M89J230K103K637K778K752
63259B99912K648K393K040J954K563L893N387O336O473O082N557N147N116N768
63245C61269P051Q414R380J0082J0976J2174J3447J4739J6247J7900J9264K0100
63233E21043K0613K0966K0962K0586K0438K1039K1890K1925K0983K0197K0515
63222G51157K1396K1503K0423J9004J8122J7812J7669J7400J6571J4445J0685
$$ y = [525491, 518637, 512519, 506934, 501158, 493956, 484407, 472434, 458310, 442225, 424854, 407856, 392899, 380308, 369355, 359735, 351902, 345916, 340921, 336170, 331842, 328382, 325625, 323079, 320548, 317963, 315051, 311747, 308648, 306438, 305030, 303769, 302295, 300687, 298944, 296970, 295031, 293632, 292786, 291934, 290708, 289365, 288260, 287315, 286276, 285220, 284512, 284416, 284942, 285896, 286904, 287586, 287923, 288412, 289642, 291745, 294382, 297160, 299912, 302560, 304953, 306993, 308947, 311510, 315403, 320790, 327126, 333599, 339681, 345238, 350385, 355501, 361269, 368320, 376734, 386114, 396196, 407172, 419346, 432793, 447532, 463779, 481679, 500943, 521043, 541656, 562622, 583584, 604170, 624608, 645647, 667537, 689462, 710445, 730642, 751157, 772553, 794056, 814479, 833483, 851605, 869417, 887086, 904486, 921057, 935502, 946187]
63211I46187N975J397k662o533j0456j4285j7927k1388k4357k6306k7169k7433
63199G75043k7292k6317k4206k1413j8643j6027j3274j0278p262m410j808M39
63187F04552K363M206O106P855R297J0656J2089J3188J3511J3359J3413J3622
63175G24217J3227J2039J0974J0878J1352J1270J0156Q470O656M482J558j903
63163H23376n152p719r896j2331j5261j8309k0950k2969k4351k4964k4621k3388
63151F13465k1686k0036j8758j7808j6862j5611j4090j2482j0684q429o007m331
63139D46681l824l673k851j607j140j800k481k113r67o7K40M51J046J961K850
63124D32706L473L823M117M594N146N314M883M300M222M713N123M820L881L012
$$ y = [946187, 952162, 953559, 950897, 944364, 933908, 919623, 901696, 880308, 855951, 829645, 802476, 775043, 747751, 721434, 697228, 675815, 657172, 641145, 627871, 617593, 610331, 605921, 604113, 604552, 606915, 611121, 617227, 625082, 634379, 645035, 657124, 670312, 683823, 697182, 710595, 724217, 737444, 749483, 760457, 771335, 782687, 793957, 804113, 812583, 819239, 823721, 825279, 823376, 818224, 810505, 800609, 788278, 773017, 754708, 733758, 710789, 686438, 661474, 636853, 613465, 591779, 571743, 552985, 535177, 518315, 502704, 488614, 476132, 465448, 457019, 451012, 446681, 442857, 439184, 436333, 434726, 433586, 431786, 429305, 427192, 426225, 426158, 426398, 426849, 427895, 429856, 432706, 436179, 440002, 444119, 448713, 453859, 459173, 464056, 468356, 472578, 477291, 482414, 487234, 491115, 494127]
63110D94127K807L099L165K657K073K094K637L061L085K920K537J599K68o28o12
63095E24889j20L26P54J154R93Q7p63q37n89p58r14r9J421K358K346K322K805
63078E35375L146K994L211M494O140P115P586Q376R478J0281J0927J2185J4030
63065F35338J5468J6031J6542J7955K0181K2525K4720K6934K9126L1075L2973
63054H88868L5417L8623M2032M4868M6865M8275M9394N0371N1347N2399N3227
63043A401686N3263N2307N0889M9731M9061M8633M8199M7561M6387M4471M2080
63032A934268L9480L6072L0707K3079J4260N439l405j3026k3474l3755m2821n0341
63020A916483n6452o1205o4482o6131o6053o4258o0962n6546n1349m5558l9281
$$ y = [494127, 496934, 500033, 503198, 505855, 507928, 510022, 512659, 515720, 518805, 521725, 524262, 525861, 526129, 525501, 524889, 524769, 525095, 525849, 527003, 527996, 528083, 527320, 526483, 525894, 525136, 524222, 524123, 525544, 527902, 530248, 532570, 535375, 538521, 541515, 544726, 549220, 555360, 562475, 570061, 578437, 587915, 598196, 609123, 621308, 635338, 650806, 666837, 683379, 701334, 721515, 744040, 768760, 795694, 824820, 855895, 888868, 924285, 962908, 1004940, 1049808, 1096673, 1144948, 1194342, 1244713, 1296060, 1348459, 1401686, 1454949, 1507256, 1558145, 1607876, 1656937, 1705570, 1753769, 1801330, 1847717, 1892188, 1934268, 1973748, 2009820, 2040527, 2063606, 2077866, 2083305, 2079900, 2066874, 2043400, 2009645, 1966824, 1916483, 1860031, 1798826, 1734344, 1668213, 1602160, 1537902, 1476940, 1420394, 1369045, 1323487, 1284206]
63009A284206l2718k6219k0097j4311q525k666K669O803R935J2957J6181J8815
62997A247030K0104K0459K0943K1954K2981K3436K3141K2103K0403J8356J6372
62986A477282J4491J2296R200M762j002p263j2783j7201k1583k7021l2952l7762
62974A360464m0835m3009m4880m5848m5254m3519m1481l9320l6814l4118l1554
62963I13832k9088k6647k4542k2915k1222j9003j6784j5429j4878j4385j3794
62952F95145j3530j3457j2836j1659j0940j1249j1838j1830j1451j1366j1426
62941E63563j0981j0017r093q301p178n709m615m371m509m241l452k710k570l025
62927D82791l514l349k271p68L48O63M09J7l26o59j115j762k418k593k006j154
$$ y = [1284206, 1251488, 1225269, 1205172, 1190861, 1182336, 1179670, 1182339, 1189142, 1199077, 1212034, 1228215, 1247030, 1267134, 1287593, 1308536, 1330490, 1353471, 1376907, 1400048, 1422151, 1442554, 1460910, 1477282, 1491773, 1504069, 1513269, 1518031, 1517029, 1509766, 1496983, 1479782, 1458199, 1431178, 1398226, 1360464, 1319629, 1276620, 1231740, 1185892, 1140638, 1097119, 1055638, 1016318, 979504, 945386, 913832, 884744, 858097, 833555, 810640, 789418, 770415, 753631, 738202, 723324, 708939, 695145, 681615, 668158, 655322, 643663, 632723, 621474, 609636, 597806, 586355, 574989, 563563, 552582, 542565, 533472, 525171, 517993, 512284, 507669, 503298, 498789, 494548, 491096, 488386, 485816, 482791, 479277, 475928, 473657, 472889, 473237, 473900, 474309, 474326, 474000, 473341, 472226, 470464, 468046, 465453, 463447, 462293]
62911D62293q81j302j657j482j308j757k463k615k184j893k110k492k715k789
62897D34645k571j785p17j98m32n57J71J312J913J690R65p1j222j773j133Q4N94
62880D30915J83k0O41J290Q31l60r96o72j85j75l34k15m2k88q67j264j256j033
62862D26153o85q9O16Q74L50n22r79q20m53j34L69J105J454Q55j79m29N61J845
62844D29892K151J244p7r61j118p02j34j0o93j728k054j146K44Q74M32j92j15
62827D25907N25J007J067J001R95Q95P50R34J476J808J620J549K411L985N192
62812D51122N465N295N308N497N616N807O273O715O621O049N729O326P834R633
62798E39290J1036J1842J2563J3929J6043J8137J9451K0198K1408K3871K7534
$$ y = [462293, 461412, 460110, 458453, 456971, 455663, 453906, 451443, 448828, 446644, 444751, 442641, 440149, 437434, 434645, 432074, 430289, 429572, 429374, 428942, 428385, 428556, 429868, 431781, 433471, 434436, 434365, 433143, 431370, 430237, 430321, 430915, 431098, 431078, 431719, 433009, 433840, 433480, 432484, 431812, 431627, 431452, 431118, 430903, 430861, 430573, 429706, 428442, 427186, 426153, 425468, 425379, 425995, 426869, 427219, 426697, 425718, 424898, 424445, 424311, 424680, 425785, 427239, 428094, 427915, 427486, 428047, 429892, 432043, 433287, 433210, 432249, 431131, 430429, 430295, 430285, 429592, 427864, 425810, 424664, 424908, 425782, 426214, 426022, 425907, 426432, 427439, 428506, 429507, 430502, 431397, 432147, 433081, 434557, 436365, 437985, 439534, 441945, 445930, 451122, 456587, 461882, 467190, 472687, 478303, 484110, 490383, 497098, 503719, 509768, 515497, 521823, 529657, 539290, 550326, 562168, 574731, 588660, 604703, 622840, 642291, 662489, 683897, 707768, 735302]
62787G35302L1840L6284M0608M4760M8831N2867N6751O0420O4109O8088P2096
62776A311956P5311P7087P7474P6861P5276P2184O6887N9049M9002L7620K5717
62765B004424J3433L83j3478k7313l9936n0712n9699o7056p2702p6579p8907p9958
62753A451900p9720p7973p4706p0442o6045o2139n8590n4704n0078m5160m0745
62742G71598l7022l3484k9792k6340k3683k1691j9650j7099j4320j1909j0184
62731E26424r004q051p130o191n196m026k724j664j238j219q06M56K085L333M247
62716D89296N473P148Q613R440J0154J1570J3741J6049J8021J9756K1619K3976
62704F54856K7027L0533L3833L6444L8639M1069M3830M6332M8088M9233N0111
$$ y = [735302, 767142, 803426, 844034, 888794, 937625, 990492, 1047243, 1107663, 1171772, 1239860, 1311956, 1387267, 1464354, 1541828, 1618689, 1693965, 1766149, 1833036, 1892085, 1941087, 1978707, 2004424, 2017857, 2018240, 2004762, 1977449, 1937513, 1886801, 1827102, 1760046, 1687344, 1610765, 1531858, 1451900, 1372180, 1294207, 1219501, 1149059, 1083014, 1020875, 962285, 907581, 857503, 812343, 771598, 734576, 701092, 671300, 644960, 621277, 599586, 579936, 562837, 548517, 536608, 526424, 517420, 509369, 502239, 496048, 490852, 486826, 484102, 482438, 481200, 479981, 479175, 479631, 481716, 485049, 489296, 494769, 501917, 510530, 519970, 530124, 541694, 555435, 571484, 589505, 609261, 630880, 654856, 681883, 712416, 746249, 782693, 821332, 862401, 906231, 952563, 1000651, 1049884, 1099995]
62693A099995N0629N0283M8607M5481M1136L5943L0078K3369J5606P007j927j0960
62681A435247k0138k9111l6939m2941m7407n1040n3886n5367n5283n4161n2504
62670I36470n0272m7365m4133m0972l7749l4189l0576k7504k5013k2567k0012
62659E56118j7823j6240j4792j3111j1657j0933j0471r346p534n960n244n134
62647D27873n200n340n446n274m894m592m177l095j511m34l00l26J97P81P24L82
62631C89368N01R09R75Q13Q65O91m29j870k102q34N56J027R92J161J493J875K654
62614C98645L777M470M492M808O169P900Q951R463J0272J1514J2737J3892J5300
62601E12390J6921J8567K0515K3106K6016K8641L0896L2833L4061L4416L4740
$$ y = [1099995, 1150624, 1200907, 1249514, 1294995, 1336131, 1372074, 1402152, 1425521, 1441127, 1448134, 1446207, 1435247, 1415109, 1385998, 1349059, 1306118, 1258711, 1207671, 1153785, 1098418, 1043135, 988974, 936470, 886198, 838833, 794700, 753728, 715979, 681790, 651214, 623710, 598697, 576130, 556118, 538295, 522055, 507263, 494152, 482495, 471562, 461091, 451745, 444211, 438251, 433007, 427873, 422673, 417333, 411887, 406613, 401719, 397127, 392950, 389855, 388344, 387910, 387610, 387284, 387481, 388262, 388986, 389368, 389869, 390778, 391753, 392566, 393431, 394122, 393693, 391823, 389721, 388887, 389443, 390470, 391462, 392623, 394116, 395991, 398645, 402422, 406892, 411384, 416192, 422361, 430261, 439212, 448675, 458947, 470461, 483198, 497090, 512390, 529311, 547878, 568393, 591499, 617515, 646156, 677052, 709885, 743946, 778362, 813102]
62590H13102L5819L6841L6139L3433L0005K6596K2399J6539R451K190m773j1526
62578A046215j8070k4222k9650l3728l5905l6503l6561l6655l6401l5325l3560
62567F89635l1433k9097k6825k4943k3147k0658j7516j4848j3345j2307j0883
62556D64633r394q474p727o391m774l810l511l146k709k822l152k402m33R76M05
62541D07269j210j846r66K71R57J296J576J455P64J82M88J552K614L323L954M810
62525D26489N898P249Q995J1019J2870J4308J5618J7165J8901K0569K2170K3843
62513F05094K5393K6483K7268K8362K9922L1100L0842K9027K6491K3924K1103
62502I05009J7359J2556P376K676j157m172o483q175r455j0456j0913j0375q793
$$ y = [813102, 848921, 885762, 921901, 955334, 985339, 1011935, 1034334, 1050873, 1060324, 1062514, 1057741, 1046215, 1028145, 1003923, 974273, 940545, 904640, 868137, 831576, 794921, 758520, 723195, 689635, 658202, 629105, 602280, 577337, 554190, 533532, 516016, 501168, 487823, 475516, 464633, 455239, 446765, 439038, 432647, 427873, 424063, 420552, 417406, 414697, 411875, 408723, 406321, 405888, 406864, 407269, 406059, 404213, 403247, 403518, 404475, 405771, 407347, 408802, 409566, 409748, 410236, 411788, 414402, 417725, 421679, 426489, 432387, 439636, 448631, 459650, 472520, 486828, 502446, 519611, 538512, 559081, 581251, 605094, 630487, 656970, 684238, 712600, 742522, 773622, 804464, 833491, 859982, 883906, 905009, 922368, 934924, 942300, 944976, 943819, 939647, 933164, 924989, 915534, 905078, 894165, 883790, 874997]
62489H74997o467l325J087O584J1898J5973J9300K3113K7490L1215L3574L5270
62477A070709L7168L8978L9717L8912L6688L3097K8005K1462J3709N042l965j2381
62465A347141j9621k6154l2978m0332m7247n2443n5371n6411n6199n4933n2351
62454H53101m8460m4081m0171l6632l2429k7157k1861j7792j4994j2687j0479
62443E46358q421o274l775j393R3Q26J720L030M002M132L794L279K171K87j627
62428E48202k874l884n517p723r642j0755j1116j0795r874q890q501q652q690
62415D41289q312p738p008n882m539l629l289k889k096j538j787k302k135j345
62401C86800q19r10r95n36K35Q65J304J588J456Q08K29N02J668K943L586L535
$$ y = [874997, 868530, 865205, 866292, 872876, 884774, 900747, 920047, 943160, 970650, 1001865, 1035439, 1070709, 1107877, 1146855, 1186572, 1225484, 1262172, 1295269, 1323274, 1344736, 1358445, 1363487, 1359522, 1347141, 1327520, 1301366, 1268388, 1228056, 1180809, 1128366, 1072995, 1016584, 960385, 905452, 853101, 804641, 760560, 720389, 683757, 651328, 624171, 602310, 584518, 569524, 556837, 546358, 537937, 531663, 527888, 526495, 526588, 527414, 529134, 532164, 536166, 540298, 544092, 547371, 549542, 549829, 548202, 545328, 541444, 535927, 528204, 518562, 507807, 496691, 485896, 476022, 467132, 458631, 449979, 441289, 432977, 425239, 418231, 412349, 407810, 404181, 400892, 398003, 395907, 394369, 392582, 390280, 388145, 386800, 385981, 385071, 384076, 383540, 383775, 384640, 385944, 387532, 388988, 389796, 390025, 390527, 392195, 395138, 398724, 402259]
62385D02259L197K971L059L446L927M239M357M578N253O440P849R132J0180J1099
62371D81986J1961J2684J3275J4031J5189J6486J7459J8335K0097K3328K7292
62360F72123L0793L3637L6580L9899M2848M4877M6543M8562N0376N0524M8340
62349A145102M4574M0150L4920K8086J9563J0403J939n283j1578j7412k2820k7458
62337A240186l1070l3819l6142l8332m0186m1078m0462l8334l5184l1531k7673
62326H46375k3933k0758j8356j6439j4737j3602j3625j4664j5759j6218j6331
62315F61953j6743j7458j7888j7662j7032j6477j6152j5742j4677j2654j0045
62304D89423p744o400n911n683n252m483l471k426j549q51j81M71R17J153J462
$$ y = [402259, 405456, 408427, 411486, 414932, 418859, 423098, 427455, 432033, 437286, 443726, 451575, 460707, 470887, 481986, 493947, 506631, 519906, 533937, 549126, 565612, 583071, 601406, 621503, 644831, 672123, 702916, 736553, 773133, 813032, 855880, 900757, 947300, 995862, 1046238, 1096762, 1145102, 1189676, 1229826, 1264746, 1292832, 1312395, 1322798, 1324737, 1319454, 1307876, 1290464, 1267644, 1240186, 1209116, 1175297, 1139155, 1100823, 1060637, 1019559, 979097, 940763, 905579, 874048, 846375, 822442, 801684, 783328, 766889, 752152, 738550, 724925, 710261, 694502, 678284, 661953, 645210, 627752, 609864, 592202, 575170, 558693, 542541, 526799, 512122, 499468, 489423, 481679, 475279, 469368, 463685, 458433, 453950, 450479, 448053, 446504, 445653, 445472, 445943, 446860, 448013, 449475]
62289D49475J953K383K641L040L756M412M730N142O118P169P381O827O623P412
62275E19062Q641R540J0130J0851J1877J3225J4997J6952J8351J8896J9463K1199
62263F93184K4081K7030K9407L1682L4465L7502M0052M1858M3388M5210M7382
62252A095241M9312N0031M8740M5393M0703L5394K9430K2275J3835M876l688j1616
62240A419926j9112k5980l1633l6053m0188m4901m9734n3223n4435n3778n2263
62229I58626n0339m7686m3944l9356l4658l0486k6947k3808k0944j8426j6186
62218F05846j3991j1903j0393r615q909p539n761m502m076l828l153k253j610
62205E18313j298j119j000q78n74l0O39J474K704M087M846M661M295M687N761
$$ y = [449475, 451428, 453811, 456452, 459492, 463248, 467660, 472390, 477532, 483650, 490819, 498200, 505027, 511650, 519062, 527703, 537243, 547373, 558224, 570101, 583326, 598323, 615275, 633626, 652522, 671985, 693184, 717265, 744295, 773702, 805384, 839849, 877351, 917403, 959261, 1002649, 1047859, 1095241, 1144553, 1194584, 1243324, 1288717, 1329420, 1364814, 1394244, 1416519, 1430354, 1435230, 1431542, 1419926, 1400814, 1374834, 1343201, 1307148, 1266960, 1222059, 1172325, 1119102, 1064667, 1010889, 958626, 908287, 860601, 816657, 777301, 742643, 712157, 685210, 661402, 640458, 622032, 605846, 591855, 579952, 569559, 559944, 551035, 543496, 537735, 533233, 529157, 525329, 522176, 519923, 518313, 517015, 515896, 514896, 514018, 513444, 513414, 514053, 515527, 518231, 522318, 527164, 531825, 536120, 540807, 546568]
62190E46568O730P267P745Q496R467J0512J1430J1810J1420J0775J0682J1161
62178F64063J1431J1031J0450J0315J0610J0929J1128J1373J1899J3086J5468
62167G91783J9162K3395K6928K9101L0329L1639L3622L5795L6949L6200L3570
62156A128473K9426K3738J6411Q188N32n609j0474j4768j8791k2448k5555k7816
62144A081307k8962k9306k9677l0322l0327k8725k5823k2779k0095j7327j4245
62133H03719j1442r532q276o947n249l604k661k715l478m233m325l599k340r18
62119G34400L61J221J491J271P95J14q65k126l468m653n428n589n298n200n850
62104G01176p055q205r043r686r977r460q148o665n371l916k017j76R16J360J951
$$ y = [546568, 553298, 560565, 568310, 576806, 586273, 596785, 608215, 620025, 631445, 642220, 652902, 664063, 675494, 686525, 696975, 707290, 717900, 728829, 739957, 751330, 763229, 776315, 791783, 810945, 834340, 861268, 890369, 920698, 952337, 985959, 1021754, 1058703, 1094903, 1128473, 1157899, 1181637, 1198048, 1206236, 1206768, 1201159, 1190685, 1175917, 1157126, 1134678, 1109123, 1081307, 1052345, 1023039, 993362, 963040, 932713, 903988, 878165, 855386, 835291, 817964, 803719, 792277, 782745, 774469, 767522, 762273, 758669, 756008, 753293, 749815, 745582, 741257, 737658, 735318, 734400, 734761, 735982, 737473, 738744, 739539, 739653, 738788, 736662, 733194, 728541, 723113, 717524, 712226, 707026, 701176, 694121, 685916, 676873, 667187, 657210, 647750, 639602, 632937, 627566, 623650, 621633, 621457, 622373, 623733, 625684]
62089F25684L215M890O269O790O446N807N612O125P070Q203R518J0886J1967J2818
62075G31300J4056J5963J7938J9324K0357K1640K3070K3984K4233K4284K4428
62064I60577K4555K4755K5346K6198K6692K6460K5601K4053K1389J7421J2405
62053A215452O546m4o716j2354j6537j9977k3492k7073l0320l3157l5548l7160
62041I79620l7957l8612l9571m0090l8998l6289l3149l0496k8174k5625k2776
62030F07883k0032j7807j6215j4990j3670j2082j0510r243q186p253o749o829
62018D64317o861o077m717l857m024m622m798m263l114j549q6N58K62j58J89J295
62002D22495K517L470M301N175N882O022N487M660M076L750L077J620j45j299
$$ y = [625684, 628899, 633789, 640058, 646848, 653294, 659101, 664713, 670838, 677908, 686111, 695629, 706515, 718482, 731300, 745356, 761319, 779257, 798581, 818938, 840578, 863648, 887632, 911865, 936149, 960577, 985132, 1009887, 1035233, 1061431, 1088123, 1114583, 1140184, 1164237, 1185626, 1203047, 1215452, 1221998, 1221954, 1215238, 1202884, 1186347, 1166370, 1142878, 1115805, 1085485, 1052328, 1016780, 979620, 941663, 903051, 863480, 823390, 784392, 748103, 714954, 684458, 656284, 630659, 607883, 587851, 570044, 553829, 538839, 525169, 513087, 502577, 493334, 485148, 477895, 471146, 464317, 457456, 451379, 446662, 442805, 438781, 434159, 429361, 425098, 421984, 420435, 420349, 420907, 421169, 421011, 421200, 422495, 425012, 428482, 432783, 437958, 443840, 449862, 455349, 460009, 464085, 467835, 470912, 472532, 472387, 471088]
61988D71088j593j676k200l216m446n594o278o242n849n793o122o146n551m909
61974D05473m645m265l250k107j715k014k215k015j745j549j233q97q89j088r52
61959C74894m12L1J98M53Q78J011P28O29J085J648J892K220L179M498N550O387
61943D04869P444Q515Q882Q511Q237Q570R078R236R251R580J0115J0380J0247
61930E22915R951R552Q881P927O882N772M441L000J796R00n8j256k221k430k101
61915E73951j947k157k122j337j26R12J834L249N293P232Q338Q686Q799Q717P973
61900F27295O443M679L171J661l91k865n082o756q248r715j0623j0576j0189j0327
61886E68477j0756j0326q656o830n982n948n878n635n730o149o247n864n718o271
$$ y = [471088, 469495, 467819, 465619, 462403, 457957, 452363, 446085, 439843, 433994, 428201, 422079, 415933, 410382, 405473, 400828, 396563, 393313, 391206, 389491, 387477, 385262, 383247, 381502, 379953, 378720, 377823, 376934, 375846, 374894, 374482, 374513, 374711, 375164, 376042, 377053, 377781, 378410, 379495, 381143, 383035, 385255, 388434, 392932, 398482, 404869, 412313, 420828, 429710, 438221, 446458, 455028, 464106, 473342, 482593, 492173, 502288, 512668, 522915, 532866, 542418, 551299, 559226, 566108, 571880, 576321, 579321, 581117, 582017, 581959, 580703, 578482, 576052, 573951, 572004, 569847, 567725, 566388, 566262, 567174, 569008, 572257, 577550, 584782, 593120, 601806, 610605, 619322, 627295, 633738, 638417, 641588, 643249, 642858, 639993, 634911, 628155, 619907, 610192, 599569, 588993, 578804, 568477, 557721, 547395, 538739, 531909, 525927, 519979, 514101, 508466, 502736, 496587, 490340, 484476, 478758, 472487]
61872D72487o950o877n929m635l390k258j249l09P51J935K918L629M671O551Q714
61857D70059J0055J0382J0623J1501J2733J3812J4814J5917J6761J6990J7025
61846F20672J7537J8365J8652J8012J6880J5579J3742J0939P455M081J309r62
61834G62261l082n172o922p800p536o373m746k872q61R49K211L102M107N279O100
61819G38645O202N637M335J935j477n078q218j1098j3993j6325j7354j7365j7301
61806F48545j7320j6701j5212j3685j2897j2594j2064j1066r782q360o919n655
61794E06290m579l518k631k490l231m103m380m286m400m573m163l143k186j695
61780D56912j501j537k025k754k989k434j701j390j293r87o75p53j003r07n13
$$ y = [472487, 465537, 458660, 452731, 448096, 444706, 442448, 441199, 440890, 441641, 443576, 446494, 450123, 454794, 461345, 470059, 480114, 490496, 501119, 512620, 525353, 539165, 553979, 569896, 586657, 603647, 620672, 638209, 656574, 675226, 693238, 710118, 725697, 739439, 750378, 757833, 761914, 763223, 762261, 759179, 754007, 747085, 739285, 731749, 725376, 720630, 717758, 716897, 717846, 720057, 723159, 727266, 732545, 738645, 744847, 750484, 754819, 756754, 755277, 750199, 741981, 730883, 716890, 700565, 683211, 665846, 648545, 631225, 614524, 599312, 585627, 572730, 560136, 548072, 537006, 527224, 518864, 511945, 506290, 501711, 498193, 495562, 493072, 489841, 485738, 481358, 477072, 472672, 468099, 463936, 460793, 458607, 456912, 455411, 453874, 451849, 449095, 446106, 443672, 441971, 440581, 439288, 438301, 437626, 436873, 435870, 434963, 434450]
61765D34450k28Q3R21J974K117R67l06l17Q56K015K468K497K429K064J280N45
61749D53815L65N98O43J47p38j617k174k349k412k712l176l221k415j106j31P4
61733D33591j57k00J91P18R33P64O46J050J832K290J989J281Q17Q10J051J386
61717D48992J697J632Q88j39o08k28L50L61k50j031j652k052k299k579l167m030
61701D35885m699m748m292l745l326l126l336l951m411m082l169k620k960l638
61687C83782l784l220k480k054k021k222k432k395k027j630j580j770j667j037
61673C53463k72J71L56N54O56L48j98m03j07J75N5r3K72R48J134M21p03j357j015
61654C54405J85J583K449K523K118J677J366J208J318J663J900J826J792K150
$$ y = [434450, 434222, 434305, 435226, 437200, 439317, 440284, 439978, 439661, 440517, 442532, 445000, 447497, 449926, 451990, 453270, 453815, 454180, 454778, 455421, 455568, 454830, 453213, 451039, 448690, 446278, 443566, 440390, 437169, 434754, 433648, 433517, 433591, 433434, 433234, 433425, 434143, 435076, 435840, 436486, 437536, 439368, 441658, 443647, 444928, 445745, 446555, 447606, 448992, 450689, 452321, 453209, 453070, 452462, 452234, 452584, 452945, 452695, 451664, 450012, 447960, 445661, 443082, 439915, 435885, 431186, 426438, 422146, 418401, 415075, 411949, 408613, 404662, 400251, 396169, 393000, 390380, 387420, 383782, 379998, 376778, 374298, 372244, 370223, 368001, 365569, 363174, 361147, 359517, 357937, 356167, 354500, 353463, 353191, 353362, 353718, 354272, 354928, 355276, 355078, 354675, 354568, 354743, 354798, 354705, 354977, 355925, 357059, 357480, 356777, 355420, 354405, 354590, 356173, 358622, 361145, 363263, 364940, 366306, 367514, 368832, 370495, 372395, 374221, 376013, 378163]
61640C78163K479K038R66K83M99R08N76n14j692k522l001l170l011k594j982j188
61624C66238m41k78r71k032k647k513k009j593j361j182j041j142j704k596l292
61609C41436l403l148l028l133l162l038k933k702k082j540j969l222l861l068
61595C01147j874j627k110k255k072k400l085k912j546j23L91L00J61j72q38j275
61579B79710j024n40m95p41p26m43k84k71j41N4M3j05p5J31K70L32N31Q57J087
61560B78170J178J238J133N31n65j570j672m56J606L201L156J662J84j52K93N73
61544B88510O13R60J498J451O88N9J24M47N66Q14J553K205J918Q73J18J86N65
61527C03148N91K30j41k90k04n2j64p34j395j497j000o93j227k212k653k074q58
$$ y = [378163, 380642, 382680, 383646, 383929, 384428, 385336, 385912, 385398, 383706, 381184, 378183, 375013, 372002, 369408, 367426, 366238, 365797, 365519, 364548, 362516, 359869, 357356, 355347, 353754, 352393, 351211, 350170, 349028, 347324, 344728, 341436, 338033, 334885, 331857, 328724, 325562, 322524, 319591, 316889, 314807, 313267, 311298, 308076, 304215, 301147, 299273, 297646, 295536, 293281, 291209, 288809, 285724, 282812, 281266, 281143, 281534, 281834, 281995, 281823, 280985, 279710, 278686, 278146, 277651, 276910, 276184, 275741, 275457, 275186, 275045, 275099, 275142, 275037, 274962, 275093, 275363, 275695, 276226, 277083, 278170, 279348, 280586, 281719, 282250, 281685, 280115, 278443, 277987, 279593, 282794, 285950, 287612, 287796, 287644, 287937, 288510, 289123, 290083, 291581, 293032, 293720, 293779, 293903, 294350, 294916, 295730, 297283, 299488, 301406, 302279, 302397, 302583, 303148, 303739, 303969, 303828, 303538, 303334, 303282, 303118, 302384, 300989, 299492, 298492, 297799, 296572, 294360, 291707, 289633, 288775]
61510B88775L29J067J215Q30J54n39j048j119m88N80J170O55l22n30K10P49K11
61493B91899q62j363j004k73M40J003J173P79J63j98l75p26j065p38M04J718K598
61476B93573L000K976K348J210K93K85R91J548J429R13N64N22M14l7n10l82M30
61459C09567J211J284Q57O27P13N46j69r19j030m49L38Q46Q39M00j7J36R31J806
61441C17517K131J804J192P38P34J181J716J850J426O76j30p97r54k63Q81J379
61425C31081N85q27j546j041P1Q59R06M48M5K19J139K479L601L869K985J272l43
61408C45802j042r00p43j081j603j875k019k334k615k399j715j104r49j112j217
61393C23094r95m45J09K31q6k95L2N76P61O42Q23J436J808J360M27j30M0N30Q90
$$ y = [288775, 289104, 290171, 291386, 292216, 292370, 291831, 290783, 289664, 289176, 289756, 290926, 291581, 291259, 290729, 290939, 291688, 291899, 291037, 289674, 288670, 288397, 288837, 289840, 291013, 291792, 291955, 291757, 291382, 290656, 289591, 288853, 289257, 290975, 293573, 296573, 299549, 301897, 303107, 303400, 303685, 304676, 306224, 307653, 308566, 309130, 309652, 310066, 310029, 309519, 309137, 309567, 310778, 312062, 312919, 313546, 314259, 314805, 314636, 313717, 312687, 312238, 312576, 313422, 314261, 314661, 314644, 314780, 315711, 317517, 319648, 321452, 322644, 323382, 324116, 325297, 327013, 328863, 330289, 330965, 330835, 330038, 329084, 328821, 329702, 331081, 331666, 330839, 329293, 328252, 328323, 329182, 330088, 330536, 330581, 330800, 331939, 334418, 338019, 341888, 344873, 346145, 345802, 344760, 343860, 343117, 342036, 340433, 338558, 336539, 334205, 331590, 329191, 327476, 326372, 325423, 324311, 323094, 322099, 321654, 321763, 321994, 321908, 321613, 321645, 322221, 322982, 323624, 324447, 325883, 327691, 329051, 329478, 329348, 329388, 329918, 330808]
61374C30808J204J737K248K168J485J023J439K247K396J687J007J109J736K165
61360C54459K037J481Q84Q31J710L080L948M021M093M765N435N286M690M809O051
61345D07580P653Q606Q369O957N042L669L141K481Q42r62j324j41J023J095O40
61330D54671N07N15J31m69q30j113j708k375k460j802q72j72J38K08M04J056K079
61313D47908L075L914M867O078P311Q377R329J0010J0056R610R456R959J0475
61300E50425J0252R381Q258O751M641K434P87n94k555n045o995p734p738p753
61286E54515p865p758p374o949o727o771o862o438n111l282j884j319j035l61
61272D84779O46J488J988K401K944L488L710L396K654J963J855K409L236L942
$$ y = [330808, 332012, 333749, 335997, 338165, 339650, 340673, 342112, 344359, 346755, 348442, 349449, 350558, 352294, 354459, 356496, 357977, 358861, 359692, 361402, 364482, 368430, 372451, 376544, 381309, 386744, 392030, 396720, 401529, 407580, 415233, 423839, 432208, 439165, 444207, 447876, 451017, 453498, 454340, 453378, 452054, 451913, 452936, 454031, 454671, 455178, 455693, 455824, 455355, 454525, 453412, 451704, 449329, 446869, 445067, 444195, 444023, 444161, 444369, 444773, 445829, 447908, 450983, 454897, 459764, 465842, 473153, 481530, 490859, 500869, 510925, 520535, 529991, 539950, 550425, 560677, 570058, 578316, 585067, 589708, 592142, 592929, 592335, 589780, 584735, 577740, 570006, 562268, 554515, 546650, 538892, 531518, 524569, 517842, 511071, 504209, 497771, 492660, 489378, 487494, 486175, 485140, 484779, 485425, 486913, 488901, 491302, 494246, 497734, 501444, 504840, 507494, 509457, 511312, 513721, 516957, 520899]
61258E20899M450M801M900M741M585M685M870M688L871K553J091j11o99o22k70
61243E64432k03o31j236j609j644j485j252r65o76m58l28k97m09o47p29k88P10
61226E52285J881K852L580M177M645N010N436N940O116N638M905M764N504O505
61212F19238P009O831O200N370M634M351M571M898M967M827M582M119L558L562
61198F88717M534N821O490O713P638R694J1863J2979J3103J3034J2871J1821R435
61185H14713O408L939K524J690P22n69j942l206m372n283n578n202m712m733n351
61170G89048o272p340q488r412r775r747r802j0048j0191j0195j0440j1076j1738
61157F64524j2020j1803j1059r878q815q497q599p905n847l426j999j713j716
$$ y = [520899, 525349, 530150, 535050, 539791, 544376, 549061, 553931, 558619, 562490, 565043, 566134, 566023, 565324, 564702, 564432, 564229, 563598, 562362, 560753, 559109, 557624, 556372, 555407, 554731, 554273, 553945, 553648, 553239, 552592, 551863, 551575, 552285, 554166, 557018, 560598, 564775, 569420, 574430, 579866, 585806, 591922, 597560, 602465, 607229, 612733, 619238, 626247, 633078, 639278, 644648, 649282, 653633, 658204, 663102, 668069, 672896, 677478, 681597, 685155, 688717, 693251, 699072, 705562, 712275, 719913, 729607, 741470, 754449, 767552, 780586, 793457, 805278, 814713, 821121, 825060, 827584, 829274, 829996, 829427, 827485, 824279, 819907, 814624, 809046, 803844, 799132, 794399, 789048, 782776, 775436, 766948, 757536, 747761, 738014, 728212, 718164, 707973, 697778, 687338, 676262, 664524, 652504, 640701, 629642, 619764, 610949, 602452, 593853, 585948, 580101, 576675, 574676, 572963, 571247]
61144E71247j473j138r74j211k204l960n579n932m991l801l136k793k259j373
61130E30423k11J081K199K956L818N508P905R999J1219J2207J3878J6206J8367
61117F35555J9708K0239K0463K1039K2248K3592K4240K4034K3580K3221K2611
61106H80530K1611K0802K0479J9820J7910J5116J2598J0713Q801O300L264j87
61094A037757m037p958j1417j4307j6833j8835j9981k0536k1134k1683k1449k0391
61082H39196j9419j8935j8156j6569j5082j4773j5128j4658j2935j0910r313p807
61070F65511n945m046k652j698p32M41J735L132M643O029O941P343P604Q166R248
61055G05720J0731J2244J3420J4302J5397J7142J9330K1307K2706K3800K5037
$$ y = [571247, 569774, 568636, 567662, 566451, 564247, 560287, 554708, 548776, 543785, 539984, 536848, 534055, 531796, 530423, 530212, 531293, 533492, 536448, 540266, 545774, 553679, 563678, 574897, 587104, 600982, 617188, 635555, 655263, 675502, 695965, 717004, 739252, 762844, 787084, 811118, 834698, 857919, 880530, 902141, 922943, 943422, 963242, 981152, 996268, 1008866, 1019579, 1028380, 1034680, 1037944, 1037757, 1033720, 1025762, 1014345, 1000038, 983205, 964370, 944389, 923853, 902719, 881036, 859587, 839196, 819777, 800842, 782686, 766117, 751035, 736262, 721134, 706476, 693541, 682631, 673318, 665511, 659566, 655520, 652868, 651170, 650438, 650879, 652614, 655746, 660389, 666418, 673359, 680702, 688306, 696472, 705720, 716451, 728695, 742115, 756417, 771814, 788956, 808286, 829593, 852299, 876099, 901136]
61044I01136K6489K7921K9219L0530L2096L4093L6493L8975M1151M3057M5114
61033A286274M7375M9306N0750N2640N5815N9482O2014O3320O5118O8429P2324
61022A932847P5979Q0743Q8698R9938J12758J26061J40141J55313J71395J88906
61012C172779K09785K36700K72200L18118L74462M39056N09292N83828O61622
61003F777842P40972Q22048R08883J003895J099356J178425J225513J229075J170355
60994A6156364J019435P59617M22020Q6535j63613k92496l19727k89167k41766
60985A7137202k17414k63415m17995o76319r78409j239554j398029j439071j383428
60976I123568j263002j107207r41007p83731o45979n29995m34193l56403k93867
$$ y = [901136, 927625, 955546, 984765, 1015295, 1047391, 1081484, 1117977, 1156952, 1198103, 1241160, 1286274, 1333649, 1382955, 1433705, 1486345, 1542160, 1601642, 1663656, 1726976, 1792094, 1860523, 1932847, 2008826, 2089569, 2178267, 2278205, 2390963, 2517024, 2657165, 2812478, 2983873, 3172779, 3382564, 3619264, 3891464, 4209582, 4584044, 5023100, 5532392, 6116220, 6777842, 7518814, 8340862, 9249745, 10253640, 11352996, 12531421, 13756934, 14986009, 16156364, 17175799, 17935416, 18357436, 18443971, 18280358, 17987862, 17668135, 17378968, 17137202, 16919788, 16656373, 16238378, 15562059, 14583650, 13344096, 11946067, 10506996, 9123568, 7860566, 6753359, 5812352, 5028621, 4382642, 3852647, 3418454, 3062051, 2768184]
60967B768184k43340k02680j71102j47343j28976j14013j01815r1782q2617p3640
60957A410876o5596n9126n3462m7567m1688l6776l3059l0211k8244k7223k6548
60946I61376k5508k4207k3118k2057k0486j8532j6901j5905j5348j5082j5018
60935G49214j4735j3891j2933j2660j3056j3282j2856j2195j1833j1649j1138
60924F08986j0101q816p726o998o418n714n022m696m604m102k985j959j657j672
60910E36516j203k24O24J095J464J771J756J527J595K071K431K269J796J413J223
60895E56124J020N32m19j589k386k615k994m267n980o920o800o641p218q032q282
60880D93533q075p997q022p674o978o485o394o272n704m783l877l256k965k793
$$ y = [2768184, 2524844, 2322164, 2151062, 2003719, 1874743, 1760730, 1658915, 1567133, 1484516, 1410876, 1345280, 1286154, 1232692, 1185125, 1143437, 1106661, 1073602, 1043391, 1015147, 987924, 961376, 935868, 911661, 888543, 866486, 846000, 827468, 810567, 794662, 779314, 764232, 749214, 734479, 720588, 707655, 694995, 681939, 668657, 655801, 643606, 631773, 620124, 608986, 598885, 590069, 582343, 575345, 568927, 563213, 558191, 553495, 548891, 544789, 541804, 539845, 538188, 536516, 535313, 535089, 535713, 536808, 538272, 540043, 541799, 543326, 544921, 546992, 549423, 551692, 553488, 554901, 556124, 557144, 557676, 557257, 555668, 553282, 550667, 547673, 543406, 537426, 530506, 523706, 517065, 509847, 501815, 493533, 485458, 477461, 469439, 461765, 454787, 448302, 441908, 435636, 429932, 425149, 421272, 418016, 415051, 412258]
60866D12258k324j392m48j70n63p75o3J361K639L237L325L286L233L108K964K883
60850D32559K746K322J675J212J317J915K484K466J730P32J65L25Q33J088Q72
60835D54441L20n31j738k977l589l331k756k574k874l242l389l293k905k191j392
60820D17979q84p74q98j191j720k384k918l290l714m120m015l163k197k076k965
60805C81670l975m210l802l615m043m535m387l623k777k090j377o09j18j07l66
60790C42036o54r63j242j217q12l85k88l43j01N53J325J889K090J923J617J608
60774C47036K163L056L814M159M077L608K876K219J968K121K323K224J724R90
60760C84358L04j56n11r80j540j940k088k116k046j809j616j805k190k115j410
$$ y = [412258, 409934, 408542, 408094, 407924, 407361, 406586, 406523, 407884, 410523, 413760, 417085, 420371, 423604, 426712, 429676, 432559, 435305, 437627, 439302, 440514, 441831, 443746, 446230, 448696, 450426, 451158, 451323, 451648, 452481, 453569, 454441, 454761, 454230, 452492, 449515, 445926, 442595, 439839, 437265, 434391, 431149, 427760, 424467, 421562, 419371, 417979, 417095, 416321, 415423, 414232, 412512, 410128, 407210, 403920, 400206, 396086, 392071, 388908, 386711, 384635, 381670, 377695, 373485, 369683, 366068, 362025, 357490, 353103, 349480, 346703, 344613, 343236, 342627, 342509, 342402, 342036, 341382, 340419, 339177, 337960, 337148, 336763, 336475, 336132, 336031, 336584, 337909, 339798, 341888, 343811, 345428, 347036, 349199, 352255, 356069, 360228, 364305, 367913, 370789, 373008, 374976, 377097, 379420, 381644, 383368, 384358, 384662, 384506, 383995, 383015, 381475, 379535, 377447, 375331, 373285, 371476, 369860, 368055, 365865, 363750, 362340]
60745C62340o92m00j69L22N27j92j498k556l208l812m247l985l142k547k709l379
60729C30653m153m747m643l363j336J89M38j63p18p94m56Q8N63Q00R95J380J700
60712C16433J468Q38N80J005J554J656J443J264J121R02P93J003J446J921K313
60697C35740K454K199J784J661J821J824J586J567J951K278K232K107K112J883
60683C63199J204N62M10M81L92L95P27Q41J49p96q60M1Q15O85m4q38j660k538
60665C63165l087l020k666k594k870l038k713j977j217p31m69j59L05P36R68J118
60649C41751J323J412J189Q49Q18J134J343J093N10n3m51p91j234j785k246k388
60633C42474k219j994j830j510q11M6N72N47J51l12o10n42k4P22J260J341J122
$$ y = [362340, 361648, 361248, 361079, 361401, 361928, 361736, 360238, 357682, 354474, 350662, 346415, 342430, 339288, 336741, 334032, 330653, 326500, 321753, 317110, 313747, 312411, 312600, 313038, 312875, 312157, 311363, 310907, 310995, 311558, 312358, 313353, 314733, 316433, 317901, 318739, 319319, 320324, 321878, 323534, 324977, 326241, 327362, 328264, 329057, 330060, 331506, 333427, 335740, 338194, 340393, 342177, 343838, 345659, 347483, 349069, 350636, 352587, 354865, 357097, 359204, 361316, 363199, 364403, 364965, 365375, 365856, 366248, 366643, 367370, 368211, 368360, 367564, 366704, 366745, 367560, 368245, 368201, 367363, 365703, 363165, 360078, 357058, 354392, 351798, 348928, 345890, 343177, 341200, 339983, 339252, 338783, 338624, 338929, 339665, 340633, 341751, 343074, 344486, 345675, 346524, 347342, 348476, 349819, 350912, 351422, 351369, 350918, 350127, 348893, 347108, 344862, 342474, 340255, 338261, 336431, 334921, 334110, 334156, 334728, 335275, 335426, 335114, 334504, 333962, 333938, 334660, 335920, 337261, 338383]
60616C38383R42R33R38P48M68M63P79Q06n3j381j959j234n0M97M61O43J199J490
60598C44073J217Q33O25K00o44j183n98P95J829J878J433J130Q23P7q47j042j29
60581C50470J170J943K204K624L355L806L697L623M169N044N649O090O894P943
60567D08681Q538Q545Q690R384R967R620Q426O992N325K906k42l260n383o626
60553D71563p262p118n896l910j959l86J182L006M666N712O510P792R494J0772
60539D94166J1352J2103J3748J5545J6081J5080J3612J2454J1125Q966O332L964
60527F34528J728j042m071o081o478o300o803p757p938o997n899n409n084m130
60513E62267k584j115j5J040K468M466O959R494J1428J2734J4352J7158K0765
$$ y = [338383, 339325, 340258, 341196, 341944, 342412, 342875, 343654, 344460, 344407, 343026, 341067, 339833, 339783, 340280, 340741, 341384, 342583, 344073, 345290, 346123, 346748, 346948, 346304, 345121, 344523, 345318, 347147, 349025, 350458, 351588, 352411, 352488, 351641, 350599, 350470, 351640, 353583, 355787, 358411, 361766, 365572, 369269, 372892, 377061, 382105, 387754, 393844, 400738, 408681, 417219, 425764, 434454, 443838, 453805, 463425, 471851, 478843, 484168, 487074, 486832, 483572, 478189, 471563, 464301, 457183, 451287, 447377, 445418, 445032, 446214, 449220, 453886, 459598, 466108, 473900, 483394, 494166, 505518, 517621, 531369, 546914, 562995, 578075, 591687, 604141, 615266, 624232, 630564, 634528, 636256, 635214, 631143, 625062, 618584, 612284, 605481, 597724, 589786, 582789, 576890, 571481, 566397, 562267, 559683, 558568, 558553, 559593, 562061, 566527, 573486, 582980, 594408, 607142, 621494, 638652, 659417]
60500F59417K4029K6635K9369L2710L5963L8160L9142L9256L8504L6577L3426
60489A033188K9331K4451J8691J1881L970m758j3539k1504k8442l4758m0456m4678
60477I33377m6688m6921m6376m5274m2977l9226l4802l0799k7617k4909k2198
60466E25590j9372j6696j4419j2470j0617q893p612o792n979m885l855l404l486
60453D07110l643l617l428l077k640k455k728l073k904k249j689j515j469j324
60439C71299j203j254j351j338j207j029r01r90j287j403r83l24j23n33r48p88
60423C55637j66L95N17J55m10o09J4J214K123K108J369O32M79J000J790K186J838
60406C70272J157Q97J212J461J102L60j60j53L14J042J670J719J062K44J5O10
$$ y = [659417, 683446, 710081, 739450, 772160, 808123, 846283, 885425, 924681, 963185, 999762, 1033188, 1062519, 1086970, 1105661, 1117542, 1121512, 1116754, 1103215, 1081711, 1053269, 1018511, 978055, 933377, 886689, 839768, 793392, 748118, 705141, 665915, 631113, 600314, 572697, 547788, 525590, 506218, 489522, 475103, 462633, 452016, 443123, 435511, 428719, 422740, 417855, 414000, 410596, 407110, 403467, 399850, 396422, 393345, 390705, 388250, 385522, 382449, 379545, 377296, 375607, 374092, 372623, 371299, 370096, 368842, 367491, 366153, 364946, 363917, 363016, 362026, 360739, 359336, 358353, 358029, 357906, 357373, 356425, 355637, 355471, 355866, 356383, 356538, 356128, 355519, 355533, 356747, 358870, 360978, 362347, 362979, 363458, 364458, 366248, 368434, 370272, 371429, 372326, 373538, 374999, 376101, 376461, 376301, 376148, 376462, 377504, 379174, 380893, 381955, 382199, 382214, 382824]
60390C82824J650K584K980K624J737J034J183K067K790K570J563O98P43J563K360
60375D10970K520K192J976K228K738K961K456J298K13J01J059K094K146J304N77
60360D36833N96J125J787K591L424L725L178K403K354L161L958L886K944J906
60346D73871J497J687J717R47l72j411j829k068k528k945k912k508k011j416p45
60331D58974m28q19j547j941j926j917j976j750j219q00o47m53q8K11M85J156
60315D45315K216L000L253L753N229P174Q526R174R893J0932J1568J1223J0201
60302E41457R057P918O761N733M620K654n79m286p246r182j0756j2248j3007j2359
60288E08537j0511q266o261m709l598k826k268j854j456p90K21J007P46n86j989
$$ y = [382824, 384474, 387058, 390038, 392662, 394399, 395433, 396616, 398683, 401473, 404043, 405606, 406304, 407047, 408610, 410970, 413490, 415682, 417658, 419886, 422624, 425585, 428041, 429339, 429552, 429653, 430712, 432806, 434952, 436256, 436833, 437429, 438554, 440341, 442932, 446356, 450081, 453259, 455662, 458016, 461177, 465135, 469021, 471965, 473871, 475368, 477055, 478772, 479719, 479347, 477936, 476107, 474039, 471511, 468566, 465654, 463146, 461135, 459719, 458974, 458546, 457727, 456180, 454239, 452313, 450396, 448420, 446670, 445451, 444651, 444004, 443551, 443463, 443674, 444159, 445315, 447531, 450531, 453784, 457537, 462766, 469940, 478466, 487640, 497533, 508465, 520033, 531256, 541457, 550514, 558432, 565193, 570926, 575546, 578200, 577621, 573335, 566089, 556907, 546151, 533903, 520896, 508537, 498026, 489760, 483499, 478790, 475192, 472366, 470098, 468244, 466788, 465998, 466219, 467226, 467972, 467386, 465397]
60273D65397k562k476k446k682k846k857k999l272l203k540j708j258j159r52
60259D32437n13l41r64k155k940k507j081K53O65L11n5L0M38Q16R38P60M67M12
60241D26971P80J242J180L84o30j097p73j39J59L8L1N93J495K080K066J749J496
60224D37625J370J356J555J991K498K988L526M001M145M032M146M713N376N849
60210D85171O335O915P117O721O409O879P706P952P629P513P722P504O515N396
60196E83484M759M503M338M270M113L308J704J0j017j404j686k194k913l622l959
60181E93694l776l615m232n488o353o310o035o262o658o513n904n411n060m337
60167E17740l076j722p68m07n87r93j179j066j072j358j380o82K45N73L22K34
$$ y = [465397, 462835, 460359, 457913, 455231, 452385, 449528, 446529, 443257, 440054, 437514, 435806, 434548, 433389, 432437, 431924, 431583, 430619, 428464, 425524, 423017, 421936, 422189, 422854, 423165, 423110, 423140, 423578, 424394, 425332, 426092, 426559, 426971, 427751, 428993, 430173, 430557, 429927, 428830, 428057, 427918, 428077, 428115, 428146, 428739, 430234, 432314, 434380, 436129, 437625, 438995, 440351, 441906, 443897, 446395, 449383, 452909, 456910, 461055, 465087, 469233, 473946, 479322, 485171, 491506, 498421, 505538, 512259, 518668, 525547, 533253, 541205, 548834, 556347, 564069, 571573, 578088, 583484, 588243, 592746, 597084, 601354, 605467, 608775, 610479, 610489, 609472, 608068, 606382, 604188, 601275, 597653, 593694, 589918, 586303, 582071, 576583, 570230, 563920, 557885, 551623, 544965, 538452, 532548, 527137, 522077, 517740, 514664, 512942, 512174, 511767, 511180, 510187, 509008, 507942, 506870, 505512, 504132, 503450, 503695, 504268, 504590, 504824]
60151E04824O64J327K011K708L096K693J734J181J594K563L498M327N146N798
60137E43164O244O956Q256R611J0115R667R151R337R968J0124R313P963O828O136
60123F62833N464M416L132J990J049Q8q90j541j616j240o87j12L27L57j63r34
60107F72473j399j299r59r66j561k431l098l426l663m011m408m723m992n246n260
60092F25031m772l934l312l294l633l670k932j516J18J579K765L622L921L539
60078F13512K912K876L711M633M532L238J624M18o80k418m878p404r500j1247
60064F01329j2697j3388j2956j1827j0751r824q595p118o100n802n520m634l500
60051D88617k697j953o74Q39J658J695J945L087M569N406N338M874M648M927N408
$$ y = [504824, 505488, 506815, 508826, 511534, 514630, 517323, 519057, 520238, 521832, 524395, 527893, 532220, 537366, 543164, 549408, 556364, 564620, 574231, 584346, 594013, 603164, 612501, 622469, 632593, 641906, 649869, 656697, 662833, 668297, 672713, 675845, 677835, 678884, 678972, 678082, 676541, 674925, 673685, 672998, 672886, 673213, 673570, 673407, 672473, 671074, 669775, 668816, 667850, 666289, 663858, 660760, 657334, 653671, 649660, 645252, 640529, 635537, 630291, 625031, 620259, 616325, 613013, 609719, 606086, 602416, 599484, 597968, 598086, 599665, 602430, 606052, 609973, 613512, 616424, 619300, 623011, 627644, 632176, 635414, 637038, 637456, 636776, 634358, 629480, 622076, 612576, 601329, 588632, 575244, 562288, 550461, 539710, 529886, 521291, 514173, 508073, 502271, 496751, 492117, 488617, 485920, 483967, 483293, 484132, 485790, 487485, 489430, 492517, 497086, 502492, 507830, 512704, 517352, 522279, 527687]
60036E27687N405M622L717L573M047M129L386K431J729Q99m03j716k566l271m342
60021E49327n595o547p224p881q369q447q351q429q530q376q117p886p214n665
60007D42696l759k517k315k778l467l891l310j563K17P20K21J52R98J786J821
59992D25011J685K016K429K366K200K642L522L996L760L423L652M339M648L905
59978D69594K405J200Q80Q58L09m86n77L4K30n80j578j768j143j85J025K477L706
59961D76401M314M592M975N347N488N702O226O502N858M580L428K370Q27j031
59947E35579k291k703l053l868m690m996n017n110n030m494l831l493l284k783
59933D80936k140j841j867j728j239n94J88J273K456L279L747M367N253N824N678
$$ y = [527687, 533092, 537714, 541431, 545004, 549051, 553180, 556566, 558997, 560726, 561625, 561222, 559506, 556940, 553669, 549327, 543732, 537185, 529961, 522080, 513711, 505264, 496913, 488484, 479954, 471578, 463461, 455575, 448361, 442696, 438937, 436420, 434105, 431327, 427860, 423969, 420659, 419096, 419313, 420033, 420254, 420406, 421404, 423190, 425011, 426696, 428712, 431141, 433507, 435707, 438349, 441871, 445867, 449627, 453050, 456702, 461041, 465689, 469594, 471999, 473199, 474079, 474937, 475246, 474760, 474183, 474217, 474447, 473867, 472289, 470521, 469378, 469193, 470218, 472695, 476401, 480715, 485307, 490282, 495629, 501117, 506819, 513045, 519547, 525405, 529985, 533413, 535783, 536610, 535579, 533288, 530585, 527532, 523664, 518974, 513978, 508961, 503851, 498821, 494327, 490496, 487003, 483719, 480936, 478796, 476955, 475088, 473360, 472121, 471527, 471715, 472988, 475444, 478723, 482470, 486837, 492090, 497914, 503592]
59918E03592N203M946M838M439L647K709J875J445J785K794L677L873L950M902
59904E53675O669Q104Q448Q042P457O647N392L943K682J565L79o80j167r53l22
59889F09881L60Q23R60R71J276K037K904L394L474L505L796M323M779M921M892
59874F52296N148N692N693M377K246O38L5l99j309k155k260j969j963k093j817
59859F62160j332j263j553j616j474j738k445k783k193j029J6O69R70R56N38l94
59843F47489j787l172l932m137m545n286n247l596j463q72k222m023n066n567
59829E96574o013o154n689m908m097l116k112j805k466l281l417l065k925l197
59815E44329l691m300m795m647l779l014l092l642l813l510l280l231k911k188
$$ y = [503592, 508795, 513741, 518579, 523018, 526665, 529374, 531249, 532694, 534479, 537273, 540950, 544823, 548773, 553675, 560344, 568448, 576896, 584938, 592395, 599042, 604434, 608377, 611059, 612624, 613003, 612323, 611156, 610203, 609881, 610241, 611064, 612024, 612995, 614271, 616308, 619212, 622606, 626080, 629585, 633381, 637704, 642483, 647404, 652296, 657444, 663136, 668829, 673206, 675452, 676090, 676125, 675726, 674417, 672262, 670002, 668033, 666070, 663977, 662160, 660828, 659565, 658012, 656396, 654922, 653184, 650739, 647956, 645763, 644734, 644750, 645419, 646389, 647345, 647883, 647489, 645702, 642530, 638598, 634461, 629916, 624630, 619383, 615787, 614324, 613452, 611230, 607207, 602141, 596574, 590561, 584407, 578718, 573810, 569713, 566597, 564485, 562680, 560214, 556933, 553516, 550451, 547526, 544329, 540638, 536338, 531543, 526896, 523117, 520103, 517011, 513369, 509556, 506046, 502766, 499535, 496624, 494436]
59801D94436j510j235j166r60n53j18J03%j96l7N55R87O54k89j101j304r92m40
59783D86834R3K57j98r53j252p83j90l98j368j936j041R26K449K593J965J688
59767D88686J917K025J965K501L930N396N957N767N665N997O438O767P275Q301
59753E58587R694J0882J1402J1360J1319J1624J2032J2191J2228J2460J2712J2489
59741F98980J1763J0985J0265R259P857O346M737K700L77j546k896m277n889o998
59727G41663p175p171p744q407q246p417o844o829o982p172p495p555o859n883
59713F39884n678o332o773o292n377m718m254l621k951k657k804l070l090k586
59699E79681j451K0J236J839J977J912J650J121M63l8j92lL92P82R61Q07K87m95
$$ y = [494436, 492926, 491691, 490525, 489565, 489012, 488894, 488997, 488997, 488801, 488764, 489319, 490306, 490960, 490671, 489570, 488266, 487274, 486834, 486927, 487184, 486986, 486033, 484781, 483998, 483808, 483410, 482042, 480106, 479065, 479991, 482440, 485033, 486998, 488686, 490603, 492628, 494593, 497094, 501024, 506420, 512377, 518144, 523809, 529806, 536244, 543011, 550286, 558587, 568281, 579163, 590565, 601925, 613244, 624868, 636900, 649091, 661319, 673779, 686491, 698980, 710743, 721728, 731993, 741252, 749109, 755455, 760192, 762892, 763269, 761723, 758827, 754550, 748661, 741663, 734488, 727317, 719573, 711166, 702920, 695503, 688659, 681830, 674848, 667676, 660181, 652626, 645767, 639884, 634206, 627874, 621101, 614809, 609432, 604714, 600460, 596839, 593888, 591231, 588427, 585357, 582267, 579681, 578230, 578250, 579486, 581325, 583302, 585214, 586864, 587985, 588448, 588410, 588218, 588215, 588607, 589389, 590350, 591157, 591444, 590949]
59681E90949j211j493j360j289j602k043k207k220k582l431m352m883m939m698
59667E52639m373m089l810l379k774k223j902j690j370r67o02k14L35J020J708
59652E28309K323K752K836K697K770L151L185K225O29n31p60o26r12j713k589
59637E43746l323m147n253o180o082m678k820j676j434j338r53p00r25j232j242
59622E01763j380k154l209l762l664l349l054k774k668k795k691j985j119p57
59608D66402o79k01N63Q59O85R53K042L177L493K950J917O72l51o09j64K55K86
59591D82250M07R86J533J347M39o87j660k182j898r31j70m52j545k402k354j665
59575D71016j051r62j333j718j673j104k38O17J124R13k6j006j147m11L33L92
$$ y = [590949, 589738, 588245, 586885, 585596, 583994, 581951, 579744, 577524, 574942, 571511, 567159, 562276, 557337, 552639, 548266, 544177, 540367, 536988, 534214, 531991, 530089, 528399, 527029, 526062, 525460, 525246, 525581, 526601, 528309, 530632, 533384, 536220, 538917, 541687, 544838, 548023, 550248, 550877, 550346, 549586, 548960, 548048, 546335, 543746, 540423, 536276, 531023, 524843, 518761, 514083, 511263, 509587, 508153, 506815, 505862, 505162, 504237, 503005, 501763, 500383, 498229, 495020, 491258, 487594, 484245, 481191, 478417, 475749, 472954, 470263, 468278, 467159, 466402, 465723, 465522, 466085, 466944, 467629, 468582, 470624, 473801, 477294, 480244, 482161, 482833, 482482, 481873, 481709, 481964, 482250, 482657, 483643, 485176, 486523, 486962, 486275, 484615, 482433, 480535, 479604, 479434, 478982, 477437, 475035, 472681, 471016, 469965, 469003, 467670, 465952, 464279, 463175, 462937, 463554, 464678, 465591, 465565, 464559, 463412, 463001, 463334, 463726]
59559D63726l0l13k05J38M40M24j7n26n30P3Q10J365J935K684L403M031M890N998
59541D88296O723O723O718P618R190J0461J1218J2124J3157J2874R851M473j236
59528E98190n478p883q991r073p905n440k303N93K677L806M015L454K460J308
59514E69430k4j608l060l766l641l370l711m737n922o698o897o732o502o225n634
59499E00903m688l891l745m024l924k958j402Q5R70J098Q41Q64J359J667J162
59484D84317L23K15J001J844K275K712L417L976M227M687N421N447M194K753K558
59469E29367L307L426K445J626K027K999L151K119Q11K17N28J299K066K694L267
59454E61349L825M352M935N698O513P014O998O568N800M609L129J800Q04k20j560
$$ y = [463726, 463696, 463383, 463178, 463316, 463756, 464180, 464163, 463637, 463107, 463180, 463990, 465355, 467290, 469974, 473377, 477408, 482298, 488296, 495019, 501742, 508460, 516078, 525268, 535729, 546947, 559071, 572228, 585102, 594953, 599426, 598190, 592712, 584829, 575838, 566765, 558860, 553420, 551117, 551710, 554387, 558193, 562208, 565662, 568122, 569430, 569406, 567798, 564738, 560972, 557331, 553961, 550250, 545513, 539591, 532893, 525996, 519264, 512762, 506537, 500903, 496215, 492324, 488579, 484555, 480631, 477673, 476271, 476356, 477326, 478424, 479265, 480129, 481488, 483155, 484317, 484640, 484855, 485856, 487700, 489975, 492687, 496104, 500080, 504307, 508994, 514415, 519862, 524056, 526809, 529367, 532674, 536100, 538545, 540171, 542198, 545197, 548348, 550467, 551278, 551495, 552023, 553322, 555388, 558082, 561349, 565174, 569526, 574461, 580159, 586672, 593686, 600684, 607252, 613052, 617661, 620790, 622590, 623394, 623174, 621614]
59439F21614k920l915m708n637o513o835o546n944n030l553j743k91N12J122K062
59424E71675L340M743O266P992R815J1575J3289J5049J6780J8268J9377K0121
59412G18290K0610K0942K1046K0650J9345J6721J2421O486j99o035r627j0703
59400H29947r932q068n517k603J59K104K459N23l792r481j4781j8194j9157j7940
59386G25727j5345j2427j0059q434p156n910m806m052l575l156k685k142j499
59373F44481q11k53M0J39J21j04o54j375j840j615o06P94J890K236K146K420L460
59356F50469M817N822O436P155Q173R097R619J0051J0876J2005J2860J3164J3237
59343G73781J3441J3683J3673J3428J3184J2966J2458J1303R304O444K988m66
$$ y = [621614, 618694, 614779, 610071, 604434, 597921, 591086, 584540, 578596, 573566, 570013, 568270, 567979, 568491, 569613, 571675, 575015, 579758, 586024, 594016, 603831, 615406, 628695, 643744, 660524, 678792, 698169, 718290, 738900, 759842, 780888, 801538, 820883, 837604, 850025, 856511, 856312, 850277, 840650, 829947, 820015, 811947, 806430, 803827, 803986, 806090, 808549, 809072, 805280, 795799, 781018, 762824, 743667, 725727, 710382, 697955, 687896, 679462, 672306, 666396, 661590, 657538, 653963, 650807, 648122, 645980, 644481, 643670, 643417, 643457, 643596, 643717, 643613, 642959, 641584, 639744, 638129, 637523, 638317, 640207, 642443, 644589, 647009, 650469, 655286, 661108, 667544, 674699, 682872, 691969, 701588, 711639, 722515, 734520, 747380, 760544, 773781, 787222, 800905, 814578, 828006, 841190, 854156, 866614, 877917, 887221, 893665, 896653, 896187]
59331H96187l311n477p453r663j1971j3917j5270j6165j6733j6879j6480j5667
59319G47201j4685j3497j1846r865q310p722p487o374m188k248j689j860j155
59306F56275Q58K989M089M297M402M662M772M519L899K715N46k825p029j1106
59292F73063j3960j5080j4876j4106j3037j1448r419p519o130m957l500j587O22
59279E58066K735M148M484M353N023O968R203J0492J0763J0878J1428J2386J3551
59266F64478J4598J4867J3858J1901R845Q097O447M720L025J308o74k833m648
59253G44989n772o325o475o116n205m063l105k455j942j272j67J375K880L729
59239G10076L823L607L380L017K506K310K760L369L266K207P32o52k014l539m980
$$ y = [896187, 892876, 887399, 879946, 870283, 858312, 844395, 829125, 812960, 796227, 779348, 762868, 747201, 732516, 719019, 707173, 697308, 688998, 681276, 673789, 667415, 663227, 660979, 659290, 657430, 656275, 657133, 660122, 664211, 668508, 672910, 677572, 682344, 686863, 690762, 693477, 694023, 691198, 684169, 673063, 659103, 644023, 629147, 615041, 602004, 590556, 581137, 573618, 567488, 562531, 559031, 557444, 558066, 560801, 564949, 569433, 573786, 578809, 585777, 594980, 605472, 616235, 627113, 638541, 650927, 664478, 679076, 693943, 707801, 719702, 729547, 737644, 744091, 748811, 751836, 753144, 752470, 749637, 744989, 739217, 732892, 726417, 720301, 715096, 711033, 707928, 705473, 703531, 702259, 702092, 703467, 706347, 710076, 713899, 717506, 720886, 723903, 726409, 728719, 731479, 734848, 738114, 740321, 741053, 740401, 738387, 734848, 729868]
59224G29868n906o317o722p600q938j0256j0967j0774r961r272r240r609r603
59211F14703q853p740o760n924m991l977l161k732k728l024l189k641j381k11
59197E57391K64N47J472K812L497L175K709K862L346L542L425L318L300L375L756
59182E98791M476N111N389N640O174O602O389N738N223M817M031K921K223K264
59168F65789K382J784O24j61J5O75Q12j2j227j997k208k460l172m114m893n536
59152F46301o287p148p885q386q781r214r618r628q874p513o305n737n331m377
59138E41217l152k574k736k760k330k223k787k992j889j73P64P64Q35J566K650
59123E24180L736M786N613N973O159O715P530P958P834P670P745P690P154O290
$$ y = [729868, 723962, 717645, 710923, 703323, 694385, 684129, 673162, 662388, 652427, 643155, 633915, 624306, 614703, 605850, 598110, 591350, 585426, 580435, 576458, 573297, 570565, 567837, 564813, 561624, 558983, 557602, 557391, 557655, 558202, 559674, 562486, 565983, 569158, 571867, 574729, 578075, 581617, 585042, 588360, 591660, 595035, 598791, 603267, 608378, 613767, 619407, 625581, 632183, 638572, 644310, 649533, 654350, 658381, 661302, 663525, 665789, 668171, 669955, 670579, 670418, 670433, 671108, 671920, 671908, 670681, 668684, 666476, 664016, 660844, 656730, 651837, 646301, 640014, 632866, 624981, 616595, 607814, 598600, 588982, 579354, 570480, 562967, 556662, 550925, 545594, 541217, 538065, 535491, 532755, 529995, 527665, 525442, 522655, 519663, 517774, 517601, 518365, 519129, 519964, 521530, 524180, 527916, 532702, 538315, 544288, 550447, 557162, 564692, 572650, 580484, 588154, 595899, 603589, 610743, 617033]
59109F17033N412M638L945L266K560K070K297L219L854L281J890Q41M65O9o94
59094F54146j303j380j390j867k646l203l237k670j623o47l77p39j055j204j889
59079F28916l387m821n300n186n409n996o134n604n198n561o269o407n674m513
59065E53457l410k511j894j782k224k749k773k313j959j994j965j355m28O1j83
59050E25978p19r97q23k62N41J312J689J510R74N01M41P98J145J035N99M48R00
59033E35070J664K457L451M747N958O875P996R665J1133J1442J1029J1404J3120
59020F36011J5087J6143J6391J6545J6723J6562J5906J4688J2419Q581L551j371
59008G87236n054p385r019j0429j1429j1543j0624q917o692m162j773r8P67J316
$$ y = [617033, 622445, 627083, 631028, 634294, 636854, 638924, 641221, 644440, 648294, 651575, 653465, 654306, 654771, 654840, 654146, 652843, 651463, 650073, 648206, 645560, 642357, 639120, 636450, 634827, 634180, 633803, 633064, 632009, 630805, 628916, 625529, 620708, 615408, 610222, 604813, 598817, 592683, 587079, 581881, 576320, 570051, 563644, 557970, 553457, 550047, 547536, 545642, 543860, 541636, 538887, 536114, 533801, 531842, 529848, 527883, 526528, 526100, 526161, 525978, 525259, 524262, 523439, 523177, 523718, 525030, 526719, 528229, 529203, 529704, 530145, 530943, 532088, 533123, 533722, 534170, 535070, 536734, 539191, 542642, 547389, 553347, 560222, 568218, 577883, 589016, 600458, 611487, 622891, 636011, 651098, 667241, 683632, 700177, 716900, 733462, 749368, 764056, 776475, 785056, 788607, 787236, 782182, 774797, 765778, 755349, 743920, 732377, 721753, 712836, 706144, 701982, 700209, 700111, 700878, 702194]
58994G02194J916K406K666L048L730M102L536K439J818J961K273K271K024J641
58980G38025J128P72J021J815K642L318M173N335O496P505Q581R740J0529J0700
58966H11780J0668J1008J1725J2268J2052J0949R347P839O633N449M045K547J022
58953I17332q20l096n368p327r311j1497j3083j3240j2521j2236j2634j2711j1749
58940G91739j0056q194o535n579n642n995n386l668j979j058m04N64J536J985
58926G41328J982J754J147P5j112k065k765l154l066k738k759l253l744l930l915
58911G13785l628k861j904j196l26J523L946N463N633N808P179R241J0854J1765
58897G65282J2244J2279J1942J1739J1871J1905J1743J1990J2744J3100J2647
$$ y = [702194, 704110, 706516, 709182, 712230, 715960, 720062, 723598, 726037, 727855, 729816, 732089, 734360, 736384, 738025, 739153, 739925, 740946, 742761, 745403, 748721, 752894, 758229, 764725, 772230, 780811, 790551, 801080, 811780, 822448, 833456, 845181, 857449, 869501, 880450, 889797, 897636, 904269, 909718, 913763, 916310, 917332, 916512, 913416, 908048, 900721, 891410, 879913, 866830, 853590, 841069, 828833, 816199, 803488, 791739, 781683, 773489, 766954, 761375, 755733, 749738, 744352, 740684, 738705, 737647, 737243, 737807, 739343, 741328, 743310, 745064, 746211, 746286, 745174, 743109, 740344, 737190, 734124, 731386, 728627, 725374, 721630, 717700, 713785, 710157, 707296, 705392, 704196, 703870, 705393, 709339, 714802, 720435, 726243, 733422, 742663, 753517, 765282, 777526, 789805, 801747, 813486, 825357, 837262, 849005, 860995, 873739, 886839, 899486]
58886H99486J2301J2798J3402J3176J2483J2024J1317R477O766M076J472j403
58874A007375m087n874p184q949j0963j2195j2539j2856j3328j3131j1894j0263
58862H84112q828p506o275n576n632o071o456o659o619o311n986n983o316o810
58848G93084p347p548o679m665k758k310l168m178n037o446q567j0500j1540j1969
58834G00372j2307j2558j2536j2170j1256r559p435n808n137m901m317l188j818
58821E97382m85P67J982L079L764L804L542L742M569N101M400K762J318O59N01
58806F36887M61M61L62p6q00j517k107k634l099l661m690o095o980o722o063o210
58790E87517o990o983n518l540k286j899j733j297n34L66J069J383J561K006K595
$$ y = [899486, 911787, 924585, 937987, 951163, 963646, 975670, 986987, 996464, 1003230, 1007306, 1008778, 1007375, 1003288, 997414, 990230, 981281, 970318, 958123, 945584, 932728, 919400, 906269, 894375, 884112, 875284, 867778, 861503, 855927, 850295, 844224, 837768, 831109, 824490, 818179, 812193, 806210, 799894, 793084, 785737, 778189, 771510, 766845, 764087, 761777, 758609, 754431, 749394, 742948, 734381, 723881, 712341, 700372, 688065, 675507, 662971, 650801, 639545, 629986, 622551, 616743, 611606, 606705, 602388, 599200, 597382, 596897, 597664, 599646, 602725, 606489, 610293, 613835, 617577, 622146, 627247, 631647, 634409, 635727, 636386, 636887, 637348, 637809, 638171, 638095, 637295, 635778, 633671, 631037, 627938, 624277, 619587, 613492, 606512, 599790, 593727, 587517, 580527, 573544, 568026, 564486, 562200, 560301, 558568, 557271, 556737, 557103, 558172, 559555, 561116, 563122, 565717]
58775E65717K810K536K201J993J495K72j524l340m667n203m975m423m040l844
58761E45008l426k565j499o03l7K90O84J539K965M584N815O306N997N047L926
58746E74031L210K971K612J627K24j061j886j995j128M45J825K510K938L537L803
58731E93663L211K442K656L780M560M262L434K920K960L380M006M713N459O309
58717F47755P079P259O707O084O084O462O521O160N791N517M990L908K049o87
58703G21679l725n877o756p539r338j1495j2660j3003j3858j5422j6375j5859
58691E89772j4480j3092j1815j0608r638q781p635o367n652n565n413m845m236
58678D81645l801l255k535j978j582j011l96j95j33O01J864K478K081J884K932
$$ y = [565717, 568527, 571063, 573264, 575257, 576752, 577024, 575500, 572160, 567493, 562290, 557315, 552892, 548852, 545008, 541582, 539017, 537518, 536915, 536878, 537168, 537852, 539391, 542356, 546940, 552755, 559061, 565058, 570105, 574031, 577241, 580212, 582824, 584451, 584675, 583614, 581728, 579733, 578605, 579050, 580875, 583385, 586323, 589860, 593663, 596874, 599316, 601972, 605752, 610312, 614574, 618008, 620928, 623888, 627268, 631274, 635987, 641446, 647755, 654834, 662093, 668800, 674884, 680968, 687430, 693951, 700111, 705902, 711419, 716409, 720317, 722366, 721679, 717954, 712077, 705321, 697782, 688444, 676949, 664289, 651286, 637428, 622006, 605631, 589772, 575292, 562200, 550385, 539777, 530139, 521358, 513723, 507356, 501704, 496139, 490726, 485881, 481645, 477844, 474589, 472054, 470076, 468494, 467483, 467087, 466892, 466759, 467360, 469224, 471702, 473783, 475667, 478599]
58663D78599M557N398N213M949N325O005N989M535J911o93k298l044l639m244
58649E08563m577m761n046m961l837k138j082r28p68j53L18L19M00Q83J286J334
58633D84852J457J794J777J251R22J129J165N61j1J72O73O62J46k74l10pO02J345
58615D97906J878K277L020M072M680M533M315M546M667L901K373P82m47j131j082
58600E36290n34k92q30j715k303k511k476k055j226m71j79o4L88J289K429L605
58584E29345M552N037N250N675O390P018P379P577P462O841O259O659Q023R303
58570F22770R949J0552J1747J3432J5384J7612J9709K0895K1234K1776K3045K4311
58558H32416K4837K4789K4348K3081K0865J8349J5757J2266P407K134k296n626
$$ y = [478599, 483156, 488554, 493767, 498716, 504041, 510046, 516035, 520570, 522481, 521788, 519490, 516446, 512807, 508563, 503986, 499225, 494179, 489218, 485381, 483243, 482161, 481233, 480465, 480312, 480630, 480949, 481349, 482232, 483518, 484852, 486309, 488103, 489880, 491131, 492053, 493182, 494347, 494908, 494897, 495069, 495742, 496404, 496550, 496276, 495966, 495959, 496561, 497906, 499784, 502061, 505081, 509153, 513833, 518366, 522681, 527227, 531894, 535795, 538168, 538950, 538503, 537372, 536290, 535756, 535464, 534634, 532919, 530616, 528105, 525629, 523574, 522348, 521877, 521698, 521634, 522022, 523311, 525740, 529345, 533897, 538934, 544184, 549859, 556249, 563267, 570646, 578223, 585685, 592526, 598785, 605444, 613467, 622770, 632719, 643271, 655018, 668450, 683834, 701446, 721155, 742050, 763284, 785060, 808105, 832416, 857253, 882042, 906390, 929471, 950336, 968685, 984442, 996708, 1004115, 1006249, 1003953, 998327]
58546I98327q035r250r212q790q816r089r208r676j1174j3349j5292j6801j8279
58533H51356j9718k0595k0596j9850j8682j7456j6303j4826j2621j0180q467p462
58521F64600o194m491l473l741m315m087l291k725k588k813l628m824n422m836
58507F08172l607k314q30O73J194L18q29j043m86J34P27J207R05k79j160p87L09
58490F02304J363K638M291N265M798M015M480O047P555Q670R651J0230J0381J1209
58476F92897J3344J5303J5250J3717J2596J2106J0761Q026M898J968j117m163
58464G95586o202p085p692q269p995o502m584k974j518K02K338M981P972J0462
58450G68720J1526J1282J0521R461P629M794J142l114p370j0358j1339j1235j1382
$$ y = [998327, 990292, 981042, 971830, 963040, 954224, 945135, 935927, 926251, 915077, 901728, 886436, 869635, 851356, 831638, 811043, 790447, 770597, 751915, 734459, 718156, 703330, 690709, 680529, 672062, 664600, 658406, 653915, 650442, 646701, 642386, 638299, 635008, 632283, 629695, 626882, 623254, 618430, 613008, 608172, 604565, 602251, 601421, 602094, 603288, 603606, 602777, 601734, 601248, 601382, 602109, 603316, 604221, 603942, 602782, 601995, 602304, 603667, 606305, 610596, 615861, 620659, 624674, 629154, 635201, 642756, 651426, 661077, 671307, 681688, 692897, 706241, 721544, 736794, 750511, 763107, 775213, 785974, 794000, 798898, 800866, 799749, 795586, 789384, 782299, 774607, 766338, 758343, 751841, 747257, 744283, 742765, 742967, 745305, 750286, 758258, 768720, 780246, 791528, 802049, 811510, 819139, 823933, 825075, 821961, 814591, 804233, 792894, 781659, 770277]
58437G70277j1611j0756q740o734n341m050k499j006L02J712L145M150M782N516
58423G39147O272O514O301O293O547O290M974K856M89j733l545n070o872r145
58409G59318j1055j1569j0650r001p104n318m321m493n097n031m148l119k351
58396F76061j788j313o13Q22K797M121M045L342L110L255L122K798K737K739K461
58381G07696K328K862L715M312M730N031M660L615L107L898N007N368N606O699
58367G68634Q008Q388Q252Q742R703J0247J0533J1240J2007J2155J2113J2472
58355H92494J2495J1442J0298J0175J0000Q021M782K261Q25n61j763j612k53J100
58341I59704K360M220O052O622O583P709R881J1321J1687J2396J3866J4964J5233
$$ y = [770277, 758666, 747910, 739170, 732436, 727095, 723045, 720546, 719540, 719842, 721554, 724699, 728849, 733631, 739147, 745419, 751933, 758234, 764527, 771074, 777364, 782338, 785194, 785683, 783950, 780405, 775335, 768463, 759318, 748263, 736694, 726044, 717043, 709939, 704621, 700300, 695807, 690710, 685679, 681531, 678412, 676061, 674273, 672960, 672347, 673169, 675966, 680087, 684132, 687474, 690584, 693839, 696961, 699759, 702496, 705235, 707696, 710024, 712886, 716601, 720913, 725643, 730674, 735334, 738949, 742056, 745954, 750961, 756329, 761935, 768634, 776642, 785030, 793282, 802024, 811727, 821974, 832507, 843747, 855754, 867909, 880022, 892494, 904989, 916431, 926729, 936904, 946904, 954925, 959707, 961968, 962793, 962232, 960469, 958857, 958604, 959704, 962064, 966284, 972336, 978958, 985541, 993250, 1003131, 1014452, 1026139, 1038535, 1052401, 1067365, 1082598]
58328A082598J5363J5323J4346J2850J2085J1863J0832Q917P250N868L924J989
58316A203208J559K290K374J704J973L550M980N774O918Q344Q707Q160Q604J0559
58302A278704J2340J2955J3338J4142J4777J5212J6358J8035J8911J8949J9558
58291A453279K0890K1307K0171J8890J8675J9297K0296K1420K1925K1472K1500
58280A679122K3335K5501K5595K4337K4650K7064K9398L0748L2378L4575L6152
58269A992855L7313L9630M2864M5133M6356M8191N0549N1778N2226N3936N6785
58258B517616N8822O0289O3123O6549O7734O6997O7640P0280P2138P2502P3826
58247C257516P6793P9360Q1544Q5969R2623R8382J02839J09226J18357J27075
$$ y = [1082598, 1097961, 1113284, 1127630, 1140480, 1152565, 1164428, 1175260, 1184177, 1191427, 1197295, 1201219, 1203208, 1204767, 1207057, 1209431, 1211135, 1213108, 1216658, 1221638, 1227412, 1234330, 1242674, 1251381, 1259541, 1268145, 1278704, 1291044, 1303999, 1317337, 1331479, 1346256, 1361468, 1377826, 1395861, 1414772, 1433721, 1453279, 1474169, 1495476, 1515647, 1534537, 1553212, 1572509, 1592805, 1614225, 1636150, 1657622, 1679122, 1702457, 1727958, 1753553, 1777890, 1802540, 1829604, 1859002, 1889750, 1922128, 1956703, 1992855, 2030168, 2069798, 2112662, 2157795, 2204151, 2252342, 2302891, 2354669, 2406895, 2460831, 2517616, 2576438, 2636727, 2699850, 2766399, 2834133, 2901130, 2968770, 3039050, 3111188, 3183690, 3257516, 3334309, 3413669, 3495213, 3581182, 3673805, 3772187, 3875026, 3984252, 4102609, 4229684]
58237D229684J34131J42092J52023J61880J71541J83765J98598K12793K26165
58228E812672K42353K61943K81450L00731L24324L53501L84310M15670M51930
58219H828884M95051N42004N92643O52220P23410Q04111Q96123J007574J144124
58210A5686144J307278J504438J749795K049863K396946K780956L198759L650151
58202C4324330M138379M682026N317833O088156P033422Q191940R585810J1199382
58194I0561278J2981751J4866038J6771569J8609641K0333574K1968035K3503490
58187B19595376K4723796K5203788K4523007K2407491J8601623J2748953M678601
58180C52482635n060081j5056959k3599269k9468145l2312976l2477074l0638057
$$ y = [4229684, 4363815, 4505907, 4657930, 4819810, 4991351, 5175116, 5373714, 5586507, 5812672, 6055025, 6316968, 6598418, 6899149, 7223473, 7576974, 7961284, 8376954, 8828884, 9323935, 9865939, 10458582, 11110802, 11834212, 12638323, 13534446, 14542020, 15686144, 16993422, 18497860, 20247655, 22297518, 24694464, 27475420, 30674179, 34324330, 38462709, 43144735, 48462568, 54550724, 61584146, 69776086, 79361896, 90561278, 103543029, 118409067, 135180636, 153790277, 174123851, 196091886, 219595376, 244319172, 269522960, 294045967, 316453458, 335055081, 347804034, 352482635, 347422554, 332365595, 308766326, 279298181, 246985205, 214508131, 183870074]
58173A83870074k7555107k3920013k0249492j6852129j3880843j1393160r371765
58166F0647565p745537o435924n385911m547977l871440l315869k860433k488987
58158B3995487k179116j913600j688435j500629j339256j195459j069866r62908
58150A2146218q67767p79194o99857o31883n70819n13478m63320m22626l87083
58141F810191l53233l23802l00874k80866k60984k43827k30999k18671k04080
58132D392855j90256j79892j70345j59114j48578j41048j34218j25759j17517
58123C026128j11207j04822r7176r1239q8966q7140q2362p6130p1296o7289o2596
58112B085905n8337n5782n3470n0014m6758m4860m2940m0209l8548l8864l8852
$$ y = [183870074, 156314967, 132394954, 112145462, 95293333, 81412490, 70019330, 60647565, 52902028, 46466104, 41080193, 36532216, 32660776, 29344907, 26484474, 23995487, 21816371, 19902771, 18214336, 16713707, 15374451, 14178992, 13109126, 12146218, 11278451, 10499257, 9799400, 9167517, 8596698, 8083220, 7619900, 7197274, 6810191, 6456958, 6133156, 5832282, 5551416, 5290432, 5046605, 4815606, 4596935, 4392855, 4202599, 4022707, 3852362, 3693248, 3544670, 3403622, 3269404, 3143645, 3026128, 2914921, 2810099, 2712923, 2621684, 2532718, 2445578, 2363216, 2287086, 2215790, 2148501, 2085905, 2027568, 1971786, 1918316, 1868302, 1821544, 1776684, 1733744, 1693535, 1654987, 1616123, 1577271]
58101A577271l7044l5560l6063l6450l4573l1950l0734l0068k8428k6690k5876
58090A223835k4719k2335k0529k0604k0620j8734j6603j6376j6927j6212j5042
58079A015134j5261j6164j5974j5138j5159j5608j5160j4228j3985j4012j3279
58068H51166j2341j2273j2601j2289j1624j1352j1157j0618j0345j0624j0412
58057G25530r167q048p877p718o961o823q006q915q113o774o682p494p836p549
58043F17567o949n610l719k956m098n422n321m804n375o296o141n455n481n770
58029E44170n391n195o448q327r097q845q795q869q121o831o090n830n216m318
58015D46797l768l383k760k399k695k732j677m56l46q59p44j82j39l55J20J008
$$ y = [1577271, 1540227, 1504667, 1468604, 1432154, 1397581, 1365631, 1334897, 1304829, 1276401, 1249711, 1223835, 1199116, 1176781, 1156252, 1135648, 1115028, 1096294, 1079691, 1063315, 1046388, 1030176, 1015134, 999873, 983709, 967735, 952597, 937438, 921830, 906670, 892442, 878457, 864445, 851166, 838825, 826552, 813951, 801662, 790038, 778686, 767529, 756911, 746566, 735942, 725530, 716363, 708315, 700438, 692720, 685759, 678936, 670930, 662015, 653902, 647128, 640446, 632952, 625116, 617567, 610618, 605008, 601289, 598333, 594235, 588813, 583492, 578688, 573313, 567017, 560876, 555421, 549940, 544170, 538779, 533584, 527136, 518809, 509712, 500867, 492072, 483203, 475082, 468251, 462161, 456331, 451115, 446797, 443029, 439646, 436886, 434487, 431792, 429060, 427383, 426927, 426581, 425722, 424978, 424796, 424657, 424302, 424422, 425430]
57999D25430J179M73l65j078j814k295k375k714l734m647m744m609m830m741l838
57984C85298l159l595m039l065j357n57p08q36j072k019k785k034m65l1q76j281
57968C57419n56R1j79o55n42j02K04M50P76J080J275J232O22n14j432j733k046
57951C55390k852l280k303m67P26O98k2q72j415j055K91J729K606L506M944O039
57935C63663N791M869M670N221N500N223M898M531L721K581J411o2j967l489m017
57920D02544m298n209o245o651p033q126q913p913n738m321m064l664k524j343
57906C26502n21K75R38J006Q28J108J502J231P47J099J933J917J061P05J271J862
57890C43464K100K577L273L384K969L051L768M016L251K118J062q3r59p90o0l76
$$ y = [425430, 426609, 427082, 426717, 425639, 423825, 421530, 419155, 416441, 412707, 408060, 403316, 398707, 393877, 389136, 385298, 382139, 378544, 374505, 371440, 370083, 369526, 368818, 367982, 366910, 364891, 362106, 360072, 359607, 359576, 358700, 357419, 356863, 356954, 356775, 356120, 355578, 355476, 355680, 356130, 356906, 357986, 359261, 360493, 361115, 360601, 359169, 357436, 355390, 352538, 349258, 346955, 346488, 347214, 347912, 347890, 347018, 345603, 344548, 344839, 346568, 349174, 352680, 357624, 363663, 369454, 374323, 378993, 384214, 389714, 394937, 399835, 404366, 408087, 410668, 412079, 412017, 410050, 406561, 402544, 398246, 393037, 386792, 380141, 373108, 364982, 356069, 348156, 342418, 338097, 334033, 330369, 327845, 326502, 325981, 326256, 327194, 328200, 329028, 330136, 331638, 332869, 333616, 334715, 336648, 338565, 339626, 340331, 341602, 343464, 345564, 348141, 351414, 354798, 357767, 360818, 364586, 368602, 371853, 373971, 375033, 374950, 373991, 373201, 373141, 372765]
57874C72765k136l849m337m111l988l848l513l481l956m248l898l437l335l126
57860C21502k194p23P46J948K736L028L193L799M693N124M853M413M128L759L244
57845C64249K821K359J445K82m09m66l86l58k13k32r61k115k814k911k945k842
57829C54504k032r16p38j629k185j506l46K92N07P32O61k54j916l731n085n500
57813C30858m978m363m592n466o029o075o272o726o703n938n038m331l506k638
57799B58203k344k512k086o70P76J321J135P52L47J85P06J653K063J622J092J041
57783B63284J157J210J600K456L234L716M382N323N795N369M584L977L478L106
57769C12671L237L670L494K441J281N08k53j121j581j745k542l948m468l334j881
$$ y = [372765, 370629, 366780, 362443, 358332, 354344, 350496, 346983, 343502, 339546, 335298, 331400, 327963, 324628, 321502, 319308, 318585, 319331, 321279, 324015, 327043, 330236, 334035, 338728, 343852, 348705, 353118, 357246, 361005, 364249, 367070, 369429, 370874, 371156, 370747, 370281, 369895, 369537, 369324, 369092, 368131, 366016, 363202, 360291, 357346, 354504, 352472, 351556, 350818, 349189, 347004, 345498, 345152, 345444, 345951, 346683, 347344, 347090, 345174, 341443, 336358, 330858, 325880, 321517, 316925, 311459, 305430, 299355, 293083, 286357, 279654, 273716, 268678, 264347, 260841, 258203, 255859, 253347, 251261, 250591, 251367, 252688, 253823, 254575, 254922, 255107, 255813, 257466, 259529, 261151, 262243, 263284, 264441, 265651, 267251, 269707, 272941, 276657, 281039, 286362, 292157, 297526, 302110, 306087, 309565, 312671, 315908, 319578, 323072, 325513, 326794, 327302, 327049, 325928, 324347, 322602, 320060, 316112, 311644, 308310, 306429]
57754C06429j624k150k160j530r80o52k74j70q03j788k375k462k332j966j406
57739B83757j126j207r44j16K23o83j783j582k88O72Q11Q07R48P94L46L31J036
57722B81996J924K480K649K377J518L71l61l57K7L27L95K99J60P3j02o75j590
57705B91511k250k169j604j191j224j581k044k446k717l044l539l765l119j849
57691B58969j029j269k114k904l433l428k433p29N27Q02J001K141M043O084Q308
57676B64536J0897J3414J5547J7929K1067K4184K6310K7871K9812L1682L2072
57665E15321L0734K8575K5358J8987P896o714k1542l3467m0844m3452m2102l8181
57653D00569l3099k7895k3175j9096j5539j2504j0227q688p300n519l628k396
$$ y = [306429, 304805, 302655, 300495, 298965, 297985, 297333, 297059, 296889, 296086, 294298, 291923, 289461, 287129, 285163, 283757, 282631, 281424, 280480, 280364, 280587, 279904, 278121, 276539, 276251, 276923, 277734, 278541, 279489, 280283, 280629, 280960, 281996, 283920, 286400, 289049, 291426, 292944, 293315, 292954, 292597, 292624, 292951, 293346, 293645, 293805, 293878, 293776, 293101, 291511, 289261, 287092, 285488, 284297, 283073, 281492, 279448, 277002, 274285, 271241, 267702, 263937, 260818, 258969, 257940, 256671, 254557, 251653, 248220, 244792, 242359, 241630, 242157, 242959, 243960, 246101, 250144, 256228, 264536, 275433, 288847, 304394, 322323, 343390, 367574, 393884, 421755, 451567, 483249, 515321, 546055, 574630, 599988, 618975, 626871, 620157, 598615, 565148, 524304, 480852, 438750, 400569, 367470, 339575, 316400, 297304, 281765, 269261, 259034, 250346, 243046, 237527, 233899, 231503]
57641B31503k030j928j453o05J71N12L78m2n16r10j166j215j037p62n95o53j006
57624B18646j701k414k489j682o53j55j40j50l07r22j615j817j921k676l574l288
57608A93142j843q58j269k250k798k931k822k237j529j674k493k333n10J372J643
57593A70610P09k02r61j805k058j276n85j182k355k566j732q14m7P67J029K08
57577A57740o97l87N51N55l68r30r58j437k321k393j484q30r37q45L9R80J198
57560A47476P92M8q05j034l2J353J556N74p2J98L48j56l28L92Q74k4j737k915
57542A46508l061k433j328k36J53j41k54K26O16L50j23k61l50q08j270j102k26
57525A36260R68K031K404J707L90n23o45l95Q7J189K628L244K546J552J396J901
$$ y = [231503, 229473, 227545, 226092, 225487, 225658, 226170, 226548, 226506, 225990, 225080, 223914, 222699, 221662, 220900, 220305, 219652, 218646, 216945, 214531, 212042, 210360, 209707, 209552, 209412, 209262, 208955, 208033, 206418, 204601, 202680, 200004, 196430, 193142, 191299, 190441, 189172, 186922, 184124, 181193, 178371, 176134, 174605, 172931, 170438, 168105, 167595, 168967, 170610, 171319, 171117, 170156, 168351, 166293, 165017, 164432, 163250, 160895, 158329, 156597, 155783, 155736, 156503, 157532, 157740, 157043, 156656, 157207, 157762, 157394, 156464, 155506, 154069, 151748, 149355, 147871, 147041, 146104, 145259, 145298, 146278, 147476, 148268, 148316, 147511, 146477, 146445, 147798, 149354, 149928, 149856, 150054, 150402, 150246, 149918, 150310, 151184, 151160, 149423, 146508, 143447, 141014, 139686, 139450, 139603, 139462, 139208, 139434, 140050, 140400, 140277, 140016, 139666, 138858, 137588, 136486, 136260, 137228, 139259, 141663, 143370, 143760, 143237, 142592, 142197, 142284, 143473, 146101, 149345, 151891, 153443, 154839, 156740]
57509A56740K180J908J367Q10L70J48N8J3K66R22J200K87j070j207OP69q3j602
57491A63082k492k836l088k770j488j43K38Q8M24J107J296J020R21R04L27o33
57475A55957j047o00R4M12J25r60k786m501m976m064k743j978j862j829j323l47
57459A27572L99K20n56q02j73L70P7l37J00R30R25M2n21j72K78j10j125j769j442
57440A23906m78K77L25N6K07Q31J217R68M71L9o03j457j705q40L69R32J039J450
57422A27004K015J931J164M27lm38p77n37J01L23nm3P06J605J848J478J077R36
57404A38812Q49N31j8l67l0P69J046L03n32k40R03J395O09m22n41J87J006J566
57386A45826J903J984J877J957K421K925L072K918K651K128J156k1r25j347j350
$$ y = [156740, 158920, 160828, 162195, 163005, 163375, 163523, 163581, 163594, 163860, 164782, 165982, 166269, 165199, 163992, 163998, 164767, 164684, 163082, 160590, 157754, 154666, 151896, 150408, 150265, 150503, 150591, 151015, 152122, 153418, 154438, 155359, 156263, 156590, 155957, 154910, 154310, 154404, 154816, 154941, 153981, 151195, 146694, 141718, 137654, 134911, 132933, 131071, 129242, 127919, 127572, 127971, 128191, 127635, 126833, 126660, 127030, 127107, 126770, 126870, 127800, 128725, 128767, 128246, 128074, 128352, 128242, 127117, 125348, 123906, 123428, 123705, 124030, 124086, 124293, 125124, 126341, 127309, 127780, 127819, 127216, 125759, 124054, 123214, 123583, 124515, 125554, 127004, 129019, 130950, 132114, 132541, 132538, 132100, 131323, 130786, 130887, 131210, 131205, 131162, 131868, 133473, 135321, 136799, 137876, 138812, 139661, 140192, 140174, 139807, 139777, 140546, 141592, 141895, 141363, 141123, 142026, 143421, 144030, 143608, 143067, 143254, 144260, 145826, 147729, 149713, 151590, 153547, 155968, 158893, 161965, 164883, 167534, 169662, 170818, 170797, 169872, 168525, 167175]
57371A67175j051o62n30p67j054j106j147j518j949j799r91k53j61l38l0P99J442
57354A56060J478J355J631K094K081J452P32L47K27K25L70N11K13o02j308j243
57338A65623n26J72M16K54j56p00j192j415j324j008n76j82n6k05k94m1L73N47
57320A59710L57J2k67l94l52k28j86j89N0O25J117J049N52K23L55N43J96p55j676
57301A60742j764q43L73R35O16M5r8K63P44J013R96Q22P06P21P23O95J041K113
57283A69843L467M168L913L415L453M024M595M727M307L616L297L754M492M638
57269B25709M170L908M103M066L460K997L231L547L102J998R09K43K85J292K647
57254B65667K867J445j33l28L20K53o24j045n08L26J085K000K712K397J278O60
$$ y = [167175, 166124, 165462, 164932, 164165, 163111, 162005, 160858, 159340, 157391, 155592, 154601, 154348, 154187, 153849, 153819, 154618, 156060, 157538, 158893, 160524, 162618, 164699, 166151, 166883, 167230, 167457, 167682, 168052, 168563, 168776, 168174, 166866, 165623, 165097, 165269, 165685, 165939, 165783, 165083, 163891, 162476, 161152, 160144, 159568, 159386, 159330, 159125, 158831, 158790, 159163, 159710, 160067, 160079, 159812, 159418, 159066, 158838, 158652, 158463, 158513, 159138, 160255, 161304, 161856, 162079, 162434, 162977, 163173, 162418, 160742, 158978, 158135, 158508, 159443, 160059, 160104, 160006, 160269, 161013, 162026, 163022, 163844, 164550, 165271, 165994, 166689, 167730, 169843, 173310, 177478, 181391, 184806, 188259, 192283, 196878, 201605, 205912, 209528, 212825, 216579, 221071, 225709, 229879, 233787, 237890, 241956, 245416, 248413, 251644, 255191, 258293, 260291, 261200, 261443, 261728, 263020, 265667, 268534, 269979, 269846, 269518, 269838, 270091, 269467, 268422, 267914, 268240, 269325, 271325, 274037, 276434, 277712, 278372]
57238B78372J059J625J745J883K274K141J074J63P54K645M386M932M416L549K908
57223C13926K608K404K205K467L604N067N746N393M891M897N003M661M133L954
57209C70959M066M106M143M467N014N529O050O802P766Q692R394R768R804R686
57195D66246R665R714R661R719J0402J1687J2824J3311J3589J4467J6181J8400
57183F15866K0789K3197K5447K7182K7813K6625K3512J9636J6722J5439J4949
57172H57177J4401J4132J4843J6202J7153J7375J7605J8471J9708K0748K1590
57161A049405K2711K4276K5784K6629K6893K7365K8583L0079L0888L0754L0447
57150A353814L0810L1861L3036L4012L5067L6721L9121M1761M3864M5189M6357
$$ y = [278372, 279431, 281056, 282801, 284684, 286958, 289099, 290173, 290336, 291090, 293735, 298121, 303053, 307469, 311018, 313926, 316534, 318938, 321143, 323610, 327214, 332281, 338027, 343420, 348311, 353208, 358211, 362872, 367005, 370959, 375025, 379131, 383274, 387741, 392755, 398284, 404334, 411136, 418902, 427594, 436988, 446756, 456560, 466246, 475911, 485625, 495286, 505005, 515407, 527094, 539918, 553229, 566818, 581285, 597466, 615866, 636655, 659852, 685299, 712481, 740294, 766919, 790431, 810067, 826789, 842228, 857177, 871578, 885710, 900553, 916755, 933908, 951283, 968888, 987359, 1007067, 1027815, 1049405, 1072116, 1096392, 1122176, 1148805, 1175698, 1203063, 1231646, 1261725, 1292613, 1323367, 1353814, 1384624, 1416485, 1449521, 1483533, 1518600, 1555321, 1594442, 1636203, 1680067, 1725256, 1771613]
57139A771613M8098N0310N2307N3803N5109N6342N7082N7150N7148N7884N9523
57128B376369O1605O3717O6008O9281P4691Q2936R3384J04042J12681J18182J21068
57117C343964J22978J25560J29616J35180J42384J51795J63749J77956J94364
57108D687546K14124K38977K70015L07751L53245M08341M74912N54752O50257
57099H159920P64500R00778J063044J256487J486046J753226K054419K381896
57091A9820316K725315L072649L412490L738142M049833M350997M638648M891714
57083E0700104N063921N089067M901724M464162L782380K902072J891333Q23143
57075G9617906k36853j238421k150095k955528l645256m210277m640465m925838
$$ y = [1771613, 1819711, 1870021, 1922328, 1976131, 2031240, 2087582, 2144664, 2201814, 2258962, 2316846, 2376369, 2437974, 2501691, 2567699, 2636980, 2711671, 2794607, 2887991, 2992033, 3104714, 3222896, 3343964, 3466942, 3592502, 3722118, 3857298, 3999682, 4151477, 4315226, 4493182, 4687546, 4901670, 5140647, 5410662, 5718413, 6071658, 6479999, 6954911, 7509663, 8159920, 8924420, 9825198, 10888242, 12144729, 13630775, 15384001, 17438420, 19820316, 22545631, 25618280, 29030770, 32768912, 36818745, 41169742, 45808390, 50700104, 55764025, 60853092, 65754816, 70218978, 74001358, 76903430, 78794763, 79617906, 79381053, 78142632, 75992537, 73037009, 69391753, 65181476, 60541011, 55615173]
57067E5615173n059015n039533m878743m601126m239995l830442l403795k984942
57059B1577582k591617k234805j919773j647386j415634j221149j059915r27019
57051H560284q16686p23502o43669n74714n14438m60742m12141l67693l26558
57042C720141k88289k53360k22551j95796j72197j50975j31755j14117r7711q2765
57032B010625o9677n8107m7238l6907k7646j9877j4385j3696k1263l7942n9702
57021A604185p9736r2812r7525r5400q8980q0591p1856o3592n6066m9309m3305
57010G85013l8081l3798l0509k7881k5476k3337k1883k1130k0485j9479j8308
56999E04646j7374j6702j6063j5353j4507j3329j1679r645p349m843k374l37J258
$$ y = [55615173, 50556158, 45516625, 40637882, 36036756, 31796761, 27966319, 24562524, 21577582, 18985965, 16751160, 14831387, 13184001, 11768367, 10547218, 9487303, 8560284, 7743598, 7020096, 6376427, 5801713, 5287275, 4826533, 4414392, 4046699, 3720141, 3431852, 3178492, 2955941, 2760145, 2587948, 2436973, 2305218, 2191101, 2093390, 2010625, 1940948, 1882841, 1835603, 1798696, 1771050, 1751173, 1736788, 1723092, 1701829, 1663887, 1604185, 1524449, 1431637, 1334112, 1238712, 1149732, 1069141, 997285, 933693, 877627, 828318, 785013, 746932, 713134, 682625, 654744, 629268, 605931, 584048, 562918, 542433, 522954, 504646, 487272, 470570, 454507, 439154, 424647, 411318, 399639, 389994, 382645, 377802, 375428, 375091, 376349]
56986C76349K885M751O360P190P406P363O675M482O27m013q456j2298j5339j7080
56972C66902j7078j5524j3108j0317p234l944q06J832M014O028P940R543J0760
56959C39008J1981J3742J6030J7996J8422J6516J2359O687L42o060j2002j6813
56947D18208j9756k0499j9450j7469j5153j2410q849m549l04L084N639Q100J0933
56934C27525J3818J6245J8224K0045K1507K1854K0434J6986J1321L303o628j7043
56922D67591k5897l1323l2487l0225k6774k4190k2669k0771j7409j3183r588p430
56910B05645o409n813n106m074k865j882j339j062p59k60O17K055L864N492O709
56895A94813P861R194J0393J1196J2051J3534J5476J7189J8369J9116J9283J8458
$$ y = [376349, 379234, 383985, 390345, 397535, 404941, 412304, 418979, 423461, 424088, 420075, 411619, 399321, 383982, 366902, 349824, 334300, 321192, 310875, 303641, 299697, 298891, 300723, 304737, 310765, 318705, 328248, 339008, 350989, 364731, 380761, 398757, 417179, 433695, 446054, 452741, 453083, 447023, 435021, 418208, 398452, 377953, 358503, 341034, 325881, 313471, 304622, 300073, 299769, 302853, 308492, 316592, 327525, 341343, 357588, 375812, 395857, 417364, 439218, 459652, 476638, 487959, 491262, 484634, 467591, 441694, 410371, 377884, 347659, 320885, 296695, 274026, 253255, 235846, 222663, 213075, 205645, 199236, 193423, 188317, 184243, 181378, 179496, 178157, 177095, 176336, 176076, 176693, 178748, 182612, 188104, 194813, 202674, 211868, 222261, 233457, 245508, 259042, 274518, 291707, 310076, 329192, 348475, 366933]
56883C66933J6511J3652R964N349j1n551j0604j4403j6028j5058j2244q879n374
56870C24257j079M319R954J4788J8897K3177K7952L2539L6222L9144M1891M4441
56858F16502M5772M4547L9879L1431J9262M143j1896k5913l5461l9725l9390l5676
56846F13475k9659k2119j3597m441N074J4676K4117L3122M1404M8909N5919O2532
56834H29412O8112P1603P2292O9724O2868N0209L1064O591k0469m6435o7201p9571
56822A048199q3020p9706p2260o2095n0046l7443k5418j3881k369Q527J7636K4807
56810F72931L0931L6544M1355M5004M7253M7315M3829L5667K2357M172j7151l8028
56798I72179n4558o4805o9078o8358o3502n5794m6828l7419k7603j7983r863l689
$$ y = [366933, 383444, 397096, 407060, 412409, 412398, 406847, 396243, 381840, 365812, 350754, 338510, 329631, 324257, 323178, 327497, 337451, 352239, 371136, 394313, 422265, 454804, 491026, 530170, 572061, 616502, 662274, 706821, 746700, 778131, 797393, 801536, 789640, 763727, 728266, 688541, 649151, 613475, 583816, 561697, 548100, 543659, 548733, 563409, 587526, 620648, 662052, 710961, 766880, 829412, 897524, 969127, 1041419, 1111143, 1174011, 1224220, 1255284, 1261875, 1241406, 1194971, 1127770, 1048199, 965179, 885473, 813213, 751118, 701072, 663629, 638211, 624330, 621961, 630488, 648124, 672931, 703862, 740406, 781761, 826765, 874018, 921333, 965162, 1000829, 1023186, 1027358, 1010207, 972179, 917621, 852816, 783738, 715380, 651878, 596084, 549256, 511837, 484234, 466251, 456388, 452699]
56786D52699J532O684J1438J5323J8737K1982K4119K3923K1377J7132J0898J720
56774F27564j0070k2247l2348l9265m3061m3967m2249l8595l4033k9363k4934
56763B67432k0972j7755j5395j3600j1934j0198q426o666n051l971l748m062m159
56750A41495l708l043k501k036j676j716k069k109j559r76p76n25J37N22j22j160
56734A18178j271l50L91K16k94l01L40J302K131K263J479M58J52N47Q07O13M52
56717A27113N59N56L67M71R71J269J025O34M12J74o6K00J033J620J347O56L14
56700A38655L50K69j62p61j221j214o68q8j45p38j049p25l25l32m44k23K14N14
56682A31907O20N84L63J15K76R97J898K532K656K091R09j65l19L37R91J367J854
$$ y = [452699, 454231, 460915, 472353, 487676, 506413, 528395, 552514, 576437, 597814, 614946, 625844, 627564, 617494, 595247, 562899, 523634, 480573, 436606, 394357, 355762, 321729, 292366, 267432, 246460, 228705, 213310, 199710, 187776, 177578, 169152, 162486, 157435, 153464, 149716, 145654, 141495, 137787, 134744, 132243, 130207, 128531, 126815, 124746, 122637, 121078, 120102, 119326, 118801, 118938, 119460, 119338, 118178, 116907, 116557, 116948, 117164, 116870, 116569, 116909, 118211, 120342, 122605, 124084, 124542, 124694, 125241, 126048, 126661, 127113, 127672, 128228, 128595, 129066, 130037, 131306, 132331, 132965, 133377, 133551, 133485, 133685, 134718, 136338, 137685, 138341, 138655, 139005, 139274, 139112, 138351, 137130, 135916, 135248, 135160, 135015, 134277, 133228, 132503, 132178, 131846, 131402, 131179, 131393, 131907, 132527, 133111, 133474, 133589, 133865, 134862, 136760, 139292, 141948, 144039, 144948, 144783, 144464, 144801, 145792, 147159, 149013]
56665A49013K377K236J303L52r8k41k6R78K335K653J505J81j82r2m09p96o13k63
56647A60213l91n89k01K26k97j451j910j154J06J057J366R01j31r31r05m92m65
56630A54952o83m40K41O80O56M85J59o73j816k445k068j010qK52n31j837k513
56613A43401k005j062o18n08o5N48O13K01L9K09K2p27j325j196n74J9L35L41K27
56594A37875M63J239J903J624N98j42j56l9l27o93n84m6M12M60J26l36o10m67
56576A41300N4P12J259J570J734K027K575L064L209L460M511N992O603N904N096
56561A89070N346O272O875P103P428P547O663M697K218m55l072m862n251m888
56547B24691m848n062m723l893l401l247k612j497r50j296j519q90j07r5o46r36
$$ y = [149013, 151390, 153626, 154929, 155281, 155183, 154942, 154916, 155894, 158229, 160882, 162387, 162568, 162386, 162294, 161885, 161089, 160476, 160213, 159822, 159233, 159032, 159258, 158961, 157510, 155600, 154446, 154552, 155609, 156975, 157876, 157745, 156814, 155909, 155417, 154952, 154269, 153829, 154070, 154750, 155406, 155891, 156050, 155377, 153561, 151116, 149048, 148038, 148030, 148282, 147751, 145914, 143401, 141396, 140334, 139716, 139208, 139143, 139691, 140304, 140505, 140544, 140753, 140775, 140048, 138723, 137527, 136953, 136972, 137307, 137648, 137875, 138338, 139577, 141480, 143104, 143702, 143560, 143404, 143365, 143038, 142345, 141761, 141715, 142127, 142587, 142713, 142377, 141767, 141300, 141354, 142066, 143325, 144895, 146629, 148656, 151231, 154295, 157504, 160964, 165475, 171467, 178070, 183974, 189070, 194416, 200688, 207563, 214666, 222094, 229641, 236304, 241001, 243219, 242764, 239692, 234830, 229579, 224691, 219843, 214781, 210058, 206165, 202764, 199517, 196905, 195408, 194458, 193162, 191643, 190753, 190646, 190551, 189905, 188969]
56531A88969p16l13%J12o5l81m69k74k14n29q49o55Q8Q73J026J81j254k215j978
56512A81337r62j20K10L12K51j45n56l99J45J18q64k016k391j930j156m15K65
56495A71684Q96J485K006K327K332K107J791J292N63r2l34k78k28j28J94N04M71
56478A86592L32N92J147J375J041N15J20r3q0J38K36L2k8N14J254J381Q96M80
56460A96444L11n3o16p63m02k54p09j142q87k14P6k89p87o71L19J592K091J406
56442A95452L59M5N27R50P70J52o38j542k290k364j593l82O78J205J176R71J014
56425A94490J114O83j17k13P73J641J272L28J54O74P68K57l1K6l18j151j562j099
56407A97689l14K79P29J049J135J272J714J870J084mj78N13J065J472K539L781
$$ y = [188969, 188253, 187940, 187940, 188052, 187987, 187606, 187137, 186863, 186649, 186120, 185271, 184616, 184704, 185577, 186603, 186784, 185530, 183315, 181337, 180375, 180255, 180465, 180777, 181028, 180883, 180327, 179928, 180073, 180191, 179327, 177311, 174920, 172990, 171834, 171419, 171684, 172580, 174065, 176071, 178398, 180730, 182837, 184628, 185920, 186483, 186391, 186057, 185779, 185551, 185423, 185617, 186121, 186592, 186924, 187516, 188663, 190038, 191079, 191594, 191714, 191621, 191541, 191679, 191915, 191947, 191919, 192433, 193687, 195068, 195964, 196444, 196755, 196702, 196086, 195323, 194921, 194667, 193958, 192816, 191929, 191715, 191791, 191502, 190715, 190044, 190363, 191955, 194046, 195452, 195811, 195856, 196383, 197333, 198103, 198255, 197617, 196075, 193785, 191421, 189828, 189446, 190124, 191329, 192505, 193476, 194490, 195604, 196287, 196170, 195957, 196730, 198371, 199643, 199971, 200125, 200799, 201567, 201824, 201793, 201819, 201501, 200350, 198788, 197689, 197375, 197654, 198383, 199432, 200567, 201839, 203553, 205423, 206507, 206503, 206325, 206838, 207903, 209375, 211914, 215695]
56391B15695L562J716Q7k16k43r87j588j016k3K2q32j524j632j375p37K83J085
56374B12277J174R62J096J457J564J455J436J458J414J573K035K253J691O30k42
56359B32233o51p05m60L8N36Q04Q30P45P73J216K010K483K148J492J248J157M53
56342B46350o54j196j044r66j106p32K64J063J464K239L605M637M838M926N458
56327B69146N979O098O175O219N429L626J947J329J322J160R12Q35O36J68j16
56312C10865o5j58m11n7J016J778J681J509J891K247K150K352L441M633N006M863
56296C42741M763M368L324K352K288K850L367L861M523M993N110N479O408P208
56282D03635P418P650Q392R058R188R459J0506J1777J2638J3500J4798J5994J6668
$$ y = [215695, 219257, 220973, 221060, 220844, 220601, 219614, 218026, 217010, 216987, 217009, 216177, 214653, 213021, 211646, 210909, 211192, 212277, 213451, 214413, 215509, 216966, 218530, 219985, 221421, 222879, 224293, 225866, 227901, 230154, 231845, 232475, 232233, 231582, 230877, 230417, 230455, 230991, 231795, 232625, 233370, 234143, 235359, 237369, 239852, 242000, 243492, 244740, 245897, 246350, 245696, 244500, 243456, 242490, 241384, 240652, 240916, 241979, 243443, 245682, 249287, 253924, 258762, 263688, 269146, 275125, 281223, 287398, 293617, 299046, 302672, 304619, 305948, 307270, 308430, 309342, 310177, 310813, 310981, 310865, 310800, 310642, 310231, 310174, 311190, 312968, 314649, 316158, 318049, 320296, 322446, 324798, 328239, 332872, 337878, 342741, 347504, 351872, 355196, 357548, 359836, 362686, 366053, 369914, 374437, 379430, 384540, 390019, 396427, 403635, 411053, 418703, 427095, 436153, 445341, 454800, 465306, 477083, 489721, 503221, 518019, 534013, 550681]
56269E50681J7494J9046K0737K2064K3705K6189K8704L0549L2573L5822L9923
56258H47487M4154M8925N4749O0910O6819P3484Q1898R1013R9141J06469J14318
56247A689367J22684J30364J36875J42430J46573J48521J48325J46162J41058
56238B952359J31980J19506J04789Q7512O6640M2641J7230q516l4006n7730p8060
56227C344345r5178j10319j23333j32756j38118j40378j40298j38097j34535j30539
56217B060794j25788j19326j11599j04178r7500r0603q3108p5829o9220o2843
56207A120800n6646n1293m6918m2845l8813l5295l2390k9563k6702k4331k2599
56196G13405k0979j9109j7066j4835j2383j0146q606p557o546n733n466n374m869
$$ y = [550681, 568175, 587221, 607958, 630022, 653727, 679916, 708620, 739169, 771742, 807564, 847487, 891641, 940566, 995315, 1056225, 1123044, 1196528, 1278426, 1369439, 1468580, 1575049, 1689367, 1812051, 1942415, 2079290, 2221720, 2368293, 2516814, 2665139, 2811301, 2952359, 3084339, 3203845, 3308634, 3396146, 3462786, 3505427, 3522657, 3514141, 3480135, 3422405, 3344345, 3249167, 3138848, 3015515, 2882759, 2744641, 2604263, 2463965, 2325868, 2191333, 2060794, 1935006, 1815680, 1704081, 1599903, 1502403, 1411800, 1328692, 1252863, 1183643, 1120800, 1064154, 1012861, 965943, 923098, 884285, 848990, 816600, 787037, 760335, 736004, 713405, 692426, 673317, 656251, 641416, 629033, 618887, 610281, 602724, 596178, 590445, 584979, 579605, 574736]
56183E74736m139l756l696l571l373l127k438j290n15n12l47Q16K255K855K819
56168E56717K950L184L221L636M872O057O276O187O798P680Q100Q796J0794J3335
56154F48603J5046J6311J8361K0913K2846K4611K7647L1924L6285M0704M5966
56143I49217N1579N6417O1134O7433P4970Q1396Q5503Q8070Q9412Q8364Q4101
56132A777596P7109O8082N7652M7356L9048L3046K8263K4035K0190J5646Q880
56121B196903l3r453j8245k6329l3542l9660m5374n1677n8553o5577p3042q0749
56109A694669q6559q8322q6447q2617p6770o7890n7127m7332l9719l3306k7464
56098A001116k2586j8437j4294j0607q351o948n064l042k136j779k34K275L782
$$ y = [574736, 570597, 566841, 563145, 559574, 556201, 553074, 550636, 549346, 548831, 548319, 547972, 548788, 551043, 553898, 556717, 559667, 562851, 566072, 569708, 574580, 580637, 586913, 593100, 599898, 607578, 615678, 624474, 635268, 648603, 663649, 679960, 698321, 719234, 742080, 766691, 794338, 826262, 862547, 903251, 949217, 1000796, 1057213, 1118347, 1185780, 1260750, 1342146, 1427649, 1515719, 1605131, 1693495, 1777596, 1854705, 1922787, 1980439, 2027795, 2066843, 2099889, 2128152, 2152187, 2172377, 2188023, 2196903, 2196870, 2187417, 2169172, 2142843, 2109301, 2069641, 2024267, 1972590, 1914037, 1848460, 1775418, 1694669, 1608110, 1519788, 1433341, 1350724, 1273954, 1206064, 1148937, 1101605, 1061886, 1028580, 1001116, 978530, 960093, 945799, 935192, 926841, 919893, 914829, 911787, 909651, 907872, 907638, 909913, 913695]
56085I13695L829L971N048O308P213P905Q082P553P460Q788J0367J0636J0451
56072A011306J1522J3093J3184J2237J2297J3370J3832J3787J4622J5872J5964
56061A161086J5478J6180J7467J7439J6779J7687J9581J9914J8800J8627J9444
56050A358482J9157J7973J8177J9544J9576J8354J8471K0074K0638J9985K0635
56039A571066K2745K3635K2953K3415K5688K7391K7957K9659L2892L5278L6397
56028A879076L8564M2081M4449M5108M6090M7442M7155M6099M7534N1134N3189
56017B387921N3423N5522O0068O3353O4433O6781P1467P5246P7180Q0479Q5949
56006C141822R0209R2477R6321J02644J07809J10965J16122J24594J32537J38515
$$ y = [913695, 917524, 921495, 926543, 932851, 940064, 947969, 956051, 963604, 971064, 979852, 990219, 1000855, 1011306, 1022828, 1035921, 1049105, 1061342, 1073639, 1087009, 1100841, 1114628, 1129250, 1145122, 1161086, 1176564, 1192744, 1210211, 1227650, 1244429, 1262116, 1281697, 1301611, 1320411, 1339038, 1358482, 1377639, 1395612, 1413789, 1433333, 1452909, 1471263, 1489734, 1509808, 1530446, 1550431, 1571066, 1593811, 1617446, 1640399, 1663814, 1689502, 1716893, 1744850, 1774509, 1807401, 1842679, 1879076, 1917640, 1959721, 2004170, 2049278, 2095368, 2142810, 2189965, 2236064, 2283598, 2334732, 2387921, 2441344, 2496866, 2556934, 2620287, 2684720, 2751501, 2822968, 2898214, 2975394, 3055873, 3141822, 3232031, 3324508, 3420829, 3523473, 3631282, 3742247, 3858369, 3982963, 4115500, 4254015]
55996D254015J46182J56857J66881J75146J85685J99948K14175K27242K43115
55987E969246K62800K82264L01210L24956L54573L84551M13605M47988M90522
55978I231715N36586N85069O42545P12399P90997Q79349R87045J120269J278642
55969A6764616J468889J707246K000764K338853K710046L114595L556422M039961
55961C7701392M584061N225485O002760O950033Q104398R491107J1091294J2844109
55953A01994639J4682086J6540744J8349957K0073959K1753061K3404213K4824332
55946B41622991K5567649K5179840K3363408J9822062J4103793N932055m148719
55939C51443079j4593503k3516124k9616927l2576408l2799598l0994031k7925042
$$ y = [4254015, 4400197, 4557054, 4723935, 4899081, 5084766, 5284714, 5498889, 5726131, 5969246, 6232046, 6514310, 6815520, 7140476, 7495049, 7879600, 8293205, 8741193, 9231715, 9768301, 10353370, 10995915, 11708314, 12499311, 13378660, 14365705, 15485974, 16764616, 18233505, 19940751, 21941515, 24280368, 26990414, 30105009, 33661431, 37701392, 42285453, 47510938, 53513698, 60463731, 68568129, 78059236, 89150530, 101994639, 116676725, 133217469, 151567426, 171641385, 193394446, 216798659, 241622991, 267190640, 292370480, 315733888, 335555950, 349659743, 355591798, 351443079, 336849576, 313333452, 283716525, 251140117, 218340519, 187346488, 159421446]
55932A59421446k4291490k0615543j7201868j4200347j1675445r617998p957389
55925E3861366o614005n534713m674947l980598l407427k936216k553056k233339
55917B1927065j957387j722881j528587j361290j209747j076354r64135q65579
55909A1241105p74093o93703o27819n69883n14018m64174m24541l90792l58383
55900F423699l30051l07882k87111k64536k44378k29469k15187j98255j83091
55891D163739j73164j64172j52083j40262j32435j25805j17239j09508j05455
55882B943616j02386r7771r4298r3916r2949q8407q3227q0193p6512o9736o3184
55871B001037o0139n8048n3872m9984m9261m9235m6559m2976m1478m0636l7874
$$ y = [159421446, 135129956, 114514413, 97312545, 83112198, 71436753, 61818755, 53861366, 47247361, 41712648, 37037701, 33057103, 29649676, 26713460, 24160404, 21927065, 19969678, 18246797, 16718210, 15356920, 14147173, 13070819, 12106684, 11241105, 10467012, 9773309, 9145490, 8575607, 8061589, 7597415, 7172874, 6782082, 6423699, 6093648, 5785766, 5498655, 5234119, 4989741, 4760272, 4545085, 4346830, 4163739, 3990575, 3826403, 3674320, 3534058, 3401623, 3275818, 3158579, 3049071, 2943616, 2841230, 2743459, 2649161, 2555245, 2462296, 2373889, 2290662, 2210469, 2133957, 2064221, 2001037, 1940898, 1882850, 1828978, 1778994, 1729733, 1680498, 1633939, 1590963, 1549485, 1508849, 1470975]
55860A470975l4628l3301l2648l0756k9292l0203l1494l0602k8879k8557k8398
55849A132217k6397k3941k3321k3809k3753k3878k5037k5489k3790k1635k0717
55838H70450j9660j7105j4821j4495j4423j2696j0740j0435j0595r638q907r946
55826G16989j1137j0416q856q330q138p112o630q220j0498j1474j1718j2347j2293
55813E89820j0528q592q008p543n862m366m453m515k831r18p25r34N83K826L656
55798E37610L603M292M982M135K710K530K944K288J115P97N56r93k811l168k972
55783E57618m186o271p336p668q952j1022j2322j2685j2891j2380j0165p103m711
55770D39926k699j23K178K802K287J867Q99j821n282p447q225q794r007q109o983
$$ y = [1470975, 1436347, 1403046, 1370398, 1339642, 1310350, 1280147, 1248653, 1218051, 1189172, 1160615, 1132217, 1105820, 1081879, 1058558, 1034749, 1010996, 987118, 962081, 936592, 912802, 891167, 870450, 850790, 833685, 818864, 804369, 789946, 777250, 766510, 756075, 745480, 735842, 726935, 716989, 705852, 695436, 686580, 678250, 670112, 663000, 656370, 648150, 637652, 626178, 614460, 602113, 589820, 579292, 570700, 562692, 555149, 549287, 544921, 540468, 535953, 533122, 532204, 531479, 530545, 531128, 533954, 537610, 541213, 545505, 550487, 554622, 557332, 559862, 562806, 565094, 566209, 567006, 567562, 566569, 563758, 560590, 557618, 553432, 547161, 539825, 532157, 523205, 512183, 499861, 487176, 474285, 461905, 451740, 444637, 439926, 437227, 437104, 439282, 442084, 444371, 446238, 447137, 445316, 440034, 432587, 424362, 415568, 406561, 398452, 391469]
55755C91469p032p710p621p209p798q913r105q626q714r019q272o816n974n556
55741B83104m398k715j656j135l81R0o51j815j936j339j327j694j416j056j927
55726B59748l465l903l172k749l021l068k766k871l184k781j762q85J08J878L663
55711B31770M137L621L497L833L601K781K248J910R50m52j447k236l618n254o141
55696B39200o321o467o351n431m313l852l542k564j595j682k166j764q12m01j47
55681A91792R70K368K721K306K230K171J229K03M93J401J175R2j60K74l21k012
55665B06932k969k508j720j156l68L36J45k45N90K082K318J338J093K027K463
55650B10358J745J196J448J432O99K48M12K14n03n99L3k6j240k389k929l859n401
$$ y = [391469, 384437, 376727, 369106, 361897, 354099, 345186, 336081, 327455, 318741, 309722, 301450, 294634, 288660, 283104, 278706, 275991, 274335, 273200, 272819, 272909, 272258, 270443, 268507, 267168, 265841, 264147, 262731, 261675, 259748, 256283, 252380, 249208, 246459, 243438, 240370, 237604, 234733, 231549, 228768, 227006, 226121, 226229, 228107, 231770, 235907, 239528, 243025, 246858, 250459, 253240, 255488, 257398, 258348, 257896, 256449, 254213, 250595, 245341, 239200, 232879, 226412, 220061, 214630, 210317, 206465, 202923, 200359, 198764, 197082, 194916, 193152, 192340, 191939, 191792, 192762, 195130, 197851, 200157, 202387, 204558, 205787, 205990, 206483, 207884, 209059, 209151, 208991, 209265, 208944, 206932, 203963, 201455, 199735, 198579, 198211, 198547, 198692, 198447, 199037, 201119, 203437, 204775, 205868, 207895, 210358, 212103, 213299, 214747, 216179, 216878, 217126, 217538, 217752, 217249, 216650, 216683, 216657, 215417, 213028, 210099, 206240, 200839]
55633B00839o161n529m798m892m984m380l799l810l702l001k302j801p51O92R80
55618A52601l94j718j500m84p2k61m09o67j372k010k012j701j611j704j855k168
55602A32663k276j484j21M30l66j463j869j798j669j291o60l90o69q77p37o72
55586A16751o85j86O79R21M06J99P50J169R58R28J602K203K070J845K285L046
55570A34941L464L482L184K423J563J412J839J649M23p79j115j081j294j474j367
55555A47270j450j874j959j447j148j582k186k560l132l903l866k660j427j081
55541A16995r76l43J58l84j441j747j034RQ20J195J110R67J311J754J182m67j748
55524A17361j746j270j243j215o04j63q57k106k532j805p15J3J10m20j006p34
$$ y = [200839, 194678, 189149, 184351, 179459, 174475, 170095, 166296, 162486, 158784, 155783, 153481, 151680, 150929, 151621, 152601, 152207, 150489, 148989, 148505, 148433, 148172, 147763, 147096, 145724, 143714, 141702, 140001, 138390, 136686, 134831, 132663, 130387, 128903, 128782, 129212, 128846, 127383, 125514, 123716, 122047, 120756, 120096, 119706, 119037, 118160, 117423, 116751, 116066, 115880, 116559, 117480, 117886, 118085, 118835, 120004, 120962, 121890, 123492, 125695, 127765, 129610, 131895, 134941, 138405, 141887, 145071, 147494, 149057, 150469, 152308, 153957, 154380, 153601, 152486, 151405, 150111, 148637, 147270, 145820, 143946, 141987, 140540, 139392, 137810, 135624, 133064, 129932, 126029, 122163, 119503, 118076, 116995, 116019, 115676, 115834, 115450, 114009, 112262, 111228, 111237, 112057, 113252, 114362, 115329, 116640, 118394, 119576, 119109, 117361, 115615, 114345, 113102, 111887, 111283, 111120, 110263, 108157, 105625, 103820, 103105, 103118, 103228, 102808, 101802, 101068]
55508A01068L48R03R0j193j722j639j759k038j931j561j379j204o64j14r4k79
55492H6832J7O85J024Q22N08M91R14J665K157J709N71j33M0K67k7k23J25J73p74
55473I6843j718j281J47R92P52K49k4m41j136j674j882k021k020j419k26Q83J382
55456H7406J337J013N06j47q42j367j354n90M13P10J03n15m16L4J82J40K87L36
55438H7236j84r00r85l61K48L84K23%k58m19k60J01K71J57J05L63O78N98J04k17
55418H6884J98J083J498J032L87K57K19m75j426j554q22l35n81q52o29l28k36
55401H4320O1O50P77P8o93p67l73P3P71J766K229J476J16o43m43J21M14L09J32
55382I0374L87J103J460P02n87j097p11n82j110j255l54P70J202J116Q47N6j194
$$ y = [101068, 101416, 102319, 102409, 101216, 99494, 97855, 96096, 94058, 92127, 90566, 89187, 87983, 87319, 87205, 87111, 86832, 86849, 87534, 88558, 89380, 89888, 90379, 91293, 92958, 95115, 96824, 97395, 97262, 97302, 97569, 97542, 97319, 97444, 97617, 96843, 95125, 93844, 93991, 94983, 95735, 95984, 95960, 95519, 94383, 92709, 90827, 88806, 86786, 85367, 85141, 86024, 87406, 88743, 89756, 90262, 90115, 89273, 87906, 86552, 85962, 86375, 87085, 87188, 86673, 86257, 86291, 86473, 86613, 86900, 87236, 87052, 86152, 85167, 84806, 85054, 85438, 85661, 85661, 85403, 84984, 84724, 84825, 85096, 85253, 85358, 85721, 86399, 86997, 87101, 86884, 87082, 88165, 89663, 90695, 91082, 91339, 91558, 91083, 89657, 88103, 87281, 86946, 86365, 85513, 84884, 84556, 84320, 84381, 85031, 85808, 85886, 85193, 84426, 84053, 84126, 84897, 86663, 88892, 90368, 90484, 89841, 89398, 89519, 89933, 90242, 90374, 90761, 91864, 93324, 94026, 93439, 92342, 91631, 91049, 89939, 88684, 88330, 89100, 90302, 91418, 92265, 92321, 91127]
55365I1127j843j369p97j085j578j261n47n02j074j316q68j25N34Q53O26K01L37
55348H1313J005J233P60N45R17P08o60j737j198nK16k18J0P31P42Q8j19K01J04
55329H4636n44r03p20n06l15J69O00M49J71N66J252J255P44O18P54L50k94j08
55311H8174P57J033M96K27N90O64k3p68j103j407j773j623q92k99j15J39N33N71
55293H5181M02P04J189P00p60j624j032j9L17M02R84J583J315M35n9J45N33O79
55275I1075N75L26Q4j3J5J20M80J181J697J432P23M44O24M38k39m73J42O50J75
55256I9456p50j021m75J47L05N3l29n72n59m76n90p39m96O7L17pm25m56k33j20
55236I3097j79l06m77n61l54L6J85j03n20o82n21k27j17m24r93j272r89n38l32
$$ y = [91127, 89284, 87915, 87118, 86033, 84455, 83194, 82647, 82145, 81071, 79755, 78887, 78762, 79296, 80149, 80775, 80976, 81313, 82318, 83551, 84311, 84856, 85773, 86481, 85821, 84084, 82886, 82881, 83097, 82879, 82889, 83620, 84362, 84450, 84331, 84532, 84636, 84092, 83189, 82469, 81963, 81648, 81817, 82417, 82866, 83037, 83603, 84855, 86110, 86854, 87472, 88226, 88576, 88282, 88174, 88931, 89964, 90460, 90687, 91277, 91941, 91918, 91150, 90047, 88640, 86867, 85244, 84352, 84053, 83938, 84077, 84610, 85181, 85583, 86287, 87476, 88176, 87416, 85792, 84760, 84741, 85058, 85460, 86444, 88027, 89342, 89777, 89718, 89863, 90396, 91075, 91650, 91976, 92060, 92047, 92062, 92182, 92662, 93843, 95540, 96972, 97695, 98139, 98763, 99201, 98962, 98489, 98631, 99281, 99456, 98706, 97685, 97210, 97357, 97662, 97715, 97386, 96814, 96255, 95779, 95189, 94450, 93954, 94021, 94338, 94331, 93906, 93450, 93217, 93097, 92918, 92612, 92135, 91574, 91220, 91256, 91441, 91338, 90818, 90136, 89615, 89388, 89271, 88847, 87854, 86582, 85593, 85055, 84723]
55217H4723p3O85J633K078J912J510R33J26l96qQ95J276R07N38O28Q39Q58Q03
55199I9867O59J58n62r69r18p44n55k61j29m98j004r62m43l3L05R88J599J291
55181I7789M18L04J104J423N10n81o87j26J93J50N8j21l92l56J0ko75j156o48
55162I7215L87J009J072R88Q49N54L48M13M06K5l64k96krk66l26j24l0j99m01
55142A01249l65m6L52M81J37n15j159j618j642p90Q35K078J839N63l07l14l46
55125A00432r71j610j685j437j179p66k49j19l59k43M53R88R05P57R79J079O12
55108I7587O8JJ82K41L67O31M90k15o87l77J02J47K97J175K104J995J035L04J45
55089A05592J6l01m19j33L57Q39J062N80o18j633j516m14P25J252J174P32L01
$$ y = [84723, 84650, 85335, 86968, 89046, 90958, 92468, 93401, 93527, 93131, 93123, 94018, 95294, 96201, 96739, 97367, 98206, 99064, 99867, 100526, 100684, 100122, 99153, 98235, 97491, 96936, 96675, 96546, 96048, 95044, 94082, 93639, 93606, 93911, 94899, 96498, 97789, 98207, 98511, 99615, 101038, 101548, 100967, 100280, 100154, 100347, 100497, 100555, 100434, 100042, 99686, 99696, 99694, 99019, 97863, 97215, 97602, 98611, 99683, 100671, 101520, 102074, 102422, 102835, 103241, 103266, 102902, 102606, 102604, 102595, 102329, 102003, 101879, 101849, 101650, 101249, 100884, 100838, 101190, 101671, 101808, 101293, 100134, 98516, 96874, 96084, 96919, 98997, 100836, 101399, 101092, 100778, 100432, 99461, 97851, 96166, 94729, 93550, 92784, 92535, 92416, 92057, 91814, 92267, 93255, 94160, 94917, 95896, 96975, 97587, 97655, 97656, 97838, 98079, 98446, 99077, 99567, 99352, 98665, 98288, 98390, 98537, 98834, 100009, 102113, 104108, 105143, 105447, 105592, 105608, 105307, 104888, 104755, 105112, 105951, 107013, 107593, 106975, 105342, 103826, 103412, 104137, 105389, 106563, 107295, 107596]
55072A07596K30L51P4n22n02M72J314R87L4m12l78o32j127j172q35p79q92l64
55054A03443P98J556J307O03J70O5J5j41n35j152j583j385o83M9O44J089J000
55037A05260P0j164j787j678j382j013k39P36J166R32P31R28J049O99K00n3j84
55020A04271l45l37m1K18J28k09n33p01n31J04Q62J106P39L48K63P7m97r13n58
55001A03451J89M34J34K06J091J943J710N42m41o27m47m06k82K59Q69R99Q00Q07
54983A11231R80Q40N14O81J363J725J322P31M79K23m16r89r04l91r1p7n1r9n21
54964A16550j174j618j675j385o52M92J503J767J274N34J03L40J174J819J345
54949A20397p5j124j010m23k84m52m41n34j160j792j668j039o78n61j45M69Q09
$$ y = [107596, 107826, 108177, 108251, 107729, 107227, 107699, 109013, 110000, 110034, 109622, 109244, 108612, 107485, 106313, 105478, 104699, 103807, 103443, 104241, 105797, 107104, 107707, 107877, 107942, 107957, 107816, 107281, 106129, 104546, 103161, 102478, 102527, 103171, 104260, 105260, 105330, 104166, 102379, 100701, 99319, 98306, 98067, 98803, 99969, 100901, 101632, 102560, 103609, 104308, 104508, 104455, 104271, 103926, 103589, 103548, 103766, 103894, 103685, 103152, 102451, 101920, 102024, 102886, 103992, 104731, 105079, 105342, 105419, 104922, 104009, 103451, 103640, 104074, 104208, 104414, 105505, 107448, 109158, 109700, 109259, 108632, 108185, 107779, 107497, 107756, 108625, 109624, 110424, 111231, 112211, 113051, 113565, 114246, 115609, 117334, 118656, 119387, 119866, 120089, 119673, 118684, 117780, 117389, 117298, 117221, 117170, 117071, 116550, 115376, 113758, 112083, 110698, 110046, 110538, 112041, 113808, 115082, 115616, 115719, 116059, 117233, 119052, 120397, 120322, 119198, 118188, 117765, 117481, 117029, 116588, 116054, 114894, 113102, 111434, 110395, 109717, 109156, 109011, 109480, 110289]
54932A10289J091J733K141J353k63j183o46P96K486M128N067M587L166K225K316
54917A39286K735L121M007N378O048N222L574K099Q58m22j442j922k332l203m242
54902A58765m862n051n010m519l373k104j484j545j656j402q86l90j20j92m90
54887A25681o81n23q7M33R15J271J563K080K909L506L218K279J689K008K853L604
54871A52718M008M004L610L151K956K735J914O35m24j207k335l790m704m711m511
54856A54049m580m456l857l387l415l354k863k640l051l067j899o01n82j250r24
54841A14123L92J027L36m64m27k24p17j547j896j619r41P5J110J379O32k87n27
54824A10425l46m14n58q9R33J560J127kq88q66J9J089J549J173M15j92n14n45
$$ y = [110289, 111380, 113113, 115254, 116607, 116344, 115161, 114515, 115311, 117797, 121925, 126992, 131579, 134745, 136970, 139286, 142021, 145142, 149149, 154527, 160575, 165797, 169371, 171470, 172328, 171906, 170464, 168542, 166210, 163007, 158765, 153903, 148852, 143842, 139323, 135950, 133846, 132362, 130817, 129161, 127759, 126873, 126483, 126363, 126171, 125681, 125000, 124477, 124390, 124823, 125738, 127009, 128572, 130652, 133561, 137067, 140285, 142564, 144253, 146261, 149114, 152718, 156726, 160730, 164340, 167491, 170447, 173182, 175096, 175731, 175307, 174100, 171765, 167975, 163271, 158560, 154049, 149469, 145013, 141156, 137769, 134354, 131000, 128137, 125497, 122446, 119379, 117480, 116879, 116297, 115047, 114123, 114515, 115542, 115878, 115414, 114987, 114763, 114046, 112499, 110603, 108984, 108043, 108118, 109228, 110607, 111239, 110952, 110425, 110079, 109665, 109107, 109018, 109951, 111511, 112638, 112636, 111748, 110882, 110901, 111990, 113539, 114712, 115127, 114935, 114421, 113876]
54806A13876k00L57N63J98j17K53R09R67M40K02N17N16m00j467j488l80Q11J168
54788A16725O49j54m73J78J425K126J547L36k25J73P51R55J077J382J522J275
54772A29269J170J756K729L326L282K919K600K589L135M207N247N663N392M749
54758A78033L937L127K629K462J952L95k010m297n787o493o693o583o273n664
54744A48735m484k884j764j874k714l067k565j982j918k023j714r98k23L48N18
54729A21391J78k44M3J257K640L317L222K903K855L270M040M672M634M031L544
54714A61753L460L253K391J056l50j844l448m589m675m033l628l876m285m218
54700A36967l546k552j620j095j074j239j136o70j23K27K49j32p99j274j039j64
$$ y = [113876, 113676, 114033, 114596, 114794, 114677, 114930, 115839, 116806, 117246, 117448, 117965, 118481, 118081, 116614, 115126, 114746, 115557, 116725, 117374, 117220, 116747, 116925, 118350, 120476, 122023, 122359, 122134, 122307, 123058, 124013, 125090, 126472, 127994, 129269, 130439, 132195, 134924, 138250, 141532, 144451, 147051, 149640, 152775, 156982, 162229, 167892, 173284, 178033, 181970, 185097, 187726, 190188, 192140, 192535, 190525, 186228, 180441, 173948, 167255, 160672, 154399, 148735, 144251, 141367, 139603, 137729, 135015, 131948, 129383, 127401, 125483, 123460, 121746, 120748, 120525, 120873, 121391, 121569, 121325, 121368, 122625, 125265, 128582, 131804, 134707, 137562, 140832, 144872, 149544, 154178, 158209, 161753, 165213, 168466, 170857, 171913, 171563, 169719, 166271, 161682, 157007, 152974, 149346, 145470, 141185, 136967, 133421, 130869, 129249, 128154, 127080, 125841, 124705, 124035, 123912, 124139, 124388, 124256, 123457, 122183, 121144, 120980]
54684A20980P09J035Q24L58k21q34j224j136o93l93o10j182j579j483j090p75
54668A12686n64j17P35J586J766J081R4m24k83K3O9O1M15Q85O69m82j748k147
54650A14305j592o35M55J692K702K812J906O54l42j030j500j587j194o41k89j64
54634A15552j21j22j13P9M55P33P39O18N01K72o4j60K18P25Q43N48K47J54P4k71
54614A20907q67j413j488q84J09Q26P94J14p24j208j000j25Q81J334J110P04M46
54597A19516R9n29r91p48QN64N67K17k00n59p21n87k75N8M65R16R72L13m97n06
54577A18082L42J041Q91K81j26l59o92q25k43Q16J467J232M70k21n16l77m6p4
54559A21143p13j279p74P04J858J803J032M16L4k84j43P25J497J192L06J85Q94
$$ y = [120980, 121689, 122724, 123548, 123906, 123685, 122851, 121627, 120491, 119798, 119405, 118795, 117613, 116034, 114551, 113461, 112686, 112122, 112005, 112740, 114326, 116092, 117173, 117267, 116843, 116560, 116583, 116652, 116713, 117128, 118013, 118682, 118200, 116452, 114305, 112713, 112078, 112533, 114225, 116927, 119739, 121645, 122299, 121957, 120927, 119427, 117840, 116646, 116005, 115716, 115552, 115431, 115309, 115196, 115275, 115730, 116463, 117202, 117820, 118321, 118593, 118529, 118369, 118587, 119312, 120155, 120703, 120950, 121104, 121178, 120907, 120040, 118627, 117139, 116255, 116364, 117190, 117984, 118098, 117374, 116166, 115166, 115041, 115922, 117256, 118366, 119070, 119516, 119615, 119086, 118095, 117347, 117355, 117919, 118486, 118703, 118503, 117944, 117223, 116636, 116361, 116419, 116884, 117800, 118772, 119085, 118588, 118082, 118424, 119465, 120356, 120637, 120511, 120152, 119460, 118635, 118392, 119208, 120675, 121907, 122377, 122156, 121640, 121263, 121217, 121143, 120430, 119151, 118377, 119081, 120939, 122742, 123774, 124190, 124224, 123940, 123797, 124522, 126019, 127211, 127517, 127702, 128596]
54542A28596J086K64l81J6N55J41o51n93J16K71l09n87q4M79N02L52M63N52J91
54523A30979m49q90r28o29j19L86O38N88L58k6n00p04l69J24J25l62o94n71l45
54504A26612k62q3L24O04M33m7n39r73j302j336r51k25O55J345J273K21j101j574
54486A23074r12J87J066J627J772J243K51l79j78M73J083J642K153K254J811J335
54470A38502J241J203P00j11o32o03k49J32L63L48J38r6k63k87K3O37R15L07o11
54451A41657o42K85Q28J19j005j290q04n27q13j116r51l98J91M91L89J56J85K96
54433A37051j28j071j619j246n81l60l08K01R65J350J314J227J002L00p00j414
54417A35983j569j192l20P02J075N17j10Q6P07Q15N09O18J136J170M51k32k76
$$ y = [128596, 129682, 129946, 129565, 129581, 130136, 130277, 129626, 129033, 129149, 129420, 129111, 128524, 128440, 128919, 129421, 129773, 130236, 130788, 130979, 130530, 129640, 128712, 128083, 127964, 128350, 128988, 129576, 129934, 129908, 129408, 128704, 128335, 128459, 128584, 128222, 127528, 126957, 126612, 126350, 126267, 126591, 127195, 127628, 127581, 127042, 126069, 124767, 123431, 122480, 122255, 122910, 124255, 125528, 125749, 124648, 123074, 122162, 122349, 123415, 125042, 126814, 128057, 128308, 127929, 127751, 128224, 129307, 130949, 133102, 135356, 137167, 138502, 139743, 140946, 141646, 141535, 140903, 140300, 140051, 140183, 140546, 140894, 141032, 140936, 140673, 140386, 140409, 141046, 141961, 142268, 141657, 141015, 141300, 142128, 142247, 141242, 139952, 139148, 138621, 137808, 136692, 135741, 135343, 135534, 136025, 136414, 136570, 136755, 137051, 136923, 135852, 134233, 132987, 132406, 132046, 131738, 131939, 132904, 134254, 135568, 136795, 137797, 138097, 137397, 135983, 134414, 133222, 132902, 133604, 134679, 135196, 135086, 135172, 135879, 136694, 137203, 137821, 138957, 140127, 140578, 140346, 140070]
54400A40070L4L11O46J162J660J943K006J781J215N65R8l07p21o18L53J338J120
54383A52656j19r80q85o66q97r38k13O73R06P56R99J638K039J973J773J684J632
54366A62031J539J458J491J806K468L039K870K036J500J839K287J673J0j552k182
54351A82313k178k246k577k950l223l445l566l412k940k308j646r38k89j11p17
54336A49767j647j879r28M75J125O27l26q33o34j99j66o99j254j163m83K4m1j56
54318A41610K86R90J147N19m10j074j154n62L15O99L84K17Q65J492P81r60j991
54301A43154j528o86o29j005r24m21p4O4K59L15l6l24J55J128J537J014M46P43
54283A43188J576J760P67o07j181p59k26k26l39J07Q27R60M70K99R32J652J597
$$ y = [140070, 140104, 140415, 141061, 142223, 143883, 145826, 147832, 149613, 150828, 151393, 151491, 151184, 150463, 149845, 150198, 151536, 152656, 152537, 151557, 150672, 150006, 149109, 148171, 147958, 148631, 149537, 150293, 151292, 152930, 154969, 156942, 158715, 160399, 162031, 163570, 165028, 166519, 168325, 170793, 173832, 176702, 178738, 180238, 182077, 184364, 186037, 186047, 184495, 182313, 180135, 177889, 175312, 172362, 169139, 165694, 162128, 158716, 155776, 153468, 151822, 150884, 150595, 150484, 149767, 148120, 146241, 145313, 145788, 146913, 147540, 147214, 146381, 145747, 145548, 145382, 144683, 143429, 142266, 141783, 141807, 141766, 141610, 141896, 142886, 144033, 144552, 144142, 143068, 141914, 141352, 141667, 142366, 142750, 142967, 143832, 145324, 146105, 145145, 143154, 141626, 140940, 140311, 139306, 138382, 137961, 137887, 137951, 138210, 138525, 138489, 138165, 138320, 139448, 140985, 141999, 142445, 143188, 144764, 146524, 147291, 146684, 145503, 144744, 144518, 144292, 143953, 144060, 144887, 145847, 146317, 146616, 147548, 149200, 150797]
54266A50797R15L22O4r4k54l45m77p90j045q33j51O21J171J408J306R76P67R35
54248A55293J205J032K86n55r58q09l84j6P5j04l62m83m32l11j67P8M63P91P32
54229A55374J51o48j131j035n89j46J96N09P07N82J13m16o66m40J66O84N26l49
54211A53588j198j261p07m07q06j394j445q98k96q8j36K7N11P69K47o77r14n3
54193A44862R70J063M20L9J43np47j345j016RQ19Q50L10j58o5M96J006J210J430
54174A50291J860J965J206Q4l54OK54j32o62q55r51j197j247p84j74Q7M7L5J30
54155A49609L26P62J328J420O00p46j740j857j240m83j91l92l45N70J737J801
54139A51159M90q08p27M65J473J582J092N82M03N71P19L87l51q86r43q72q53m54
$$ y = [150797, 151712, 152034, 152098, 152004, 151750, 151405, 150928, 150138, 149093, 148260, 148109, 148730, 149901, 151309, 152615, 153591, 154358, 155293, 156498, 157530, 157816, 157261, 156303, 155494, 155110, 155094, 155169, 155065, 154703, 154220, 153788, 153477, 153310, 153388, 153851, 154642, 155374, 155525, 154877, 153746, 152711, 152122, 151976, 152172, 152681, 153388, 153970, 154083, 153667, 153001, 152561, 152727, 153411, 153937, 153588, 152390, 151129, 150422, 150015, 149209, 147815, 146370, 145472, 145176, 145088, 144952, 144979, 145490, 146259, 146506, 145829, 144915, 144862, 145832, 146895, 147315, 147354, 147497, 147492, 146745, 145400, 144384, 144393, 145212, 146062, 146372, 146214, 146149, 146645, 147651, 148861, 150291, 152151, 154116, 155322, 155406, 155052, 155058, 155312, 155180, 154518, 153663, 152712, 151515, 150268, 149484, 149310, 149397, 149444, 149479, 149609, 149935, 150697, 152025, 153445, 154045, 153299, 151559, 149702, 148462, 147979, 147788, 147396, 147051, 147621, 149358, 151159, 151649, 150841, 150114, 150579, 152052, 153634, 154726, 155308, 155711, 156282, 157001, 157388, 157037, 156151, 155208, 154336, 153483, 153029]
54121A53029M53J104Q01o5o00n48j50N64J520K069J670Q32N63R88J377J367J310
54104A66284J395J261O94K9k90j00N79J547K287K379K095K068K364K462K205K116
54088A89375K516K859K331Q22r42k134k505k497k758l478m172m193l326j882m13
54073A69603N47P56N61O63J303J911J891J402J047J049J194J300J296J028N67
54058A86118M57J138K211K844K781K453K192J903J468R08J45p98j378q59P41K461
54042B04785L305L080K293J708J924K989M271N061N265N188M823L946K848K248
54028B53734K300K306J683P12K5j63K1M95J085J345R43J04p28j497k481l615m351
54011B51918m261l601l126l346m099m839n148m968m372l442k383j493r43o92p30
$$ y = [153029, 153482, 154586, 155387, 155322, 154722, 154174, 154024, 154588, 156108, 158177, 159847, 160679, 161242, 162230, 163607, 164974, 166284, 167679, 168940, 169634, 169663, 169373, 169273, 169852, 171399, 173686, 176065, 178160, 180228, 182592, 185054, 187259, 189375, 191891, 194750, 197081, 197903, 196961, 194827, 192322, 189825, 187067, 183589, 179417, 175224, 171898, 170016, 169603, 170150, 170906, 171467, 172130, 173433, 175344, 177235, 178637, 179684, 180733, 181927, 183227, 184523, 185551, 186118, 186575, 187713, 189924, 192768, 195549, 198002, 200194, 202097, 203565, 204473, 204618, 203820, 202442, 201583, 202324, 204785, 208090, 211170, 213463, 215171, 217095, 220084, 224355, 229416, 234681, 239869, 244692, 248638, 251486, 253734, 256034, 258340, 260023, 260735, 260760, 260597, 260618, 261113, 262198, 263543, 264486, 264590, 263862, 262365, 259884, 256269, 251918, 247657, 244056, 240930, 237584, 233485, 228646, 223498, 218530, 214158, 210716, 208333, 206840, 205897, 205205, 204475]
53996B04475j115j703k109k153k021j795j242l67K67K36r3j98k71p36j192p78
53980A89205L52R44L28o48q83n18m22p10o37J24R94J391J541J962K568K797K466
53963B00854K016J880K042K374K923L619M064M132M468N720P424Q401Q289P955
53949B66161Q126Q381P870O342L975Q92k490n184o449o558o175n353l869k082
53935B63587o56M07J523K503K686K109J676J995K708L194L352L487L825M313M599
53920C01308M388M070M573O005O899N872L750K834L980N542N597M065K145O60
53906C61688l42j079j888l035m196m550l908l138l014l265l309l295l673m307
53892C18689m759n083n599o159o354o244o179o103n692n070m685m540m179l446
$$ y = [204475, 203360, 201657, 199548, 197395, 195374, 193579, 192337, 191970, 192237, 192473, 192380, 192182, 191911, 191175, 189983, 189205, 189557, 190501, 190829, 190181, 189298, 188780, 188358, 187648, 187011, 187135, 188129, 189520, 191061, 193023, 195591, 198388, 200854, 202870, 204750, 206792, 209166, 212089, 215708, 219772, 223904, 228372, 234092, 241516, 249917, 258206, 266161, 274287, 282668, 290538, 296880, 300855, 301747, 299257, 294073, 287624, 281066, 274891, 269538, 265669, 263587, 262931, 263338, 264861, 267364, 270050, 272159, 273835, 275830, 278538, 281732, 285084, 288571, 292396, 296709, 301308, 305696, 309766, 314339, 320344, 327243, 333115, 336865, 339699, 343679, 349221, 354818, 358883, 361028, 361688, 361346, 360267, 358379, 355344, 351148, 346598, 342690, 339552, 336538, 333273, 329964, 326669, 322996, 318689, 313930, 308847, 303248, 297089, 290735, 284491, 278312, 272209, 266517, 261447, 256762, 252222, 248043, 244597]
53878B44597k699k245k100k252k658k967k774k240j958k134k412k495k445k286
53864B10932j882j376j205j369j309q31o79j505k730l103k258j050l24k3L24P77
53848A92389J081J092Q00J74o46j194j165q41o12l39L07J014J063M32o3P8M85
53831A94055P72J175J796K002J367O09O39J083Q38j07n75j2P16P28K94P3Q6J55
53813B05694O24J790L009L265K550J918K161L015L763M097M248M552N036N324
53799B51046M968M032L188K938K943K513J634J055J239J762J970J796J541J156
53785B83781K90r42j827j913j678j920k749l561l870l811l734l783l958m234m452
53770B41639m374m010l546k903j887r32r84k153l139k709j289l30l84p52q37q14
$$ y = [244597, 241898, 239653, 237553, 235301, 232643, 229676, 226902, 224662, 222704, 220570, 218158, 215663, 213218, 210932, 209050, 207674, 206469, 205100, 203791, 202960, 202281, 200776, 198046, 194943, 192685, 191635, 191311, 191288, 191612, 192389, 193470, 194562, 195362, 195536, 194890, 193696, 192531, 191690, 191078, 190739, 191046, 192060, 193123, 193555, 193492, 193570, 194055, 194827, 196002, 197798, 199800, 201167, 201776, 202415, 203498, 204336, 204229, 203654, 203642, 204358, 205086, 205380, 205453, 205539, 205694, 206318, 208108, 211117, 214382, 216932, 218850, 221011, 224026, 227789, 231886, 236134, 240686, 245722, 251046, 256014, 260046, 263234, 266172, 269115, 271628, 273262, 274317, 275556, 277318, 279288, 281084, 282625, 283781, 284071, 283129, 281302, 279389, 277711, 275791, 273042, 269481, 265611, 261800, 258066, 254283, 250325, 246091, 241639, 237265, 233255, 229709, 226806, 224919, 223987, 223003, 220850, 217711, 215002, 213713, 213383, 212999, 212247, 211410, 210596]
53754B10596q95q88p58q47j232j506j499j494j465q78L48J364J495J155J048J007
53738B05551M58l45m28N55J793K282J846J111P78J050J580J865J775J549J312
53723B22732Q73J45m75m47L25J426K264K401J815J035P66J198J912K588L334M106
53707B45998M292L445K170J613K178L116L526L261K818K592K478K156J639J335
53693B82617J459J610J261O41N47J187J757J487O44K8j28k53o57j242j808k224
53677B86926k284j840j089m83l11n62j018j312j147p19p06j379k017j647l22Q56
53661B70946J020L92k12k91Q0N62Q15O56J87j92r9M94J196J554J455J209J112
53644B80884J048P16K39J81Q19J722K281K396K410K535K670K717K766K954L298
$$ y = [210596, 209701, 208813, 208055, 207208, 205976, 204470, 202971, 201477, 200012, 199134, 199482, 200846, 202341, 203496, 204544, 205551, 206009, 205664, 205236, 205791, 207584, 209866, 211712, 212823, 213601, 214651, 216231, 218096, 219871, 221420, 222732, 223605, 223750, 223275, 222828, 223153, 224579, 226843, 229244, 231059, 232094, 232860, 234058, 235970, 238558, 241892, 245998, 250290, 253735, 255905, 257518, 259696, 262812, 266338, 269599, 272417, 275009, 277487, 279643, 281282, 282617, 284076, 285686, 286947, 287588, 288135, 289322, 291079, 292566, 293210, 293238, 293110, 292857, 292200, 290958, 289150, 286926, 284642, 282802, 281713, 281230, 280919, 280357, 279339, 278027, 276880, 276161, 275455, 274076, 272059, 270412, 270090, 270946, 271966, 272358, 272146, 271855, 271935, 272497, 273312, 273968, 274155, 273963, 273864, 274358, 275554, 277108, 278563, 279772, 280884, 281932, 282648, 282887, 283068, 283887, 285609, 287890, 290286, 292696, 295231, 297901, 300618, 303384, 306338, 309636]
53629C09636L657L839L739L436L061K681K392K473L145M207N202N857O079N660
53615C65064M546L317K763K852K833K485K427K878K986K087Q99N99J230J820J770
53600D00556J300P48K36o5k1J39J66K38N78Q33M87k96r55j424k019k606k760k632
53582C92503k805l240l234k548j735j221r15q68j406k305k698k240j563j193q85
53567C63647m34k47m55l26N94J528J540J002Q98J191J042M35K56P18Q71J42o85
53550C71717n97K97J172J660J937K044J903J762K065K759L358L711M248N291O475
53535D09802P195P359P439P857Q592R296R699R898J0267J1058J1951J2296J1948
53522E34657J1669J2318J3756J5056J5804J6626J8095J9661K0292J9936J9693
$$ y = [309636, 313293, 317132, 320871, 324307, 327368, 330049, 332441, 334914, 338059, 342266, 347468, 353325, 359404, 365064, 369610, 372927, 375690, 378542, 381375, 383860, 386287, 389165, 392151, 394238, 395137, 395736, 396966, 398786, 400556, 401856, 402604, 402840, 402775, 402754, 402893, 403059, 403297, 403875, 404708, 405195, 404899, 403944, 402520, 400501, 397895, 395135, 392503, 389698, 386458, 383224, 380676, 378941, 377720, 376805, 375937, 374531, 372226, 369528, 367288, 365725, 364532, 363647, 363213, 362966, 362511, 362185, 362779, 364307, 365847, 366849, 367747, 368938, 369980, 370415, 370671, 371389, 372260, 372402, 371717, 371120, 371417, 372589, 374249, 376186, 378230, 380133, 381895, 383960, 386719, 390077, 393788, 398036, 403327, 409802, 416997, 424356, 431795, 439652, 448244, 457540, 467239, 477137, 487404, 498462, 510413, 522709, 534657, 546326, 558644, 572400, 587456, 603260, 619886, 637981, 657642, 677934, 697870, 717563]
53511G17563K0433K1826K2965K3450K3464K3043K1930K0216J8696J8253J8962
53500I50801K0016K0485K0059J9092J8124J7432J6906J6239J5246J4149J3445
53489A141994J3443J3952J4477J4661J4423J3841J3063J2321J1746J1201J0427
53478A285549R300P813N909L643J435k54j514k894m676o596q379j0083j1758j3229
53464A254266j4425j5486j6279j6296j5467j4618j4657j5557j6645j7541j8263
53453A079032j8675j8556j8075j7608j7073j6093j4847j4013j3742j3334j2242
53442I04774j0791r541q451p124n482l664j618O92K767L875L967L847M365N701
53428H83317P498R325J0803J1669J2029J2408J3251J4482J5766J7111J8803K0863
$$ y = [717563, 737996, 759822, 782787, 806237, 829701, 852744, 874674, 894890, 913586, 931839, 950801, 970817, 991302, 1011361, 1030453, 1048577, 1066009, 1082915, 1099154, 1114400, 1128549, 1141994, 1155437, 1169389, 1183866, 1198527, 1212950, 1226791, 1239854, 1252175, 1263921, 1275122, 1285549, 1294849, 1302662, 1308571, 1312214, 1313649, 1313395, 1311881, 1308987, 1304311, 1297715, 1289336, 1279253, 1267495, 1254266, 1239841, 1224355, 1208076, 1191780, 1176313, 1161695, 1147038, 1131481, 1114836, 1097295, 1079032, 1060357, 1041801, 1023726, 1006118, 989045, 972952, 958105, 944092, 930350, 917016, 904774, 893983, 884442, 875991, 868867, 863385, 859721, 858103, 858795, 861562, 865437, 869404, 873251, 877616, 883317, 890815, 900140, 910943, 922612, 934641, 947049, 960300, 974782, 990548, 1007659, 1026462, 1047325]
53416A047325K2862K4448K5655K6634K7465K8402K9893L2015L4189L5822L6955
53405A371665L7934L8855L9821M1283M3443M5576M6767M7203M7827M8793M9278
53394A858445M8914M8428M8406M8418M7862M6901M5931M4779M3063M0823L8249
53383B360219L5311L2169K9218K6288K2499J7584J2582Q370M364m04n627j0357
53371B532216j4687j9427k4534k9205l3371l7606m1674m4566m6172m7522m9085
53360B144367n0111n0080m9526m8895m7865m6393m5270m4814m4023m1994l9345
53349A636051l7251l5803l4349l2873l1911l1358l0425k8777k6924k5439k4313
53338A296628k3100k1362j9088j6931j5665j5011j3638j0952q324p601q687r683
$$ y = [1047325, 1070187, 1094635, 1120290, 1146924, 1174389, 1202791, 1232684, 1264699, 1298888, 1334710, 1371665, 1409599, 1448454, 1488275, 1529558, 1573001, 1618577, 1665344, 1712547, 1760374, 1809167, 1858445, 1907359, 1955787, 2004193, 2052611, 2100473, 2147374, 2193305, 2238084, 2281147, 2321970, 2360219, 2395530, 2427699, 2456917, 2483205, 2505704, 2523288, 2535870, 2544240, 2548604, 2548200, 2542573, 2532216, 2517529, 2498102, 2473568, 2444363, 2410992, 2373386, 2331712, 2287146, 2240974, 2193452, 2144367, 2094256, 2044176, 1994650, 1945755, 1897890, 1851497, 1806227, 1761413, 1717390, 1675396, 1636051, 1598800, 1562997, 1528648, 1495775, 1463864, 1432506, 1402081, 1373304, 1346380, 1320941, 1296628, 1273528, 1252166, 1233078, 1216147, 1200482, 1185471, 1171833, 1160881, 1152557, 1144956, 1136269, 1126586]
53326A126586r409q637q583r162r399q876p964o999n925m795l963l586l229k234
53312A033825m63J526L056M035M986O395Q153R713J0744J1524J2612J4196J5857
53299A136159J7044J7714J8374J9475K0970K2505K3796K4648K4843K4342K3431
53288A373301K2348K0901J8811J6336J4054J2021R634O526L171L66j689l508n741
53275A486531q624j1875j4915j7233j8686j9548k0278k1279k2647k4072k5145
53264A282229k5841k6422k6830k6721k6357k6747k8175k9272k8576k6639k5339
53253I85310k5267k5210k4362k3475k3155k2538k0846j9121j8956k0027k0396
53242G41957j9103j7183j5977j5561j5169j4326j3054j1552j0059q814p899p261
$$ y = [1126586, 1117177, 1108540, 1099957, 1090795, 1081396, 1072520, 1064556, 1057557, 1051632, 1046837, 1042874, 1039288, 1036059, 1033825, 1033362, 1034888, 1037944, 1041979, 1046965, 1053360, 1061513, 1071226, 1081970, 1093494, 1106106, 1120302, 1136159, 1153203, 1170917, 1189291, 1208766, 1229736, 1252241, 1276037, 1300685, 1325528, 1349870, 1373301, 1395649, 1416550, 1435361, 1451697, 1465751, 1477772, 1487406, 1493932, 1497103, 1497469, 1495780, 1492272, 1486531, 1477907, 1466032, 1451117, 1433884, 1415198, 1395650, 1375372, 1354093, 1331446, 1307374, 1282229, 1256388, 1229966, 1203136, 1176415, 1150058, 1123311, 1095136, 1065864, 1037288, 1010649, 985310, 960043, 934833, 910471, 886996, 863841, 841303, 820457, 801336, 782380, 762353, 741957, 722854, 705671, 689694, 674133, 658964, 644638, 631584, 620032, 609973, 601159, 593260, 585999]
53230E85999o894o736o537o192o145o928q329r473r879r944j0188j0475j0305
53217D77974r550q624q040q054q545r032q928q038o832o033n921o169o317o258
53203C71633o126n930n570n221n328n992o659o706o226n776n589n426n215n178
53189B90691n206m707l441k000j094p54o43p43j193j741j981k002k213k601k689
53174B57683k279j723j373j207j126j188j384j486j328j018o97l59OK47K08q8
53158B42888n34j020j321j180o70k90m17p92q22l59J11J10k40m44k59M9M8l53
53140B34505p72o64J01R20R39N3q18o90L20J219J406J179R45O24J70Q4P24J520
53122B41765J562Q23J52J47N98J105J513J630J151K61k27K04J010J136K64q62
$$ y = [585999, 579105, 572369, 565832, 559640, 553495, 546567, 538238, 528765, 518886, 508942, 498754, 488279, 477974, 468424, 459800, 451760, 443706, 435161, 426129, 417201, 409163, 402331, 396298, 390377, 384208, 377891, 371633, 365507, 359577, 354007, 348786, 343458, 337466, 330807, 324101, 317875, 312099, 306510, 301084, 295869, 290691, 285485, 280778, 277337, 275337, 274243, 273489, 272846, 272103, 270910, 269169, 267188, 265186, 262973, 260372, 257683, 255404, 253681, 252308, 251101, 249975, 248787, 247403, 245917, 244589, 243571, 242874, 242515, 242521, 242768, 242976, 242888, 242354, 241334, 240013, 238833, 238163, 237873, 237456, 236664, 235842, 235483, 235594, 235704, 235464, 235020, 234761, 234810, 234858, 234505, 233733, 233069, 233170, 234090, 235029, 235082, 234264, 233574, 233894, 235113, 236519, 237698, 238643, 239267, 239437, 239521, 240245, 241765, 243327, 244150, 244302, 244449, 245047, 246152, 247665, 249295, 250446, 250707, 250480, 250684, 251694, 252830, 253094, 252232]
53106B52232j354j141r35j325k048k278j631o32r9k93q59j365j548j262n66K34
53090B35130Q41J131R16J2j168j589q08K42L78l04q27q84r13r25m50K86L69l31
53072B31106q16m84Q6K64K75L28r4j268k349k344j421m96l1M6k09o38p69m53k26
53053B20507m70o41j10P67J198J179J299J591J454O63l53j181j749j951j595p57
53037B19851J26O09M83q6m96j85N81Q88M32O6M90J134J047M60M81J437K442K532
53019B32292J618K36j011j695j697j177l07P83J648J628O82k96m46J15O93Q79
53003B33945O15m5p18p85k17K18R3m8K54M95J88j34J55O26O56O75J326K004J689
52984B40992P18L00O30R55J162J721K268J904R05N40J053J415J256J316J640J175
$$ y = [252232, 250878, 249737, 248802, 247477, 245429, 243151, 241520, 240888, 240789, 240496, 239637, 238272, 236724, 235462, 234896, 235130, 235971, 237102, 238018, 238030, 236862, 235273, 234465, 234707, 235085, 234781, 233954, 233070, 232157, 231232, 230782, 231068, 231437, 231106, 230290, 229806, 229892, 230156, 230431, 230759, 230665, 229397, 227048, 224704, 223283, 222787, 222756, 222802, 222593, 221955, 221186, 220733, 220507, 220037, 219396, 219286, 220053, 221251, 222430, 223729, 225320, 226774, 227437, 227084, 225903, 224154, 222203, 220608, 219851, 219977, 220586, 221069, 220983, 220487, 220302, 220883, 221771, 222203, 222269, 222759, 223893, 224940, 225400, 225881, 227318, 229760, 232292, 233910, 234146, 233135, 231440, 229743, 228566, 228259, 229042, 230690, 232318, 233000, 232704, 232258, 232373, 233066, 233945, 234560, 234515, 233797, 233012, 232795, 233013, 233106, 233058, 233312, 233807, 233995, 233861, 234016, 234642, 235298, 235973, 237299, 239303, 240992, 241710, 242010, 242640, 243595, 244757, 246478, 248746, 250650, 251555, 252095, 253148, 254563, 255819, 257135, 258775, 259950]
52968B59950k60j257r02j25lj39K29P33O79L58L83M17k39j379k228k547k508k025
52950B49137j094l54m02q78j012p93q19j210j482j269o49J09O77P10K04m02p72
52933B39701r81j048p24j08J76j56n30m25j63k52m93m37k17j80j33L06Q97J072
52915B36305P73L32j90q33j161o81K56O99K99l10m00J26Q91J457J553J185O47
52898B40948J60l64r53j240q73j14L82L55J41J91O42J259J503Q82m98j795k125
52881B38501j335l1R90J221P47K64M71J225J654J337Q76R65J408J508J102O01
52865B51504L13K40L36N27N90M72M88Q29J097P27l12j573k636l195k966k037j131
52848B43273j023j725k611l095k998k408j710j420j630j733j144m6Q78J212R22
$$ y = [259950, 259690, 258433, 257531, 257406, 257403, 257264, 257493, 258226, 258905, 259263, 259646, 260063, 259824, 258445, 256217, 253670, 251162, 249137, 248043, 247689, 247287, 246409, 245397, 244604, 243785, 242575, 241093, 239824, 239175, 239284, 239961, 240671, 240875, 240473, 239701, 238720, 237672, 236948, 236840, 237016, 236860, 236330, 235905, 235742, 235490, 234997, 234560, 234343, 234163, 234030, 234336, 235233, 236305, 237078, 237410, 237220, 236387, 235226, 234545, 234801, 235500, 235799, 235489, 235089, 235215, 236106, 237563, 239116, 240301, 240948, 241108, 240744, 239791, 238551, 237678, 237564, 237946, 238301, 238442, 238633, 239275, 240534, 242037, 242919, 242421, 240626, 238501, 237166, 237135, 238125, 239346, 240093, 240357, 240828, 242053, 243707, 245044, 245920, 246885, 248293, 249801, 250903, 251504, 251817, 252057, 252393, 252920, 253510, 253982, 254470, 255299, 256396, 257123, 256811, 255238, 252602, 249407, 246441, 244404, 243273, 242250, 240525, 237914, 234819, 231821, 229413, 227703, 226283, 224653, 222920, 221776, 221730, 222608, 223820, 224742]
52833B24742J36p20q76l7J003J162M44j54k0M32N11R1m47o97n08j27l3l55n91
52814B23956l18O6j75r18j159k64J230K288K384J721Q11R1l08n92r77j303j247
52797B25286q86o71q24j081j124r73p66m57n7J21k64j018j481j216m83P5J28j78
52779B14131o00j012j158o87L03J060J039O37N87Q05N47l84j272j444q94R4J249
52762B13001K064J961J053N6o59j229j396m82J229K214J550K08l59r0J91L56R04
52745B20572J694K002J659J144P65N77Q53J671K289J948J128R47J424J442N55
52730B40670l33l45L09R45J212J005L10m79p53n00l95p95j254j274r17m94j39
52713B36773L9o0k55l03m20j040j862j932r07M02J027Q70M56J90K13M81O73M29
$$ y = [224742, 224878, 224158, 223282, 223245, 224248, 225410, 225854, 225700, 225680, 226112, 226623, 226714, 226267, 225570, 225062, 224935, 224902, 224547, 223956, 223638, 223704, 223529, 222611, 221452, 221188, 222418, 224706, 227090, 228811, 229622, 229713, 229405, 228813, 227836, 226533, 225286, 224400, 223729, 222905, 221824, 220700, 219727, 218961, 218504, 218447, 218568, 218304, 217286, 215805, 214589, 214106, 214181, 214309, 214131, 213531, 212519, 211361, 210674, 210977, 212037, 213076, 213713, 214300, 215105, 215652, 215268, 213996, 212552, 211658, 211752, 213001, 215065, 217026, 218079, 218135, 217476, 216247, 214851, 214369, 215598, 217812, 219362, 219570, 219211, 219121, 219312, 219668, 220572, 222266, 224268, 225927, 227071, 227836, 228413, 229266, 230937, 233226, 235174, 236302, 237249, 238673, 240115, 240670, 240337, 239992, 240301, 241246, 242458, 243463, 243773, 243294, 242541, 242041, 241646, 240851, 239597, 238323, 237406, 236912, 236773, 236812, 236752, 236497, 236194, 235774, 234734, 232872, 230940, 230033, 230435, 231462, 232332, 232788, 232978, 233191, 233672, 234345, 234774]
52695B34774j11m27l51k10j05K74Q44R17J95n80n63P4M61K14k25k85N5L26Q9n22
52675B34844q55n33L3L12N10J174K019K131J415R09J227J633J200K22l15j42J40
52658B45924R9p6p8O8J69K03M72J297K385K713J597j55r24k50O08L75p54j726
52640B51947j935j441n00L60M75j27m83L5P37O84J00p7L69R14J377J977K489K344
52622B59245J633J039P08P3j014j837j767j034k39L20M92J33o17j213j220o83
52606B54019P7O64O04k29j142j180l67K34k0n18l90K76P80Q60P50N84M01M91J044
52587B56938J607J513Q51M27O34R78Q71M01M0l6J7J30M16Q85J300J328Q13j05
52569B69008j075j789k200k380k294j843j137n26k91m40p72j025r69n95k26k02
$$ y = [234774, 234663, 234236, 233885, 233675, 233570, 233844, 234688, 235605, 235800, 235220, 234657, 234731, 235192, 235406, 235181, 234896, 234951, 235277, 235366, 234844, 233989, 233456, 233489, 233801, 234311, 235485, 237504, 239635, 241050, 241959, 243186, 244819, 246019, 246241, 245926, 245784, 245924, 246023, 245947, 245869, 245937, 246106, 246309, 246781, 248078, 250463, 253176, 254773, 254618, 253694, 253444, 254052, 254427, 253673, 251947, 250012, 248571, 248071, 248431, 248906, 248779, 248296, 248331, 249068, 249752, 249852, 249775, 250144, 251058, 252435, 254412, 256901, 259245, 260878, 261917, 262625, 262698, 261684, 259847, 258080, 257046, 256807, 257127, 257619, 257752, 257135, 255922, 254702, 254019, 254096, 254760, 255364, 255135, 253993, 252813, 252446, 252680, 252660, 252142, 251752, 252028, 252808, 253668, 254418, 255002, 255403, 255894, 256938, 258545, 260058, 260909, 261336, 261970, 262948, 263819, 264220, 264260, 264224, 264241, 264371, 264787, 265672, 266972, 268300, 269113, 269008, 267933, 266144, 263944, 261564, 259270, 257427, 256290, 255764, 255473, 255033, 254261, 253236, 252267, 251672, 251446, 251244]
52553B51244m18m73k83j75k69k39K1K1n43j030n71O45J549J617J386J408J461
52536B55351J161P52O40N87J5r35j341n81Q59J893J948J373Q19N09K53O6K60P58
52518B64387Q05n8j004p00R32K533L045K859K819K956K852K629K672K692K072
52503B91491R96L85N25N45m22k031l109l028k375k283l118l985l695k255r71r31
52487B65739j721k105j515m10N63J141J285J076Q26Q25R83J010Q93Q01O72L89
52471B70452J95M29R40J281J421J699K141K355K174J871J703J695J855K090J957
52456B94258J086j66j061j464j850k361k596k465k502k985l413l237k626k132
52442B66486k000k052j956j369k64P94J066M69l36p36o01m9N43M55o23j685j266
$$ y = [251244, 250826, 250353, 250070, 249895, 249626, 249387, 249408, 249429, 248886, 247856, 247285, 247930, 249479, 251096, 252482, 253890, 255351, 256512, 257264, 257904, 258491, 258506, 257571, 256230, 255649, 256508, 258401, 260349, 261722, 262541, 263050, 263303, 263369, 263629, 264387, 265192, 265134, 264130, 263430, 264362, 266895, 269940, 272799, 275618, 278574, 281426, 284055, 286727, 289419, 291491, 292487, 292872, 293397, 293942, 293520, 291489, 288380, 285352, 282977, 280694, 277576, 273591, 269896, 267641, 266670, 265739, 264018, 261913, 260398, 259988, 260551, 261692, 262977, 264053, 264879, 265704, 266687, 267697, 268590, 269391, 270063, 270452, 270647, 271076, 272016, 273297, 274718, 276417, 278558, 280913, 283087, 284958, 286661, 288356, 290211, 292301, 294258, 295344, 295178, 294117, 292653, 290803, 288442, 285846, 283381, 280879, 277894, 274481, 271244, 268618, 266486, 264486, 262434, 260478, 259109, 258845, 259639, 260705, 261174, 260838, 260102, 259501, 259452, 259995, 260450, 259827, 258142, 256876]
52425B56876N17J846J546N85M88J228J640J298Q13O63P12Q71J347K217L283M359
52409B80289N248N603N358N175N849P245Q365Q459P565N905L375ll481n930o834
52394C32188o711o435o259n734m603l344k568k244j949j615j369r44K0J187J839
52379B91459K048K527L212L114K040J320K065L573M348M002L260K644K214K217
52365C30043K878L637L492K230O76l14n63m06l37p46j477j789j122K08J443K195
52349C40048K401J959J051N23J105K434L536M046M332M630M898N408O545P995
52335C90911Q962R324R801J0835J2029J2998J3990J5270J6512J7303J7789J8390
52323E54114J9134J9704J9950J9963J9762J9251J8434J7489J6509J5364J3971
$$ y = [256876, 257393, 259239, 260785, 261370, 261858, 263086, 264726, 266024, 266837, 267500, 268212, 269083, 270430, 272647, 275930, 280289, 285537, 291140, 296498, 301673, 307522, 314767, 323132, 331591, 339156, 345061, 348436, 348433, 344952, 339022, 332188, 325477, 319042, 312783, 307049, 302446, 299102, 296534, 294290, 292341, 290726, 289357, 288413, 288433, 289620, 291459, 293507, 296034, 299246, 302360, 304400, 305720, 307785, 311358, 315706, 319708, 322968, 325612, 327826, 330043, 332921, 336558, 340050, 342280, 342956, 342642, 342079, 341673, 341336, 340590, 339113, 337324, 336202, 336410, 337853, 340048, 342449, 344408, 345459, 345982, 347087, 349521, 353057, 357103, 361435, 366065, 370963, 376371, 382916, 390911, 399873, 409197, 418998, 429833, 441862, 454860, 468850, 484120, 500632, 517935, 535724, 554114, 573248, 592952, 612902, 632865, 652627, 671878, 690312, 707801, 724310, 739674, 753645]
52312G53645J2692J2130J2293J2293J1328R852R024R033Q810P747O672O451O503
52299H78473N681M034K541J505L55j069k242l011l889n098o244p174q249r422
52285H46191r891r062p265n126k893p04J104K458L813N496P176Q415R340J0377
52271H59429J1551J2487J2884J2799J2514J2326J2290J2107J1402J0206Q850P614
52259I96459O683O357O730P226O966N667L824J975L66p82j326j715k778m752p013
52244A023887q989j0755j2531j4146j5314j6040j6393j6253j5557j4448j3060
52233H70401j1492j0075r166q575p723o542n618n220m851m101l277k732k145j035
52219G87849L64J340J566J355J258J740K853M006M385L954L574L870M398M408
$$ y = [753645, 766337, 778467, 790760, 803053, 814381, 824233, 833257, 842290, 851100, 858847, 865519, 871970, 878473, 884154, 888188, 890729, 892234, 892589, 891520, 889278, 886267, 882378, 877280, 871036, 863862, 855613, 846191, 836300, 827238, 819973, 814847, 811954, 811250, 812354, 814812, 818625, 824121, 831297, 839712, 849052, 859429, 870980, 883467, 896351, 909150, 921664, 933990, 946280, 958387, 969789, 979995, 988845, 996459, 1003142, 1009499, 1016229, 1023455, 1030421, 1036088, 1039912, 1041887, 1042253, 1041471, 1040145, 1038430, 1035652, 1030900, 1023887, 1014898, 1004143, 991612, 977466, 962152, 946112, 929719, 913466, 897909, 883461, 870401, 858909, 848834, 839668, 831093, 823370, 816828, 811210, 805990, 801139, 797038, 793761, 791029, 788884, 787849, 788213, 789553, 791119, 792474, 793732, 795472, 798325, 802331, 806716, 810670, 814244, 818114, 822512, 826920]
52205H26920L905L473L388L475L539L369K731J747J113J335K016K405K373K278
52191H64067K225K090K132K717L521L688K948J932J234P18j8j023k110l183m149
52176H76789m811n155n525o183o831o834n931m506l147k070j087p4P49J147J367
52161H27898J968L089M165M538M185L653L391L409L495L512L409L113K515J599
52147H73939O31Q3K49R23J677K415L400M731O049O855O949O438N734N497O294
52132I31864Q028J0066J1998J3962J6095J8179K0079K2021K4051K5649K6380K6627
52120A154999K7009K7367K6933K5514K3820K2508K1411J9926J7795J5236J2524
52109A395042R728O757L582L97k406m522n977p048p968q793r445r846j0002j0008
$$ y = [826920, 830825, 834298, 837686, 841161, 844700, 848069, 850800, 852547, 853660, 854995, 857011, 859416, 861789, 864067, 866292, 868382, 870514, 873231, 876752, 880440, 883388, 885320, 886554, 887272, 887254, 886231, 884121, 880938, 876789, 871978, 866823, 861298, 855115, 848284, 841450, 835519, 831013, 827866, 825796, 824709, 824635, 825384, 826531, 827898, 829866, 832955, 837120, 841658, 845843, 849496, 852887, 856296, 859791, 863303, 866712, 869825, 872340, 873939, 874570, 874653, 874902, 875825, 877502, 879917, 883317, 888048, 894097, 900952, 907901, 914339, 920073, 925570, 931864, 939892, 949958, 961956, 975918, 992013, 1010192, 1030271, 1052292, 1076343, 1101992, 1128372, 1154999, 1182008, 1209375, 1236308, 1261822, 1285642, 1308150, 1329561, 1349487, 1367282, 1382518, 1395042, 1404770, 1411527, 1415109, 1415506, 1413100, 1408578, 1402601, 1395553, 1387585, 1378792, 1369347, 1359501, 1349499, 1339491]
52095A339491r863r438q813q571r295j0758j2065j2704j2965j3162j3028j2317
52083A206512j1352j0405r033o766m014j524P34L262N802P538Q500R717J1588
52070A210559J3145J3504J3217J3350J3865J3842J3022J2130J1630J1033R727
52059A349024P896O135M482K438q6k321l440l592l807m837o481q190r936j2018
52045A315267j4300j6207j7539j8653j9727k0420k0626k0913k1691k2280k1574
52034A101337j9464j6956j4886j3167j1443r815q555p584o650n775n127m709m580
52021I72626n087o429q047q993q936q427q050p827p558p377p573q133q758r238
$$ y = [1339491, 1329628, 1320190, 1311377, 1302806, 1293511, 1282753, 1270688, 1257984, 1245019, 1231857, 1218829, 1206512, 1195160, 1184755, 1175722, 1168956, 1164942, 1163418, 1164152, 1167414, 1173216, 1180754, 1189254, 1198971, 1210559, 1223704, 1237208, 1250425, 1263775, 1277640, 1291482, 1304504, 1316634, 1328264, 1339297, 1349024, 1356920, 1363055, 1367537, 1369975, 1369889, 1367568, 1364128, 1360536, 1356729, 1351892, 1345411, 1337221, 1327285, 1315267, 1300967, 1284760, 1267221, 1248568, 1228841, 1208421, 1187795, 1166882, 1145191, 1122911, 1101337, 1081873, 1064917, 1050031, 1036864, 1025421, 1015606, 1007051, 999467, 992817, 987042, 981915, 977206, 972626, 967539, 961110, 953063, 944070, 935134, 926707, 918657, 910830, 903272, 895895, 888322, 880189, 871431, 862193]
$$ [...]
##END NTUPLES=NMR SPECTRUM
##END=
