
##TITLE=AC1354_CPIAH12173_6648069_Yin7xcXN6v
##JCAMPDX= 6.0         $$ Bruker NMR JCAMP-DX V2.0
##DATA TYPE= NMR SPECTRUM
##DATA CLASS= NTUPLES
##ORIGIN= BRUKER
##OWNER= Administrator
$$ 1.72 TOPSPIN		Version 2.1
$$ 2012-08-10 21:26:10.171 -0500  Administrator@TOPSPIN
$$ Compression mode = diff/dup
##.OBSERVE FREQUENCY= 400.02188249412
##.OBSERVE NUCLEUS= ^1H
##.ACQUISITION MODE= SIMULTANEOUS (DQD)
##.ACQUISITION SCHEME= undefined
##.AVERAGES= 64
##.DIGITISER RES= 22
##SPECTROMETER/DATA SYSTEM= spect
##.PULSE SEQUENCE= noesygpps1d.comp
##.SOLVENT NAME= COFFEE_meoh
##.SHIFT REFERENCE= INTERNAL, COFFEE_meoh, 1, 14.96282
##AUDIT TRAIL= $$ (NUMBER, WHEN, WHO, WHERE, PROCESS, VERSION, WHAT)
$$ ##TITLE= Audit trail, TOPSPIN		Version 2.1
$$ ##JCAMPDX= 5.01
$$ ##ORIGIN= Bruker BioSpin GmbH
$$ ##OWNER= Administrator
$$ $$ C:\Bruker\TOPSPIN/data/COFFEE/nmr/AC1354_CPIAH12173_6648069_Yin7xcXN6v/12/pdata/1/auditp.txt
$$ ##AUDIT TRAIL=  $$ (NUMBER, WHEN, WHO, WHERE, PROCESS, VERSION, WHAT)
(   1,<2012-08-10 21:26:05.265 -0500>,<Administrator>,<TOPSPIN>,<go>,<TOPSPIN 2.1>,
      <created by zg
	started at 2012-08-10 21:14:35.156 -0500,
	POWCHK enabled, PULCHK disabled,
       configuration hash MD5:
       6B 1B 68 BB D9 2E 58 E2 7F 35 AD 54 07 DF 0E 41
       data hash MD5: 64K
       48 7D CD E0 40 89 4D 47 59 F2 1B DA 7B A3 0D 1D>)
(   2,<2012-08-10 21:26:08.140 -0500>,<Administrator>,<TOPSPIN>,<proc1d>,<TOPSPIN 2.1>,
      <Start of raw data processing
       efp LB = 0.3 FT_mod = 6 PKNL = 1 PHC0 = 0 PHC1 = 0 SI = 128K 
       data hash MD5: 128K
       26 4A 49 7A 32 54 5C 0D C6 55 C1 F4 77 18 E4 E4>)
(   3,<2012-08-10 21:26:09.265 -0500>,<Administrator>,<TOPSPIN>,<proc1d>,<TOPSPIN 2.1>,
      <pk PHC0 = 2.713623 PHC1 = 0 
       data hash MD5: 128K
       95 8F BB B0 DF DF D3 93 EB C3 22 97 DD 6A F3 41>)
(   4,<2012-08-10 21:26:09.796 -0500>,<Administrator>,<TOPSPIN>,<proc1d>,<TOPSPIN 2.1>,
      <abs ABSG = 1 
       data hash MD5: 128K
       27 20 91 C7 13 A8 E7 56 C0 3E C8 46 B1 1A 0F 0C>)
(   5,<2012-08-10 21:26:09.875 -0500>,<Administrator>,<TOPSPIN>,<proc1d>,<TOPSPIN 2.1>,
      <abs ABSG = 2 
       data hash MD5: 128K
       4D 1F A8 81 EB 00 B4 C2 0C FF 25 53 77 49 EF 10>)
(   6,<2012-08-10 21:26:09.921 -0500>,<Administrator>,<TOPSPIN>,<proc1d>,<TOPSPIN 2.1>,
      <abs ABSG = 3 
       data hash MD5: 128K
       69 7A E5 C1 96 94 AC E0 B9 BA 91 E7 DD 30 E2 BF>)
(   7,<2012-08-10 21:26:09.984 -0500>,<Administrator>,<TOPSPIN>,<proc1d>,<TOPSPIN 2.1>,
      <abs ABSG = 4 
       data hash MD5: 128K
       A2 3C BE F3 FA 06 8F 37 3B 7D 2E 65 19 05 8D 12>)
(   8,<2012-08-10 21:26:10.031 -0500>,<Administrator>,<TOPSPIN>,<proc1d>,<TOPSPIN 2.1>,
      <abs ABSG = 5 
       data hash MD5: 128K
       42 A9 A2 EB E1 EE D4 64 6F 07 17 8C 9C 18 67 D8>)
$$ ##END=
$$ 
$$ $$ hash MD5
$$ $$ BE 0A BD 54 7E 47 4F 25 CB 46 D0 A6 3B 50 A7 9D
##$RELAX= 
##$RELAX= 
##$RELAX= 
##$RELAX= 
##$RELAX= 
##$RELAX= 
##$RELAX= 
##$RELAX= 
$$ Bruker specific parameters
$$ [...]
150 150 150 150 150 150 150 150
##$TP07= 0
##$TPNAME0= <>
##$TPNAME1= <>
##$TPNAME2= <>
##$TPNAME3= <>
##$TPNAME4= <>
##$TPNAME5= <>
##$TPNAME6= <>
##$TPNAME7= <>
##$TPOAL= (0..7)
0.5 0.5 0.5 0.5 0.5 0.5 0.5 0.5
##$TPOFFS= (0..7)
0 0 0 0 0 0 0 0
##$TUNHIN= 0
##$TUNHOUT= 0
##$TUNXOUT= 0
##$USERA1= <user>
##$USERA2= <user>
##$USERA3= <user>
##$USERA4= <user>
##$USERA5= <user>
##$V9= 5
##$VALIST= <valist>
##$VCLIST= <CCCCCCCCCCCCCCC>
##$VD= 0
##$VDLIST= <DDDDDDDDDDDDDDD>
##$VPLIST= <PPPPPPPPPPPPPPP>
##$VTLIST= <TTTTTTTTTTTTTTT>
##$WBST= 1024
##$WBSW= 4
##$XGAIN= (0..3)
0 0 0 0
##$XL= 0
##$YL= 0
##$YMAX_a= 16097675
##$YMIN_a= -8590186
##$ZGOPTNS= <>
##$ZL1= 120
##$ZL2= 120
##$ZL3= 120
##$ZL4= 120
##$ABSF1= 14.96282
##$ABSF2= -5.595362
##$ABSG= 5
##$ABSL= 3
##$ALPHA= 0
##$AQORDER= 0
##$ASSFAC= 0
##$ASSFACI= 0
##$ASSFACX= 0
##$ASSWID= 0
##$AUNMP= <proc_prof1d_extract.lims>
##$AXLEFT= 0
##$AXNAME= <>
##$AXNUC= <1H>
##$AXRIGHT= 0
##$AXTYPE= 0
##$AXUNIT= <>
##$AZFE= 0.1
##$AZFW= 0.1
##$BCFW= 0
##$BC_mod= 0
##$BYTORDP= 0
##$COROFFS= 0
##$CY= 15
##$DATMOD= 1
##$DC= 0
##$DFILT= <>
##$DTYPP= 0
##$F1P= 0
##$F2P= 0
##$FCOR= 0.5
##$FTSIZE= 131072
##$FT_mod= 6
##$GAMMA= 0
##$GB= 0
##$INTBC= 1
##$INTSCL= 1
##$ISEN= 128
##$LB= 0.3
##$LEV0= 0
##$LPBIN= 0
##$MAXI= 10000
##$MC2= 0
##$MEAN= 0
##$ME_mod= 0
##$MI= 0
##$NCOEF= 0
##$NC_proc= -2
##$NLEV= 6
##$NOISF1= 0
##$NOISF2= 0
##$NSP= 0
##$NTH_PI= 0
##$NZP= 0
##$OFFSET= 14.96282
##$PC= 1
##$PHC0= 2.713623
##$PHC1= 0
##$PH_mod= 1
##$PKNL= yes
##$PPARMOD= 0
##$PPDIAG= 0
##$PPIPTYP= 0
##$PPMPNUM= 2147483647
##$PPRESOL= 1
##$PSCAL= 4
##$PSIGN= 0
##$PYNMP= <proc.py>
##$REVERSE= no
##$SF= 400.020008908342
##$SI= 131072
##$SIGF1= 0
##$SIGF2= 0
##$SINO= 400
##$SIOLD= 131072
##$SPECTYP= <>
##$SREGLST= <1H.CDCl3>
##$SSB= 0
##$STSI= 131072
##$STSR= 0
##$SW_p= 8223.68421052631
##$SYMM= 0
##$S_DEV= 0
##$TDeff= 65536
##$TDoff= 0
##$TI= <>
##$TILT= no
##$TM1= 0
##$TM2= 0
##$TOPLEV= 0
##$USERP1= <user>
##$USERP2= <user>
##$USERP3= <user>
##$USERP4= <user>
##$USERP5= <user>
##$WDW= 1
##$XDIM= 131072
##$YMAX_p= 432690023
##$YMIN_p= -11501
##$CURPLOT= <Network HP LaserJet P1505>
##$CURPRIN= <$Network HP LaserJet P1505>
##$DFORMAT= <normdp>
##$LAYOUT= <+/1D_H.xwp>
##$LFORMAT= <normlp>
##$PFORMAT= <normpl>
##$SURQMSG= 1
$$ End of Bruker specific parameters
$$ ---------------------------------
##NTUPLES= NMR SPECTRUM
##VAR_NAME=  FREQUENCY,     SPECTRUM/REAL,   SPECTRUM/IMAG
##SYMBOL=    X,             R,               I
##VAR_TYPE=  INDEPENDENT,   DEPENDENT,       DEPENDENT
##VAR_FORM=  AFFN,          ASDF,            ASDF
##VAR_DIM=   131072,        131072,          131072
##UNITS=     HZ,            ARBITRARY UNITS, ARBITRARY UNITS
##FACTOR=    0.0627417313425164, 1,          1
##FIRST=     8223.62146879497, 457,          -53041
##LAST=      0,             2386,            -52879
##MIN=       0,             -11501,          0
##MAX=       8223.62146879497, 432690023,    0
$$ Real data points
##PAGE= N=1
##DATA TABLE= (X++(R..R)), XYDATA
$$ [...]
63177F40489J2871J4098J4548J4750J5096J5489J5741J5898J6014J6060J6175
63166H07229J6483J6581J5819J4299J2883J1826J0132O906K666j394m977q627
63154H99826j2398j5623j7996j9960k1838k3303k3954k3803k2900k1144j8775
63143F78132j6564j5058j4005j2850j1415r776p960o129m738m007l497k677j602
63130E67854o02L77J525K517K858K747K958L732M461M628M498M585M978N415N698
63115F18229N701N338M803M552M795N284N747O212O690O908O664O103N376M388
63101F96790L132J984J195M63n63j660k356k667k936l140k931k332j818j691j811
63086F79659j924j827j232JJ424K297K488K654L364M418N240N612N746N937O378
$$ plain form
63177 640489 653360 667458 682006 696756 711852 727341 743082 758980 774994 791054 807229
63166 807229 823712 840293 856112 870411 883294 895120 905252 912158 914824 913430 908453 899826
63154 899826 887428 871805 853809 833849 812011 788708 764754 740951 718051 696907 678132
63143 678132 661568 646510 632505 619655 608240 598464 590504 584375 579637 575630 572133 569456 567854
63130 567854 567252 567629 569154 571671 574529 577276 580234 583966 588427 593055 597553 602138 607116 612531 618229
63115 618229 623930 629268 634071 638623 643418 648702 654449 660661 667351 674259 680923 687026 692402 696790
63101 696790 699922 701906 703101 703564 703001 701341 698985 696318 693382 690242 687311 684979 683161 681470 679659
63086 679659 677735 675908 674676 674677 676101 678398 680886 683540 686904 691322 696562 702174 707920 713857 720235
63071G20235P199Q363R594J0538J1021J1246J1709J2808J4365J5780J6860J8184
63059H67902K0261K2596K4207K4953K5646K6836K8265K9711L1561L4092L6790
63048A172820L8983M0700M2405M4174M5711M6933M7841M8051M7108M5311M3639
63037A663676M2659M2008M1146M0165L9552L9457L9639L9894M0133L9984L8770
63026B107083L5993L1602K5634J7912Q498j896j2428k2993l3999m5068n4686o1516
63014A994136o5641o7915o8535o6975o3218n8238n3017m7684m1929l5808k9782
63003A395394k4194j9013j4043r134m274M78N088R486J3352J6225J8036J9325
62991A406726K0562K1446K1353K0395J9440J9116J9206J9116J8394J6776J4276
$$ plain form
63071 720235 727434 735797 745391 755929 766950 778196 789905 802713 817078 832858 849718 867902
63059 867902 888163 910759 934966 959919 985565 1012401 1040666 1070377 1101938 1136030 1172820
63048 1172820 1211803 1252503 1294908 1339082 1384793 1431726 1479567 1527618 1574726 1620037 1663676
63037 1663676 1706335 1748343 1789489 1829654 1869206 1908663 1948302 1988196 2028329 2068313 2107083
63026 2107083 2143076 2174678 2200312 2218224 2226722 2224826 2212398 2189405 2155406 2110338 2055652 1994136
63014 1994136 1928495 1860580 1792045 1725070 1661852 1603614 1550597 1502913 1460984 1425176 1395394
63003 1395394 1371200 1352187 1338144 1329010 1324736 1325214 1330302 1339788 1353140 1369365 1387401 1406726
62991 1406726 1427288 1448734 1470087 1490482 1509922 1529038 1548244 1567360 1585754 1602530 1616806
62980A616806J1408Q811O304K842k329q764j5344k1407k7091l2776l8409m3343
62968A456708m6828m8779m9912n0817n1062m9738m6725m2856l8865l4938l1229
62957I64959k8021k5107k1882j8392j5583j4051j3236j2330j1311j0507r838r089
62945G75612q485q286q293q311q601r234r513q879p912p564p766p690p167o767
62931F61144o587o027m952m114l977m023l609k957k663k782k868k679k330j891
62917F09685j325p67n17o79j002j209j343j672k251k694k493j573m24L61O44P45
62901E93486R75J193R53J11q03j160j174j798l399n008n491n035m766n037n137
62886E57910m646m138m162m454m550m411l999l027j700r91j461k380k673k253
$$ plain form
62980 1616806 1628214 1637025 1643329 1646171 1643842 1635078 1619734 1598327 1571236 1538460 1500051 1456708
62968 1456708 1409880 1361101 1311189 1260372 1209310 1159572 1112847 1069991 1031126 996188 964959
62957 964959 936938 911831 889949 871557 855974 841923 828687 816357 805046 794539 784701 775612
62945 775612 767127 758841 750548 742237 733636 724402 714889 706010 698098 690534 682768 675078 667911 661144
62931 661144 654557 648530 643578 639464 635487 631464 627855 624898 622235 619453 616585 613906 611576 609685
62917 609685 608360 607593 607076 606397 605395 604186 602843 601171 598920 596226 593733 592160 591736 592097 592741 593486
62901 593486 594461 595654 596607 596718 595915 594755 593581 591783 588384 583376 577885 572850 568084 563047 557910
62886 557910 553264 549126 544964 540510 535960 531549 527550 524523 522823 521832 520371 517991 515318 513065
62872E13065j730j389j207j357j827j917j010L99J218J110O06J98J35P67K092
62857E09153L147K891J657Q17Q84R82L90l78m87N6O61J054J341J535J433R08J09
62840E26153n05l31P95K259L146L128K553J820J061L96J1j09j64k06j34J6J21
62823E40010K26M27N80N01L08J87Km62r92j144p89j09P02J278J048Rp88l36R75
62804E41633J976K404K956L768M083L709L631M561N855O528O724P356Q767J0372
62790F14323J1476J1908J2003J2286J3116J4483J6224J8412K1264K4656K8136
62779G98287L1476L4912L8787M3239M8204N3342N8104O2279O6348P0844P5441
62768A381263P9282Q1944Q3465Q3504Q1375P6864P0229O1360M9826L5969K1005
$$ plain form
62872 513065 511335 509946 508739 507382 505555 503638 502628 503027 504245 505355 505961 506159 506294 507061 509153
62857 509153 512300 515191 516848 517665 518549 519531 519921 519543 519056 519112 519773 520827 522168 523703 525136 526044 526153
62840 526153 525648 525317 526112 528371 531517 534645 537198 539018 540079 540475 540486 540377 540213 540007 539873 539889 540010
62823 540010 540236 540663 541243 541744 542052 542239 542241 541779 540787 539643 538854 538745 539447 540725 541773 541782 540994 540658 541633
62804 541633 543609 546013 548969 552737 556820 560529 564160 568721 574576 581104 587828 595184 603951 614323
62790 614323 625799 637707 649710 661996 675112 689595 705819 724231 745495 770151 798287
62779 798287 829763 864675 903462 946701 994905 1048247 1106351 1168630 1234978 1305822 1381263
62768 1381263 1460545 1542489 1625954 1709458 1790833 1867697 1937926 1999286 2049112 2085081 2106086
62757B106086N840r369k4260l7858m9614n9935o9028p6043q0086q1473q1355q0520
62745A462385p9150p7249p4681p1153o6699o1878n7096n2194m7028m1973l7436
62734G95848l3374k9771k7013k5194k3605k1564j9280j7341j5753j4158j2640
62723E56155j1521j0624r487q126o935n929m808l641k895k639k323j464k33Q59
62709D86389J646K524M011O091Q140R629J0802J2226J3810J4935J5617J6719J8718
62696F21257K1020K3042K5193K8135L1598L4841L7847M1188M4883M8164N0325
62685A007493N1194N0819M9239M6564M2807L7712L1022K2845J3459L153p385j7072
62673A331850k5365l2796l9827m5660m9089n0289n0754n1405n1658n0610m8221
$$ plain form
62757 2106086 2111926 2102557 2078297 2040439 1990825 1930890 1861862 1785819 1705733 1624260 1542905 1462385
62745 1462385 1383235 1305986 1231305 1160152 1093453 1031575 974479 922285 875257 833284 795848
62734 795848 762474 732703 705690 680496 656891 635327 616047 598706 582953 568795 556155
62723 556155 544634 534010 524523 516397 509462 503533 498725 495084 492189 489550 487227 485763 485530 486389
62709 486389 488035 490559 494570 500661 508801 518430 529232 541458 555268 570203 585820 602539 621257
62696 621257 642277 665319 690512 718647 750245 785086 822933 864121 909004 957168 1007493
62685 1007493 1058687 1109506 1158745 1205309 1248116 1285828 1316850 1339695 1353154 1356307 1348922 1331850
62673 1331850 1306485 1273689 1233862 1188202 1139113 1088824 1038070 986665 935007 884397 836176
62662H36176m5101m1730l8435l5503l2973l0505k7801k4915k2033j9295j6969
62651E00916j5429j4671j4116j3107j1564j0001r002q740q855q757q166p361o797
62638C64350o639o715o798o668o160n391m767m489m245l701l051k702k604k385
62624B98035j988j685j536j366j161j055q67k74M88P05J90k67K53J743L294L953
62608B98462L441K307J529J760K816M058N217O556Q217R867J1216J2425J3731
62595C81602J4988J6034J7335J9649K3043K6591K9361L1425L3614L6458L9606
62584F69706M2332M4155M4907M4467M2830M0220L6780L2225K6166J8768J0727
62573A053283K548n689j3764k0980k6662l0695l3366l4950l5692l5877l5642l4911
$$ plain form
62662 836176 791075 749345 710910 675407 642434 611929 584128 559213 537180 517885 500916
62651 500916 485487 470816 456700 443593 432029 422028 413026 404286 395431 386674 378508 371147 364350
62638 364350 357711 350996 344198 337530 331370 325979 321212 316723 312478 308777 305726 303024 300420 298035
62624 298035 296047 294362 292826 291460 290299 289244 288377 288103 288591 289296 289486 289219 289472 291215 294509 298462
62608 298462 301903 304210 305739 307499 310315 314373 319590 326146 334363 344230 355446 367871 381602
62595 381602 396590 412624 429959 449608 472651 499242 528603 560028 593642 630100 669706
62584 669706 712038 756193 801100 845567 888397 928617 965397 997622 1023788 1042556 1053283
62573 1053283 1055831 1050142 1036378 1015398 988736 958041 924675 889725 854033 818156 782514 747603
62561G47603l3674l2081l0160k7889k5643k4012k2855k1167j8473j5794j4503
62550D81352j4565j4697j4071j3073j2393j2157j2076j1827j1065r573p666o064
62538C42125n171m695m129l268k242j288o15k38N7M74R33J328J796K445K958K982
62522C33452K829L209M259N349O020O586P538Q834J0118J1279J2416J3526J4571
62509D39986J5797J7589K0034K2823K5552K7941K9713L0498L0070K8709K7062
62498G15774K5443K3340J9953J5221R912M570j092p324j3333j7856k0613k2486
62486G31509k4235k5677k6366k6378k6009k5092k3212k0443j7423j4738j2508
62475D89428j0541q631o685m797l223k156j409n69N11J561K351L085M057N079
$$ plain form
62561 747603 713929 681848 651688 623799 598156 574144 551289 530122 511649 495855 481352
62550 481352 466787 452090 438019 424946 412553 400396 388320 376493 365428 355855 348189 342125
62538 342125 336954 332259 328130 324862 322620 321332 320717 320479 320536 321010 321943 323271 325067 327512 330470 333452
62522 333452 336281 339490 343749 349098 355118 361704 369242 378076 388194 399473 411889 425415 439986
62509 439986 455783 473372 493406 516229 541781 569722 599435 629933 660003 688712 715774
62498 715774 741217 764557 784510 799731 809643 814213 813121 805797 792464 774608 753995 731509
62486 731509 707274 681597 655231 628853 602844 577752 554540 534097 516674 501936 489428
62475 489428 478887 470256 463571 458774 455551 453395 451986 451417 451928 453489 455840 458925 462982 468061
62461D68061N581N404N063N088N395N554N412N139M912M901N392O397P313P463
62447E47075O851N925M796L337J913J044K95j534m678p898j0164j1942j4076j6145
62433E04799j7052j6677j5860j4986j3609j1541r334p497n951m547l494k949k569
62420C78733j763k50J717L504M598N072N544O411P381P958Q090Q048P900P566
62406D50509P099O540N737M675L682K844J632k99k312l535m095m798n760o296
62392D55623o122n742n527n257m860m711m803m364k870q79O45J531K439L912N851
62377D24866P858R729J1563J3501J5467J7272J8993K1065K3756K6771K9633L2255
62365F52729L4877L7550M0097M2342M4054M4830M4514M3558M2482M1077L8579
$$ plain form
62461 468061 473642 479046 484109 489197 494592 500146 505558 510697 515609 520510 525902 532299 539612 547075
62447 547075 553926 559851 564647 567984 569897 570941 571236 569702 565024 557126 546962 535020 520944 504799
62433 504799 487747 471070 455210 440224 426615 415074 405740 398243 392292 387745 384251 381302 378733
62420 378733 376970 376720 378437 381941 386539 391611 397155 403566 410947 418905 426995 435043 442943 450509
62406 450509 457608 464148 469885 474560 478242 481086 482718 482419 480107 476572 472477 467679 461919 455623
62392 455623 449501 443759 438232 432975 428115 423404 418601 414237 411367 410488 411133 412664 415103 419015 424866
62377 424866 432724 442453 454016 467517 482984 500256 519249 540314 564070 590841 620474 652729
62365 652729 687606 725156 765253 807595 851649 896479 940993 984551 1027033 1068110 1106689
62354A106689L4523K8966K2117J4272O060j792q871j4850j9191k1698k3144k4632
62342A098449k6360k7788k8807k9901l1095l1665l1059k9489k7391k5015k2688
62331G87191k0759j9093j7240j5271j3851j3305j3201j2980j2325j0962q903o927
62319F22374n964n785n233l957k918k824l118l168l444m633o289p318p406p195
62305E53122p326p863q407q342p295n696m534m160l879l020j891j071m55L86J361
62290D90930K066K532L091L786M436N029N534N618N168M794N298O701Q235R175
62276E62393R363R194R340J0213J1365J1871J1568J1404J2136J3361J4382J5467
62264G02057J7386K0186K3273K6430K9835L3357L6678L9992M3680M7177M9032
$$ plain form
62354 1106689 1141212 1170178 1192295 1206567 1212627 1210835 1201964 1187114 1167923 1146225 1123081 1098449
62342 1098449 1072089 1044301 1015494 985593 954498 922833 891774 862285 834894 809879 787191
62331 787191 766432 747339 730099 714828 700977 687672 674471 661491 649166 638204 629301 622374
62319 622374 616410 610625 605392 601435 598517 595693 592575 589407 585963 581330 575041 567723 560317 553122
62305 553122 545796 537933 529526 521184 513889 508193 503659 499499 495620 492600 490709 489638 489183 489569 490930
62290 490930 492996 495528 498619 502405 506841 511870 517404 523022 528190 532984 538282 544983 553218 562393
62276 562393 571756 580950 590290 600503 611868 623739 635307 646711 658847 672208 686590 702057
62264 702057 719443 739629 762902 789332 819167 852524 889202 929194 972874 1020051 1069083
62253A069083M8228M4824L9271L1904K3303J4422N975j880q921j4567j8579k1668
62241A211395k4856k8420l1784l4305l5712l5880l4679l2348k9723k7565k5631
62230H70492k2878j8904j4804j2045j0701r569p998o696o378o511o133n287m744
62217G37844m615m199l143j987j337j129r10m35K61J011J664K234K961M000N052
62202G37272N672N911O308P204Q412R578J0571J1379J2004J2650J3702J5262J6888
62189H72813J8079J8903J9812K0823K1225K0377J8574J6699J5083J3219J0837
62178A066444Q764Q124R004J0533J2121J3923J6068J8299K0613K3497K7093L0660
62166A265143L3389L5247L6521L6961L5971L3397K9571K4747J9190J3622R045
$$ plain form
62253 1069083 1117311 1162135 1201406 1233310 1256613 1271035 1277010 1275130 1266209 1251642 1233063 1211395
62241 1211395 1186539 1158119 1126335 1092030 1056318 1020438 985759 953411 923688 896123 870492
62230 870492 847614 828710 813906 801861 791160 781591 773593 766897 760519 754008 747875 742588 737844
62217 737844 733229 729030 725887 723900 722563 721434 720524 720089 720350 721361 723025 725259 728220 732220 737272
62202 737272 742944 748855 755163 762367 770779 780357 790928 802307 814311 826961 840663 855925 872813
62189 872813 890892 909795 929607 950430 971655 992032 1010606 1027305 1042388 1055607 1066444
62178 1066444 1075208 1083332 1092336 1102869 1114990 1128913 1144981 1163280 1183893 1207390 1234483 1265143
62166 1265143 1298532 1333779 1370300 1407261 1443232 1476629 1506200 1530947 1550137 1563759 1572804
62155A572804N920L815J955r9k205l921m989n692o468p153p002n633l586j573
62141A536173L47K416M406N815O648P374Q169Q794R202R803J0917J2391J3870
62128A636325J5140J6110J6752J7227J7901J9015K0450K1870K3038K3972K4789
62117A852589K5472K5913K6175K6525K7038K7411K7441K7473K7860K8243K7957
62106B150097K7205K7031K7945K9173K9729K9625K9611L0177L1193L2329L3432
62095B477547L4636L6273L8362M0324M1669M2935M5154M8325N1373N3814N6268
62084B966680N8732N9550N7332N3102M9462M7983M8448N0040N2118N3877N4380
62073C551704N3121N0113M5685M0817L7134L5578L5370L5113L4608L4549L4763
$$ plain form
62155 1572804 1578724 1582539 1584494 1584395 1582190 1578269 1573280 1567588 1561120 1553967 1546965 1541332 1537746 1536173
62141 1536173 1536520 1538936 1543342 1549157 1555805 1563179 1571348 1580142 1589344 1599147 1610064 1622455 1636325
62128 1636325 1651465 1667575 1684327 1701554 1719455 1738470 1758920 1780790 1803828 1827800 1852589
62117 1852589 1878061 1903974 1930149 1956674 1983712 2011123 2038564 2066037 2093897 2122140 2150097
62106 2150097 2177302 2204333 2232278 2261451 2291180 2320805 2350416 2380593 2411786 2444115 2477547
62095 2477547 2512183 2548456 2586818 2627142 2668811 2711746 2756900 2805225 2856598 2910412 2966680
62084 2966680 3025412 3084962 3142294 3195396 3244858 3292841 3341289 3391329 3443447 3497324 3551704
62073 3551704 3604825 3654938 3700623 3741440 3778574 3814152 3849522 3884635 3919243 3953792 3988555
62062C988555L3966L1323K7132K1904J5824R354L350j803o451j0918j5250j9663
62050D077323k4399k8915l2178l4047l5461l6924l7714l7086l5383l3362l1121
62039C710733k8385k5302k2357j9709j7198j4740j2401j0261q377o690m906k915
62027C537492j308q26j221j352p14j07m50j640l046m465n876o949p525q249r870
62012C483894j2160j4230j5829j7550j9748k1991k3776k5246k6822k8471k9745
62001C248326l0430l0855l1450l2172l2558l2405l2186l2654l4031l5845l7502
61990B886238l8757l9614m0061m0000l9308l7890l5930l4079l3033l2681l2014
61979B482871l0186k7550k5257k3904k2930k1446j9346j7336j6022j5401j5277
$$ plain form
62062 3988555 4022521 4053844 4080976 4102880 4118704 4128058 4131408 4129605 4123154 4112236 4096986 4077323
62050 4077323 4052924 4024009 3991831 3957784 3922323 3885399 3847685 3810599 3775216 3741854 3710733
62039 3710733 3682348 3657046 3634689 3614980 3597782 3583042 3570641 3560380 3552003 3545313 3540407 3537492
62027 3537492 3536184 3535358 3534137 3532785 3532071 3531964 3531514 3529874 3526828 3522363 3516487 3509538 3502013 3493764 3483894
62012 3483894 3471734 3457504 3441675 3424125 3404377 3382386 3358610 3333364 3306542 3278071 3248326
62001 3248326 3217896 3187041 3155591 3123419 3090861 3058456 3026270 2993616 2959585 2923740 2886238
61990 2886238 2847481 2807867 2767806 2727806 2688498 2650608 2614678 2580599 2547566 2514885 2482871
61979 2482871 2452685 2425135 2399878 2375974 2353044 2331598 2312252 2294916 2278894 2263493 2248216
61968B248216j5679j6484j6979j6447j5173j4276j4381j5042j5635j6190j6936
61957B074994j7570j7600j7041j6252j5365j4401j3555j2920j2172j1136j0201
61946A916781r539q343n775k440Q8J204J878L272N619Q604J2039J5749J9488K3319
61932A981944K7617L2488L7663M3010M8560N4019N9058O4267P0956P9650Q9632
61921B588864J00383J12630J27360J44480J63412J84532K09121K37980K70841
61912D139603L07184L47166L91651M41803M98721N63167O35163P13527P95318
61903H833303Q75414R46339R98023J017463R89456R00232P43240N23693K58800
61894A6085963k6117l03284n48004p42833q79511r58388r86294r73908r32997
$$ plain form
61968 2248216 2232537 2216053 2199074 2182627 2167454 2153178 2138797 2123755 2108120 2091930 2074994
61957 2074994 2057424 2039824 2022783 2006531 1991166 1976765 1963210 1950290 1938118 1926982 1916781
61946 1916781 1907242 1898899 1893124 1890684 1890772 1891976 1893854 1897126 1902745 1911349 1923388 1939137 1958625 1981944
61932 1981944 2009561 2042049 2079712 2122722 2171282 2225301 2284359 2348626 2419582 2499232 2588864
61921 2588864 2689247 2801877 2929237 3073717 3237129 3421661 3630782 3868762 4139603
61912 4139603 4446787 4793953 5185604 5627407 6126128 6689295 7324458 8037985 8833303
61903 8833303 9708717 10655056 11653079 12670542 13659998 14560230 15303470 15827163 16085963
61894 16085963 16059846 15756562 15208558 14465725 13586214 12627826 11641532 10667624 9734627
61885I734627q73923q04501p30484o56470n85945n20846m61781m08854l62061
61876D329762l21023k84899k52860k24526j99778j78281j59476j42984j28699
61867B437236j16362j05293r4890q5243p6854o9755o3293n6888n0594m4775l9670
61856A633619l5393l1860k8500k4602k0323j6724j4358j2435j0047p543n760m483
61844A421591k783p25N20M39mL31J443K519L010K966K737K709L136M029N269O641
61828A453828P673P889P625Q057R742J1713J2809J3366J4447J5916J6702J6917
61816A596684J8045K0774K4065K6937K9868L3608L7778M1557M5068M9122N4047
61805A977553N9439O4783O9935P5242Q1384Q8719R6789J05037J13878J24137J35629
$$ plain form
61885 9734627 8860704 8056203 7325719 6669249 6083304 5562458 5100677 4691823 4329762
61876 4329762 4008739 3723840 3470980 3246454 3046676 2868395 2708919 2565935 2437236
61867 2437236 2320874 2215581 2120691 2035448 1958594 1888839 1825546 1768658 1718064 1673289 1633619
61856 1633619 1598226 1566366 1537866 1513264 1492941 1476217 1461859 1449424 1439377 1431834 1426074 1421591
61844 1421591 1418808 1418083 1418603 1419042 1419038 1419369 1420812 1423331 1426341 1429307 1432044 1434753 1437889 1441918 1447187 1453828
61828 1453828 1461501 1469390 1477015 1485072 1494814 1506527 1519336 1532702 1547149 1563065 1579767 1596684
61816 1596684 1614729 1635503 1659568 1686505 1716373 1749981 1787759 1829316 1874384 1923506 1977553
61805 1977553 2036992 2101775 2171710 2246952 2328336 2417055 2513844 2618881 2732759 2856896 2992525
61794B992525J47526J60258J75575J94271K15360K38204K64048K94382L29105
61785E011254L67565M10385M58842N13342N74008O42211P20027Q08491R07657
61776A0413782J017968J139998J272331J410344J546246J668139J758040J791830
61768B2018678J743069J589452J320014R41334M80036k1250n13662r53109j308037
61759B5296525j562562j715658j777555j764975j696839j591214j463577j326328
61751A2397817j189071j058635r38663q29975p32263o45535n69812n04155m46896
61742E482812l96758l53155l15405k82378k53013k26811k03649j83380j65714
61733C102549j50311j36836j24914j14006j03551r3517q4652p7702p2357o7542
$$ plain form
61794 2992525 3140051 3300309 3475884 3670155 3885515 4123719 4387767 4682149 5011254
61785 5011254 5378819 5789204 6248046 6761388 7335396 7977607 8697634 9506125 10413782
61776 10413782 11431750 12571748 13844079 15254423 16800669 18468808 20226848 22018678
61768 22018678 23761747 25351199 26671213 27612547 28092583 28071333 27557671 26604562 25296525
61759 25296525 23733963 22018305 20240750 18475775 16778936 15187722 13724145 12397817
61751 12397817 11208746 10150111 9211448 8381473 7649210 7003675 6433863 5929708 5482812
61742 5482812 5086054 4732899 4417494 4135116 3882103 3655292 3451643 3268263 3102549
61733 3102549 2952238 2815402 2690488 2576482 2472931 2379414 2294762 2217060 2144703 2077161
61723B077161o2731n8302n4552n1137m7764m4667m1967l9284l6332l3327l0450
61712A576648k7664k5302k3984k3466k2613k0960j9389j8641j8246j7599j7033
61701A341751j6852j6368j5066j3695j3102j2845j2260j1882j2348j2773j1965
61690A192595j0581j0170j0542j0145q903q507r644j0877j0896j0149r567r237
61678A073377r111r649j0799j1486j1038j0209r934r921r333q175p182o826p056
61665I52658p545p686o898n483m562m652m963m616l873l513l541l374k830k222
61651H86900j656r67k09L95Q48J222J340J076Q33J169J981K555K531K338K490
61636I02846K831K770K082J203P02P05R67J206J152M27j067k687l522l541l746
$$ plain form
61723 2077161 2014430 1956128 1901576 1850439 1802675 1758008 1716041 1676757 1640425 1607098 1576648
61712 1576648 1548984 1523682 1499698 1476232 1453619 1432659 1413270 1394629 1376383 1358784 1341751
61701 1341751 1324899 1308531 1293465 1279770 1266668 1253823 1241563 1229681 1217333 1204560 1192595
61690 1192595 1182014 1171844 1161302 1151157 1142254 1133747 1124103 1113226 1102330 1092181 1082614 1073377
61678 1073377 1064266 1054617 1043818 1032332 1021294 1011085 1001151 991230 981897 973722 966540 959714 952658
61665 952658 945113 937427 930529 925046 920484 915832 910869 906253 902380 898867 895326 891952 889122 886900
61651 886900 885244 884277 884068 884463 885311 886533 887873 888949 889782 890951 892932 895487 898018 900356 902846
61636 902846 905677 908447 910529 911732 912434 913139 914106 915312 916464 916891 915824 913137 909615 906074 902328
61621I02328m874o442p498p710p278o296m953l938l793m108m077l644l352l305
61607H31060l112k801k838l227l443l329l280l360l014j932n66M31P91O00K72
61592H02252N70K033M186N931O737O966P107P420Q257R815J1491J2353J2468J2968
61578I10554J4548J6715J8765K0642K2460K4059K5443K6963K8660L0101L1143
61567A170053L2169L3174L3464L2706L1561L0759L0285K9877K9535K9067K7929
61556A510579K6172K4719K4035K3315K1759J9852J8347J6741J3910R860N665J897
61544A716851j776n504q850j1554j3883j6017j7785j9068j9837j9753j8466j6418
61532A547940j4602j3328j1897r731p176m753k250R42M939R321J3766J8254K2826
$$ plain form
61621 902328 897454 891012 883514 875804 868526 862230 857277 853339 849546 845438 841361 837717 834365 831060
61607 831060 827948 825147 822309 819082 815639 812310 809030 805670 802656 800724 800158 800589 801380 801980 802252
61592 802252 802822 804855 809041 814972 821709 828675 835782 843202 851459 861274 872765 885118 897586 910554
61578 910554 925102 941817 960582 981224 1003684 1027743 1053186 1080149 1108809 1138910 1170053
61567 1170053 1202222 1235396 1268860 1301566 1333127 1363886 1394171 1424048 1453583 1482650 1510579
61556 1510579 1536751 1561470 1585505 1608820 1630579 1650431 1668778 1685519 1699429 1709289 1714954 1716851
61544 1716851 1715075 1709571 1700721 1689167 1675284 1659267 1641482 1622414 1602577 1582824 1564358 1547940
61532 1547940 1533338 1520010 1508113 1498382 1491206 1486453 1484203 1485145 1490084 1499405 1513171 1531425 1554251
61519A554251K7619L3104L9855M7877N6544O5315P4377Q4368R5651J08130J21641
61508B308732J36178J51767J68454J86564K06688K29058K53052K77400L00654
61499D218547L21177L36720L44291L40547L22615K89053K40599J80050J11424
61490F705023L9421l0655r3625j46114j87391k18062k38328k48145k48631k42183
61480E091310k31029k16430j99299j80699j61463j41956j22537j03681q5456o7584
61470C581176n0337l4708k1277r432J873J2988K3548L3040M1064M7421N2351N6337
61458C734044N9260O0250N8671N5025N0486M5915M1729L8373L6323L5734L6444
61447D252254L8271M1149M5096N0165N6192O2458O7951P2006P4388P4721P2524
$$ plain form
61519 1554251 1581870 1614974 1654829 1702706 1759250 1824565 1898942 1983310 2078961 2187091 2308732
61508 2308732 2444910 2596677 2765131 2951695 3158383 3387441 3640493 3917893 4218547
61499 4218547 4539724 4876444 5220735 5561282 5883897 6172950 6413549 6593599 6705023
61490 6705023 6744444 6713789 6620164 6474050 6286659 6068597 5830269 5582124 5333493 5091310
61480 5091310 4860281 4643851 4444552 4263853 4102390 3960434 3837897 3734216 3648760 3581176
61470 3581176 3530839 3496131 3474854 3465422 3467295 3480283 3503831 3536871 3577935 3625356 3677707 3734044
61458 3734044 3793304 3853554 3912225 3967250 4017736 4063651 4105380 4143753 4180076 4215810 4252254
61447 4252254 4290525 4331674 4376770 4426935 4483127 4545585 4613536 4685542 4759930 4834651 4907175
61436D907175O7959O1878N4620M5456L3814K0528P062o084j9343l2580m4648n4524
61424E041313o2087o7423p0096o9771o7152o3611n9875n5544n0005m3330l5997
61413D396422k8179j9833j1350l535L125Q672J3035J5782J6725J6203J4290J0462
61401D431819M655j847p498j1996j5805j8452j8485j5130q883l13J0685K4126
61389D372876L9481N6552P5882R7729J21341J45861J71294J98026K25951K54604
61379E759597K83424L11212L35750L54724L66500L69340L60343L36308K95877
61370H773075K40597J74254J01831K8683m0426j02263j55352j99667k36358k67179
61360H317195k93255l14161l28585l35862l36607l32013l23091l10664k95606
$$ plain form
61436 4907175 4975134 5037012 5091632 5137088 5170902 5191430 5198492 5192408 5173065 5140485 5095837 5041313
61424 5041313 4979226 4911803 4841707 4771936 4704784 4641173 4581298 4525754 4475749 4432419 4396422
61413 4396422 4368243 4348410 4337060 4333525 4336650 4345322 4358357 4374139 4390864 4407067 4421357 4431819
61401 4431819 4436474 4434627 4427129 4415133 4399328 4380876 4362391 4347261 4338378 4338065 4348750 4372876
61389 4372876 4412357 4468909 4544791 4642520 4763861 4909722 5081016 5279042 5504993 5759597
61379 5759597 6043021 6354233 6689983 7044707 7411207 7780547 8140890 8477198 8773075
61370 8773075 9013672 9187926 9289757 9318440 9278014 9175751 9020399 8820732 8584374 8317195
61360 8317195 8023940 7709779 7381194 7045332 6708725 6376712 6053621 5742957 5447351
61351E447351k78871k61281k43356k25196k06653j87764j68872j50238j31748
61342C593372j13302r5333p8578o3337m9173l5480k2142r590J822J2271K2148
61331C162678L1255L8805M4475M9104N3698N7947O0502O0789N9717N8294N6280
61320C733544N2811M7916M2689L8090L4220L0843K8115K6531K6215K6541K6524
61309D114039K5568K3684K0944J7037J1549M498l651j2308k0898k8999l6670m4274
61297D070519n1700n8168o3319o7847p2354p6093p7838p7563p6146p3724o9699
61286C306068o4204n8118n1469m3399l4178k5710j9280j4058q743l609O9J741
61274B985110J679J16k663n899r020j2209j5540j8049j8667j7624j6003j4153
$$ plain form
61351 5447351 5168480 4907199 4663843 4438647 4231994 4044230 3875358 3725120 3593372
61342 3593372 3480070 3384737 3306159 3242822 3193649 3158169 3136027 3126437 3128259 3140530 3162678
61331 3162678 3193933 3232738 3277213 3326317 3380015 3437962 3498464 3559253 3618970 3677264 3733544
61320 3733544 3786355 3834271 3876960 3915050 3949270 3980113 4008228 4034759 4060974 4087515 4114039
61309 4114039 4139607 4163291 4184235 4201272 4212821 4217319 4213668 4201360 4180462 4151463 4114793 4070519
61297 4070519 4018819 3960651 3897332 3829485 3757131 3681038 3603200 3525637 3449491 3375767 3306068
61286 3306068 3241864 3183746 3132277 3088878 3054700 3028990 3009710 2995652 2986909 2983300 2983369 2985110
61274 2985110 2986789 2986905 2984242 2978343 2969323 2957114 2941574 2923525 2904858 2887234 2871231 2857078
61262B857078j1532p840l395J637P677J5299K4825L6269M9253O3099P7412R2390
61250C202172J08215J24370J39926J54179J66481J75588J79549J76210J63775
61241D590465J41253J08788O7567J9566l2203q3413j29426j67089j95200k13333
61231D106975k21284k20036k12145k00252j85741j69370j52386j36202j21456
61222B488103j08116r6143q5468p5797o6963n9111n2207m5968m0485l6106l2349
61211A789390k7958k2633j7639j3932j0699o694k045K288O078R624J2767J5224
61199A733771J7343J9299K0107J8615J5120J0932O806K827o70l293n363p416r307
61186A818771j0773j2371j4687j7199j9190k1224k4204k7427k9230k9418k9388
$$ plain form
61262 2857078 2845546 2837706 2834311 2835948 2843625 2858924 2883749 2920018 2969271 3032370 3109782 3202172
61250 3202172 3310387 3434757 3574683 3728862 3895343 4070931 4250480 4426690 4590465
61241 4590465 4731718 4840506 4908073 4927639 4895436 4812023 4682597 4515508 4320308 4106975
61231 4106975 3885691 3665655 3453510 3253258 3067517 2898147 2745761 2609559 2488103
61222 2488103 2379987 2283844 2198376 2122579 2055616 1996505 1944298 1898330 1857845 1821739 1789390
61211 1789390 1761432 1738799 1721160 1707228 1696529 1689835 1687790 1690078 1696156 1705780 1718547 1733771
61199 1733771 1751114 1770413 1790520 1809135 1824255 1835187 1841993 1844820 1844150 1840857 1835494 1828078 1818771
61186 1818771 1807998 1795627 1780940 1763741 1744551 1723327 1699123 1671696 1642466 1613048 1583660
61175A583660k9806k9823k8865k7699k7161k7092k7091k7239k7550k7629k7399
61164A276306k7467k8282k9547l0591l0866k9964k7878k5275k2870k0590j8087
61153I84889j5871j4888j5128j5719j6494j8210k0928k3293k3997k3060k1219
61142G76082j8872j6170j3522j1310r457p618n546l125m34K058L771M603M981
61129G05441N386O141P412Q931R964J0129J0024J0519J1635J2805J3841J4904
61117H27132J5754J5944J5584J5153J4703J4056J3483J3298J3002J1780R598O844
61105I86331L227j739p250j1593j4116j5604j6640j6825j5993j4923j4256j3701
61093H46918j2810j1747j0787r843q950q541q843r531j0254j0925j1266j0762
$$ plain form
61175 1583660 1553854 1524031 1495166 1467467 1440306 1413214 1386123 1358884 1331334 1303705 1276306
61164 1276306 1248839 1220557 1191010 1160419 1129553 1099589 1071711 1046436 1023566 1002976 984889
61153 984889 969018 954130 939002 923283 906789 888579 867651 844358 820361 797301 776082
61142 776082 757210 741040 727518 716208 706751 699133 693587 690462 690028 692086 695857 700460 705441
61129 705441 710827 716968 724380 733311 743275 753404 763428 773947 785582 798387 812228 827132
61117 827132 842886 858830 874414 889567 904270 918326 931809 945107 958109 969889 979487 986331
61105 986331 989558 987819 980569 968976 954860 939256 922616 905791 889798 874875 860619 846918
61093 846918 834108 822361 811574 801731 792781 784240 775397 765866 755612 744687 733421 722659
61081G22659r381p760o467n537m769l990k955j644o73q18k030l460m381m615m256
61066F59923l716l738m617n536n525m849m595n040n415n212m656l884k639r20
61052E99581P86K041K659K618K400L003M733O472P124P243Q077R518J0434J0598
61038F77287J0732J0895J0432R489R010R077Q746P651O384N284M143L202L011
61025G75343L293L332L379M152N181N376N148O035Q118R783J0297J0641J1422
61012H61500J2031J2348J3285J4958J6249J6844J7961K0315K3132K5860K9103
61001A063586L3143L7304M1488M6596N2740N8672O3492O7296O9842P0754P1357
60990A676270P4009P9097Q5141R2295J02854J17478J33865J50171J66886J84572
$$ plain form
61081 722659 713278 705518 699051 693514 688745 684755 681800 680156 679483 678665 676635 673175 668794 664179 659923
61066 659923 656207 652469 647852 642316 636791 631942 627347 622307 616892 611680 607024 603140 600501 599581
61052 599581 600367 602408 605067 607685 610085 613088 617821 624293 631417 638660 646737 656255 666689 677287
61038 677287 688019 698914 709346 718835 727845 736922 745668 753319 759703 764987 769130 772332 775343
61025 775343 778636 781968 785347 789499 794680 800056 805204 811239 819357 829140 839437 850078 861500
61012 861500 873531 885879 899164 914122 930371 947215 965176 985491 1008623 1034483 1063586
61001 1063586 1096729 1134033 1175521 1222117 1274857 1333529 1397021 1464317 1534159 1604913 1676270
60990 1676270 1750279 1829376 1914517 2006812 2109666 2227144 2361009 2511180 2678066 2862638
60980B862638K03339K25825K56816K98304L48968M10154M87449N84570P02169
60971F380232Q46042J029029J260833J547258J905614K354243K844501L198392
60963B1366144L165965K608057J643163N95939k14266o37773o80827m03346J04183
60954B7547239O53188R51751P53464M2620r39055j858722k490876k785868k806706
60945A9067035k642750k371607k055464j739162j447820j192444r77356q01570
60937E838862o58953n42661m48937l75432l18661k74934k41619k15818j94001
60928B567846j74353j57457j43459j30546j17305j04344r2311q0465o8695n9000
60918A439911n3221n0785m9867m9402m8776m7107m4246m1246l8686l5733l1769
$$ plain form
60980 2862638 3065977 3291802 3548618 3846922 4195890 4606044 5093493 5678063 6380232
60971 6380232 7226274 8255303 9516136 11063394 12969008 15323251 18167752 21366144
60963 21366144 24532109 27140166 28783329 29379268 29165002 28527229 27846402 27443056 27547239
60954 27547239 28200427 29152178 29905642 29948262 29009207 27150485 24659609 21873741 19067035
60945 19067035 16424285 14052678 11997214 10258052 8810232 7617788 6640432 5838862
60937 5838862 5179909 4637248 4188311 3812879 3494218 3219284 2977665 2761847 2567846
60928 2567846 2393493 2236036 2092577 1962031 1844726 1740382 1648071 1567606 1498911 1439911
60918 1439911 1386690 1335905 1286038 1236636 1187860 1140753 1096507 1055261 1016575 980842 949073
60907I49073k7681k4474k1906j9426j7200j5256j3020j0542q804p847o138k969
60895G73810O9J467K148L810O102P336P198O932P173P242O445M791K477k87k988
60880H33725n199p191r415j1638j3215j3958j4152j4020j3751j3660j3698j3173
60868F90655j1553r310p408o222n401m530l444k139p69M68J642K985M398N552
60854F54924O530P848R565J1030J1801J2235J2922J4003J5332J6756J8042J9008
60842H09996J9799K0546K0735J9630J7400J4991J2863J0693Q425O527M973L081
60830I69659Q27p49r87n10j36J52N05M05p17k704n167q046j1097j3532j4852j5463
60814H97588j5895j6086j5978j6050j6523j6637j5583j3686j1941j0774r901r047
$$ plain form
60907 949073 921392 896918 875012 855586 838386 823130 810110 799568 790764 782917 776779 773810
60895 773810 773879 775346 777494 781304 787406 794742 801940 808872 816045 823287 829732 834523 837000 836713 833725
60880 833725 828526 821335 811920 800282 787067 773109 758957 744937 731186 717526 703828 690655
60868 690655 679102 669792 662384 656162 650761 646231 642787 640648 639879 640347 641989 644974 649372 654924
60854 654924 661454 669302 678867 689897 701698 713933 726855 740858 756190 772946 790988 809996
60842 809996 829795 850341 871076 890706 908106 923097 935960 946653 955078 961605 966578 969659
60830 969659 970486 969737 968750 968240 968104 968256 968761 969166 968449 965745 960578 952532 941435 927903 913051 897588
60814 897588 881693 865607 849629 833579 817056 800419 784836 771150 759209 748435 738534 729487
60802G29487q133p075n921m933m125l107j717l75N52J333K415L876N664P848J0210
60787G25999J2073J3014J3337J3538J3771J4168J5031J6302J7295J7385J6651
60776H88564J5523J4325J3354J2863J2669J2280J1636J1097J0606R635Q147O767
60764A027466N709M481K993J934J471N77j536m077n592n603m777m000l900m605
60750A010541n436n421m546l807l671l455k729k288k916m243n596p062q716r852
60736I40803j0063j0134j0689j0836r522p388n802m718l152j276k35J0P72K399
60722H70169L601L499K859K667K672K127R92l26j711l094m040m242m016l803l517
60707H63837k888k047j303o48J4L71n3j108k041k406k676l608n189o592p311p908
$$ plain form
60802 729487 721354 714279 708358 703425 699300 696193 694476 694101 694653 695986 698401 702277 707941 715789 725999
60787 725999 738072 751086 764423 777961 791732 805900 820931 837233 854528 871913 888564
60776 888564 904087 918412 931766 944629 957298 969578 981214 992311 1002917 1012552 1020699 1027466
60764 1027466 1033175 1037656 1040649 1042583 1044054 1044631 1043095 1039018 1033426 1027823 1023046 1019046 1015146 1010541
60750 1010541 1005105 999684 995138 991331 987660 984205 981476 979188 976272 972029 966433 959371 950655 940803
60736 940803 930740 920606 909917 899081 889559 882171 876369 871651 868499 867223 866988 866998 867770 870169
60722 870169 873770 877269 880128 882795 885467 887594 888586 888260 886549 883455 879415 875173 871157 867354 863837
60707 863837 860949 858902 857599 856951 856965 857336 857283 856175 854134 851728 849052 845444 840255 833663 826352 818444
60691H18444r287j1497j3730j5344j6292j6592j6044j4734j3199j1787j0261q425
60679F61252o632n345m552l991l507k859j546O32L114N044O010O137N700M970
60665F64427M151L273K341J678J655J986J852R17k58j004j111m56J131L252M888
60650F88722N467N422N301N167N230O111P684Q508P447N297L839L742M372N222
60636G67531O455Q136R917J1541J2985J4122J4812J5231J5537J5494J4924J4214
60624I20899J3689J2822J0864Q070N395L092M09l144o971j0014j1751j2383j2453
60611I18524j2397j2238j1669j0497q834o815m454j955L56K540M915P126Q138
60598H72740P598O391N284L836J528r70k713l965n459o672o294m295k167j040
$$ plain form
60691 818444 809157 797660 783930 768586 752294 735702 719658 704924 691725 679938 669677 661252
60679 661252 654620 649275 644723 640732 637225 634366 632820 633452 636566 641610 647620 653757 659457 664427
60665 664427 668578 671851 674192 675870 677525 679511 681363 682280 682022 681018 679907 679451 680582 683834 688722
60650 688722 694189 699611 704912 710079 715309 721420 729104 737612 745059 750356 754195 757937 762309 767531
60636 767531 773986 782122 792039 803580 816565 830687 845499 860730 876267 891761 906685 920899
60624 920899 934588 947410 958274 966344 971739 974831 975240 972096 965125 955111 943360 930977 918524
60611 918524 906127 893889 882220 871723 862889 856074 851620 849665 850021 852561 857476 864602 872740
60598 872740 880338 886729 892013 895849 897377 896407 893694 889729 884270 877598 871304 867009 864842 863802
60584H63802p67r87j821l126m092m188l812l579l534l366k933k241j342m49K18
60569H27783P54J375J935K026J593R37K27o08j573k638l902n233o080o132n873
60554H04591n759n289l716j459K72J089J720K679L743M789O072P424Q258Q764
60540H33178J0104J2945J6656K0479K4633K9807L6202M3625N1768N9649O5404
60529A204450O7284O4660N7652M6443L1566J4361l470k0458l5008m5123m9490
60518A332867m8736m4821l9142l1907k3390j4954q251l751n38K436N273P279P977
60505A140342P673P068O653O688P519R509J2709J6924K2160K8662L6411M4961
60493A347279N4021O3915P5196Q7806J00886J13304J24414J34330J43729J53441
$$ plain form
60584 863802 863035 862048 860227 857101 853009 848821 845009 841430 837896 834530 831597 829356 828014 827565 827783
60569 827783 828537 829912 831847 833873 835466 836403 836630 836022 834449 831811 827909 822676 816596 810464 804591
60554 804591 798832 793543 789827 788368 788640 789729 791449 794128 797871 802660 808732 816156 824414 833178
60540 833178 843282 856227 872883 893362 917995 947802 984004 1027629 1079397 1139046 1204450
60529 1204450 1271734 1336394 1394046 1440489 1472055 1486416 1482946 1462488 1427480 1382357 1332867
60518 1332867 1284131 1239310 1200168 1168261 1144871 1129917 1121666 1117915 1117377 1119813 1125086 1132365 1140342
60505 1140342 1148015 1155083 1161736 1168424 1175943 1185452 1198161 1215085 1237245 1265907 1302318 1347279
60493 1347279 1401300 1465215 1540411 1628217 1729103 1842407 1966821 2101151 2244880 2398321
60483B398321J64366J77857J95963K20945K54258K95923L44290L95388M41666
60474D888977M71828M73481M37824L63092K54338J20797k6019j72455l03397m05559
60464F102907m71645n01854n01814m79362m42412l97830l50749l04576k61699
60455B390966k23800j91362j63638j39719j19465j03050q9992p9183o9687o1169
60445A149901n3654m7247m1933l7374l3076k8910k5233k2369k0255j8769j7912
60434H03169j7425j6721j5568j4372j3420j2304j0602q615o876n385l969k946
60422F74966k717k905k722k075j624j757k081j954j128J25J144J291N94j81l59
60407F58617j6N61J510K995M476N192N108M821M632M349L881L361K809K273K190
$$ plain form
60483 2398321 2562687 2740544 2936507 3157452 3411710 3707633 4051923 4447311 4888977
60474 4888977 5360805 5834286 6272110 6635202 6889540 7010337 6984318 6811863 6508466 6102907
60464 6102907 5631262 5129408 4627594 4148232 3705820 3307990 2957241 2652665 2390966
60455 2390966 2167166 1975804 1812166 1672447 1552982 1449932 1359940 1280757 1211070 1149901
60445 1149901 1096247 1049000 1007067 969693 936617 907707 882474 860105 839850 821081 803169
60434 803169 785744 769023 753455 739083 725663 713359 702757 694142 687266 681881 677912 674966
60422 674966 672249 669344 666622 664547 662923 661166 659085 657131 656003 656128 657272 658563 659157 658976 658617
60407 658617 658601 659162 660672 663667 668143 673335 678443 683264 687896 692245 696126 699487 702296 704569 706759
60392G06759L033M540N863O421O128M983L068R86m28r78j307k038l127m114m649
60377G25140m692m345l647k514j046J70M47j47p73q91p82p84o54k43q6o85j589
60360G02879j885j315l11O51J219J168R19J464L087M664N047M671M849N921P120
60345G40148P938Q535Q990R108R031R138R362R322Q966Q389P282N423L468K329
60331H47429J979J697J365J527K344L487M940O949R140J0613J0969J0473R264
60318I22176P290M907K671N98j643l911n842p526r127j0063r689q412p088n641
60304H68700l587j534o85q22m90P87J938K273K467L184M079M705N120N176M442
60289H95753L274K713K810K295N44j352k134j865j186j89J189K531L532M515N757
$$ plain form
60392 706759 709792 714332 720195 726616 732744 737727 740795 741781 741353 740375 739068 737030 733903 729789 725140
60377 725140 720448 716103 712456 709942 708896 709066 709513 709366 708593 707702 706920 706136 705482 705239 705153 704468 702879
60360 702879 700994 699679 699368 700019 701238 702406 703325 704789 707876 712540 717587 722258 727107 733028 740148
60345 740148 748086 756621 765611 774719 783750 792888 802250 811572 820538 828927 836209 841632 845100 847429
60331 847429 849408 851105 852470 853997 856341 859828 864768 871717 880857 891470 902439 912912 922176
60318 922176 929466 934373 937044 937642 935999 932088 926246 918720 909593 899530 889841 881429 874341 868700
60304 868700 865113 863579 862894 862072 861582 862369 864307 866580 869047 872231 876310 881015 886135 891311 895753
60289 895753 899027 901740 904550 906845 907389 906037 903903 902038 900852 900663 901852 904383 907915 912430 918187
60274I18187O998Q065R244J0633J1945J3276J5127J7351J9108K0247K1630K3627
60262A095438K5588K7265K9499L2740L6193L9283M2784M7531N3121N8849O4953
60251A553244P1856P9163Q6521R4487J03484J12704J21318J29863J39090J48050
60241B639780J54763J58380J59379J57927J53398J45432J34332J20443J04121
60232C927955Q6317O8188N0056L1484J2428o376k4052l9944n3330o3497p0209
60221C919020p3619p3718p0344o3696n4436m3272l0685j6922k027J3962L0631
60210C534894M7270O3523P9682R6078J12490J28262J42606J54603J63390J68565
60200D691363J69922J66803J58356J44717J27184J06915Q4122N8900L2082M741
$$ plain form
60274 918187 925185 933250 942494 953127 965072 978348 993475 1010826 1029934 1050181 1071811 1095438
60262 1095438 1121026 1148291 1177790 1210530 1246723 1286006 1328790 1376321 1429442 1488291 1553244
60251 1553244 1625100 1704263 1790784 1885271 1988755 2101459 2222777 2352640 2491730 2639780
60241 2639780 2794543 2952923 3112302 3270229 3423627 3569059 3703391 3823834 3927955
60232 3927955 4014272 4082460 4132516 4164000 4176428 4170052 4146000 4106056 4052726 3989229 3919020
60221 3919020 3845401 3771683 3701339 3637643 3583207 3539935 3509250 3492328 3490301 3504263 3534894
60210 3534894 3582164 3645687 3725369 3821447 3933937 4062199 4204805 4359408 4522798 4691363
60200 4691363 4861285 5028088 5186444 5331161 5458345 5565260 5649382 5708282 5740364 5745105
60190E745105k2514m9202p4456r7256j16738j31968j42065j46822j46666j41842
60180D675576j32438j19349j04184q7807o9933n0533l0429r967J1565L4247N6385
60169D173133P6097R2991J07172J17558J22499J21515J15282J04510Q9926P2831
60159E193514N4448L5090J4921m885k2728l7834m9831n7627n9888n6463m8222
60148D960495l5807j9459J02K1690M4363O7285Q9142J08889J27036J45450J65735
60137E674921J88468K13665K41195K70733L01957L34609L67821L99634M27790
60128H420793M50751M67504M77070M78859M73002M59412M37030M04866L63366
60119A2432653L13987K57952J96414J31198O4174l873p2645j40915k06647k68154
$$ plain form
60190 5745105 5722591 5673389 5598933 5501677 5384939 5252971 5110906 4964084 4817418 4675576
60180 4675576 4543138 4423789 4319605 4231798 4161865 4111332 4080903 4070936 4082501 4116748 4173133
60169 4173133 4249230 4342221 4449393 4566951 4689450 4810965 4926247 5030757 5120683 5193514
60159 5193514 5247962 5283052 5297973 5293088 5270360 5232526 5182695 5125068 5065180 5008717 4960495
60148 4960495 4924688 4905229 4905331 4927021 4971384 5038669 5127811 5236700 5363736 5509186 5674921
60137 5674921 5863389 6077054 6318249 6588982 6890939 7225548 7593369 7993003 8420793
60128 8420793 8871544 9339048 9816118 10294977 10767979 11227391 11664421 12069287 12432653
60119 12432653 12746640 13004592 13201006 13332204 13396378 13392505 13319860 13178945 12972298 12704144
60109A2704144l23948l71673m08486m32563m43445m41229m26611m01583l68830
60100I085776l30261k86917k40106j91505j42145r2514m3733K359M4484Q2302
60090G887740J15322J42406J62567J75416J80667J77954J67321J49246J24058
60081I282697R2233N5324J5888k3762o2196r8374j31435j61092j87513k10565
60071H571205k29749k44871k56072k63058k65063k61694k53333k40639k24303
60062F332423k05229j84351j62099j38566j14185q9665o5316m0974j6454Q366
60052E323950L3734N9591Q5120J09264J31505J51459J67973J79425J84756J83579
60042F610356J75619J60886J40185J14616Q4827N1531J6361j8941n3940q8910
$$ plain form
60109 12704144 12380196 12008523 11600037 11167474 10724029 10282800 9856189 9454606 9085776
60100 9085776 8755515 8468598 8228492 8036987 7894842 7802328 7758595 7760954 7805438 7887740
60090 7887740 8003062 8145468 8308035 8483451 8664118 8842072 9009393 9158639 9282697
60081 9282697 9374930 9430254 9446142 9422380 9360184 9261810 9130375 8969283 8781770 8571205
60071 8571205 8341456 8096585 7840513 7577455 7312392 7050698 6797365 6556726 6332423
60062 6332423 6127194 5942843 5780744 5642178 5527993 5438328 5373012 5332038 5315584 5323950
60052 5323950 5357684 5417275 5502395 5611659 5743164 5894623 6062596 6242021 6426777 6610356
60042 6610356 6785975 6946861 7087046 7201662 7286489 7338020 7354381 7335440 7281500 7192590
60032G192590j22881j53478j78732j97987k10903k16950k16271k09974j99095
60023E486319j84086j65642j45110j23553j01112p7793n4166l0920q126J4610
60013D610421L7668O1226Q5293J09769J34700J60211J85735K09574K29797K45270
60003F069664K55164K57978K52214K37832K16095J88065J54377J16397P6334L5839
59993G859959m643m4939q4333j21730j55650j83942k04446k16221k19463k14450
59983F410142k01632j82642j59915j34937j07973p9584n1199k3705L229K9874
59973E501658N5409P8669R8958J15598J27717J35164J38805J39414J37025J31790
59963F660207J24548J15829J05187R2224P7541O2001M5717K8665J1729l633j6541
$$ plain form
60032 7192590 7069709 6916231 6737499 6539512 6328609 6111659 5895388 5685414 5486319
60023 5486319 5302233 5136591 4991481 4867928 4766816 4689023 4634857 4603937 4595811 4610421
60013 4610421 4648089 4709315 4794608 4904377 5039077 5199288 5385023 5594597 5824394 6069664
60003 6069664 6324828 6582806 6835020 7072852 7288947 7477012 7631389 7747786 7824120 7859959
59993 7859959 7855316 7810377 7726044 7604314 7448664 7264722 7060276 6844055 6624592 6410142
59983 6410142 6208510 6025868 5865953 5731016 5623043 5543459 5492260 5468555 5471784 5501658
59973 5501658 5557067 5635736 5734694 5850292 5978009 6113173 6251978 6391392 6528417 6660207
59963 6660207 6784755 6900584 7005771 7097995 7175536 7237537 7283254 7311919 7323648 7320015 7303474
59952G303474k6825l4222l7905l6737k9855j7211M10K2284M8645Q0097J16237
59941G388392J55715J97721K42623K90720L41188L92546M43463M92657N38532
59932A0483557N79077O11371O30864O32103O10841N65202M94958M00804K85225
59923A5294002J53552J3739j24931k53380l64526m54553n22251n67231n89603
59914A2584818n91378n76674n49674n13038m68725m19252l67198l14121k60804
59905H523954k08029j56379j05813n6168p826L8622Q2983J25338J65548K03138
59895H605368K37113K65635K86434K97698K97900K84779K55820K10479J50984
59886A0892210Q0428J244q3470j68316k46970l14995l70364m11768m37962m48955
$$ plain form
59952 7303474 7276649 7242427 7204522 7167785 7137930 7120719 7121129 7143413 7192058 7272155 7388392
59941 7388392 7544107 7741828 7984451 8275171 8616359 9008905 9452368 9945025 10483557
59932 10483557 11062634 11674005 12304869 12936972 13547813 14113015 14607973 15008777 15294002
59923 15294002 15447554 15461293 15336362 15082982 14718456 14263903 13741652 13174421 12584818
59914 12584818 11993440 11416766 10867092 10354054 9885329 9466077 9098879 8784758 8523954
59905 8523954 8315925 8159546 8053733 7997565 7989739 8028361 8111344 8236682 8402230 8605368
59895 8605368 8842481 9108116 9394550 9692248 9990148 10274927 10530747 10741226 10892210
59886 10892210 10972638 10973882 10890412 10722096 10475126 10160131 9789767 9377999 8940037 8491082
59876H491082m46655m33755m12530l84882l52896l18744k84141k50126k17455
59867E389898j87100j60226j37515j18889j04162r3749q7981q5932q5680q5819
59857D242845q5933q5423q2934p7409o9069n8779m7139l4690k2409j1363k199
59846C665498M605Q368Q418M347m095j6599l1474m6009n8157o7428p3845p6941
59834C316688p6429p3062o7944o1364n3113m3563l3698k4151j4796n193M857J5035
59822B883267K4683L3571M2529N2702O4030P5116Q4843R3216J00015J03604J01983
59811C659559R4739Q3297O9648N5414M1689K8995J7390O900k334j0402j7405k2485
59799D005005k3781j9996j1574J85J4585L1508N0537P1051R2970J16691J42407
$$ plain form
59876 8491082 8044427 7610672 7198142 6813260 6460364 6141620 5857479 5607353 5389898
59867 5389898 5202798 5042572 4905057 4786168 4682006 4588257 4500276 4414344 4328664 4242845
59857 4242845 4156912 4071489 3988555 3911146 3842077 3783298 3736159 3701469 3679060 3667697 3665498
59846 3665498 3670103 3678471 3686889 3691236 3687141 3670542 3639068 3593059 3534902 3467474 3393629 3316688
59834 3316688 3240259 3167197 3099253 3037889 2984776 2941213 2907515 2883364 2868568 2863375 2868232 2883267
59822 2883267 2907950 2941521 2984050 3036752 3100782 3175898 3260741 3353957 3453972 3557576 3659559
59811 3659559 3754298 3837595 3907243 3962657 4004346 4033341 4050731 4057631 4055297 4044895 4027490 4005005
59799 4005005 3981224 3961228 3949654 3949839 3964424 3995932 4046469 4117520 4210490 4327181 4469588
59788D469588J70205K00824K35747K76312L22865L74620M30031M86849N41177
59779G508218N85776O09425N99160N44730M42806K99419J30253m2330j96124l16339
59769A0164994l98028m42995m56155m44511m16648l80384l40635l00018k60565
59760F725055k23776j89826j58096j28426j01065p5811n2095k9661q445J1955
59750E769809L1947N1417P0162Q8604J07487J27234J48130J70713J95323K21675
59740F982501K49471K79111L11221L45891L83029M23005M66235N12414N60776
59731A0513654O10717O61431P11060P56723P95001Q22001Q33524Q26185P98801
59722A7329097P52888O92523O24124N55477M93936M45373M14602M05485M19428
$$ plain form
59788 4469588 4639793 4840617 5076364 5352676 5675541 6050161 6480192 6967041 7508218
59779 7508218 8093994 8703419 9302579 9847309 10290115 10589534 10719787 10677457 10481333 10164994
59769 10164994 9766966 9323971 8867816 8423305 8006657 7626273 7285638 6985620 6725055
59760 6725055 6501279 6311453 6153357 6024931 5923866 5848055 5795960 5766299 5757854 5769809
59750 5769809 5801756 5853173 5923335 6011939 6119426 6246660 6394790 6565503 6760826 6982501
59740 6982501 7231972 7511083 7822304 8168195 8551224 8974229 9440464 9952878 10513654
59731 10513654 11124371 11785802 12496862 13253585 14048586 14870587 15704111 16530296 17329097
59722 17329097 18081985 18774508 19398632 19954109 20448045 20893418 21308020 21713505 22132933
59713B2132933M54267N05597N68963O40151P13864P83342Q41331Q80918Q95629
59704B8416995Q79794Q29540P43992O26133M82876L23748J59008j188j46643k67959
59694C2046296l58712m16444m41295m34449l98364l37298k56328j59899n1520
59685B9191987O5959J90631L21640M58461O00430P46984Q97058J047407J192038
59676C4712595J323393J432551J507414J532276J491126J371860J168332Q81840
59668D5421387N23901J17429l06933p17017j083561j382951j600383j731721j781411
59659C7458740j758764j676636j551637j402585j248108j106740r97636r37067
59651B6779567r31537r74167j047529j129597j199408j242016j251642j230530
$$ plain form
59713 22132933 22587200 23092797 23661760 24301911 25015775 25799117 26640448 27521366 28416995
59704 28416995 29296789 30126329 30870321 31496454 31979330 32303078 32462086 32460898 32314255 32046296
59694 32046296 31687584 31271140 30829845 30395396 29997032 29659734 29403406 29243507 29191987
59685 29191987 29257946 29448577 29770217 30228678 30829108 31576092 32473150 33520557 34712595
59676 34712595 36035988 37468539 38975953 40508229 41999355 43371215 44539547 45421387
59668 45421387 45945288 46062717 45755784 45038767 43955206 42572255 40971872 39240151 37458740
59659 37458740 35699976 34023340 32471703 31069118 29821010 28714270 27716634 26779567
59651 26779567 25848030 24873863 23826334 22696737 21497329 20255313 19003671 17773141
59643A7773141j184490j119670j042367r59078q75065p93451p16226o45089n80732
59634I856973n22391m69012m20425l76851l37843l02316k69338k38570k10226
59625F710001j84668j61713j40421j20054j01077q4518p0514n8333m7914m0504
59615E700285l7424l8852m4049n2171o2594p4774q7999j01041j12313j20718j26183
59604D842167j28956j28742j25219j19108j11823j04098r5634q6083p5689o5014
59594C801801n4558m4643l5219k5894j6635q100q15N614J1785J7418K1724K4525
59582C697003K6242K7052K6906K6116K5260K4687K4834K6503L0113L5047M0622
59571D010385M7285N5887O6241P7405Q9055J01425J14285J27244J40909J56471
$$ plain form
59643 17773141 16588651 15468981 14426614 13467536 12592471 11799020 11082794 10437705 9856973
59634 9856973 9334582 8865570 8445145 8068294 7730451 7428135 7158797 6920227 6710001
59625 6710001 6525333 6363620 6223199 6103145 6002068 5917550 5847036 5788703 5740789 5700285
59615 5700285 5662861 5624009 5579960 5527789 5465195 5390421 5302422 5201381 5089068 4968350 4842167
59604 4842167 4713211 4584469 4459250 4340142 4228319 4124221 4028587 3942504 3866815 3801801
59594 3801801 3747243 3702600 3667381 3641487 3624852 3616752 3615937 3621551 3633336 3650754 3672478 3697003
59582 3697003 3723245 3750297 3777203 3803319 3828579 3853266 3878100 3904603 3934716 3969763 4010385
59571 4010385 4057670 4113557 4179798 4257203 4346258 4447683 4561968 4689212 4830121 4986592
59561D986592J74060J92765K12243K33161K55778K79217L02485L25359L47842
59552G309502L69493L89494M06833M20233M28400M30594M26761M17320M03167
59543A1001797L85455L65051L42559L19263K97299K78342K62779K50483K41131
59534A3744159K33048K23427K11373J99548J90929J84528J75935J61067J37348
59525A5461362J02094N2775j0505q4607j65888k51394l37444m18935m90898n49664
59515A3306896n92531o17971o26702o21287o04367n78289n46291n12169m78211
59506H129078m44610m11085l77850l44937l12178k80146k49824k21224j93712
59497E293512j67668j44203j23095j02846q2991o4527m7684l1198j4423J840J7322
$$ plain form
59561 4986592 5160652 5353417 5565660 5798821 6054599 6333816 6636301 6961660 7309502
59552 7309502 7678995 8068489 8475322 8895555 9323955 9754549 10181310 10598630 11001797
59543 11001797 11387252 11752303 12094862 12414125 12711424 12989766 13252545 13503028 13744159
59534 13744159 13977207 14200634 14412007 14611555 14802484 14987012 15162947 15324014 15461362
59525 15461362 15563456 15616231 15605726 15521119 15355231 15103837 14766393 14347458 13856560 13306896
59515 13306896 12714365 12096394 11469692 10848405 10244038 9665749 9119458 8607289 8129078
59506 8129078 7684468 7273383 6895533 6550596 6238418 5958272 5708448 5487224 5293512
59497 5293512 5125844 4981641 4858546 4755700 4672709 4608182 4560498 4529300 4514877 4516717 4534039
59486D534039L3378N1019O9470Q7682J05959J25067J45062J65953J88389K12699
59476E718717K38151K63766K88955L12814L33946L51360L64264L70520L66809
59467H609302L50976L22868K82413K28775J62464Q6872O681p4093j51754k22372
59457I602132k82913l32095l69232l93568m05577m07501m01500l88424l69348
59448F251974l46795l23102k98834k74007k49611k26577k04416j82495j61767
59439C984370j43618j27774j12849r8346q4759p2179o0222m8991l8908k9808k1238
59428C145678j3259o072Q13P965J4978K0808K5023K8006L0214L1965L3581L5259
59416C354959L6962L8801M1246M4823N0052N7336O5847P2719P5050P3331P1731
$$ plain form
59486 4534039 4567417 4618436 4687906 4775588 4881547 5006614 5151676 5317629 5506018 5718717
59476 5718717 5956868 6220634 6509589 6822403 7156349 7507709 7871973 8242493 8609302
59467 8609302 8960278 9283146 9565559 9794334 9956798 10043670 10050351 9976258 9824504 9602132
59457 9602132 9319219 8987124 8617892 8224324 7818747 7411246 7009746 6621322 6251974
59448 6251974 5905179 5582077 5283243 5009236 4759625 4533048 4328632 4146137 3984370
59439 3984370 3840752 3712978 3600129 3501783 3417024 3344845 3284623 3235632 3196724 3166916 3145678
59428 3145678 3132419 3126347 3127160 3135125 3150103 3170911 3195934 3223940 3254154 3286119 3319700 3354959
59416 3354959 3391921 3430722 3471968 3516791 3566843 3624179 3690026 3762745 3837795 3911126 3982857
59405C982857P4396Q2629R5863J13530J35014J59523J87283K19370K54991K90323
59395E595779L21969L50899L81709M18623M63204N14693N70708O27831O82658
59386I928073P32012P71583P95608P99474P82320P46352O94588O30482N58698
59377A6439190M84409M11631L42999K80461K25012J75949J31231Q8209M3645n912
59367A8616824o2589j26402j96345k71018l47170m18732m78839n22478n46694
59358A5646557n49745n31973m96977m50535l98403l45814k98006k59633k33667
59349A2081804k21440k23096k37161k60400k89080l19910l49306l73237l88985
59340I419189l96209l95386l86456l70103l48902l25398k99986k72203k43201
$$ plain form
59405 3982857 4057253 4139882 4235745 4349275 4484289 4643812 4831095 5050465 5305456 5595779
59395 5595779 5917748 6268647 6650356 7068979 7532183 8046876 8617584 9245415 9928073
59386 9928073 10660085 11431668 12227276 13026750 13809070 14555422 15250010 15880492 16439190
59377 16439190 16923599 17335230 17678229 17958690 18183702 18359651 18490882 18579091 18622736 18616824
59367 18616824 18554235 18427833 18231488 17960470 17613300 17194568 16715729 16193251 15646557
59358 15646557 15096812 14564839 14067862 13617327 13218924 12873110 12575104 12315471 12081804
59349 12081804 11860364 11637268 11400107 11139707 10850627 10530717 10181411 9808174 9419189
59340 9419189 9022980 8627594 8241138 7871035 7522133 7196735 6896749 6624546 6381345
59331F381345k15221j89291j65027j42042j20067r8489p7279n7832m1324k6974
59321E247799j3410r12R297J7258K3862K8917L1512L1834L0804K8222K3063J5327
59309E473573N945m790j6900k9201l9954m8868n6693o2994o6176o5707o2541n7298
59297D968396m9610l9510k7865j5205j362J3651K9643M6870O5440Q4311J02356
59286E177115J20106J38878J58394J76882J93417K08510K22380K34210K43093
59277F872985K48111K47596K39881K24875K03522J75983J42159J03854O4509K6597
59267H550072q956m0865o7218q7707j04467j20036j35738j51948j67918j80993
59257G484226j88038j88516j84774j78795j70379j58980j45402j30559j14041
$$ plain form
59331 6381345 6166124 5976833 5811806 5669764 5549697 5451208 5373929 5316097 5274773 5247799
59321 5247799 5234389 5233477 5242774 5260032 5283894 5312811 5344323 5376157 5406961 5435183 5458246 5473573
59309 5473573 5479518 5474728 5457828 5428627 5388673 5339805 5283112 5220118 5153942 5088235 5025694 4968396
59297 4968396 4918786 4879276 4851411 4836206 4834844 4848495 4878138 4925008 4990448 5074759 5177115
59286 5177115 5297221 5436099 5594493 5771375 5964792 6173302 6395682 6629892 6872985
59277 6872985 7121096 7368692 7608573 7833448 8036970 8212953 8355112 8458966 8523475 8550072
59267 8550072 8541116 8500251 8433033 8345326 8240859 8120823 7985085 7833137 7665219 7484226
59257 7484226 7296188 7107672 6922898 6744103 6573724 6414744 6269342 6138783 6024742
59248F024742r5039p3652n0376k5283J626L0207O0896R4640J31597J70873K11953
59237F482184K55306L01166L48804L97287M45640M91538N30801N58801N71483
59228A0383010N65091N36429M84278M09721L14827K02258P6600n5383j86607l10943
59218A2419281m22469n15175n84668o29572o50859o50838o33300o03160n64727
59209G164513n20741m73509m25942l80708l39020l00942k66287k34818k06314
59200D016232j80941j59000j40089j23270j08214r5303q4561p5433o7748o1643
59190B920030n6377n0623m4276l8628l4193k9761k4426j9091j4952j1554p508
59179B588641k416L008Q126J2838J7208K1443K5933L0887L6165M1649M7289N2778
$$ plain form
59248 6024742 5929703 5856051 5805675 5780392 5782018 5812225 5873121 5967761 6099358 6270231 6482184
59237 6482184 6737490 7038656 7387460 7784747 8230387 8721925 9252726 9811527 10383010
59228 10383010 10948101 11484530 11968808 12378529 12693356 12895614 12972214 12916831 12730224 12419281
59218 12419281 11996812 11481637 10896969 10267397 9616538 8965700 8332400 7729240 7164513
59209 7164513 6643772 6170263 5744321 5363613 5024593 4723651 4457364 4222546 4016232
59200 4016232 3835291 3676291 3536202 3412932 3304718 3209415 3124854 3049421 2981673 2920030
59190 2920030 2863653 2813030 2768754 2730126 2695933 2666172 2641746 2622655 2607703 2596149 2588641
59179 2588641 2586225 2589233 2597359 2610197 2627405 2648848 2674781 2705668 2741833 2783482 2830771 2883549
59167B883549N7869O3078O9155P5796Q1813Q6763R1198R5070R7160R6707R4359
59156C792517R0722Q5055P6353O4966N2210L8913K5138J0979l122j6622k9046
59145D188063l9974m9038n5777n9744o1178o1080n9854n6360m9408l9886k9964
59134C625800k0395j0091J570J3750K5878L8625N2539O7100Q1926R7595J14481
59123D088778J31984J49700J68293J88408K09741K31929K55261K79733L04275
59114F008102L27672L49234L67754L80660L84936L78107L57726L21045K66517
59105I141753J95432J11743K0877p1072j58107k35369k99486l48225l80961l99410
59095G577175m06643m04855l95141l79426l60817l41394l21154k99829k78333
$$ plain form
59167 2883549 2941418 3004496 3073651 3149447 3231260 3318023 3409221 3504291 3601451 3698158 3792517
59156 3792517 3883239 3968294 4044647 4109613 4161823 4200736 4225874 4236853 4233731 4217109 4188063
59145 4188063 4148089 4099051 4043274 3983530 3922352 3861272 3801418 3745058 3695650 3655764 3625800
59134 3625800 3605405 3595314 3596884 3610634 3636512 3675137 3727676 3794776 3876702 3974297 4088778
59123 4088778 4220762 4370462 4538755 4727163 4936904 5168833 5424094 5703827 6008102
59114 6008102 6335774 6685008 7052762 7433422 7818358 8196465 8554191 8875236 9141753
59105 9141753 9337185 9448928 9469805 9398733 9240626 9005257 8705771 8357546 7976585 7577175
59095 7577175 7170532 6765677 6370536 5991110 5630293 5288899 4967745 4667916 4389583
59086D389583k57533k37149k17015j98129j81274j65759j50710j36544j23969
59077B721501j12498j01241r0369q0618p1968o3915n6376m9341m2325l5089k8244
59066A989517k2173j6140r383k373L983R636J4866J9099K1299K1022J8051J1692
59054B059096J570j1158k4339l6344m6508n4542o0286o3647o4283o1832n6835
59043A580892n0793m4807l8900l3074k8002k4025k0381j6289j1981p937m016j03
59031A300584L216N499P149Q509R102Q574P518O527N275L413J444j49j757l654
59017A361250n040n103m277l420k544j288J52J558L399N941Q442J0193J1598J3197
59003A394058J4471J4672J4107J3449J2646J1582J1012J1589J2582J2854J2498
$$ plain form
59086 4389583 4132050 3894901 3677886 3479757 3298483 3132724 2982014 2845470 2721501
59077 2721501 2609003 2507762 2417393 2336775 2264807 2200892 2144516 2095175 2052850 2017761 1989517
59066 1989517 1967344 1951204 1941821 1939448 1943431 1953067 1967933 1987032 2008331 2029353 2047404 2059096
59054 2059096 2060666 2049508 2025169 1988825 1942317 1887775 1827489 1763842 1699559 1637727 1580892
59043 1580892 1530099 1485292 1446392 1413318 1385316 1361291 1340910 1324621 1312640 1304703 1300687 1300584
59031 1300584 1303800 1309299 1316448 1324957 1334059 1342633 1350151 1356678 1361953 1365366 1366810 1366661 1364904 1361250
59017 1361250 1356210 1351107 1346830 1343410 1340866 1339578 1339730 1341288 1344687 1350628 1359070 1369263 1380861 1394058
59003 1394058 1408529 1423201 1437308 1450757 1463403 1474985 1485997 1497586 1510168 1523022 1535520
58992A535520J2396J2806J3497J4645J6309J7620J7762J7275J7271J7849J8429
58981A711379J9005J9923K0937K1725K2820K4886K7590L0302L3288L6998M0910
58970B009763M4444M8312N3392N8805O2742O4847O6023O6146O3874N8916N2867
58959B650131M7368M2841L9394L7675L8123M0385M4043M9209N6013O4060P2845
58948C182087Q2262R2454J03463J15077J26902J38648J50620J63573J77867J93189
58938D526142K09325K26696K45753K66576K89496L15311L44356L76046M10070
58929G209771M47210M88267N32978N80721O31592O85807P42690Q01097Q60175
58920A2980308R18648R73854J022112J059328J080405J078907J048464R84396
$$ plain form
58992 1535520 1547916 1560722 1574219 1588864 1605173 1622793 1640555 1657830 1675101 1692950 1711379
58981 1711379 1730384 1750307 1771244 1792969 1815789 1840675 1868265 1898567 1931855 1968853 2009763
58970 2009763 2054207 2102519 2155911 2214716 2277458 2342305 2408328 2474474 2538348 2597264 2650131
58959 2650131 2697499 2740340 2779734 2817409 2855532 2895917 2939960 2989169 3045182 3109242 3182087
58948 3182087 3264349 3356803 3460266 3575343 3702245 3840893 3991513 4155086 4332953 4526142
58938 4526142 4735467 4962163 5207916 5474492 5763988 6079299 6423655 6799701 7209771
58929 7209771 7656981 8145248 8678226 9258947 9890539 10576346 11319036 12120133 12980308
58920 12980308 13898956 14872810 15894922 16954250 18034655 19113562 20162026 21146422
58912B1146422Q83879P46018N73284L72471J53422p2721k93905m97940o75092
58903B2335838q19867r29810j004026j044079j054946j042883j012656r67942
58895A4459629r13097q52569p89103p24208o59863n98095n39548m84223m33297
58886H465626l88517l50281l18040k92139k73314k60506k51031k42978k35746
58877E853074k28400k19373k08114j95544j82494j68990j55141j41410j27893
58868D225715j14558j02185r1775q2964p4401o5727n7845n1092m4529l7355k9901
58857C473383k2838j6310j0111l929K646R710J6767K3496L0465L8242M6363N4151
58845C642035O2029P0906Q0699R0679J00819J11604J22937J34547J47052J61294
$$ plain form
58912 21146422 22030301 22776319 23349603 23722074 23875496 23802775 23508870 23010930 22335838
58903 22335838 21515971 20586161 19582135 18538056 17483110 16440227 15427571 14459629
58895 14459629 13546532 12693963 11904860 11180652 10520789 9922694 9383146 8898923 8465626
58886 8465626 8077109 7726828 7408788 7116649 6843335 6582829 6331798 6088820 5853074
58877 5853074 5624674 5405301 5197187 5001643 4819149 4650159 4495018 4353608 4225715
58868 4225715 4111157 4008972 3917197 3834233 3759832 3694105 3636260 3585168 3540639 3503284 3473383
58857 3473383 3450545 3434235 3424124 3420195 3422841 3432551 3449318 3472814 3503279 3541521 3587884 3642035
58845 3642035 3704064 3774970 3855669 3946348 4047167 4158771 4281708 4416255 4563307 4724601
58835D724601J76953J93156K10022K28404K48499K70170K94062L20889L50112
58826G016868L80947M14246M51666M93439N38718N87739O41494O99336P58902
58817A1983355Q18490Q77410R33599R82745J020099J041425J041603J014161R53394
58808B0666281Q56359P22957N55755L60551J46307p5998k94344m96633o72886
58799B1768349q17214r27160j001811j042050j052139j038834j008361r65271
58791A3915509r13819q58522q02791p48271o95695o45324n96797n49991n05831
58782G598468m65068m26801l89892l55324l25014k98658k73985k50165k28650
58773D584911k10489j94998j81547j70407j61203j52583j44004j36001j28181
$$ plain form
58835 4724601 4901554 5094710 5304732 5533136 5781635 6051805 6345867 6666756 7016868
58826 7016868 7397815 7812061 8263727 8757166 9295884 9883623 10525117 11224453 11983355
58817 11983355 12801845 13679255 14612854 15595599 16615698 17657123 18698726 19712887 20666281
58808 20666281 21522640 22245597 22801352 23161903 23308210 23232212 22937868 22441235 21768349
58799 21768349 20951135 20023975 19022164 17980114 16927975 15889141 14880780 13915509
58791 13915509 13001690 12143168 11340377 10592106 9896411 9251087 8654290 8104299 7598468
58782 7598468 7133400 6706599 6316707 5961383 5636369 5337711 5063726 4813561 4584911
58773 4584911 4374422 4179424 3997877 3827470 3666267 3513684 3369680 3233679 3105498
58764C105498j19011j08350r8107q9571q1941p4361o7483o1867n6623n0845m5058
58753B252281m0090l5775l1733k8206k5278k2395j9456j7246j6117j5365j4495
58742A986125j3931j3976j4359j5254j7311k0131k2153k2671k2582k2640k2487
58731A778630k2071k2360k3757k5328k6420k7706k9699l1632l2723l3304l3742
58720A469888l3494l2109l0103k8009k5627k2934k0603j8932j7373j5752j4767
58709A210185j4538j4003j2469j0591r039p361n102k888j554j181j785l953p944
58696A117777j2924j7743k1686k4182k4784k3969k2909k1987k0540j8305j6009
58685H92739j4113j2247j0285q785p851o785n273l805k582j101P76K526L834M620
$$ plain form
58764 3105498 2986487 2878137 2780030 2690459 2608518 2534157 2466674 2404807 2348184 2297339 2252281
58753 2252281 2212191 2176416 2144683 2116477 2091199 2068804 2049348 2032102 2015985 2000620 1986125
58742 1986125 1972194 1958218 1943859 1928605 1911294 1891163 1869010 1846339 1823757 1801117 1778630
58731 1778630 1756559 1734199 1710442 1685114 1658694 1630988 1601289 1569657 1536934 1503630 1469888
58720 1469888 1436394 1404285 1374182 1346173 1320546 1297612 1277009 1258077 1240704 1224952 1210185
58709 1210185 1195647 1181644 1169175 1158584 1149545 1142184 1137082 1134194 1132640 1131459 1129674 1125721 1117777
58696 1117777 1104853 1087110 1065424 1041242 1016458 992489 969580 947593 927053 908748 892739
58685 892739 878626 866379 856094 847309 839458 832673 827400 823595 821013 819912 820688 823214 827048 831668
58671H31668M231K185l12j265m75N13J129K480N039P664R474J0639J0812Q948
58657H92730N596L197L113M128M843N599P008Q469R519J0996J3554J6395J8608
58644A003755K0489K2656K5118K8018L1819L6140L9873M3087M7205N2675N8335
58633A409170O3764P0247P8547Q7678R6868J06922J18676J31953J46902J64437
58623B475164J84456K05657K27890K52449K78987L04522L26492L44234L55903
58614D955754L56621L41693L09703K61074J96252J17790L2129n3031j32062k00790
58604F185133k55122k92794l15022l24361l22286l10513k92638k72132k50093
58595C550172k26851k04165j83654j64707j46176j28787j13668r9934q6112p2882
$$ plain form
58671 831668 835899 838084 837772 836507 836032 836545 837674 840154 845193 852857 862331 872970 883782 892730
58657 892730 898326 901523 904636 908764 913607 919206 926214 934683 944202 955198 968752 985147 1003755
58644 1003755 1024244 1046900 1072018 1100036 1131855 1167995 1207868 1250955 1298160 1350835 1409170
58633 1409170 1472934 1543181 1621728 1709406 1806274 1913196 2031872 2163825 2310727 2475164
58623 2475164 2659620 2865277 3093167 3345616 3624603 3929125 4255617 4599851 4955754
58614 4955754 5312375 5654068 5963771 6224845 6421097 6538887 6571016 6517985 6385923 6185133
58604 6185133 5930011 5637217 5322195 4997834 4675548 4365035 4072397 3800265 3550172
58595 3550172 3323321 3119156 2935502 2770795 2624619 2495832 2382164 2282230 2196118 2123236
58585B123236o2194n4606m9397m6261m4963m4434m4050m4677m6704m8335m7827
58574A589788m6072m4894m3981m1680l7839l3727k9857k5880k1937j8494j5521
58563A229906j3177j2266j2700j2858j1835j0817j0687j0135q012n682m832m563
58551A112342l102r92j37q44k191m287p745j1764j4941j7253j9310k0674k0758
58538I88344k0339k0233j9622j7640j5302j3880j2698j0699q880q830j0006j0765
58526H19450j0908j1109j0961r917q965r108r351q383o986o462o111m744l361
58513G13084l597m632m386k834j519p08L84J357J271P08R18J627J912K195L211
58498G08991M174M218M352N611O789O513O016P059Q731R239R303J0506J1752J0904
$$ plain form
58585 2123236 2061042 2006436 1957039 1910778 1865815 1821381 1777331 1732654 1685950 1637615 1589788
58574 1589788 1543716 1498822 1454841 1413161 1375322 1341595 1311738 1285858 1263921 1245427 1229906
58563 1229906 1216729 1204463 1191763 1178905 1167070 1156253 1145566 1135431 1127419 1121737 1116905 1112342
58551 1112342 1109240 1108248 1108111 1107267 1105076 1100789 1093044 1081280 1066339 1049086 1029776 1009102 988344
58538 988344 968005 947772 928150 910510 895208 881328 868630 857931 849051 840221 830215 819450
58526 819450 808542 797433 786472 776555 767590 758482 749131 740748 733762 727300 721189 716445 713084
58513 713084 709487 704855 700469 697635 696116 695408 695792 697149 698420 699128 700046 701673 703585 705780 708991
58498 708991 713165 717383 721735 727346 734135 740648 746664 753723 762454 771693 780996 791502 803254 814158
58484H14158Q691P446O878M826J409j198k650m527o875q077p976q037q619r021
58470G86428r705j1537j3370j3441j2569j2841j3843j3476j1831j0814j0446r107
58458F43448p017o001o023n400m210m024m508l784j991j006q71M9J530J720Q49
58443F02761J069K566L378L192L771N437O535O657P084P962Q274Q564J0221J2193
58429F89664J1967R829Q486Q410P399M915K907J945L03k465m672n740o821p774
58415G18353p114n394n024o156o307m604k856j964q58M75N38m87o43K34K61p34
58399F77720q53J28L88j90L46K087K793J947J521K147K251J592J789K850K925
58384F99441K068K265L383L060J178K41Q68J179J120K892O349Q485Q372Q207Q675
$$ plain form
58484 814158 822849 830295 837173 841999 843408 842210 839560 835033 828158 820081 812105 804068 795449 786428
58470 786428 776723 765186 751816 738375 725806 712965 699122 685646 673815 663001 652555 643448
58458 643448 636431 630430 624407 619007 614797 610773 606265 602481 600490 599484 598613 598662 600192 601912 602761
58443 602761 603830 606396 609774 612966 616737 622174 628709 635366 642450 650412 658686 667250 677471 689664
58429 689664 701631 711460 719946 728356 735755 740670 743577 745522 745825 743360 738688 732948 726127 718353
58415 718353 711239 705845 700821 694665 688358 683754 680898 678934 678076 678551 679089 678602 677959 678193 678454 677720
58399 677720 676867 676995 677383 677193 677539 679626 682419 684366 685887 688034 690285 691877 693666 696516 699441
58384 699441 701509 703774 707157 710217 711395 711636 712504 713683 714803 717695 724044 732529 740901 749108 757783
58369G57783P940O088N666O747O309L863K687L952M549K598M37J58N95O32J213
58354H11217K299K028N62O20K702M063L730L986N487N777M248L720N213O068N113
58339H66833M949O965Q833Q987R127J0279J0860J0443J0891J2180J1742R498Q548
58326I90135R455R071O511M900N577O171O000P464J0352J0929Q723P873R637J0104
58312A102902P732O378P993R152P918P454R479J0756R549R060J0993J2251J1511
58299A223128J2241J5598J7295J5394J4283J6749J9147J8609J8033J9494J9853
58288A409824J7477J6281J8434K0202J9491K0107K3805K5928K4061K3126K6449
58277A645185K9714K9443K9399L2547L4765L2960L1400L3508L5299L3561L2534
$$ plain form
58369 757783 765723 771811 777477 784224 790533 794396 797083 801035 805584 808182 808619 808777 809372 810004 811217
58354 811217 813516 815544 816106 816726 819428 823491 827221 831207 836694 842471 846719 850439 855652 861720 866833
58339 866833 871782 878747 887580 896567 905694 915973 926833 937276 948167 960347 972089 981587 990135
58326 990135 999590 1008661 1015172 1020072 1025649 1031820 1037820 1045284 1055636 1066565 1075288 1083161 1092798 1102902
58312 1102902 1110634 1117012 1125005 1134157 1142075 1149529 1159008 1169764 1179313 1188373 1199366 1211617 1223128
58299 1223128 1235369 1250967 1268262 1283656 1297939 1314688 1333835 1352444 1370477 1389971 1409824
58288 1409824 1427301 1443582 1462016 1482218 1501709 1521816 1545621 1571549 1595610 1618736 1645185
58277 1645185 1674899 1704342 1733741 1766288 1801053 1834013 1865413 1898921 1934220 1967781 2000315
58266B000315L5653L8917L9137M0372M5152M8157M6071M4718M8656N2836N2660
58255B492644N2787N7419O1488O0678O0534O6050P1925P2997P4430Q1176Q7442
58244C239570Q7550Q7318R3337J00951J04339J08283J18005J27765J31816J36017
58234D334951J46192J56240J60696J67041J81912J97622K06840K17482K37700
58225F006676K59863K75708K93032L20012L48066L68904L92774M29907M70516
58216I165458N04489N43392N99880O63965P24757P96198Q94102J008544J128815
58207A6029600J274366J469867J713192K000470K352992K779780L246437L728531
58199C4595235M263550M901281N646116O511830P588098Q981587J0749836J2982875
$$ plain form
58266 2000315 2035968 2074885 2114022 2154394 2199546 2247703 2293774 2338492 2387148 2439984 2492644
58255 2492644 2545431 2602850 2664338 2725016 2785550 2851600 2923525 2996522 3070952 3152128 3239570
58244 3239570 3327120 3414438 3507775 3608726 3713065 3821348 3939353 4067118 4198934 4334951
58234 4334951 4481143 4637383 4798079 4965120 5147032 5344654 5551494 5768976 6006676
58225 6006676 6266539 6542247 6835279 7155291 7503357 7872261 8265035 8694942 9165458
58216 9165458 9669947 10213339 10813219 11477184 12201941 12998139 13892241 14900785 16029600
58207 16029600 17303966 18773833 20487025 22487495 24840487 27620267 30866704 34595235
58199 34595235 38858785 43760066 49406182 55918012 63506110 72487697 83237533 96220408
58191I6220408J5874223J9595821K4217442K9906715L6901831M4591294N0369031
58184C17676765N0090094M0699402K2922876J300886j8563381l2967000m1023478
58177C40136164m3700832m2547785l9024691l4299719k9200721k4268222j9850647
58170A07243547j6125217j3087429j0630770q661869p112299n886559m881091
58163D0858313m046327l370113k813688k322083j881705j505409j170812q32029
58155B2916147m80104j28707K49438P04753J243600J862284K630920L596833M525664
58146C7120828M852740M062270K163968k48464k417203l880712m589957m724168
58138C2339302m486730m033525l483050k923755k408871j962082j591748j297008
$$ plain form
58191 96220408 112094631 131690452 155907894 185814609 222716440 267307734 317676765
58184 317676765 367766859 408466261 431389137 432690023 414126642 381159642 340136164
58177 340136164 296435332 253887547 214862856 180563137 151362416 127094194 107243547
58170 107243547 91118330 78030901 67400131 58738262 51625963 45739404 40858313
58163 40858313 36811986 33441873 30628185 28306102 26424397 24918988 23748176 22916147
58155 22916147 22436043 22307336 22556774 23261527 24505127 26367411 28998331 32595164 37120828
58146 37120828 41973568 46035838 48199806 47951342 45534139 41653427 37063470 32339302
58138 32339302 27852572 23819047 20335997 17412242 15003371 13041289 11449541 10152533
58130A0152533j066782q84260p36541o17257n20859m40525l73383l21668k85151
58121D906107k57354k33109k14715k05487k01590j95981j86891j76576j64851
58112C069553j50047j33966j19803j06824r2501p8114o7227o0505n6884n7402
58102B146280o2631o8583p0681o9879o9719o9619o6594o1505n7716n5162n1279
58091A442912m6424m2950m0285l6242l1788k9391k8057k5154k1756k0908k1928
58080A098029k1661k0174j9956k0680j9934j8115j7544j7643j6054j3491j2612
58069I00165j3027j2308j0905j1074j1968j0847q290p221p533o696m914m677n905
58056G84800o462o775q947j1939j2737j1714j1729j2484j1057p767n996o218n507
$$ plain form
58130 10152533 9085751 8201491 7464950 6847693 6326834 5886309 5512926 5191258 4906107
58121 4906107 4648753 4415644 4200929 3995442 3793852 3597871 3410980 3234404 3069553
58112 3069553 2919506 2785540 2665737 2558913 2466412 2388298 2321071 2260566 2203682 2146280
58102 2146280 2083649 2015066 1944385 1874506 1804787 1735168 1668574 1607069 1549353 1494191 1442912
58091 1442912 1396488 1353538 1313253 1277011 1245223 1215832 1187775 1162621 1140865 1119957 1098029
58080 1098029 1076368 1056194 1036238 1015558 995624 977509 959965 942322 926268 912777 900165
58069 900165 887138 874830 863925 852851 840883 830036 821746 814525 806992 800296 795382 790705 784800
58056 784800 778338 771563 762616 750677 737940 726226 714497 702013 690956 683189 677193 670975 665468
58043F65468l217j919k196j611M34J736J842K893N074N888M851M409N236N013
58029F93901K959J356J308J054k74j033m86k46j084j701j700k449m084m926m735
58014F77860n237o671p161o212n490n396m377k418j657k559k945j904j274k075
58000F22484k794k496k479l501m253l855l146k469j030O13L79j873l536l041j717
57985E87286q64J80J855L051L257L583M439M573L434K174J408L88q66j212q98
57970F11788j741l968n542n532n299n520m958l288k154k103j327J078L355M031
57956E78820L938L843K773L50j727k331k699l796m222k566K20K576M443N992O229
57941E91843M717K862J793O29j558l883n339o573q258r402r083q386q800r970
$$ plain form
58043 665468 662251 660332 658136 656525 656959 658695 660537 663430 668504 674392 679243 683652 688888 693901
58029 693901 696860 698216 699524 700578 700304 699271 698785 698539 697455 695754 694054 691605 687521 682595 677860
58014 677860 672623 665952 658791 652579 647089 641693 637316 634898 633241 630682 627737 625833 624559 622484
58000 622484 619690 617194 614715 611214 606961 603106 599960 597491 596461 597074 597453 595580 592044 589003 587286
57985 587286 586422 586602 588457 591508 594765 598348 602787 607360 610794 612968 614376 614764 613898 612686 611788
57970 611788 610047 606079 600537 595005 589706 584186 579228 575940 573786 571683 570356 571434 574789 578820
57956 578820 582758 586601 589374 589724 587997 585666 582967 579171 574949 572383 572603 575179 579622 585614 591843
57941 591843 596560 599422 601215 601844 600286 596403 591064 584491 576233 566831 557748 549362 540562 530592
57927E30592j0661j0730j0637j0093q750p207o114n128l784k385j236r6Q64R55
57913D55590M61O98J889K679K559K906M633O661P911Q923J0067J0130Q279N935
57899E29321M911M861M229K594O60j154k723l682m026m526n634o840p726q553
57885E01712r257r193q508q270q551q052o372m841m198l317j458J85O00Q62K245
57870D33587M055N090N793P194Q843R626R638R667R629R029Q163P467O504M838
57856E39123L138K128J317p1j730l025m189n693p196q247r096r832r703q334o673
57841D71917n691n148m580m359m642m445l040j271l25k00n09j597l575n309n825
57826D21401n764o222p009p417p706q486r398r769r853j0156j0231r361p775o186
$$ plain form
57927 530592 519931 509201 498564 488471 479721 472514 466400 461272 457488 455103 453867 453771 454635 455590
57913 455590 456051 456749 458638 461317 463876 466782 471415 478076 485987 494910 504977 515107 523386 529321
57899 529321 534232 539093 543322 545916 546576 545422 542699 539017 534991 530465 524831 517991 510265 501712
57885 501712 492455 483262 474754 466484 457933 449881 443509 438668 434470 431153 429695 429880 430480 431342 433587
57870 433587 437642 442732 448525 455719 464562 474188 483826 493493 503122 512151 520314 527781 534285 539123
57856 539123 542261 544389 545706 545635 543905 540880 536691 530998 523802 515555 506459 496627 486924 478590 471917
57841 471917 466226 461078 456498 452139 447497 443052 440012 438741 438416 438216 437707 436110 432535 427226 421401
57826 421401 415637 409415 402406 394989 387283 378797 369399 359630 349777 339621 329390 320029 312254 306068
57812C06068m787l631l085l032k560j377m73m64n25RM05J73M39K139M166N018
57796B98483N179O046P471Q271Q447R090J0533J2126J3396J4025J3391J1498R739
57783D27695R218R068P785N519L451J633p91l759o272p933r083r763r819r527
57769D07422q995p594n245l451l472m279l905k162l77Q45J840K429K172J702K010
57754C78940K724K785K473K925L869L850K706J926K289K927L109L414M518O029
57740D24484P108P382O983O368O119O285O212N708N789P215R016R743R703J0394
57726E28509J2092J3615J4392J5172J6520J7984J9156K0397K2256K4880K8036
57715G33009L1075L3110L4111L5439L8384M2629M7037N1467N6673O2971P0123
$$ plain form
57812 306068 301281 297650 294565 291533 288973 287596 287123 286659 286134 286143 286548 286721 287160 289299 293465 298483
57796 298483 303662 309708 317179 325450 333897 342987 353520 365646 379042 393067 406458 417956 427695
57783 427695 436913 445981 453766 459285 462736 464369 463578 459819 453547 445614 436531 426768 416949 407422
57769 407422 398427 390833 385588 382137 378665 374386 370481 368319 367942 368787 370627 373056 375228 376930 378940
57754 378940 381664 384449 386922 389847 393716 397566 400272 402198 404487 407414 410523 413937 418455 424484
57740 424484 431592 438974 445957 452325 458444 464729 470941 476649 482438 489653 498669 508412 518115 528509
57726 528509 540601 554216 568608 583780 600300 618284 637440 657837 680093 704973 733009
57715 733009 764084 797194 831305 866744 905128 947757 994794 1046261 1102934 1165905 1236028
57704A236028P8206Q7408R7522J08615J21640J37223J54548J72709J92336K14470
57694B600705K38584K63292K88020L12106L32804L46102L49006L39212L13441
57685E383272K68874K06462J31012M8274l5952j14469j79793k27863k58979k74736
57675D946102k75968k64108k42160k13018j78149j38377r4658m8292l125L1487
57665C519734M2806K3024k3822q3313j38545j77640j96761j98601j88254j69870
57655B408758j46576j21891r9065p9005o0573m3109k7205j3000K90J2812K3915
57644A855351L4032M4986N7709P1313Q5015R9411J15141J31997J50051J70093
57634B815099J92054K14498K36337K57524K77193K92580L00533K98513K83519
$$ plain form
57704 1236028 1314234 1401642 1499164 1607779 1729419 1866642 2021190 2193899 2386235 2600705
57694 2600705 2839289 3102581 3390601 3702707 4035511 4381613 4730619 5069831 5383272
57685 5383272 5652146 5858608 5989620 6037894 6001942 5887473 5707680 5479817 5220838 4946102
57675 4946102 4670134 4406026 4163866 3950848 3772699 3634322 3539664 3491372 3488247 3519734
57665 3519734 3562540 3585564 3561742 3478429 3339884 3162244 2965483 2766882 2578628 2408758
57655 2408758 2262182 2140291 2041226 1962221 1901648 1858539 1831334 1818334 1818624 1831436 1855351
57644 1855351 1889383 1934369 1992078 2063391 2148406 2247817 2362958 2494955 2645006 2815099
57634 2815099 3007153 3221651 3457988 3715512 3992705 4285285 4585818 4884331 5167850
57625E167850K52192K03548J40520O7912r612q6696j56779k14595k58447k88798
57615D817095l05905l10309l04413k91695k74750k55216k34724k14499j94603
57606B430981j74861j56080j39361j24810j11881j00353r0087q0568p1646o4013
57596A317321n8050n2984m8058m3675m0374l7533l4208l0580k7436k4862k2480
57585H97081k0350j8663j7128j5574j4497j4053j3234j1126q353o205m926l816
57573G49156k497r77R12L125M924N797O364P422Q684R441R964J1104J2921J4795
57559H41135J6580J8696K1306K4292K7773L1837L6088M0163M4442M9562N5651
57548A207525O2583P0444P9160Q8349R8232J09934J24093J39799J55739J71708
$$ plain form
57625 5167850 5420042 5623590 5764110 5832022 5822410 5735714 5578935 5364340 5105893 4817095
57615 4817095 4511190 4200881 3896468 3604773 3330023 3074807 2840083 2625584 2430981
57606 2430981 2256120 2100040 1960679 1835869 1723988 1623635 1533548 1452980 1381334 1317321
57596 1317321 1259271 1206287 1158229 1114554 1074180 1036647 1002439 971859 944423 919561 897081
57585 897081 876731 858068 840940 825366 810869 796816 783582 772456 764103 757898 752972 749156
57573 749156 746659 745682 746594 749719 754643 760440 766804 774226 782910 792351 802315 813419 826340 841135
57559 841135 857715 876411 897717 922009 949782 981619 1017707 1057870 1102312 1151874 1207525
57548 1207525 1270108 1340552 1419712 1508061 1606293 1716227 1840320 1980119 2135858 2307566
57538B307566J88102K04620K20305K34102K44259K47941K42357K25778J96884
57529D311914J54515R9701L7126k6907q7573j41628j85816k17455k36466k45057
57519C462354k45175k37722k24051k06614j87659j68484j50036j33098j17651
57510A791864j03162q9655p7692o7256n7733m8924m1134l4253k7828k2014j7283
57499A204930j3205q648l395J543N517R097J3079J7644K2830K8965L6148M4021
57487A358526N2335O1104P0073P8832Q7804R8274J11041J25619J41144J57446
57477B342198J74684J92316K08871K22512K31474K33860K27256K08839J76482
57468D218492J30280P3091R517n5356j16435j69035k09982k38292k54487k59659
$$ plain form
57538 2307566 2495668 2700288 2920593 3154695 3398954 3646895 3889252 4115030 4311914
57529 4311914 4466429 4566130 4603256 4576349 4488776 4347148 4161332 3943877 3707411 3462354
57519 3462354 3217179 2979457 2755406 2548792 2361133 2192649 2042613 1909515 1791864
57510 1791864 1688702 1599047 1521355 1454099 1396366 1347442 1306308 1272055 1244227 1222213 1204930
57499 1204930 1191725 1183077 1179682 1181225 1186742 1195839 1208918 1226562 1249392 1278357 1314505 1358526
57487 1358526 1410861 1471965 1542038 1620870 1708674 1806948 1917989 2043608 2184752 2342198
57477 2342198 2516882 2709198 2918069 3140581 3372055 3605915 3833171 4042010 4218492
57468 4218492 4348772 4421863 4431380 4376024 4259589 4090554 3880572 3642280 3387793 3128134
57458C128134k55570k44844k30030k12623j93603j74406j56508j40374j25650
57449A394526j12205j00205q9452p9553p0648o3108n6706n0751m5029l9914l5692
57438F51263l2364k9915k8169k6599k4866k3198k1695j9829j7326j4980j3695
57427C98627j3164j2469j1575j1134j1169j0977j0208r034p591o152n505o028
57415B83621o701o242m942m112m045l870l308k997k960k318r12J28N4m44m40j03
57399B40409k26j064k191k955k790j606p4R05J062O99K6p51j054m54N08R22O65
57382B32031K31l56j308k128k065j419j258j803k246k105j686j220p46p16j508
57367B11698k354k085r29j93k29k42q2n06j346j273OJ033Q01J43J32N75J021J788
$$ plain form
57458 3128134 2872564 2627720 2397690 2185067 1991464 1817058 1660550 1520176 1394526
57449 1394526 1282321 1182116 1092664 1013111 942463 879355 822649 771898 726869 686955 651263
57438 651263 618899 588984 560815 534216 509350 486152 464457 444628 427302 412322 398627
57427 398627 385463 372994 361419 350285 339116 328139 317931 308897 301306 295154 289649 283621
57415 283621 276920 270678 265736 261624 257579 253709 250401 247404 244444 242126 241214 241342 241396 240952 240512 240409
57399 240409 240183 239119 236928 233973 231183 229577 229503 230408 231470 232169 232195 231444 230390 229936 230444 231366 232031
57382 232031 232262 231906 230598 228470 226405 224986 223728 221925 219679 217574 215888 214668 213922 213206 211698
57367 211698 209344 207259 206330 206137 205908 205666 205584 205078 203732 202459 202465 203498 204299 204442 204574 205149 206170 207958
57349B07958K920L391K546J275O98N62J12l83j95M56P44N36L75N01P45J015J279
57332B24535J406J523K094L125L876L867L586L668L967L951L597L350L616M540
57318B70701N827O661O472N808N707O192O429O415P123Q696R996J0472J1029J2235
57304C79763J3213J3284J3365J4438J5845J6559J7120J8772K1334K3524K4949
57293E72166K6372K8177K9868L1059L1926L2679L3338L3901L4141L3431L1363
57282I18421K8146K3944J8292J0854K212o712j5528k4051l1756l8214m3463m7315
57270G94830m9041m8515m6830m4881m2163l8044l3352k9442k6297k2940j9317
57259C94008j6308j4100j1917r413p125n450m142k931j733k66J715L737M998N447
$$ plain form
57349 207958 210878 214269 216815 218090 218788 219350 219462 219079 218884 219340 220084 220620 220995 221496 222241 223256 224535
57332 224535 225941 227464 229558 232683 236559 240426 244012 247680 251647 255598 259195 262545 266161 270701
57318 270701 276528 283189 289661 295469 301176 307368 313797 320212 327335 336031 346027 356499 367528 379763
57304 379763 392976 406260 419625 434063 449908 466467 483587 502359 523693 547217 572166
57293 572166 598538 626715 656583 687642 719568 752247 785585 819486 853627 887058 918421
57282 918421 946567 970511 988803 999657 1001869 995157 979629 955578 923822 885608 842145 794830
57270 794830 745789 697274 650444 605563 563400 525356 492004 462562 436265 413325 394008
57259 394008 377700 363600 351683 342270 335145 329695 325553 322622 320889 320623 322338 326075 331073 336520
57245C36520N699N942N834N430N380N969O771P335P660P884Q121Q675R756J0957
57231D37933J1601J1725J2133J3331J4828J5732J5674J5107J4837J5285J6033
57220E94219J6300J5904J5470J5572J6115J6827J7726J8809J9776K0600K1710
57209G89028K3101K3871K3363K2223K1476K1081K0216J8754J7490J7027J7142
57198A014772J7304J7226J6842J6302J5944J5956J6249J6829J7869J9192K0192
57187A204677K0687K1270K2344K3429K3976K4298K4933K5680K5983K5886K5866
57176A469029K6167K6856K8122K9854L1415L2457L3394L4493L5155L4836L3949
57165A815727L3120L2259L1293L0927L1589L2327L2020L1091L0716L0916L0842
$$ plain form
57245 336520 342219 348161 353995 359425 364805 370774 377545 384880 392540 400424 408545 417220 426976 437933
57231 437933 449534 461259 473392 486723 501551 517283 532957 548064 562901 578186 594219
57220 594219 610519 626423 641893 657465 673580 690407 708133 726942 746718 767318 789028
57209 789028 812129 836000 859363 881586 903062 924143 944359 963113 980603 997630 1014772
57198 1014772 1032076 1049302 1066144 1082446 1098390 1114346 1130595 1147424 1165293 1184485 1204677
57187 1204677 1225364 1246634 1268978 1292407 1316383 1340681 1365614 1391294 1417277 1443163 1469029
57176 1469029 1495196 1522052 1550174 1580028 1611443 1643900 1677294 1711787 1746942 1781778 1815727
57165 1815727 1848847 1881106 1912399 1943326 1974915 2007242 2039262 2070353 2101069 2131985 2162827
57154B162827L0544L0899L1992L3017L3698L4379L4791L4179L2811L1891L1686
57143B522714L1167K9804K8461K7991K8074K8067K7996K8043K7879K7148K6067
57132B833411K5066K4319K4010K4448K5682K7401K9470L2006L4844L7380L9170
57121C157207M0110M0044L8865L7125L5861L5554L5912L6845L8963M2784M8130
57110C587400N4790O3171P3739Q6289J00376J16433J36033J61269J94450K38155
57100D812105K94695L64737M46654N37743O36369P43045Q60124R91401J141929
57091A0828802J316727J518359J745114J990736K244134K488663K703109K865748
57083B7701392K960719K986720K965728K938855K934651K922488K798170K436088
$$ plain form
57154 2162827 2193371 2224270 2256262 2289279 2322977 2357356 2392147 2426326 2459137 2491028 2522714
57143 2522714 2553881 2583685 2612146 2640137 2668211 2696278 2724274 2752317 2780196 2807344 2833411
57132 2833411 2858477 2882796 2906806 2931254 2956936 2984337 3013807 3045813 3080657 3118037 3157207
57121 3157207 3197317 3237361 3276226 3313351 3349212 3384766 3420678 3457523 3496486 3539270 3587400
57110 3587400 3642190 3705361 3779100 3865389 3965765 4082198 4218231 4379500 4573950 4812105
57100 4812105 5106800 5471537 5918191 6455934 7092303 7835348 8695472 9686873 10828802
57091 10828802 12145529 13663888 15409002 17399738 19643872 22132535 24835644 27701392
57083 27701392 30662111 33648831 36614559 39553414 42488065 45410553 48208723 50644811
57075E0644811J777082Q75764j32538j107059j953337k628472l123698l448658
57067D0903895l620589l656954l575175l397381l150786k861820k552314k241057
57059A5847819j944475j673397j431714j219810j037496q83188p53395o44898
57051F259446n55783m83524m24344l75512l36188l05004k78914k55535k34545
57042C010097k15738j97751j79891j63194j48413j34729j21708j10508j01796
57033A636369r4265q6641p9590p4056o9315o4206n9028n4630n0788m6855m3064
57022I13931l9892l7018l3995l0994k8090k4848k1416j8787j7130j5224j2399
57011F34138r553p427n418l119j248J29K449O378J0462J3598J7147K2996L1266
$$ plain form
57075 50644811 52421893 53297657 53165119 52058060 50104723 47476251 44352553 40903895
57067 40903895 37283306 33626352 30051177 26653796 23503010 20641190 18088876 15847819
57059 15847819 13903344 12229947 10798233 9578423 8540927 7657739 6904344 6259446
57051 6259446 5703663 5220139 4795795 4420283 4084095 3779091 3500177 3244642 3010097
57042 3010097 2794359 2596608 2416717 2253523 2105110 1970381 1848673 1738165 1636369
57033 1636369 1542104 1455463 1375873 1301817 1232502 1168296 1109268 1054638 1003850 956995 913931
57022 913931 874039 837021 803026 772032 743942 719094 697678 678891 661761 646537 634138
57011 634138 624585 617158 611740 608621 607373 607502 609951 616329 626791 640389 657536 680532 711798
56998G11798M1719N5454P3241R4706J21919J60251K08971K50354K54787K02726
56988B175926J02541j4022j13263j77275k05898k07928j93012j69365j44183j22757
56978I30764j06688r4325q3510p3364o3547n3318m2338l1558k2371j5286r945
56967C34514n847k524L55K512L538M184O168J0089J4702J9015K3714K9144L2971
56954D72535L1605K3737J1346k252j4223k2675k7010k8113k7433k5703k2933j9245
56942C49636j5094j0918p111l959j177J969N653R281J2745J7139K3549L1702M0038
56929D53453M6073M6414L8085K1469J214j6932k9860l7339m0056l8935l5623l1847
56917C76116k8212k4406k0333j6332j2689r742p926p088o296n006l780l245l177
$$ plain form
56998 711798 753517 808971 882212 976918 1098837 1259088 1468059 1718413 1973200 2175926
56988 2175926 2278467 2264445 2151182 1973907 1768009 1560081 1367069 1197704 1053521 930764
56978 930764 824076 729751 646241 572877 509330 456012 413674 382116 359745 344459 334514
56967 334514 328667 326143 326498 329010 332548 336732 342900 352989 367691 386706 410420 439564 472535
56954 472535 504140 527877 539223 536971 522748 500073 473063 444950 417517 391814 368881 349636
56942 349636 334542 323624 316513 312554 311377 313346 318999 328280 341025 358164 381713 413415 453453
56929 453453 499526 545940 584025 605494 606708 589776 559916 522577 482521 443586 407963 376116
56917 376116 347904 323498 303165 286833 274144 264402 256476 249388 243092 238086 234306 231061 227884
56904B27884l237l541l752k764m17J598J823J137J400K846M292N279O457Q193
56890B47198J0167J2182J4396J6961K0199K4404K8462K9405K4720J4901K884q429
56878D37450j7228k2465k4079k3236k1136j7827j3106p813l043J368O209J1307
56866C06401J5849J9990K4829L1043L8691M8192O0109P3523Q4911Q8678P9406
56855H71622N5474K1763j2293l8714n5010o2561o3130n8297n0380m1481l2132
56844E34861k2343j3023m873L047J1909K1303L0616M1088N4520P1015Q9900J11077
56832I29097J31906J43447J34156R9451M6382j1294o1006r5398j12766j16131
56822A087844j10708j00562q7598p3172n8950m5838l3651k2326j2204k814P188
$$ plain form
56904 227884 224647 221106 217354 214590 214173 215771 217594 218731 220131 222977 227269 232548 239005 247198
56890 247198 257365 269547 283943 300904 321103 345507 373969 403374 428094 442995 445879 437450
56878 437450 420222 397757 373678 350442 329306 311479 298373 290560 287517 288885 295094 306401
56866 306401 322250 342240 367069 398112 436803 484995 545104 618627 703538 792216 871622
56855 871622 927096 948859 936566 897852 842842 780281 717151 658854 608474 566993 534861
56844 534861 512518 499495 494622 497669 509578 530881 561497 602585 657105 728120 818020 929097
56832 929097 1061003 1204450 1338606 1438057 1484439 1473145 1412139 1316741 1203975 1087844
56822 1087844 977136 876574 788976 715804 656854 611016 577365 555039 542835 540021 547209
56811E47209J8402L0248M2705N7101P4162R1420J02735J00428P9546M2159k263
56800A183852m2218p0778q7119r3236r1260q3562p2934o1496n0241l9770l0473
56789D60765k2088j4215p108r52N169J2294K0103K7871L6150M5295N2554N2836
56777F68674M3024K4365J003k2105m0265n0740n4301n3712n0606m5185l8544l2803
56765C48805k8565k4440j9705j5431j2401r903p436n731n170m874m196l632l415
56752B03906k776j497p55j400k579k983k447j587q70o28j041j668j878j906k419
56737A77472k985k515j219n88j077j541j289r63q86l81N39N82p81k237k522k022
56721A57587j555j016j64M30K48l07p41j151j556j481q51k66M9M74R10P10L9k7
$$ plain form
56811 547209 565611 595859 638564 695665 769827 861247 963982 1064410 1143956 1186115 1183852
56800 1183852 1141634 1070856 983737 890501 799241 715679 642745 581249 531008 491238 460765
56789 460765 438677 424462 417354 416402 421571 433865 453968 481839 517989 563284 615838 668674
56777 668674 711698 736063 737066 714961 674696 623956 569655 515943 465337 420152 381608 348805
56765 348805 320240 295800 276095 260664 248263 238360 230924 225193 220023 215149 210953 207321 203906
56752 203906 201130 199633 198878 197478 194899 191916 189469 187882 187012 186384 185343 183675 181797 179891 177472
56737 177472 174487 171972 170753 170165 169088 167547 166258 165295 164409 164028 164567 165149 164368 162131 159609 157587
56721 157587 156032 155016 154852 155282 155530 155223 154482 153331 151775 150294 149443 149177 149226 149700 150610 151320 151359 151332
56703A51332P86J484J419J045O52j18j041j220o84n24r20p85R0L44n67j208m65
56686A49620O70R00O71J102K022K480K252J731J122O43O27P89L20o85j042l37
56670A62885K68j69j005j165n55L55J280J762J247R2o08n71n33o53k37N44M51
56653A63388p09j543j311j022j466j979k012k162k675k665j881j471j874j801
56639A38817n79L17l83j496j241L3O52J29o59r47n24N72J758K123J665J283J118
56622A42638L39r13j156L2J107J047Q08J137J023j61r82k29R21Q77K86O62J709
56605A49145K013J392O87J28m41o13j42K37M4M0O76R16M2o97J19J788K647K446
56587A60427J975J400N78N3K15M03K21N50J839K688J833L06p5O83J346J595J802
$$ plain form
56703 151332 152118 153602 155021 156066 156718 156600 155559 154339 153655 153131 152211 151426 151516 151860 151293 150085 149620
56686 149620 150290 151190 151861 152963 154985 157465 159717 161448 162570 163213 163840 164629 164949 164264 163222 162885
56670 162885 163153 162984 161979 160814 160259 160614 161894 163656 164903 164995 164387 163816 163283 162630 162393 162937 163388
56653 163388 162679 161136 159825 158803 157337 155358 153346 151184 148509 145844 143963 142492 140618 138817
56639 138817 138238 138555 138172 136676 135435 135468 136120 136249 135590 134643 134119 134691 136449 138572 140237 141520 142638
56622 142638 142977 142064 140908 140940 142047 143094 143902 145039 146062 145901 144919 144690 145611 146488 146774 147436 149145
56605 149145 151158 152550 153237 153365 152924 152311 152169 152406 152450 152490 153166 154082 154124 153427 153546 155334 157981 160427
56587 160427 162402 163802 164380 164433 164648 165051 165272 165822 167661 170349 172182 172488 172413 173096 174442 176037 177839
56570A77839J700J067Q81K049L675M178L437K419J616J128J444K689L932M426
56556B12480M521M414L420J717J014K022K945K198Q96P14J040M70m13j95P23J002
56540B38968P43P50N24o63j804j569p40q49j461j174m17o57j637j904j567j993
56524B24550l188l866l726l551l395k805k377k984l894l703k683k254k635k977
56510A80512l137l359k944j328K60L96j42K60J125Q14l72o68K8J99l63k89P86
56493A71778J668J761J684J744J708J877K604L103K539J742J998K835K952K518
56479B02511K447K316J372O28J402K621K332J136J208K543L150K619K451L066
56465B31802L476L786N050O662O846N824N597O448O574N450M580M508L967K534
$$ plain form
56570 177839 179539 180606 181487 183536 187211 191389 194826 197245 198861 199989 201433 204122 208054 212480
56556 212480 217001 221415 224835 226552 227566 229588 232533 234731 235627 236341 237381 237851 237438 237243 237966 238968
56540 238968 239711 240461 240985 240322 238518 236949 236209 235360 233899 232725 232308 231651 230014 228110 226543 224550
56524 224550 221362 217496 213770 210219 206824 204019 201642 198658 194764 191061 188378 186124 183489 180512
56510 180512 177375 174016 171072 169744 170004 170400 170258 170518 171643 172457 172085 171417 171445 171644 171281 170992 171778
56493 171778 173446 175207 176891 178635 180343 182220 184824 187927 190466 192208 194206 197041 199993 202511
56479 202511 204958 207274 208646 209274 210676 213297 215629 216765 217973 220516 223666 226285 228736 231802
56465 231802 235278 239064 244114 250776 257622 263446 269043 275491 282065 287515 292095 296603 300570 303104
56451C03104J395R56K07r32j168l03L28L24P79J806K026J057K57L28L40m08j543
56434C08553k939m809o334o397n712n987o997o957n731m941m882m223l040l007
56420B36597m152m382l027j904k049k238j707j557k305k642j914j406j995k706
56406B02613k682k494k456j760k72Q14R93J166J640J485N78J60O15Q02K89J05
56390B01596N88O97J69J99J212K101K380K946M034M618M508M854N867O312N858
56375B47939N638N832N141L365K040J670Q44r80k250j941j082o02R1J319K097
56360B69121J918J631J639J241M33K67P47O48k5K67J743K658K255J907K502L231
56344B92183L749M954O623O997N772N029N965P132P080O358N794N149M649N412
$$ plain form
56451 303104 304499 305455 305662 304730 303562 303259 303587 303911 304690 306496 308522 309579 309836 310164 310504 310096 308553
56434 308553 305614 300805 294471 288074 282362 276375 269378 262421 256690 251749 246867 242644 239604 236597
56420 236597 232445 228063 225036 223132 221083 218845 217138 215581 213276 210634 208720 207314 205319 202613
56406 202613 199931 197437 194981 193221 192949 193763 194756 195922 197562 199047 199625 199785 200400 201202 201491 201596
56390 201596 202184 202881 203050 203249 204461 206562 208942 211888 215922 220540 225048 229902 235769 242081 247939
56375 247939 253577 259409 264550 267915 269955 271625 272469 271489 269239 267298 266216 265614 265705 267024 269121
56360 269121 271039 272670 274309 275550 275983 276250 276997 277645 277620 277887 279630 282288 284543 286450 288952 292183
56344 292183 295932 300886 307509 314506 320278 325307 331272 338404 345484 351842 357636 362785 367434 372846
56330C72846P260Q225P425O215N717N447N133N376N724M636K273P03N43L8j577
56315D35984k737k534k227k629k778k298k292k786k201m10O03K22K37J322J767
56300D17243R82R28K467L685L471L497M750N451M491L767M872O421O866P202Q675
56285D84768J0449J1667J3190J5356J6669J6671J7418K0136K3130K4901K6524
56274F80879K9038L1369L2943L5452L9865M4516M8269N2792N9501O7122P4468
56263A196214Q2770R3042J03939J14489J26042J39228J51976J62804J73103J83700
56253B527307J92349J97070J98924J98727J94163J83174J67191J48089J24753
56244D131747R6011O4351L3556M846k1781m4822o2960p7301q9120r7402j01155
$$ plain form
56330 372846 380106 388331 395756 401971 407688 413135 418268 423644 429368 434004 436277 436980 437523 437561 435984
56315 435984 433247 430713 428486 425857 423079 420781 418489 415703 413502 413092 413695 413917 414154 415476 417243
56300 417243 418225 419153 421620 425305 428776 432273 437023 442474 446965 450732 455604 462025 468891 476093 484768
56285 484768 495217 506884 520074 535430 552099 568770 586188 606324 629454 654355 680879
56274 680879 709917 741286 774229 809681 849546 894062 942331 995123 1054624 1121746 1196214
56263 1196214 1278984 1372026 1475965 1590454 1716496 1855724 2007700 2170504 2343607 2527307
56253 2527307 2719656 2916726 3115650 3314377 3508540 3691714 3858905 4006994 4131747
56244 4131747 4227758 4292109 4325665 4330511 4308730 4263908 4200948 4123647 4034527 3937125 3835970
56233C835970j01943j01721j00478r8317r7191r8132r9438j00073j02042j06747
56223B829888j11903j14909j16486j18191j19134j18090j16092j14071j10628
56214A790384j04925r8900r3915q8241q0707p3544o8491o3388n6047m8396m3152
56203I70678l9422l5172l1134k8639k6330k2669j9034j6899j4725j1061p816o903
56191G10874o582m627k250j249l28K071M306M633M730O362P696O724N117M806
56177G42283M068J082k007k781k903m525n878m985m240o338r026q887p203o904
56163F81756o909m810k151j621j733K95L081L831L893O077R059R892R615J0909
56149G21184J2729J2781J2753J5497J9391K1223K2313K6101L1882L6696M1259
$$ plain form
56233 3835970 3734027 3632306 3531828 3433511 3336320 3238188 3138750 3038677 2936635 2829888
56223 2829888 2717985 2603076 2486590 2368399 2249265 2131175 2015083 1901012 1790384
56214 1790384 1685459 1586559 1492644 1404403 1323696 1250152 1181661 1118273 1062226 1013830 970678
56203 970678 931256 896084 864950 836311 809981 787312 768278 751379 736654 725593 717777 710874
56191 710874 704292 699665 697415 696166 695838 697909 702215 706848 711578 717940 725636 732360 737477 742283
56177 742283 746351 747433 745426 742645 739742 735217 729339 724354 720114 713776 704750 695863 688660 681756
56163 681756 674847 670037 667886 666265 664532 664827 667908 671739 675632 681709 690768 700660 710275 721184
56149 721184 733913 746694 759447 774944 794335 815558 837871 863972 895854 932550 973809
56138I73809M8464N8152O8872Q2368J00673J20982J38995J54660J68903J77571
56128B093449J75106J62132J43608J22246R9839Q1879P3294P1130O7917O0483
56118C151083M9670L4476J3946p184k2042k9708l3957l6554l8465m4870o1100
56107B975295q4895j09281j30999j49664j61696j63163j56751j48216j37826j22625
56097A610179j04806q9767p7723o5246n3213m5144l9528l2090k3994j9646j8111
56086A040911j4955j0812r564r839p146k801j819l427k614M19J334O97K589N758
56072I88731N494L061L700O650O761M698N634Q986R557P704Q292J0655R968P463
56058A087354Q660J2501J3039J0913J2025J5792J6188J3683J4443J8166J8657
$$ plain form
56138 973809 1022273 1080425 1149297 1231665 1332338 1453320 1592315 1746975 1915878 2093449
56128 2093449 2268555 2430687 2574295 2696541 2796380 2878259 2951553 3022683 3090600 3151083
56118 3151083 3200753 3235229 3249175 3241991 3219949 3190241 3156284 3119730 3081265 3036395 2975295
56107 2975295 2890400 2781119 2650120 2500456 2338760 2175597 2018846 1870630 1732804 1610179
56097 1610179 1505373 1415606 1337883 1272637 1219424 1174280 1134752 1102662 1078668 1059022 1040911
56086 1040911 1025956 1015144 1005580 995741 988595 985794 983975 980548 977934 978353 979687 980384 982973 988731
56072 988731 994225 997286 1000986 1007636 1014397 1019095 1024729 1033715 1043272 1050976 1059268 1069923 1079891 1087354
56058 1087354 1096014 1108515 1121554 1132467 1144492 1160284 1176472 1190155 1204598 1222764 1241421
56047A241421J6140J7022K1424K3072K1546K2497K5828K5948K3689K5357L0064
56036A494008L0872K8266K9310L3566L3688L0058L0490L5029L5606L1568L0785
56025A843246L4388L5347L3192L4929M0221M1100L7757L8885M5073M7913M6694
56014B278745M9433N6134N8321N6426N9876O8433P1891O9907P2917Q1621Q5558
56003C009262Q4191Q8596R9531J05286J04466J08864J20225J26871J27234J33177
55993D107703J45763J52096J50929J56317J70796J80904J84655J96324K18167
55984E663654K35627K46784K67048K98174L23615L41713L70838M14069M53205
55975H614727M85918N32206N95282O55386P12225P91677Q99531J013436J133177
$$ plain form
56047 1241421 1257561 1274583 1296007 1319079 1340625 1363122 1388950 1414898 1438587 1463944 1494008
56036 1494008 1524880 1553146 1582456 1616022 1649710 1679768 1710258 1745287 1780893 1812461 1843246
56025 1843246 1877634 1912981 1946173 1981102 2021323 2062423 2100180 2139065 2184138 2232051 2278745
56014 2278745 2328178 2384312 2442633 2499059 2558935 2627368 2699259 2769166 2842083 2923704 3009262
56003 3009262 3093453 3182049 3281580 3386866 3491332 3600196 3720421 3847292 3974526 4107703
55993 4107703 4253466 4405562 4556491 4712808 4883604 5064508 5249163 5445487 5663654
55984 5663654 5899281 6146065 6413113 6711287 7034902 7376615 7747453 8161522 8614727
55975 8614727 9100645 9632851 10228133 10883519 11595744 12387421 13286952 14300388 15433565
55966A5433565J291549J503021J752707K047287K416701K850835L302339L772406
55958C4370410M322340M982813N739730O636010P789065R279783J1145016J3513480
55950I7778647J6597106K0514639K5345255L1361848L8625396M5725068M9149006
55943C25096965M4913026L1631160J2089512q361518k5013191l5753638m0800828
55936C03801488m1443515l9136031l5148264l0437595k5639199k1167998j7286457
55929I3542429j4079225j1475127r368882p694712o384418n338751m481567l790194
55921C0929553l244671k796046k408685k086337j830816j615438j420422j255432
55913A4271706j125993j012872r03397q09685p38058o71932o01466n40041m95522
$$ plain form
55966 15433565 16725114 18228135 19980842 22028129 24444830 27295665 30598004 34370410
55958 34370410 38692750 43675563 49415293 56051303 63840368 73120151 84265167 97778647
55950 97778647 114375753 134890392 160235647 191597495 230222891 275947959 325096965
55943 325096965 370009991 401641151 413730663 405369145 380355954 344602316 303801488
55936 303801488 262357973 223221942 188073678 157636083 131996884 110828886 93542429
55929 93542429 79463204 67988077 58619195 50924483 44540065 39201314 34719747 30929553
55921 30929553 27684882 24888836 22480151 20393814 18562998 16947560 15527138 14271706
55913 14271706 13145713 12132841 11229444 10419759 9681701 9009769 8408303 7868262 7372740
55904G372740m53922m06690l66492l40884l16717k85419k58729k44743k32061
55895D467083k12009j94150j85812j77519j62151j48471j42708j35999j22486
55886B985778j11288j08488j05268r5480q7489q7163q6113p8191p1165p0907o9882
55875B014344o2405n5918n6134n5896m9572m4059m4692m4341l7384l1116l2282
55864A500545l4932l2333k8908k9845l0413k5845k1047k0642j9757j4080q700
55853A234043p806n757K551J1980J6303J7513J7743J1892k965j9732l1211l9316
55841A205238m7045n0592m7424m3220m2657m1689l6477l1306l0096k8702k3395
55830G82635j8566j8255j8246j4317j0298j0234j0482p357m781o630r025p861
$$ plain form
55904 7372740 6918818 6512128 6145636 5804752 5488035 5202616 4943887 4699144 4467083
55895 4467083 4255074 4060924 3875112 3697593 3535442 3386971 3244263 3108264 2985778
55886 2985778 2874490 2766002 2660734 2565254 2477765 2390602 2304489 2226298 2155133 2084226 2014344
55875 2014344 1951939 1896021 1839887 1783991 1734419 1690360 1645668 1601327 1563943 1532827 1500545
55864 1500545 1465613 1433280 1404372 1374527 1344114 1318269 1297222 1276580 1256823 1242743 1234043
55853 1234043 1226237 1220480 1223031 1235011 1251314 1268827 1286570 1298462 1295497 1275765 1244554 1205238
55841 1205238 1158193 1107601 1060177 1016957 974300 932611 896134 864828 834732 806030 782635
55830 782635 764069 745814 727568 713251 702953 692719 682237 674880 670099 663469 654444 646583
55818F46583o532q491r672o173k217k524l777j596P78j116m383m620m218o882
55804E85160r822r187p590q587r264o026k295k746n089n132m907q040j1973j2418
55790D82084j1124j1785j2660j0605q068q786j0495r140o432o181o890m937j569
55777C73412k9P53K998M158P97m818q276r937j2247j3693j1718q431p238o802
55763B98929m258j190n73j027J6Q02j159l357k205L97N53p64m07L89j578n004
55747B79564o208n400n249n559m895m905p381r571q035m717l703m496l996k596
55733B02853k551k778r70J300J146j89R2P06j148l942m241k906l185m594m390
55718A75203l239l676m630l208l36Q45P47K059M228M714M281N635Q038Q717Q374
$$ plain form
55818 646583 640051 631560 621888 615715 613498 610974 607197 605601 606379 605263 600880 596260 592042 585160
55804 585160 575338 566151 558561 549974 540710 534684 532389 529643 524554 519422 514515 506475 494502 482084
55790 482084 470960 459175 446515 435910 427842 419056 408561 399421 392989 386808 379918 374981 373412
55777 373412 373383 374136 377134 381292 382089 377271 368995 359058 346811 333118 321400 312969 305731 298929
55763 298929 294671 293481 292908 291881 291897 292699 291540 288183 285978 286375 286928 286164 285757 286146 284568 279564
55747 279564 273356 267956 262707 257148 252253 247348 239967 230396 222361 217644 213941 209445 205449 202853
55733 202853 200302 197524 196554 197854 199000 198811 198903 199609 198461 194519 190278 187372 184187 179593 175203
55718 175203 171964 168288 163658 160450 160114 160959 161706 163765 167993 172707 176988 182623 190661 199378 207752
55703B07752R882J2551J2967J0702Q124N512J390l137n434o006p446r530r974
55690B27353r049q822q799o975m239l105l033j653N19J178R55K236M328M652L730
55675A99276M103N144M038J238j16K78j54j633j738k52M08k49k78O23O74l43q36
55658B10183p82j494k418j981j113j965l738l802k423k224l445l971l598m101
55644A73128n322n418m728n278o690o650n214m555m780m042k566k436l493l588
55630A08368k686k719l481k852j058n59j701k399k171k464l047k122j55M07o33
55615H0728j098n23m96j005n02M47l50k468l186k160j688k169j559L28J205N36
55599F6040K83R41Q01k82m00N74O21l86k56J238J640K55o95k14M2n84n38M90N91
$$ plain form
55703 207752 217634 230185 243152 253854 261978 267490 268880 265743 260309 254303 246857 237327 227353
55690 227353 218304 209482 200683 193708 189469 186364 183331 181678 182197 183375 184330 186566 190894 195546 199276
55675 199276 203379 208523 212561 213799 213683 213961 213807 212174 210436 210184 210592 210343 210065 210688 211362 211019 210183
55658 210183 209401 207907 205489 203508 202395 200430 196692 192890 190467 188243 184798 180827 177229 173128
55644 173128 167806 162388 157660 152382 145692 139042 133828 129273 124493 120451 117885 115449 111956 108368
55630 108368 105682 102963 99482 96630 95572 95013 93312 90913 88742 86278 83231 81109 80954 81361 80728
55615 80728 79630 79107 78611 77606 77104 77551 77201 74733 71547 69387 67699 65530 63971 64299 65504 66040
55599 66040 66323 67264 68065 67783 67383 67957 68578 68192 67936 69174 70814 71069 70374 70160 70202 69618 69080 69570 70161
55580G0161o64j179j54M95k75r80p26p08j374j264J10J183J119R50J078N52m87
55563F7837o17N6j03r69o46P95J051k62q49K8K46j142k134j462o45r12j176n82
55545E8514j68n63o23L14J341J990K850L487K651J069R85K323K546R81j57J31
55529G7671J62p13o76Q26J505J12j402j410j129j746k132j414j032k133l377l233
55513E9879k204j247k07P72O11o33j336j059j220k054j811j37P47k84j345r15
55497D7557k17m33m30P61J763J189j1m54m60o62n35Q2O5r29j569j240j151j850
55479D1476k073j295q76j376j314r8N14n04j552j255o61q15p47K59Q31j3q46k81
55461B9374P11P73L75K39l15j595k254j528p51r13q88J43Q02n2j119q77m6R5m4
$$ plain form
55580 70161 69497 68318 68164 68659 68384 67404 66678 65970 64596 63332 63442 64625 65744 66694 67772 68324 67837
55563 67837 67220 67276 67173 66204 65558 66353 67404 67142 66293 66321 66567 65425 63291 61829 61184 60272 59096 58514
55545 58514 58346 57783 57160 57474 58815 60805 63655 67142 69793 70862 71847 74170 76716 77697 77540 77671
55529 77671 77833 77120 76444 77270 78775 78887 77485 76075 74946 73200 71068 69654 68622 66489 63112 59879
55513 59879 57675 56428 56221 56993 57604 56971 55635 54576 53356 51302 49491 49354 50101 49817 48472 47557
55497 47557 47340 46907 46477 47238 49001 50190 50179 49725 49265 48603 48068 48150 48215 47286 45717 44477 43326 41476
55479 41476 39403 38108 37232 35856 34542 34444 34958 34454 32902 31647 30986 30171 29424 29683 30514 30501 29655 29374
55461 29374 30085 30858 31233 31472 31157 29562 27308 25780 25029 24116 23228 23371 24173 24121 23002 22125 22079 22174 22130
55442B2130L13O36M28M88J188J467R00P32J341J093o70j985j450n42p63r90Q1
55425B4397J256J039K92L35M34m07j125n51K55l1n22M4Q14N26j15p8j23r36j094
55406B4410N38K252K035Q89Q94J662J574R52J034J150l0j602j711p76o09j236
55390C1426j344j018j306j738r68N67J151M41n19j333k105k021m47J193J003m79
55374B2503j156o06k34o27r90r66j019j122q13k72J2K37O25O40J24J70J295K039
55356A9840J122l53o63j74j72l52K25Q49K75p52n95M35P42K86L58J031J229R13
55338B4244R15J011L18p79j169j051j361j673q51N85R92K41k60J4K43R7P5J52
55320B1743j54n26l10P9j44n13o9P33P05m0m42m50p36j014n18L35N61M90J150
$$ plain form
55442 22130 22443 23079 23507 23995 25183 26650 27550 28282 29623 30716 30046 28061 26611 26069 25306 24316 24397
55425 24397 25653 26692 26984 27319 27753 27346 26221 25670 25925 25894 25372 25416 26230 26756 26641 26563 26440 25504 24410
55406 24410 24948 27200 29235 30124 31018 32680 34254 35206 36240 37390 37360 35758 34047 33271 32662 31426
55390 31426 30082 29064 27758 26020 25052 25619 26770 27211 26692 25359 23254 21233 20786 21979 22982 22503
55374 22503 21347 20741 20507 19880 18890 17924 16905 15783 14970 14698 14710 14947 15572 16212 16336 16506 17801 19840
55356 19840 20962 20609 19946 19772 19600 19248 19473 20322 20597 19845 19250 19685 20427 20713 21071 22102 23331 24244
55338 24244 25159 26170 26488 25709 24540 23489 22128 20455 19604 20189 21181 21422 21162 21176 21419 21516 21591 21743
55320 21743 21589 21063 20753 20832 20688 20175 20106 20839 21544 21504 21062 20612 19876 18862 18344 18679 19240 19730 20880
55301B0880K240K559J975J215K62j102j833q07J000J594P85o0n61j376k183j906
55285B2682q38k54j88L08R56O38k41j60P53Q00k61o87L52J518J550P87l6p53j092
55266B5834o89j10l34r17m24J189K224J595k8j570k521k420j070N33J028N76M93
55249B3389J035J205P78P04J240J407P37J3o3K77O87J038R12k5j082j214n50k8
55231C0460J43L32K29o10j356q68K72N15p7m8Q39J261P44L30N70P92P41J036J617
55212C6922J486M90k38p6L43M66M45K31m25r38m12P18J110O30L84O20M65j39j55
55193D1927N52P77k1r13j128r53p05l62l39j086j773j174J97O62J13R2R72J305
55175C8143M22m94o56q10j428j760j471j328j484r37M18J136M94l18k82m1l32
$$ plain form
55301 20880 23120 25679 27654 28869 29131 28029 26196 25389 26389 27983 28768 28708 28147 26771 24588 22682
55285 22682 21844 21590 21402 21710 22666 23304 23063 22903 23656 24456 24195 23508 23860 25378 26928 27715 27679 26926 25834
55266 25834 25145 25035 24701 23784 23360 24549 26773 28368 28340 26770 24249 21829 20759 21292 22320 22896 23389
55249 23389 24424 25629 26407 27111 28351 29758 30495 30508 30445 30722 31409 32447 33359 33334 32252 31038 30488 30460
55231 30460 30603 30935 31164 30554 29198 28330 28602 29117 29040 28992 29831 31092 31836 32166 32736 33528 34269 35305 36922
55212 36922 38408 38898 38660 38584 38927 39393 39838 40069 39644 38706 38294 39012 40122 40752 41136 41756 42221 42082 41927
55193 41927 42479 43256 43235 42322 41194 40241 39536 39174 38835 37749 35976 34802 34999 35661 35774 35866 36838 38143
55175 38143 38565 38071 37415 36605 35177 33417 31946 30618 29134 28197 28615 29751 30245 29927 29645 29604 29272
55158B9272o82o39p55j270j385p65k67l06j06N35M88o52j437p58M31Q78R69J537
55140B5088K111J868J154O76J58p93j481j085nR01J669K653L359L041J895P51
55124D1960Rk93q4M23N57M1n81p86o74m34q0K0n87j358j138P2R45Q50N39M44o2
55103C9783r61r72L87J613J411N75M45Q33R00R13J544K275K129J369J107J618
55087E4969K175K177J512K85r34j184k86O98Q68O87Q96J126O36k29m24K94J210
55070F4476J670J558J016M19K45N40Q02P61O48N06rp86j054n74j11k43n86p15
55052F8563q47j045p69J5K99m99j439j382n58Jm7l66p69j195j383j293j309j536
55034E4441j452q10q7L90Q90J328R74k25j065p08Q7K71J42N66J344J590J149O32
$$ plain form
55158 29272 28590 27951 27196 25926 24541 23776 23509 23203 23097 23632 24120 23468 22031 21273 21704 22582 23551 25088
55140 25088 27199 29067 30221 30897 31055 30262 28781 27696 27691 28592 30261 32914 36273 39314 41209 41960
55124 41960 41969 41676 41592 42015 42572 42613 42032 41246 40572 40138 40058 40078 39491 38133 36995 37067 38012 38862 39401 39845 39783
55103 39783 38822 37850 38237 39850 41261 41836 42281 43114 44014 44927 46471 48746 50875 52244 53351 54969
55087 54969 57144 59321 60833 61118 60184 59000 58714 59412 60280 60967 61863 62989 63625 63396 62972 63266 64476
55070 64476 66146 67704 68720 69139 69384 69924 70726 71487 72135 72641 72632 71846 70792 70218 70107 69864 69278 68563
55052 68563 67716 66671 65902 65917 66216 65717 64278 62896 62338 62339 62292 61926 61157 59962 58579 57286 55977 54441
55034 54441 52989 52179 52092 52482 53372 54700 55674 55449 54384 53676 53763 54034 54176 54742 56086 57676 58825 59457
55016E9457L94L64N25P59O16m7o50o90n05n59n89j11N98P93K17p25j464j592j053
54997E5738k73K55O22J153J515J065J23k11K94O63L44l0J04L71L33J29k18r11
54979F1066j341l92J675L080K894K155J841J437N73L57J632L290L866L713M001
54964H9847M630M779M744N486O854P821Q173Q650R647J0940J2461J4222J5578
54951B03832J5412J3059Q691L184k068n942q674j1362j4072j5491j4968j3553
54939A58048j2305j0949r182p859p601p438o240m450l095k093r11P6L24K75M54
54924H7054L36m42p66M92K535L803M236M762N408N695O243Q036J0553J2344J3102
54909A63391J3428J3063J1195Q218N316K465j330n838r448j1374j2426j3316j3745
$$ plain form
55016 59457 59851 60215 60740 61499 62115 62068 61418 60728 60223 59664 59075 58964 59562 60355 60572 59847 58383 56791 55738
54997 55738 55465 55720 56342 57495 59010 60075 60198 59987 60281 60944 61288 61258 61362 61733 62066 62195 61977 61066
54979 61066 59725 59333 61008 64088 66982 69137 70978 72415 72988 73345 74977 78267 82133 85846 89847
54964 89847 94477 99256 104000 109486 116340 124161 132334 140984 150631 161571 174032 188254 203832
54951 203832 219244 232303 240994 244178 242110 236168 227494 216132 202060 186569 171601 158048
54939 158048 145743 134794 125612 117753 110152 102714 96474 92024 88929 86836 85925 86001 86325 86600 87054
54924 87054 87390 86948 86182 86674 89209 93012 97248 102010 107418 113113 119356 127392 137945 150289 163391
54909 163391 176819 189882 201077 209295 214611 217076 215746 209908 200460 189086 176660 163344 149599
54896A49599j3346j2234j0419p889n407m065l892l929l651l206k491j204J64O92
54882G8722L62j03n44j280j885j523n35k50j029j786j706j165p40m36k69n24j070
54865F4239j265q44j93K66L14k92j412k089j568n36l03r37j360j133q57q21o06
54848E0603j16J28J7K2K50L05K30M44P09K94o86j237r59m84k72m3L63O41Q36J398
54828E2443K183K411J896J380J352J468J372J147Q11K88L1O41J690K004J412J158
54812G3687K138L785N076N717N888N685N409N648O558P713Q892J0364J2094J3483
54798A72137J4184J4396J4013J2339R081M947Q21l003o375q789r870r947r691
54785A94243r488r412r346r012q170o981n750m470l012j718j116j098r84m86N8
$$ plain form
54896 149599 136253 124019 113600 105711 100304 96239 92347 88418 84767 81561 79070 77866 78030 78722
54882 78722 79084 78981 78437 77157 75272 73749 73214 72964 71935 70149 68443 67278 66538 66102 65833 65309 64239
54865 64239 62974 62130 61937 62203 62517 62225 60813 58724 57156 56620 56317 55380 54020 52887 52030 51209 50603
54848 50603 50487 50615 50632 50654 50904 51209 51439 51883 52592 52886 52200 50963 50004 49520 49248 49205 49568 50209 51045 52443
54828 52443 54626 57037 58933 60313 61665 63133 64505 65652 66463 66751 66782 67423 69113 71117 72529 73687
54812 73687 75825 79610 84686 90403 96291 101976 107385 113033 119591 127304 136196 146560 158654 172137
54798 172137 186321 200717 214730 227069 236150 241097 241918 238915 232540 223751 213881 203934 194243
54785 194243 184755 175343 165997 156985 148815 141834 136084 131614 128602 126884 125768 124670 123686 123200 123258
54770A23258L80N86P58R44J567L100N204O865P603P973Q790J0366J2542J4910
54756B04846J6888J8033J8343J7983J6889J4973J2381R108M899J01m009o644q612
54743C15179j1036j3533j4918j5212j5446j5781j5341j4012j2816j2197j1351
54732A63536r704p835o436n390m486m003m068m203l980l486k810j769n13K80J93
54717A05326m58j079j274r06k75j21p40j346j059k42J07m8M3M01L92J86O76J696
54699A01279J935R31k02n59n87q70j037p00l23l61m07M2P00J058J140J155J088
54682A04282J057J363J808J711J054P67J363K122K190J800J774K437L405M113
54668A31246M169L676L409M167N755P186P844P816P210O103N122N005N412N195
$$ plain form
54770 123258 123638 124224 124982 125926 127493 130593 135797 142662 150265 158238 167028 177394 189936 204846
54756 204846 221734 239767 258110 276093 292982 307955 320336 329444 334343 334444 330435 323791 315179
54743 315179 304143 290610 275692 260480 245034 229253 213912 199900 187084 174887 163536
54732 163536 153832 145997 139561 134171 129685 125682 121614 117411 113431 109945 107135 105366 104853 105133 105326
54717 105326 104868 103789 102515 101609 101334 101213 100473 99127 98068 97826 97933 97885 97928 98329 98721 98907 99583 101279
54699 101279 103214 104145 103943 103384 102797 101927 100890 100190 99867 99506 99099 99141 99841 100899 102039 103194 104282
54682 104282 105339 106702 108510 110221 111275 112042 113405 115527 117717 119517 121291 123728 127133 131246
54668 131246 135415 139091 142500 146667 152422 159608 167452 175268 182478 188581 193703 198708 204120 209315
54654B09315M028K802K222K131K421L403M920O143O709P161P979R131J0745J3108
54640B92218J5702J7325J7439J6318J3831R472L735j995p234j2526j7461k0419
54628C26405k0992k0748k0706j9867j7367j4400j2451j1149r376p365o045n311
54616A60628m429l429k657j750l53Q47J165J207J878K789L010K717K634K491J509
54601A68257m3j163j696k232k780k881k798l288m306n095n382n443n196m386l554
54586A18014l505l957l877l102k513k531k572k229j929k038k171j756q73j81l10
54571H4470j229k081j855o50K36q6q98r98l65J10J96M10Q19P98J75m07l81J20
54553G8384P14J188J406J334J254J479J889K090K016J933J967K106K456L117L878
$$ plain form
54654 209315 213343 216145 218367 220498 222919 226322 231242 237385 244094 251255 259234 268365 279110 292218
54640 292218 307920 325245 342684 359002 372833 382305 386040 384045 376811 364285 346824 326405
54628 326405 305413 284665 263959 244092 226725 212325 199874 188725 179349 171984 165939 160628
54616 160628 156199 152770 150113 148363 148010 148857 150022 151229 153107 155896 158906 161623 164257 166748 168257
54601 168257 168214 167051 165355 163123 160343 157462 154664 151376 147070 141975 136593 131150 125954 121568 118014
54586 118014 114509 110552 106675 103573 101060 98529 95957 93728 91799 89761 87590 85834 84961 84780 84470
54571 84470 83241 81160 79305 78655 78891 78805 77907 76909 76544 76654 76850 77260 78079 78877 79052 78645 78264 78384
54553 78384 79098 80286 81692 83026 84280 85759 87648 89738 91754 93687 95654 97760 100216 103333 107211
54538A07211M470M871N128N174N253O019P677R338R868R108P715O155M434K540
54524A94961M99j798m227o224p467q444r659j0599j0245q497o344m788m105m069
54510A08994m250m188l739l232k916k556j934j328j038q69o06n36q85j131o78
54495G9108J84O27L64k68q75j041k57J353K610K455J280K74j52l61l20L74J412
54478H6767J848J477J085J183J389J325J193J142Q25Q0n89o61l26j67m28q84j206
54461I4053j255j168j202j382j438j280j342k022k940l243k643j618o91M0N68
54446G2437P32N19K59K37K94L4o00j105q88kQ08R21N19J33k23q16j356j170l11
54427G0422L60M35M45Q10J203J360J560J772J277n6j034o57M02Q67P33R92J857
$$ plain form
54538 107211 111681 116552 121680 126854 132107 138126 145803 155141 165009 174117 181832 187987 192421 194961
54524 194961 195460 193662 189435 183211 175744 167300 157641 147042 136797 128300 121956 117168 113063 108994
54510 108994 104744 100556 96817 93585 90669 88113 86179 84851 83813 82944 82338 81802 80917 79786 79108
54495 79108 79292 79919 80283 80015 79140 78099 77842 79195 81805 84260 85540 85814 85662 85301 84981 85355 86767
54478 86767 88615 90092 91177 92360 93749 95074 96267 97409 98234 98314 97725 97064 96738 96571 96143 95259 94053
54461 94053 92798 91630 90428 89046 87608 86328 84986 82964 80024 76781 74138 72520 71829 71869 72437
54446 72437 73169 73688 73947 74184 74478 74512 73912 72807 71919 71917 72725 73646 74165 74298 74075 73259 71903 70733 70422
54427 70422 70782 71217 71662 72472 73675 75035 76595 78367 79644 79588 78554 77897 78299 79166 79899 80891 82748
54410H2748K556K624K414K327K422K745L267L558L216K552K286K726L712N031
54396A24184O199O402N420M273M088M643M876M457L849L148K004O41k00m85j068
54381A72431k410l880m699m859m880n095n417n487m948l911l030k803k968k922
54367A15122k528k086j786j614j562j515j253q80q59j190j175m60L07M54K68L38
54351I9581N44O22R83K042L289L982M298M726M973M501L735L533L908M315M756
54336A49788N367N462M389K922K351K478K002O67n78j452k706m488n922o554o814
54321A46912o838o270n460n358n835n641m429l369l261l431l159k794k750k676
54307H5641k405k513l124l254k256r04k34k16l65p30j347j581r83j72Rl76p52
$$ plain form
54410 82748 85304 87928 90342 92669 95091 97836 101103 104661 107877 110429 112715 115441 119153 124184
54396 124184 130383 136785 142205 146478 150566 155209 160085 164542 168391 171539 173543 174184 173984 173499 172431
54381 172431 170021 166141 161442 156583 151703 146608 141191 135704 130756 126845 123815 121012 118044 115122
54367 115122 112594 110508 108722 107108 105546 104031 102778 101898 101039 99849 98674 98214 98521 98975 99243 99581
54351 99581 100125 100747 101730 103772 107061 111043 115341 120067 125040 129541 133276 136809 140717 145032 149788
54336 149788 155155 160617 165006 167928 170279 172757 174759 175426 174848 173396 170690 166202 160280 153726 146912
54321 146912 140074 133804 128344 122986 117151 111510 107081 103712 100451 97020 93861 91067 88317 85641
54307 85641 83236 80723 77599 74345 72089 71185 70951 70735 70370 69640 68293 66712 65729 65557 65566 65190 64438
54290F4438r85j182j116o24q8J41K91O16P94N27J28p3l07p33q12j23P34Q69L39
54271F2834j01j18K6K21O14J047J113P90N27N81O42K45o25j423j475o60M25J072
54253F5735J158J018Q06N00L22N49R27Q72L68l6j05j70m05n42m83m82m99j37N50
54234F9946Q73M80j34l86k94j38pj6l26p25p33l92k85n94q16p09p26j096j270
54215F2652p76jM30N15O08P05N32K1o06r80p07K15J072J083M04j04j52k62o59
54196F3990r04q43r40j249r98J99J526J915J220L6r70j161k41J079J512Q05J10
54179F5086K93Q16Q49N71M96M48P7k80k15r0l72o55l32K58K53m29j079j217r54
54160F3524n25j39m3k25l09j80j92m01k56L78O33r7r85p94L89J445J825J878J799
$$ plain form
54290 64438 63453 62271 61155 60531 60443 60584 60875 61491 62285 62812 62940 62867 62560 61827 61015 60892 61626 62495 62834
54271 62834 62733 62615 62641 62862 63476 64523 65636 66426 66953 67534 68176 68421 67796 66373 64898 64238 64663 65735
54253 65735 66893 67911 68717 69217 69539 70088 71015 71887 72255 72219 72114 71944 71539 70997 70514 70032 69533 69396 69946
54234 69946 70819 71299 71165 70779 70485 70347 70340 70324 69998 69273 68540 68148 67863 67269 66453 65744 65018 63922 62652
54215 62652 61876 61875 62305 62820 63428 64133 64665 64686 64080 63100 62393 62608 63680 64763 65167 65063 64911 64649 63990
54196 63990 63086 62243 61303 60054 59056 59255 60781 62696 63916 63952 62982 61821 61580 62659 64171 64976 65086
54179 65086 65379 66195 67044 67615 68111 68559 68636 68356 68141 68051 67679 67024 66692 66950 67203 66774 65695 64478 63524
54160 63524 62999 62860 62817 62592 62283 62103 61911 61510 61254 61632 62265 62168 61183 60389 60778 62223 64048 65926 67725
54141F7725J328M43m29r77j168r65m26N3J83K86P53J276J190M45m42j125j527
54124F6623j403o24K51M04k37r71j284j268j142r63q08p10m27K54J015J263Q96
54107F0869L84P9p4j69j00J49L31J86k06n11m81k84l52p94j118q61l11j16l19
54088E6302m34l98o01r20o20M14J281J284P47J69m79j067r10J17R08N12n35j086
54070E4684r52o51k68L65R14J037J167J714K033J343L15K72J114J427P31Q6K91
54053F5622P92R50J105J665K088J626N42j88p1N74J230J641J785J729J559J361
54037H4010J283J566K250K929L159L025L018L343L740M002M342N020N926O660
54023A34273O917O689O180N553M870M268M002M056L882K969J695J030J281J708
$$ plain form
54141 67725 69053 69496 69067 68090 66922 65957 65531 65584 65767 66053 66806 68082 69272 69717 69275 68150 66623
54124 66623 65220 64596 64847 65251 65014 64043 62759 61491 60349 59386 58578 57868 57441 57695 58710 59973 60869
54107 60869 61253 61332 61258 61089 60989 61138 61469 61655 61449 60938 60457 60173 59821 59027 57909 57048 56737 56621 56302
54088 56302 55868 55470 54869 53949 53329 53743 55024 56308 57055 57224 56745 55678 54768 54885 55793 56305 55770 54684
54070 54684 53732 53081 52813 53178 54092 55129 56296 58010 60043 61386 61701 61973 63087 64514 65245 65331 65622
54053 65622 66414 67364 68469 70134 72222 73848 74390 74202 74131 74705 75935 77576 79361 81090 82649 84010
54037 84010 85293 86859 89109 92038 95197 98222 101240 104583 108323 112325 116667 121687 127613 134273
54023 134273 141190 147879 154059 159612 164482 168750 172752 176808 180690 183659 185354 186384 187665 189373
54009A89373J632J295J131Q58j50j825l352l998l703l003k620k878l357l372k885
53994A63146k444k222j859j328j103j151p71Q6L25o44j791j860j148p75r04q46
53978A44711m75l72p52j302j880k492k792k490k029j962j933j230j42K56l98j426
53962A23292k190k625k609j809l52R88J513J125K42m04j44Q71J654J647J507J991
53946A24697K628K509J931K013K976M012M718N463O269O619O513O577O832O469
53932A90226N175L697K667J759N30p45j564j914k050j966j564r03j29N87J004
53917A94810J089J296K064L180M121M825N462N736N262M528M491N246N996O386
53903B54492O854P475P522O607N329M332L431K246J033K98ml77j120k093k956
$$ plain form
54009 189373 191005 192300 193431 194289 194139 192314 188962 184964 181261 178258 175638 172760 169403 166031 163146
53994 163146 160702 158480 156621 155293 154190 153039 152268 152354 152679 152035 150244 148384 147236 146461 145557 144711
53978 144711 144236 143864 143112 141810 139930 137438 134646 132156 130127 128165 126232 125002 124860 125116 124718 123292
53962 123292 121102 118477 115868 114059 113707 114695 116208 117333 117575 117171 117027 117898 119552 121199 122706 124697
53946 124697 127325 129834 131765 133778 136754 140766 145484 150947 157216 163835 170348 176925 183757 190226
53932 190226 195401 199098 201765 203524 204054 203309 201745 199831 197781 195815 194251 193348 193219 193806 194810
53917 194810 195899 197195 199259 202439 206560 211385 216847 222583 227845 232373 236864 242110 248106 254492
53903 254492 261346 268821 276343 282950 288279 292611 296042 298288 299321 299619 299615 299238 298118 296025 293069
53888B93069l451l576l606l805m226m867n719o451o532o067n961o626p208o834
53874B18140o043n873o052n535m510m340n371o172n514l909k708k544l126l797
53860A52646l934l392k835k981l486l361k518j962k304l029l414l296k721j791
53846A11622j042j041j439j305n86j86m84q93j119j576k224k270j548r57r17o12
53830I3423M62J428J306M53k40n42n01J81J333J804Q75n11r82o00l88n78n09R
53812I6423M83O87R78J503J945K035J793J308P24L48L98P70J328K120L027L636
53796A19506L802L966M520N226N633N622N260M597L890L569L596L455L004K737
53782A78383K820K689K020J344J117R60M99J86M24O08k6j162j941k302k758l313
$$ plain form
53888 293069 289618 286042 282436 278631 274405 269538 263819 257368 250836 244769 238808 232182 224974 218140
53874 218140 212097 206224 200172 194637 190127 185787 180416 174244 168730 164821 162113 159569 156443 152646
53860 152646 148712 145320 142485 139504 136018 132657 130139 128177 125873 122844 119430 116134 113413 111622
53846 111622 110580 109539 108100 106795 106209 106023 105539 104646 103527 101951 99727 97457 95909 94952 94035 93423
53830 93423 93885 95313 96619 97072 96832 96290 95789 95970 97303 99107 99982 99471 98489 97889 97501 96923 96414 96423
53812 96423 96906 97593 98571 100074 102019 104054 105847 107155 107879 108227 108625 109395 110723 112843 115870 119506
53796 119506 123308 127274 131794 137020 142653 148275 153535 158132 162022 165591 169187 172642 175646 178383
53782 178383 181203 183892 185912 187256 188373 189333 189832 190018 190442 191050 191024 189862 187921 185619 182861 179548
53766A79548l569l698m224m944n027m277l401k930k590j949j151p10r57j731k422
53751A35968k356j488n93m42r72j491j518j051l26K98M09r4q24j438k032k714
53735A19336l107k757j817q28k8O78J182J138M90l13p11n23n3K12J17Q2N64J402
53717A15064K050K411K868L409L408K593J582J084J068J084R44O72K41k54n43
53702A37681n88o66p71n42K7L75K92L79J112K065K516K285J595O43j54j49P32
53685A46832J671J984J936K037K202K092J814J589J288Q30N51O25O56L79J44J84
53669A66814J18k26k36M57J114R65M04K44L88K91J27M11Q84Q75N09M66Q00R83
53651A75388Q85P27L02p18j890k415k336k301k277j611l86L73Q3p02j168j065
$$ plain form
53766 179548 175979 172281 168057 163113 158086 153809 150408 147478 144888 142939 141788 141078 140121 138390 135968
53751 135968 133612 132124 131531 131089 130117 128626 127108 126057 125731 126029 126438 126344 125520 124082 122050 119336
53735 119336 116229 113472 111655 110827 110799 111477 112659 113797 114287 113974 113263 112740 112687 112899 113016 113098 113662 115064
53717 115064 117114 119525 122393 125802 129210 131803 133385 134469 135537 136621 137565 138237 138478 138224 137681
53702 137681 137093 136427 135656 135114 135141 135516 135808 136187 137299 139364 141880 144165 145760 146403 146249 146100 146832
53685 146832 148503 150487 152423 154460 156662 158754 160568 162157 163445 164275 164826 165451 166107 166486 166630 166814
53669 166814 166932 166706 166470 166927 168041 169006 169410 169654 170042 170333 170460 170871 171755 172630 173139 173605 174405 175388
53651 175388 176273 177000 177302 176584 174694 172279 169943 167642 165365 163754 163368 163741 163824 163122 161954 160889
53635A60889n31J97O50L84m04j055j298j464j775j900j343RJ675K752K628J775
53619A61189J332J610J667R60M57J230K627L114K494J963K208K713K935K934K779
53604A92212K384K107K544L545M257M238L792L219K648K555L344M366M411L378
53590B39000K553K891L940M687M669L958K837J833J399J342J123Q48J120J882
53576B74082K197J532M56k07k19K71J040J642J567Q93K55O5K42P38J547K227K166
53559B90494J511J050J119J307J355J493J738J751J594J776K284K426J930J427
53545C13255J500K010K643L324L852L909L753M083M889N268M735L822L103K529
53531C62675K106K279L092L796L911L821L879L818L592L819M716N441N339M973
$$ plain form
53635 160889 160358 160555 161205 161589 161185 160130 158832 157368 155593 153693 152350 152359 154034 156786 159414 161189
53619 161189 162521 164131 165798 166758 167215 168445 171072 174186 176680 178643 180851 183564 186499 189433 192212
53604 192212 194596 196703 199247 202792 207049 211287 215079 218298 220946 223501 226845 231211 235622 239000
53590 239000 241553 244444 248384 253071 257740 261698 264535 266368 267767 269109 270232 271080 272200 274082
53576 274082 276279 277811 278267 278060 277841 278112 279152 280794 282361 283254 283509 283574 283816 284554 286101 288328 290494
53559 290494 292005 293055 294174 295481 296836 298329 300067 301818 303412 305188 307472 309898 311828 313255
53545 313255 314755 316765 319408 322732 326584 330493 334246 338329 343218 348486 353221 357043 360146 362675
53531 362675 364781 367060 370152 373948 377859 381680 385559 389377 392969 396788 401504 406945 412284 417257
53517D17257N142N664O077O704P944R157R536R501J0033J0969J1275J0923J1138
53504E31320J2515J4045J4501J4033J3793J4516J5904J7201J7991J8441J8960
53493G03220J9596K0026K0133K0272K0680K0998K0763K0186J9920K0152K0407
53482I26353K0224J9629J8946J8427J8042J7516J6599J5535J4976J5212J5704
53471A117163J5680J5079J4441J4048J3631J2943J2182J1726J1624J1509J0893
53460A260919R499P523N552M104L155K172O65j353l407n037o195p200q368r775
53446A252254j1295j2654j3480j3616j3499j3872j4946j6209j7249j8271j9376
53435A087787j9935j9445j8572j8415j8905j8922j8037j7182j7236j7811j7871
$$ plain form
53517 417257 422399 428063 434140 440844 448788 457945 467481 476982 487015 497984 509259 520182 531320
53504 531320 543835 557880 572381 586414 600207 614723 630627 647828 665819 684260 703220
53493 703220 722816 742842 762975 783247 803927 824925 845688 865874 885794 905946 926353
53482 926353 946577 966206 985152 1003579 1021621 1039137 1055736 1071271 1086247 1101459 1117163
53471 1117163 1132843 1147922 1162363 1176411 1190042 1202985 1215167 1226893 1238517 1250026 1260919
53460 1260919 1270418 1277941 1283493 1287597 1290752 1292924 1293589 1292236 1288829 1283792 1277597 1270397 1262029 1252254
53446 1252254 1240959 1228305 1214825 1201209 1187710 1173838 1158892 1142683 1125434 1107163 1087787
53435 1087787 1067852 1048407 1029835 1011420 992515 973593 955556 938374 921138 903327 885456
53424H85456j6945j5306j3381j1452r611p756n872m340l559l277k844k109j439
53411G87565q09K25J520K234K132K120K944M232N417O832Q980J1298J2667J2911
53397H60268J2936J3563J4907J6793J8972K0946K2271K3163K4290K5876K7467
53386A081452K8692K9794L1171L2717L3941L4637L5118L5779L6599L7267L7712
53375A454879L8240L8988L9546L9407L8617L7634L6781L6122L5700L5361L4492
53364A865767L2510K9577K6354K3182J9987J6828J3883J1005P988N057K371p55
53352B053754n068r985j4118j7279k0637k4593k7951k9816l1003l2544l4088l4807
53340A771865l4968l5283l5559l5274l4887l5218l5838l5425l3644l1492k9754
$$ plain form
53424 885456 868511 853205 839824 828372 818761 811005 805133 800793 797234 793957 791113 789004 787565
53411 787565 786756 786981 788501 790735 792867 794987 797931 802163 807580 814412 823392 834690 847357 860268
53397 860268 873204 886767 901674 918467 937439 958385 980656 1003819 1028109 1053985 1081452
53386 1081452 1110144 1139938 1171109 1203826 1237767 1272404 1307522 1343301 1379900 1417167 1454879
53375 1454879 1493119 1532107 1571653 1611060 1649677 1687311 1724092 1760214 1795914 1831275 1865767
53364 1865767 1898277 1927854 1954208 1977390 1997377 2014205 2028088 2039093 2047081 2052138 2054509 2053754
53352 2053754 2048686 2038701 2024583 2007304 1986667 1962074 1934123 1904307 1873304 1840760 1806672 1771865
53340 1771865 1736897 1701614 1666055 1630781 1595894 1560676 1524838 1489413 1455769 1424277 1394523
53329A394523k8329k7174k6792k7264k7630k6846k4974k3022k1827k1301k0627
53318A118737j9112j6874j4706j3110j1750j0048q008o142m912m547n113o346
53306I98069p533q065p941p549p153o820o539o081n054l412j641j99R06J774K384
53291I35146K964M003N479O650P156P693Q976J0634J1878J2750J3915J5533J7150
53278A059927J8478J9481K0051K0277K0745K1708K2318K1571J9780J8181J7244
53267A279761J6379J5251J4296J3640J2601J0654Q172N794L677J748J34j093k263
53254A378751l716n323o658p590q529j0066j2348j4795j6598j7584j8230j8737
53242A238577j8674j7916j7305j7756j8990j9882j9819j8995j7672j5975j4334
$$ plain form
53329 1394523 1366194 1339020 1312228 1284964 1257334 1230488 1205514 1182492 1160665 1139364 1118737
53318 1118737 1099625 1082751 1068045 1054935 1043185 1033137 1025129 1018987 1014075 1009528 1004415 998069
53306 998069 990536 982471 974530 966981 959828 953008 946469 940388 935334 931922 930281 930082 930988 932762 935146
53291 935146 938110 942113 947592 954242 961398 969091 978067 988701 1000579 1013329 1027244 1042777 1059927
53278 1059927 1078405 1097886 1117937 1138214 1158959 1180667 1202985 1224556 1244336 1262517 1279761
53267 1279761 1296140 1311391 1325687 1339327 1351928 1362582 1370754 1376548 1380225 1381973 1382107 1381014 1378751
53254 1378751 1375035 1369712 1363054 1355464 1346935 1336869 1324521 1309726 1293128 1275544 1257314 1238577
53242 1238577 1219903 1201987 1184682 1166926 1147936 1128054 1108235 1089240 1071568 1055593 1041259
53231A041259j3302j2897j2686j2494j2434j2288j1654j0719j0186j0301j0515
53220I11783j0190r160p620o095n376n808o543o263m774l193k455k389k427k491
53206H36999k813l434m282n345o560p857r381j1175j2675j3121j2554j1808j1389
53193G24605j1055j0621j0352j0264r813q856q201q677j0038j1381j2194j2519
53181F00634j2473j2246j2270j2850j3687j4224j4295j4065j3472j2318j0869
53170D57865r853r670r892r750r026q251q072q497q871q564p614o601o079o187
53156C40938o648o950o586n427l880k547j770j580j815k107j950j168j63O41J348
53141C00336K226K982K997K257J419Q85L38n40j443j878j976k421l627n194o265
$$ plain form
53231 1041259 1027957 1015060 1002374 989880 977446 965158 953504 942785 932599 922298 911783
53220 911783 901593 892433 884813 878718 873342 867534 860991 854728 849954 846761 844306 841917 839490 836999
53206 836999 834186 830752 826470 821125 814565 806708 797327 786152 773477 760356 747802 735994 724605
53193 724605 713550 702929 692577 682313 672500 663644 655443 646766 636728 625347 613153 600634
53181 600634 588161 575915 563645 550795 537108 522884 508589 494524 481052 468734 457865
53170 457865 448012 438342 428450 418700 409674 401423 393351 384854 375983 367419 359805 353204 347125 340938
53156 340938 334290 327340 320754 315327 311447 308900 307130 305550 303735 301628 299678 298510 298347 298988 300336
53141 300336 302562 305544 308541 310798 312217 313102 313440 312900 311457 309579 307603 305182 301555 296361 290096
53126B90096o289n540m819m735n227n781n948n627n117m934n245n458m853l724
53112B16799l297m110n109m956l758k716k465k585k605k627k792k945k979l001
53098A70854l008k789k303j779j427j355j607j983k008j454p23l16k37l19o87
53083A48859j342j714j383q44p91j039j012q93j195j575j337q21r02j259p21N42
53067A32573R00k60j531j655j144q39l71P56J718J426K84m55m79l94m01k25m2
53050A29861l38r30j185j079j173j622j987k010j820j449q04q8L79O90J039J093
53034A18577L88p46j363j124o16l99l42j09K94O73R55J068R09N43K02j8j84k51
53016A18457p1K44L66K80M59J278K406L053K762J907J309J386J747J758J405J321
$$ plain form
53126 290096 283807 278267 273448 268713 263486 257705 251757 246130 241013 236079 230834 225376 220523 216799
53112 216799 213502 209392 204283 199327 195569 192853 190388 187803 185198 182571 179779 176834 173855 170854
53098 170854 167846 165057 162754 160975 159548 158193 156586 154603 152595 151141 150418 150102 149865 149546 148859
53083 148859 147517 145803 144420 143576 142785 141746 140734 139841 138646 137071 135734 134913 134011 132752 132031 132573
53067 132573 133473 133213 131682 130027 128883 128044 127673 128429 130147 131573 131857 131402 130923 130529 130128 129903 129861
53050 129861 129523 128593 127408 126329 125156 123534 121547 119537 117717 116268 115464 115376 115755 116445 117484 118577
53034 118577 118965 118219 116856 115732 115116 114717 114375 114266 114560 115233 116188 117256 118165 118708 118910 118892 118708 118457
53016 118457 118386 118630 118996 119276 119735 121013 123419 126472 129234 131141 132450 133836 135583 137341 138746 140067
53000A40067J968L107M190M971N452N613N458N187N023M972M943M871M546L579
52986B03947J840k42k003l090l514l467l300l384l717l922l923m201n021n671
52972A60332n162l558k085j753k337k870k793k392k241k461k583k099j117k91
52958A26590n1j73j77J8J33O2L9K00K65j49r56j475j117j18N78L59l88q37p53
52939A22050n26l67J9Q02J570J775J373Q30O54R69J357J172K48o80p17J01Q52
52922A31482Q87M60J03%J03L69N87M60J37J56O28R78P76L03l0k66m79l04N05J502
52902A38357K075K255K434K566K252J460O20J35J53P25J684K516K683K192J490
52887A63597R99Q93J167J665K146K532K888L099K874K276J862K033K612L300M106
$$ plain form
53000 140067 142035 145142 149332 154303 159755 165368 170826 176013 181036 186008 190951 195822 200368 203947
52986 203947 205787 205545 203542 200452 196938 193471 190171 186787 183070 179148 175225 171024 166003 160332
52972 160332 155170 151612 149527 147774 145437 142567 139774 137382 135141 132680 130097 127998 126881 126590
52958 126590 126539 126366 126189 126207 126340 126402 126441 126641 126906 126757 125801 124326 123209 123091 123669 124028 123640 122803 122050
52939 122050 121524 121157 121176 121978 123548 125323 126696 127526 128180 129149 130506 131678 131926 131246 130529 130630 131482
52922 131482 132369 132829 132932 132932 133035 133404 133991 134451 134588 134744 135372 136350 137126 137429 137399 137133 136654 136350 136855 138357
52902 138357 140432 142687 145121 147687 149939 151399 152019 152154 152307 153032 154716 157232 159915 162107 163597
52887 163597 164596 165489 166656 168321 170467 172999 175887 178986 181860 184136 185998 188031 190643 193943 198049
52872A98049M989N555N536N254N134N119M922M502L884K897J538K43o50j420k408
52857B43144l305l541l093k403j836j583j823k391k701k521k362k548k463j553
52843B09021n50o04j522j984j438o54k95j65j46p53k126l293l213k054q70l48
52827A89006m13p08r62r99q76q76j117j303j073n16j05j75o96j419k016k116j492
52810A72144m11L30K2j161k199k265j578r47o58l85q3j77o29o43J71R41N96o76
52792A62392j687j748j198o52m13n64r63j106o16J61M60K1p65j518k109k306j880
52775A45509j139q20j207j743j758j249p50o67q37p01Q8J105J486R40J54j48q6
52758A38177k27n99q22q68j056j382j534j497j562j761j777j464r86n72m48p83
$$ plain form
52872 198049 203038 208593 214129 219383 224517 229636 234558 239060 242944 245841 247379 247622 246972 245552 243144
52857 243144 239839 236298 233205 230802 228966 227383 225560 223169 220468 217947 215585 213037 210574 209021
52843 209021 208471 207867 206345 204361 202923 202269 201974 201809 201663 200910 198784 195491 192278 190224 189354 189006
52827 189006 188593 187885 186923 185924 185048 184172 183055 181752 180679 180163 180058 179883 179187 177768 175752 173636 172144
52810 172144 171733 172063 172085 170924 168725 166460 164882 163935 163277 162892 162809 162632 162003 161360 161531 162472 163068 162392
52792 162392 160705 158957 157759 157107 156694 156130 155167 154061 153445 153606 154066 154087 153322 151804 149695 147389 145509
52775 145509 144370 143550 142343 140600 138842 137593 136843 136176 135339 134638 134726 135831 137317 138257 138411 138263 138177
52758 138177 137950 137351 136529 135661 134605 133223 131689 130192 128630 126869 125092 123628 122642 122070 121622 120839
52742A20839j239r67K41J224P27q18j713j115K15J253J761J943K007K284K980
52727A29622L580L450L074L659N168N981N032L222J952J277M30o39j370j825k595
52712A60018l613m004l282k054j313j484k247l040l555l874m156m257l915l268
52698A15956k805k713k710k575k451k402k198j795j601j829k040j755j130o61
52684H7291m78l44j66q7k23n58j011j376j426j176q99p31n61l89m30p27j007j066
52666G4636r25n00L42J270J548R80K29j27k92o10q44o75m41o23r46p29L9O65P32
52647G3729M29j9o47j293j485r95k68N1j72m64l22K37P48Q99R31J219J604J507
52629G5689P92Ol64m86p40j090j239j115q02k66M69J039J009L55m97r96p54J77
$$ plain form
52742 120839 119600 118633 118874 120098 120825 120007 118294 117179 117394 118647 120408 122351 124358 126642 129622
52727 129622 133202 136652 139726 143385 148553 154534 159566 162788 164740 166017 166447 165808 164438 162613 160018
52712 160018 156405 152401 149119 147065 145752 144268 142021 138981 135426 131552 127396 123139 119224 115956
52698 115956 113151 110438 107728 105153 102702 100300 98102 96307 94706 92877 90837 89082 87952 87291
52684 87291 86813 86469 86303 86216 85993 85435 84424 83048 81622 80446 79547 78816 78255 77866 77436 76709 75702 74636
52666 74636 73711 73211 73553 74823 76371 77351 77580 77453 77161 76551 75707 75032 74591 73968 73022 72293 72332 72997 73729
52647 73729 74158 74139 73492 72199 70714 69719 69451 69502 69330 68866 68544 68781 69529 70428 71359 72578 74182 75689
52629 75689 76481 76487 76123 75637 74897 73807 72568 71453 70651 70385 70854 71893 72902 73257 72760 71764 71010 71187
52611G1187J132J339Q13L54M29N48J47m40m98qM65O67P60P45N14L36N80R21O48
52592H0639j42m28L79J532J911J369O76M73P64J255J687J846J586R56J46o75j327
52575I2647j470p99M87J640K048J849J601J447J054L71m2J94O32P20P67J475K637
52558A07258L186K653J736J168Q18L46L5L13R95J628K140K528K360J395L64J88
52542A29111O06M98m08j126r17l15j42k79m5O17J152J314J422J637J590R95K08
52525A35918j36K1J34j50m85l32K15N10K05k92l73L8N01O43M56J48n2L9M30Q60
52505A38298R41M91k57q11q55n89n50q98j095n47N14J166R62M71M75R62J271J051
52487A41000O36N31P98R93O75j9m11QR46J628J710J500J311J050O19K60K68O88
$$ plain form
52611 71187 72319 73658 74471 74825 75254 75802 75949 75509 75011 75003 75468 76135 76895 77640 78154 78490 79070 79991 80639
52592 80639 80497 80069 80448 81980 83891 85260 85936 86409 87173 88428 90115 91961 93547 94503 94649 93974 92647
52575 92647 91177 90378 90865 92505 94553 96402 98003 99450 100504 100875 100833 101027 101659 102379 103146 104621 107258
52558 107258 110444 113097 114833 116001 116819 117165 117200 117513 118508 120136 122276 124804 127164 128559 128923 129111
52542 129111 129717 130215 129807 128681 127764 127449 127307 127028 126983 127600 128752 130066 131488 133125 134715 135710 135918
52525 135918 135782 135803 135937 135787 135302 134970 135185 135695 135900 135608 135235 135273 135774 136417 136873 137021 136969 137008 137438 138298
52505 138298 139239 139730 139473 138662 137807 137218 136668 135770 134675 134128 134642 135808 136770 137241 137716 138678 139949 141000
52487 141000 141636 142167 142965 143958 144633 144614 144203 144211 145157 146785 148495 149995 151306 152356 152975 153235 153503 154191
52469A54191J450K400L065K896K003J204J022J125J105J205J725K219K064J503
52455A79177J378J960K703L124L231L127K787K344K094K017J744J118M28k5k72
52440B06935m94p91j202j757k340k718k669k089j084j02K76m4m82n15m01p57j586
52423A88180k189k031j294n61k51l86o18n51j85O9j5m7M23J190J634J515J075
52406A85958N36k4m22n32n83q18r36m86K57M66p7o13m36K04N83M09Lk12j02J37
52386A83312K19J15J69O27J162J248R06P05R93J519J875J887J519Q37K15J16M63
52369A97887O27K30k75j21Q69K018K382J631M67K6O67J537J693J364J504K317
52353B14823K979K880K363J990J792J564J416J533J765J843J719J459J119Q58
$$ plain form
52469 154191 155641 158041 161106 164002 166005 167209 168231 169356 170461 171666 173391 175610 177674 179177
52455 179177 180555 182515 185218 188342 191573 194700 197487 199831 201925 203942 205686 206804 207232 207207 206935
52440 206935 206441 205650 204448 202691 200351 197633 194964 192875 191791 191689 191965 191921 191439 190924 190523 189766 188180
52423 188180 185991 183960 182666 182105 181854 181468 180850 180299 180114 180183 180168 180121 180544 181734 183368 184883 185958
52406 185958 186494 186470 186048 185516 184933 184115 183179 182693 182950 183416 183339 182726 182290 182494 183077 183486 183489 183277 183175 183312
52386 183312 183531 183646 183815 184442 185604 186852 187758 188463 189456 190975 192850 194737 196256 197093 197308 197424 197887
52369 197887 198514 198744 198469 198348 199217 201235 203617 205248 205715 205741 206408 207945 209638 211002 212506 214823
52353 214823 217802 220682 223045 225035 226827 228391 229807 231340 233105 234948 236667 238126 239245 240103
52339B40103Q61R97R61R17J415K448L148K828J827R41M93M24P31J230J304O55
52323B61283kK83J390K290K435K285K342K403K077J532J355J841K706L412L622
52308B91254L472L396L667M167M705N381O304P156P396O998O619O870P624Q256
52294C73265Q369Q202Q344R137J0316J1284J1719J1866J2099J2474J2807J3051
52282E02933J3206J3002J2157J1052J0671J1550J3046J4026J4110J3890J3933
52271F43576J4029J3572J2422J1036R935R257Q846Q471P889O968N933N275N128
52258G62337M891L821K026M67j56k24o15j510k248k368k328k848l829m390l979
52243G49047k990k096j429q11m52p10j175p70Q71K742L726M093N052O962Q841
$$ plain form
52339 240103 240964 241961 242922 243839 245254 247702 250850 253678 255505 256446 256939 257363 258094 259324 260628 261283
52323 261283 261281 261564 262954 265244 267679 269964 272306 274709 276786 278318 279673 281514 284220 287632 291254
52308 291254 294726 298122 301789 305956 310661 316042 322346 329502 336898 343896 350515 357385 365009 373265
52294 373265 381634 389836 398180 407317 417633 428917 440636 452502 464601 477075 489882 502933
52282 502933 516139 529141 541298 552350 563021 574571 587617 601643 615753 629643 643576
52271 643576 657605 671177 683599 694635 704570 713827 722673 731144 739033 746001 751934 757209 762337
52258 762337 767228 771049 773075 773542 773386 773162 772547 771037 768789 766421 764093 761245 757416 753026 749047
52243 749047 746057 743961 742532 741721 741269 740559 739384 738614 739485 742227 745953 750046 755098 762060 770901
52228G70901R753R962J0304J0953J1393J1322J0997J0638J0053R134Q367Q378
52216H92155R006R214Q179O243M455L340K493J442L54l69q45j672l216n297p427
52201I18055r114j0046j0323j0410j0646j0885j0884j0789j0912j1174j1251j1071
52189G90550j0718r965q540o899o034o252o704o424n370m183l360l064l310l823
52175G05904l981l402k489j961j966k036j858j667j726j921k030k179k708l622
52161F72358m416m578m127l581l361l411l394l146k753k323j943j761j925k319
52147F29320k602k583k459k594l090l653l895l741l471l299l097k725k499k789
52133E86823l172k685j223q3m37j863k991l232l072k910k697k590k934l440l319
$$ plain form
52228 770901 780654 790616 800920 811873 823266 834588 845585 856223 866276 875410 883777 892155
52216 892155 901161 910375 918554 924797 929252 932592 935085 936527 936881 936512 935667 933995 930779 925482 918055
52201 918055 908941 898895 888572 878162 867516 856631 845747 834958 824046 812872 801621 790550
52189 790550 779832 769867 761327 754428 748394 742142 735438 729014 723644 719461 716101 713037 709727 705904
52175 705904 701923 698521 696032 694071 692105 690069 688211 686544 684818 682897 680867 678688 675980 672358
52161 672358 667942 663364 659237 655656 652295 648884 645490 642344 639591 637268 635325 633564 631639 629320
52147 629320 626718 624135 621676 619082 615992 612339 608444 604703 601232 597933 594836 592111 589612 586823
52133 586823 583651 580966 579743 579660 579223 577360 574369 571137 568065 565155 562458 559868 556934 553494 550175
52118E50175k579k235k843l607l513k600j550o58N4L32J03k4N41J473K035K284
52102E37388K895L991M895N140N036N143N701O726Q112R508J0543J1355J2455
52089F28888J3972J5400J6293J6896J7789J9130K0459K1109K0772J9817J9115
52078H29640J9257J9843J9770J8374J6145J4155J3032J2622J2380J1778J0493
52067I97489Q601O708N481M879M062K327j7k039l260l982m639n350o236p546r089
52052I87389j0058r939r307r090r304r226q601p951p577p099o227n319m778m429
$$ plain form
52118 550175 547596 545361 542518 538911 535398 532798 531248 530590 530644 530976 531079 531055 531596 533069 535104 537388
52102 537388 540283 544274 549169 554309 559345 564488 570189 576915 585027 594535 605078 616433 628888
52089 628888 642860 658260 674553 691449 709238 728368 748827 769936 790708 810525 829640
52078 829640 848897 868740 888510 906884 923029 937184 950216 962838 975218 986996 997489
52067 997489 1006090 1012798 1018279 1023158 1027220 1029547 1029530 1027491 1024231 1020249 1015610 1010260 1004024 996478 987389
52052 987389 977331 967392 958085 948995 939691 930465 921864 913913 906336 899237 893010 887691 882913 878484
$$ [...]
##END NTUPLES=NMR SPECTRUM
##END=
