
##TITLE=AC1355_CPIAH12174_6672380_DT29ptS5HK
##JCAMPDX= 6.0         $$ Bruker NMR JCAMP-DX V2.0
##DATA TYPE= NMR SPECTRUM
##DATA CLASS= NTUPLES
##ORIGIN= BRUKER
##OWNER= Administrator
$$ 1.72 TOPSPIN		Version 2.1
$$ 2012-08-14 17:26:55.031 -0500  Administrator@TOPSPIN
$$ Compression mode = diff/dup
##.OBSERVE FREQUENCY= 400.02188249412
##.OBSERVE NUCLEUS= ^1H
##.ACQUISITION MODE= SIMULTANEOUS (DQD)
##.ACQUISITION SCHEME= undefined
##.AVERAGES= 8
##.DIGITISER RES= 22
##SPECTROMETER/DATA SYSTEM= spect
##.PULSE SEQUENCE= zg30
##.SOLVENT NAME= COFFEE_meoh
##.SHIFT REFERENCE= INTERNAL, COFFEE_meoh, 1, 14.98509
##AUDIT TRAIL= $$ (NUMBER, WHEN, WHO, WHERE, PROCESS, VERSION, WHAT)
$$ ##TITLE= Audit trail, TOPSPIN		Version 2.1
$$ ##JCAMPDX= 5.01
$$ ##ORIGIN= Bruker BioSpin GmbH
$$ ##OWNER= Administrator
$$ $$ C:\Bruker\TOPSPIN/data/COFFEE/nmr/AC1355_CPIAH12174_6672380_DT29ptS5HK/10/pdata/1/auditp.txt
$$ ##AUDIT TRAIL=  $$ (NUMBER, WHEN, WHO, WHERE, PROCESS, VERSION, WHAT)
(   1,<2012-08-14 17:26:43.640 -0500>,<Administrator>,<TOPSPIN>,<go>,<TOPSPIN 2.1>,
      <created by zg
	started at 2012-08-14 17:25:36.890 -0500,
	POWCHK enabled, PULCHK disabled,
       configuration hash MD5:
       6B 1B 68 BB D9 2E 58 E2 7F 35 AD 54 07 DF 0E 41
       data hash MD5: 64K
       9F 82 17 CA 19 D1 9C 62 81 2F 9C 1A FF 75 E0 66>)
(   2,<2012-08-14 17:26:49.671 -0500>,<Administrator>,<TOPSPIN>,<proc1d>,<TOPSPIN 2.1>,
      <Start of raw data processing
       efp LB = 0 FT_mod = 6 PKNL = 1 PHC0 = 0 PHC1 = 0 SI = 32K 
       data hash MD5: 32K
       BA 54 FE AC E4 AC 03 B9 27 25 F8 64 69 1A F8 A6>)
(   3,<2012-08-14 17:26:50.078 -0500>,<Administrator>,<TOPSPIN>,<proc1d>,<TOPSPIN 2.1>,
      <pk PHC0 = 177.9895 PHC1 = 0 
       data hash MD5: 32K
       AA 5A 2E 0F B8 F3 0E 6C D8 0F E9 20 51 B9 7C 13>)
(   4,<2012-08-14 17:26:50.234 -0500>,<Administrator>,<TOPSPIN>,<proc1d>,<TOPSPIN 2.1>,
      <abs ABSG = 1 
       data hash MD5: 32K
       E7 DC 00 D4 15 C4 18 B0 3F D4 13 61 24 14 73 88>)
(   5,<2012-08-14 17:26:50.265 -0500>,<Administrator>,<TOPSPIN>,<proc1d>,<TOPSPIN 2.1>,
      <abs ABSG = 2 
       data hash MD5: 32K
       FE 98 C2 50 34 AE CB 9E A7 3B 99 B7 68 89 93 7B>)
(   6,<2012-08-14 17:26:50.312 -0500>,<Administrator>,<TOPSPIN>,<proc1d>,<TOPSPIN 2.1>,
      <abs ABSG = 3 
       data hash MD5: 32K
       DE 52 90 66 52 E3 C6 A9 5B 74 E8 16 CC DA 88 0C>)
(   7,<2012-08-14 17:26:50.359 -0500>,<Administrator>,<TOPSPIN>,<proc1d>,<TOPSPIN 2.1>,
      <abs ABSG = 4 
       data hash MD5: 32K
       31 F2 1A 51 6E FD 82 26 37 E8 97 1F 16 00 DB F8>)
(   8,<2012-08-14 17:26:50.390 -0500>,<Administrator>,<TOPSPIN>,<proc1d>,<TOPSPIN 2.1>,
      <abs ABSG = 5 
       data hash MD5: 32K
       B8 90 DE 16 25 91 FD 95 FE BD FB 8E E6 DA 59 7A>)
$$ ##END=
$$ 
$$ $$ hash MD5
$$ $$ 64 55 20 0B 13 3B 08 3A D6 DA 7F DE D3 6F 0D CD
##$RELAX= 
##$RELAX= 
##$RELAX= 
##$RELAX= 
##$RELAX= 
##$RELAX= 
##$RELAX= 
$$ Bruker specific parameters
$$ --------------------------
$$ [...]
150 150 150 150 150 150 150 150
##$TP07= 0
##$TPNAME0= <>
##$TPNAME1= <>
##$TPNAME2= <>
##$TPNAME3= <>
##$TPNAME4= <>
##$TPNAME5= <>
##$TPNAME6= <>
##$TPNAME7= <>
##$TPOAL= (0..7)
0.5 0.5 0.5 0.5 0.5 0.5 0.5 0.5
##$TPOFFS= (0..7)
0 0 0 0 0 0 0 0
##$TUNHIN= 0
##$TUNHOUT= 0
##$TUNXOUT= 0
##$USERA1= <user>
##$USERA2= <user>
##$USERA3= <user>
##$USERA4= <user>
##$USERA5= <user>
##$V9= 5
##$VALIST= <valist>
##$VCLIST= <CCCCCCCCCCCCCCC>
##$VD= 0
##$VDLIST= <DDDDDDDDDDDDDDD>
##$VPLIST= <PPPPPPPPPPPPPPP>
##$VTLIST= <TTTTTTTTTTTTTTT>
##$WBST= 1024
##$WBSW= 4
##$XGAIN= (0..3)
0 0 0 0
##$XL= 0
##$YL= 0
##$YMAX_a= 486133
##$YMIN_a= -615367
##$ZGOPTNS= <>
##$ZL1= 120
##$ZL2= 120
##$ZL3= 120
##$ZL4= 120
##$ABSF1= 14.98509
##$ABSF2= -5.573092
##$ABSG= 5
##$ABSL= 3
##$ALPHA= 0
##$AQORDER= 0
##$ASSFAC= 0
##$ASSFACI= 0
##$ASSFACX= 0
##$ASSWID= 0
##$AUNMP= <proc_prof1d_extract_pilot.lims>
##$AXLEFT= 0
##$AXNAME= <>
##$AXNUC= <1H>
##$AXRIGHT= 0
##$AXTYPE= 0
##$AXUNIT= <>
##$AZFE= 0.1
##$AZFW= 0.1
##$BCFW= 0
##$BC_mod= 0
##$BYTORDP= 0
##$COROFFS= 0
##$CY= 15
##$DATMOD= 1
##$DC= 0
##$DFILT= <>
##$DTYPP= 0
##$F1P= 0
##$F2P= 0
##$FCOR= 0.5
##$FTSIZE= 32768
##$FT_mod= 6
##$GAMMA= 0
##$GB= 0
##$INTBC= 1
##$INTSCL= 1
##$ISEN= 128
##$LB= 0
##$LEV0= 0
##$LPBIN= 0
##$MAXI= 10000
##$MC2= 0
##$MEAN= 0
##$ME_mod= 0
##$MI= 0
##$NCOEF= 0
##$NC_proc= -8
##$NLEV= 6
##$NOISF1= 0
##$NOISF2= 0
##$NSP= 0
##$NTH_PI= 0
##$NZP= 0
##$OFFSET= 14.98509
##$PC= 1
##$PHC0= 177.9895
##$PHC1= 0
##$PH_mod= 1
##$PKNL= yes
##$PPARMOD= 0
##$PPDIAG= 0
##$PPIPTYP= 0
##$PPMPNUM= 2147483647
##$PPRESOL= 1
##$PSCAL= 4
##$PSIGN= 0
##$PYNMP= <proc.py>
##$REVERSE= no
##$SF= 400.02
##$SI= 32768
##$SIGF1= 0
##$SIGF2= 0
##$SINO= 400
##$SIOLD= 32768
##$SPECTYP= <>
##$SREGLST= <1H.CDCl3>
##$SSB= 0
##$STSI= 32768
##$STSR= 0
##$SW_p= 8223.68421052631
##$SYMM= 0
##$S_DEV= 0
##$TDeff= 65536
##$TDoff= 0
##$TI= <>
##$TILT= no
##$TM1= 0
##$TM2= 0
##$TOPLEV= 0
##$USERP1= <user>
##$USERP2= <user>
##$USERP3= <user>
##$USERP4= <user>
##$USERP5= <user>
##$WDW= 1
##$XDIM= 32768
##$YMAX_p= 475420282
##$YMIN_p= -734215
##$CURPLOT= <Network HP LaserJet P1505>
##$CURPRIN= <$Network HP LaserJet P1505>
##$DFORMAT= <normdp>
##$LAYOUT= <+/1D_H.xwp>
##$LFORMAT= <normlp>
##$PFORMAT= <normpl>
##$SURQMSG= 1
$$ End of Bruker specific parameters
$$ ---------------------------------
##NTUPLES= NMR SPECTRUM
##VAR_NAME=  FREQUENCY,     SPECTRUM/REAL,   SPECTRUM/IMAG
##SYMBOL=    X,             R,               I
##VAR_TYPE=  INDEPENDENT,   DEPENDENT,       DEPENDENT
##VAR_FORM=  AFFN,          ASDF,            ASDF
##VAR_DIM=   32768,         32768,           32768
##UNITS=     HZ,            ARBITRARY UNITS, ARBITRARY UNITS
##FACTOR=    0.250966925370066, 1,           1
##FIRST=     8223.43324360094, 99242,        -120790
##LAST=      0,             76366,           -181886
##MIN=       0,             -734215,         0
##MAX=       8223.43324360094, 475420282,    0
$$ Real data points
##PAGE= N=1
##DATA TABLE= (X++(R..R)), XYDATA
$$ [...]
19546f6241j73832K8038C02b90250J4441c6260k84677E9905L9661b34244C1562
19534A01590a5694k77889g8767n3042K4288E8388a62418c1848l98457E1945b15773
19522A47417a63466d2685D4234f5024g578C12796a7140j85920A4461b55631C82749
19510A00674a62807B54692a67580n2794M115G2285a10045a338m1259J7514A60665
19498b97781P8530B26262c30258A5460b01434P6974L705o9757g7369L0593p9936
19487a26712d1725k17333d2136A39461n8411Q9162b76663J6671g2611c3645j74935
19476b08580I614J33848i780o0098j32729h4066j98574J26425a9496m5011B25400
19464a88886G0137B9271K1750i6542j56906J01394b8467A76196h4370A15660J4097
$$ y = [-66241, -240073, -212035, 302, -290250, -275809, -36260, -320937, 59905, 99566, -234244, 31562, 101590, -15694, -293583, -78767, -131809, -107521, 58388, -162418, -31848, -430305, 51945, -215773, 147417, -163466, -42685, 44234, -65024, -7578, 312796, -17140, -203060, 14461, -255631, 382749, 100674, -162807, 254692, -167580, -220374, -216259, 72285, -110045, -1338, -42597, -25083, 160665, -297781, -219251, 226262, -330258, 15460, -201434, -124460, -120755, -190512, -77369, -46776, -126712, -41725, -259058, -42136, 139461, 81050, 170212, -276663, -259992, -72611, -33645, -208580, 9614, 143462, -9780, -69878, -202607, -84066, -282640, -156215, -19496, -64507, 225400, -188886, 70137, 29271, 51021, -96542, -253448, -152054, -28467, 176196, -84370, 115660, 129757]
19453A29757g5977r301B6614K34996b48420J354d3317A53173M50986b10363H671
19441b81213B2475f0830m7030d1163M174P863k72536H9758d56348K05400a4371
19429A89581A4666e5313k0432A02656j1134K05203e36612b1866j7449j36865c5090
19417c21933c53A46118d6616G764b2880j0808B10781j7597a81670o4990R7146
19406a49514d0561l7318A11914C3596K80002A36450g4074k8735A46792C2946N6719
19395H9665a53913j0884A6649c18048H9694a8461C37440a98880A78714J19077
19385B97791c92380R6790o4758J53876c0719k8308D8330b7327n4738n8566j21392
19374b62023B86985i0986B5533g6327j13901B48154r6399O3623a5399E9140d3573
$$ y = [129757, -75977, -85278, 26614, 261610, -248420, -247066, -43317, 153173, 604159, -210363, 8671, -281213, 22475, -60830, -107860, -41163, -36989, -29126, -301662, 89758, -456348, -250948, -14371, 189581, 14666, -55313, -75745, 102656, 91522, 296725, -536612, -21866, -39315, -176180, -35090, -321933, -353, 146118, -46616, 7764, -22880, -33688, 210781, 193184, -181670, -246660, -149514, -40561, -77879, 111914, 33596, 313598, 136450, -74074, -102809, 146792, 32946, 89665, -153913, -164797, 16649, -318048, 89694, -18461, 337440, -198880, 178714, 297791, -392380, -295590, -360348, -206472, -30719, -59027, 48330, -27327, -82065, -140631, -262023, 286985, -90986, 25533, -76327, -190228, 248154, 151755, 215378, -15399, 59140, -43573]
19362a26153A26954a75253J5016k69534K03242K3309j03591E7661g7552l350A3498
19350A9391a67087B9054o902M4988e7489k02528n5877K6316A57032e8843k95780
19339c54623a51638A78827q8189b86380P7248B99896E5613f9878o3904e5438A82169
19327A08219a10889B31921E4525B6561a60357j5298c7843k01441j32955A23815
19316b69018C35584m6391q6893b57104l4058a00212A65231b02733c3198j21498
19306a54696H2467a34711b5697k94502a43776B67927a1527m56619J65454C2424
19295a3311m13843a60551b2304B47J97579c7610D3768c770D4085O0161l2070i956
19282D55759g844D7412e42p9390q9849B4332b66217R0936m7349G8442a35635B58954
$$ y = [-126153, 126954, -175253, -160237, -429771, -226529, -203220, -306811, 57661, -77552, -80902, 13498, 19391, -167087, 29054, 22152, 67140, -57489, -260017, -315894, -289578, 157032, -58843, -354623, -151638, 178827, 90638, -286380, -209132, 299896, 55613, -69878, -133782, -55438, 182169, 108219, -110889, 231921, 54525, 26561, -160357, -175655, -37843, -239284, -372239, 123815, -269018, 335584, 289193, 202300, -257104, -291162, -100212, 165231, -202733, -33198, -154696, 82467, -134711, -25697, -320199, -143776, 267927, -11527, -468146, -302692, 32424, -13311, -427154, -160551, -22304, 247, 197826, -37610, 43768, -3770, 44085, 104246, 72176, -9956, 455759, -7844, 47412, -542, -79932, -169781, 24332, -266217, -175281, -222630, 78442, -135635, 258954]
19269A59443e0258A50665m3742g5490j2801C29737G3878a4176m5285j90278J22612
19258a27127n7742B45882l8426h489j96773j08159R0937h5257q1628a1580A86869
19246a72423M1660j47032E1807c5525k10240k9738j5797L4613h2183q9751P8364
19235i3570A25796b77948B54416R3560c74729l4737R5024J31432k56879G7943
19224B46612h9128G8784b76268a8156l16032Q8736B9679h6375B69411d137j63931
19213a68068l36039a93384P4327E6282c3776j30395B26531h3262B8927h7293o452
19202i3745c4495j42356A81112o4668a77020b9918j14450f0534j72736b6966k89926
19191c16892g5444m1102J4449m2763b5708j7615C7282f0260j16681d7044h887
$$ y = [159443, -50258, 150665, 106923, -75490, -88291, 329737, 73878, -14176, -59461, -249739, -127127, -184869, 245882, 207456, -8489, -205262, -313421, -222484, -85257, -166885, -11580, 186869, -172423, -130763, -277795, 51807, -35525, -245765, -275503, -291300, -256687, -82183, -171934, -93570, 125796, -277948, 254416, 347976, -374729, -409466, -314442, -183010, -439889, 77943, 246612, -89128, 78784, -276268, -18156, -334188, -245452, 29679, -86375, 269411, -4137, -168068, -504107, -193384, -119057, 56282, -33776, -164171, 226531, -83262, 28927, -87293, -93745, -34495, -176851, 181112, 116444, -177020, -29918, -144368, -60534, -233270, -26966, -316892, -75444, -116546, -102097, -144860, -25708, -43323, 37282, -60260, -176941, -47044, -8887]
19179D7474a31297N8387q2889d0563C52037B7000b4767j91859q8296a50721N1574
19168i9147J71j94430L6419A83886C2480p96a68705L794C6197P0478e8957j35159
19156a94116A02398d37092b2406A62864G4054a89372C6766N1683k5001K13360
19146B76808a74162k63658G531K8279P7485g5307j15306a4574k81474J1511B58616
19134a53111P4788m12E3827b18911n1330A76753B608b83894D9327J55043B7269
19122A27159b81737G7608d06949c4713a7125n0020j77176N1841l31842e9424k94484
19111c53908J04632b4674j35529B09492i1943A31496C1670K3634c68204h4679
19100c9253M873A99501E4043p15J49367d2363E4617a94053Q9269q9846g7603A67956
$$ y = [47474, -131297, -72910, -155799, -40563, 352037, 27000, -24767, -216626, -304922, -150721, -99147, -98976, -293406, -256987, 183886, 32480, 31684, -168705, -164911, 36197, 106675, -58957, -194116, 102398, -437092, -22406, 162864, 74054, -189372, 36766, 88449, 63448, 276808, -174162, -437820, 7531, 35810, 113295, -75307, -190613, -14574, -296048, -284537, 258616, -153111, -78323, -78735, 53827, -218911, -270241, 176753, 2608, -283894, 49327, 204370, 27269, 127159, -281737, 77608, -406949, -34713, -17125, -67145, -244321, -192480, -524322, -59424, -353908, -249276, -24674, -160203, 209492, -91943, 131496, 31670, 55304, -368204, -84679, -39253, -34380, 199501, 54043, 53328, 202695, -42363, 54617, -194053, -104784, -194630, -77603, 167956]
19087c07131e8297j52768A42391e2802A08921b12787F8647K24758a41668j60059
19077c01727J29982d6995j5206H4593N2484m9785d18112a21220N8239k89474a68665
19065c13682a52807k395c3970A25599C15g1783p349B49536b18277i7103A92053
19053g7485c8077l80103d3042j07618j15068A41972n7252i6432d6410k08779E0940
19041b30709A10186h6486r0194N7554B6341c74716J66554D04978a24829D1723
19030A56294D935Q5527l188L36009j17154O8376B1523L00514b00157C23899c4901
19018B49797g4702a0083n8915K5636B3351a40160I2665a64991j81481I9804a48755
19006A14097b07751B59812e3498b0219k17035A73167a79924l3585e3649j0767
$$ y = [-307131, -58297, -211065, 142391, -52802, 108921, -212787, 68647, 293405, -141668, -301727, -171745, -46995, -62201, 84593, 137077, 87292, -418112, -121220, -62981, -352455, -168665, -313682, -152807, -155202, -33970, 125599, 315, -71783, -79132, 249536, -218277, -97103, 192053, -77485, -38077, -418180, -43042, -150660, -265728, 141972, 84720, -96432, -46410, -255189, 50940, -230709, 110186, -86486, -176680, -119126, 26341, -374716, -208162, 404978, -124829, 41723, 156294, 4935, 90462, 87274, 423283, 306129, 374505, 21523, 322037, -200157, 323899, -34901, 249797, -74702, -10083, -68998, -43362, 23351, -140160, 92665, -164991, -346472, 99804, -148755, 114097, -207751, 259812, -53498, -20219, -237254, 173167, -179924, -213509, -53649, -64416]
18996f4416j80995b5855m64537A17877N2373J78191a09463q9468M349f1352l5522
18985i6874A26682A8063J07332b18417b1287j03628I0860P4534F0527e9200k47971
18974c07171P2850i7572H6237L00590h8082D6598j8982J6515j3807a69055B60732
18962c08057A917b10354A07307c1367C8026K6910c13409A35127b28126l7791g6113
18950e1455j5899j6949g170C76592A64476I654c14538K1735A28888b5711H7043
18938h0980B9159c71445B8775K04628b13903C33801A03919a84110D43925c93391
18927A63004b95172A96674b7170J848G3988Q3816a65377L8887b6847j14922C99871
18915F0073a72917o509B84132l9378a809j4842j33892E1334a33357f195o4564
$$ y = [-64416, -245411, -25855, -490392, 117877, 170250, 348441, -109463, -198931, -194582, -61352, -96874, 126682, 18063, 125395, -218417, -21287, -124915, 90860, 165394, 60527, -59200, -307171, -234321, -97572, 86237, 386827, -88082, 46598, 27616, 44131, 30324, -169055, 260732, -308057, 1917, -210354, 107307, -31367, 38026, 64936, -313409, 135127, -228126, -265917, -76113, -51455, -67354, -84303, -7170, 376592, 164476, 9654, -314538, -292803, 128888, -25711, 87043, -80980, 29159, -371445, 28775, 233403, -213903, 333801, 103919, -184110, 443925, -393391, 163004, -295172, 196674, -27170, -25322, 73988, 157804, -165377, -126490, -26847, -141769, 399871, 60073, -172917, -179426, 284132, 244754, -1809, -16651, -150543, 51334, -133357, -6195, -70759]
18904g0759j52621F6478m822a16212A0121b2578B2103J93136E0827a63512o3742
18893b27254A2613J17267J80657A52304M3909I6071M2853a49245p4024R0803e4791
18881c05045H0930b41305A81296g459A12037f2512p0935A01363c86641A23229
18870a84205f425D6796L91396d7970k61676a27038n8389C27486a58896p7074B67104
18858a6477m70465J59866a40847A14123a07389j93707J14343g0414A80456k0154
18848A60302L1742c04918f7446I0190b23976M0353A54267b17451K0776D1666J13191
18837A54857b72447J18366E6780a86471l1009A62228d1892q9852A69919c1433
18826a60639G9223b23483A77786g3426b6655k01926e2942A67728d0647B6013J09664
$$ y = [-70759, -223380, 66478, 61656, -116212, 10121, -22578, 22103, 215239, 50827, -163512, -227254, 12613, 129880, 310537, 152304, 196213, 96071, 138924, -149245, -223269, -132466, -54791, -305045, 80930, -241305, 181296, -7459, 112037, -62512, -133447, 101363, -386641, 123229, -184205, -6425, 46796, 438192, -47970, -309646, -127038, -185427, 327486, -158896, -235970, 267104, -16477, -486942, -327076, -140847, 114123, -107389, -301096, -186753, -70414, 180456, 160302, 192044, -304918, -67446, 90190, -223976, -183623, 154267, -217451, -196675, 41666, 154857, -272447, -154081, 56780, -186471, -217480, 162228, -41892, -131744, 169919, -31433, -160639, 79223, -223483, 177786, -73426, -26655, -228581, -52942, 167728, -40647, 26013, 135677]
18815A35677a03049G1807J99279f8518A13710h4167O288E6254b0390E0514L1620
18804H2134a09032A70655g4335B34020e5251n1403i121j31030r1206Q089N4402
18793a68866A74208b34177d2387e625m108r4996A19968h2748b7349j11223e4787
18781A02443e7868B3722O0799g9945b794j47013j90924a15490C94091a49744A54375
18769b46320l8147K7852B11712a03625j88153B31295d8787J468k30866d2812B2642
18757a22651D27710a79834D3910b74528A67102a46843j84560Q8205a08495j39416
18747b47911J18372A72886L5957f4261A57215h1311b5762A7436c05400e1391j69935
18736b21326A27819J6429a32882r671Q373j54254F8979Q0580b03373e2445j9781
$$ y = [135677, -103049, 71807, 271086, -68518, 113710, -84167, -77879, 56254, -20390, 50514, 82134, -109032, 170655, -74335, 234020, -55251, -106654, -9121, -140151, -231357, -223268, -168866, 174208, -234177, -42387, -5625, -9733, -104729, 119968, -82748, -27349, -138572, -54787, 102443, -57868, 23722, 84521, -79945, -2794, -149807, -340731, -115490, 394091, -149744, 154375, -246320, -284467, -256615, 211712, -103625, -291778, 231295, -48787, -47319, -278185, -42812, 22642, -122651, 427710, -179834, 43910, -274528, 167102, -146843, -331403, -243198, -108495, -247911, -129539, 172886, 208843, -64261, 157215, -81311, -25762, 17436, -305400, -51391, -221326, 127819, 144248, -132882, -142553, -134180, -288434, 68979, 149559, -203373, -52445, -72226]
18725g2226D8444c0748k26968A05941i4868k1273l70311K42992K8091L9597j54285
18714c30057a58383G9925P0814B6740b07974b1694n0898A11178a77818H1105d3308
18702a30168I2017c92836c5788j47349B31036d15384a56798J0294A60828b34217
18691a13828j56656C43067h9086o2913p2696B23574b60702j37483d3604N284A01952
18679b19881A29073f4749j40155C01964a14696B0249K9742b68592e2017j68897
18669b20914J07466N3839k9147n5218B6600b03114D27117a73223I089e5325I323
18657A4170D220a87207f0853l46876f805k2717k3631B22768H4680a4742r7017
18646a11759p1815i371C7165a23870b4910l28793H9370k8440O1042a44678j47458
$$ y = [-72226, 48444, -30748, -257716, 105941, -94868, -116141, -486452, -243460, -215369, -175772, -330057, -158383, 79925, 150739, 26740, -207974, -21694, -72592, 111178, -177818, 81105, -43308, -130168, 92017, -392836, -35788, -183137, 231036, -415384, -156798, -146504, 160828, -234217, -113828, -270484, 343067, -89086, -151999, -224695, 223574, -260702, -398185, -43604, -38320, 101952, -219881, 129073, -64749, -204904, 301964, -114696, 20249, 49991, -268592, -52017, -220914, -113448, -59609, -88756, -143974, 26600, -203114, 427117, -173223, 9089, -55325, 9323, 14170, 4220, -187207, -60853, -407729, -6805, -29522, -53153, 222768, 84680, -14742, -111759, -183574, -9371, 37165, -123870, -24910, -353703, 89370, 60930, 121972, -144678, -292136]
18635b92136F2719J41259M1364b67042F4942b56136A98151g8273j86235Q9660
18625a74848j36125a01676Q329A36821f6335A70815J55771a12244l255C32152
18614a31915k43401B5009D570d2144o3084j1350m4261C1i2498h26l52130c2765
18601C9301h6309A27981h8879j56662M7690A10034e2484q0284n0912O1194G2001
18589B62655B5273b44590M7587h9508G1879d54580a26180m56578a89356p2281
18579b61637C1179L7958a18146k16570M0270E5137J26215d50282c672j6449A66895
18567b07415D8900I712a31460L1480j83462P2778h6711J269b4751j50719C1375
18555a2225j336j3787p2445B48680B8879K7479e807k55086h6288l84416B95705
$$ y = [-292136, 62719, 203978, 245342, -267042, 64942, -256136, 198151, -78273, -264508, -174848, -310973, -101676, -93347, 136821, -66335, 170815, 326586, -112244, -115499, 332152, -131915, -375316, 25009, 4570, -42144, -105228, -116578, -160839, 31, -92498, -826, -352956, -32765, 39301, -86309, 127981, -88879, -245541, -197851, 110034, -52484, -132768, -183680, -122486, 72001, 262655, 25273, -244590, -197003, -89508, 71879, -454580, -126180, -582758, -189356, -261637, 31179, 69137, -118146, -334716, -294446, 55137, 181352, -450282, -3672, -20121, 166895, -207415, 48900, 9712, -131460, -99980, -283442, -210664, -86711, -85442, -24751, -175470, 31375, -12225, -13561, -27348, -99793, 248680, 28879, 56358, -5807, -260893, -86288, -470704, 295705]
18543B40463c16586B17570b43473D1968K39175j07675a02695A52872i7584E35833
18532d6015I5266P9173a69745A52521J90390F4028A7667M3812g8565B19700l8917
18521A80783f6694B00461a06181A66827b024j75727l5276a1963n37223a36956
18510A14323M7973n6921a55883l8111N1978h75k26367O945C09535d78579d3753
18498B3395l20J19080i8553B96150a22372m27185a90373m4250A67923b54756A19202
18486f0740k2511m400F5221c73660N1151a50586l4283g2338j02268B41053l2616
18475B08437b13437E5578d8867A47174a85190A30928a04005B88994A00885c06348
18464a78081B70113f2988H0959g8168A3948N2840b94573R0197B3033b75312A87563
$$ y = [240463, -316586, 217570, -243473, 41968, 281143, 173468, -102695, 152872, -97584, 535833, -46015, 95266, 174439, -169745, 152521, 342911, 64028, 17667, 61479, -78565, 219700, 180783, -66694, 200461, -106181, 166827, -2024, -177751, -213027, -11963, -549186, -136956, 114323, 162296, 105375, -155883, -193994, -142016, -875, -227242, -220297, 309535, -478579, -43753, 23395, 23075, 142155, -98553, 296150, -122372, -549557, -190373, -234623, 167923, -254756, 119202, -60740, -83251, -87651, 65221, -373660, -322509, -150586, -184869, -72338, -174606, 241053, 208437, -213437, 55578, -48867, 147174, -185190, 130928, -104005, 288994, 100885, -306348, -178081, 270113, -62988, 80959, -78168, 13948, 66788, -294573, -204376, 23033, -275312, 187563]
18452A5297L2205K20852A26580b7018j06959c8497k58726O2264P7506G8942M6646
18441A25588b27071A20814C6044Q970r840q349M0336a0648j01110A32286d74642
18429d8432k37897J25950b8204I5302D0164b40297L1478C3899M4691a01811A70456
18417a46660A74027a2480A7748L7529K78818H3616b9149E085J49266J27278B8691
18405B6891b35553a04658F0690J52215O5635a31560I4548K70556a15885H4165
18394h1396l9091c7849B32556D1871C976L96329b62127O9203G5168a67710N9719
18383a07991B35033b27463B11011c51547d2585j09203M0336B47342d092j26898
18373a30990A46880b05707L1544m1575A95725a7036A25525f6044B69431B068J04694
$$ y = [15297, 47502, 268354, 126580, -27018, -133977, -38497, -297223, -234959, -157453, 78942, 125588, -227071, 120814, 36044, 45014, 35174, 26825, 67161, -10648, -111758, 132286, -474642, -48432, -286329, -160379, -28204, 95302, 40164, -240297, -208819, 33899, 78590, -101811, 170456, -146660, 174027, -12480, 17748, 55277, 334095, 83616, -29149, 5085, 154351, 281629, 28691, 26891, -235553, -104658, 60690, 212905, 278540, -131560, 94548, 365104, -115885, 84165, -81396, -120487, -37849, 232556, 41871, 3976, 400305, -262127, -192924, 75168, -167710, -107991, 235033, -227463, 211011, -351547, -42585, -151788, -111452, 247342, -4092, -130990, 146880, -205707, -174163, -215738, 195725, -17036, 125525, -66044, 269431, 2068, 106762]
18362A06762o189a21953k47303h9116C9116M723b43917i9980j45961H10i5272
18350a18160k4390K5362d6791A30779g4671H5331h0651a102m23711B05813L1050
18339B36863B5194M8014P0121L1581b14413L5772P4113j66366A8107J71827f6082
18327a25820A54906e28178K2031l2116B21132c9729o856n3600j48586F5213L8426
18316A03639C9614M23942a30600c3787B1505b99292H8121g4012A27627O3600b35029
18304b08542d7345j85511A95261e05435a16638B21164I5373g8637b0835j5318
18294c6153k49814j22425A02040c08226N1448a01195A27817E5441M7259k3688
18284G9012D695c10495a23961A92685a85472k1878A6048J10147n7709f4028m9700
$$ y = [106762, 100573, -121953, -369256, -89116, 39116, 43839, -243917, -99980, -245941, 810, -95272, -118160, -142550, -117188, -46791, 130779, -74671, 85331, -80651, -1102, -424813, 205813, 236863, 25194, 73208, 143329, 174910, -214413, -178641, -104528, -270894, 18107, 189934, -66082, -125820, 154906, -528178, -506147, -538263, 221132, -39729, -46585, -100185, -248771, 65213, 103639, 39614, 463556, -130600, -33787, 21505, -299292, 88121, -74012, 127627, 191227, -235029, -208542, -47345, -232856, 195261, -505435, -116638, 221164, 95373, -78637, -20835, -36153, -285967, -408392, 102040, -308226, -256778, -101195, 127817, 55441, 102700, 79012, 4695, -310495, -123961, 192685, -185472, -207350, 16048, 126195, 68486, -64028, -113728]
18273a13728r2363B74468j26933a00208k5881I7245J05482C2906d58041a0273
18262A24628a0037j33219e5272f503E2038a52978B8527a38412d7875J3459j61031
18251a95447E4650c38000f0254j21954A21710c89196H2662g2466H3616I384J41150
18240A50534l5132J34191j15678c9202B56594h6457j52607a0012m0991l936A40641
18228H3416b14081b753k66402g4354B11856c7769j76989G3291Q7704a31719G505
18216A54609c80403A95222G7284a01770I3787D854N5207A9379a29572C2838c53289
18204a3150q8482E1012C435K52361a05111I6367a3948B81010c10813A81716N9459
18193B41175J00170a84214A00402B3366c16486c5064A78403b61649N0325C1129
$$ y = [-113728, -206091, 274468, 147535, -100208, -126089, 97245, 202727, 32906, -458041, -10273, 124628, -10037, -143256, -55272, -6503, 52038, -152978, 28527, -138412, -47875, -34416, -195447, 54650, -338000, -60254, -182208, 121710, -389196, 82662, -72466, 83616, 9384, 150534, 115402, 249593, 133915, -39202, 256594, -86457, -239064, -10012, -51003, -54939, 140641, 83416, -214081, -2753, -269155, -74354, 211856, -37769, -214758, 73291, 160995, -131719, 7505, 154609, -380403, 195222, 77284, -101770, 93787, 4854, 60061, 19379, -129572, 32838, -353289, -13150, -101632, 51012, 3435, 255796, -105111, 96367, -13948, 281010, -310813, 181716, 241175, 341345, -184214, 100402, 23366, -316486, -35064, 178403, -261649, -211324, 31129]
18182B89265a97944N1613f8828C83241j80260o8548a51212L4598G1131N6919C046
18170f7288j58340d989j87320o5039B09862b16009N3671b6534m0526E9246J56187
18159B15433J07752q3409c48321b8575A9602P3873b38496c1675j22932l327C59349
18147e3904j83176j35603a03057k04274I2346J04390a81476a7900C43485a72070
18136a05748j81789b9585A00758b47948R2097c5350l3607C31729H1531a8457A81475
18124a23390l8016j06413a9798g610b081A41436j3794a64283r6322C69968a42526
18112A09929k37b7607j13641A03275O4044n1796b71784A17447A7216a12151a5032
18100C4184e7190A13523i117l9428n0904G0207b74341j08355f108k20875D71547
$$ y = [289265, -197944, -146331, -68828, 383241, 202981, 134433, -151212, -116614, 71131, 128050, 3046, -67288, -225628, -4989, -192309, -257348, 209862, -216009, -162338, -26534, -67060, 59246, 215433, 323185, 239776, -348321, -28575, 19602, 93475, -238496, -31675, -154607, -157934, 359349, -53904, -237080, -372683, -103057, -307331, 92346, 196736, -181476, -17900, 343485, -172070, -105748, -287537, -29585, 100758, -247948, -155851, -35350, -68957, 331729, 81531, -18457, 181475, -123390, -161406, -267819, -19798, -7610, -2081, 141436, 127642, -164283, -260605, 369968, -142526, 109929, 109692, -27607, -141248, 103275, 167319, 115523, -271784, 117447, 17216, -112151, -15032, 34184, -57190, 113523, -9117, -48545, -99449, 70207, -274341, -382696, -6108, -226983, 471547]
18088A2184J77694i860m6453K0640D4980a06932A5127a75301B18730n4406A4963
18076b07068K3338E0902R7930K38592b71244a00230p8284e708C7034c81742c6942
18064a85354A39210a70455K3528B33337A10746c76860J31592C4374J57257J13309
18054C04940o1004A03110a09671D95226A5301d07100J58375b5793j49209D1930
18043b82333j6826J31070A61452b92C5495a40070A06861B0924J26062K4130b52434
18031f0692j19027a2243l8647j36051i1631J6800j50279N5696G3019O5293a8201
18019H9289a29568A31189J1616a98114h6221o9773J6385j6551I0604K8615e0042
18007C2392J78341a05721H8426a86008J9358A23417A4439J134c01760B81763a32093
$$ y = [12184, 189878, -9860, -56313, -35673, 44980, -106932, 15127, -175301, 218730, 164324, 14963, -207068, -183730, 50902, 148832, 387424, -271244, -100230, -178514, -5708, 37034, -381742, -36942, -185354, 139210, -170455, -146927, 233337, 110746, -376860, -245268, 34374, 191631, 304940, 243936, 103110, -109671, 495226, 15301, -407100, -248725, -25793, -175002, 41930, -282333, -299159, -168089, 161452, -292, 35495, -140070, 106861, 20924, 146986, 171116, -252434, -60692, -179719, -12243, -50890, -186941, -91631, -74831, -225110, -169414, 73019, 138312, -18201, 89289, -129568, 131189, 142805, -198114, -86221, -155994, -139609, -156160, 90604, 119219, -50042, 32392, 210733, -105721, 88426, -186008, -166650, 123417, 14439, 15573, -301760, 281763, -132093]
17995B5234b7773k63432G4213J60515a73557a8214j71262B07100a73607A3263
17984a86194f3700B12250F750J01369j9890b14736A9264J8953J36608B3980L27093
17973C51073G8609b55587a8483H8966f1633A31064b27080B7109b85296D5741J09002
17962A54743a36389j07527i4933b1581C25106b67850F6070J63321D1088A7947
17951A00790l9952B4843i0102j90089J00059f3940j20303g6277F2159a02684k1600
17940a24284F5840c58857a03694A26998a01188G7709B9846O4199N3188F9247J91413
17929B60660B7670a25491o384j84597E2201J10031c78199J30024A63389J3190
17919A76579F0223N8773D7979n235b124m9454D7877a28759C87701A46466a02793
$$ y = [25234, -27773, -291205, 74213, 234728, -173557, -18214, -189476, 207100, -173607, 13263, -186194, -63700, 212250, 6750, 108119, 88229, -214736, 19264, 38217, 174825, 23980, 351073, 78609, -255587, -18483, 88966, -61633, 131064, -227080, 27109, -285296, 45741, 154743, -136389, -243916, -94933, -21581, 325106, -267850, 66070, 229391, 41088, 17947, 100790, 60838, 24843, -90102, -280191, -180132, -63940, -184243, -76277, 62159, -102684, -124284, 65840, -358857, -103694, 126998, -101188, 77709, 29846, 94045, 147233, 69247, 260660, 27670, -125491, -131875, -316472, 52201, 162232, -378199, -248175, 163389, 176579, 60223, 118996, 47979, 42744, -2124, -51578, 47877, -128759, 387701, 146466, -102793]
17907B3633c3243G6462B2960M2641e7073b3062A94511J73855f3705J5304p0698
17896a19099a293B28171J56582b8925r5685e1646A02580c541k5685A2528e0723
17884A93806f6647k88613b3662G7936J99114b87333I8918d1617k14005C3926J72594
17873B06520g4377r143m3364C7946L71227A00428b26681A92908G5685A3619b43539
17861B06189a24667B21350p2004a60388E3291c68980A74133a5714D6566J38130
17851A84696d2911A74166b9426I3503N470d3243D7347c33452D1937K71278E1029
17839A36660c9572m6065k49223J04055G0492a56950B28315j02167a33680A36665
17828F5581l241a9501m81409E202h4546H808a29805B16684N4532o5114F4326J5363
$$ y = [23633, -33243, 76462, 22960, 65601, -57073, -23062, 194511, 368366, -63705, -48401, -119099, -1293, 228171, 384753, -28925, -124610, -51646, 102580, -3541, -29226, 12528, -50723, 193806, -66647, -355260, -23662, 77936, 277050, -287333, 98918, -41617, -255622, 33926, 206520, -74377, -83520, -126884, 37946, 409173, 100428, -226681, 192908, 75685, 13619, -243539, 206189, -124667, 221350, 149346, -160388, 53291, -368980, 174133, -15714, 46566, 184696, -42911, 174166, -29426, 93503, 98973, -43243, 47347, -333452, 41937, 313215, 51029, 136660, -39572, -85637, -334860, -230805, 70492, -156950, 228315, 126148, -133680, 136665, 65581, 62340, -19501, -500910, 5202, -84546, 8808, -129805, 216684, 271216, 206102, 64326, 79689]
17816G9689b72588i4533d1547H0950a46054G7506h2506D4556a04142k02653J38216
17805a68579B1135K15895a65111A17321a51446g3606j16803O2270k6218m6540
17795b00897P3017B17305a50743c73j46026L9137e1567j21605G5158l4701e5741
17783b70636e8954l8840B7216J7573J51930b95764J07917D9790b29608e3770l00883
17772c54653a68361g8273D3613J59461N7562i1679j32246f7296p8016H8212J01335
17761A89547E1466L31206a01382A93250K6777c3894k58169j63092E4156k3455
17751C0701i1758B09756a24223m50414b9802H4355J19606R5054m9429I775J89346
17740A99121H1269a23189a7789D275a19496B69774I799a88796A01577o323k2154
$$ y = [79689, -272588, -94533, -41547, 80950, -146054, 77506, -82506, 44556, -104142, -306795, -168579, 21135, 237030, -165111, 117321, -151446, -73606, -190409, -128139, -154357, -200897, -127880, 217305, -150743, -373, -146399, -107262, -51567, -173172, 75158, 40457, -55741, -270636, -58954, -97794, 27216, 44789, 196719, -295764, -187847, 49790, -229608, -53770, -354653, -168361, -78273, 43613, 203074, 260636, -91679, -223925, -67296, -145312, 88212, 189547, 51466, 382672, -101382, 193250, 220027, -33894, -292063, -455155, 54156, 30701, -91758, 209756, -124223, -574637, -29802, 84355, 203961, 299015, 249586, 9775, 199121, 81269, -123189, -17789, 4275, -119496, 269774, 9799, -188796, 101577, 95254, 73100]
17729G3100J17166C1664e4078A02397D4822k0056e1006C5715a55738A25512b14772
17717A00858L41294j54875A00774K7904f9808B88090A08512a38286A83289n914
17707A77375d116A96200p0951E1033b03710N0577I8579b56508g879A28968K4326
17696A53294J14727a21282e8112K3754A30551J968F0198f6195C27308c1752k04821
17685b36573A68714J20110c44828B36173o4716h4642j1179B08446a7720n9118
17675g6838f571E9962P9783h9529F08644d21912a75876A96341A8331K38342R6099
17664C52772f6086q2100A03122J70407A25766M7696a00649k0850M7313M390B06213
17652B06973E0787a96748A04402d2481A46036M5976J32049q3394F5000C2159N4992
$$ y = [73100, 190266, 31664, -54078, 102397, 44822, 24766, -51006, 35715, -155738, 125512, -214772, 100858, 442152, 287277, 100774, 128678, -69808, 288090, 108512, -138286, 183289, 177375, -4116, 196200, 125249, 51033, -203710, -153133, 98579, -256508, -7879, 128968, 153294, 268021, -121282, -58112, -34358, 130551, 132519, 60198, -66195, 327308, -31752, -236573, 168714, 288824, -344828, 236173, 171457, -84642, -95821, 208446, -17720, -76838, -6571, 59962, 139745, -89529, 608644, -421912, -175876, 196341, 18331, 256673, 352772, -66086, -148186, 103122, 273529, 125766, 173462, -100649, -121499, -74186, -69796, 206213, 206973, 50787, -196748, 104402, -42481, 146036, 192012, 324061, 240667, 65000, 32159, 87151]
17641H7151O3211a70294A88673c53882C29546a43431A4094N4357P1464b25734
17630I7017a03575M9910B9029a03803o1080a9824A51694J62967j56795g6901j9580
17619i6481j07311A11801B0812O4255i4963n6869j19776B04091j9228J24550D6126
17607C9102L16179A02171D9577K7100P4458B9527K09401a8401B56764f9288b3265
17595B94930a45939l56956J17409J82245B03555c1493F6905h6158B2715J9579
17585D2294M0744K60559c96206a21858O560D17039j801F1381J90215J05812j38174
17574B19234E1521a04562j32114A7999a63469a4519j46494j2254d7821B5126b84699
17562B74518j09394K6888m4719L57563a25898C1687a43426E9541N6505b44091
$$ y = [87151, 150362, -170294, 188673, -353882, 329546, -143431, 14094, 68451, 139915, -225734, 97017, -103575, -53665, 29029, -103803, -164883, -19824, 151694, 314661, 157866, -76901, -96481, -203792, 111801, 20812, 85067, -94963, -151832, -271608, 204091, 184863, 309413, 46126, 39102, 355281, 102171, 49577, 76677, 151135, 29527, 238928, -18401, 256764, -69288, -23265, 294930, -145939, -502895, -385486, -203241, 203555, -31493, 66905, -86158, 22715, 42294, 83038, 343597, -396206, -121858, -115298, 417039, 415238, 61381, 251596, 357408, 219234, 51521, -104562, -236676, 17999, -163469, -14519, -161013, -173267, -47821, 25126, -284699, 274518, 165124, 192012, 147293, 504856, -125898, 31687, -143426, 59541, 116046, -244091]
17551A07797a849B78239b61796B36410E0326J06211p1356J57550G3868a44418
17540c4556D4794J21929p7939a21837O0219D1633H916K14570o1750a699n3561
17529e5260B03561J49963H5591h1250I2068B2491a26549B40707k6378r9214d4315
17517D17895b23054g3906D283P4464A6432b27204R0814D0499J14095i225C59068
17505d4981B6557J64787a78193A27546d0937B31301i7035E6277K88941I4470A5538
17493a61428G6275N0946J40344b36837B64641d657D192L30281F3510f5929G0748
17481C29395a62387H0629P2885B3449d502p2092j0343C29381j0627A15952K90181
17470D06133c210H8305e5419A76071H0015j4733b48367C48428a39151b297C51334
$$ y = [107797, -1849, 278239, -261796, 236410, 50326, 156537, 85181, 242731, 73868, -144418, -34556, 44794, 166723, 88784, -121837, -61618, 41633, 8916, 223486, 161736, -1699, -55260, 203561, 353524, 85591, -81250, 92068, 22491, -126549, 240707, 214329, 115115, -44315, 417895, -223054, -73906, 4283, 78747, 16432, -227204, -136390, 40499, 154594, -9225, 359068, -44981, 26557, 191344, -178193, 127546, -40937, 231301, -97035, 56277, 345218, 94470, 15538, -161428, 76275, 127221, 267565, -236837, 264641, -4657, 4192, 334473, 63510, -65929, 70748, 329395, -162387, 80629, 153514, 23449, -4502, -76594, -86937, 329381, 318754, 115952, 406133, -3210, 88305, -55419, 176071, 80015, 65282, -248367, 348428, -139151, -2297, 351334]
17458A57884a08480B2703J03875k4416L6606P5162j3A2647K89853A24080N08130
17447F32210B77815J01331r539j19874A21882l7028J16890J74886a97562F6121
17436B49119J23722j58338j02785M1201N1433K479K6960A04549L94917k27357
17426B72109O4046a7861D03975j94761h814l5785A77464L95126A86609K7224G7574
17414B65523J0611Q0515E7100b6543B39036b64451G5619L775M64439A52377J27115
17403B79492L2706A7885L56904k9496n0915m2867J33600J75217a76644K7531B35853
17391H109L65285A09896J41345J6607A4762N5476J72650c37553A15423e926j12874
17380a18800D46864A31276h6906m8138e6391A82560H671J95057M3735a11262A38798
$$ y = [157884, -108480, 22703, 126578, 102162, 138768, 213930, 213917, 12647, 302500, 124080, 632210, 277815, 379146, 369607, 249733, 121882, 84854, 201744, 376630, -197562, 66121, 249119, 372841, 214503, 111718, 152919, 204352, 206831, 233791, 104549, 499466, 272109, 336155, -17861, 403975, 209214, -8814, -44599, 177464, 572590, 186609, 213833, 77574, 265523, 276134, 356649, 57100, -26543, 239036, -264451, 75619, 79394, 543833, 152377, 279492, 312198, 17885, 374789, 345293, 294378, 251511, 385111, 560328, -176644, -149113, 235853, 8109, 373394, 109896, 251241, 267848, 14762, 70238, 242888, -337553, 115423, -5926, -118800, 446864, 131276, -86906, -135044, -56391, 182560, 8671, 203728, 247463, -111262, 138798]
17368B67732n3136A00372P9091J41387f0204I0119R2951a28650B77859N3776c8721
17356A08189K24888I117a49093A98745G7041J01432b894A34082A2001h8652A75643
17344A88067c1106F78518B06658I6380L84709B20424K1839E6100Q866L68566A56793
17332B48784q1772J01721J09990f8937I7986a453B65973k4867A9000i7267B45952
17320A76289J28036e9584C55839b3325A56980R655b28995A50032l0003q251E1093
17308D8789f9990G1849J50509a28210B32772L17886o9691j50174j25360b09673
17297B84095q9269A916b4679A73757K3693L9460o4848L402G4960a48739C78709
17285E47012A52735i1821B06146q1836d3998I7447K92463r5295g687C80228q1645
$$ y = [267732, 214596, 100372, 179463, 320850, -60204, 90119, 183070, -128650, 277859, 331635, -38721, 108189, 333077, 9117, -149093, 198745, 77041, 178473, -2894, 134082, 12001, -88652, 175643, 188067, -31106, 678518, 206658, 96380, 481089, 220424, 242263, 56100, 64966, 433532, 156793, 248784, 167012, 268733, 378723, -68937, 97986, -1453, 265973, 241106, 19000, -97267, 245952, 176289, 304325, -59584, 355839, -23325, 156980, 166635, -228995, 150032, 120029, 111778, 51093, 48789, -69990, 71849, 222358, -128210, 232772, 550658, 480967, 330793, 205433, -209673, 284095, 194826, 1916, -24679, 173757, 197450, 236910, 172062, 175464, 74960, -148739, 378709, 547012, 152735, -91821, 206146, 124310, -43998, 97447, 389910, 294615, -7687, 380228, 298583]
17274B98583A13394K18442A27496K5250O9606b4991F5801R7874O6997J6187F2426
17262B4187J40963E5556a90127D1469K04674o0859D2626L21698m0070j45015K8829
17251B08068a79679B31320b80043f0148C83907L2045C7157b57154G2693M9573
17241A22266J4302k8666J07536l828b9626D45253o5978A06062L36457E4875P9550
17230A34425K56173l9036I1056J87722J64990A7858K21658F1816K64782O3108
17220C89706E7663b2898D29832o1457A00556M9937N8851H2180J38984O792J92256
17209D20212M5681j19286p0771L378C6486J23030l3469o431Q8941P7989F3465
17197B19954N5604j1908K98674H9324K73771j57818a3522B18440o3167j0294K70103
$$ y = [298583, 113394, 331836, 127496, 152746, 222352, -24991, 65801, 163675, 230672, 246859, 62426, 24187, 165150, 55556, -190127, 41469, 246143, 185284, 42626, 364324, 324254, 179239, 208068, -179679, 231320, -280043, -60148, 383907, 415952, 37157, -257154, 72693, 122266, 136568, 107902, 215438, 211610, -29626, 445253, 379275, 106062, 442519, 54875, 134425, 390598, 351562, 91056, 278778, 443768, 17858, 239516, 61816, 326598, 389706, 57663, -22898, 429832, 368375, 100556, 150493, 209344, 82180, 221164, 227956, 420212, 465893, 346607, 275836, 279214, 36486, 159516, 126047, 119616, 208557, 286546, 63465, 219954, 275558, 263650, 562324, 89324, 363095, 205277, -13522, 218440, 155273, 144979, 415082]
17186D15082A56427D8231J67269L96013B20591a69458B94896r0136J66781j52472
17176B19069p5730J56499n3313I0941k1121O11854A08125R4241J95917A93285
17165D59972A764K56727n8529J72932C2835M43394A11658J30597j886c6771C78706
17153B42658J22788j34784k0536K40663c8914C61274A57308J24572J69219H5855
17142C30508A16810J34673j13102L11312J02795J1724A59918J46771J5053K23291
17132E45033A46347J67379K25310A94182l9537J38492F5101M26875l4809k07139
17122B50028L77304k33559L18527I6854K71338m0353A59330J92188J29268B14650
17111E78031G0773N03314j06130G4552M99511E4319L19330k2400r1401M708J01814
$$ y = [415082, 156427, 48231, 215500, 611513, 220591, -169458, 294896, 204760, 371541, 219069, 143339, 299838, 246525, 90941, 69820, 681674, 108125, 202366, 398283, 193285, 459972, 1764, 258491, 199962, 372894, 32835, 476229, 111658, 242255, 240369, -36771, 378706, 242658, 365446, 230662, 210126, 450789, -38914, 361274, 157308, 281880, 451099, 85855, 330508, 116810, 251483, 138381, 449693, 552488, 564212, 159918, 306689, 321742, 545033, 146347, 313726, 539036, 194182, 154645, 293137, 65101, 491976, 457167, 250028, 627332, 393773, 712300, 96854, 368192, 327839, 159330, 351518, 480786, 214650, 578031, 70773, 574087, 467957, 74552, 574063, 54319, 373649, 351249, 259848, 264556, 366370]
17100C66370K31972B86667k4630L33983j10117K5753m8552j50057N1638O9584
17090D34269G1705L68406j63998P6516o6157M14616B86303M92442D6048M11375
17080D57423q4496L68855C31959J03915J81042B62421M6132K15732A80773J66005
17070C46778O8282M42702m27718A05821L23110K38158B95529M15594l19528j8119
17060C73476j1573R3589q3721L89557k88504J13627k64683k48m704L83068R7202
17049G97086n9846j0930k78086M1679o7300o3204K71012k68785K67421C06810
17038G27672J39556C17309J04375K41437k54364K56416m1979L77784l06220C42548
17027C75564K71896J86606l58064L93934m31811O3763K08383k74356L68516p0747
$$ y = [366370, 598342, 286667, 262037, 596020, 485903, 511656, 463104, 313047, 364685, 434269, 71705, 440111, 276113, 352629, 286472, 701088, 286303, 778745, 46048, 457423, 372927, 741782, 331959, 435874, 616916, 262421, 308553, 524285, 180773, 346778, 415060, 857762, 430044, 105821, 428931, 667089, 295529, 711123, 391595, 373476, 361903, 455492, 371771, 761328, 472824, 586451, 321768, 321520, 316816, 699884, 797086, 737240, 726310, 448224, 489903, 422603, 359399, 630411, 361626, 629047, 306810, 727672, 867228, 317309, 421684, 663121, 408757, 665173, 623194, 1000978, 694758, 342548, 375564, 647460, 834066, 476002, 869936, 438125, 501888, 710271, 435915, 804431, 733684]
17017G33684j35043j77484K68265K45211J29373l95557K1253o1040K2472K24866
17007H76000o3248j29006K56952L142D44203L72880j39135K07317r1963q276j57699
16996F27327n2790K33112O3881D34367L59749m1689J81805N7137l74652k82502
16986C34215J55948J17439L19039k43830l0628K26058J0475k54234J81099J7563
16976H33144J24100j89570K33972L69616o46673N3098l9069K48533l01283J78607
16966H64475J00245M7923j86214l0420P4860r1495k08512M77273j87324K48389
16956A109200l43265K70709J79830k34029k71974R5333L10715J72158k53523J28038
16946A163192n3775K02875k14955J41503j7836N6096J22394k57561J31753l4263
$$ y = [733684, 598641, 421157, 689422, 934633, 1064006, 668449, 689702, 628662, 651134, 876000, 812752, 683746, 940698, 943840, 444203, 817083, 677948, 885265, 793302, 785026, 627327, 574537, 807649, 871530, 434367, 794116, 752427, 934232, 991369, 616717, 334215, 490163, 607602, 926641, 682811, 652183, 878241, 888716, 634482, 815581, 833144, 957244, 767674, 1001646, 1371262, 724589, 777687, 738618, 987151, 685868, 864475, 964720, 1012643, 826429, 796009, 870869, 779374, 570862, 1048135, 860811, 1109200, 765935, 1036644, 1216474, 982445, 710471, 805804, 1116519, 1288677, 1035154, 1163192, 1109417, 1312292, 1097337, 1238840, 1221004, 1277100, 1399494, 1141933, 1273686, 1239423]
16936A239423l79688M78578k69231p9743K11214K07346l19009Q783p3201K52562
16926A277034J33162l89643N8757J82198k5812l92388M39323K21821j41534l80407
16916I82511M60958n3751M3077j22582J20443P98J28822j91938M0601P4921k5671
16905A458189k69686L02179J00010L08601k22856k89061J61606N1229r5251Q8945
16895A593905K05485q6414q651n0490J83538k18836J43058O544L04170k93278
16885A779031P3813P3963K2352Q7839J40577K1704k13618K43387j01433J92059
16875B319674m44888Q50L39778N5414J4061L383Q2480J98423K85757o55215L90376
16864B590093n0947J38260M272m6118k76252J43149K76964j30790M20532J31537
$$ y = [1239423, 859735, 1338313, 1069082, 989339, 1200553, 1407899, 1088890, 1097673, 1024472, 1277034, 1410196, 1020553, 1079310, 1261508, 1235696, 843308, 1282631, 1504452, 1362918, 982511, 1443469, 1389718, 1432795, 1310213, 1430656, 1431454, 1560276, 1368338, 1408939, 1483860, 1458189, 1188503, 1490682, 1590692, 1899293, 1676437, 1387376, 1548982, 1600211, 1504960, 1593905, 1799390, 1712976, 1704325, 1653835, 1837373, 1618537, 1761595, 1768139, 2072309, 1779031, 1852844, 1926807, 1949159, 2036998, 2177575, 2199279, 1985661, 2229048, 2127615, 2319674, 1874786, 1875636, 2215414, 2270828, 2284889, 2288272, 2370752, 2569175, 2854932, 2199717, 2590093, 2539146, 2677406, 2681678, 2635560, 2359308, 2502457, 2779421, 2648631, 3069163, 3200700]
16854C200700J56143k32254K33269n62465J17212K52420o9016L65526k93088O7417
16844C235864j5589J02563K48081m13891N42245q1130k98086N91349p1744j49810
16834C689852M51861n1146j45051j02562K45801M4021K12896p2353J26655q297
16824D391677L24959R3721k96529K48288K79266N9332J42168l50679J86417M90099
16814E568719J17276n8167J01909J40304J81566K13442j07049K47726j37996N14639
16804F782369k6457J67365J48340j52151O98799J18914M6816L17956k14107L49740
16794H237584L38323J92753J84642L17392L26800K37387k6306L35117N62430K79109
16784A0985231K91847M57362k68508P60229L09904P78766m8923L78841O13182
$$ y = [3200700, 3356843, 3124589, 3357858, 2795393, 2912605, 3165025, 3096009, 3461535, 3168447, 3235864, 3220275, 3322838, 3570919, 3157028, 3699273, 3618143, 3320057, 3911406, 3839662, 3689852, 4141713, 4090567, 3945516, 3842954, 4088755, 4132776, 4345672, 4273319, 4399974, 4391677, 4716636, 4810357, 4513828, 4762116, 5041382, 5100714, 5242882, 4892203, 5078620, 5568719, 5685995, 5627828, 5729737, 5870041, 6051607, 6265049, 6158000, 6405726, 6267730, 6782369, 6755912, 6923277, 7071617, 6919466, 7618265, 7737179, 7783995, 8101951, 7887844, 8237584, 8575907, 8768660, 8953302, 9270694, 9597494, 9834881, 9808575, 10143692, 10706122, 10985231, 11277078, 11734440, 11465932, 12226161, 12536065, 13314831, 13265908, 13644749, 14257931]
16775A4257931L52411N84043M73192M98150Q40826J47500P28584O54427P19696
16766A9256760Q04878M80627J294637L21146Q98579J141592Q16349J025774J194605
16757B7234947J308569J386952J241840J260751J672931J247258K087217J415040
16749C8855505K445165K048921K220998K751696K418721K766927L212374K927145
16741E9647452M051495L348703M204643M307805M958828N369844N171573N631405
16733I6691748O522810O629610O882239P619637P745092Q129147Q011945Q015312
16725A56247540Q388986P416724P553139O583723N908324M325801L563137J640423
16717B01627797O76364r21817k620993l823134m728203o245264o855209p907120
$$ y = [14257931, 14610342, 15194385, 15667577, 16165727, 17006553, 17154053, 17882637, 18537064, 19256760, 20061638, 20542265, 21836902, 22158048, 23056627, 24198219, 25014568, 26040342, 27234947, 28543516, 29930468, 31172308, 32433059, 34105990, 35353248, 37440465, 38855505, 41300670, 43349591, 45570589, 48322285, 50741006, 53507933, 56720307, 59647452, 63698947, 67047650, 71252293, 75560098, 80518926, 85888770, 91060343, 96691748, 103214558, 109844168, 116726407, 124346044, 132091136, 140220283, 148232228, 156247540, 164636526, 172053250, 179606389, 186190112, 192098436, 196424237, 199987374, 201627797, 202304161, 201382344, 198761351, 194938217, 190210014, 183964750, 177109541, 169202421]
16709A69202421q172893q041064q187859q642010p641709p665631p591811o609919
16701A06649525o837572o517806n637613n733192m839899m576881m581295l766823
16693F4158444l648921l463713l192624l195944k594698k639406k271273k310961
16685D0840904j764183k338283j779737j848596j443490j426336j456927r07627
16677B7875725j425937j364374j226910p20348q47071r60216r19861q64417p65332
16668A8781259o01883n14578r09015m69492n70013p21275l57425m13968n00358
16659A3723252n24789k17867n96906k62361o26491j21950l55611n06621k34480
16650A0276176l98543m4228p53680M6375l74465j03215P5273m75061j18331j53174
$$ y = [169202421, 161029528, 152988464, 144800605, 136158595, 128516886, 120851255, 113259444, 106649525, 99811953, 93294147, 87656534, 81923342, 77083443, 72506562, 67925267, 64158444, 60509523, 57045810, 53853186, 50657242, 48062544, 45423138, 43151865, 40840904, 39076721, 36738438, 34958701, 33110105, 31666615, 30240279, 28783352, 27875725, 26449788, 25085414, 23858504, 23138156, 22291085, 21330869, 20411008, 19546591, 18781259, 18179376, 17664798, 16755783, 16286291, 15716278, 14995003, 14637578, 14223610, 13723252, 13198463, 12980596, 12383690, 12121329, 11494838, 11372888, 11017277, 10510656, 10276176, 9877633, 9833405, 9079725, 9126100, 8751635, 8648420, 8723693, 8248632, 8130301, 7977127]
16640G977127o0402n44398p0766l280l38589n38538n287M2580l13625k56048K07093
16629F095867j05309n49248K5458K9129l49627K2791k61464k59810K37021k73038
16619D611770L63929o56242j29778J72903K28533l19908k48331m71860N81958
16610D132974l2847k43360o35613M35581k38579n5293J47009l15922J93797j79525
16600C208222j7227k59095K80871r5437j77577q958k02984J07049l44578N34989
16590C025275l34284J35944j71023k30324l4j83119j47076J60871K38145k79453
16580B214922J44246o0585M09219o13229N3393k53296J15946m7355L6476K15140
16570B214877k45149k05181L70111l02622m80831Q90743m86304J73158k30468
$$ y = [7977127, 7916725, 7372327, 7301561, 7298281, 6959692, 6421154, 6415867, 6458447, 6144822, 5888774, 6095867, 5990558, 5441310, 5466768, 5495897, 5146270, 5169061, 4907597, 4647787, 4884808, 4611770, 4975699, 4319457, 4189679, 4362582, 4591115, 4271207, 4022876, 3551016, 4132974, 4100127, 3856767, 3221154, 3656735, 3418156, 3362863, 3509872, 3193950, 3387747, 3208222, 3190995, 2931900, 3212771, 3117334, 2939757, 2930799, 2727815, 2834864, 2490286, 3025275, 2690991, 2826935, 2655912, 2425588, 2425554, 2242435, 2095359, 2256230, 2494375, 2214922, 2359168, 2298583, 2707802, 2094573, 2147966, 1894670, 2010616, 1963261, 1999737, 2214877, 1969728, 1764547, 2134658, 1832036, 1351205, 2241948, 1755644, 1928802, 1698334]
16561A698334j38011M1037k62041K44564k983o1272K3842j51029K49385j62761
16551A479065K00153j09374k00234J98632j14768L3677j47323p3350J22983J36758
16541A526219k5974k00000J90501l64820O33272q00385L22290J86899l42303o1951
16531A063748o9017K93414k44494k88855M57468m69791J09577M6272K05799r5414
16521A008707p0699M554j09273L73014j45517j10487O8772j06037o9068P4380
16511I18346j65913K06450N0144r4392j38174k40391M91188m8362m86482L66235
16501H58649j83287K40675k48708L95731l70043k05617K28647p1857J02458j1717
16491G34931j35309R0934R5553K56692D12966L86525k07166j36314L8772J42762
$$ y = [1698334, 1560323, 1601360, 1339319, 1583883, 1580900, 1519628, 1543470, 1392441, 1641826, 1479065, 1679218, 1569844, 1369610, 1568242, 1453474, 1487151, 1339828, 1266478, 1389461, 1526219, 1500245, 1300245, 1490746, 1125926, 1759198, 958813, 1281103, 1468002, 1125699, 1063748, 994731, 1288145, 1043651, 754796, 1212264, 742473, 852050, 898322, 1104121, 1008707, 938008, 942562, 833289, 1206303, 1060786, 950299, 1019071, 913034, 843966, 918346, 752433, 958883, 1009027, 914635, 776461, 536070, 1027258, 978896, 492414, 858649, 675362, 916037, 667329, 1063060, 693017, 487400, 716047, 644190, 746648, 734931, 599622, 690556, 786109, 1042801, 412966, 799491, 592325, 456011, 494783, 637545]
16481F37545N85382E57366K32019k01087K18453k28649K8234o6990J32149k16153
16471D55342O7927K47927k33468j57315K12146J36807k29725O539p7308j07245
16461C21627J95410q8876N5086k53j36009J1415M50024j94979C05081M80131j05132
16450F80080J1047k74467P8792j34976J17157R9409K0316B90965J91412k34616
16440B47761J9121J12227J34909A83877M10276M9427H8887M26297K2711k25403
16430C12492L2735M76744B19600J11197K55882j28351N7894K43124B50070J09519
16420C59589q1675P6070K00441j5576j30675j97699H0060K95961J98083n1873
16410E22231A16877L97691k53148p8788L36351K49299l57362r7523A32719L83834
$$ y = [637545, 1222927, 557366, 789385, 588298, 806751, 578102, 606336, 539346, 671495, 455342, 523269, 771196, 537728, 380413, 592559, 729366, 499641, 506180, 428872, 321627, 517037, 428161, 483247, 482994, 346985, 358400, 808424, 613445, 305081, 785212, 680080, 691127, 416660, 495452, 360476, 477633, 577042, 597358, 290965, 482377, 247761, 266882, 379109, 514018, 183877, 594153, 643580, 88887, 515184, 537895, 312492, 345227, 821971, 219600, 330797, 586679, 458328, 516222, 759346, 250070, 359589, 277914, 353984, 554425, 538849, 408174, 210475, 80060, 376021, 574104, 522231, 116877, 514568, 261420, 182632, 518983, 768282, 410920, 313397, 132719, 516553]
16400E16553B9397P632K16968b2846q2033E41637A88514L00161j8776k21241A03097
16388D32387A38743L72817A12131M54099j72733J22247j50294G7509L15650J4120
16378D07279I5480K67177A25339E1506J97662M5688J32036j92707j09919n0855
16368G3411J23130P5454j9858j2262C5305Q4420n521K42463e0381B39232p754
16357B31478G8572M76915A25363O136b4603B63289n5117J70759D1323P8986N022
16346A25331J61808e628A15306M1720e2144A63580f1939C67189D1134a08710B05135
16334A89422B9037J58776d3104r9358A25379E9719K4393J07844j3693N6304A09432
16322I6913B5873O8288J71006P6431a5330G2829R8647g1247l9368b7409A58031
$$ y = [516553, 29397, 37029, 253997, -22846, -104879, 541637, 188514, 488675, 469899, 248658, 103097, 432387, 138743, 511560, 112131, 566230, 393497, 515744, 365450, 77509, 393159, 407279, 95480, 362657, 125339, 51506, 249168, 294856, 426892, 234185, 124266, 73411, 196541, 271995, 252137, 239875, 35305, 119725, 114204, 356667, -50381, 239232, 231478, 78572, 555487, 125363, 131499, -24603, 263289, 208172, 378931, 41323, 120309, 125331, 287139, -5628, 115306, 157026, -52144, 163580, -61939, 367189, 41134, -108710, 205135, 189422, 29037, 187813, -43104, -142462, 125379, 59719, 84112, 191956, 178263, 234567, 109432, 96913, 25873, 94161, 265167, 341598, -15330, 72829, 171476, -71247, -110615, -27409, 158031]
16310b7872A96917p5321b5139k27092A92856h7594A36264a31912B9639K39574
16300B69213J31415q8454N0436r8862a13459D81980f3698k23068A26644n5850
16290G0794J29016D4806P1344J73072a14849M7901c935A7592a61534A72045p503
16279A64542G77K89205c32607F3657a28302A39239J55870c24732B54744p0497
16269A84247K46560L1149A69734a63659A58958O4338j10423n4268L68070C4430
16258B66960a83876A924K1360J51622i3135A20783A4088K56137k0918r978b17178
16246b37625n2279F925f9299B32466i4966D67708A15926b6972A41148n5494h1683
16234A71282K26758f2233A04225L30321B06189F0276D568L79915A05543d7608
$$ y = [-27872, 196917, 121596, -25139, -252231, 192856, -87594, 136264, -131912, 29639, 269213, 400628, 312174, 362610, 263748, -113459, 481980, -63698, -286766, 126644, 70794, 199810, 44806, 116150, 289222, -114849, -66948, -3935, 17592, -161534, 172045, 164542, 777, 289982, -332607, 63657, -128302, 139239, 295109, -324732, 254744, 184247, 430807, 461956, 169734, -163659, 158958, 223296, 112873, 58605, 426675, 34430, 266960, -183876, 1924, 23284, 174906, -93135, 120783, 14088, 270225, 249307, 239329, -217178, -237625, -289904, 6925, -69299, 232466, -94966, 467708, 115926, -26972, 141148, 85654, -81683, 171282, 398040, -62233, 104225, 434546, 206189, 60276, 4568, 384483, 105543, -47608]
16223b17126i662B11404I4830J43432d4620J7487G9208J07716a8169n7640n5310
16212a31119A96951B9783O3116B282L1881B64d764A67975b3937A08653r481A4602
16199B85990A23140J08692e7907j22773c2489j49854a1362A81322B7199L2736
16189E9935e2614A9161c44236A34469l497M587a44050A16175a88069A55894n5306
16178A00588D2925j0009r814K26550P2212k7618d9820j47987A98525o0402i2549
16166i8749C55466m8579f5722I9019A0786J94185R6921j22557o4231h090A45770
16154A43333a7590r6673e867j77042B16964j6349Q2394g5522l5762C5990c12367
16142e7967H4373c8477j71087A63217J10322B4913e5297H612c599j90833A45921
$$ y = [-217126, -9662, 211404, 94830, 238262, -44620, -27133, 79208, 186924, -18169, -75809, -131119, 196951, 29783, 92899, 2282, 34163, 264, -4764, 167975, -23937, 108653, 99172, 14602, 285990, 123140, 231832, -57907, -180680, -32489, -182343, -11362, 181322, 27199, 59935, -52614, 19161, -344236, 134469, 130972, 135559, -144050, 116175, -188069, 155894, 100588, 42925, 32916, 23102, 249652, 321864, 294246, -49820, -197807, 198525, 138123, -92549, -98749, 355466, 306887, -65722, 99019, 10786, 204971, 301892, 179335, 115104, -8090, 145770, 143333, -17590, -114263, -5867, -182909, 216964, 200615, 283009, -75522, -111284, 35990, -312367, -57967, 84373, -38477, -209564, 163217, 273539, 24913, -55297, 8612, -3599, -194432, 145921]
16130a51114c619G0654J4606a91653N1059D4728d91119B19538a57622j35619E8246
16118A60391L5435L6730j9620a63997D5053a88543j19187J20098B10828d09031
16107a28757A55723c1784A01735C5831O4437f1170A20043a14488p2857a6095j21580
16096a37675e4873F1509a21583p0099H1983f5197l9470k06033A33984O4833a1681
16084G9997M3194R5265D2294b3067p3421n2658J8677D1370F959J09793k5304h9916
16071b07750M6682B23267L3980f2516j65040f3711H9189b37289G2796J75703d7796
16059a967j99350a3151H3563D95a76366b6199A22860D7774J3082P1767b18655
16047A71277a026j98606A8046K19830r5097k0887f2604G593B705J03902k1934
$$ y = [-151114, -3619, 70654, 85260, -191653, -140594, 44728, -491119, 219538, -157622, -293241, 58246, 160391, 195826, 232556, 212936, -163997, 45053, -188543, -307730, -187632, 210828, -409031, -128757, 155723, -31784, 101735, 35831, 100268, -61170, 120043, -114488, -187345, -16095, -137675, -54873, 61509, -121583, -191682, 81983, -65197, -104667, -310700, 133984, 198817, -11681, 79997, 123191, 218456, 42294, -23067, -96488, -149146, -130469, 41370, 6959, 116752, 91448, -89916, -207750, -161068, 223267, 257247, -62516, -227556, -63711, 89189, -237289, 72796, 248499, -47796, -1967, -201317, -13151, 83563, 495, -176366, -26199, 122860, 47774, 60856, 132623, -218655, 171277, -1026, -199632, 18046, 237876, 142779, 121892, -62604, 7593, 2705, 106607, 84673]
16036H4673a02500B3672P5017J9725M2891b10692o769A71572h5966B11271b7261
16024b33810k7891j89896B68006b6929F6653O7670k123a9684I4478b1486o9354
16013i0840j64314f2676A99899b18486J4735A51380L3293b71241i1106j07052
16003a98158N366a0995k82988A73150K4558G0085A3854b02079K0841e4143I9163
15991e4533n11005B4066d37698C8147L6367g2381l7381G9595M0183Q0068I2255
15979E314c20438J23397E15899B6248K4506a13060j17145A59376a85206j11840
15969b97046J06153F517i3354B06706a62600e0422B15781b31106a1992B25292
15958h6477m9512B80318c1853k48543A27942j6760B7635f4918B89321e0190q2496
$$ y = [84673, -102500, 23672, 98689, 118414, 161305, -210692, -217461, 171572, -85966, 211271, -27261, -233810, -261701, -451597, 268006, -26929, 66653, 134323, 132200, -19684, 94478, -21486, -90840, -255154, -62676, 199899, -218486, -203751, 151380, 184673, -271241, -91106, -198158, -192792, -10995, -293983, 173150, 197708, 70085, 13854, -202079, -181238, -54143, 99163, -54533, -565538, 24066, -437698, 38147, 74514, -72381, -109762, 79595, 119778, 199846, 92255, 5314, -320438, -197041, 515899, 26248, 50754, -113060, -230205, 159376, -185206, -297046, -190893, 6517, -93354, 206706, -162600, -50422, 215781, -231106, -11992, 225292, -86477, -135989, 280318, -31853, -280396, 127942, 111182, 27635, -64918, 289321, -50190, -132686]
15947a32686E3833L415a02101D231J21194K5442b18164A22380L0614a37593I3652
15935E5261K36104A7377b6301r3142e1517b1261l87515a36161A02207J55333r3460
15924A64080a00077A34968b04573e823F5169i6134n1222C43080a69994j33817
15914c03811a40675J7351j63107e0184E87406e1290p8731B640g8909k53463q803
15903c41175g9114n075A4618a47779F9078j2610a38898k28615a17000A77303a22449
15891D0419e9241k83163B45076c3714l86737D092a92435M4942a038B5600a21728
15879A06876A3432Q5541b96627A37022L0006c7880k4845A33077l7577k8126e6383
15867i3914M4533B68407I6906b043C8662a30748e802B02337c7016k96196A84388
$$ y = [-132686, 53833, 57248, -102101, 4231, 125425, 150867, -218164, 122380, 152994, -137593, 93652, 55261, 291365, 17377, -26301, -119443, -51517, -21261, -408776, -136161, 102207, 257540, 164080, -100077, 134968, -204573, -5823, 65169, -96134, -147356, 343080, -169994, -303811, -140675, -123324, -286431, -50184, 587406, -51290, -130021, 2640, -78909, -332372, -341175, -79114, -84189, 14618, -147779, 69078, 56468, -138898, -367513, -117000, 177303, -122449, 40419, -59241, -342404, 245076, -33714, -420451, 4092, -192435, -147493, -1038, 25600, -121728, 106876, 13432, 98973, -296627, 137022, 167028, -37880, -62725, 133077, 95500, 67374, -56383, -93914, -49381, 268407, 96906, -2043, 38662, -130748, -5802, 202337, -37016, -333212, 184388]
15855b90923a30877j22728C04914I521Q2610f3375l4213k40871B44417J1534a04769
15843A6711c6286n6341k21385A91787l2335o4798g6304p5939a5928p2807K7634
15832f1101A61649E0821c73405b2740N300k13414A41545a2840k87531C1235N0728
15821H1963B6372K45589f5947a4490j80414i128l43109G6369c60388B11178a03985
15809A09163h8963C40016b44868E5215L25679A8827L49685D4030a11621m8514
15799a60135B28716a64379f8673E4867a71619P7747C62856A15790M7779B854N9696
15788F2550K346a08001A94147a69538h622F7080b36758A83880a18687A85782b01281
15776B42112j04810J10748J23359G7564O2523a21j23293k5251j16057h4644J1764
$$ y = [-290923, -130877, -253605, 304914, 9521, 92131, -63375, -97588, -338459, 244417, 255951, -104769, 16711, -36286, -92627, -314012, 191787, 159452, 94654, -76304, -152243, -15928, -88735, -61101, 161649, 50821, -373405, -22740, -17440, -230854, 141545, -12840, -300371, 31235, 81963, 26372, 271961, -65947, -14490, -194904, -9128, -352237, 76369, -360388, 211178, -103985, 109163, -88963, 340016, -244868, 55215, 380894, 18827, 368512, 44030, -111621, -160135, 228716, -164379, -68673, 54867, -171619, -93872, 362856, 115790, 163569, 2854, 62550, 64896, -108001, 194147, -169538, -8622, 67080, -236758, 183880, -118687, 185782, -201281, 242112, 137302, 248050, 371409, 77564, 140087, -121, -123414, -148665, -264722, -84644, -72880]
15765g2880F5735f2222B15006b49968I2870O3574l1457a04706j28404B9829a97858
15753g2654m4482m0575q6253O1975c0841A21184b23545e4852E5879c77421O0729
15742c16692E82071a70296E3253g2127A12310h6301A26451c02116B91651C9364
15731c37369J38258A39767L8702J7428C8468O2294p785M9382J25692P1670i0980
15719A8815K78389B80a24416c8666A99792d46k26432A55359C7893c2140B03542
15707G0375f2014j83446p410A00410b68497K7955C0284a00227k1993c5951n7323
15696i3274h40m8955D48842a17721c5108k82179B19222G5199R4316B9038c8578
15684a45884G9392K0732m941P0235b80186a05338j75067C37557b4959m2635j35684
$$ y = [-72880, 65735, -62222, 215006, -249968, 92870, 156444, 124987, -104706, -233110, 29829, -197858, -72654, -117136, -157711, -243964, -181989, -30841, 121184, -223545, -54852, 55879, -377421, -316692, 582071, -170296, 53253, -72127, 112310, -86301, 126451, -302116, 291651, 39364, -337369, -199111, 139767, 178469, 195897, 38468, 100762, 92977, 142359, 268051, 339721, -90980, 18815, 297204, 280, -124416, -38666, 199792, -446, -226878, 155359, 37893, -32140, 203542, 70375, -62014, -245460, -252870, 100410, -268497, -240542, 30284, -100227, -122220, -35951, -93274, -840, -49795, 448842, -117721, -35108, -317287, 219222, 75199, 169515, 29038, -38578, -145884, 79392, 100124, 95183, 165418, -280186, -105338, -280405, 337557, -24959, -67594, -203278]
15673b03278p1438e5901A85062M341a46225I129b77336F8410K10789q1717c26412
15661E0406j5108a55602e4986j29473A24921P6646a8472o2425k54682e6499k08034
15650b64533A87264r2107M811a02039K8440j989B13310c49670a4846B38039K6511
15639B64550b13152a5409B78758B5031K3276R0272l5934K90296H2240a70427a309
15627b7299k45297A6907a73182B35443g24D26084c5002B71747a75254A36361L0535
15616A66896a42957L3153b0270C20462A19132a09048A76565f5374B24165A9809
15605b31503B1262a17194A79506i5244a5502o3431r8898H5173j9251H478K0094
15594B8572f4976m35941C33550A17687O5845b0962C4507M05664g0192H8653b5150
$$ y = [-203278, -274716, -55901, 185062, 189403, -146225, 9129, -277336, 68410, 279199, 197482, -326412, 50406, 35298, -155602, -54986, -184459, 124921, 201567, -18472, -80897, -335579, -56499, -264533, 187264, 95157, 99968, -102039, -73599, -75588, 213310, -349670, -14846, 238039, 264550, -213152, -15409, 278758, 25031, 48307, 138579, 102645, 392941, 82240, -170427, -1309, -27299, -272596, 16907, -173182, 235443, -724, 426084, -35002, 271747, -175254, 136361, 166896, -142957, -109804, -20270, 320462, 119132, -109048, 176565, -65374, 224165, 19809, -231503, 21262, -117194, 179506, -95244, -15502, -78933, -177831, 85173, 65922, 8478, 28572, -64976, -500917, 333550, 117687, 183532, -20962, 34507, 440171, -70192, 88653, -25150]
15582E1893L4270i7130A0393b16110M5347M015r6710a07459K9438m647A5607b26876
15569f3392k44269D0613K36492A15640O419e9993B37931H036R8275k5511L06229
15558C87029A20992O1529g677B9591a64017j27730A39081b8650j49991C57105
15547B57362E9811J27708n4903a214k86598B94110A3528a28856G8927b62129f8817
15535A43598J65646A09416g4532A2590f6771A4220h4972B69060i6714j00458A44622
15523I3401a25177J7973A73495J75223a90253M7273L3039k3547N6418K1027I1687
15511c4788D5181c83070a3768I8312a47230d6704l06118C42608j58085M0307c72278
15499A37265A3996J34753b2005A81440A6111M0981d44012G2617b14767m8280A54183
$$ y = [51893, 86163, -97130, 10393, -216110, -170763, -166748, -263458, -107459, -78021, -82668, 15607, -226876, -63392, -307661, 40613, 277105, 115640, 122059, -59993, 237931, 8036, 106311, 80800, 387029, 120992, 182521, -7677, 29591, -164017, -291747, 139081, -28650, -178641, 357105, 257362, 59811, 187519, 132616, -1214, -287812, 294110, 13528, -128856, 78927, -262129, -68817, 143598, 309244, 109416, -74532, 12590, -66771, 14220, -84972, 269060, -96714, -197172, 144622, 93401, -125177, -107204, 173495, 348718, -190253, -142980, -109941, -133488, -77070, -56043, 91687, -34788, 45181, -383070, -13768, 98312, -147230, -46704, -352822, 342608, 184523, 224830, -372278, 137265, 13996, 148749, -22005, 181440, 16111, 57092, -444012, 72617, -214767, -263047, 154183]
15487c8772A69833h5903j05979A51844a12830A54540P5361A0332L8382e6943r9124
15476a56067e7148l18026J38639a08800B25893I6139a18044A61930N8016a94230
15465A38443o6830P7464J2992c8027p8091j08053c5452A83956b460n0536A49358
15453a19830G2817J17132J31204A03999a78522d2285A67988D5591Q9539B4785
15442d8520j70732B35363a39272m984C94941D8087c80985C7554d89971a1902B47604
15430a75372C46693I4795b14004i4024j43762H3173a72018j88373A8084b05085
15419i0494C22638a02405H4364g8416E6879b8911G1093B4075L452O732i6610A46196
15406a4449n5261n7148A76412G2005a5858B1756L10555a43405O139D9544J06456
$$ y = [-38772, 169833, -85903, -191882, 151844, -112830, 154540, 229901, 10332, 48714, -56943, -156067, -57148, -375174, -236535, -108800, 225893, 96139, -118044, 161930, 219946, -194230, 138443, 71613, 149077, 162069, -38027, -116118, -224171, -35452, 183956, -2460, -52996, 149358, -119830, 72817, 189949, 321153, 103999, -178522, -42285, 167988, 45591, 135130, 24785, -48520, -219252, 235363, -139272, -144256, 394941, 48087, -380985, 37554, -489971, -11902, 247604, -175372, 346693, 94795, -214004, -94024, -237786, 83173, -172018, -360391, 18084, -205085, -90494, 322638, -102405, 84364, -78416, 56879, -28911, 71093, 24075, 27527, 34259, -96610, 146196, -14449, -69710, -126858, 176412, 72005, -15858, 21756, 332311, -143405, -137266, 49544, 156000]
15395A56000a07380j8477a9084B43191H8601d8161B73517K7573C9274M9962e3713
15383h738j85483F7354B4578b25053b3963j08478n5092G5421k9361J11314e5446
15371a86371H1704h4111j32392N7191A35865I857h2545A51924b10257J4316H6237
15359C3243a67066A19296a05553A87452b26544b376C18920A02922e1185C44297
15348C3178c2443D7338J63807J46331f7164j49700E4529A0083f7699k20170a293
15336B23442F7918L44199K75111a60200A82396h403B3544d74446D58810H3600
15325b48879A35260O1223b18999C16376j28013a08693j23166J09330A08658K11035
15315C19693a99673A71292B5197h7725J1720A37418L2479a78182g8672D7705J75943
$$ y = [156000, -107380, -125857, -19084, 243191, 88601, -48161, 273517, 301090, 39274, 89236, -53713, -8738, -194221, 67354, 24578, -225053, -23963, -132441, -187533, 75421, 46060, 157374, -55446, -186371, 81704, -84111, -216503, -159312, 135865, 9857, -82545, 151924, -210257, -195941, 86237, 33243, -167066, 119296, -105553, 187452, -226544, -2376, 318920, 102922, -51185, 344297, 33178, -32443, 47338, 211145, 357476, -67164, -216864, 54529, 10083, -67699, -287869, -1293, 223442, 67918, 412117, 687228, -160200, 182396, -8403, 23544, -474446, 458810, 83600, -248879, 135260, 196483, -218999, 316376, 188363, -108693, -231859, -122529, 108658, 319693, -199673, 171292, 25197, -87725, -76005, 137418, 169897, -178182, -78672, 47705, 223648]
15304B23648o4317O9345a64085A18231P2077n5059b75769B81656j26588m296a62026
15292d1019C42044F4723b71232A80074b05075A44385a10832C7695J34341p641
15282A64395G6414a97198A37085R9870j9099m2805i3582B50765b1624A79209a04949
15270b31647P0106B28250c4686A93707F6746k4208g7044F0590a1524A25589a07688
15258a7751B63854a92098N3211B4385N7421K18839p3410k547E1539Q28436M32235
15247A312210j36596j93940N8216l43316k79569q3097E3544a40849e2514F4103
15236A46478o9745d3983d05q217B48754F4923L33078A02018g4927C09282a16492
15224b9602p2068B27886A03909Q0764q9065a07495A14911a60916C2607L9720N0115
$$ y = [223648, 159331, 228676, -164085, 118231, 190308, 135249, -275769, 281656, 155068, 150772, -162026, -41019, 342044, 64723, -271232, 180074, -205075, 144385, -110832, 37695, 172036, 164395, 76414, -197198, 137085, 236955, 217856, 175051, -93582, 250765, -21624, 179209, -104949, -231647, -161541, 228250, -34686, 193707, 66746, 42538, -77044, 60590, -11524, 125589, -107688, -17751, 263854, -192098, -138887, 24385, 81806, 300645, 227235, 224688, 51539, 879975, 1312210, 1175614, 981674, 1039890, 696574, 417005, 333908, 53544, -140849, -52514, 64103, 146478, 76733, -43983, -405, -8622, 248754, 64923, 398001, 102018, -74927, 309282, -116492, -29602, -101670, 227886, 103909, 184673, 95608, -107495, 114911, -160916, 32607, 72327, 122442]
15213A22442L04362a88246L8738A73652m3573a13917A39198f9169C82210a24948
15202f282A41237E8412n014c05002A76983H0130a51112G4068K71914j69035a76407
15190d4840A36706F405J10715a38260C60846A38211E4399O0582n7068a00490j92183
15179b92673A81926N109J84182A44004d99161f1688r1305f3522k4657G7009K1456
15168I8465a67231A47647O836e3525C19404j52222Q7892a66B02912R6635f2479
15156C781i7988A29943D3054J35169L5099g5694E1122J76766G9420a05909A38570
15144C52290b51559C14193b00342p3569C6162P0378J68745M18142b9541A47082
15133A96275J01525a4983C06154l2133f9339E69377k31293o1993C7188A191N0754
$$ y = [122442, 426804, -188246, -149508, 173652, 130079, -113917, 139198, -69169, 382210, -124948, -6282, 141237, 58412, 53398, -305002, 176983, 80130, -151112, 74068, 345982, 176947, -176407, -44840, 136706, 6405, 117120, -138260, 360846, 138211, 54399, 114981, 57913, -100490, -292673, 181926, 187035, 371217, 144004, -499161, -61688, -152993, -63522, -88179, 77009, 98465, -167231, 147647, 154483, -53525, 319404, 167182, 255074, -166, 202912, 299547, -62479, 3781, -97988, 129943, 43054, 178223, 213322, -75694, 51122, 227888, 79420, -105909, 138570, 352290, -251559, 314193, -200342, -273911, 36162, 106540, 275285, 693427, -29541, 147082, 196275, 297800, -14983, 306154, 274021, -69339, 569377, 338084, 276091, 37188, 1191, 51945]
15122E1945K05690J77656c4542C7214M6968a35952B60774b09621B95902A28851
15111A29578L5158j4918a91901G2298J38182a26672A15127f5305A61565a23722
15100A27309R753d3674D95792B042L23496h9885c5718e653A15694O9289n4167
15089A30816A1307a70069I7477A4326a44416B20675J18684b39476A66760a63918
15078H2842C26Q6125L66393A16139d595A947a720j7126D8551N21306A73897e3424
15065A55449L5789G1476l2336L62182I4562K74531r8427l7915c5817A23821n1269
15054G2552M18444A27173K62300j39970J4142j13333a40137O6656A28366B4156
15043A44750J17675r7621J52417A35408J09123a24344B70780A26588R2344G206
$$ y = [51945, 257635, 435291, -34542, 37214, 84182, -135952, 260774, -209621, 295902, 128851, 129578, 164736, 149818, -191901, 72298, 210480, -126672, 115127, -65305, 161565, -123722, 127309, 137062, -43674, 495792, 2042, 325538, -89885, -35718, -5653, 115694, 184983, 130816, 11307, -170069, 97477, 14326, -144416, 220675, 339359, -239476, 166760, -163918, 82842, 326, 86451, 452844, 116139, -4595, 1947, -1720, -18846, 48551, 569857, 173897, -53424, 155449, 191238, 71476, 39140, 401322, 94562, 369093, 270666, 232751, -35817, 123821, 72552, 490996, 127173, 389473, 249503, 263645, 150312, -140137, -73481, 128366, 24156, 144750, 262425, 164804, 317221, 135408, 244531, -124344, 270780, 126588, 218932, 7206]
15032B64080m7096Q7364A17282J33601n8027J87269b57429C4491L26981A29314
15021D63349J97028B51871q4607D6972J79949J67369A23491J85209j30421J3782
15011A92061L0508C3488J71933r0889K77760j78436A01118L63570h3211C92538
15000C21990l8763n6638A10395K2480J08428a19622B26825G5134J60948R79J65803
14989D02864j76665L45300j08548k19376D236J79788F7337K86107G6980J64158
14979B41138G9621L65232k02067l8318G3480D909L02935F9171J36758K80026k26140
14968B59815O2725A32334O845O6025K49813j42356A10509J52928J00950F2088
14957A66013K91721D7823M04925K5431A74700R8139J47297K2283R3489D6252L95748
$$ y = [264080, 216984, 304348, 117282, 250883, 192856, 380125, -257429, 34491, 361472, 129314, 463349, 660377, 251871, 167264, 46972, 226921, 394290, 123491, 308700, 178279, 192061, 222569, 33488, 205421, 114532, 392292, 213856, 101118, 464688, -83211, 392538, 321990, 283227, 226589, 110395, 132875, 241303, -119622, 226825, 75134, 236082, 237061, 402864, 226199, 571499, 462951, 243575, 4236, 184024, 67337, 353444, 76980, 241138, 79621, 444853, 242786, 204468, 73480, 4909, 307844, 69171, 205929, 485955, 259815, 322540, 132334, 139179, 205204, 455017, 312661, 110509, 263437, 364387, 62088, 166013, 457734, 47823, 452748, 478179, 174700, 272839, 420136, 442419, 535908, 46252, 442000]
14946D42000j98125a07371C18673j33531J6154K01886K40534A71135K35703H3640
14935A75526a5433C1715J72813Q2362J64983B22364K35109j15962J30517l6226
14925D35802j62105J70621j11671m956j16467j9361G8941M30690p3618m6904d6632
14913B71099c5946C94664p8873L0947q6144K91722H1407K32110J24955l0653p2144
14902C35675L9131N0280J91165B18137N413J82457Q5690B01310o5246K88736j56660
14891B68140J74269j05899e8605A83474A8544L639N0282K44346j22759J62653
14881C56705n8385l400K34586k30850q5631J53994K67312j33174L6154o435C7624
14869C01879o8625p2622J05326H3959N45735l2095L6421j77308m0766A20212B3533
$$ y = [442000, 243875, -107371, 318673, 185142, 201296, 403182, 643716, 171135, 406838, 83640, 175526, -15433, 31715, 204528, 286890, 451873, 222364, 457473, 341511, 472028, 435802, 273697, 444318, 332647, 327691, 211224, 191863, 78941, 509631, 436013, 389109, -46632, 271099, -35946, 394664, 315791, 346738, 260594, 552316, 81407, 313517, 438472, 407819, 335675, 374806, 425086, 616251, 218137, 223550, 406007, 491697, 201310, 136064, 424800, 268140, 442409, 336510, -58605, 183474, 18544, 22183, 72465, 316811, 194052, 356705, 298320, 294920, 529506, 298656, 213025, 367019, 634331, 501157, 537311, 530876, 37624, 301879, 233254, 160632, 265958, 83959, 629694, 597599, 634020, 456712, 415946, 120212, 23533]
14857D95007o9246j68560M79278Q0212k38402k38644J50657R0963j99648J29132
14847E10749r6569j37123Q1082K05787c2986C90890Q1414m4919R2427J22257r4991
14836E47078j50053k3182Q6745k9328J83362p0748B45455K72123j11895J76006
14826E81689M6890B55745K96301m5193m9541J29995A20276M47351A95897C7978
14815D43155k11322N06271k87799B08232K33282Q1313R6050k34212L8569l1227
14805C92007K21536j51797J27851k56473P1527R4639Q3669k85466L5334J16368
14795D49195J49012k16748K3899K73258r9763j46448K83090j56512k64539K50321
14785E44765Q1961j79305J39253j50661J79165O0469m1896k04277J84756B36108
$$ y = [495007, 425761, 257201, 736479, 816691, 578289, 339645, 490302, 581265, 381617, 510749, 414180, 277057, 358139, 563926, -32986, 390890, 472304, 427385, 519812, 642069, 547078, 397025, 373843, 460588, 431260, 614622, 543874, 245455, 517578, 405683, 581689, 628579, 255745, 552046, 506853, 457312, 587307, 120276, 567627, 195897, 37978, 443155, 231833, 738104, 450305, 208232, 441514, 522827, 618877, 384665, 423234, 392007, 613543, 461746, 589597, 333124, 404651, 499290, 582959, 297493, 332827, 449195, 598207, 381459, 405358, 678616, 578853, 432405, 715495, 558983, 294444, 544765, 626726, 447421, 586674, 436013, 615178, 675647, 633751, 429474, 614230, 236108]
14774F18839L90949j87530l42636J2574J89805J063j96134j93308K82756o6152
14764E10226K57660k70086K76505k15476Q144j46529K9211l6865K78420J13909
14754H05119C66915J01655L33123l3507K1258L8986l60380l9554P6555K27458
14744G32509r5560p2490K69667j88198P8283j39198B17056L71256L9070j98077
14734D29305M04610n8168r0643m6956P9871J5425j58278K8463j9767L30172j25550
14723G88484l20927K60247L45397D09563M36372L06338k15074k66136k3814J45118
14713G92367k5498L4727R0232O7700j78527j58417L11566l0307k02153K14054
14703I15744N799k41409N53192D47896K96633J22747K4897k82346O9381K05805
$$ y = [618839, 1009788, 822258, 479622, 492196, 682001, 683064, 486930, 293622, 576378, 510226, 767886, 497800, 774305, 558829, 566973, 420444, 449655, 412790, 691210, 805119, 366915, 468570, 801693, 768186, 789444, 828430, 468050, 428496, 505051, 732509, 636949, 564459, 834126, 645928, 724211, 585013, 217056, 588312, 627382, 429305, 833915, 775747, 685104, 638148, 718019, 733444, 575166, 603629, 583862, 914034, 788484, 467557, 727804, 1073201, 409563, 845935, 1152273, 937199, 671063, 647249, 792367, 766869, 801596, 891828, 959528, 781001, 622584, 934150, 903843, 701690, 915744, 921543, 680134, 1233326, 447896, 744529, 867276, 892173, 609827, 679208, 885013]
14693H85013j4673n8834L18550k42525O7871o0856n4042R4015j68872O014J33739
14682I05400j46684n8502Q945M71204k08453m8358K44816k10729k6677k4828J8718
14671I24852j54353J00118J13089K7176K05793M9504m49819K94979k49757R2430
14661I54012J46554j86503j09807K65551k85025K43600K50182l10140J81298l53134
14651G96588Q9478J48388j3976K10971J4806P1165l07412j2874J14566J28696
14641A240396j04789L79565k10279k71805K06200j21150K2841L4590J97236l62805
14631A010000L52011j08668K55610j07074j36551R172K0633Q3578J8740J72411
14621A569862j63961j30750J45024p5922k4615J39890j4780n7278r3608N14647
$$ y = [885013, 870340, 811506, 1130056, 887531, 955402, 894546, 840504, 934519, 765647, 771661, 905400, 758716, 700214, 709159, 1180363, 971910, 923552, 1168368, 957639, 930962, 906134, 924852, 770499, 870617, 983706, 1010882, 1216675, 1266179, 816360, 1111339, 861582, 954012, 1100566, 914063, 804256, 1069807, 784782, 1028382, 1278564, 968424, 1149722, 796588, 886066, 1034454, 1020478, 1231449, 1246255, 1317420, 1010008, 997134, 1111700, 1240396, 1135607, 1515172, 1304893, 1033088, 1239288, 1118138, 1140979, 1175569, 1372805, 1010000, 1362011, 1253343, 1508953, 1401879, 1265328, 1274500, 1295133, 1378711, 1397451, 1569862, 1405901, 1275151, 1420175, 1344253, 1319638, 1459528, 1444748, 1387470, 1293862, 1808509]
14611A808509l44161M952j10932R4941L60568k33764j94486L26728j24666l9540
14601A548149J74947m28852O67574m32420K84507o81466N13709r5914k35924M24136
14591A738446k10877J87555K83066k28189k21010p4725K67653o7093K27376j13436
14581A788766p172q8876K69057N5815m50696M28460K7156l04940N22932k64334
14571A976168l8052q365l9991N28664k06966M9862N027q1775K93042O1543k84
14560B538873j84853K36307j61120j5254O45091J70749j23613M52911N73533O13268
14550D745892J117008J691643L639659Q045410J6036527Q910024j6382877A0201885
14541D271119j376373n14102l0378k31410J7481k63965q5852J10271K98128q9861
$$ y = [1808509, 1464348, 1469300, 1358368, 1453309, 1813877, 1580113, 1385627, 1712355, 1587689, 1548149, 1723096, 1294244, 1961818, 1529398, 1813905, 1132439, 1646148, 1550234, 1314310, 1738446, 1527569, 1715124, 1998190, 1770001, 1548991, 1474266, 1741919, 1674826, 1902202, 1788766, 1781594, 1692718, 1961775, 2017590, 1566894, 1995354, 2022510, 1717570, 2240502, 1976168, 1938116, 1929751, 1889760, 2418424, 2211458, 2261320, 2266347, 2184572, 2477614, 2539157, 2538873, 2354020, 2590327, 2429207, 2413953, 3059044, 3229793, 3106180, 3559091, 4132624, 4745892, 5862900, 7554543, 11194202, 19239612, 35276139, 44186163, 27803286, 10201885, 4271119, 2894746, 2380644, 2350266, 2118856, 2136337, 1872372, 1786520, 1896791, 2194919, 2105058]
14531B105058j00349K99261k97626j43183L90471K3912R5004K5559j45395J24934
14521B377646m02430L98550n5547l1626L97974k34621k45620K12589L41441k81284
14511B477072l785J71904k43377M52112k78954k1906K07964j83992M02766o5273
14501B914531n3289K70608l48131K82785J97123j65051K29611j31037M8875j33724
14491C112301L4154J59998R5976j56992K11498J94455p4058N6926j87321L91644
14481C838581k80907J29333J07525M6921J36775l13636J42387J65559L06250n03701
14471C775087L25652j84448R4815J26414K5617k63740N18103J7141J65202r883
14461D589960L3077j53077P29700o95309N05968n26931m3882M73478M84701k90277
$$ y = [2105058, 2004709, 2303970, 2006344, 1863161, 2253632, 2277544, 2372548, 2398107, 2252712, 2377646, 1975216, 2373766, 2318219, 2286593, 2684567, 2449946, 2204326, 2416915, 2758356, 2477072, 2473287, 2645191, 2401814, 2853926, 2574972, 2553066, 2761030, 2577038, 2979804, 2914531, 2861242, 3131850, 2783719, 3066504, 3263627, 3098576, 3328187, 3197150, 3246025, 3112301, 3146455, 3306453, 3402429, 3245437, 3456935, 3651390, 3577332, 3634258, 3446937, 3838581, 3557674, 3687007, 3794532, 3841453, 3978228, 3664592, 3806979, 3972538, 4278788, 3775087, 4100739, 3916291, 4011106, 4137520, 4163137, 3899397, 4417500, 4434641, 4599843, 4589960, 4623037, 4469960, 5199660, 4504351, 5010319, 4483388, 4439506, 4912984, 5397685, 5107408]
14451E107408j00053N06895l68685K81689m1294p0181M78968k26146k75776L27998
14441E620823j41686J56676L47308j57586R962L43597r5660J92862J49280J62833
14431F588409k7763J25722p4685o4862J31303r1692O62985K12518k38012J25477
14421G349400J18474J28349K72893m4335r7505K75566J47169k16222L33571M26300
14411H693660q8104N7930M8620M23244M085J47595j86421K80689M5523M52065
14401I878886J22425j53599L51858P1229M62966J02048j1688M88256k35619L98271
14391A1475033J7835M19908L21676l64867N04766L33121K99769p1275K31958N21487
14381A3689411L72336k97111N77732p3636M82902L86647M72895J11566L74218
$$ y = [5107408, 5007355, 5514250, 5145565, 5427254, 5385960, 5315779, 5794747, 5568601, 5292825, 5620823, 5479137, 5635813, 5983121, 5825535, 5835497, 6179094, 6083434, 6276296, 6425576, 6588409, 6560646, 6686368, 6611683, 6546821, 6678124, 6586432, 7249417, 7461935, 7223923, 7349400, 7467874, 7596223, 7869116, 7824781, 7727276, 8002842, 8150011, 7933789, 8267360, 8693660, 8605556, 8663486, 8712106, 9135350, 9139435, 9287030, 9100609, 9381298, 9426821, 9878886, 10001311, 9847712, 10199570, 10270799, 10733765, 10835813, 10824125, 11312381, 11076762, 11475033, 11492868, 11912776, 12234452, 11869585, 12374351, 12707472, 13007241, 12935966, 13167924, 13689411, 14061747, 13764636, 14342368, 14268732, 14751634, 15138281, 15611176, 15722742, 16096960]
14372A6096960K34972p3671M48985L15221O25625K64216J16849R10958L56132
14363A9296247P4536N37016L30209K99066M83737K75854O86399M30584O69950
14354B3083598M76895R10153M34934L85526Q40220M90484O81004J103000J70857
14345B8576671J023184Q04535M99831O85509J088340R78151N97781R25820J367256
14336C6547078R92321R39048J110160Q56034J504751J387046J331424J574036
14328D6241898J373555J640303J689538J692982J362346K291159J880533K100703
14320F0273017J927047K058055K936788K281430K513582K880104K975037K989270
14312H0834330L523341L330627M121136L564808M127071M144182N049629M679412
$$ y = [16096960, 16331932, 16258261, 16707246, 17022467, 17648092, 17912308, 18029157, 18940115, 19296247, 19370783, 19907799, 20238008, 20537074, 21020811, 21296665, 21983064, 22413648, 23083598, 23560493, 24470646, 24905580, 25291106, 26131326, 26621810, 27302814, 28405814, 28576671, 29599855, 30404390, 30904221, 31589730, 32678070, 33656221, 34254002, 35179822, 36547078, 37539399, 38478447, 39588607, 40444641, 41949392, 43336438, 44667862, 46241898, 47615453, 49255756, 50945294, 52638276, 54000622, 56291781, 58172314, 60273017, 62200064, 64258119, 67194907, 69476337, 71989919, 74870023, 77845060, 80834330, 84357671, 87688298, 91809434, 95374242, 99501313, 103645495, 108695124, 113374536]
14304A13374536N141093N696005N984588N971382P185100P264096P251145Q215731
14296A66083676Q651762R264848R611044J0591208J1155129J1513342J2545647
14289B39416656J2864326J3439806J4522709J4900853J5838427J5640444J6878522
14282C43501743J6409671J6749318J6965748J6408506J5660742J4677484J3270133
14275D53643345R215182N087591M321491L061035R1638r78346n93993n112476
14267D68735467j164166p436087j0986584j2766214j3641552j4879096j6010628
14260C91851140j7028460j7054820j6864742j6795234j6157121j4962672j4806546
14253B78181545j4577197j3736726j2991840j2344289j1662912j1113135j0551068
$$ y = [113374536, 118515629, 124211634, 130196222, 136167604, 143352704, 150616800, 157867945, 166083676, 174735438, 184000286, 193611330, 204202538, 215357667, 226871009, 239416656, 252280982, 265720788, 280243497, 295144350, 310982777, 326623221, 343501743, 359911414, 376660732, 393626480, 410034986, 425695728, 440373212, 453643345, 462858527, 467946118, 472267609, 475328644, 475420282, 474441936, 473847943, 468735467, 467571301, 460135214, 449148630, 436382416, 422740864, 407861768, 391851140, 374822680, 357767860, 340903118, 324107884, 307950763, 292988091, 278181545, 263604348, 249867622, 236875782, 224531493, 212868581, 201755446, 191204378]
14246A91204378r262521r430661q120064p964841p631334p100598o745747o582783
14238A28365829n434916n499307n034878m882652n069898m025507m071502l794657
14230I0552512l500838l390322l428041k824474l513939k702181k675313k428886
14222F6088518k360715k098414j989148k198185k052393j960786j802592j549315
14214E0076970j263409j321783j747949j374159j346514j512517j085802m57129
14206C9967708j280954j001365j644459q96327j052940n80515o46106o38267j254119
14197C0972656o82848j047393o52545n86124n78021r11855l94132p82904m75584
14188B4861250j024122n02670l26865m02009n84225p69895k98725n02521o04063
$$ y = [191204378, 181941857, 172511196, 164391132, 156426291, 148794957, 141694359, 134948612, 128365829, 122930913, 117431606, 112396728, 107514076, 102444178, 98418671, 94347169, 90552512, 87051674, 83661352, 80233311, 77408837, 73894898, 71192717, 68517404, 66088518, 63727803, 61629389, 59640241, 57442056, 55389663, 53428877, 51626285, 50076970, 48813561, 47491778, 45743829, 44369670, 43023156, 41510639, 40424837, 39967708, 38686754, 37685389, 36040930, 35144603, 34091663, 33511148, 32865042, 32226775, 30972656, 30289808, 29242415, 28589870, 28003746, 27425725, 26513870, 26119738, 25336834, 24861250, 23837128, 23334458, 23007593, 22605584, 22021359, 21251464, 20952739, 20450218, 19846155]
14179A9846155k22796l34047m80626n56890J4833p21322K38515p77875o94686
14170A6311261j56624j62536k21291k65602l47274L5507o83028j01220l65677
14161A4043516j29223j63013n25761j43672k08245l72978k18054k18571j29183
14152A1934816j98939l58773J40733n32658K32441n31064J79964m73942k56470
14143A0136108j83567Q3605l81338k47144K53066k44311j02863j59149k87854
14134H866553J48232j33667k22932j8956l26149k67551J40262m60726j4721Q2557
14124G792902M6648n87723L32944k46808J63687l36383J877k7424j57671j67897
14114F814152j25985n4192l13116L41635m28050j61627L47119l19168k84038J17491
$$ y = [19846155, 19623359, 19289312, 18808686, 18251796, 18266629, 17545307, 17783822, 17005947, 16311261, 16154637, 15992101, 15770810, 15505208, 15157934, 15193441, 14510413, 14409193, 14043516, 13914293, 13751280, 13225519, 13081847, 12873602, 12500624, 12282570, 12063999, 11934816, 11735877, 11377104, 11517837, 10985179, 11217620, 10686556, 10866520, 10392578, 10136108, 9952541, 10036146, 9654808, 9407664, 9660730, 9416419, 9313556, 9154407, 8866553, 9014785, 8881118, 8658186, 8639230, 8313081, 8045530, 8185792, 7725066, 7710345, 7792902, 7839550, 7251827, 7584771, 7337963, 7501650, 7165267, 7167144, 7139720, 6982049, 6814152, 6688167, 6633975, 6320859, 6662494, 6234444, 6072817, 6419936, 6100768, 5816730, 5934221]
14104E934221R1156k25905l38321L39029J53572n19103J55421J2610j97058R6519
14094E502141l19761K41254l11432J522k77232M08177p4778n41165M86428j29627
14084D985527m10321j42834N9000M8632Q9577j1039l4880k31374m0947J64154
14074D475495K14864o32430p5511J15686j70539K11450o5122l3819k66936j06751
14064C666387L10803k24057k26581Q8165M8240K03325k50178J44416j22234j72621
14054C465665N5609j03167P5013j49954m9175k21834K95767j14557j37850q788
14044C106729K20719l77300K89689l084k09014p4973j44577J71671M8361l99330
14034B628891L41596j44942J45811j52805P2341m99628L34433R6078n9394M5124
$$ y = [5934221, 6025377, 5799472, 5461151, 5800180, 5953752, 5434649, 5590070, 5602680, 5405622, 5502141, 5182380, 5423634, 5112202, 5113724, 4836492, 5244669, 5169891, 4628726, 5115154, 4985527, 4575206, 4432372, 4491372, 4540004, 4629581, 4618542, 4583662, 4352288, 4311341, 4475495, 4690359, 4057929, 3982418, 4098104, 3927565, 4139015, 4073893, 4040074, 3773138, 3666387, 3977190, 3753133, 3526552, 3614717, 3662957, 3866282, 3616104, 3760520, 3638286, 3465665, 3521274, 3418107, 3493120, 3343166, 3293991, 3072157, 3367924, 3253367, 3115517, 3106729, 3327448, 2950148, 3239837, 3236753, 3027739, 2952766, 2808189, 2979860, 3028221, 2628891, 2970487, 2825545, 2971356, 2818551, 2890892, 2391264, 2725697, 2821775, 2762381, 2807505]
14024B807505k70478k30132N66632l83596K7353j73896N9870j34432j13578K55812
14014B411060O8082j64143p6320O1114j09445j25968o524k37286K42229O3671
14004B126470k7211m550K69902l03132l5952R2148l04091l3038J60618j31150
13994A810014N3072N1770r8336N09522N00662J343584J974052O491614J5556319
13985B8192273J3878108j0803094A5141345p069568k155745j243869o99610q44357
13977C128196k43828K97357m28560j66150J10256j92955P2928m45685L97089m76290
13967B052358J30320L42857k91445k20398p4435P5084J12092l04331J51503N4051
13957B027656n03878J93960K2278l0438l2714K23706j29672j61708K82090j12997
$$ y = [2807505, 2537027, 2306895, 2873527, 2489931, 2517284, 2343388, 2403258, 2268826, 2155248, 2411060, 2479142, 2314999, 2238679, 2299793, 2190348, 2064380, 2057856, 1820570, 2062799, 2126470, 2099259, 2094709, 2364611, 2061479, 2025527, 2117675, 1813584, 1780546, 1941164, 1810014, 1863086, 1914856, 1816520, 2326042, 2826704, 4170288, 6144340, 12635954, 28192273, 42070381, 31267287, 15141345, 8071777, 5916032, 4672163, 3972553, 3128196, 2884368, 3181725, 2753165, 2587015, 2697271, 2504316, 2577244, 2131559, 2528648, 2052358, 2182678, 2525535, 2234090, 2013692, 1939257, 2014341, 2126433, 1822102, 1973605, 2027656, 1523778, 1717738, 1740016, 1709578, 1676864, 1900570, 1770898, 1609190, 1891280, 1778283]
13947A778283L3778k81553N0950J21624j15552K37941K0440m12092K33598K20163
13937A887580l55027k57160Q7648O2337j19220P6440K71232j05385k9236L35968
13927A855177l21910k73645P1680Q7682k88494K23782J10268l7129j21208n2144
13917A254059k7857L20073q5663k4417K05544j5042k23187k26419J85248j87464
13907A174875L03424m31526q5515J87321J1932q4114M05881k64547J93937j95373
13897A216295K9828l67873L35416n6852N0210J33360k98730k41312O21457l79861
13887A041938J53705j33889l8292J15664r9961q8847L29529p9012l77618L80033
13877A203250k09522l837o2528L30522k32812K74240l65070o4499N13471m38197
$$ y = [1778283, 1812061, 1530508, 1581458, 1703082, 1587530, 1825471, 1845911, 1433819, 1667417, 1887580, 1532553, 1275393, 1363041, 1425378, 1306158, 1382598, 1653830, 1548445, 1519209, 1855177, 1533267, 1259622, 1331302, 1418984, 1130490, 1354272, 1464540, 1427411, 1306203, 1254059, 1226202, 1546275, 1460612, 1436195, 1641739, 1626697, 1403510, 1177091, 1362339, 1174875, 1478299, 1046773, 961258, 1148579, 1160511, 1076397, 1482278, 1217731, 1411668, 1216295, 1246123, 878250, 1213666, 1156814, 1207024, 1340384, 1041654, 800342, 1421799, 1041938, 1195643, 1061754, 1023462, 1139126, 1039165, 950318, 1279847, 1200835, 823217, 1203250, 993728, 989891, 927363, 1257885, 1025073, 1299313, 934243, 869744, 1383215, 945018]
13867I45018k05630M43759k33559N2481L26736l32331j4667o7249L79013k07139
13857A086432J12601l31766j23832M28370E41253K41756N01150n06952J28067
13848I05274M8428J58228j3199j29363M1190m1933J37746m62488M28030l91760
13838F80153J32226K69452n16432J56417J73359J31504l10390J41330J31565o7523
13828I21661k88163n5153M14893k16811j34735J52360J82712l09923P5943j33426
13818F09358O3621Q367j69613J19629M88702k91267l3121k24757j08284M24131
13808H86766l39442K18499k49653K96239j56445j15172J63078J74394J4312j54202
13798G38374O6350D01133L33582L84525E34727J9908N73879n44972N17182k72331
$$ y = [945018, 739388, 1183147, 949588, 1002069, 1328805, 996474, 981807, 914558, 1293571, 1086432, 1199033, 867267, 743435, 1171805, 541253, 783009, 1284159, 777207, 905274, 953702, 1111930, 1098731, 969368, 1010558, 968625, 1106371, 643883, 1071913, 680153, 812379, 1081831, 565399, 721816, 895175, 1026679, 716289, 857619, 989184, 921661, 633498, 578345, 993238, 776427, 641692, 794052, 976764, 666841, 742784, 609358, 672979, 681346, 511733, 631362, 1120064, 828797, 795676, 570919, 462635, 886766, 547324, 765823, 516170, 812409, 655964, 540792, 703870, 878264, 892576, 738374, 804724, 401133, 734715, 1119240, 534727, 554635, 1128514, 583542, 1100724, 828393]
13788H28393J17270l19023K68961n9045C99034M63944j40769Q7301k16104N6529
13778F49935j06134J75152P8470k48609K20256n643q0248q2214r2984j8153o2994
13767D26834K98988K27331l81552j2673k4077p5163N1670M02762o3925l95296
13757D54899K07269k07264K25918B12270O63747j17279N4254C63835O1296R5262
13747E20393M15370j39873p6122J00510k92989O8030J32928j29893j845k33974
13737C62535q8110K76718p4553A87487J63310J58412k20157J16934A90065K96345
13727D86410K60762k84427j17309J18065o8189K1126J92736j9902o9300k09430
13717C10542M44768q2604l21769K37106J1290j89874m5279J6088L63962j08577
$$ y = [828393, 945663, 626640, 895601, 836556, 399034, 862978, 722209, 809510, 593406, 649935, 543801, 718953, 797423, 548814, 769070, 763427, 683179, 600965, 507981, 489828, 426834, 725822, 953153, 571601, 558928, 534851, 459688, 511358, 914120, 850195, 454899, 662168, 454904, 680822, 212270, 876017, 758738, 812992, 363835, 425131, 520393, 935763, 795890, 719768, 820278, 527289, 595319, 728247, 598354, 596509, 362535, 274425, 551143, 476590, 187487, 350797, 509209, 289052, 405986, 190065, 486410, 747172, 462745, 345436, 463501, 395312, 416438, 609174, 589272, 519972, 310542, 755310, 672706, 350937, 588043, 599333, 409459, 364180, 380268, 744230, 635653]
13707F35653C05987R7255N1628K56735m5205B52530M40045k56385l8813A02989
13696C48065J34721j22073k7512K96191J01857j93036j52640L5319A57407N60042
13686G17449k12872q263B18159J64929Q5587k0418m9083J1888j75550m1254L38756
13675E33014j57299J399J62871B02700K14059o9746J25498a2429A85248H8295
13664E64384j53012j36325M08621j42139A56087L80703n0669B00095R9727A03635
13653B93781c4578C45152J29505R0519A47676L75570A97193J17214J7165B4090
13642G89717B28947p30J88746l1641J02895n0279p4014j9566J04757I2816J15375
13631B08191K47043I5668L55510A10391J9164J67680o7046E6874O0977J72551
$$ y = [635653, 305987, 403242, 454870, 711605, 666400, 252530, 692575, 436190, 397377, 102989, 348065, 482786, 360713, 333201, 629392, 731249, 538213, 385573, 420892, 157407, 717449, 504577, 496314, 218159, 383088, 468675, 448257, 399174, 411062, 235512, 194258, 533014, 375715, 377114, 539985, 202700, 416759, 347013, 472511, -12429, 185248, 88295, 564384, 411372, 275047, 683668, 541529, 156087, 536790, 486121, 200095, 299822, 103635, 293781, -34578, 345152, 474657, 565176, 147676, 523246, 197193, 314407, 331572, 24090, 789717, 228947, 228217, 416963, 385322, 488217, 437938, 363924, 344358, 449115, 92816, 208191, 455234, 95668, 451178, 110391, 129555, 297235, 230189, 56874, 117851, 290402]
13621B90402L01853N4537j50940p3942j62266J17294K0926J29207j89280J66425
13611E04216j48913q0998l4279J36617j09150L14906k69324K7524J12507k10873
13601B42233a11118F09397k12894r4340G1650L19620j42052R8268j32917K09275
13591D23844j62734j30538K06255K14806B52423M1095J67192k9090L4487A47324
13580C07090R5368j50411J29385j81941L76495k15068j62072q4856b25642C76465
13569A06495J42363F6573L00076m3096A09560J56891J41255j60268J09484j06149
13559B50773n2429a43039D35303B15850P0294Q7059j33448j14090L30314B12527
13548B43446E4672M11811J10043j33755k8708p9529K3831j18318J74289j59214
$$ y = [290402, 592255, 646792, 495852, 421910, 259644, 376938, 397864, 527071, 337791, 504216, 355303, 274305, 240026, 376643, 267493, 582399, 313075, 340599, 453106, 242233, -111118, 609397, 396503, 302163, 71650, 391270, 249218, 347486, 214569, 423844, 261110, 130572, 336827, 551633, 252423, 293518, 460710, 431620, 466107, 147324, 307090, 402458, 252047, 381432, 199491, 575986, 360918, 198846, 113990, -225642, 376465, 106495, 248858, 66573, 366649, 323553, 109560, 266451, 407706, 247438, 356922, 250773, 198344, -143039, 435303, 215850, 286144, 373203, 239755, 125665, 455979, 212527, 243446, 54672, 466483, 576526, 442771, 414063, 334534, 358365, 240047, 414336, 255122]
13538B55122K96177N6889k50250r6296L52395k78561c3775D50874L1892l9813
13528D42953J45178a77273A93198r773r949K90777j98589e2381C01870b4353B59039
13516g534j46688A25313k2054J31565k8656P0601o8358a49150A06127J95505H0399
13504E36144j43575j62021R9489j53773O6626J07631N2798B01072k012R7835b67759
13492B80884c471C68799n4473k578j28900J68122A68412L25685A14828k8524K78685
13481C64989F1338M6400J11344a48288B77413b29738D85413i6027A56925E8770
13470B09369j7924K53242k15211a28367I2413J48112F7570M67262k41565J36478
13460D29745j46292J93125j27586O8259l2275F2863k6221J01744F3375J91542
$$ y = [255122, 551299, 608188, 357938, 261642, 614037, 335476, -33775, 450874, 482766, 442953, 588131, -177273, 193198, 183425, 173476, 464253, 265664, -52381, 301870, -24353, 259039, -7534, -154222, 125313, 103259, 234824, 206168, 276769, 208411, -149150, 106127, 301632, 80399, 536144, 392569, 230548, 330037, 176264, 242890, 350521, 403319, 201072, 199060, 296895, -267759, 280884, -3471, 368799, 314326, 311748, 182848, 350970, 168412, 494097, 114828, 86304, 364989, 61338, 107738, 219082, -148288, 277413, -229738, 485413, -96027, 156925, 58770, 209369, 191445, 444687, 229476, -128367, 92413, 240525, 67570, 534832, 293267, 429745, 283453, 476578, 348992, 417251, 384976, 62863, 36642, 138386, 63375, 254917]
13450B54917r8276L95276A85890R3124q5051a3165B06388J19774j11982N2827
13440B67007M5762A36985J99810a31365b8138C82726J24938B02312h7462G07763
13429I2978P0696j2062m1750K17639m6712j16361K70263A74623M6104q0012J60491
13418C01206q2433L37316A74669R3785A11598K51174n6597E435L47121A16291
13407A28614k6641D6570K15201b2152A73345K96991j48375c5526H4451J31714
13397B16165o6453a8870D55040B11198o8685a20070N6722B46015J00765c3046
13386C50766j8546d2107I2777A7127d1332C01680c31569B61496j26099K87578
13376D22975j16248J04983A45740i5326C16920o5268B1135K57661J18633g4901
$$ y = [254917, 156641, 551917, 185890, 279014, 193963, -13165, 206388, 326162, 214180, 267007, 312769, 136985, 336795, -131365, -28138, 382726, 507664, 202312, -87462, 707763, 92978, 163674, 151612, 109862, 327501, 280789, 164428, 434691, 174623, 220727, 140715, 301206, 218773, 556089, 174669, 268454, 111598, 362772, 306175, 5435, 352556, 116291, 128614, 101973, 46570, 261771, -22152, 173345, 470336, 321961, -35526, 84451, 216165, 149712, -18870, 455040, 211198, 142513, -120070, -63348, 246015, 346780, -33046, 350766, 332220, -42107, 92777, 17127, -41332, 301680, -331569, 261496, 135397, 422975, 306727, 411710, 145740, -95326, 316920, 251652, 21135, 278796, 397429, -74901]
13365A95755F317K94909L1P3260A25236J24704f1535F3343L4964K0733O1632L02723
13353D83395k707k04159c38389A23966K62000L4401G8556B582P4776K50589j11980
13342B15967j2209d4312B09518A9832a5183A60933K14139j65061Q7903n3304k2507
13331B22103A08092K47930A5127K14448b8408A40705B9526K07084P8694C2061
13320C72063a32477A62212o81f1056a5678B22303g9285B04661J84590j29110d147
13308B35679a3233B98230H910K29981J01698c0855D45603a5128A99384j0571J35743
13297C24556A37095E6362M31583A12039b02118C33681j16452n6649f7069J9971
13287d7098A30579l5053n114b77703A1960N4234L29623A47948J97067j24560D7118
$$ y = [195755, 6317, 301226, 301257, 374517, 125236, 249940, -61535, 63343, 98307, 119040, 180672, 483395, 480688, 276529, -338389, 123966, 385966, 420367, 78556, 2582, 77358, 327947, 215967, 203758, -44312, 209518, 19832, -15183, 160933, 375072, 210011, 297914, 244610, 222103, 108092, 356022, 15127, 229575, -28408, 140705, 29526, 236610, 315304, 32061, 372063, -132477, 162212, 161531, -61056, -15678, 222303, -79285, 204661, 389251, 260141, -4147, 235679, -13233, 298230, 8910, 238891, 340589, -30855, 445603, -15128, 199384, 188813, 324556, 137095, 56362, 487945, 112039, -202118, 333681, 217229, 160580, -67069, -47098, 130579, 95526, 90412, -277703, 11960, 66194, 395817, 147948, 345015, 220455, 47118]
13275B53782q3056O3015A6494J63365E8332a25478B80389i8458j09079A06516
13264a11532J0573a0799B14504H4674K97395A8860q8J32572a25099b4421J0138
13253a4283C80939i3395l4332N4455j2694D1348M7056J91192C8169N4630a87455
13241C05642d0020D40370j93244I8091O1521P3703a10366B11454g6065A45666
13230A90842b13058G2191a39497c7837a4368A31172P8890A017J95544f340n1077
13219e7417k1215A13275a16645b4781B13198a07450a4932A43302a10426A3226
13208B63166f5908l78517c3557B69094O5513a30933l4612A52214p4427a95818
13197C26392o6414a31555A02215i4835C32647f9762B10482o7016a67257A9267
$$ y = [253782, 170726, 233741, 16494, 179859, 58332, -125478, 280389, -98458, -207537, 106516, -111532, -100959, -10799, 214504, 84674, 382069, 18860, 18772, 151344, -125099, -24421, -14283, 380939, -93395, -127727, -73272, -85966, 41348, 88404, 279596, 38169, 92799, -187455, 305642, -40020, 440370, 247126, 98091, 159612, 233315, -110366, 211454, -76065, 145666, 190842, -213058, 72191, -139497, -37837, -14368, 131172, 210062, 1017, 196561, -6340, -57417, -78632, 113275, -116645, -24781, 213198, -107450, -14932, 143302, -110426, 13226, 263166, -65908, -444425, -33557, 269094, 334607, -130933, -165545, 152214, 77787, -195818, 326392, 259978, -131555, 102215, -94835, 332647, -69762, 210482, 143466, -167257, 19267]
13186C75457a80510D3801L84425A34157m6672J3691a60927A72545F9711d4291
13175c3885B65274a21772j35516h6455J7725b0283C89279G1542J37146k295F4414
13163B1908a4294m07459G3585J18670a17774b1555B9654K45020a85953G9960g5419
13151A51734B5396K84905D7795J07385b05286B94986j29683Q3319A8693J73989
13141A92682K1604a21953C12443A6486P2803J44485p1768J01951A20208P0010
13131A90218C1813A0127h52E12889a83860Q4711A59784A9861c54327J53797H886
13119a16042A13255c0943A10801K8448J1371b60495A08921d42781A33937B4782
13108c541j22589G3610a50051h978A28944K9817i4407A82903a50745d3853C64367
$$ y = [375457, -180510, 43801, 428226, 134157, 87485, 101176, -160927, 172545, 69711, -44291, -33885, 265274, -121772, -257288, -86455, -68730, -20283, 389279, 71542, 208688, 206393, 64414, 21908, -14294, -421753, 73585, 192255, -117774, -21555, 29654, 274674, -185953, 79960, -75419, 151734, 25396, 310301, 47795, 155180, -205286, 294986, 165303, 248622, 18693, 192682, 214286, -121953, 312443, 16486, 89289, 233774, 162006, 263957, 120208, 190218, 31813, 10127, -852, 512889, -183860, -99149, 159784, 19861, -354327, -200530, 8886, -116042, 113255, -30943, 110801, 139249, 150620, -260495, 108921, -442781, 133937, 24782, -3541, -126130, 73610, -150051, -8978, 128944, 158761, -94407, 182903, -150745, -43853, 364367]
13096C23634c77421f4124p0329E4246J0922k2899K58992a96508B57151b0552B93219
13084a44094l3649B69844b16504K6507i2792B16044e0355B6576a75005h137C68480
13072F341J60147D3552j8920J86247k7639g0244A94733B7040K02839e5193l5687
13061i0880k4022M6485B36609j15475D2614J82186C5942M8186O0450a23752A73236
13049I3378J39549Q768C0866K90576q9681D7486h802A9281c5742N30A09561O5605
13037A75166p4108K81005H4196J35822l4684R6317a14530l3303d1455r3668A71423
13025A4422M8439L38772j67022K69660a87651A25056c3683j31602h1965A88640
13014a86984A5991g5420B65174o4447M8666a86101B0693K6568M37536k28797a14012
$$ y = [323634, -377421, -64124, -134453, 54246, 65168, 42269, 301261, -196508, 257151, -20552, 293219, -144094, -177743, 269844, -216504, -189997, -92792, 216044, -50355, 26576, -175005, -8137, 368480, 6341, 166488, 43552, 24632, 210879, 183240, -70244, 194733, 27040, 229879, -55193, -90880, -114902, -68417, 236609, 121134, 42614, 224800, 35942, 84128, 144578, -123752, 173236, 93378, 232927, 241695, 30866, 321442, 231761, 47486, -8802, 19281, -35742, -35212, 109561, 175166, 101058, 382063, 84196, 220018, 185334, 281651, -114530, -147833, -41455, -135123, 171423, 14422, 62861, 401633, 234611, 504271, -187651, 125056, -33683, -165285, -81965, 188640, -186984, 15991, -75420, 265174, 200727, 249393, -186101, 20693, 47261, 484797, 256000, -114012]
13002F1935O8131J51874H8910d9377K0271B95407A00749k7321c177j98912H7002
12990A47975n2785K57476a95832B57441A4510c4029G8648B188a38415B24325e5809
12978e23B4700f0778E418a79008Q4080A07499a6630A48138K1904L133c22766A0619
12965C05884f7672A71869h2920F253e4250A40162j6863a37524E03R5197a85870
12953H7411h216A09857J39723A4044a26913E7810c95636C4242c55476f2600b1965
12941A13480D2695b89540A86671A8810K17782C114J73519i3723A25722a65335
12930E447J09306b68930C1139a7282m44314a71567A42417b1416D20982f5532B53311
12918F2632c6303C35568a8486j56161B8098J00037i6660k51605D2233K62460A13859
$$ y = [61935, 130066, 281940, 88910, -49377, -29106, 295407, 100749, 73428, -3177, -202089, 87002, 147975, 95190, 352666, -195832, 257441, 14510, -34029, 78648, 2188, -138415, 224325, -55809, -523, 24700, -60778, 5418, -179008, -94928, 107499, -16630, 148138, 170042, 173175, -322766, 10619, 305884, -67672, 171869, -82920, 6253, -54250, 140162, 123299, -137524, 503, 95700, -185870, 87411, -8216, 109857, 249580, 14044, -126913, 57810, -395636, 34242, -355476, -62600, -21965, 113480, 42695, -289540, 186671, 18810, 236592, 3114, 176633, -93723, 125722, -165335, 5447, 114753, -268930, 31139, -17282, -461596, -171567, 142417, -21416, 420982, -65532, 253311, 62632, -36303, 335568, -18486, -174647, 28098, 128135, -96660, -348265, 42233, 304693, 113859]
12906a45572A15296h5814A01890N4186l3277a67590M2020A24591d2815H4414d00214
12894d0518E5690N5752d8858a0864j00858f229j84920A02463g2976N599A7658
12882B8929D943K16828G1346J85290G3352a8760N455q3105A32941b4176H6706
12870a45344M8707B64840c92721A53058J71579a77166b0516B24877a3646n9493
12860g3139G8688k2986K14952j35005P6778J84514B2972J91321b02204D2493c8850
12848A31052k7322L8558N4893a83013h9555A11759Q8097j5590J30232n5452A00151
12836a96990I8278a91512P2272o0720g5430A14290a21702c802C40352a83402A45427
12824A53125N601j8694k1318J91298d7709C09552D3292K69756K2532B2580K4777
$$ y = [-145572, 115296, -85814, 101890, 156076, 122799, -167590, -125570, 124591, -42815, 84414, -400214, -40518, 55690, 111442, -48858, -10864, -111722, -6229, -191149, 102463, -72976, -67377, 17658, 28929, 4943, 221771, 71346, 256636, 73352, -18760, -13305, -96410, 132941, -24176, 86706, -145344, -96637, 264840, -392721, 153058, 324637, -177166, -20516, 224877, -13646, -73139, 78688, 55702, 270654, 135649, 212427, 396941, 22972, 214293, -202204, 42493, -38850, 131052, 103730, 142288, 197181, -183013, -89555, 111759, 199856, 184266, 314498, 259046, 100151, -196990, 98278, -191512, -119240, -179960, -75430, 114290, -121702, -3802, 340352, -183402, 145427, 153125, 158726, 140032, 118714, 310012, -47709, 309552, 43292, 313048, 335580, 22580, 47357]
12813D7357d853A3397K9611d7827a5453A04399J43287a93687R4983A87649a7646
12801G0907K7661a4784j83568A68725b1514A71064a9228j32430D16702i238k35997
12790b45235j03257a11123A64830m9153J934J82492a90457j00274A94831m7367
12780A47464a16850k21577A27443o0468J20790B4320l205a74954G2434i671j02298
12769a11969C23565j58145b4320H8797k9893N4112e4966j42843I5446b10521B7785
12757A29193J32067d4367q3096f1059A93003J29630J15360b22613C5231D69J01072
12746A01541l6608J0257c8818k2270k00965d313j3755k4788C6232L395J43549
12735A83176A7537E162J79849K16599G3599K2564J82431i1734J616L1076C01191
$$ y = [47357, -4853, 13397, 43008, -47827, -15453, 104399, 247686, -193687, -98704, 187649, -17646, 70907, 98568, -14784, -198352, 168725, -21514, 171064, -19228, -151658, 416702, -9238, -245235, -348492, -111123, 164830, 115677, 117611, 300103, -190457, -290731, 194831, 147464, -116850, -338427, 127443, 66975, 187765, 24320, 21115, -174954, 72434, -9671, -111969, 323565, 165420, -24320, 88797, 58904, 113016, -54966, -197809, 95446, -210521, 27785, 129193, 261260, -44367, -127463, -61059, 193003, 322633, 437993, -222613, 35231, 469, 101541, 64933, 75190, -38818, -61088, -262053, -4313, -18068, -42856, 36232, 39627, 183176, 17537, 5162, 185011, 401610, 73599, 96163, 278594, -91734, -90118, -59042, 301191]
12723b3320B33242a59109A1702J17601F2144J45607C7328g1403C96005C5524f9790
12711b12949B17434F2738P3548D391b8981D12118A42015E032c8339q2705A31249
12699C9192J6506a76818g8878B49911C1074a75720j62528B40526a27872C769K5452
12688B9221a85071K3432F3159L6783l2205O8780b942p1515C46815C8230Q4289
12677A22519K85731I7246a65200D7615N0338J8869i6027A89655g3527D5075M75110
12666E20185B47688O3702e1472B19462G6861i2349r13H5606a9219p5115r2968
12655a87302A15491c68510A38368b40516A8h9054H2279c30085A19997c03099a43099
12643A90764d1680J7953B72595A27643c3375H5578b02056A31498b00927B49665
$$ y = [-23320, 233242, -159109, 11702, 129303, 62144, 207751, 37328, -71403, 396005, 35524, -69790, -212949, 217434, 62738, 136286, 4391, -28981, 412118, 142015, 5032, -38339, -121044, 131249, 39192, 55698, -176818, -78878, 249911, 31074, -175720, -338248, 240526, -127872, 3769, 29221, -185071, -161639, 63159, 99942, 67737, 136517, -2942, -74457, 346815, 38230, 122519, 408250, 97246, -165200, 47615, 97953, 116822, -96027, 189655, -73527, 45075, 520185, 247688, 311390, -51472, 219462, 76861, -92349, -93262, 85606, -19219, -94334, -187302, 115491, -368510, 138368, -240516, 18, -89054, 82279, -330085, 119997, -303099, -143099, 190764, -41680, -23727, 272595, 127643, -33375, 85578, -202056, 131498, -200927, 249665]
12632I6392J92450e0562C2327K54017b81475F9289J76923C2998M4425J45905a29540
12620C56447B1477b26899D3332a02504B7364L83020h8766B1613J18158g9046J1736
12609f7310A15802a85916H1224j7186i6798l4922A4444b06700B19627L4236M8835
12598C02698d4725D0072d9935A34765c26090B13933a4519B65769b27598B72407
12587A95283c1429k51084f3253D7404J40841D1252K04354q6265C0986J1756a03834
12575B6449g1113A22507J18333r7776D4778M10040b54300f7795k56260j13624
12565d37679E8570I2P3477P9687L6298a99108l2904R4044L1523E1024L72532A34183
12552B01072f4609m0334j874B59077c07657D12681j84630C5052c36247A16535
$$ y = [96392, 288842, -50562, 32327, 286344, -281475, 69289, 246212, 32998, 77423, 223328, -129540, 356447, 21477, -226899, 43332, -102504, 27364, 410384, -88766, 21613, 139771, -79046, -67310, 115802, -185916, 81224, 64038, -96798, -131720, 14444, -206700, 219627, 253863, 302698, -44725, 40072, -49935, 134765, -326090, 213933, -14519, 265769, -227598, 272407, 195283, -31429, -282513, -63253, 47404, 188245, 41252, 245606, 159341, 30986, 42742, -103834, 26449, -71113, 122507, 240840, 143064, 44778, 454818, -254300, -67795, -324055, -437679, 58570, 92, 73569, 153256, 189554, -199108, -232012, -137968, -106445, 51024, 423556, 134183, 201072, -64609, -104943, -106817, 259077, -307657, 412681, 228051, 35052, -336247, 116535]
12541B1194f1979k3187q8716G5033J58579K6826b42539q3613b0280j9697A63734
12529A15036L5092K60341A16870m9355b43708E11400c0170J4861A88450I761g8539
12517g0914A80197E0318a51323L9001j66863f0107A72865g9420C2796e2477C125
12505B21124b19558G3929P4834N261n4698M8114a47882k06625J36474j0824B5664
12493c95855i2614I1431a82029Q6639E7467a83664l3753A12144J29554a93292
12482B87369P3723h1216j549c8562A14695N3505d51879C3785b16798O8476J1608
12471a36714M0478c926A06859k5049L9244O2054F0470C831b69899I1553K7053
12460A18606E5614b2165F6932k9170A1354a66220f8122J6837j36911i509A08481
$$ y = [21194, -61979, -85166, -173882, 75033, 233612, 260438, -242539, -326152, -20280, -39977, 163734, 115036, 150128, 410469, 116870, 67515, -243708, 511400, -30170, -15309, 188450, 9761, -78539, -70914, 180197, 50318, -151323, -112322, -279185, -60107, 172865, -79420, 32796, -52477, 3125, 221124, -219558, 73929, 148763, 154024, 99326, 147440, -147882, -354507, -218033, -228857, 25664, -395855, -92614, 91431, -182029, -95390, 57467, -183664, -217417, 112144, 241698, -193292, 287369, 361092, -81216, -82765, -38562, 114695, 168200, -451879, 33785, -216798, -148322, -136714, -96236, -3926, 106859, 81810, 121054, 183108, 60470, 3831, -269899, 91553, 118606, 55614, -22165, 66932, 37762, 11354, -166220, -68122, -51285, -188196, -9509, 108481]
12448B95287j41426b89815A31671G307a13618B68091a52203e3628B63503h9369
12437B38903A12880K48101G3233a50372N0838A08566L9413n1519d5105A9771N0069
12426F9840L7042a70940j47873a53035k4650O4407C02537G5678J32121a16575
12415E6592b68583J22203D167K23941c36770a18810E8698b23787N6037N1431j01147
12404b17466B08582a07759A17653b75060F1670O7689f8700f452n0174q3420A58621
12392C0145g4996A00116c5437p8720b0756A84837F7092J88162i6407E3862J89223
12381B43085A6475J69229n4110a50662B79027A29050h4218j61523d9355a3794
12370a3505k37182b1995j46709e5050F9733c5853O552A27600m6934R4388a15422
$$ y = [295287, 153861, -289815, 131671, 7307, -113618, 268091, -152203, -53628, 263503, -89369, 238903, 112880, 360981, 73233, -150372, -99534, 108566, 147979, 96460, -45105, 19771, 69840, 106882, -170940, -318813, -153035, -177685, -113278, 302537, 75678, 207799, -116575, 56592, -268583, -146380, 4167, 228108, -336770, -118810, 58698, -223787, -167750, -116319, -217466, 208582, -107759, 117653, -275060, 61670, 129359, -68700, -6452, -56626, -140046, 158621, 30145, -74996, 100116, -35437, -114157, -20756, 184837, 67092, 255254, -96407, 53862, 243085, 16475, 185704, 131594, -150662, 279027, 129050, -84218, -245741, -49355, -13794, -13505, -250687, -21995, -168704, -55050, 69733, -35853, -29301, 127600, 80666, 175054, -115422]
12358e38828f5755A32141a08223k40083D9458B1847b22926h9645C51826j75442
12348A76384b01137H5597j1750a06144C96179A3447d7334C72195A64127g1369
12337g3201A61686J1629a20826l1936I160b29139o5590a06822B21434L3888H7345
12325G9174c04976F079K94926e3689l48777A31255k7336B2091a09194M8835l9907
12314a00266A56812P749m8175c5637C10651h4543q946A90586R191h9150E1640
12302a99042j4459m6709C73356C7908b71952B3517b57486B4479R1584b0741A30095
12290A61856P3746I9594L489J579m9871g7483G6164B2211J9181J6295f5688H6055
12277B44671n3501k8943C9110a47336A39748J38359q9103o3047a14768j47972
$$ y = [-538828, -65755, 132141, -108223, -348306, 49458, 21847, -222926, -89645, 351826, 176384, -201137, 85597, 73847, -106144, 396179, 13447, -47334, 372195, 164127, -71369, -73201, 161686, 173315, -120826, -152762, 9160, -229139, -294729, -106822, 221434, 255322, 87345, 79174, -304976, 6079, 301005, -53689, -402466, 131255, 103919, 22091, -109194, -60359, -100266, 156812, 164561, 116386, -35637, 310651, -84543, -93489, 190586, 199777, -89150, 51640, -199042, -213501, -260210, 373356, 37908, -271952, 23517, -257486, 24479, 116063, -20741, 130095, 161856, 235602, 99594, 103083, 104662, 54791, -77483, 76164, 22211, 41392, 57687, -65688, 86055, 244671, 191170, 162227, 39110, -147336, 139748, 278107, 189004, 125957, -114768, -262740]
12267b62740B57489b30261B68042b86818B93823H255J06567b37384C82256A50304
12256a12384B02210E7373J17363Q8010j6096a82899f5856I6434J80813c0546j38921
12245a69467d2291D86348A19792b86703H7321K51110A38565h015j06385B04118
12234H2594J64332D7033c0757F46383i437n8809a7821A38289J15127J35254Q4431
12223D73101j04229j58536F9248J80024M54613b35101J13092J8715H6591J25839
12213B12430n3631D6375c5365k49594C37912b698D02556A38276b59117B68255
12202A50451O0818a8617j42310D91236A1482K99144G5213C1815J90405l8594A6759
12190B04722b94339E3783K14672H9236C1702J4747K47389a1151j90408C56393
$$ y = [-262740, 257489, -230261, 268042, -286818, 293823, 8255, 114822, -237384, 382256, 150304, -112384, 202210, 57373, 174736, 262746, 246650, -182899, -65856, 96434, 277247, -30546, -169467, -42291, 486348, 119792, -286703, 87321, 338431, 138565, -8015, -114400, 204118, 82594, 246926, 47033, -30757, 646383, -9437, -68246, -17821, 138289, 253416, 388670, 473101, 368872, 210336, 69248, 249272, 703885, -235101, -122009, -103294, 86591, 212430, 158799, 46375, -35365, -284959, 337912, -2698, 402556, 138276, -259117, 268255, 150451, 211269, -18617, -160927, 491236, 11482, 310626, 75213, 31815, 222220, 183626, 16759, 204722, -294339, 53783, 268455, 89236, 31702, 46449, 293838, -11151, -201559, 356393]
12179A64398D5913r549Q9995C046Q0290a26263C48843a99406c8917j39318A88067
12167D8321J02378b1614j02252B42590E4705a91979A4408P7131L07506D097b49358
12155A20433K16283b1022A55104E1615b3241f261j17442B04g7629F0076Q015f1341
12142a44997p6180g0670o4244A71824J27336j8659P169A35085e3250B54101A9390
12130B4998K75973c4868E704h7128D66219j63072c1916m7919A62002b2936C74792
12118e3836j81245F3004K00221p5387n4402l0402b03078f327A16738J12203a28830
12106a9672j37387I3214E706Q5342J73410b6552k75953J29716h5277j44129Q2439
12095a46967R364A94949a08829d3939C65679j71875K5406J27907h908m2803F4840
$$ y = [164398, 45913, 36364, 126359, 3046, 83336, -126263, 348843, -199406, -38917, -178235, 188067, 48321, 150699, -21614, -123866, 242590, 54705, -191979, 14408, 91539, 399045, 4097, -249358, 120433, 336716, -21022, 155104, 51615, -23241, -6261, -123703, 204, -77629, 60076, 68091, -61341, -144997, -221177, -70670, -134914, 171824, 299160, 280501, 287670, 135085, -53250, 254101, 19390, 24998, 300971, -34868, 5704, -87128, 466219, 303147, -31916, -79835, 162002, -22936, 374792, -53836, -235081, 63004, 263225, 187838, 133436, 103034, -203078, -6327, 116738, 228941, -128830, -19672, -157059, 93214, 5706, 91048, 264458, -26552, -302505, -172789, -85277, -229406, -146967, -137603, 194949, -108829, -43939, 365679, 193804, 219210, 347117, -8908, -51711, 64840]
12083a70437O6619N1168A1279J62828H845N190Q5752c10686C06740L57673R64917
12072A629330o24464B77486H4947B2171a61750b7301I0087i400I1336m4440A9618
12060B1299b30854C25673d6776m3357B11804G3056K46330E3310B0326a49141E2634
12048d68115I7112h4225E8929a33108I1759D520b51766l03772G6580B0375P151
12037B7526J3597J19649a79190B1506N2619i7877r049B1573M7J8201L9008M3424
12025A22253b39097e5814j54972A45910b13790B89780a4089l41329H2959L4513
12015A17472l5783a34698F6799J73789A00834L4366a55021c9881C08093g2144
12004b2143C3691J33083a4210k68225j62826H9670a80957l6683R841B98089f6668
$$ y = [-170437, -103818, -52650, 11279, 174107, 8845, 14035, 99787, -310686, 306740, 664413, 1629330, 1004866, 277486, 84947, 22171, -161750, -27301, 90087, -9400, 91336, 46896, 19618, 21299, -230854, 325673, -46776, -90133, 211804, 73056, 319386, 53310, 20326, -149141, 52634, -468115, 97112, -84225, 58929, -133108, 91759, 4520, -251766, -555538, 76580, 20375, 27526, 41123, 160772, -179190, 21506, 74125, -97877, -106926, 21573, 21620, 39821, 78829, 122253, -239097, -55814, -210786, 145910, -213790, 289780, -14089, -355418, 82959, 117472, 81689, -134698, 66799, 240588, 100834, 135200, -155021, -39881, 308093, -72144, -22143, 33691, 166774, -14210, -282435, -445261, 89670, -180957, -217640, -207799, 298089, -66668]
11992a12797B16262a39037j1150A54851b91250i1691j03213b3742l2378J5699
11982d0421C1387J35017K5931b69520H6854B8012a50434k73d6126F2948h6151
11970c9161k95776C0998a12735j19190B91059r963a99486A88778D090K33199h0686
11958F2457a88970N8827F360b65970C1259e3447A57292K8884d31628D4121a04968
11946A06808f3491k00663B72997b38683Q5194K5401B01384I4693g0831B7617g4891
11934C01296H9202c26376E5024L13397a1972B9205J64201n2771c55230d3027B16126
11922A492c6336E8339a35617q6141R5535A87680J74475a38106C4307a42156A44865
11910E4602a38190e4585j81609A5549f8005A17496L4994l0822J16660C6196L09001
$$ y = [-112797, 216262, -139037, -150187, 154851, -291250, -91691, -194904, -23742, -56120, -40421, 31387, 166404, 192335, -269520, 86854, 28012, -150434, -150707, -46126, 62948, -86151, -39161, -334937, 30998, -112735, -231925, 291059, 281096, -199486, 188778, 4090, 237289, -80686, 62457, -188970, -130143, 6360, -265970, 31259, -53447, 157292, 186176, -431628, 44121, -104968, 106808, -63491, -264154, 272997, -238683, -153489, -128088, 201384, 94693, -70831, 27617, -74891, 301296, 89202, -326376, 55024, 368421, -11972, 29205, 193406, 140635, -355230, -43027, 216126, 1492, -36336, 58339, -135617, -221758, -126223, 187680, 362155, -138106, 34307, -142156, 144865, 54602, -138190, -54585, -236194, 15549, -68005, 117496, 152490, 121668, 238328, 36196, 345197]
11899C45197c4846C3890a02471J5010c3863B8176c72601a51648A3904b4778C46150
11887a6543p3994B7789f4791m154I5410c5269A21353c5003k30434J06875M5792
11876a12770M8229j94316A615b25709B8506K5137b01379K2294B69535G0018b4607
11864D8253J06438f3649A75104J01665i1630A78207b16112A75636J94589i5601
11853c25508A58567B3408e2450j18678G9998J7110g2076A10988A7251d3092j19258
11842a62350D763b5086k57706j42300a62891n7175N2420d5465l9598j12429A13515
11830C14546a76379A55260c60308o7320i8353E7065A4928e5487m39418A86482
11819a67368B57793E9374E048J15411b37530R3531c5420j36517H3626a32631m1576
$$ y = [345197, -34846, 33890, -102471, -87461, -33863, 28176, -372601, -151648, 13904, -24778, 346150, -16543, -90537, 27789, -64791, -68945, 95410, -35269, 121353, -35003, -265437, -158562, -112770, -64541, -258857, 1615, -225709, 28506, 53643, -201379, -179085, 269535, 70018, -24607, 48253, 154691, -63649, 175104, 276769, -91630, 178207, -216112, 175636, 370225, -95601, -325508, 158567, 23408, -52450, -171128, 79998, 97108, -72076, 110988, 17251, -43092, -162350, 4763, -25086, -282792, -425092, -162891, -220066, -167646, -45465, -85063, -197492, 113515, 314546, -176379, 155260, -360308, -427628, -98353, 57065, 14928, -55487, -494905, 186482, -167368, 257793, 59374, 5048, 120459, -237530, -143999, -35420, -171937, 83626, -132631, -174207]
11808a74207q296P5606M2952k5903K2019j35517A9075a9238k69444J24695j2448
11797a76435Q6989j40120B75247a45102l9447J5867P8022b2772k83633C742K84551
11786B88293j25810b32227o605m0067A3757h7645C8688o259a15830C23665a9513
11774d7673l27717h6087A67333a3081m82156f6444r7957l4750R4233B23635r2161
11763A31474c9569k76874e4237C18908E5874P7735k8485h5978C0107K12318A16342
11751F1270h9490C96813a22111C50573A73190l106B5943c94332a23058l8003A74643
11739I8936N92975I4042I199a09195k61537E4704A967a69602H8371h5950A4409
11727h7170c4788j17931N8532B5075b05381D7L65348q1284I9177c59025i684j09587
$$ y = [-174207, -182503, -106897, -63945, -89848, -67829, -203346, 19075, -19238, -288682, -163987, -176435, -89446, -229566, 275247, -145102, -184549, -168682, -90660, -22772, -306405, 3742, 288293, 162483, -232227, -238832, -278899, 13757, -87645, 38688, 32429, -115830, 323665, -19513, -47673, -375390, -86087, 167333, -13081, -495237, -66444, -164401, -199151, -104918, 223635, 131474, -39569, -316443, -54237, 318908, 55874, 133609, 105124, -85978, 30107, 242425, 116342, 61270, -89490, 396813, -122111, 350573, 173190, 170084, 25943, -394332, -123058, -161061, 174643, 98936, 691911, 94042, 9199, -109195, -370732, 54704, 1967, -169602, 88371, -85950, 14409, -87170, -34788, -152719, -94187, 25075, -205381, 47, 365395, 284111, 99177, -359025, -9684, -119271]
11715a19271m2472n7634C9722J07580A2882Q0075B6088P0845c13201B72980E2652
11703F7080B0201F794a34081F08688B05025d39473A93559i8514E7088c51540B35331
11691a58698g3070H0885L0736K46689B6874Q489e0141H3716Q2876a25392H0108
11679g360m1911A05766I090M3287a47804E8739O1182R3756H8555M2644M1257a6736
11666A25910i6283j03620B1379J64193J05581M9208F4143P7962E5768L9524K41804
11655C37096a66601L8544I577g8380j4090E5427J88405a99174m26243A35328m3818
11644I1510k4555b52861Q1659d2926m7746k61117B8540M3553J44091g3713I0757
11632a20665H3745L1780C3441b87088R6097c2457F0790H70a14744b5846A54962
$$ y = [-119271, -161743, -219377, 39722, 147302, 12882, 92957, 26088, 96933, -313201, 272980, 52652, 67080, 20201, 6794, -134081, 608688, 205025, -439473, 193559, -98514, 57088, -351540, 235331, -158698, -73070, 80885, 111621, 358310, 26874, 35363, -50141, 83716, 166592, -125392, 80108, -7360, -49271, 105766, 9090, 52377, -147804, 58739, 119921, 213677, 88555, 131199, 172456, -16736, 125910, -96283, -199903, 21379, 185572, 291153, 340361, 64143, 142105, 55768, 95292, 337096, -166601, -128057, 9577, -78380, -92470, 55427, 243832, -199174, -625417, 135328, 91510, 66955, -252861, -171202, -42926, -90672, -351789, 28540, 72093, 216184, -73713, 90757, -120665, 83745, 115525, 33441, -287088, -190991, -32457, 60790, 870, -114744, -25846, 154962]
11620a32272A84930p5485I352c03790e930k15365R5794M814d2829j54217B71457
11608B67095i6118l05433b1925A83883D5633c75374E5814j791M4267J2680C4764
11596C15068j45103K29367H5234b40238C08473d2580j80997A13996a27924A17169
11585A44662b5619l4262o292I8106C3798a80830A86405c18278b1433j60940C47172
11573b64211C20590j45705j1477l0847n5895J63794l2828p0220f1237I5145K72375
11562C67520A37760f1105A50759M5253K00301j76025F298c55l26188G3949a9256
11550A37883g1677A94826o6573a7030o7855B51761a83995A0342A630g441B81238
11538d9058j78782C76835a31599A72550q5877J97769A00839b72404A48902a03765
$$ y = [-132272, 184930, 109445, 9352, -303790, -5930, -221295, -125501, -120687, -42829, -197046, 271457, 267095, -96118, -401551, -21925, 183883, 45633, -375374, 55814, 54023, 98290, 110970, 34764, 315068, 169965, 399332, 85234, -240238, 308473, -42580, -223577, 113996, -127924, 117169, 144662, -25619, -59881, -66173, 98106, 33798, -180830, 186405, -318278, -21433, -182373, 347172, -264211, 320590, 174885, 163408, 132561, 76666, 240460, 207632, 137412, -61237, 95145, 367520, 137760, -61105, 150759, 196012, 396313, 220288, 6298, -355, -326543, 73949, -19256, 137883, -71677, 194826, 128253, -17030, -84885, 251761, -183995, 10342, 1630, -7441, 281238, -49058, -227840, 376835, -131599, 172550, 86673, 284442, 100839, -272404, 148902, -103765]
11527G3701a25575p710A63756O7937H7047A3233K38182C9570a19913B2469a22209
11515f622A01550B8797f5224A55482o3040k9551L33059B6635K92068A20532c2682
11503e6833I3324A3077e6085g06B5917h0631F05591b46781E5418a7476n9806C56306
11490A10865D720J75047D8680J25398O9359a09299B06855E5430C156K60916r0699
11479A73373R9067f1281B87411K88983B24772i0844M4049H1284L52995I1946g7848
11467b2177B37125d8426B97013j17580B8683J84100J05064C5556J76660a44776
11456B24830d0630r8617A04493e1189c283j77566A46335a8850B7685a98827B76184
11444B73367e7948A81226h1282D3232a98067B56831K08183B02468b05727B95914
$$ y = [73701, -125575, -133285, 163756, 231693, 87047, 13233, 251415, 39570, -119913, 22469, -122209, -6622, 101550, 28797, -65224, 155482, 92442, 62891, 395950, 26635, 318703, 120532, -32682, -56833, 93324, 13077, -56085, -706, 25917, -80631, 605591, -246781, 55418, -17476, -77282, 356306, 110865, 4720, 179767, 48680, 174078, 243437, -109299, 206855, 55430, 3156, 264072, 173373, 272440, -61281, 287411, 576394, 224772, -90844, -46795, 81284, 434279, 91946, -77848, -22177, 237125, -48426, 297013, 179433, 28683, 212783, 317847, 35556, 212216, -144776, 224830, -40630, -139247, 104493, -51189, -3283, -180849, 146335, -18850, 27685, -198827, 276184, 273367, -57948, 181226, -81282, 43232, -198067, 256831, 465014, 202468, -205727, 295914]
11433A60861b11952o9560A15800E6285K17586D8261h1929o3655A60708p7325b04274
11421c39200f6427f996B58039a75067B70863g33940a33559Q679L9635q7628b4920
11409A67521b31605i5175r8362G4012a9088j58613N8177j26186J8831I1781g4953
11397c377E8733c2295k90454A55907a39677n585C7707J76898k9530b42343F0546
11385g2261J4471k20885A06518B3680e8119B32281a36651C1648J07508g1386n6338
11374a27724B48934a00176R38A19308a4646A37762a79916d3842k80b978D22449
11362a87493M3045M7662J6256n223j12075d9282m3512A80045j8118a02166J1869
11351i0297k66377E0783l164J18531B3303b85761E9833b11386d007A55320A067
$$ y = [160861, -211952, -281512, 115800, 56285, 273871, 48261, -81929, -145584, 160708, 83383, -204274, -339200, -66427, -6996, 258039, -175067, 270863, -733940, -133559, -124880, -85245, -172873, -24920, 167521, -231605, -95175, -193537, 74012, -19088, -177701, -119524, -245710, -226879, 91781, -74953, -3377, 58733, -32295, -322749, 155907, -139677, -145262, 37707, 214605, 185075, -242343, 60546, -72261, -57790, -278675, 106518, 23680, -58119, 232281, -136651, 31648, 139156, -71386, -127724, 248934, -100176, -99238, 119308, -14646, 137762, -179916, -43842, -44122, -2978, 422449, -187493, -144448, -96786, -80530, -85753, -197828, -49282, -92794, 180045, 161927, -102166, -90297, -356674, 50783, 47619, 166150, 23303, -285761, 59833, -211386, -4007, 155320, 1067]
11339c70561A03646C7512a61173F1187h3087A9722b95325E04712a2495B53957
11328A17669c53621C02688b02325C1832L34083D8066d01572c0508j55840A42242
11317A19109a85272C93957A30711j614b99287a29012D35851b0776j29303C8195
11306B0177K49881i5123H8624a87463A51994b3405A91870d7900k12255A85388
11295A7318K9576b54679c154n52380g7402j88168B5680J7421P0979R9756e19073
11283C5700J52727H4187j6877a01332j61379i6627j17732e5510k6964A81858c85992
11271C09528A20472i4920j61878R2981A7460b0835A09653L6637K0285b91515A07143
11259D9011a84233B232R3609a74174E4316R6930L1585a99430B02222a80306o4560
$$ y = [-370561, 103646, 37512, -161173, 61187, -83087, 19722, -295325, 504712, -12495, 253957, 117669, -353621, 302688, -202325, 31832, 365915, 48066, -401572, -30508, -186348, 142242, 119109, -185272, 393957, 130711, 129097, -299287, -129012, 435851, -20776, -150079, 38195, 20177, 270058, -95123, 88624, -187463, 151994, -23405, 191870, -47900, -260155, 185388, 17318, 46894, -254679, -3154, -555534, -77402, -265570, 25680, 43101, 114080, 213836, -519073, 35700, 188427, 84187, 67310, -101332, -262711, -96627, -214359, -55510, -82474, 181858, -385992, 309528, 120472, -94920, -256798, -163817, 17460, -20835, 109653, 146290, 166575, -291515, 107143, 49011, -184233, 2232, 95841, -174174, 54316, 151246, 182831, -199430, 202222, -180306, -244866]
11248b44866e194n66876a50716k40758A9097a06798p9908j05388A50549g5010
11237A6397b8923B25919a32428G6175a10065j69203I770a05689m45688G3561b5715
11225c01451J973e906A26759g476E7295K6879N0839a38676d7942E8489K40519
11214B99008j8532b49213K318A84537D0522P0861M8692h8056l36330h5284C5103
11202a73239m0426B21337d7576j35737l0768C2965j2895N447Q3347a03272O701
11191i6571L4143B16604b49450f2664m79987F4080g8751D89768H6f7609F1076
11179G0238b50104A35001d79192g0325m64702J98973A17395a36577K0528n7099
11169a73148c4820k66314j8617e4349k53831H0566O5674n2617R09c12944F978
$$ y = [-244866, -5194, -572070, -150716, -391474, 19097, -106798, -186706, -292094, 150549, -75010, 16397, -28923, 225919, -132428, 76175, -110065, -279268, 9770, -105689, -551377, 73561, -25715, -301451, -299478, -5906, 126759, -7476, 57295, 84174, 135013, -138676, -47942, 58489, 299008, 280476, -249213, -246895, 184537, 40522, 111383, 160075, -88056, -424386, -85284, 35103, -173239, -213665, 221337, -47576, -183313, -214081, 32965, 20070, 25517, 108864, -103272, -96571, -62428, 216604, -249450, -62664, -542651, 64080, -78751, 489768, 86, -67609, 61076, 70238, -250104, 135001, -479192, -70325, -535027, -336054, 117395, -136577, -116049, -173148, -34820, -301134, -319751, -54349, -308180, 80566, 146240, 93623, 94532, -312944, 6978]
11157g1790j87120j20494a4576A10425H297i5499J5013B7512a08081B47611r8948
11146A48663e8517q7297B26515b2421j55964j22713a24828E864K16491c2780A67751
11134a79309H6229b46529O7282e830j46127B13510C9969a58437A49760J31883
11124B81643a57055C5748a46989A81284a70036k6466D1206e9332B25492b21087
11113A77510a11692B01227N8186K68559f3701B8191a54069A97385C3266c0319
11102B68620n6564n4164R6423A15649R6264N8388P826l744j0403k6412J37308
11091C74876A59107B170J11232o310k5320D512a0533B51265F7287J422L82391
11080D51100A80939L4306F4488K35329M9008j06145l6894b0455B15916Q688I9646
$$ y = [-71790, -258910, -379404, -14576, 110425, 8297, -95499, -80486, 27512, -108081, 247611, 148663, -58517, -145814, 226515, -22421, -178385, -301098, -124828, 5864, 222355, -32780, 167751, -179309, 86229, -246529, -179247, -5830, -151957, 213510, 39969, -158437, 149760, 281643, -157055, 35748, -146989, 181284, -170036, -196502, 41206, -59332, 225492, -221087, 177510, -111692, 201227, 259413, 527972, -63701, 28191, -154069, 197385, 33266, -30319, 268620, 212056, 157892, 254315, 115649, 211913, 270301, 278127, 274383, 263980, 237568, 374876, 159107, 2170, 113402, 107092, 81772, 4512, -10533, 251265, 67287, 68709, 451100, 180939, 215245, 64488, 299817, 348825, 242680, 205786, -20455, 215916, 224604, 99646]
11068B84570k0682m1592P0782K02228o5273O8615A61689K0657L40260B46126J66947
11057D13073Q2763L15450j88825j42688J37643m4568J27185m4891k06607o8239
11047C80296K87257B96508J66484n9393M17313k65873J51524k28367K84563k75163
11037D87596J85421I9398N12407o5911P3319m1605J05641l22960J25042O2554
11027E47885R8519R7553j59016m9169m3156J82N074p9088Q7970L7850n0407J006
11015D95203M2413J7672m2780j5277j16426K22867k21411K17520K43596m19612
11005D23765A07738P61541j83673l2013j57865L34344l52144r4644K41372K02368
10995H27024J1853l08591r8186J56627j130o7530Q5631K27495l1642R7574o8052
$$ y = [284570, 263888, 222296, 293078, 495306, 430033, 498648, 161689, 182346, 522606, 246126, 413073, 495836, 811286, 622461, 479773, 617416, 572848, 700033, 655142, 448535, 380296, 667553, 296508, 462992, 403599, 820912, 555039, 706563, 478196, 762759, 487596, 673017, 99398, 611805, 545894, 619213, 577608, 683249, 360289, 485331, 547885, 646404, 743957, 584941, 535772, 492616, 492798, 497872, 418784, 506754, 544604, 494197, 495203, 537616, 555288, 512508, 497231, 380805, 603672, 382261, 599781, 843377, 423765, 107738, 869279, 685606, 653593, 495728, 830072, 477928, 383284, 624656, 827024, 838877, 530286, 432100, 588727, 587597, 520067, 605698, 833193, 801551, 899125, 831073]
10984H31073J02977K29235n3480k16112n6314J91864j24738O60250P0505L34573
10974A969833J5344N21498j16850N0253l6483j23873j62895m47989p3329l95311
10964A200198n9510K37549m7772M70889p62676Q84781l93949K33398k57526Q6265
10954A591647P3366l61449K03031m88800J54336n29784k58174J75134B58379J22409
10944C80788G8805M78605k72034J995i2304C52958a07931D41976B8820K76486
10934C05306K10459B49729c21794c3815A06014a20529K1410A78966a74545d2215
10923i5339a6895H5256b8229n1005A52467b39720h8771A16800J87030L1851d06689
10911A07028b99851F6500b94735j60686B15475d171E7732P2824H55b57909B96217
$$ y = [831073, 934050, 1163285, 1109805, 893693, 837379, 1029243, 904505, 1564755, 1635260, 1969833, 1985177, 2506675, 2389825, 2440078, 2403595, 2279722, 2116827, 1668838, 1595509, 1200198, 1140688, 1378237, 1330465, 1801354, 1038678, 1923459, 1529510, 1762908, 1505382, 1591647, 1665013, 1303564, 1506595, 1017795, 1172131, 642347, 384173, 559307, 258379, 380788, 78805, 557410, 285376, 287371, -92304, 352958, -107931, 441976, 28820, 305306, 515765, 249729, -321794, -33815, 106014, -120529, -99119, 178966, -174545, -42215, -95339, -16895, 85256, -28229, -79234, 152467, -239720, -88771, 116800, 303830, 335681, -406689, 107028, -299851, 66500, -294735, -455421, 215475, -4171, 57732, 130556, 855, -257909, 296217]
10899C606J33591l8307J17272l630a54536A46278f1178H6104a72447A07339K02101
10888C09440a3890k8941k6284m145B49495c32112A10070c6733B47725J6936c14539
10876B3567g1363C00243r1961e2211q0584N9222a6039B07698b70090B34266C3621
10864b5326B64592a4741j84944a5055q6669b3393j19938O7089M540j6947K636
10853h6013j03698B35079a39185d2209l416J7022A90483a84399D1066g0727l7349
10842a08076b8366j01335i433j72964B05205a06409A5113J54644k6791l0159Q5752
10831A98559E6763b13025A54648d186n8018n1197G7147A7247a06489B8634K09222
10820B37856g911l6483n2679A46725b61604J10407B0673b15143A4698J08116J08869
$$ y = [3606, 137197, 98890, 216162, 212532, -154536, 146278, -61178, 86104, -172447, 107339, 309440, -13890, -42831, -69115, -73260, 249495, -332112, 110070, -36733, 247725, 264661, -314539, 23567, -71363, 300243, 208282, -52211, -132795, -73573, -16039, 207698, -270090, 234266, 33621, -25326, 264592, -14741, -199685, -15055, -101724, -23393, -143331, -76242, -71702, -88649, -86013, -189711, 235079, -139185, -42209, -45625, -28603, 190483, -184399, 41066, -70727, -108076, -28366, -129701, -9433, -182397, 205205, -106409, 15113, 169757, 142966, 112807, 198559, 56763, -213025, 154648, -4186, -62204, -113401, 77147, 17247, -106489, 28634, 237856, -7911, -44394, -97073, 146725, -261604, -151197, 20673, -215143, 14698, 122814, 231683]
10809B31683b76609J22335J9197I9605c11917A71743F8238e3868j93958A66401
10798E2357g2047j32562g1106p3790a7037j66101g4489a3390B3073g3246B54323
10786A76195a08417B557J97870c00302b2463B38337h6370k18406e60p3616k72486
10775c46662j7690F5675b74382f125r0678B07435I46J23250A7376a69946j85093
10764c55039D8093b50964B80693F3590i5322C32991D5487c1609j25970a226q4761
10753h5987r0215m1181N2191P5234l9581j94072J10783F9171c31682F7010B9090
10741G94M01515a5986l7674j28748A70218B7142a12289r7763j16831J13579j2271
10730b25575C681a05364r9627j6476r4373e5023m47902A05043b4533P020j34532
$$ y = [231683, -276609, -154274, -135077, 99605, -311917, 171743, 68238, -53868, -247826, 166401, 52357, -72047, -204609, -71106, -144896, -17037, -183138, -74489, -13390, 23073, -73246, 254323, 176195, -108417, 2557, 200427, -300302, -22463, 238337, -86370, -304776, -560, -74176, -346662, -364352, 65675, -274382, -6125, -96803, 207435, 946, 124196, 17376, -169946, -355039, 48093, -250964, 280693, 63590, -95322, 332991, 45487, -31609, -157579, -1226, -85987, -176202, -217383, -165192, -89958, -129539, -323611, -212828, 69171, -331682, 67010, 29090, 794, 402309, -15986, -53660, -182408, 170218, 27142, -112289, -210052, -326883, -213304, -225575, 3681, -105364, -204991, -221467, -315840, -55023, -502925, 105043, -24533, -17513, -152045]
10719a52045O1877m6761O5411A3501b7176m10326A42861a54154o0745m0161b6020
10707A31906a43927E9251b99076J20942A67748c9610B39448c8790l29021e3476
10696e504l94282a73860A04541b5884l2879A18297b16803j41574B48499I5641
10685h7963a3483j80537j98771c2405k27973C80104b83129A72165J3589a54032
10674B85799a00299I5720f246p6957C9033N4221a01256D7221N5061K96797A74638
10662i3718b781j94757e9530g130G4858K44210b93434A9462c97972a2867k7865
10651d0732a6292B2537g2193q2337k08390g2991a8178p679p8623C3767g9015A03386
10638B3834K20248b13B16588E9206b32643j98094B1458O6752h0105B10315a57585
$$ y = [-152045, -90168, -136929, -71518, 13501, -27176, -437502, 142861, -154154, -214899, -255060, -26020, 131906, -143927, 59251, -299076, -178134, 167748, -39610, 239448, -38790, -367811, -53476, -5504, -399786, -173860, 104541, -25884, -58763, 118297, -216803, -358377, 248499, 95641, -87963, -13483, -194020, -392791, -32405, -260378, 380104, -283129, 172165, 185754, -154032, 285799, -100299, 95720, -6246, -83203, 39033, 93254, -101256, 47221, 102282, 399079, 174638, -93718, -2781, -197538, -59530, -7130, 74858, 319068, -293434, 19462, -397972, -12867, -40732, -16292, 22537, -72193, -154530, -362920, -72991, -18178, -25857, -104480, 33767, -79015, 103386, 23834, 244082, -213, 216588, 59206, -232643, -430737, 21458, 88210, -80105, 210315, -157585]
10626A9958g9557A33937a55298k54021D7667b58602A8220a65144A08030A384J18244
10615A19628b29441N9058K2002A20091P7553b63709q4890j69173a10724p1922
10605a82646H0175b32089A10725k0650c6615A68669g8589j45326h5989C00355
10594a82390b9702B23909B2895f3251J2649B0442b0712j98988D22102d159k40012
10583b44171j1285F6735b43913K0394N2873g7023o9008B16638a83863g6292k30016
10572c06308E91460c67253i1942E1843o264f4023l41070b56C1957g8447o2568
10561a41015F5225O9129K5698b01448h4526A31025k1318C035i2206J5620L6707
10550c9879l36360C2061h6027a1302D34002A11565k8715R9238e7816j29468N3338
$$ y = [19958, -79557, 133937, -155298, -409319, 47667, -258602, 18220, -165144, 108030, 1384, 119628, -229441, -170383, -148381, 120091, 197644, -263709, -348599, -517772, -110724, -182646, 80175, -232089, 110725, 90075, -36615, 168669, -78589, -223915, -85989, 300355, -182390, -29702, 223909, 22895, -63251, -50602, 20442, -20712, -219700, 422102, -4159, -244171, -255456, 66735, -243913, -223519, -170646, -77023, -146031, 216638, -183863, -76292, -306308, 591460, -367253, -91942, 51843, 45579, -64023, -405093, -256, 31957, -78447, -141015, 65225, 134354, 160052, -201448, -84526, 131025, 109707, 3035, -92206, -76586, -39879, -376239, 32061, -86027, -11302, 434002, 111565, 82850, 182088, -57816, -187284, -133946]
10539a33946p5487n2217D17728a0667m60504g849A06891P1220e54847i245j39593
10528a48838o4943r1572g6888K9240j42843A30376N34a18519l0674e5322A12553
10516f6024j05654g7265L8400C6156L892o662a45296A35597a22049B80203c10229
10504a05889e2482j04524o0073K4072O5103A94648b17951r2091g5875b8862B16979
10492E9662B2637M6303N6504o0004b99206A37744M0652Q8073J5438m0405J22569
10481C64071j65362N5696J60491B4853L53518c0984j39493b5931l7685F7613a07708
10469A85780i1515j6501j94124I3199b8096A02250h7720J1641a5597l5081l12433
10458c63111G650a32490B66238e1731C5793d54415a81768B9618R0655i7429r9112
$$ y = [-133946, -209433, -261650, 417728, -10667, -471171, -7849, 106891, 178111, -554847, -9245, -148838, -213781, -305353, -76888, -47648, -190491, 130376, 130910, -118519, -149193, -55322, 112553, -66024, -171678, -77265, -38865, 36156, 40048, 33386, -145296, 135597, -122049, 280203, -310229, -105889, -52482, -157006, -217079, -193007, -127904, 194648, -217951, -310042, -75875, -28862, 216979, 59662, 22637, 68940, 125444, 65440, -299206, 137744, 178396, 266469, 281907, 241502, 364071, 198709, 254405, 414896, 24853, 378371, -30984, -170477, -25931, -63616, 67613, -107708, 185780, -91515, -108016, -302140, 93199, -28096, 102250, -87720, -76079, -15597, -50678, -363111, 7650, -132490, 266238, -51731, 35793, -454415, -181768, 29618, 120273, -97429, -196541]
10447a96541m06973a08070B02147e3173B53724h1415m0252p778D0709K72181j53316
10436A59574g145D63217a36469c948C17407j08793a86068k48674c0174J3061p1559
10425h8672b1864j45607D03544a55831A21931m0069i7993L3768F9015J90815A02709
10413i7955j5750e5829B5823R2507b82626f0162j14083B22712c8779k45079C79426
10401a1090D7038a64373d2497j18725O6875A13413a1677B90511d8185j390j6241
10390f5816B31439n5746O1231a0550D48873c44394A52981g2623H2215N7812b79754
10378e3697I0058j5012J60247C5189J20066a91343D84310a58983A2180J68388
10368A80568J76553k3132J45615k19591J93455L852J64407I6101O0151o7890m253
$$ y = [-196541, -603514, -108070, 202147, -53173, 253724, -81415, -121667, -129445, 40709, 312890, 159574, -7145, 463217, -136469, -3948, 317407, 208614, -186068, -434742, -30174, -17113, -88672, -21864, -167471, 403544, -155831, 121931, 81862, -97993, -64225, 69015, 259830, 102709, -97955, -113705, -55829, 25823, 118330, -282626, -60162, -174245, 222712, -38779, -283858, 379426, -11090, 47038, -164373, -42497, -161222, -94347, 113413, -11677, 290511, -48185, -49575, -65816, 231439, 175693, 236924, -10550, 448873, -344394, 152981, -72623, 82215, 140027, -279754, -53697, 90058, 75046, 235293, 35189, 155255, -191343, 484310, -158983, 12180, 180568, 357121, 333989, 479604, 260013, 453468, 457320, 621727, 96101, 156252, 88362, 84109]
10357H4109R2248m7553M2316M0512K17183A27947L22630p1168j21199N1970m5448
10346B64732j7713B5135a7101B72800q5095J87885b01018D06078G3384a08726
10335H3099P3073a56099B32088J09777A10832a25078N3357A09949n2207N5718
10325A13460l1812K5076J92143A19948J02414C3950M4109J54248i3201I6863h0983
10313C15343a38440E44206D4996J9617i5383a1580d783r6166E3277h4757A71434
10301e0804m3972I1403c6282B57413A21602a76344m2510k30755C4575J7475c37899
10289b11681B13821a12198c1842B65708i8505a74j47403a9415k69984K1006a7952
10277A79803a42210C1615K36462e59542J4515A23731O3048K5214c77425B99584
$$ y = [84109, 176357, 128804, 171120, 211632, 428815, 127947, 450577, 379409, 258210, 310180, 264732, 247019, 25135, -17101, 272800, 187705, 375590, -201018, 406078, 73384, -108726, 83099, 156172, -156099, 232088, 341865, 110832, -125078, -71721, 109949, 57742, 113460, 81648, 106724, 298867, 119948, 222362, 33950, 78059, 232307, -93201, 96863, -80983, 315343, -138440, 544206, 44996, 64613, -95383, -11580, -4783, -100949, 53277, -84757, 171434, -50804, -94776, 91403, -36282, 257413, 121602, -176344, -218854, -449609, 34575, 52050, -337899, -211681, 213821, -112198, -31842, 265708, -98505, -174, -147577, -19415, -289399, -268393, -17952, 179803, -142210, 31615, 268077, -559542, -545027, 123731, 186779, 211993, -377425, 299584]
10266A24515Q5213C730J34504E7224B201a8967B07453o9109P0035a30847P48c3764
10253a54028k68516a26396j31393K3615I8572a13569j48640A71876a16532M9659
10243f6873A68541i4650j80600J2396H7990d14343A27584f649o478F8793J909
10232G0702J89646f0794D35600f9406B86723j27519a31652k19085c1927k19599
10222b51526p7190P8478d952A77433a40414d9312G8666J7514i3569A76366R9369
10211B75735A37121c5165A28177J3790Q5162j1072b54008J07361A3701J09604
10201A23305c54912B08666b17517A93155f9237B89381b49158D2389P3004a1042
10190a87173B30972g0346G6442J18856d5018j36527p3110A4648K02933H9463b89000
$$ y = [124515, 209728, 3730, 138234, 57224, 2201, -18967, 207453, 138344, 208379, -130847, -130099, -33764, -154028, -422544, -126396, -257789, -234174, 98572, -113569, -262209, 171876, -116532, -66873, 168541, -94650, -275250, -262854, 87990, -414343, 127584, -6649, -13127, 68793, 70702, 260348, -60794, 435600, -69406, 286723, 159204, -131652, -350737, -31927, -251526, -328716, -250238, -4952, 177433, -140414, -49312, 78666, 96180, -93569, 176366, 275735, 137121, -35165, 128177, 141967, 227129, 216057, -254008, -146647, 13701, 123305, -354912, 208666, -217517, 193155, -69237, 289381, -249158, 42389, 115393, -11042, -187173, 230972, -70346, 76442, 195298, -45018, -181545, -254655, 14648, 217581, 89463, -289000]
10178A01093g1625m7685e6964r673A36153i6527k24333j40625a79515F1971C408
10166a86749p822N1922D2208K08003i3414a316C07857B8290J3876L0528a05564
10154c64306a38448l0119A10363J03628r3724A1296i8253M3208h745l4353j13441
10143a56539C36840e6383A05522b55737l7057a33996F9608a06638A48395a54759
10132a43982A55572r786K9038I277i3357m2193M1233l7070B01908b4124m04806
10121d28930G329b52373F5096i3557k43808h5313I9259b58469q6503A52751f1280
10109A90086Q4557f1640D9147d05521F8001b13803g006D1137C153a54104k11583
10098c65687a61774E374a53797p4076j10637B03679q8239j905c10873J30714K2051
$$ y = [101093, -71625, -119310, -56964, -66637, 136153, -96527, -320860, -461485, -179515, 61971, 3408, -186749, -194571, -142649, 42208, 250211, -93414, -1316, 307857, 28290, 42166, 72694, -105564, -364306, -138448, -168567, 110363, 213991, 120267, 11296, -98253, -55045, -8745, -43098, -156539, 336840, -56383, 105522, -255737, -292794, -133996, 69608, -106638, 148395, -154759, -143982, 155572, 145786, 174824, 9277, -93357, -135550, -94317, -131387, 201908, -24124, -428930, 7329, -252373, 65096, -93557, -337365, -85313, 99259, -258469, -344972, 152751, -61280, 190086, 274643, -61640, 49147, -405521, 68001, -213803, -7006, 41137, 3153, -154104, -365687, -161774, 5374, -153797, -227873, -338510, 203679, 115440, 113535, -310873, -180159, -158108]
10087a58108M462D487a74214A76437e5115k73249b2459A46307N4155c30726D4219
10075b29239B8587h056A22878a88152j30925A53667J1130a64131f5027K7041B9106
10063H004b41489A73014Q5712a44914k8605a3364H6625b25298L4031r3660b0485
10051b33586J05588k44357a04813B39017b63315J3568A45870a33756J6685k08961
10041c26032Q4953A94131h1427k93156J86661I6042a06723k02502A44670b0489
10030d9680j56263Q3383n4811J977E0282J32903c44382J02353R1988B90697a06808
10018b91216h407A00626a59621j90769l5481J10718K8323e2908k496j23793C23346
10006B59033C2511K77311e02012J70556a8862l58275a42193M3983M7901p4971
$$ y = [-158108, -153646, 4487, -174214, 176437, -55115, -328364, -22459, 146307, 200462, -330726, 44219, -229239, 28587, -8056, 122878, -188152, -319077, 153667, 164797, -164131, -65027, -37986, 29106, 8004, -241489, 173014, 258726, -144914, -173519, -13364, 86625, -225298, -191267, -284927, -20485, -233586, -127998, -372355, -104813, 239017, -263315, -249747, 145870, -133756, -117071, -326032, -241079, 194131, -81427, -374583, -187922, 96042, -106723, -309225, 144670, -20489, -49680, -205943, -122560, -177371, -175394, 50282, 183185, -344382, -242029, -150041, 290697, -106808, -291216, -8407, 100626, -159621, -350390, -385871, -275153, -246830, -52908, -55404, -179197, 323346, 259033, 32511, 309822, -502012, -331456, -18862, -377137, -142193, -98210, -50309, -125280]
9996a25280L8880G8357a60032B41229a52556n7422K8075e9603k2412q3461A46177
9984E2075J69624n1896b71271b4874j83372A45594D7132J16846k3453b55930A9220
9972a2666B25357l3265D2708b03590e0120B77653b64l7862k3038B486K7297Q7891
9960A17674K0644a02419J8770B18568b28881J11898A12104a38984A66746c00533
9949d08156a49062o8905a6902o0944j00723j03238i8344j91370n323c0072m8097
9938g8169A80295a64047q8167J20138l9253G4439J01171p9565g0579l45A81487
9926D3771c89245d1637e872A03655b7384B24735d1105A71671b1188m793m58697
9915d84678C73844F7576O355Q8872A137b17060N1093C06326a7837k6953J8367
$$ y = [-125280, -86400, 78357, -160032, 241229, -152556, -209978, -181903, -59603, -82015, -165476, 146177, 52075, 221699, 169803, -271271, -24874, -208246, 145594, 47132, 163978, 140525, -255930, 19220, -12666, 225357, 192092, 42708, -203590, -50120, 277653, -264, -38126, -61164, 2486, 29783, 117674, 138318, -102419, -83649, 218568, -228881, -116983, 112104, -138984, 166746, -300533, -408156, -149062, -217967, -16902, -77846, -178569, -281807, -98344, -289714, -295037, -30072, -78169, 180295, -164047, -252214, -132076, -171329, 74439, 175610, 96045, -70579, -70924, 181487, 43771, -389245, -41637, -5872, 103655, -27384, 224735, -41105, 171671, -21188, -25981, -484678, 373844, 67576, 73931, 162803, 1137, -217060, -165967, 306326, -17837, -44790, -26423]
9904b6423j42670b7560j36432D4162L14981b13081b3306j31406a9509B12063e9530
9892A31360A5423a25075C1334b56558G2859B2448f2660B70933a94696h1890k80362
9881c62252a73028q6891k3799H0261N4946a16646H9934D1001j6538K1225d4596
9869A81821J3346c98801J71621c8944e443l22152B07903a9785j96641d5253l8826
9858h4079A28399a47640B94650e9415j41259B40898b45416B96819b95994o3776
9848c59770M9870G8036L43478d15594G7731a5446B79928c43611C7224b21134F2964
9836a50349J7040H8515a02780I9900a78781r4441I8626L0387c8360k4646j16686
9825a79692Q5737H6489d5407i721o5386k63006O1837A06525b82858J0443A770
$$ y = [-26423, -169093, -27560, -163992, 44162, 359143, -213081, -23306, -154712, -19509, 212063, -59530, 131360, 15423, -125075, 31334, -256558, 72859, 22448, -62660, 270933, -194696, -81890, -362252, -173028, -259919, -283718, 80261, 135207, -116646, 89934, 41001, 24463, 45688, -44596, 181821, 195167, -398801, -227180, -38944, -5443, -327595, 207903, -19785, -216426, -45253, -84079, 128399, -147640, 294650, -59415, -200674, 240898, -245416, 296819, -295994, -359770, -309900, 78036, 421514, -415594, 77731, -15446, 279928, -343611, 37224, -221134, 62964, -150349, -133309, 88515, -102780, 99900, -178781, -273222, 98626, 129013, -38360, -63006, -179692, -93955, 86489, -45407, -9721, -75107, -338113, -276276, 106525, -282858, -272415, 1770]
9813c34666a03130j05410B02780H3802b81513B08577a84194a3702r6544F3694
9802d7011A18828O3521c6033j85592q5804R6763m9616G6256a53157k2298j20210
9791b95665D7800P9453n2302i081D1882d03090a19409C060J01319a44017c9932
9779b15543j58323f1335A69929b46893J03384O6017B4382a77159r6594A42540
9768a11941l4654B443N9553c3570m84776i3451A22116k6545a54661A06555b92390
9756a79096d4515r2782O5698A83350n4236o0940a8675p7730b1831C38947b07473
9744c61911a34117A59244R4329a09660A693a59993N4249c97j10822A66967m4164
9733A22803k6420c0875H2852R1306c06992a48030A7693P8763a31809K5022C17506
$$ y = [-334666, -103130, -208540, 202780, 83802, -281513, 208577, -184194, -13702, -110246, 63694, -47011, 118828, 182349, -36033, -221625, -307429, -210666, -260282, 76256, -153157, -175455, -295665, 47800, 127253, 74951, -9081, 41882, -403090, -119409, 3060, 104379, -144017, -39932, -215543, -373866, -61335, 169929, -246893, -143509, -77492, 24382, -177159, -273753, 142540, -111941, -146595, 2443, 61996, -33570, -518346, -93451, 122116, 95571, -154661, 106555, -292390, -179096, -44515, -137297, -71599, 183350, 129114, 68174, -18675, -96405, -21831, 338947, -207473, -361911, -134117, 159244, 253573, -109660, 1693, -159993, -105744, -397, -111219, 166967, 122803, 96383, -30875, 82852, 174158, -306992, -148030, 17693, 96456, -131809, -106787, 317506]
9721A65405h1490A40306a01594M1945j07295j121A87411E526b82518J27532J5621
9710a39365p8384h1781B3861A829e7132j6231N696j61467A82220b31537I4220
9698B99398b0138H107Q2368h4859a5368B29801a9809A04237a13767k47506a15014
9686A69582a79971p4675c513j88941b4914o4909G238c10466g3625C76963i7108
9674a51700d1761D2159J1287K01449b60923C24532G954a1059j48219g340r6360
9663a03700A1239f98796b54335N5903O2689N0595j03031g0835m0364M9214D06668
9651f6044j92713O1377c993A93463G4026a9222q7971M4783n1125A46553b9179
9639C5524a91094j83814A40026h16F221b20983i0119L1408B42282e4112k24831
$$ y = [165405, -81490, 140306, -101594, -59649, -166944, -168065, 187411, 5526, -282518, -154986, -139365, -217749, -81781, 23861, 1829, -57132, -73363, -67667, -229134, 182220, -231537, 94220, 299398, -20138, 8107, 90475, -84859, -15368, 229801, -19809, 104237, -113767, -361273, -115014, 169582, -179971, -254646, -3513, -192454, -24914, -89823, 7238, -310466, -73625, 376963, -97108, -151700, -41761, 42159, 53446, 254895, -260923, 324532, 7954, -11059, -159278, -7340, -103700, 11239, -698796, -254335, -198432, -135743, -85148, -188179, -70835, -111199, -61985, 406668, -66044, -258757, -197380, -3993, 193463, 74026, -19222, -107193, -62410, -113535, 146553, -29179, 35524, -191094, -374908, 140026, -816, 6221, -220983, -90119, -58711, 242282, -54112, -278943]
9628b78943B6200a25164f181j82548K3377k47165F7597K1567g2396J7197j96161
9617b51360c234k13787E6806K42720A8182a3411F4976i1071A4188b0043i906F0298
9604A40468e8199j620m8977d1699A4961b81781B54286b14162A30368d90501B58836
9592a72584E6932j4677a10565l9636m198G7767M2988e0180A33009g4361B43099
9580a47611r6795M3623j70513B33401b56262r2178B54482b17728C09824A20281
9569b17562B50190c24215A03821E872c80992i5786P568b1225j84187D10J05879
9558A06289b5217A35980a47832m8207A14133K948D7206a11530A1156A887d6231
9546f6318A20771l2111f3579j91677H735b63752A98424d99769a32721k24010d4046
$$ y = [-278943, 26200, -125164, -6181, -188729, -165352, -412517, 67597, 89164, -72396, -55199, -251360, -3234, -217021, 56806, 299526, 18182, -13411, 64976, -91071, 14188, -20043, -9906, 60298, 140468, -58199, -59819, -108796, -41699, 14961, -281781, 254286, -214162, 130368, -490501, 258836, -172584, 56932, 42255, -110565, -150201, -154399, 77767, 120755, -50180, 133009, -74361, 243099, -147611, -244406, -200783, -371296, 233401, -256262, -348440, 254482, -217728, 309824, 120281, -217562, 250190, -324215, 103821, 5872, -380992, -95786, -88218, -21225, -205412, 410, 106289, -25217, 135980, -147832, -196039, 114133, 117081, 47206, -111530, 11156, 1887, -46231, -66318, 120771, 88660, -63579, -255256, 8735, -263752, 198424, -499769, -132721, -356731, -44046]
9534A06296b50323N732L0827O1292a8305A78684m0822j260a82592h2000C8356
9522h7930d05l45681L2468A27479f1798G409h4466B35160i4051p6194e2600A85788
9509a57133k90653C7040a43399F5443N4023N4422A8733M0116J3607d5348A11104
9497E6943b12886H7386g2366c1390C57240B2370g049k74343i8668j92304B5212
9485D4340c613j87999A51302c12317B55644b23021D5331b41977A36182F6928h6233
9473a10499D6397M4156a0772r0867j48931d3685B49951A02261f1196l46466g955
9461c27847F3121b32028h0845n3595K0787n40748a10526B9775b96582d0965E2294
9449f4560l7978k6346F0160J32416b5034k11004A20605B2316i3140r5540e3565
$$ y = [106296, -250323, -244591, -213764, -152472, -18305, 178684, 137862, 136602, -182592, -82000, 38356, -87930, -405, -346086, -313618, 127479, -61798, 7409, -84466, 235160, -94051, -170245, -52600, 185788, -157133, -447786, 37040, -143399, 65443, 119466, 173888, 18733, 58849, 72456, -45348, 111104, 56943, -212886, 87386, -72366, -31390, 357240, 22370, -7049, -281392, -98668, -290972, 25212, 44340, -3613, -191612, 151302, -312317, 255644, -223021, 45331, -241977, 136182, 66928, -86233, -110499, 46397, 90553, -10772, -101639, -250570, -43685, 249951, 102261, -61196, -407662, -7955, -327847, 63121, -232028, -80845, -134440, -113653, -654401, -110526, 29775, -296582, -40965, 52294, -64560, -102538, -128884, 60160, 192576, -25034, -236038, 120605, 22316, -93140, -188680, -53565]
9437e09351a11535q546k34152a51720B9095M4011a17733J7487k0484l2976K1056
9426a32650O3340j29909b0562k6337r4248A05858a86083R1161G8087i9450I6680
9414A77385a00917k09283J43551k2234E091c832C2865m291a72536p6794i9885
9402A15391b05216E4122a41832F4234C1419b7896j33110n0193G7011J00732e5425
9390A02372b10440i0393L3373k62429a6430l12054k8471J50365d9762k13768A96719
9378b29109D16622a13804d6720j53961A52171k9253b224q1994m5524c3981E4692
9366A29417g4541b6161j72426B34527a90165b9252o3070K7523J1250a9206r6187
9355a15393A67505L4719n1358g405m2356k28327A63898B392b82694C341L15103
$$ y = [-509351, -111535, -120081, -354233, -151720, 29095, 73106, -117733, -100246, -120730, -153706, -132650, -69310, -199219, -20562, -46899, -141147, 105858, -186083, -94922, 78087, -99450, 96680, 177385, -100917, -310200, -166649, -188883, 5091, -3832, 32865, 28574, -172536, -249330, -99885, 115391, -205216, 54122, -141832, 64234, 31419, -27896, -161006, -211199, 77011, 177743, -55425, 102372, -210440, -90393, -57020, -319449, -16430, -328484, -356955, -206590, -49762, -263530, 196719, -229109, 416622, -113804, -46720, -200681, 152171, 122918, -2224, -84218, -129742, -33981, 54692, 129417, -74541, -26161, -198587, 234527, -190165, -29252, -92322, -64799, -53549, -19206, -115393, 167505, 202224, 150866, -7405, -49761, -278088, 163898, 2392, -282694, 3341, 318444]
9344C18444b4903A43198b82233A1270a33366J8403d2557m9621B27341B0190h9570
9332b33043F6798b36784A35584d28556Q9899b5149C88135B9847b2146F3105a29689
9320F7061J28359f9714k5765j79583N5907f1239r8604M5461d9123j48100R3307
9309a03916H8535C0834b177k87548F0131J49444a9595B1654a54497A58058A8279
9297c4947k93335g2272m9264q9869A30454b34103a16583K848M6000A85963g4332
9285a67006C0743K23662A08134g0556m5496m8597C20957a18721B69937c0592k40442
9274b71034a1104k307j24236A39786k0693c24071N1033D5639n568K4818l293B8833
9261a92858A95605e8881j03799k94827B1769K94212E8742L35002a69167j80034
$$ y = [318444, -24903, 143198, -282233, 11270, -133366, -114963, -42557, -92178, 227341, 20190, -89570, -233043, 66798, -236784, 135584, -428556, -338657, -25149, 388135, 29847, -22146, 63105, -129689, 67061, 195420, -69714, -95479, -275062, -219155, -61239, -159843, -114382, -49123, -197223, -103916, 88535, 30834, -2177, -289725, 60131, 209575, -19595, 21654, -154497, 158058, 18279, -34947, -328282, -72272, -121536, -211405, 130454, -234103, -116583, -113735, -67735, 185963, -74332, -167006, 30743, 254405, 108134, -70556, -116052, -164649, 320957, -118721, 269937, -30592, -271034, -11104, -13411, -137647, 139786, 119093, -324071, -273038, 45639, 40071, 64889, 61596, 28833, -192858, 195605, -58881, -162680, -457507, 21769, 315981, 58742, 393744, -169167, -349201]
9251c49201B0604e2488j48533A90157a45388o9732j40187c9877j09743B38284
9240b82144J16353J4122A65078j0970a20762C81028e8179B90217b76139O5387
9230b10752A22343C0034M2952a78383A12241J36129d2420j67033N4113B9951Q6043
9219A15994a59888j10439O7486D77141a36529l13410G9569b86461B6913c64652
9208a86173A76930d8233o9573q6788f2721n3458E605b60777c0046A67800q1852
9197H5948j9964J51690i5289j78661N9307o105i7114A04556c41013A1794K08003
9186B19797b40012g5864A6019a13279H7751a68914o2824B20211I1811K54321a69304
9174a25601A18909D7792m037b96282K4043O292J6248a10449A95883c95027D3236
$$ y = [-349201, 20604, -52488, -201021, 190157, -145388, -215120, -355307, -39877, -149620, 238284, -282144, -165791, -151669, 165078, 154108, -120762, 381028, -58179, 290217, -276139, -210752, 122343, 30034, 72986, -178383, 112241, 248370, -42420, -209453, -155340, 29951, 115994, -159888, -270327, -202841, 477141, -136529, -449939, 79569, -286461, 26913, -364652, -186173, 176930, -48233, -117806, -204594, -62721, -116179, 5605, -260777, -30046, 167800, 85948, 65984, 217674, -95289, -273950, -214643, -220748, -97114, 104556, -341013, 11794, 219797, -240012, -75864, 16019, -113279, 87751, -168914, -231738, 220211, 91811, 346132, -169304, -125601, 118909, 47792, 43755, -296282, -272239, -265947, -249699, -110449, 195883, -395027, 43236]
9162C59698O7472a2664j51529k57140f7674C6102J21074a77504C9607E295L14270
9151C19565j58610d0351D7575a3558j93778j6602A6117b50855B5047b03105f7512
9139a88906j08349A36709j5735K4146a93893j5451C18887j0312h4409i400j64387
9128a73787m8773L0266A6728b42889q6161d15j07586l02630J67311Q5231B55523
9116g9745A87273H8903D3541a94972N6774j30821f7575B46255a98951L6823c8496
9104b20852B5272e9487m7411j75937d6300A16643a04063L0491P437q7490A69219
9092c86256B01553a94256A3707b2838j18327r4487H6226a95059c2680j6104k29005
9081b77789A14045e9612n057G3044l6074c55111A33365a09221n0958c7329B57915
$$ y = [359698, 427170, -12664, -164193, -421333, -67674, 36102, 157176, -177504, 39607, 5295, 319565, 160955, -40351, 47575, -13558, -207336, -223938, 16117, -250855, 25047, -203105, -67512, -188906, -297255, 136709, 120974, 145120, -193893, -209344, 318887, 308575, -84409, -9400, -173787, -222560, -192294, 16728, -242889, -329050, -415, -108001, -410631, -243320, -158089, 255523, -79745, 187273, 88903, 43541, -194972, -138198, -269019, -67575, 246255, -198951, -162128, -38496, -220852, 25272, -59487, -106898, -282835, -46300, 116643, -104063, -73572, -66135, -153625, 169219, -386256, 201553, -194256, 13707, -22838, -141165, -235652, 86226, -195059, -32680, -48784, -277789, 114045, -59612, -64669, 73044, 36970, -355111, 133365, -109221, -160179, -37329, 257915]
9069c07853A26371b70926J4739J24202j43894j6883I8121A1173f8696k05718B71939
9057A76178i3446p0411J665j31778c2660F7696b40603B7254J19290b22889O941
9046b15948A61423F8830h1268k6755e1670j21811G1736C0054J8083D721g105j93437
9034b00542I5119a7963q7956F898J44700e26612C14773a45553H2367c51689L4531
9023c17158B4818F973a069j29622K5626k10470J18641k42317A17747a33233k45987
9012c79220l0704i8259b7356A25380e8425p1068I3904H684i6039B60172i9561
9000A27516N2939J1930b57944k3735J22546J4188a735n6247j08705b8456A89298
8988A09617h2286k17526B54689e5317o5012k4995M2880A83944a26343j39743F756
$$ y = [-307853, 126371, -270926, -256187, -131985, -275879, -292762, 98121, 11173, -68696, -274414, 271939, 176178, -93446, -163857, -162192, -293970, -32660, 67696, -240603, 27254, 146544, -222889, -215948, 161423, 68830, -81268, -108023, -51670, -173481, 71736, 30054, 48137, 4721, -7105, -200542, 95119, -17963, -105919, 6898, 151598, -526612, 314773, -145553, 82367, -351689, -317158, 24818, 6973, -1069, -130691, -105065, -315535, -196894, -439211, 117747, -133233, -379220, -409924, -98259, -27356, 125380, -58425, -129493, 93904, 8684, -96039, 260172, -99561, 127516, 180455, 192385, -257944, -281679, -159133, -144945, -1735, -57982, -166687, -28456, 189298, 109617, -82286, -299812, 254689, -55317, -120329, -145324, -102444, 183944, -126343, -266086, 6756]
8976a73980B3849b45913A4147b31759k11100a13424D3684a34589e9871H935c09131
8964a72585g5653j25458B18911P0850a14206q2103A80839O916E8311J400P379
8953F7090M9719b81997G2678f4525C41420C3572E37P2273b36507d7778B998b36800
8940b11027A82795a16816l49856a88970B8490L48887a58467k0104A54248I48b8215
8928a10719l656g313C12991L88063K83465K431794O892033N59334D408447E81856
8917F30502k40012j12875j23397d09920A43640e792A60657K16345j43651O7228
8907C00579H9725i9965o457E6900g5694m14365a42674h836j60396B2602R3537
8896A16139J9139a92030r2025N2550d3539r5875b308A5722h5171j50882N7750
$$ y = [-173980, 23849, -245913, 14147, -231759, -442859, -113424, 43684, -134589, -59871, 8935, -309131, -172585, -75653, -201111, 218911, 289761, -114206, -196309, 180839, 187755, 58311, 59711, 67090, 116809, -281997, 72678, -64525, 341420, 33572, 537, 72810, -236507, -47778, 2998, -236800, -211027, 182795, -116816, -466672, -188970, 28490, 377377, -158467, -178571, 154248, 948, -28215, -110719, -114375, -7313, 312991, 701054, 984519, 3416313, 10308346, 10867680, 4408447, 581856, 630502, 390490, 277615, 154218, -409920, 143640, -5792, 160657, 377002, 233351, 300579, 89725, -99965, -106422, 56900, -75694, -490059, -142674, -8836, -169232, 22602, 116139, 135278, -192030, -284055, -231505, -43539, -139414, -2308, 15722, -85171, -236053, -178303]
8885a78303l961D6088L155a33548j62058q7076e2897C91185g2617j5890a7522
8873F59c66744D1892R6444k6302K50540b38451P0756M8575A86821g8634r0489
8862a69123r2955A49281a09622c2985B32239c70164J46209j19186J2442B97058
8851C7437Q942k0842J22764p1109P6206o6557b11667A02707K08227a16748k62790
$$ y = [-178303, -182264, 46088, 49243, -133548, -295606, -382682, -52897, 391185, -72617, -88507, -17522, 659, -366744, 41892, 138336, 112034, 362574, -238451, -167695, -119120, 186821, -78634, -169123, -262078, 149281, -109622, -32985, 232239, -370164, -223955, -343141, -330699, 297058, 37437, 46379, 25537, 148301, 77192, 153398, 86841, -211667, 102707, 310934, -116748, -379538]
$$ [...]
##END NTUPLES=NMR SPECTRUM
##END=
