
##TITLE=AC1355_CPIAH12174_6672380_DT29ptS5HK
##JCAMPDX= 6.0         $$ Bruker NMR JCAMP-DX V2.0
##DATA TYPE= NMR SPECTRUM
##DATA CLASS= NTUPLES
##ORIGIN= BRUKER
##OWNER= Administrator
$$ 1.72 TOPSPIN		Version 2.1
$$ 2012-08-14 17:39:57.140 -0500  Administrator@TOPSPIN
$$ Compression mode = diff/dup
##.OBSERVE FREQUENCY= 400.02188249412
##.OBSERVE NUCLEUS= ^1H
##.ACQUISITION MODE= SIMULTANEOUS (DQD)
##.ACQUISITION SCHEME= undefined
##.AVERAGES= 64
##.DIGITISER RES= 22
##SPECTROMETER/DATA SYSTEM= spect
##.PULSE SEQUENCE= noesygpps1d.comp
##.SOLVENT NAME= COFFEE_meoh
##.SHIFT REFERENCE= INTERNAL, COFFEE_meoh, 1, 14.96094
##AUDIT TRAIL= $$ (NUMBER, WHEN, WHO, WHERE, PROCESS, VERSION, WHAT)
$$ ##TITLE= Audit trail, TOPSPIN		Version 2.1
$$ ##JCAMPDX= 5.01
$$ ##ORIGIN= Bruker BioSpin GmbH
$$ ##OWNER= Administrator
$$ $$ C:\Bruker\TOPSPIN/data/COFFEE/nmr/AC1355_CPIAH12174_6672380_DT29ptS5HK/12/pdata/1/auditp.txt
$$ ##AUDIT TRAIL=  $$ (NUMBER, WHEN, WHO, WHERE, PROCESS, VERSION, WHAT)
(   1,<2012-08-14 17:39:51.265 -0500>,<Administrator>,<TOPSPIN>,<go>,<TOPSPIN 2.1>,
      <created by zg
	started at 2012-08-14 17:28:20.890 -0500,
	POWCHK enabled, PULCHK disabled,
       configuration hash MD5:
       6B 1B 68 BB D9 2E 58 E2 7F 35 AD 54 07 DF 0E 41
       data hash MD5: 64K
       FF F7 AA 2C 3E 04 90 DB EE FA 80 A2 E3 39 67 2E>)
(   2,<2012-08-14 17:39:54.875 -0500>,<Administrator>,<TOPSPIN>,<proc1d>,<TOPSPIN 2.1>,
      <Start of raw data processing
       efp LB = 0.3 FT_mod = 6 PKNL = 1 PHC0 = 0 PHC1 = 0 SI = 128K 
       data hash MD5: 128K
       A5 31 8D F1 C7 B1 56 BC AF 0A 5E 5F EC 6F 36 62>)
(   3,<2012-08-14 17:39:56.250 -0500>,<Administrator>,<TOPSPIN>,<proc1d>,<TOPSPIN 2.1>,
      <pk PHC0 = 0.2911377 PHC1 = 0 
       data hash MD5: 128K
       7D 68 19 34 E7 3C C9 D3 47 BA AD AD F8 88 D4 30>)
(   4,<2012-08-14 17:39:56.671 -0500>,<Administrator>,<TOPSPIN>,<proc1d>,<TOPSPIN 2.1>,
      <abs ABSG = 1 
       data hash MD5: 128K
       FA 71 7D 30 F4 BC CC 2B 3C 25 5C 4B 2C A7 69 CB>)
(   5,<2012-08-14 17:39:56.765 -0500>,<Administrator>,<TOPSPIN>,<proc1d>,<TOPSPIN 2.1>,
      <abs ABSG = 2 
       data hash MD5: 128K
       82 73 EA CF 17 6D 1A B6 FA 30 D1 BD A0 85 66 34>)
(   6,<2012-08-14 17:39:56.843 -0500>,<Administrator>,<TOPSPIN>,<proc1d>,<TOPSPIN 2.1>,
      <abs ABSG = 3 
       data hash MD5: 128K
       50 D3 F1 DA 87 C1 14 36 C4 8C 1C 9B 43 8B 2B 17>)
(   7,<2012-08-14 17:39:56.921 -0500>,<Administrator>,<TOPSPIN>,<proc1d>,<TOPSPIN 2.1>,
      <abs ABSG = 4 
       data hash MD5: 128K
       5E 66 CF C1 39 ED 49 B5 3B 21 35 70 B6 DA D7 29>)
(   8,<2012-08-14 17:39:57.000 -0500>,<Administrator>,<TOPSPIN>,<proc1d>,<TOPSPIN 2.1>,
      <abs ABSG = 5 
       data hash MD5: 128K
       AB 7F 12 0A 58 CB 2E AA E8 74 2D 40 96 AC 6D 6A>)
$$ ##END=
$$ 
$$ $$ hash MD5
$$ $$ 57 BA DB 19 CA 2B 73 35 4C 81 76 CD D4 DA FA 8C
##$RELAX= 
##$RELAX= 
##$RELAX= 
##$RELAX= 
##$RELAX= 
##$RELAX= 
##$RELAX= 
##$RELAX= 
$$ Bruker specific parameters
$$ [...]
##$TP07= 0
##$TPNAME0= <>
##$TPNAME1= <>
##$TPNAME2= <>
##$TPNAME3= <>
##$TPNAME4= <>
##$TPNAME5= <>
##$TPNAME6= <>
##$TPNAME7= <>
##$TPOAL= (0..7)
0.5 0.5 0.5 0.5 0.5 0.5 0.5 0.5
##$TPOFFS= (0..7)
0 0 0 0 0 0 0 0
##$TUNHIN= 0
##$TUNHOUT= 0
##$TUNXOUT= 0
##$USERA1= <user>
##$USERA2= <user>
##$USERA3= <user>
##$USERA4= <user>
##$USERA5= <user>
##$V9= 5
##$VALIST= <valist>
##$VCLIST= <CCCCCCCCCCCCCCC>
##$VD= 0
##$VDLIST= <DDDDDDDDDDDDDDD>
##$VPLIST= <PPPPPPPPPPPPPPP>
##$VTLIST= <TTTTTTTTTTTTTTT>
##$WBST= 1024
##$WBSW= 4
##$XGAIN= (0..3)
0 0 0 0
##$XL= 0
##$YL= 0
##$YMAX_a= 10702748
##$YMIN_a= -8297151
##$ZGOPTNS= <>
##$ZL1= 120
##$ZL2= 120
##$ZL3= 120
##$ZL4= 120
##$ABSF1= 14.96094
##$ABSF2= -5.597241
##$ABSG= 5
##$ABSL= 3
##$ALPHA= 0
##$AQORDER= 0
##$ASSFAC= 0
##$ASSFACI= 0
##$ASSFACX= 0
##$ASSWID= 0
##$AUNMP= <proc_prof1d_extract.lims>
##$AXLEFT= 0
##$AXNAME= <>
##$AXNUC= <1H>
##$AXRIGHT= 0
##$AXTYPE= 0
##$AXUNIT= <>
##$AZFE= 0.1
##$AZFW= 0.1
##$BCFW= 0
##$BC_mod= 0
##$BYTORDP= 0
##$COROFFS= 0
##$CY= 15
##$DATMOD= 1
##$DC= 0
##$DFILT= <>
##$DTYPP= 0
##$F1P= 0
##$F2P= 0
##$FCOR= 0.5
##$FTSIZE= 131072
##$FT_mod= 6
##$GAMMA= 0
##$GB= 0
##$INTBC= 1
##$INTSCL= 1
##$ISEN= 128
##$LB= 0.3
##$LEV0= 0
##$LPBIN= 0
##$MAXI= 10000
##$MC2= 0
##$MEAN= 0
##$ME_mod= 0
##$MI= 0
##$NCOEF= 0
##$NC_proc= -2
##$NLEV= 6
##$NOISF1= 0
##$NOISF2= 0
##$NSP= 0
##$NTH_PI= 0
##$NZP= 0
##$OFFSET= 14.96094
##$PC= 1
##$PHC0= 0.2911377
##$PHC1= 0
##$PH_mod= 1
##$PKNL= yes
##$PPARMOD= 0
##$PPDIAG= 0
##$PPIPTYP= 0
##$PPMPNUM= 2147483647
##$PPRESOL= 1
##$PSCAL= 4
##$PSIGN= 0
##$PYNMP= <proc.py>
##$REVERSE= no
##$SF= 400.020009662223
##$SI= 131072
##$SIGF1= 0
##$SIGF2= 0
##$SINO= 400
##$SIOLD= 131072
##$SPECTYP= <>
##$SREGLST= <1H.CDCl3>
##$SSB= 0
##$STSI= 131072
##$STSR= 0
##$SW_p= 8223.68421052631
##$SYMM= 0
##$S_DEV= 0
##$TDeff= 65536
##$TDoff= 0
##$TI= <>
##$TILT= no
##$TM1= 0
##$TM2= 0
##$TOPLEV= 0
##$USERP1= <user>
##$USERP2= <user>
##$USERP3= <user>
##$USERP4= <user>
##$USERP5= <user>
##$WDW= 1
##$XDIM= 131072
##$YMAX_p= 395141945
##$YMIN_p= -12793
##$CURPLOT= <Network HP LaserJet P1505>
##$CURPRIN= <$Network HP LaserJet P1505>
##$DFORMAT= <normdp>
##$LAYOUT= <+/1D_H.xwp>
##$LFORMAT= <normlp>
##$PFORMAT= <normpl>
##$SURQMSG= 1
$$ End of Bruker specific parameters
$$ ---------------------------------
##NTUPLES= NMR SPECTRUM
##VAR_NAME=  FREQUENCY,     SPECTRUM/REAL,   SPECTRUM/IMAG
##SYMBOL=    X,             R,               I
##VAR_TYPE=  INDEPENDENT,   DEPENDENT,       DEPENDENT
##VAR_FORM=  AFFN,          ASDF,            ASDF
##VAR_DIM=   131072,        131072,          131072
##UNITS=     HZ,            ARBITRARY UNITS, ARBITRARY UNITS
##FACTOR=    0.0627417313425164, 1,          1
##FIRST=     8223.62146879497, -1859,        -54111
##LAST=      0,             -237,            -54481
##MIN=       0,             -12793,          0
##MAX=       8223.62146879497, 395141945,    0
$$ Real data points
##PAGE= N=1
##DATA TABLE= (X++(R..R)), XYDATA
$$ [...]
$$ plain form
61732 420764 419714 419147 419579 420647 421544 422168 423256 425405 428412 431624 434532 436954 438927 440649 442418
61717 442418 444475 446789 448931 450300 450725 450855 451602 453091 454462 454875 454373 453464 452295 450664 448615 446469
61701 446469 444235 441447 437727 433268 428620 424176 419969 415862 411873 408224 405050 402123 399081 395927
61687 395927 392978 390250 387235 383524 379369 375313 371546 367987 364736 361979 359487 356735 353664 350982
61673 350982 349493 349270 349639 349824 349517 348866 348091 347277 346553 346215 346353 346473 345945 344900 344185 344281 344792 345331
61655 345331 346331 348375 351157 353776 355834 357483 358591 358743 358206 358112 359327 361684 364524 367443 370231
61640 370231 372677 374872 377234 379804 381962 383262 384072 384796 384885 383480 380876 378485 377175 376370 375035
61625 375035 372891 370186 366850 362621 357872 353657 350747 348938 347424 345616 343508 341494 339979 339063
$$ packed form
61732D20764j050n67M32J068Q97O24J088K149L007L212K908K422J973J722J769
61717D42418K057K314K142J369M25J30P47J489J371M13n02r09j169j631k049k146
61701D46469k234k788l720m459m648m444m207m107l989l649l174k927l042l154
61687C95927k949k728l015l711m155m056l767l559l251k757k492k752l071k682
61673C50982j489k23L69J85l07o51p75q14p24l38J38J20n28j045p15R6N11N39
61655C45331J000K044K782K619K058J649J108J52n37r4J215K357K840K919K788
61640C70231K446K195K362K570K158J300Q10P24Q9j405k604k391j310q05j335
61625C75035k144k705l336m229m749m215k910j809j514j808k108k014j515r16
$$ plain form
61611 339063 338451 337734 336757 335592 334161 332136 329352 326064 322601 318975 315083 311138 307544 304396 301437
61596 301437 298518 295761 293269 290999 289022 287488 286159 284368 281750 278761 276136 274104 272495 271433
61582 271433 271300 271961 272517 272100 270703 269022 267683 266756 265891 264733 263252 261845 261124 261498 262847 264571
61566 264571 265962 266657 266844 267035 267570 268355 269109 269798 270652 271757 272778 273203 272893 272350 272389 273458 275240
61549 275240 276968 278138 278869 279586 280511 281540 282427 282929 282901 282474 282092 282187 282797 283662 284606 285622 286652 287585
61531 287585 288571 290030 292106 294300 295907 296788 297427 298195 298806 298654 297572 296035 294670 293703 292902 291828
61515 291828 290058 287420 284282 281567 280174 280234 281024 281697 282016 282305 282833 283374 283427 282774 281703 280632 279605
61498 279605 278354 276899 275775 275507 276056 277007 278071 279034 279471 279041 278100 277514 277741 278521 279568 281051 283055
$$ packed form
61611C39063o12p17r77j165j431k025k784l288l463l626l892l945l594l148k959
61596C01437k919k757k492k270j977j534j329j791k618k989k625k032j609j062
61582B71433j33O61N56m17j397j681j339r27q65j158j481j407p21L74J349J724
61566B64571J391O95J87J91N35P85P54O89Q54J105J021M25l10n43L9J069J782
61549B75240J728J170P31P17R25J029Q87N02k8m27l82R5O10Q65R44J016J030R33
61531B87585R86J459K076K194J607Q81O39P68O11j52j082j537j365r67q01j074
61515B91828j770k638l138k715j393O0P90O73L19K89N28N41N3o53j071j071j027
61498B79605j251j455j124k68N49R51J064R63M37m30r41n86K27P80J047J483K004
$$ plain form
61481 283055 285023 286194 286410 286207 286253 286934 288288 290022 291728 293259 294759 296208 297190 297349 296812 295982
61465 295982 295179 294649 294560 294712 294710 294711 295503 297302 298964 299123 297860 296568 296322 297107 298463 300044 301414 302082
61447 302082 302079 302011 302360 303125 304162 305285 305985 305775 305085 305168 306745 309265 311841 314332 317043 319869 322413
61430 322413 324679 327059 329674 332168 334083 335186 335535 335475 335432 335496 335436 335328 335784 337177 338924 340063 340413
61413 340413 340707 341646 343238 345013 346387 346822 346115 344771 343688 343186 342562 340792 337580 333532 329494 325952
61397 325952 323020 320718 319046 317891 317023 316266 315641 315315 315460 316109 317037 317760 317876 317576 317596 318383 319475
61380 319475 320103 320275 320816 322240 324056 325404 325997 326210 326565 327395 328691 329955 330500 330289 330283 331486 333716
61363 333716 335724 336619 336887 337871 340387 343950 347308 349696 351498 353627 356483 359822 363526 367942 373317
$$ packed form
61481B83055J968J171K16k03M6O81J354J734J706J531J500J449R82J59n37q30
61465B95982q03n30q9J52kJP92J799J662J59j263j292k46P85J356J581J370O68
61447C02082lo8L49P65J037J123P00k10o90Q3J577K520K576K491K711K826K544
61430C22413K266K380K615K494J915J103L49o0m3O4o0j08M56J393J747J139L50
61413C40413K94R39J592J775J374M35p07j344j083n02o24j770l212m048m038l542
61397C25952k932k302j672j155q68p57o25l26J45O49R28P23J16l00K0P87J092
61380C19475O28J72N41J424J816J348N93K13L55Q30J296J264N45k11oJ203K230
61363C33716K008Q95K68R84K516L563L358K388J802K129K856L339L704M416N375
$$ plain form
61348 373317 379468 386324 394227 403132 411999 419690 426202 432337 438323 443597 447933 451879 455818 459384
61334 459384 462230 464711 467262 469564 470943 471312 471124 470601 469613 468232 466775 465169 462840 459528 455887
61319 455887 452938 451083 449929 449007 448423 448699 450121 452350 454699 456813 459063 462287 467177 473903 482205
61304 482205 491676 501989 513057 524991 537797 550972 563541 574613 583801 590948 595619 597212
61292 597212 595666 591726 586339 579967 572671 564640 556275 547792 539084 530075 521026 512399 504519 497408
61278 497408 490827 484503 478491 473330 469692 467855 467668 468881 471248 474317 477626 481230 485619 490839
61264 490839 496029 500213 503319 506107 509324 513359 518589 525425 533848 543189 552563 561382 569391 576451
61250 576451 582412 587137 590551 592735 593858 593942 592788 590362 587123 583681 580107 575921 570846 565387 560543
$$ packed form
61348C73317O151O856P903Q905Q867P691O512O135N986N274M336L946L939L566
61334D59384K846K481K551K302J379L69j88n23r88j381j457j606k329l312l641
61319D55887k949j855j154r22n84K76J422K229K349K114K250L224M890O726Q302
61304D82205R471J0313J1068J1934J2806J3175J2569J1072R188P147M671J593
61292E97212j546l940n387o372p296q031q365q483q708r009r049q627p880p111
61278D97408o581o324o012n161l638j837j87J213K367L069L309L604M389N220
61264D90839N190M184L106K788L217M035N230O836Q423R341R374Q819Q009P060
61250E76451N961M725L414K184J123Q4j154k426l239l442l574m186n075n459m844
$$ plain form
61235 560543 557083 555102 554028 553012 551590 550132 549474 549944 550981 551860 552640 554152 557119 561542 566879
61220 566879 572608 578551 584817 591505 598388 604879 610447 615108 619417 623963 628965 634370 640040 645629
61206 645629 650469 654006 656441 658583 660918 663131 664821 666436 669013 673148 678655 685286 693262 702916
61192 702916 714232 727011 741178 756594 772741 788808 803948 817335 828421 837376 844908 851222
61180 851222 855566 857317 857187 856642 856263 855363 853175 849635 844909 838983 832062 824766 817366 809351 800262
61165 800262 790601 781318 772523 763261 752526 740189 726931 713532 700240 686704 672643 658581
61153 658581 645598 634195 623868 614142 605547 598964 594387 591084 588826 588018 588416 588553 586941 583374
61139 583374 578598 573161 567078 560362 553325 546449 540388 535982 533804 533587 534434 535641 537148 539296 542556
$$ packed form
61235E60543l460j981j074j016j422j458o58M70J037Q79P80J512K967M423N337
61220E66879N729N943O266O688O883O491N568M661M309M546N002N405N670N589
61206F45629M840L537K435K142K335K213J690J615K577M135N507O631P976R654
61192G02916J1316J2779J4167J5416J6147J6067J5140J3387J1086Q955P532O314
61180H51222M344J751j30n45l79r00k188l540m726n926o921p296p400q015r089
61165H00262r661r283q795r262j0735j2337j3258j3399j3292j3536j4061j4062
61153F58581j2983j1403j0327r726q595o583m577l303k258q08L98J37j612l567
61139E83374m776n437o083o716p037o876o061m406k178k17Q47J207J507K148L260
$$ plain form
61124 542556 547508 554621 563843 574668 586855 600821 617076 635472 655286 676002 697706 720752
61112 720752 745300 771221 798198 825771 853424 880803 907813 934396 960220 984667 1007150
61101 1007150 1027410 1045432 1061082 1073856 1083049 1088182 1089217 1086389 1079946 1070067 1056896 1040547
61089 1040547 1021187 999266 975608 951116 926359 901571 876983 852930 829580 806780 784355
61078 784355 762479 741638 722215 704229 687433 671683 657217 644571 634174 625953 619363 613785
61066 613785 608960 605111 602729 602129 603065 604793 606586 608238 610062 612624 616528 622178 629409 637473 645774
61051 645774 654555 664557 676096 688965 703185 719216 737201 756574 776793 798083 821049 845887
61039 845887 872353 900247 929515 960136 992244 1026148 1061820 1098708 1136511 1175854 1217598
$$ packed form
61124E42556M952P113R222J0825J2187J3966J6255J8396J9814K0716K1704K3046
61112G20752K4548K5921K6977K7573K7653K7379K7010K6583K5824K4447K2483
61101A007150K0260J8022J5650J2774R193N133J035k828o443r879j3171j6349
61089A040547j9360k1921k3658k4492k4757k4788k4588k4053k3350k2800k2425
61078G84355k1876k0841j9423j7986j6796j5750j4466j2646j0397q221o590n578
61066F13785m825l849k382o00R36J728J793J652J824K562L904N650P231Q064Q301
61051F45774Q781J0002J1539J2869J4220J6031J7985J9373K0219K1290K2966K4838
61039H45887K6466K7894K9268L0621L2108L3904L5672L6888L7803L9343M1744
$$ plain form
61028 1217598 1261675 1307230 1353785 1401503 1450355 1499894 1550282 1603043 1660437 1724410 1796265
61017 1796265 1876910 1967018 2067121 2177728 2299383 2432941 2580435 2745740 2934046 3150977
61007 3150977 3403128 3699525 4052045 4475012 4986040 5606940 6360918 7267355 8340688
60998 8340688 9592441 11022417 12591699 14198657 15692964 16932048 17837947 18409355
60990 18409355 18692734 18756382 18690256 18603873 18588189 18658119 18731772 18673739 18366402 17752004
60980 17752004 16828978 15631648 14221647 12687462 11133850 9658445 8330450 7183604
60972 7183604 6221812 5429476 4781502 4251322 3815756 3456318 3158257 2909194 2698351
60963 2698351 2516585 2356957 2214995 2088023 1974069 1871354 1778371 1693893 1616853 1546503
$$ packed form
61028A217598M4077M5555M6555M7718M8852M9539N0388N2761N7394O3973P1855
61017A796265Q0645R0108J00103J10607J21655J33558J47494J65305J88306K16931
61007C150977K52151K96397L52520M22967N11028O20900P53978R06437J073333
60998H340688J251753J429976J569282J606958J494307J239084R05899N71408
60990A8409355K83379O3648o6126q6383j5684O9930P3653n8033l07337o14398
60980A7752004r23026j197330j410001j534185j553612j475405j327995j146846
60972G183604r61792p92336o47974n30180m35566l59438k98061k49063k10843
60963B698351j81766j59628j41962j26972j13954j02715r2983q4478p7040p0350
$$ plain form
60953 1546503 1482603 1425045 1373246 1326194 1283043 1243277 1206297 1171284 1137637 1105279 1074384
60942 1074384 1044973 1016858 989806 963689 938583 914656 891863 869824 848228 827111 806442
60931 806442 785670 764268 742740 722457 704338 688090 672943 658575 645048 632349 620476
60920 620476 609661 599993 591076 582562 574838 568592 563684 559014 553724 548160 543438 540338 538857 538511
60906 538511 538767 539277 540020 541291 543381 546163 549063 551477 553238 554737 556602 559169 562080 564397 565258
60891 565258 564626 563359 562378 561701 560408 557627 553446 548698 543974 539091 533539 527163 520224 513034 505769
60876 505769 498587 491632 484937 478514 472534 467205 462442 457865 453221 448603 444178 439958 436033 432776
60862 432776 430482 428914 427588 426472 426004 426332 426943 427245 427250 427385 427907 428775 429928 431291 432660 433950 435477
$$ packed form
60953A546503o3900n7558n1799m7052m3151l9766l6980l5013l3647l2358l0895
60942A074384k9411k8115k7052k6117k5106k3927k2793k2039k1596k1117k0669
60931H06442k0772k1402k1528k0283j8119j6248j5147j4368j3527j2699j1873
60920F20476j0815r668q917q514p724o246m908m670n290n564m722l100j481l46
60906E38511K56N10P43J271K090K782K900K414J761J499J865K567K911K317Q61
60891E65258o32j267r81o77j293k781m181m748m724m883n552o376o939p190p265
60876E05769p182o955o695o423n980n329m763m577m644m618m425m220l925l257
60862D32776k294j568j326j116m68L28O11L02NJ35N22Q68J153J363J369J290J527
$$ plain form
60845 435477 437571 439877 441471 441822 441302 440611 440076 439687 439352 438754 437224 434331 430562 427036 424441 422519
60829 422519 420589 418353 416102 414341 413348 413005 412991 413131 413497 414149 414913 415530 415915 416105 416043 415580 414643 413251
60811 413251 411464 409432 407359 405253 402876 400172 397539 395358 393427 391310 389118 387440 386385 385237
60797 385237 383213 380172 376411 372223 367936 363959 360368 356756 352891 349335 346966 345997 345732 345215 343847
60782 343847 341634 339181 337333 336419 335907 335138 334216 333714 333686 333561 333108 332898 333588 335209 337409 339958 342708
60765 342708 345444 348187 351359 355257 359541 363597 367191 370415 373152 375064 376039 376292 376049 375468 374836
60750 374836 374424 374150 373706 373100 372679 372582 372484 372079 371448 370792 370073 369101 367743 365858 363231 359739 355383 350110
60732 350110 343947 337493 331865 327706 324508 321322 317986 315171 313256 311719 309808 307521 305619 304753
$$ packed form
60845D35477K094K306J594L51n20o91n35l89l35n98j530k893l769l526k595j922
60829D22519j930k236k251j761r93l43j4J40L66O52P64O17L85J90o2m63r37j392
60811D13251j787k032k073k106k377k704k633k181j931k117k192j678j055j148
60797C85237k024l041l761m188m287l977l591l612l865l556k369r69k65n17j368
60782C43847k213k453j848r14n12p69r22n02k8j25m53k10O90J621K200K549K750
60765C42708K736K743L172L898M284M056L594L224K737J912R75K53k43n81o32
60750C74836m12k74m44o06m21r7r8m05o31o56p19r72j358j885k627l492m356n273
60732C50110o163o454n628m159l198l186l336k815j915j537j911k287j902q66
$$ plain form
60718 304753 304721 304601 303672 302219 301276 301468 302312 302868 302846 302738 302997 303572 304230 304907 305602 306338 307348 308932
60700 308932 310935 312665 313602 313998 314581 315853 317801 320031 321976 323268 324184 325556 327886 330675 332961
60685 332961 334423 335634 337258 339383 341739 344243 347070 350286 353682 357006 360175 363139 365642 367371
60671 367371 368415 369334 370535 371680 372011 371242 369841 368385 366898 364895 361829 357454 352131 346916 342978
60656 342978 340630 339179 337949 337116 337152 337799 338169 337880 337610 338348 340385 343203 346140 348961 351743 354298
60640 354298 355887 355704 353703 350678 347447 344226 340903 337555 334328 331080 327600 324134 321367 319910
60626 319910 319972 321274 322991 324028 323858 323033 322476 322429 322529 322758 323620 325301 327237 328733 329608 330071 330358
60609 330358 330623 330818 330549 329471 327938 326793 326411 326449 326741 327753 329717 331884 333240 333641 333675 333718 333703 333663
$$ packed form
60718C04753l2j20r29j453r43J92Q44N56k2j08K59N75O58O77O95P36J010J584
60700C08932K003J730R37L96N83J272J948K230J945J292R16J372K330K789K286
60685C32961J462J211J624K125K356K504K827L216L396L324L169K964K503J729
60671C67371J044R19J201J145L31p69j401j456j487k003l066m375n323n215l938
60656C42978k348j451j230q33L6O47L70k89k70P38K037K818K937K821K782K555
60640C54298J589j83k001l025l231l221l323l348l227l248l480l466k767j457
60626C19910O2J302J717J037j70q25n57m7J00K29Q62J681J936J496Q75M63K87
60609C30358K65J95k69j078j533j145l82L8K92J012J964K167J356M01L4M3j5m0
$$ plain form
60591 333663 333843 334272 334703 335057 335496 336031 336421 336562 336665 337003 337742 338957 340481 341735 342132 341862 341921 343212
60573 343212 345806 349244 353271 358020 363646 370055 376994 384330 392226 401060 411015 421659 432013 441123
60559 441123 448477 453843 456893 457254 454966 450718 445484 439942 434309 428773 423918 420502 418835 418567 419254
60544 419254 420948 424004 428418 433666 439243 445154 451838 459768 469204 480089 491994 504215 516103
60531 516103 527289 537521 546279 552751 556315 557082 555876 553536 550252 545727 539991 533785 527968 522809
60517 522809 518147 514014 510595 507667 504712 501779 499663 498853 498848 499043 499884 502394 506733 512119 518266 526000
60501 526000 536130 548498 562811 579759 600423 624845 652042 681386 713143 747416 783253
60490 783253 819085 853526 885387 913361 936117 952402 960870 960273 950302 931919 906487 874932
$$ packed form
60591C33663J80M29M31L54M39N35L90J41J03L38P39J215J524J254L97k70N9J291
60573C43212K594L438M027M749N626O409O939P336P896Q834R955J0644J0354R110
60559D41123P354N366L050L61k288m248n234n542n633n536m855l416j667k68O87
60544D19254J694L056M414N248N577N911O684P930R436J0885J1905J2221J1888
60531E16103J1186J0232Q758O472L564P67j206k340l284m525n736o206n817n159
60517E22809m662m133l419k928k955k933k116q10nJ95Q41K510M339N386O147P734
60501E26000J0130J2368J4313J6948K0664K4422K7197K9344L1757L4273L5837
60490G83253L5832L4441L1861K7974K2756J6285Q468n97r971j8383k5432l1555
$$ plain form
60478 874932 838243 798359 757734 718034 679871 643747 610505 580619 553716 529284 507507
60467 507507 488966 473692 460822 449163 437927 427088 417204 408873 402256 397081 392979 389617 386629
60454 386629 383699 380725 377748 374835 372234 370393 369310 368082 365766 362645 359886 357890 355858 353371
60440 353371 351411 351095 352063 352966 353093 352604 351550 349782 347835 346819 347047 347556 347428 346964 347054 347834 348551
60423 348551 348587 348141 347833 347925 348045 347647 346689 345764 345452 345692 346008 346241 346704 347657 349037 350761 352903 355302
60405 355302 357346 358476 358801 359008 359704 360962 362411 363692 364820 366074 367498 368727 369532 370378 371931
60390 371931 374070 375881 376803 377283 378094 379469 381255 383386 385671 387461 388215 388313 388711 389802 391215 392781
60374 392781 395025 398397 402537 406742 410774 414702 418223 420780 422357 423563 424769 425666 425967 426097 426691
$$ packed form
60478H74932l6689l9884m0625l9700l8163l6124l3242k9886k6903k4432k1777
60467E07507j8541j5274j2870j1659j1236j0839r884q331o617n175m102l362k988
60454C86629k930k974k977k913k601j841j083j228k316l121k759j996k032k487
60440C53371j960l16R68R03J27m89j054j768j947j016K28N09j28m64R0P80P17
60423C48551L6m46l08R2J20l98r58r25l12K40L16K33M63R53J380J724K142K399
60405C55302K044J130L25K07O96J258J449J281J128J254J424J229Q05Q46J553
60390C71931K139J811R22M80Q11J375J786K131K285J790P54R8L98J091J413J566
60374C92781K244L372M140M205M032L928L521K557J577J206J206Q97L01J30N94
$$ plain form
60359 426691 427688 428529 429120 429962 431177 432073 432054 431559 431647 432971 435634 439687 445081 451110 456602 460870 464099
60342 464099 466638 468343 468862 468195 466693 464776 462872 461370 460355 459555 458721 457839 456897 455769 454516 453392
60326 453392 452283 450582 447999 445066 442346 439531 435990 431960 428364 425539 423012 420715 419575 420455
60312 420455 423076 426443 429917 433443 437172 441423 446779 453681 462025 471480 481929 493125 504109
60299 504109 513649 521283 527425 532302 535250 535291 532057 526005 518057 509241 500347 491632 482992 474651 467440
60284 467440 462161 458832 456852 455769 455575 456304 457644 458978 459605 458986 457116 454740 452866 451802 450830
60269 450830 449051 446430 443741 441526 439451 436861 433757 430892 428842 427226 425086 421922 418125 414379
60255 414379 410940 407698 404712 402315 400672 399564 398771 398439 398858 399982 401407 402776 404005 405086 405920
$$ packed form
60359D26691R97Q41N91Q42J215Q96j9m95Q8J324K663M053N394O029N492M268L229
60342D64099K539J705N19o67j502j917j904j502j015q00q34q82r42j128j253j124
60326D53392j109j701k583k933k720k815l541m030l596k825k527k297j140Q80
60312D20455K621L367L474L526L729M251N356O902Q344R455J0449J1196J0984
60299E04109R540P634O142M877K948M1l234o052p948q816q894q715q640q341p211
60284D67440n279l329j980j083j94P29J340J334O27o19j870k376j874j064r72
60269D50830j779k621k689k215k075k590l104k865k050j616k140l164l797l746
60255D14379l439l242k986k397j643j108p93l32M19J124J425J369J229J081Q34
$$ plain form
60240 405920 406458 406862 407284 407579 407479 407082 406952 407555 408732 409949 410960 411987 413253 414640 415974 417432
60224 417432 419387 421909 424643 427206 429554 431963 434773 438197 442258 446876 451958 457317 462494 466927
60210 466927 470680 474872 480977 489443 499184 508583 516809 524081 530939 537616 544097 550470 557001 563826
60196 563826 570580 576417 580631 583347 585410 587437 589242 590361 590862 591131 590958 589442 586044 581283 575995
60181 575995 570238 563456 555633 547713 540656 534453 528425 522252 516313 511051 506346 501758 497163 492944
60167 492944 489519 486816 484334 481766 479489 478235 478180 478578 478537 478037 477784 478111 478527 478543 478439 478806 479683 480655
60149 480655 481571 482613 483767 484828 485936 487562 489801 492242 494754 497896 502229 507635 513624 520037
60135 520037 527074 534883 543412 552406 561297 569401 576634 583734 591328 598947 605418 610114 613403 615990
$$ packed form
60240D05920N38M04M22K95j00l97j30O03J177J217J011J027J266J387J334J458
60224D17432J955K522K734K563K348K409K810L424M061M618N082N359N177M433
60210D66927L753M192O105Q466R741R399Q226P272O858O677O481O373O531O825
60196E63826O754N837M214K716K063K027J805J119N01K69j73j516l398m761n288
60181E75995n757o782p823p920p057o203o028o173n939n262m705m588m595m219
60167D92944l425k703k482k568k277j254n5L98m1n00k53L27M16J6j04L67Q77R72
60149D80655R16J042J154J061J108J626K239K441K512L142M333N406N989O413
60135E20037P037P809Q529Q994Q891Q104P233P100P594P619O471M696L289K587
$$ plain form
60121 615990 618262 620268 621910 623124 624181 625726 628136 630917 633182 634749 636284 638342 640749 642985
60107 642985 644631 645224 644278 641832 638596 635156 631374 626901 621963 617126 612543 607948 603371 599335 596252
60092 596252 594012 592277 590899 589884 589176 588719 588643 589214 590569 592560 594799 596822 598282 599105 599537 599985
60076 599985 600723 601661 602326 602060 600261 596609 591269 584873 578094 571100 563530 555063 545815 536104 526140
60061 526140 516261 507169 499417 492780 486668 481168 477040 474450 472353 469644 466573 464462 464182 465446
60047 465446 467481 469838 472412 475183 478311 482263 487517 494138 501772 510025 518709 527639 536285 543770
60033 543770 549390 553188 555895 558165 559948 560697 560105 558404 555970 552831 548731 543544 537436 530660 523356
60018 523356 515648 507772 499922 491978 483586 474633 465542 456938 449104 441913 435230 429215 424179 420255
$$ packed form
60121F15990K272K006J642J214J057J545K410K781K265J567J535K058K407K236
60107F42985J646N93r46k446l236l440l782m473m938m837m583m595m577m036l083
60092E96252k240j735j378j015p08m57p6N71J355J991K239K023J460Q23M32M48
60076E99985P38R38O65k66j799l652n340o396o779o994p570q467r248r711r964
60061E26140r879r092p752o637o112n500m128k590k097k709l071k111k80J264
60047D65446K035K357K574K771L128L952N254O621P634Q253Q684Q930Q646P485
60033E43770N620L798K707K270J783P49n92j701k434l139m100n187o108o776p304
60018E23356p708p876p850p944q392q953r091q604p834p191o683o015n036l924
$$ plain form
60004 420255 417251 414772 412548 410695 409546 409093 408796 408252 407925 408686 410583 412598 413889 414835 416413 418880
59988 418880 421658 424405 427531 431461 435851 439914 443351 446596 450139 453826 456869 458481 458472 457288 455572
59973 455572 453668 451515 448931 445932 442763 439644 436549 433301 429934 426939 425046 424757 426036 428393
59959 428393 431227 434135 437027 439939 442797 445430 447849 450239 452510 454097 454562 454218 453736 453177 451997
59944 451997 450124 448451 447798 447764 447149 445384 443123 441401 440568 440080 439098 437166 434532 431940 430163 429697
59928 429697 430705 432883 435333 437079 438107 439604 442703 447203 452029 456749 461891 467714 473469 478261
59914 478261 482101 485581 488939 491973 494570 496688 497935 497926 497213 497256 499109 502459 506233 509772 513026 515924
59898 515924 518127 519413 519864 519669 519165 519100 520293 522705 525224 526771 527421 528113 529509 531564 534043 536922
$$ packed form
60004D20255l004k479k224j853j149m53k97n44l27P61J897K015J291R46J578K467
59988D18880K778K747L126L930M390M063L437L245L543L687L043J612rj184j716
59973D55572j904k153k584k999l169l119l095l248l367k995j893k89J279K357
59959D28393K834K908K892K912K858K633K419K390K271J587M65l44m82n59j180
59944D51997j873j673o53l4o15j765k261j722q33m88r82j932k634k592j777m66
59928D29697J008K178K450J746J028J497L099M500M826M720N142N823N755M792
59914D78261L840L480L358L034K597K118J247rp13M3J853L350L774L539L254K898
59898E15924K203J286M51j95n04o5J193K412K519J547O50O92J396K055K479K879
$$ plain form
59882 536922 540182 543665 547316 551232 555346 559392 563367 567681 572548 577424 581399 584021 585471 585996
59868 585996 585496 583754 580863 577292 573585 570094 566897 563872 560802 557552 554294 551599 550082 549856 550439
59853 550439 551292 552340 553845 556054 559237 563805 569882 576776 583254 588429 592042 593983 594067 592477 589980
59838 589980 587416 585167 583251 581536 579658 577037 573370 568941 564263 559564 554743 549673 544487 539762
59824 539762 536356 534684 534122 533515 532323 530790 529002 526537 523243 519647 516146 512474 508492 504816 501956
59809 501956 499396 496372 493128 490565 488904 487617 486500 485901 485812 485599 484816 483705 482700 481888 481015 479655
59793 479655 477414 474403 471327 468681 466100 463126 460188 457952 456000 453313 450033 447484 446167 444917
59779 444917 442651 439931 438041 437336 437332 437763 438666 439723 440404 440648 440906 441567 442702 444108 445337 446022 446548
$$ packed form
59882E36922L260L483L651L916M114M046L975M314M867M876L975K622J450N25
59868E85996n00j742k891l571l707l491l197l025l070l250l258k695j517k26N83
59853E50439Q53J048J505K209L183M568O077O894O478N175L613J941Q4j590k497
59838E89980k564k249j916j715j878k621l667m429m678m699m821n070n186m725
59824E39762l406j672n62o07j192j533j788k465l294l596l501l672l982l676k860
59809E01956k560l024l244k563j661j287j117n99q9k13p83j111j005q12q73j360
59793D79655k241l011l076k646k581k974k938k236j952k687l280k549j317j250
59779D44917k266k720j890p05mM31R03J057O81K44K58O61J135J406J229O85N26
$$ plain form
59762 446548 448008 451039 455036 458987 462745 466940 471929 477413 483055 488981 495642 503368 511916 520394
59748 520394 528007 535034 542527 550776 558697 565262 570881 576666 582834 588723 593894 598223 601146 601985
59734 601985 601117 599791 598525 596572 593381 589706 586701 584521 582423 579880 576950 573831 570607 567433
59720 567433 564512 561797 558903 555435 551413 547397 544111 541791 539957 538045 536167 534912 534439 534190 533654
59705 533654 532969 532485 532086 531335 530164 529025 528339 528070 528007 528301 529481 531804 534716 537247 538961 540226
59689 540226 541437 542393 542839 543205 544154 545468 546170 545923 545597 546043 546781 546490 544559 541646 538789 536359 533919
59672 533919 530795 526762 522307 518242 514940 512002 508723 504847 500728 496922 493789 491377 489515 488019
59658 488019 486936 486575 487225 488917 491465 494578 497803 500596 502690 504356 506188 508643 511841 515552 519167
$$ packed form
59762D46548J460L031L997L951L758M195M989N484N642N926O661P726Q548Q478
59748E20394P613P027P493Q249P921O565N619N785O168N889N171M329K923Q39
59734F01985q68j326j266j953l191l675l005k180k098k543k930l119l224l174
59720E67433k921k715k894l468m022m016l286k320j834j912j878j255m73k49n36
59705E33654o85m84l99p51j171j139o86k69o3K94J180K323K912K531J714J265
59689E40226J211R56M46L66R49J314P02k47l26M46P38k91j931k913k857k430k440
59672E33919l124m033m455m065l302k938l279l876m119l806l133k412j862j496
59658D88019j083l61O50J692K548L113L225K793K094J666J832K455L198L711L615
$$ plain form
59643 519167 521868 523203 523458 523159 522196 519871 515956 511373 507445 504563 501957 498793 495216 492118 490076
59628 490076 488880 488112 487808 488238 489225 490032 490005 489059 487462 485395 482861 479793 476111 471876 467519 463594
59612 463594 460089 456368 452248 448814 447495 448373 450066 451385 452374 453490 454565 455302 456175 457831 459762
59597 459762 460613 460030 459367 460026 461683 462807 462553 461451 460326 459341 458391 457875 458439 459944 461159 460798 458862
59580 458862 456691 455583 455540 455512 454664 453035 451070 449059 447267 446089 445615 445301 444574 443621 443088 443087 443017 442467
59562 442467 441787 441483 441489 441390 441170 441349 442351 443963 445501 446418 446723 446773 446739 446453 445968 446060 447764 451305 455741
59543 455741 459880 463458 467350 472759 480259 489565 500196 512285 526516 542956 560119 575548 587338
59530 587338 594839 598089 597195 592489 584806 575395 565865 558206 554181 554172 556948 560898 565157 569372 573012
$$ packed form
59643E19167K701J335K55k99r63k325l915m583l928k882k606l164l577l098k042
59628D90076j196p68l04M30R87Q07k7r46j597k067k534l068l682m235m357l925
59612D63594l505l721m120l434j319Q78J693J319R89J116J075P37Q73J656J931
59597D59762Q51n83o63O59J657J124k54j102j125r85r50n16N64J505J215l61j936
59580D58862k171j108m3k8q48j629j965k011j792j178m74l14p27r53n33jp0n50
59562D42467o80l04Or9k20J79J002J612J538R17L05N0l4k86m85R2J704L541M436
59543D55741M139L578L892N409P500R306J0631J2089J4231J6440J7163J5429J1790
59530E87338P501L250q94m706p683r411r530p659m025rK776L950M259M215L640
$$ plain form
59515 573012 575564 577033 577557 576762 574138 569865 564629 558722 551998 544675 537375 530195 522488 513969 505494
59500 505494 498284 492716 488270 484345 480724 477402 474431 471964 470196 469163 468692 468536 468530 468702 469270 470388
59484 470388 471794 472870 473223 473168 473558 475073 477691 480797 483818 486743 489899 493285 496462 499298 502463
59469 502463 506660 511556 516023 519469 522319 525025 527274 528634 529551 531061 533594 536553 539106 541107
59455 541107 543196 546304 551028 557229 564147 571120 578258 586208 595136 604179 612114 618424 623383 627100
59441 627100 628812 627469 622930 616293 608942 601504 593819 585689 577358 569418 562512 557094 553230 550583
59427 550583 548745 547568 547095 547336 548415 550822 555147 561549 569796 579854 592092 606836 624030 643394
59413 643394 664582 687150 710813 735770 762045 788031 810242 825263 831924 831208 824489 812709
$$ packed form
59515E73012K552J469N24p95k624m273n236n907o724p323p300p180p707q519q475
59500E05494p210n568m446l925l621l322k971k467j768j033m71j56oJ72N68J118
59484D70388J406J076L53n5L90J515K618L106L021K925L156L386L177K836L165
59469E02463M197M896M467L446K850K706K249J360R17J510K533K959K553K001
59455E41107K089L108M724O201O918O973P138P950Q928R043P935O310M959L717
59441F27100J712j343m539o637p351p438p685q130q331p940o906n418l864k647
59427E50583j838j177m73K41J079K407M325O402Q247J0058J2238J4744J7194J9364
59413F43394K1188K2568K3663K4957K6275K5986K2211J5021O661p16o719j1780
$$ plain form
59401 812709 797256 780725 766195 755979 751123 751410 755241 759768 761939 759756 752564 740476 724023
59388 724023 704368 683268 662440 643108 626246 612819 603297 597081 592875 589749 587499 586024 584883
59375 584883 583774 583022 583098 583861 584748 585624 586936 588929 591172 593072 594493 595609 596427 596826 596977 597345 598247
59358 598247 599619 601338 603618 606956 611690 617727 624747 632633 641568 651726 663033 675340 688660
59345 688660 703034 718290 734128 750317 766555 782278 796971 810660 823646 835705 845929
59334 845929 853503 858233 860108 858874 854402 847132 837630 825930 811873 795988 779486 763218 747081
59321 747081 730678 714237 698634 684631 672323 661258 650983 641441 632907 625608 619550 614710
59309 614710 611142 608692 606864 605397 604881 606317 609967 615032 620656 626788 633696 640899 647014 650547
$$ packed form
59401H12709j5453j6531j4530j0216m856K87L831M527K171k183p192j2088j6453
59388G24023j9655k1100k0828j9332j6862j3427r522o216m206l126k250j475j141
59375E84883j109p52P6P63Q87Q76J312J993K243J900J421J116Q18L99J51L68R02
59358E98247J372J719K280L338M734O037P020P886Q935J0158J1307J2307J3320
59345F88660J4374J5256J5838J6189J6238J5723J4693J3689J2986J2059J0224
59334H45929P574M730J875j234m472p270r502j1700j4057j5885j6502j6268j6137
59321G47081j6403j6441j5603j4003j2308j1065j0275r542q534p299o058m840
59309F14710l568k450j828j467n16J436L650N065N624O132O908P203O115L533
$$ plain form
59295 650547 650531 646629 639136 628935 616992 603771 589469 574914 561713 551170 543343 537442 532862
59282 532862 529453 527107 525678 525291 526189 528268 531232 535216 540665 547435 554664 561988 570333 580903
59268 580903 593659 607388 621098 634690 648238 661217 672641 681632 687812 691461 693340 693931 692781
59255 692781 688963 682379 674238 666132 658986 652982 647948 643453 638891 633972 629048 624730 621413 619429
59241 619429 619290 621258 624744 628560 631879 634776 637939 642094 647615 654300 661448 668333 674612 680199
59227 680199 684944 688676 691380 692943 692843 690520 686024 679870 672283 663102 652599 641755 631357 621283
59213 621283 611191 601535 593197 586173 579350 571812 563865 556499 550258 545006 540513 536715 533501 530731
59199 530731 528529 527156 526419 525602 524268 522943 522645 523809 525888 527974 529587 530854 532161 533749 535568
$$ packed form
59295F50547j6l902p493j0201j1943j3221j4302j4555j3201j0543p827n901m580
59282E32862l409k346j429l87Q98K079K964L984N449O770P229P324Q345J0570
59268E80903J2756J3729J3710J3592J3548J2979J1424Q991O180L649J879N91j150
59255F92781l818o584q141q106p146o004n034m495m562m919m924m318l317j984
59241F19429j39J968L486L816L319K897L163M155N521O685P148O885O279N587
59227F80199M745L732K704J563j00k323m496o154p587r181j0503j0844j0398j0074
59213F21283j0092r656q338p024o823p538p947p366o241n252m493l798l214k770
59199E30731k202j373p37q17j334j325k98J164K079K086J613J267J307J588J819
$$ plain form
59184 535568 537489 539685 542646 546629 551205 555650 559815 564277 569539 575369 581163 586709 592280 598077
59170 598077 603950 609693 615342 621048 626845 632742 638851 645220 651512 657065 661357 664330 666203 667107
59156 667107 666950 665478 662367 657382 650619 642490 633308 623082 611991 600865 590667 581434 572295
59143 572295 562765 553532 545573 538895 532663 526361 520285 514952 510534 506934 503959 501267 498411 495163
59129 495163 491715 488547 486176 484935 484803 485536 487009 489286 492269 495656 499491 504296 510221 516470 522152
59114 522152 527423 533142 539632 546591 553981 562024 570246 577633 584073 590749 598524 606695 613960 620036
59100 620036 625632 631210 636506 641059 644646 647295 649147 650192 649953 647869 644294 640740 638703 638473 639340
59085 639340 640441 640991 640250 637973 634692 630991 626652 621010 613935 606012 597949 590226 583093 576467 570014
$$ packed form
59184E35568J921K196K961L983M576M445M165M462N262N830N794N546N571N797
59170E98077N873N743N649N706N797N897O109O369O292N553M292K973J873R04
59156F67107j57j472l111m985o763q129r182j0226j1091j1126j0198r233r139
59143E72295r530r233p959o678o232o302o076n333m418l600k975k692k856l248
59129D95163l448l168k371j241j32P33J473K277K983L387L835M805N925O249N682
59114E22152N271N719O490O959P390Q043Q222P387O440O676P775Q171P265O076
59100F20036N596N578N296M553L587K649J852J045k39k084l575l554k037k30Q67
59085F39340J101N50p41k277l281l701m339n642p075p923q063p723p133o626o453
$$ plain form
59070 570014 563752 558270 553931 550265 546604 542916 539362 535502 530848 525922 521853 518971 516676 514631
59056 514631 513166 512388 511800 511026 510096 508782 506517 503370 500339 498187 496638 495223 494235 494189 494802 495282
59040 495282 495427 495770 496674 497796 498535 498739 498891 499684 501413 503760 506329 509336 513427 518777 524784 530865
59024 530865 537175 544320 552705 562389 573198 584666 596222 607799 619952 632917 645788 657033
59012 657033 665722 671851 675664 677176 676388 673543 669069 663565 657884 652907 649092 646401 644771 644464 645882
58997 645882 649172 654049 659859 665795 671227 675972 680184 683988 687281 689913 691884 693284 694131 694382 694091
58982 694091 693438 692522 691173 689036 685927 682136 678408 675628 674489 675375 678411 683479 690176 697883 706090
58967 706090 714717 724004 734070 744701 755636 766766 777860 788402 798157 807687 817601 827170 834364
$$ packed form
59070E70014o262n482m339l666l661l688l554l860m654m926m069k882k295k045
59056E14631j465p78n88p74r30j314k265l147l031k152j549j415r88m6O13M80
59040D95282J45L43R04J122P39K04J52P93J729K347K569L007M091N350O007O081
59024E30865O310P145Q385R684J0809J1468J1556J1577J2153J2965J2871J1245
59012F57033Q689O129L813J512p88k845m474n504n681m977l815k691j630l07J418
58997F45882L290M877N810N936N432M745M212L804L293K632J971J400Q47K51k91
58982F94091o53r16j349k137l109l791l728k780j139Q86L036N068O697P707Q207
58967G06090Q627R287J0066J0631J0935J1130J1094J0542R755R530R914R569P194
$$ plain form
58954 834364 837704 837612 835488 831896 826319 818397 808597 797524 785218 771474 756474 740840 725276
58941 725276 710405 696808 684984 675204 667345 660834 654843 648810 642836 637573 633707 631565 630977 631370
58927 631370 632140 633087 634382 636017 637565 638633 639158 639015 637718 635049 631670 628586 626135 624002 622067
58912 622067 620590 619529 618361 616794 615262 614556 615212 617306 620523 624474 629265 635651 644235 654618
58898 654618 665854 677562 689960 702871 715517 727540 739491 751971 764845 777687 790512
58887 790512 803744 817908 833669 851624 871517 891973 911467 929362 945702 960250 972194
58876 972194 980691 985437 986757 985226 981016 973621 962517 948231 932346 916268 900372 884526 868984
58863 868984 854365 841083 829230 818840 809908 802225 795382 788843 781972 774249 765596 756312 746649
$$ packed form
58954H34364L340r2k124l592n577p922r800j1073j2306j3744j5000j5634j5564
58941G25276j4871j3597j1824r780p859o511n991o033n974n263l866k142n88L93
58927F31370P70R47J295J635J548J068N25j43j297k669l379l084k451k133j935
58912F22067j477j061j168j567j532p06O56K094L217L951M791O386Q584J0383
58898F54618J1236J1708J2398J2911J2646J2023J1951J2480J2874J2842J2825
58887G90512J3232J4164J5761J7955J9893K0456J9494J7895J6340J4548J1944
58876I72194Q497M746J320j531m210p395j1104j4286j5885j6078j5896j5846j5542
58863H68984j4619j3282j1853j0390q932p683o843o539o871p723q653r284r663
$$ plain form
58850 746649 736844 727531 719507 712834 706677 700411 694446 689543 685674 682006 677749 672601 666597 659930
58836 659930 652813 645298 637342 629246 621654 614892 608639 602575 597031 592600 589401 587091 585329 583848
58822 583848 582351 580779 579583 579360 580320 582316 585127 588392 591549 594269 596812 599676 603064 606883 610937
58807 610937 614765 617665 619315 620150 620720 620953 620468 619318 617878 616169 613805 610552 606515 601894 596954
58792 596954 592087 587466 582719 577379 571554 565774 560332 555259 550869 547785 546361 546416 547605 549730 552676
58777 552676 556289 560281 564063 566864 568313 568766 568726 568096 566365 563358 559347 554561 549027 542905 536584
58762 536584 530441 524797 519998 516237 513410 511506 510935 512013 514282 516904 519730 523399 528246 533598
58748 533598 538426 542309 545524 548423 551017 553122 554712 556053 557532 559419 561885 565128 569169 573534
$$ packed form
58850G46649r805r313q024o673o157o266n965m903l869l668m257n148o004o667
58836F59930p117p515p956q096p592o762o253o064n544m431l199k310j762j481
58822E83848j497j572j196k23R60J996K811L265L157K720K543K864L388L819M054
58807F10937L828K900J650Q35N70K33m85j150j440j709k364l253m037m621m940
58792E96954m867m621m747n340n825n780n442n073m390l084j424N5J189K125K946
58777E52676L613L992L782K801J449M53m0o30j731l007m011m786n534o122o321
58762E36584o143n644m799l761k827j904n71J078K269K622K826L669M847N352
58748E33598M828L883L215K899K594K105J590J341J479J887K466L243M041M365
$$ plain form
58734 573534 577549 581128 584916 589455 594541 599591 604223 608240 611585 614731 618563 623335 628232 632551
58720 632551 636828 641995 647812 653101 657388 661458 666295 672263 679385 687543 696172 704438 711964 718822
58706 718822 724697 728772 730709 731093 730455 728351 723822 716408 706307 693876 679441 663530 646892
58693 646892 630173 613636 597289 581267 566091 552409 540496 530242 521695 515182 510676 507439
58681 507439 504662 502111 499743 497191 494176 491022 488055 484891 481118 477359 474707 473222 472061 471123
58667 471123 471535 474293 479291 485991 494083 503072 512052 520522 528791 537008 544294 549373 551700 551587 549678
58652 549678 546747 543602 540585 537355 533473 528997 524221 519173 513720 507924 502004 496115 490432 485271
58638 485271 481014 478069 476892 477629 479640 481808 483504 484909 486307 487569 488518 489251 489756 489672 488846 487765
$$ packed form
58734E73534M015L579L788M539N086N050M632M017L345L146L832M772M897M319
58720F32551M277N167N817N289M287M070M837N968P122Q158Q629Q266P526O858
58706G18822N875M075J937L84o38k104m529p414j0101j2431j4435j5911j6638
58693F46892j6719j6537j6347j6022j5176j3682j1913j0254q547o513m506l237
58681E07439k777k551k368k552l015l154k967l164l773l759k652j485j161r38
58667D71123M12K758M998O700Q092Q989Q980Q470Q269Q217P286N079K327j13j909
58652E49678k931l145l017l230l882m476m776n048n453n796n920n889n683n161
58638D85271m257k945j177P37K011K168J696J405J398J262R49P33N05q4q26j081
$$ plain form
58622 487765 487075 486973 487368 488286 489739 491515 493495 496041 499714 504715 510799 517551 524575 531634 538723
58607 538723 545780 552259 557400 561134 564265 567441 570297 571957 572074 570979 569078 566562 563614 560527
58593 560527 557553 554825 552417 550388 548851 548023 548068 548937 550615 553442 557868 563933 571410 580416 591236
58578 591236 603354 615264 625673 634485 642250 649148 655004 660031 664959 670524 677181 685205 694697
58565 694697 705596 718010 732584 750272 771700 796808 824956 855185 886420 917596 947649
58554 947649 975403 999597 1019106 1033214 1041828 1045552 1045347 1041904 1035548 1027029 1018091 1010624 1005260
58541 1005260 1001137 996948 991689 984500 974472 960951 943721 922969 899495 874831 850501 827095
58529 827095 804644 783844 765995 751508 739391 728691 719700 713138 708714 705218 701685 697853 693779
$$ packed form
58622D87765o90j02L95R18J453J776J980K546L673N001O084O752P024P059P089
58607E38723P057O479N141L734L131L176K856J660J17j095j901k516k948l087
58593E60527k974k728k408k029j537q28M5Q69J678K827M426O065P477R006J0820
58578E91236J2118J1910J0409Q812P765O898N856N027M928N565O657Q024R492
58565F94697J0899J2414J4574J7688K1428K5108K8148L0229L1235L1176L0053
58554I47649K7754K4194J9509J4108Q614L724k05l443o356q519q938p467n364
58541A005260m123m189n259p189j0028j3521j7230k0752k3474k4664k4330k3406
58529H27095k2451k0800j7849j4487j2117j0700q991o562m424l496l533l832m074
$$ plain form
58516 693779 689675 686041 683362 681500 679613 676770 672689 668009 663847 660923 659028 657420 655583 653401
58502 653401 650919 648387 646269 644659 642891 640467 638123 637107 637414 637744 637324 636796 637015 637978 639456 641799
58486 641799 645422 650124 655522 661660 668726 676661 685431 695213 706003 717670 730681 746060 764154
58473 764154 784015 804279 823840 841261 854517 862189 864462 862427 857047 849253 840146 830236 819058
58460 819058 806432 793718 783096 775921 772266 771612 773424 777547 784537 795025 808239 821865 834018
58447 834018 844624 854143 861818 866177 866588 863179 855852 844677 831002 816936 803684 791333 780173
58434 780173 771195 765061 761396 759380 758541 758874 760589 763812 768338 773812 780303 788238 797543 807401 817226
58419 817226 827107 836737 844670 849504 851272 850829 848431 843780 836974 828405 818110 806271 794085 783078
$$ packed form
58516F93779m104l634k679j862j887k843m081m680m162k924j895j608j837k182
58502F53401k482k532k118j610j768k424k344j016L07L30m20n28K19R63J478K343
58486F41799L623M702N398O138P066P935Q770R782J0790J1667J3011J5379J8094
58473G64154J9861K0264J9561J7421J3256P672K273k035n380p794r107r910j1178
58460H19058j2626j2714j0622p175l655o54J812M123O990J0488J3214J3626J2153
58447H34018J0606R519P675M359M11l409p327j1175j3675j4066j3252j2351j1160
58434G80173q978o134l665k016q39L33J715L223M526N474O491P935R305R858R825
58419H17226R881R630P933M834J768m43k398m651o806q569j0295j1839j2186j1007
$$ plain form
58405 783078 773595 764849 756350 748439 741520 735631 730780 726990 723986 721542 720065 720220 721953 724444
58391 724444 726939 729175 731157 733060 735164 737397 739153 739992 740198 740259 740258 740363 741380 744104 748495 754165
58375 754165 761248 770057 780214 790892 801688 812640 823625 834325 844546 854169 863181 872056
58363 872056 881524 891593 901624 911789 923419 937181 951983 966535 980898 995337 1008742 1019594
58351 1019594 1027748 1033900 1037995 1039652 1039608 1039248 1039006 1038507 1037900 1037810 1038422 1039821 1042771 1047861 1054413 1061548
58335 1061548 1069827 1080372 1092900 1106147 1119836 1134648 1150541 1166701 1182956 1199714 1216562
58324 1216562 1232272 1245993 1257229 1265117 1269302 1271264 1273132 1275341 1276849 1277429 1278173 1279872 1282417 1285784
58310 1285784 1290267 1295885 1302699 1311361 1322079 1333738 1345507 1358524 1374223 1391749 1409002 1425580
$$ packed form
58405G83078r483q746q499p911o919n889m851l790l004k444j477J55J733K491
58391G24444K495K236J982J903K104K233J756Q39K06O1jJ05J017K724M391N670
58375G54165P083Q809J0157J0678J0796J0952J0985J0700J0221R623R012Q875
58363H72056R468J0069J0031J0165J1630J3762J4802J4552J4363J4439J3405J0852
58351A019594Q154O152M095J657m4l60k42m99o07r0O12J399K950N090O552P135
58335A061548Q279J0545J2528J3247J3689J4812J5893J6160J6255J6758J6848
58324A216562J5710J3721J1236P888M185J962J868K209J508N80P44J699K545L367
58310A285784M483N618O814Q662J0718J1659J1769J3017J5699J7526J7253J6578
$$ plain form
58298 1425580 1442523 1459728 1476103 1492017 1509157 1527939 1547356 1567367 1589059 1612215 1635027
58287 1635027 1656531 1677360 1698011 1718464 1739475 1761971 1785096 1807245 1829186 1853678 1881777
58276 1881777 1911998 1943461 1977213 2013813 2052124 2091310 2131847 2173905 2216882 2261113 2307916
58265 2307916 2357403 2408266 2460073 2513623 2568820 2624527 2680844 2739205 2799977 2862270 2926189
58254 2926189 2992721 3061390 3130712 3200944 3273521 3347929 3422368 3497495 3576007 3658449 3743198
58243 3743198 3830893 3924865 4026534 4134397 4248337 4370807 4502786 4642693 4790425 4948375
58233 4948375 5117355 5295757 5483944 5685184 5901088 6130615 6374867 6638113 6922714
58224 6922714 7228063 7556078 7912573 8301440 8722813 9178823 9675844 10219367 10812778
$$ packed form
58298A425580J6943J7205J6375J5914J7140J8782J9417K0011K1692K3156K2812
58287A635027K1504K0829K0651K0453K1011K2496K3125K2149K1941K4492K8099
58276A881777L0221L1463L3752L6600L8311L9186M0537M2058M2977M4231M6803
58265B307916M9487N0863N1807N3550N5197N5707N6317N8361O0772O2293O3919
58254B926189O6532O8669O9322P0232P2577P4408P4439P5127P8512Q2442Q4749
58243C743198Q7695R3972J01669J07863J13940J22470J31979J39907J47732J57950
58233D948375J68980J78402J88187K01240K15904K29527K44252K63246K84601
58224F922714L05349L28015L56495L88867M21373M56010M97021N43523N93411
$$ plain form
58215 10812778 11463503 12184737 12989757 13891839 14912376 16081717 17428786 18976304 20747606
58206 20747606 22768809 25061016 27640069 30528847 33762324 37380131 41429029 45981289
58198 45981289 51143843 57052497 63881801 71878993 81385326 92826111 106692630 123512903
58190 123512903 143773663 167819425 195805903 227645425 262724391 299380349 334602242
58183 334602242 364497433 385441007 395141945 392964238 379592391 356604485 326258123
58176 326258123 291320132 254712127 219033281 186192004 157276514 132636971 112093267
58169 112093267 95177320 81326033 69988497 60673553 52973136 46565045 41194524
58162 41194524 36655575 32786450 29465842 26598427 24103077 21914672 19986570 18282373
$$ packed form
58215A0812778O50725P21234Q05020R02082J020537J169341J347069J547518J771302
58206B0747606K021203K292207K579053K888778L233477L617807M048898M552260
58198D5981289N162554N908654O829304P997192R506333J1440785J3866519J6820273
58190A23512903K0260760K4045762K7986478L1839522L5078966L6655958L5221893
58183C34602242K9895191K0943574R700938k177707j3371847k2987906l0346362
58176C26258123l4937991l6608005l5678846l2841277k8915490k4639543k0543704
58169A12093267j6915947j3851287j1337536r314944p700417o408091n370521
58162D1194524m538949l869125l320608k867415k495350k188405j928102j704197
$$ plain form
58154 18282373 16768106 15415416 14205617 13124235 12154975 11282720 10497813 9792785 9158206
58145 9158206 8585193 8068236 7602065 7179025 6792396 6438702 6113982 5811518 5526303
58136 5526303 5258100 5007117 4770133 4544045 4329887 4129956 3943724 3769543 3607534
58127 3607534 3457627 3317284 3184247 3059351 2943826 2835987 2733291 2635640 2543936 2457267
58117 2457267 2374189 2295219 2221601 2152992 2088391 2027837 1971286 1917285 1864567 1813355 1763660
58106 1763660 1714176 1664589 1616954 1572889 1531187 1490047 1449737 1411177 1373846 1337265 1302763
58095 1302763 1271558 1242640 1214761 1188986 1166989 1148151 1130576 1113835 1098516 1084025 1068981
58084 1068981 1053018 1036341 1018354 998541 977955 958116 939188 920752 903371 887726 873107
$$ packed form
58154A8282373j514267j352690j209799j081382r69260q72255p84907p05028o34579
58145I158206n73013n16957m66171m23040l86629l53694l24720l02464k85215
58136E526303k68203k50983k36984k26088k14158j99931j86232j74181j62009
58127C607534j49907j40343j33037j24896j15525j07839j02696r7651r1704q6669
58117B457267q3078p8970p3618o8609o4601o0554n6551n4001n2718n1212m9695
58106A763660m9484m9587m7635m4065m1702m1140m0310l8560l7331l6581l4502
58095A302763l1205k8918k7879k5775k1997j8838j7575j6741j5319j4491j5044
58084A068981j5963j6677j7987j9813k0586j9839j8928j8436j7381j5645j4619
$$ plain form
58073 873107 858477 844168 830901 818046 804584 790962 778139 765523 751754 737081 723234
58062 723234 711234 700830 691697 683653 675961 667773 659134 650556 642021 633338 624770 616247 606752 595819
58048 595819 584867 575718 568424 561859 555675 550124 544647 538357 531619 525519 519976 513867 506845 499635
58034 499635 492665 485798 479345 473897 469024 463404 456471 448899 441331 433626 425574 417472 409699 402320
58020 402320 395214 388167 380969 373859 367600 362626 358446 354349 350192 346014 341583 337070 333368 330772
58006 330772 328071 324064 319330 315216 311633 307404 302524 298502 296324 295482 295349 296197 298358 301448 305076
57991 305076 309599 315519 322525 329564 335615 340189 343419 345860 347959 349561 350077 349204 347278 344908 342414
57976 342414 339609 336166 332275 328848 326757 325956 325680 325399 324970 324099 322559 321064 320943 322529 324702 326339
$$ packed form
58073H73107j4630j4309j3267j2855j3462j3622j2823j2616j3769j4673j3847
58062G23234j2000j0404r133q044p692q188q639q578q535q683q568q523r495j0933
58048E95819j0952r149p294o565o184n551n477o290o738o100n543o109p022p210
58034D99635o970o867o453n448m873n620o933p572p568p705q052q102p773p379
58020D02320p106p047p198p110o259m974m180m097m157m178m431m513l702k596
58006C30772k701m007m734m114l583m229m880m022k178q42j33Q48K161L090L628
57991C05076M523N920P006P039O051M574L230K441K099J602N16q73j926k370k494
57976C42414k805l443l891l427k091q01k76k81m29q71j540j495j21J586K173J637
$$ plain form
57960 326339 327367 327994 327956 327172 326242 325583 324854 323825 322915 322158 320642 317892 314884 312704 311015 308903
57944 308903 306475 304506 303209 302539 303011 304983 307678 310168 312846 316652 321456 326607 332597 340502 349887
57929 349887 358841 366254 372705 378903 384539 388963 391864 392921 391774 388680 384409 379266 373009 365886
57915 365886 358837 352392 346096 339317 332046 324730 317899 312077 307558 304168 301688 300304 300032 300042 299386
57900 299386 298266 297728 298148 298923 299687 300910 303070 305976 309035 311598 313059 313398 313648 315009 317396 319567
57884 319567 320774 321482 322318 323149 323477 323101 322056 320403 318294 315892 313218 310460 308194 306667 305030
57869 305030 302109 297941 293759 290429 287715 285160 282857 281054 279679 278565 277691 277103 277069 278298 281420
57854 281420 286273 292234 299081 306792 314725 321946 328380 334677 340900 346348 350764 354579 357685 359161
$$ packed form
57960C26339J028O27l8p84r30o59p29j029r10p57j516k750l008k180j689k112
57944C08903k428j969j297o70M72J972K695K490K678L806M804N151N990P905R385
57929C49887Q954P413O451O198N636M424K901J057j147l094m271n143o257p123
57915C65886p049o445o296o779p271p316o831n822m519l390k480j384k72J0o56
57900B99386j120n38M20P75P64J223K160K906L059K563J461L39K50J361K387K171
57884C19567J207P08Q36Q31L28l76j045j653k109k402k674k758k266j527j637
57869C05030k921m168m182l330k714k555k303j803j375j114q74n88l4J229L122
57854B81420M853N961O847P711P933P221O434O297O223N448M416L815L106J476
$$ plain form
57840 359161 358736 357472 356251 354499 351213 346563 341543 336544 331192 325394 319681 314490 309703 305047
57826 305047 300653 297041 294622 293240 292273 291277 290455 290281 290879 292100 293975 296502 299074 300688 300764 299251
57810 299251 296044 290976 284493 277625 271027 264543 257897 251282 245056 239438 234755 231434 229392 227792
57796 227792 225726 222846 219205 214920 210301 206020 202805 200947 200112 199580 198891 198476 199437 202360 206685
57781 206685 211600 217137 223723 231104 238613 246243 254423 262806 270371 276853 283071 289518 295524 300248
57767 300248 303706 306448 308821 310888 312466 313003 312007 309781 307088 303915 299417 293429 287209 282265 279087
57752 279087 277384 276816 276985 277283 277353 277318 277343 277465 278014 279483 281649 283559 284719 285606 286632 287451 287801 288236
57734 288236 289297 290596 291434 291889 292597 293859 295540 297460 299340 300665 301133 300929 300246 298992 297339 296058
$$ packed form
57840C59161m25j264j221j752l286m650n020m999n352n798n713n191m787m656
57826C05047m394l612k419j382r67r96q22j74N98J221J875K527K572J614P6j513
57810B99251l207n068o483o868o598o484o646o615o226n618m683l321k042j600
57796B27792k066k880l641m285m619m281l215j858q35n32o89m15R61K923M325
57781B06685M915N537O586P381P509P630Q180Q383P565O482O218O447O006M724
57767C00248L458K742K373K067J578N37r96k226k693l173m498n988o220m944l178
57752B79087j703n68J69K98P0l5K5J22N49J469K166J910J160Q87J026Q19L50M35
57734B88236J061J299Q38M55P08J262J681J920J880J325M68k04o83j254j653j281
$$ plain form
57718 296058 295777 296362 297432 298932 300710 302032 302152 300935 298440 294432 288956 282856 277043 271595 266186
57703 266186 260911 255944 250818 244972 238821 233493 229538 226610 224280 222401 220675 218606 216124 213697
57689 213697 211586 209339 206276 202303 198154 194864 192992 192295 192168 192356 192998 194152 195826 198544 203217
57674 203217 210177 218936 229337 242446 259773 281993 308903 340250 375978 415577 457287 497598
57662 497598 531543 554281 563207 558518 541854 515132 480932 442917 404774 368917 336681 309109
57650 309109 286717 268918 254559 242963 233897 226891 221347 217080 214115 212136 210720 209808 209284 208476
57636 208476 206907 205235 204538 204769 204842 204262 203699 203783 204138 204021 203305 202466 201979 201983 202247 202291 201765 200810 199872 199248
57616 199248 199007 199127 199372 199238 198537 197903 198217 199529 200926 201390 200465 198333 195745 193783 193067 193124 192899
$$ packed form
57718B96058k81N85J070J500J778J322J20j217k495m008n476o100n813n448n409
57703B66186n275m967n126n846o151n328l955k928k330j879j726k069k482k427
57689B13697k111k247l063l973m149l290j872o97j27J88O42J154J674K718M673
57674B03217O960Q759J0401J3109J7327K2220K6910L1347L5728L9599M1710M0311
57662D97598L3945K2738Q926m689j6664k6722l4200l8015l8143l5857l2236k7572
57650C09109k2392j7799j4359j1596r066p006n544m267k965j979j416r12n24q08
57636B08476j569j672o97K31P3n80n63Q4L55j17p16q39m87MK64M4n26r55r38o24
57616A99248k41J20K45j34p01o34L14J312J397M64r25k132k588j962p16N7k25
$$ plain form
57599 192899 191891 190425 188932 187414 185624 183295 180209 176419 172453 168987 166247 163920 161542 158768
57585 158768 155458 151834 148430 145627 143354 141437 139880 138580 137182 135614 134372 133781 133353 132374 130856
57570 130856 129333 128066 127025 126286 125791 125050 123864 123068 123645 125141 125815 124550 121968 119604 118508 118743
57554 118743 119696 120660 121436 122417 123966 125966 128191 130623 132972 134455 134786 134860 135610 136604 136724 135869 134928
57537 134928 134384 134166 134733 136909 140395 143693 145889 147481 149111 150530 151271 151440 151302 150899 150542 150902
57521 150902 152110 153452 154364 155000 155436 155141 153834 152145 150826 149918 149250 149131 149814 150728 150934 150075 148452
57504 148452 146550 144812 143429 141872 139183 135184 130979 127718 125360 123083 120416 117309 113643 109520
57490 109520 105791 103473 102592 102140 101211 99826 98729 98687 99917 101895 103829 105512 107489 110189 113201
$$ packed form
57599A92899j008j466j493j518j790k329l086l790l966l466k740k327k378k774
57585A58768l310l624l404k803k273j917j557j300j398j568j242n91m28r79j518
57570A30856j523j267j041p39m95p41j186p96N77J496O74j265k582k364j096K35
57554A18743R53R64P76R81J549K000K225K432K349J483L31P4P50R94J20q55r41
57537A34928n44k18N67K176L486L298K196J592J630J419P41J69j38m03l57L60
57521A50902J208J342R12O36M36k95j307j689j319r08o68j19O83R14K06q59j623
57504A48452j902j738j383j557k689l999m205l261k358k277k667l107l666m123
57490A09520l729k318q81m52r29j385j097m2J230J978J934J683J977K700L012
$$ plain form
57475 113201 115683 117170 117689 117371 116324 114672 112433 109579 106404 103467 100994 98707 96496 94742 93633
57460 93633 92723 91641 90744 90420 90169 89130 87281 85420 84064 83008 81987 81172 80903 81292 82184 83205
57444 83205 83961 84530 85611 87821 90892 93928 96326 98017 98940 98827 97686 96166 95213 95429 96648 98063
57428 98063 98907 99242 99849 101157 102563 103203 103069 102792 102526 101759 100321 98902 98228 98159 97946 97126 95810 94332
57410 94332 93027 92339 92750 94311 96370 97949 98463 97968 96792 95168 93297 91522 90164 89296 88871 88888
57394 88888 89192 89355 89221 89413 90753 93189 95907 98509 101385 104701 107801 110108 112008 114229 116744
57379 116744 118942 120592 121988 123260 124131 124296 123564 121713 118730 115260 112306 110348 108982 107510 105617
57364 105617 103439 101277 99374 97800 96428 95084 93764 92695 92221 92557 93477 94279 94394 94088 94270 95518
$$ packed form
57475A13201K482J487N19l18j047j652k239k854l175k937k473k287k211j754j109
57460I3633r10j082q97l24k51j039j849j861j356j056j021q15k69L89Q92J021
57444H3205P56N69J081K210L071L036K398J691R23j13j141j520r53K16J219J415
57428I8063Q44L35O07J308J406O40j34k77k66p67j438j419o74o9k13q20j316j478
57410I4332j305o88M11J561K059J579N14m95j176j624j871j775j358q68m25J7
57394H8888L04J63j34J92J340K436K718K602K876L316L100K307J900K221K515
57379A16744K198J650J396J272Q71J65p32j851k983l470k954j958j366j472j893
57364A05617k178k162j903j574j372j344j320j069m74L36R20Q02J15l06J82J248
$$ plain form
57348 95518 97635 100238 103230 106372 108984 110648 111825 113185 114609 115551 116176 117352 119477 122023 124390
57333 124390 126541 128479 129739 129885 129225 128533 128173 127850 127210 126356 125701 125517 125716 126009 126146 125984 125487 124840
57315 124840 124516 124982 126173 127410 128034 128065 128086 128541 129311 129973 130307 130513 131001 131962 133146 134060 134447 134508 134680
57296 134680 135254 136250 137606 139400 141847 144974 148310 151119 153124 154790 156634 158481 159743 160253 160375
57281 160375 160390 160255 159882 159117 157446 154410 150427 146566 143305 140186 136897 133951 131847 130243 128539
57266 128539 126768 125232 123728 121803 119564 117651 116614 116745 118165 120499 122747 124124 124883 125853 127457
57251 127457 129726 132877 137025 141486 145202 147935 150329 152697 154483 155215 155384 156030 157802 160658 164118
57236 164118 167565 170531 172902 174858 176638 178551 181034 184290 187887 191054 193457 195448 197558 200010
$$ packed form
57348I5518K117K603K992L142K612J664J177J360J424R42O25J176K125K546K367
57333A24390K151J938J260J46o60o92l60l23o40q54o55j84J99K93J37j62m97o47
57315A24840l24M66J191J237O24L1K1M55P70O62L34K06M88R61J184R14L87O1J72
57296A34680N74R96J356J794K447L127L336K809K005J666J844J847J262N10J22
57281A60375J5j35l73p65j671l036l983l861l261l119l289k946k104j604j704
57266A28539j771j536j504j925k239j913j037J31J420K334K248J377P59R70J604
57251A27457K269L151M148M461L716K733K394K368J786P32J69O46J772K856L460
57236A64118L447K966K371J956J780J913K483L256L597L167K403J991K110K452
$$ plain form
57222 200010 202684 205272 207465 209304 211288 213879 216968 220089 222996 225716 228197 230449 232972 236492
57208 236492 241134 246282 251394 256570 262150 268136 274282 280505 286931 293650 300636 307911 315621 323793
57194 323793 332009 339515 345983 352105 358971 366698 374194 380552 386220 392248 398841 405378 411666 418354
57180 418354 426013 434483 443432 453109 464179 477044 491466 506781 522416 538295 554665 571508
57168 571508 588419 605276 622630 640972 659923 678687 697151 715908 735207 754470 772950
57157 772950 790440 807284 824162 841884 860932 881001 901300 921388 941463 961930 983078
57146 983078 1005183 1028472 1052814 1077719 1102692 1127427 1151829 1176268 1201735 1229243 1258922
57135 1258922 1289982 1321629 1353789 1386998 1421875 1458655 1497011 1536353 1576534 1618100 1661736
$$ packed form
57222B00010K674K588K193J839J984K591L089L121K907K720K481K252K523L520
57208B36492M642N148N112N176N580N986O146O223O426O719O986P275P710Q172
57194C23793Q216P506O468O122O866P727P496O358N668O028O593O537O288O688
57180D18354P659Q470Q949R677J1070J2865J4422J5315J5635J5879J6370J6843
57168E71508J6911J6857J7354J8342J8951J8764J8464J8757J9299J9263J8480
57157G72950J7490J6844J6878J7722J9048K0069K0299K0088K0075K0467K1148
57146I83078K2105K3289K4342K4905K4973K4735K4402K4439K5467K7508K9679
57135A258922L1060L1647L2160L3209L4877L6780L8356L9342M0181M1566M3636
$$ plain form
57124 1661736 1707818 1756795 1809517 1866607 1927850 1992939 2062587 2138167 2220347 2308866 2403755
57113 2403755 2506105 2617535 2739583 2873929 3022813 3189068 3376094 3588034 3829796
57104 3829796 4107039 4426456 4796175 5225847 5726685 6311707 6995823 7795989 8732734
57095 8732734 9832988 11131588 12669611 14491038 16639725 19156221 22073753 25414475
57087 25414475 29184836 33364844 37889952 42635646 47418638 52018474 56212341 59814032
57079 59814032 62707606 64860811 66306055 67097675 67274113 66846698 65810444 64158974
57071 64158974 61895781 59045678 55666816 51855977 47742418 43473543 39197955 35049136
57063 35049136 31132920 27522102 24258078 21355829 18809426 16597820 14690572 13052280
$$ packed form
57124A661736M6082M8977N2722N7090O1243O5089O9648P5580Q2180Q8519R4889
57113B403755J02350J11430J22048J34346J48884J66255J87026K11940K41762
57104C829796K77243L19417L69719M29672N00838N85022O84116Q00166R36745
57095H732734J100254J298600J538023J821427K148687K516496K917532L340722
57087B5414475L770361M180008M525108M745694M782992M599836M193867L601691
57079E9814032K893574K153205J445244P91620J76438m27415j036254j651470
57071F4158974k263193k850103l378862l810839m113559m268875m275588m148819
57063C5049136l916216l610818l264024k902249k546403k211606j907248j638292
$$ plain form
57055 13052280 11645813 10435500 9389803 8481898 7688704 6990644 6372476 5823266 5334861
57046 5334861 4900445 4514155 4170954 3866149 3595135 3353610 3137772 2944380 2770977
57037 2770977 2615914 2477788 2355030 2246315 2151048 2068910 1999317 1942007 1897900 1868447
57027 1868447 1853721 1851011 1854596 1856317 1847215 1820278 1772555 1704925 1620579 1524394 1422921 1323119
57015 1323119 1230151 1146477 1072620 1007905 950710 899267 852794 811305 774272 740265 708067
57004 708067 677317 647818 619053 590775 563415 537418 512702 489188 467402 448095 431568
56993 431568 417684 406231 397070 390273 386387 386245 390307 398398 410144 425267 443269 463149 483483
56980 483483 502412 517581 526821 529307 525788 517533 505513 490804 475064 459913 446049 433429
$$ packed form
57055A3052280j406467j210313j045697r07905p93194o98060o18168n49210m88405
57046E334861m34416l86290l43201l04805k71014k41525k15838j93392j73403
57037B770977j55063j38126j22758j08715r5267q2138o9593n7310m4107k9453
57027A868447j4726k710L585J721r102k6937m7723o7630q4346r6185j01473r9802
57015A323119r2968q3674p3857o4715n7195n1443m6473m1489l7033l4007l2198
57004G08067l0750k9499k8765k8278k7360k5997k4716k3514k1786j9307j6527
56993D31568j3884j1453r161o797l886j42M062Q091J1746J5123J8002J9880K0334
56980D83483J8929J5169R240K486l519q255j2020j4709j5740j5151j3864j2620
$$ plain form
56968 433429 422200 412890 405656 399843 394699 390453 388420 389898 395156 403770 415762 431774 451748
56955 451748 473831 494976 512347 523834 527842 523630 511953 494699 473724 450450 426481 403803
56943 403803 384042 367931 355593 346849 341156 337885 337088 339647 346501 358048 374368 395423 420656
56930 420656 448701 477621 505000 527720 542376 546569 539752 522816 497443 466110 431913 397488
56918 397488 364181 332687 304103 279700 259802 243605 230213 219348 210915 204431 199214 194903
56906 194903 191449 188688 186156 183367 180204 176964 174038 171547 169373 167532 166442 166709 168665 172227
56892 172227 177209 183765 192449 203841 218132 235107 254517 276222 299698 323372 344623 360723
56880 360723 369951 372038 367762 358383 345414 330662 315990 302811 291919 283947 279741 280020 284837
$$ packed form
56968D33429j1229r310p234n813n144m246k033J478N258Q614J1992J6012J9974
56955D51748K2083K1145J7371J1487M008m212j1677j7254k0975k3274k3969k2678
56943D03803j9761j6111j2338q744n693l271p97K559O854J1547J6320K1055K5233
56930D20656K8045K8920K7379K2720J4656M193o817j6936k5373l1333l4197l4425
56918C97488l3307l1494k8584k4403j9898j6197j3392j0865q433o484n217m311
56906A94903l454k761k532k789l163l240k926k491k174j841j090K67J956L562
56892A72227M982O556Q684J1392J4291J6975J9410K1705K3476K3674K1251J6100
56880C60723R228K087m276r379j2969j4752j4672j3179j0892p972m206K79M817
$$ plain form
56867 284837 293793 306735 323933 345680 372305 404608 443670 489863 542236 598675 655804 708506
56855 708506 750679 777639 787828 782049 761818 729299 688224 643576 600006 560893 528571 504454
56843 504454 488823 481302 481888 491204 509805 537880 575793 624327 684086 754937 835845 924303
56831 924303 1015256 1100771 1171439 1218849 1237718 1226795 1188417 1127363 1050033 964069 877375
56820 877375 796223 724104 662576 612727 575225 549618 534802 530307 536337 552657 578446 613390
56808 613390 657921 711841 773053 837520 899585 952206 988256 1002876 994838 965804 918941 858456
56796 858456 789564 718010 649297 587917 536398 494796 461837 436861 420140 411362 408993 411808
56784 411808 420218 435210 456568 482899 512804 544873 576510 603694 622258 629268 623502 605290
$$ packed form
56867B84837Q956J2942J7198K1747K6625L2303L9062M6193N2373N6439N7129N2702
56855G08506M2173K6960J0189n779k0231l2519m1075m4648m3570l9113l2322k4117
56843E04454j5631p521N86R316J8601K8075L7913M8534N9759P0851Q0908Q8458
56831I24303R0953Q5515P0668M7410J8869j0923l8378o1054p7330q5964q6694
56820H77375q1152p2119o1528m9849l7502k5607j4816m495O030J6320K5789L4944
56808F13390M4531N3920O1212O4467O2065N2621L6050J4620q038k9034m6863o0485
56796H58456o8892p1554o8713o1380n1519m1602l2959k4976j6721q778k369K815
56784D11808Q410J4992K1358K6331K9905L2069L1637K7184J8564P010n766j8212
$$ plain form
56772 605290 576227 538765 495878 450902 407193 367376 332709 303137 277871 256057 237263
56761 237263 221529 208731 197949 187850 177747 167912 158912 151162 145083 140851 137640 133923 129099
56748 129099 124317 121103 119566 118553 117217 115698 114397 113239 111811 109848 107489 105219 103602 102944
56734 102944 103181 104042 105141 106037 106524 106905 107643 108738 109806 110741 111801 113045 114254 115510 117213 119356
56718 119356 121390 123050 124618 126131 127040 127056 126658 126329 125887 125131 124516 124563 125077 125546 125954 126640 127711 129106
56700 129106 130867 132881 134742 136340 138139 140364 142364 143355 143342 142760 141671 140025 138292 137071 136319
56685 136319 135650 135155 135195 135557 135516 134670 133183 131370 129581 128263 127517 126710 125098 122720 120229 118060 116275
56668 116275 114962 114103 113250 111958 110496 109562 109398 109628 109824 109681 108896 107483 106092 105453 105611 106198 107178
$$ packed form
56772F05290k9063l7462m2887m4976m3709l9817l4667k9572k5266k1814j8794
56761B37263j5734j2798j0782j0099j0103r835r000p750o079m232l211l717m824
56748A29099m782l214j537j013j336j519j301j158j428j963k359k270j617o58
56734A02944K37Q61J099Q96M87L81P38J095J068R35J060J244J209J256J703K143
56718A19356K034J660J568J513R09J6l98l29m42p56o15M7N14M69M08O86J071J395
56700A29106J761K014J861J598J799K225K000R91j3n82j089j646j733j221p52
56685A36319o69m95M0L62m1q46j487j813j789j318p46q07j612k378k491k169j785
56668A16275j313q59q53j292j462r34j64K30J96j43p85j413j391o39J58N87R80
$$ plain form
56651 107178 108691 110372 111543 112027 112158 112097 111753 111308 111113 111097 110842 110280 109809 109780 110325 111541 113295 115063
56633 115063 116567 118332 120905 123792 125988 127435 128993 130984 132745 133842 134753 136033 137520 138748
56619 138748 139475 139487 138499 136632 134490 132416 130136 127391 124473 121845 119701 118209 117727 118380 119700 121000
56603 121000 121949 122637 123332 124273 125474 126609 127257 127298 126837 125936 124774 123949 124146 125516 127750 130619 133912
56586 133912 137010 139203 140486 141462 142428 143130 143470 143750 144128 144488 144979 145995 147418 148526 148998 149367 150188
56569 150188 151346 152612 154274 156732 159952 163838 168798 175378 183487 192472 201875 211782 222489 233997
56555 233997 245730 256640 265738 272678 277772 281457 283942 285299 285552 284643 282605 279819 276836 273942
56541 273942 271192 268755 266801 265068 263000 260413 257630 254885 251989 248578 244284 238735 231919 224612
$$ packed form
56651A07178J513J681J171M84J31o1l44m45j95j6k55n62m71k9N45J216J754J768
56633A15063J504J765K573K887K196J447J558J991J761J097R11J280J487J228
56619A38748P27J2r88j867k142k074k280k745k918k628k144j492m82O53J320J300
56603A21000R49O88O95R41J201J135O48M1m61r01j162q25J97J370K234K869L293
56586A33912L098K193J283R76R66P02L40K80L78L60M91J016J423J108M72L69Q21
56569A50188J158J266J662K458L220L886M960O580Q109Q985R403R907J0707J1508
56555B33997J1733J0910R098O940N094L685K485J357K53r09k038k786k983k894
56541B73942k750k437j954j733k068k587k783k745k896l411m294n549o816p307
$$ plain form
56527 224612 217895 212132 206909 202005 197787 194523 191964 189924 188676 188380 188580 188687 188599 188513 188471 188365 188082
56510 188082 187420 186170 184533 183156 182543 182619 182949 183098 182758 181967 181261 181150 181301 180785 179287 177536 176304
56493 176304 175507 174631 173517 172314 171126 170099 169538 169531 169766 170007 170449 171327 172554 174090 176230 178987 181539
56476 181539 182879 182937 182571 182491 182591 182441 182048 181838 182075 182577 183112 183814 184862 185852 186013 185233 184367 184180 184497
56457 184497 184884 185583 186975 188585 189600 190172 191104 192268 192498 191328 189792 189123 189564 190860 192902 195274
56441 195274 197004 197557 197537 197765 198182 198255 197943 197549 197010 196054 194833 193825 193265 193143 193548 194583 196026 197434
56423 197434 198493 199144 199535 199869 200038 199488 197983 196446 196269 197590 199087 199721 199792 199854 199610 198671 197586
56406 197586 197109 196891 195897 193787 191071 188143 185037 182032 179671 178108 177071 176532 176864 178170 179859
$$ packed form
56527B24612o717n763n223m904m218l264k559k040j248k96K00J07q8q6m2j06k83
56510A88082o62j250j637j377o13P6L30J49l40p91p06j11J51n16j498j751j232
56493A76304p97q76j114j203j188j027n61pK35K41M42Q78J227J536K140K757K552
56476A81539J340N8l66q0J00j50l93k10K37N02N35P02J048R90J61p80q66j87L17
56457A84497L87O99J392J610J015N72R32J164K30j170j536o69M41J296K042K372
56441A95274J730N53k0K28M17P3l12l94n39r56j221j008n60j22M05J035J443J408
56423A97434J059O51L91L34J69n50j505j537j77J321J497O34P1O2k44r39j085
56406A97586m77k18r94k110k716k928l106l005k361j563j037n39L32J306J689
$$ plain form
56391 179859 180943 180616 178670 175688 172775 170815 170064 170402 171626 173239 174527 175293 176272 178309 181326
56376 181326 184473 187119 189288 191336 193563 196113 198917 201777 204633 207628 210834 214165 217566 220955
56362 220955 223947 226132 227714 229348 231103 232161 231821 230349 228632 227475 227446 228704 230602 232063 232722
56347 232722 233207 234048 235025 235937 237192 239085 241169 243003 244840 247020 249333 251675 254626 258573 262725
56332 262725 265853 267578 268309 268384 268068 267928 268424 269451 270888 273093 276139 279126 281119 282295 283276 283838
56316 283838 283370 282224 281479 281512 281821 282185 282946 284153 285405 286597 287983 289381 290199 290465 291105 292986 296196
56299 296196 300336 304946 309598 314107 318771 323952 329415 334506 338910 342797 346374 349810 353412 357310
56285 357310 361068 364275 367475 371898 378168 385701 393420 400734 407848 415471 424146 433628 443120 452262
$$ packed form
56391A79859J084l27j946k982k913j960p51L38J224J613J288P66R79K037L017
56376A81326L147K646K169K048K227K550K804K860K856K995L206L331L401L389
56362B20955K992K185J582J634J755J058l40j472j717j157k9J258J898J461O59
56347B32722M85Q41R77R12J255J893K084J834J837K180K313K342K951L947M152
56332B62725L128J725P31P5l16j40M96J027J437K205L046K987J993J176R81N62
56316B83838m68j146p45L3L09L64P61J207J252J192J386J398Q18K66O40J881L210
56299B96196M140M610M652M509M664N181N463N091M404L887L577L436L602L898
56285C57310L758L207L200M423O270P533P719P314P114P623Q675R482R492R142
$$ plain form
56271 452262 461592 471786 483037 495483 509578 525416 542297 559754 578471 599450 622795 648208
56259 648208 676173 707528 742107 778974 818031 860472 907654 960363 1019342 1085658 1160181
56248 1160181 1243154 1334430 1433906 1541808 1658766 1785251 1920509 2062442 2208910 2358506
56238 2358506 2509391 2657966 2799636 2930483 3047479 3147613 3227946 3286342 3321258 3331140
56228 3331140 3315054 3273802 3209674 3125383 3024013 2909447 2785539 2654941 2519670 2382480
56218 2382480 2246504 2113697 1984835 1860997 1743809 1634126 1531599 1435803 1346841 1264679
56208 1264679 1188831 1118972 1055128 997144 944678 897714 856325 819835 786969 756822 729145
56197 729145 703853 680922 660522 642511 626099 610757 597056 585702 576190 567420 559131 551637
$$ packed form
56271D52262R330J0194J1251J2446J4095J5838J6881J7457J8717K0979K3345K5413
56259F48208K7965L1355L4579L6867L9057M2441M7182N2709N8979O6316P4523
56248A160181Q2973R1276R9476J07902J16958J26485J35258J41933J46468J49596
56238B358506J50885J48575J41670J30847J16996J00134Q0333N8396L4916R882
56228C331140j6086m1252o4128q4291j01370j14566j23908j30598j35271j37190
56218B382480j35976j32807j28862j23838j17188j09683j02527r5796q8962q2162
56208A264679p5848o9859o3844n7984n2466m6964m1389l6490l2866l0147k7677
56197G29145k5292k2931k0400j8011j6412j5342j3701j1354r512q770q289p494
$$ plain form
56185 551637 544645 537702 531461 527040 524313 522190 520299 518921 517490 514976 511841 509899 509900 510789 511682
56170 511682 513022 515228 517633 519433 520642 521681 523020 525500 529759 535048 539798 543717 548129 554019
56156 554019 561024 568744 577604 587917 599387 612172 627267 645124 664932 685870 708228 732891
56144 732891 760681 792636 829913 873010 922025 977947 1042599 1116925 1200333 1291928 1390982
56133 1390982 1495469 1601211 1703238 1797553 1881664 1954714 2017695 2072681 2121342 2164602 2203185
56122 2203185 2237039 2264264 2282053 2289045 2285699 2272569 2249915 2218996 2181778 2138609 2087688 2027276
56110 2027276 1957069 1877270 1788387 1692827 1595037 1499102 1407380 1321856 1245001 1178320 1121471
56099 1121471 1073682 1034724 1003781 978842 958195 941434 928428 918585 911651 907771 906121 905002
$$ packed form
56185E51637o992o943o241m421k727k123j891j378j431k514l135j942JQ89Q93
56170E11682J340K206K405J800J209J039J339K480M259N289M750L919M412N890
56156E54019P005P720Q860J0313J1470J2785J5095J7857J9808K0938K2358K4663
56144G32891K7790L1955L7277M3097M9015N5922O4652P4326Q3408R1595R9054
56133A390982J04487J05742J02027R4315Q4111P3050O2981N4986M8661M3260L8583
56122B203185L3854K7225J7789O992l346j3130k2654l0919l7218m3169n0921o0412
56110B027276p0207p9799q8883r5560r7790r5935r1722q5524p6855o6681n6849
56099A121471m7789l8958l0943k4939k0647j6761j3006r843o934l880j650j119
$$ plain form
56087 905002 903874 903817 905365 907516 909527 911952 915159 918561 922177 927150 933743 940562 946818 953691 962380
56072 962380 972393 982859 993925 1005687 1017311 1028389 1039837 1052381 1065464 1078475 1091646
56061 1091646 1104997 1118073 1131475 1146874 1164596 1183033 1201224 1219994 1239642 1258744 1276509
56050 1276509 1294182 1312703 1330996 1347990 1364428 1381272 1398251 1415291 1433443 1452993 1472708
56039 1472708 1492343 1513844 1538658 1565915 1594607 1625277 1658097 1691719 1725701 1761718 1800666
56028 1800666 1840963 1881394 1923104 1966908 2011255 2054953 2099275 2145185 2191035 2235382 2279693
56017 2279693 2325987 2374279 2424559 2478680 2537802 2600527 2665914 2735728 2811227 2890585 2972064
56006 2972064 3056887 3146255 3238546 3332431 3429842 3532867 3640678 3752625 3871258 3999014
$$ packed form
56087I05002j128n7J548K151K011K425L207L402L616M973O593O819O256O873Q689
56072I62380J0013J0466J1066J1762J1624J1078J1448J2544J3083J3011J3171
56061A091646J3351J3076J3402J5399J7722J8437J8191J8770J9648J9102J7765
56050A276509J7673J8521J8293J6994J6438J6844J6979J7040J8152J9550J9715
56039A472708J9635K1501K4814K7257K8692L0670L2820L3622L3982L6017L8948
56028A800666M0297M0431M1710M3804M4347M3698M4322M5910M5850M4347M4311
56017B279693M6294M8292N0280N4121N9122O2725O5387O9814P5499P9358Q1479
56006B972064Q4823Q9368R2291R3885R7411J03025J07811J11947J18633J27756
$$ plain form
55996 3999014 4134917 4277720 4429133 4590599 4760311 4937048 5123678 5323507 5536774
55987 5536774 5764243 6010068 6277177 6564109 6870634 7202050 7563529 7955160 8377573
55978 8377573 8837446 9342185 9894641 10499253 11168320 11916479 12755390 13701211 14781282
55969 14781282 16025195 17454112 19085543 20941461 23043453 25408105 28058234 31033342
55961 31033342 34381603 38152920 42414224 47266496 52840823 59297755 66856526 75825783
55953 75825783 86599856 99637554 115440165 134491664 157157402 183623121 213866829
55946 213866829 247444537 282969486 317674003 347709915 369292211 379928232 378874035
55939 378874035 366772964 345133614 316109308 282403909 246950547 212381864 180604480
$$ packed form
55996C999014J35903J42803J51413J61466J69712J76737J86630J99829K13267
55987E536774K27469K45825K67109K86932L06525L31416L61479L91631M22413
55978H377573M59873N04739N52456O04612O69067P48159Q38911R45821J080071
55969A4781282J243913J428917J631431J855918K101992K364652K650129K975108
55961C1033342L348261L771317M261304M852272N574327O456932P558771Q969257
55953G5825783J0774073J3037698J5802611J9051499K2665738K6465719L0243708
55946B13866829L3577708L5524949L4704517L0035912K1582296J0636021j054197
55939C78874035j2101071k1639350k9024306l3705399l5453362l4568683l1777384
$$ plain form
55932 180604480 152671686 128898057 109082764 92752016 79354103 68364099 59317539
55925 59317539 51823769 45573253 40324915 35883361 32090449 28826871 26003026 23543844
55917 23543844 21386183 19484018 17803931 16315310 14990789 13811756 12764289 11831189
55909 11831189 10994544 10243102 9569819 8964535 8415808 7917468 7466445 7055991 6677446
55900 6677446 6326869 6003715 5704548 5423998 5160508 4915343 4687072 4472347 4270934
55891 4270934 4084726 3912668 3751637 3601391 3463824 3337980 3220271 3109011 3004578
55882 3004578 2905828 2810354 2717568 2627697 2538739 2448490 2358917 2274570 2197107 2124812 2056623
55871 2056623 1992815 1932269 1872946 1814967 1759900 1707369 1655569 1604732 1556858 1512375 1470174
$$ packed form
55932A80604480k7932794k3773629j9815293j6330748j3397913j0990004r046560
55925E9317539p493770o250516n248338m441554l792912l263578k823845k459182
55917B3543844k157661j902165j680087j488621j324521j179033j047467r33100
55909A1831189q36645p51442o73283o05284n48727m98340m51023m10454l78545
55900F677446l50577l23154k99167k80550k63490k45165k28271k14725k01413
55891D270934j86208j72058j61031j50246j37567j25844j17709j11260j04433
55882C004578r8750r5474r2786q9871q8958r0249q9573q4347p7463p2295o8189
55871B056623o3808o0546n9323n7979n5067n2531n1800n0837m7874m4483m2201
$$ plain form
55860 1470174 1430523 1394745 1362229 1330758 1299701 1270096 1241980 1214478 1188250 1164940 1144285
55849 1144285 1124333 1104167 1083835 1062160 1037629 1011207 985320 960194 934099 907183 882030
55838 882030 860100 840408 822112 805771 791466 778118 765296 753640 743081 732705 722701
55827 722701 714247 707072 699246 689959 680608 672498 665207 657759 649806 641060 631025 619932 608778
55814 608778 598098 587663 577415 567675 558547 550202 543386 538489 534585 530772 527802 526848 527208 527139
55800 527139 526566 527053 529276 532447 536054 540215 544257 546874 547935 548513 549000 548735 547499 545754 543415
55785 543415 540040 536183 532842 529573 524820 518033 509642 499149 485426 469189 453046 438598 425379
55772 425379 413182 403387 397082 393556 391593 390815 390882 390670 389182 386286 381933 375646 367416 358178 348972
$$ packed form
55860A470174l9651l5778l2516l1471l1057k9605k8116k7502k6228k3310k0655
55849A144285j9952k0166k0332k1675k4531k6422k5887k5126k6095k6916k5153
55838H82030k1930j9692j8296j6341j4305j3348j2822j1656j0559j0376j0004
55827G22701q454p175p826r287r351q110p291p448p953q746j0035j1093j1154
55814F08778j0680j0435j0248r740r128q345o816m897l904l813k970r54L60o9
55800E27139n73M87K223L171L607M161M042K617J061N78M87k65j236j745k339
55785E43415l375l857l341l269m753o787q391j0493j3723j6237j6143j4448j3219
55772D25379j2197r795o305l526j963p78O7k12j488k896m353o287q230r238r206
$$ plain form
55757 348972 340465 333475 328815 326233 324621 323568 323610 324675 325476 324884 322898 319947 316219 311947 307349
55742 307349 302111 295978 289881 285226 281980 278875 275720 273905 274077 274829 274517 273183 271801 270721 269723
55727 269723 268742 267666 265971 263227 259518 255102 250225 245485 241525 238160 234635 231013 228426 227638 228204
55712 228204 229351 230837 232655 234748 237315 240593 244088 246887 248959 251228 254027 256380 257125 255967
55698 255967 253187 249178 244509 239599 234094 227402 220002 213387 208552 205433 203782 203422 203494 202788 201301
55683 201301 200319 200585 201509 202535 204050 206289 208554 210292 211961 214041 216010 217018 216847 215570 212994
55668 212994 209128 204577 199921 195278 190881 187362 185015 183380 182017 181057 180716 180986 182051 184219 187164
55653 187164 190100 192968 196488 200706 204531 207178 209053 210682 211811 212215 212403 212802 213055 212825 212455 212151
$$ packed form
55757C48972q507o990m660k582j612j053M2J065Q01n92j986k951l728m272m598
55742C07349n238o133o097m655l246l105l155j815J72P52l12j334j382j080r98
55727B69723r81j076j695k744l709m416m877m740l960l365l525l622k587p88N66
55712B28204J147J486J818K093K567L278L495K799K072K269K799K353P45j158
55698B55967k780m009m669m910n505o692p400o615m835l119j651l60P2p06j487
55683B01301r82K66R24J026J515K239K265J738J669K080J969J008j71j277k576
55668B12994l866m551m656m643m397l519k347j635j363r60l41K70J065K168K945
55653A87164K936K868L520M218L825K647J875J629J129M04J88L99K53k30l70l04
$$ plain form
55637 212151 211275 209073 205371 200121 193269 185731 179381 175092 171662 167598 163145 159509 156907 154589
55623 154589 152322 150654 149911 149808 149896 149691 148695 146949 145198 143902 142562 140732 139097 138623 139044 139145
55607 139145 138331 137002 135537 133823 131902 130246 129135 128240 127057 125499 123929 122766 122057 121425 120554
55592 120554 119685 119315 119497 119917 120599 121869 123457 124384 124030 122748 121189 119694 118684 118897 120673 123503
55576 123503 126636 129624 132107 133827 135276 137558 141098 145194 149290 153832 159200 164539 168484 170562
55562 170562 171125 170426 168506 165606 162001 157628 152396 146542 140352 133982 127926 123039 119537 116514 113030
55547 113030 109234 105974 103797 102784 102743 103130 103359 103626 104755 106797 108686 109818 110978 112914 114906
55532 114906 115800 115662 115332 114998 114363 113722 113644 113893 113707 112961 112159 111546 111055 110832 110953 110978 110617 110468 111203
$$ packed form
55637B12151q76k202l702n250o852p538o350m289l430m064m453l636k602k318
55623A54589k267j668p43j03Q8k05r96j746j751j296j340j830j635m74M21J01
55607A39145q14j329j465j714j921j656j111q95j183j558j570j163p09o32q71
55592A20554q69l70J82M20O82J270J588R27l54j282j559j495j010K13J776K830
55576A23503L133K988K483J720J449K282L540M096M096M542N368N339L945K078
55562A70562N63o99j920k900l605m373n232n854o190o370o056m887l502l023l484
55547A13030l796l260k177j013m1L87K29K67J129K042J889J132J160J936J992
55532A14906Q94j38l30l34o35o41p8K49j86p46q02o13m91k23J21K5l61j49P35
$$ plain form
55513 111203 112400 113174 113592 114475 116072 117935 119813 121633 122834 122884 122296 122036 121959 120989 118870 116637 115180
55496 115180 114316 113459 112316 110752 108823 107175 106629 107222 108256 109262 110099 110254 109116 107151 105766 105644
55480 105644 106028 105999 105585 105180 104698 103921 103131 102762 102849 103200 103800 104577 104997 104347 102374 99521 96612 94342
55462 94342 92875 91862 90942 90114 89554 89330 89475 90020 90674 90866 90476 90097 90143 90225 89982 89911 90544 91298 91171
55443 91171 90246 89416 88819 87744 86061 84551 83617 82822 82053 82076 83351 85142 86383 86848 86919 86812 86524 86094
55425 86094 85458 84360 82769 81129 80032 79871 80826 82681 84647 85867 86195 86048 85551 84517 83281 82707
55409 82707 83109 83883 84474 85032 85781 86435 86675 86621 86444 86040 85511 85377 85830 86266 86083 85549 85327 85484 85595
55390 85595 85646 86283 88053 90656 93040 94202 94001 93215 92663 92398 92028 91614 91718 92579 93815 94983 95912
$$ packed form
55513A11203J197P74M18Q83J597J863J878J820J201N0n88k60p7r70k119k233j457
55496A15180q64q57j143j564j929j648n46N93J034J006Q37J55j138j965j385j22
55480A05644L84k9m14m05m82p77p90l69Q7L51O00P77M20o50j973k853k909k270
55462I4342j467j013r20q28n60k24J45N45O54J92l90l79M6Q2k43p1O33P54j27
55443I1171r25q30n97j075j683j510r34p95p69K3J275J791J241M65P1j07k88m30
55425H6094o36j098j591j640j097j61R55J855J966J220L28j47m97j034j236n74
55409H2707M02P74N91N58P49O54K40n4j77m04n29j34M53M36j83n34k22J57J11
55390H5595N1O37J770K603K384J162k01p86n52k65l70m14J04Q61J236J168R29
$$ plain form
55373 95912 96414 96334 96060 96352 97346 98280 98543 98404 98331 98090 97073 95198 93010 91121 89818 88978 88089 86659
55355 86659 84932 83919 84359 85839 87138 87316 86297 84732 83544 83330 83943 84779 85532 86400 87499 88443
55339 88443 88713 88141 86970 85696 84923 84997 85692 86576 87627 88999 90285 90724 90275 89695 89309 88553 87161
55322 87161 85998 85990 86811 87381 87266 86875 86545 86176 85675 85160 84698 84278 84027 84113 84486 84931 85187 84881 83731
55303 83731 82151 81274 81839 83293 84450 84811 84737 84539 84053 83164 82245 81905 82505 83945 85689 87046 87626
55286 87626 87530 87007 86139 85105 84461 84810 86219 88122 89716 90390 90077 89424 89274 89729 90021 89611 88975 88875
55268 88875 89227 89337 89020 88797 89050 89629 90366 91350 92513 93407 93688 93526 93330 93309 93438 93590 93537 92994 91818
55249 91818 90145 88311 86712 85610 84893 84194 83502 83477 84735 86876 88705 89540 89793 90130 90606 90995 91514
$$ packed form
55373I5912N02q0k74K92R94R34K63j39p3k41j017j875k188j889j303q40q89j430
55355H6659j727j013M40J480J299J78j019j565j188k14O13Q36P53Q68J099R44
55339H8443K70n72j171j274p73P4O95Q84J051J372J286M39m49n80l86p56j392
55322H7161j163qQ21N70j15l91l30l69n01n15m62m20k51Q6L73M45K56l06j150
55303H3731j580q77N65J454J157L61p4j98m86q89r19l40O00J440J744J357N80
55286H7626r6n23q68j034o44L49J409J903J594O74l13o53j50M55K92m10o36j00
55268H8875L52J10l17k23K53N79P37R84J163Q94K81j62j96k1J29J52n3n43j176
55249I1818j673j834j599j102p17o99o92k5J258K141J829Q35K53L37M76L89N19
$$ plain form
55232 91514 92544 93836 94638 94707 94639 94975 95449 95462 94912 94116 93197 92139 91302 91214 91756 92167 92075 91895 91881 91442
55212 91442 90057 88338 87363 87193 86951 86326 86090 86880 88213 89132 89307 89127 89065 89328 89812 90156 90092 89883 90070
55193 90070 90644 90970 90747 90530 90909 91664 92192 92435 92829 93574 94460 95265 95867 96094 95880 95501 95272 95077 94535
55174 94535 93608 92729 92399 92923 94364 96330 97873 98105 97103 95888 95313 95149 94461 92773 90717 89507
55158 89507 89862 91464 93405 94978 95980 96519 96884 97490 98509 99551 100067 100078 100069 100069 99446 97902 96129 95034
55140 95034 94717 94663 94602 94661 94851 94946 94800 94484 94202 94332 95218 96539 97242 96639 95372 94706 95004 95588 96024 96724
55120 96724 98015 99302 99715 99237 98698 98721 98995 98670 97326 95505 94285 94273 95076 95847 96236 96618 97447 98671
55102 98671 99824 100550 100929 101355 102123 103067 103704 103794 103656 103803 104353 104995 105469 105908 106703 108107 109878 111240
$$ packed form
55232I1514J030J292Q02O9o8L36M74J3n50p96r19j058q37q8N42M11r2j80j4m39
55212I1442j385j719r75j70k42o25k36P90J333R19J75j80o2K63M84L44o4k09J87
55193I0070N74L26k23k17L79P55N28K43L94P45Q86Q05O02K27k14l79k29j95n42
55174I4535r27q79l30N24J441J966J543K32j002j215n75j64o88j688k056j210
55158H9507L55J602J941J573J002N39L65O06J019J042N16J1r%o23j544j773j095
55140I5034l17n4o1N9J90R5j46l16k82J30Q86J321P03o03j267o66K98N84M36P00
55120I6724J291J287M13m78n39K3K74l25j344j821j220j2Q03P71L89L82Q29J224
55102I8671J153P26L79M26P68R44O37R0j38J47N50O42M74M39P95J404J771J362
$$ plain form
55084 111240 111401 110341 108906 107946 107499 107124 106827 107163 108432 110161 111519 111981 111456 110059 108023 105770
55068 105770 103872 102893 103174 104635 106676 108398 109091 108658 107620 106635 105925 105187 104146 103049 102394 102198
55052 102198 101941 101334 100753 100675 100994 101251 101271 101152 100776 99810 98273 96697 95601 95064 94938 95206 95934 97000
55034 97000 98114 99107 100079 101172 102244 102843 102619 101750 100839 100351 100210 100012 99563 99120 99107 99622 100339 100928
55016 100928 101418 101894 101954 101042 99509 98747 99674 101509 102726 102938 103001 103436 103794 103703 103514 103498 103320 102891 102922
54997 102922 103975 105547 106752 107357 107483 106918 105544 104029 103211 103089 103181 103547 104597 106135 107517 108654
54981 108654 109940 111217 111780 111609 111703 112838 114662 116342 117505 118176 118324 117907 117104 116136 115048 113880
54965 113880 112879 112394 112646 113515 114390 114440 113472 112376 112267 113276 114645 115863 117002 117943 118085 117159 115760
$$ packed form
55084A11240J61j060j435r60m47l75k97L36J269J729J358M62n25j397k036k253
55068A05770j898r79K81J461K041J722O93m33j038r85p10p38j041j097o55j96
55052A02198k57o07n81p8L19K57K0j19l76r66j537j576j096n37j26K68P28J066
55034I7000J114R93R72J093J072N99k24q69r11m88j41j98m49m43j3N15P17N89
55016A00928M90M76O0r12j533p62R27J835J217K12O3M35L58r1j89j6j78m29L1
54997A02922J053J572J205O05J26n65j374j515q18j22R2L66J050J538J382J137
54981A08654J286J277N63j71R4J135J824J680J163O71J48m17q03r68j088j168
54965A13880j001m85K52Q69Q75N0r68j096j09J009J369J218J139R41J42r26j399
$$ plain form
54948 115760 114696 114204 114090 114201 114440 114620 114629 114508 114177 113388 112144 110883 109968 109258 108434 107576 107171 107627
54930 107627 108902 110474 111700 112338 112733 113292 113865 113993 113757 113965 115390 118119 121709 125701 129864 134273
54914 134273 139168 144524 149768 154227 157753 160461 161984 161617 159310 155931 152349 148804 145355 142263
54900 142263 139526 136614 133187 129707 126847 124611 122553 120700 119672 119917 121130 122442 123020 122596 121624
54885 121624 120857 120706 121105 121899 122934 123694 123444 122177 121075 121520 123787 127029 130360 133605 137104 141189
54869 141189 145758 150099 153203 154570 154690 154523 154549 154480 153700 151744 148454 144014 138935 133858 129339 125800
54853 125800 123456 122063 120935 119496 117816 116397 115456 114581 113152 111027 108746 107058 106184 105621 104776
54838 104776 103636 102618 101856 101100 100364 100198 101005 102353 103324 103431 102978 102609 102707 103127 103385 103130 102505 101928
$$ packed form
54948A15760j064m92j14J11K39J80Rj21l31p89j244j261r15p10q24q58m05M56
54930A07627J275J572J226O38L95N59N73J28k36K08J425K729L590L992M163M409
54914A34273M895N356N244M459L526K708J523l67k307l379l582l545l449l092
54900A42263k737k912l427l480k860k236k058j853j028K45J213J312N78m24r72
54885A21624p67j51L99P94J035P60k50j267j102M45K267L242L331L245L499M085
54869A41189M569M341L104J367J20j67K6o9p80j956l290m440n079n077m519l539
54853A25800k344j393j128j439j680j419r41q75j429k125k281j688q74n63q45
54838A04776j140j018p62p56p36j66Q07J348R71J07m53l69R8M20K58k55o25n77
$$ plain form
54820 101928 101577 101335 101181 101283 101644 102060 102526 103254 104099 104509 104386 104516 105629 107394 108875 109746 110437 111206
54802 111206 111699 111554 110937 110314 109996 110066 110519 111308 112412 113800 115232 116193 116290 115710 115008 114477 114006 113511
54784 113511 113088 112648 111789 110363 108941 108362 108865 109901 110846 111678 112872 114775 117275 120019 122787 125556
54768 125556 128325 131028 133621 136174 138885 141975 145475 149095 152516 155919 159934 164767 169578 173082
54754 173082 174721 174854 173914 171940 168983 165393 161358 156622 151060 145231 139917 135353 131295 127716 125009
54739 125009 123477 122965 123000 123081 122825 122139 121362 121050 121497 122492 123574 124435 125049 125485 125734 125812 126019 126888 128724
54720 128724 131255 133951 136644 139610 143056 146784 150422 153713 156539 158835 160542 161420 160874 158322 153894
54705 153894 148552 143380 138892 135063 131674 128505 125521 123106 121866 121945 122732 123464 123943 124423 124987 125283
$$ packed form
54820A01928l51k42j54J02L61M16M66P28Q45M10j23J30J113J765J481Q71O91P69
54802A11206M93j45o17o23l18P0M53P89J104J388J432R61R7n80p02n31m71m95
54784A13511m23m40q59j426j422n79N03J036R45Q32J194J903K500K744K768K769
54768A25556K769K703K593K553K711L090L500L620L421L403M015M833M811L504
54754A73082J639J33r40j974k957l590m035m736n562n829n314m564m058l579k707
54739A25009j532n12L5Q1k56o86p77l12M47R95J082Q61O14M36K49P8K07Q69J836
54720A28724K531K696K693K966L446L728L638L291K826K296J707Q78n46k552m428
54705A53894n342n172m488l829l389l169k984k415j240P9P87P32M79M80N64K96
$$ plain form
54689 125283 124888 123704 122057 120407 118937 117384 115440 113278 111485 110523 110456 111113 112076 112615 112220 111355
54673 111355 111134 111931 112814 112689 111582 110340 109488 108916 108471 108323 108783 110047 111974 113834 114514 113426 111170
54656 111170 109020 107846 107710 108234 108962 109576 110136 111080 112637 114399 115751 116580 117248 118014 118873 119826 120915
54639 120915 122017 122933 123594 123893 123439 121947 119866 118199 117602 117906 118557 119186 119654 119835 119614 119017 118277
54622 118277 117798 117948 118747 119767 120492 120777 120825 120765 120447 119742 118931 118550 118756 118990 118570 117655 117213 117747 118450
54603 118450 118160 116966 116202 116854 118525 120064 120673 120279 119371 118642 118365 118043 117168 116244 116305 117431 118595
54586 118595 119124 119303 119298 118685 117640 117307 118097 118708 117986 116765 116511 116952 116713 115846 115915 117484 119211 119882
54568 119882 120029 120844 122422 123840 124372 124050 123337 122655 122047 121199 119988 118844 118254 118192 118516 119479 121102
$$ packed form
54689A25283l95j184j647j650j470j553j944k162j793r62o7O57R63N39l95q65
54673A11355k21P97Q83j25j107j242q52n72m45j48M60J264J927J860O80j088k256
54656A11170k150j174j36N24P28O14N60R44J557J762J352Q29O68P66Q59R53J089
54639A20915J102R16O61K99m54j492k081j667n97L04O51O29M68J81k21n97p40
54622A18277m79J50P99J020P25K85M8o0l18p05q11l81K06K34m20r15m42N34P03
54603A18450k90j194p64O52J671J539O09l94r08p29k77l22q75r24O1J126J164
54586A18595N29J79no13j045l33P90O11p22j221k54M41k39q67O9J569J727O71
54568A19882J47Q15J578J418N32l22p13o82o08q48j211j144n90o2L24R63J623
$$ plain form
54551 121102 122458 122580 121933 121894 122799 123602 123576 123221 123156 123210 123080 122978 123039 122872 122256 121699 121777 122461 123478 124719
54531 124719 125856 126240 125692 124887 124407 123951 123007 121880 121391 121783 122417 122507 121828 120817 120114 119957 120057 120232
54513 120232 120822 121971 122844 122455 121193 120506 120943 121556 121477 120968 120413 119493 118200 117679 118928 121296 123267
54496 123267 124324 125078 125937 126671 127209 127920 128985 130075 130751 130816 130320 129572 128974 128569 127963 126978 126011 125432
54478 125432 125079 124802 124986 125928 127121 127856 128237 128940 130205 131737 133371 135062 136386 136818 136589 136579 137252
54461 137252 138190 138773 138836 138576 138239 138018 137945 137794 137344 136754 136437 136614 137168 137775 137946 137194 135484 133437 131821
54442 131821 130976 130808 130998 130989 130237 128830 127540 126923 126870 127333 128782 131226 133454 134233 133964 134167 135453 136949
54424 136949 137684 137636 137281 136976 137014 137619 138542 139167 139185 138751 137985 136869 135669 134840 134413 134047 133760 134007 134886
$$ packed form
54551A21102J356J22o47l9R05Q03k6l55o5N4j30j02O1j67o16n57P8O84J017J241
54531A24719J137L84n48q05m80m56r44j127m89L92O34R0o79j011p03j57J00J75
54513A20232N90J149Q73l89j262o87M37O13p9n09n55r20j293n21J249K368J971
54496A23267J057P54Q59P34N38P11J065J090O76O5m96p48n98m05o06r85r67n79
54478A25432l53k77J84R42J193P35L81P03J265J532J634J691J324M32k29j0O73
54461A37252R38N83O3k60l37k21p3j51m50n90l17J77N54O07J71p52j710k047j616
54442A31821q45j68J90rp52j407j290o17n3M63J449K444K228P79k69K03J286J496
54424A36949P35m8l55l05L8O05R23O25J8m34p66j116j200q29m27l66k87K47Q79
$$ plain form
54405 134886 135882 136587 137129 137706 138278 138894 139766 140816 141683 142395 143477 145076 146542 147203 147081 146573 145951
54388 145951 145496 145548 145943 145885 144871 143397 142286 141698 141296 141036 141124 141445 141683 141993 142917 144511 146072 146917
54370 146917 147109 147160 147335 147559 147895 148789 150636 153175 155506 156899 157578 158571 160758 164168 168224 172432
54354 172432 176604 180477 183392 184592 183915 182069 180038 178221 176316 174016 171547 169322 167347 165278
54340 165278 162891 160284 157712 155492 153903 152876 151874 150404 148559 146818 145472 144533 144029 143960 144078
54325 144078 144092 143981 143755 143100 141846 140546 140008 140266 140676 141021 141753 143074 144521 145756 147052 148619 150030
54308 150030 150727 150642 149931 148593 146772 144997 143734 143012 142774 143093 143666 143670 142659 141222 140260 139969 140018 140263
54290 140263 140698 141041 141005 140715 140339 139681 138815 138690 140187 142716 144667 145264 145096 144760 144030 142746 141622
$$ packed form
54405A34886R96P05N42N77N72O16Q72J050Q67P12J082J599J466O61j22n08o22
54388A45951m55N2L95n8j014j474j111n88m02k60Q8L21K38L10R24J594J561Q45
54370A46917J92N1J75K24L36Q94J847K539K331J393O79R93K187L410M056M208
54354A72432M172L873K915J200o77j846k031j817j905k300k469k225j975k069
54340A65278k387k607k572k220j589j027j002j470j845j741j346r39n04o9J18
54325A44078J4j11k26o55j254j300n38K58M10L45P32J321J447J235J296J567J411
54308A50030O97q5p11j338j821j775j263p22k38L19N73Mj011j437r62k91M9K45
54290A40263M35L43l6k90l76o58q66j25J497K529J951N97j68l36p30j284j124
$$ plain form
54273 141622 141488 142280 143343 144345 145338 146207 146713 147010 147615 148759 150016 150653 150222 148906 147455 146743 147258
54256 147258 148937 151404 154139 156458 157726 157892 157587 157479 157635 157717 157604 157513 157561 157520 157099 156249 155133 153902
54238 153902 152628 151443 150622 150432 150781 151135 151053 150789 151057 151979 152628 151985 150206 148477 147644 147428 147145 146740
54220 146740 146796 147758 149569 151912 154384 156423 157443 157268 156223 154758 153168 151794 151082 151051 150946 149924
54204 149924 148133 146616 145988 145702 144981 144023 143660 144037 144409 144402 144712 146055 147903 148957 148694 147826 147251 147108
54186 147108 147028 146788 146426 146062 145904 146187 146833 147378 147464 147186 146799 146400 146175 146584 147812 149320 150452 151308
54168 151308 152406 153617 154184 153851 153245 152866 152389 151390 150150 149194 148466 147628 146894 146872 147629 148501 148938 149053
54150 149053 149223 149530 149753 149669 149228 148619 148221 148328 148888 149610 150234 150558 150378 149727 149061 148811 148795 148465 147812
$$ packed form
54273A41622j34P92J063J002R93Q69N06K97O05J144J257O37m31j316j451p12N15
54256A47258J679K467K735K319J268J66l05j08J56Q2j13r1M8m1m21q50j116j231
54238A53902j274j185q21j90L49L54q2k64K68R22O49o43j779j729q33k16k83m05
54220A46740N6R62J811K343K472K039J020j75j045j465j590j374p12l1j05j022
54204A49924j791j517o28k86p21r58l63L77L72pL10J343J848J054k63q68n75j43
54186A47108q0k40l62l64j58K83O46N45Q6k78l87l99k25M09J228J508J132Q56
54168A51308J098J211N67l33o06l79m77r99j240r56p28q38p34k2P57Q72M37J15
54150A49053J70L07K23q4m41o09l98J07N60P22O24L24j80o51o66k50j6l30o53
$$ plain form
54131 147812 147589 148435 150098 151776 152954 153627 153891 153731 153246 152820 152900 153577 154471 155062 155158 155037 155097 155460 156001
54112 156001 156602 157252 157982 158921 160354 162427 164784 166698 167698 167911 167779 167617 167536 167613 167905 168330 168672 168770
54094 168770 168705 168711 168854 168899 168667 168488 168982 170298 171944 173560 175481 178159 181352 184525 187892 192363 198232
54077 198232 204420 209296 211949 212472 211406 209236 206310 202896 199274 195800 192781 190301 188323 186918
54063 186918 186158 185804 185465 185131 185200 185778 186356 186417 186050 185649 185304 184940 184903 185841 187898 190481 193034 195760
54045 195760 199212 203344 207401 210846 214034 217694 221967 226391 230801 235779 242060 249868 259015 269214
54031 269214 279850 289793 298034 304493 309774 314257 317828 320392 322039 322632 321762 319351 315991 312514
54017 312514 309477 307022 304812 302033 297940 292630 286934 281388 275742 269720 263807 258839 255006 251643
$$ packed form
54131A47812k23Q46J663J678J178O73K64j60m85m26Q0O77Q94N91R6j21O0L63N41
54112A56001O01O50P30R39J433K073K357J914J000K13j32j62q1P7K92M25L42R8
54094A68770o5OJ43M5k32j79M94J316J646J616J921K678L193L173L367M471N869
54077A98232O188M876K653N23j066k170k926l414l622l474l019k480j978j405
54063A86918p60l54l39l34O9N78N78O1l67m01l45l64l7R38K057K583K553K726
54045A95760L452M132M057L445L188L660M273M424M410M978O281P808R147J0199
54031B69214J0636R943Q241O459N281M483L571K564J647N93q70k411l360l477
54017C12514l037k455k210k779m093n310n696n546n646o022n913m968l833l363
$$ plain form
54003 251643 247876 243298 238117 232896 228138 224012 220471 217514 215147 213215 211567 210327 209657 209328 208955
53988 208955 208623 208747 209304 209770 209884 209826 209447 208066 205460 202448 200029 198399 197196 196235 195471 194771 194245
53971 194245 194340 195069 195599 195284 194679 194765 195512 196065 196160 196480 197557 199174 201022 203265 206065 209114 211946
53954 211946 214382 216398 217816 218419 218350 218313 219366 222250 226689 231557 236070 240657 246371 253692 262342
53939 262342 272093 283092 295362 308409 321340 332989 342037 347568 349652 349027 346274 341760 336314
53926 336314 331272 327572 325258 324054 323983 325198 327584 330830 334679 338940 343542 348675 354612 361285 368271
53911 368271 375251 382140 388741 394654 399645 403681 406538 407840 407682 406696 405253 403071 399951 396411 393022
53896 393022 389516 385141 379733 373850 367878 361635 354990 348348 342174 336285 329958 322704 314726 306651
$$ packed form
54003B51643l767m578n181n221m758m126l541k957k367j932j648j240o70l29l73
53988B08955l32J24N57M66J14n8l79j381k606l012k419j630j203r61p64p00n26
53971A94245R5P29N30l15o05Q6P47N53R5L20J077J617J848K243K800L049K832
53954B11946K436K016J418O03o9l7J053K884M439M868M513M587N714P321Q650
53939B62342R751J0999J2270J3047J2931J1649R048N531K084o25k753m514n446
53926C36314n042l700k314j204p1J215K386L246L849M261M602N133N937O673O986
53911C68271O980O889O601N913M991M036K857J302j58r86j443k182l120l540l389
53896C93022l506m375n408n883n972o243o645o642o174n889o327p254p978q075
$$ plain form
53882 306651 299025 292126 286114 281077 276856 272964 268929 264755 260947 257985 255768 253601 250730 246946
53868 246946 242701 238647 235073 231872 228906 226175 223591 220889 217941 214974 212362 210389 209251 208885
53854 208885 208652 207685 205939 204430 203960 204028 203685 203034 202994 203692 204123 203587 202605 202025 201975 202088 202149 202022 201473
53835 201473 200599 200069 200400 201243 201767 201526 200671 199601 198771 198556 198898 199330 199662 200340 201755 203537 205017
53818 205017 206117 207298 208817 210571 212520 214718 216998 219167 221491 224492 228196 232081 235839 239702
53804 239702 243858 248028 251863 255416 258986 262741 266740 271046 275556 279881 283693 287043 290107 292762
53790 292762 294715 296044 297276 298788 300341 301377 301687 301552 301216 300456 298852 296334 293238 289811 285910
53775 285910 281267 275926 270254 264654 259357 254416 249789 245467 241631 238569 236315 234452 232457 230190
$$ packed form
53882C06651p626o899o012n037m221l892m035m174l808k962k217k167k871l784
53868B46946m245m054l574l201k966k731k584k702k948k967k612j973j138l66
53854B08885k33r67j746j509m70O8l43o51m0O98M31n36r82n80n0J13O1j27n49
53835B01473q74n30L31Q43N24k41q55j070q30k15L42M32L32O78J415J782J480
53818B05017J100J181J519J754J949K198K280K169K324L001L704L885L758L863
53804B39702M156M170L835L553L570L755L999M306M510M325L812L350L064K655
53790B92762J953J329J232J512J553J036L10j35l36p60j604k518l096l427l901
53775B85910m643n341n672n600n297m941m627m322l836l062k254j863j995k267
$$ plain form
53761 230190 227887 225689 223363 220606 217457 214291 211439 208950 206725 204765 203199 202120 201503 201269 201307
53746 201307 201424 201400 201186 200913 200673 200450 200307 200399 200600 200456 199838 199417 199947 201165 201968 201845 201596 202330 204109
53727 204109 205983 207128 207610 208101 209172 210928 213163 215686 218376 220885 222612 223293 223520 224151 225253
53712 225253 226152 226639 227473 229359 231913 234135 235488 236148 236559 237325 239152 242208 245685 248620 251043 253747
53696 253747 257005 260252 263094 265873 268906 271805 273967 275408 276631 277974 279498 281308 283436 285326
53682 285326 285815 283961 279950 275199 271466 269672 269444 269686 269542 268765 267415 265636 263740 262130 260931
53667 260931 259875 258757 257847 257595 258039 258709 259153 259393 259787 260451 260863 260143 257926 255005 252927 252763 254294
53650 254294 256343 257769 258077 257401 256280 255437 255453 256450 258097 259949 261709 263243 264616 266139 268172 270688
$$ packed form
53761B30190k303k198k326k757l149l166k852k489k225j960j566j079o17k34L8
53746B01307J17k4k14k73k40k23j43R2K01j44o18m21N30J218Q03j23k49P34J779
53727B04109J874J145M82M91J071J756K235K523K690K509J727O81K27O31J102
53712B25253Q99M87Q34J886K554K222J353O60M11P66J827L056L477K935K423K704
53696B53747L258L247K842K779L033K899K162J441J223J343J524J810K128J890
53682B85326M89j854m011m751l733j794k28K42j44p77j350j779j896j610j199
53667B60931j056j118r10k52M44O70M44K40L94O64M12p20k217k921k078j64J531
53650B54294K049J426L08o76j121q43J6R97J647J852J760J534J373J523K033K516
$$ plain form
53634 270688 273164 275136 276738 278508 280713 283120 285401 287461 289292 290862 292358 294280 296992 300268
53620 300268 303546 306546 309443 312572 316249 320775 326223 332199 338164 344018 350105 356582 363065 368978
53606 368978 373967 377891 380766 382830 384429 385689 386579 387297 388226 389337 390058 390012 389485 388821 387728 385693
53590 385693 382863 380006 377630 375534 373253 370704 368316 366659 365835 365243 364196 362860 362103 362137 361902 360357
53574 360357 357952 356028 354996 354004 352450 350946 350444 351058 352139 353028 353351 352935 351902 350678 349682 349109
53558 349109 349053 349479 350014 350199 350181 350708 352153 353945 355321 356228 357023 357651 357768 357560 357841 359262 361799 365050
53540 365050 368619 372158 375438 378608 382161 386502 391672 397491 403755 410266 416936 423967 431691 440136
53526 440136 449047 458424 468710 480100 491977 503511 514778 526797 540352 555149 570312 585356
$$ packed form
53634B70688K476J972J602J770K205K407K281K060J831J570J496J922K712L276
53620C00268L278L000K897L129L677M526N448N976N965N854O087O477O483N913
53606C68978M989L924K875K064J599J260Q90P18R29J111P21m6n27o64j093k035
53590C85693k830k857k376k096k281k549k388j657q24n92j047j336p57L4k35j545
53574C60357k405j924j032r92j554j504n02O14J081Q89L23m16j033j224r96n73
53558C49109n6M26N35J85j8N27J445J792J376R07P95O28J17k08K81J421K537L251
53540C65050L569L539L280L170L553M341N170N819O264O511O670P031P724Q445
53526D40136Q911R377J0286J1390J1877J1534J1267J2019J3555J4797J5163J5044
$$ plain form
53514 585356 600385 615739 631884 649476 668938 689931 711622 733556 755825 778386 800769
53503 800769 822732 844674 866953 889188 910681 931195 950773 969165 986096 1002010 1017820
53492 1017820 1033856 1049690 1065069 1080398 1096016 1111586 1126505 1140579 1154024 1167291 1181103
53481 1181103 1196117 1212037 1227477 1241235 1253488 1265241 1276799 1287258 1295436 1300848 1303780 1304772
53469 1304772 1304053 1301271 1295822 1287644 1277548 1266520 1254839 1242185 1228344 1213447 1197721 1181501
53457 1181501 1165345 1149579 1133706 1116800 1098575 1079647 1060721 1042068 1023865 1006412 989681
53446 989681 973191 956725 940766 925834 911798 898373 886034 875817 868269 863045 859474 857091
53434 857091 855599 854833 854942 856264 858814 862149 865912 870369 876225 883956 893322 903475 913638 923851
$$ packed form
53514E85356J5029J5354J6145J7592J9462K0993K1691K1934K2269K2561K2383
53503H00769K1963K1942K2279K2235K1493K0514J9578J8392J6931J5914J5810
53492A017820J6036J5834J5379J5329J5618J5570J4919J4074J3445J3267J3812
53481A181103J5014J5920J5440J3758J2253J1753J1558J0459Q178N412K932R92
53469A304772p19k782n449q178j0096j1028j1681j2654j3841j4897j5726j6220
53457A181501j6156j5766j5873j6906j8225j8928j8926j8653j8203j7453j6731
53446I89681j6490j6466j5959j4932j4036j3425j2339j0217p548n224l571k383
53434H57091j492p66J09J322K550L335L763M457N856P731R366J0153J0163J0213
$$ plain form
53420 923851 934985 947818 962220 977561 993726 1011201 1030171 1050204 1071090 1093393 1117646
53409 1117646 1143452 1170025 1197380 1226344 1257474 1290615 1325489 1362059 1400194 1439622 1480500
53398 1480500 1523423 1568503 1614950 1662035 1709967 1759183 1809127 1858499 1906701 1954345 2002159
53387 2002159 2049926 2096772 2142102 2185924 2228424 2269518 2308778 2345680 2379910 2411292 2439333
53376 2439333 2463045 2481612 2495164 2504508 2510074 2511523 2508375 2500460 2487508 2468875 2444149 2413806
53364 2413806 2378832 2339925 2297421 2251771 2203677 2153838 2102971 2051955 2001519 1951837 1902786
53353 1902786 1854554 1807636 1762321 1718648 1676835 1637167 1599350 1562497 1525993 1489966 1454748
53342 1454748 1420500 1387734 1357552 1330644 1306284 1283060 1260548 1239684 1221489 1206096 1193099
$$ packed form
53420I23851J1134J2833J4402J5341J6165J7475J8970K0033K0886K2303K4253
53409A117646K5806K6573K7355K8964L1130L3141L4874L6570L8135L9428M0878
53398A480500M2923M5080M6447M7085M7932M9216M9944M9372M8202M7644M7814
53387B002159M7767M6846M5330M3822M2500M1094L9260L6902L4230L1382K8041
53376B439333K3712J8567J3552R344N566J449l148p915j2952j8633k4726l0343
53364B413806l4974l8907m2504m5650m8094m9839n0867n1016n0436m9682m9051
53353A902786m8232m6918m5315m3673m1813l9668l7817l6853l6504l6027l5218
53342A454748l4248l2766l0182k6908k4360k3224k2512k0864j8195j5393j2997
$$ plain form
53331 1193099 1182134 1172696 1163908 1155046 1146094 1137386 1128833 1119946 1110450 1100481 1090287 1080176 1070785
53318 1070785 1062805 1056195 1050029 1043532 1037093 1031929 1028835 1027530 1027214 1027442 1028339 1030216 1033186 1037131 1041899
53303 1041899 1047517 1054288 1062618 1072681 1084267 1097059 1111074 1126700 1144189 1163280 1183508 1204835
53291 1204835 1227646 1252059 1277493 1303114 1328460 1353319 1377205 1399384 1419441 1437410 1453249
53280 1453249 1466569 1477066 1484889 1490302 1493212 1493265 1490207 1483913 1474334 1461733 1446758 1429922 1411168
53267 1411168 1390306 1367718 1344127 1319717 1294089 1267185 1239713 1212418 1185394 1158406 1131492
53256 1131492 1104844 1078415 1052112 1026196 1001029 976527 952249 928021 904077 880606 857557
53245 857557 835012 813393 793040 773802 755183 736776 718504 700693 684094 669588 657510
$$ packed form
53331A193099j0965r438q788q862q952q708q553q887r496r969j0194j0111r391
53318A070785p980o610o166o497o439n164l094j305l16K28Q97J877K970L945M768
53303A041899N618O771Q330J0063J1586J2792J4015J5626J7489J9091K0228K1327
53291A204835K2811K4413K5434K5621K5346K4859K3886K2179K0057J7969J5839
53280A453249J3320J0497P823N413K910N3l058o294r579j2601j4975j6836j8754
53267A411168k0862k2588k3591k4410k5628k6904k7472k7295k7024k6988k6914
53256A131492k6648k6429k6303k5916k5167k4502k4278k4228k3944k3471k3049
53245H57557k2545k1619k0353j9238j8619j8407j8272j7811j6599j4506j2078
$$ plain form
53234 657510 647255 637754 628404 619458 611483 604612 598404 592392 586582 581213 575996 569758 561176 549999
53220 549999 537414 525042 513618 502738 491779 480766 470237 460430 450879 440964 430763 421156
53208 421156 412963 406148 400075 394395 389281 384734 380162 375026 369542 364264 359135 353507 347072 340211
53194 340211 333346 326554 320057 314439 309905 305822 301632 297824 295248 293618 291586 288385 284707 281659
53180 281659 279491 277689 275741 273323 270186 266475 262972 260485 259057 258077 257001 255607 253761 251466
53166 251466 249141 247437 246688 246828 247688 248950 249889 249774 248709 247597 246997 246456 245290 243658 242367 241836
53150 241836 241718 241525 241197 240939 240839 240883 241139 241649 242187 242339 241912 241091 240168 239293 238627 238556 239349 240602 241382
53131 241382 241129 240131 238955 237736 236410 235325 235062 235681 236653 237598 238599 239757 240886 241934 243170 244621
$$ packed form
53234F57510j0255r501r350q946p975o871o208o012n810n369n217o238q582j1177
53220E49999j2585j2372j1424j0880j0959j1013j0529r807r551r915j0201r607
53208D21156q193o815o073n680n114m547m572n136n484n278n129n628o435o861
53194C40211o865o792o497n618m534m083m190l808k576j630k032l201l678l048
53180B81659k168j802j948k418l137l711l503k487j428r80j076j394j846k295
53166B51466k325j704p49J40Q60J262R39j15j065j112o00n41j166j632j291n31
53150B41836j18j93l28k58j00M4K56N10N38J52m27q21r23q75o66p1P93J253P80
53131B41382k53r98j176j219j326j085k63O19R72R45J001J158J129J048J236J451
$$ plain form
53115 244621 245689 245820 245334 245126 245605 246365 246892 247163 247473 247943 248382 248422 247716 246184 244183 242315 240949
53098 240949 240029 239368 238944 238787 238701 238305 237357 235917 234276 232820 231954 231912 232510 233173 233390 233160 232929 233136
53080 233136 233847 234782 235565 235939 235887 235633 235434 235386 235464 235679 235990 236112 235726 234933 234184 233600 232693 231037 228901
53061 228901 226872 225149 223633 222494 222017 221899 221365 220158 218987 218673 219203 219907 220285 220363 220412 220597 220899
53044 220899 221259 221803 222833 224364 225764 226218 225588 224432 223133 221541 219662 218168 217736 218279 219284 220599
53028 220599 222336 224199 225500 225885 225609 225097 224624 224437 224759 225520 226383 227106 227659 227984 227966 227711 227561 227690
53010 227690 227927 228046 228018 227905 227783 227913 228699 230212 231936 233146 233495 233144 232524 232129 232325 233065 233842 234174
52992 234174 234125 234154 234468 234768 234721 234430 234255 234329 234499 234669 234934 235338 235773 236235 236969 238200 239854 241738 243823
$$ packed form
53115B44621J068J31m86k08M79P60N27K71L10M70M39M0p06j532k001j868j366
53098B40949r20o61m24j57q6l96r48j440j641j456q66m2N98O63K17k30k31K07
53080B33136P11R35P83L74n2k54j99m8P8K15L11J22l86p93p49n84r07j656k136
53061B28901k029j723j516j139m77j18n34j207j171l14N30P04L78P8M9J85L02
53044B20899L60N44J030J531J400M54o30j156j299j592j879j494m32N43J005J315
53028B20599J737J863J301L85k76n12m73j87L22P61Q63P23N53L25j8k55j50J29
53010B27690K37J19k8j13j22J30P86J513J724J210L49l51o20l95J96P40P77L32
52992B34174m9K9L14L00m7k91j75P4J70J70K65M04M35M62P34J231J654J884K085
$$ plain form
52973 243823 246125 248412 250315 251657 252450 252712 252614 252701 253451 254532 254981 254327 253200 252603 252915 253806 254776
52956 254776 255453 255704 255820 256313 257162 257511 256514 254277 251546 248754 245922 243302 241392 240210 239206 238078
52940 238078 237215 237100 237661 238498 239400 240285 240904 240898 240086 238512 236376 234124 232433 231840 232316 233283 233994 233961
52922 233961 233173 231952 230611 229243 228039 227528 228119 229395 230355 230540 230489 230816 231288 231259 230659 229966 229337 228386
52904 228386 226919 225382 224350 223942 223964 224331 225014 225714 225972 225641 225095 224874 225204 225925 226783 227730 228841 230013
52886 230013 230929 231475 232020 233005 234228 234915 234646 233930 233595 233845 234236 234411 234393 234270 234103 234274 235365 237407
52868 237407 239670 241596 243570 246250 249386 251943 253402 254419 256024 258575 261538 263927 264820 263894 261733
52853 261733 259377 257345 255309 252781 249725 246338 242689 238954 235635 233049 230849 228507 226099 224153
$$ packed form
52973B43823K302K287J903J342P93K62r8Q7P50J081M49o54j127n97L12Q91R70
52956B54776O77K51J16M93Q49L49r97k237k731k792k832k620j910j182j004j128
52940B38078q63j15N61Q37R02Q85O19oq12j574k136k252j691n93M76R67P11l3
52922B33961p88j221j341j368j204n11N91J276R60J85n1L27M72k9o00o93o29r51
52904B28386j467j537j032m08K2L67O83P00K58l31n46k21L30P21Q58R47J111J172
52886B30013R16N46N45R85J223O87k69p16l35K50L91J75j8j23j67J71J091K042
52868B37407K263J926J974K680L136K557J459J017J605K551K963K389Q93r26k161
52853B61733k356k032k036k528l056l387l649l735l319k586k200k342k408j946
$$ plain form
52839 224153 222799 221648 220501 219616 219089 218460 217323 215986 215097 214755 214477 214091 214198 215416 217358 218829
52823 218829 219087 218541 217994 217611 217063 216429 216277 216756 217231 217116 216666 216556 217044 217910 218944 220063 221137 222137
52805 222137 223303 224787 226215 227025 227139 226898 226394 225346 223719 221983 220617 219659 218953 218502 218338 218210
52789 218210 217722 216736 215546 214643 214331 214507 214764 214739 214375 213877 213516 213556 214209 215485 217058 218425 219215 219364
52771 219364 219086 218698 218348 217894 217154 216268 215609 215341 215335 215479 215739 215872 215544 214895 214488 214521 214584 214482 214693 215588
52751 215588 216720 217425 217639 217624 217449 217422 218415 220812 223498 224976 225308 225897 227428 229165 230470 231800 233684
52734 233684 235618 236743 237046 237302 238106 239399 240643 241188 240742 239660 238564 237664 236809 236136 236034 236422 236665
52717 236665 236419 235940 235402 234513 233091 231461 230028 228948 228420 228661 229370 229792 229566 228946 228113 227085 226477
$$ packed form
52839B24153j354j151j147q85n27o29j137j337q89l42k78l86J07J218J942J471
52823B18829K58n46n47l83n48o34j52M79M75j15m50j10M88Q66J034J119J074J000
52805B22137J166J484J428Q10J14k41n04j048j627j736j366r58p06m51j64j28
52789B18210m88r86j190r03l12J76K57k5l64m98l61M0O53J276J573J367P90J49
52771B19364k78l88l50m54p40q86o59k68oJ44K60J33l28o49m07L3O3j02K11Q95
52751B15588J132P05K14j5j75k7R93K397K686J478L32N89J531J737J305J330J884
52734B33684J934J125L03K56Q04J293J244N45m46j082j096r00q55o73j02L88K43
52717B36665k46m79n38q89j422j630j433j080n28K41P09M22k26o20q33j028o08
$$ plain form
52700 226477 227283 229399 231247 231552 230792 230263 230508 231361 232687 234110 234655 233728 232117 231181 231376 232351 233963
52683 233963 236180 238312 239486 239797 240053 240441 240355 239508 238300 237037 235669 234392 233692 233635 233764 233821 233872 233760
52665 233760 233170 232345 231938 231990 231834 231242 230916 231535 232973 234764 236732 238813 240854 242924 245290 247759
52649 247759 249612 250499 250853 251016 250541 248901 246469 244149 242293 240542 238631 236918 236081 236518 238008 239777
52633 239777 241034 241598 241914 242443 243290 244396 245675 246856 247666 248379 249670 251537 252850 252495 250683 248537
52617 248537 246646 244668 242390 240495 239976 241100 243198 245277 246623 247079 247023 247060 247537 248270 248821 249024 249135
52600 249135 249468 250060 250751 251421 251917 251937 251316 250428 249947 250102 250487 250702 250765 250718 250327 249629 249371 250297 252193
52581 252193 254147 255624 256687 257290 257142 256439 256068 256653 257773 258454 258201 257282 256234 255394 254828 254458 254200
$$ packed form
52700B26477Q06K116J848L05p60n29K45Q53J326J423N45r27j611r36J95R75J612
52683B33963K217K132J174L11K56L88q6q47j208j263j368j277p00n7J29N7N1j12
52665B33760n90q25m07N2j56n92l26O19J438J791J968K081K041K070K366K469
52649B47759J853Q87L54J63m75j640k432k320j856j751j911j713q37M37J490J769
52633B39777J257N64L16N29Q47J106J279J181Q10P13J291J867J313l55j812k146
52617B48537j891j978k278j895n19J124K098K079J346M56n6L7M77P33N51K03J11
52600B49135L33N92O91O70M96K0o21q88m81J55L85K15O3m7l91o98k58R26J896
52581B52193J954J477J063O03j48p03l71N85J120O81k53r19j048q40n66l70k58
$$ plain form
52564 254200 253998 253765 253471 253318 253592 254135 254287 253664 252689 251854 250791 248812 246241 244369 243928 244358 244855
52547 244855 245376 246194 247105 247659 247795 247703 247352 246642 245803 245215 245006 245137 245635 246396 247010 247227 247446 248309 249894
52528 249894 251677 253178 254314 255181 255888 256637 257591 258562 259071 258877 258351 258240 259084 260844 262979 264833 266051
52511 266051 266787 267669 269517 272788 277055 281192 284325 286511 288262 289661 290343 290129 289072 286963 283522
52496 283522 279231 275307 272497 270397 268231 265767 263180 260629 258488 257489 257983 259361 260684 261620 262293
52481 262293 262587 262211 261217 259853 258153 256302 255196 255838 258070 260542 262113 262767 263078 263326 263463 263562 264033
52464 264033 265472 268289 272213 276245 279515 282214 285249 288910 292359 294596 295445 295280 294195 291906 288366
52449 288366 284088 279833 276093 272830 269584 265954 262060 258453 255541 253265 251492 250473 250619 251806
$$ packed form
52564B54200k02k33k94j53K74N43J52o23r75q35j063j979k571j872m41M30M97
52547B44855N21Q18R11N54J36r2l51p10q39n88k09J31M98P61O14K17K19Q63J585
52528B49894J783J501J136Q67P07P49R54R71N09j94n26j11Q44J760K135J854J218
52511B66051P36Q82J848L271M267M137L133K186J751J399O82k14j057k109l441
52496B83522m291l924k810k100k166k464k587k551k141r99M94J378J323R36O73
52481B62293K94l76r94j364j700j851j106O42K232K472J571O54L11K48J37R9M71
52464B64033J439K817L924M032L270K699L035L661L449K237Q49j65j085k289l540
52449B88366m278m255l740l263l246l630l894l607k912k276j773j019J46J187
$$ plain form
52435 251806 253155 253670 253068 251929 251016 250532 250101 249401 248642 248332 248716 249586 250576 251451 252180 252856 253571 254280
52417 254280 254865 255417 256354 258042 260349 262847 265498 268885 273563 279344 285521 291810 298825 307321 317049
52402 317049 326620 334608 340481 344250 345608 344077 339972 334536 328761 322505 315217 307171 299493 293120
52388 293120 288263 284822 282764 281944 281866 281922 281769 281478 281434 282066 283468 285252 286955 288579 290568 293259 296534
52371 296534 299985 303307 306567 310253 314919 320563 326376 331359 335096 337719 339276 339595 338763 337308 335712
52356 335712 334082 332450 331073 330227 329926 330053 330554 331317 332061 332664 333449 334896 337116 339862 342996 346670
52340 346670 351026 355958 361292 366993 373033 379245 385564 392364 400201 409099 418437 427822 437909 449850
52326 449850 463990 479563 495833 512975 531434 550883 570479 589996 609985 630672 651276
$$ packed form
52435B51806J349N15o02j139r13m84m31p00p59l10L84Q70R90Q75P29O76P15P09
52417B54280N85N52R37J688K307K498K651L387M678N781O177O289P015Q496R728
52402C17049R571P988N873L769J358j531m105n436n775o256p288q046p678o373
52388B93120m857l441k058q20p8N6j53k91m4O32J402J784J703J624J989K691L275
52371B96534L451L322L260L686M666N644N813M983L737K623J557L19q32j455j596
52356C35712j630j632j377q46l01J27N01P63P44O03P85J447K220K746L134L674
52340C46670M356M932N334N701O040O212O319O800P837Q898R338R385J0087J1941
52326D49850J4140J5573J6270J7142J8459J9449J9596J9517J9989K0687K0604
$$ plain form
52315 651276 670744 688767 705714 721903 737412 752434 767340 782263 796909 810847 823789
52304 823789 835511 845843 854904 863151 870979 878384 885220 891631 897874 903746 908569 911800 913298 912831
52290 912831 909843 904133 896448 887856 878672 868564 857631 846669 836320 826652 817885 810831 806113
52277 806113 803456 802405 803370 807194 813839 822178 831146 840552 850694 861729 873603 886123 898848
52264 898848 911234 923118 934808 946551 958146 969266 979879 990136 1000058 1009610 1018864 1027825
52252 1027825 1036113 1043141 1048615 1052658 1055356 1056392 1055251 1051665 1045654 1037181 1026051 1012295 996421
52239 996421 979114 960845 942004 923164 904770 886677 868562 850829 834493 819925 806339
52228 806339 792951 780050 768353 757750 747498 737447 728304 720708 714735 710339 707580 706203 705590
$$ packed form
52315F51276J9468J8023J6947J6189J5509J5022J4906J4923J4646J3938J2942
52304H23789J1722J0332R061Q247P828P405O836O411O243N872M823L231J498m67
52290I12831k988n710p685q592r184j0108j0933j0962j0349r668q767p054m718
52277H06113k657j051R65L824O645Q339Q968R406J0142J1035J1874J2520J2725
52264H98848J2386J1884J1690J1743J1595J1120J0613J0257R922R552R254Q961
52252A027825Q288P028N474M043K698J036j141l586o011q473j1130j3756j5874
52239I96421j7307j8269j8841j8840j8394j8093j8115j7733j6336j4568j3586
52228H06339j3388j2901j1697j0603j0252j0051r143p596n973m396k759j377o13
$$ plain form
52215 705590 705391 705733 706615 707619 708515 709713 711727 714505 717608 720737 723743 726392 728527 730317 732058
52200 732058 733849 735712 737856 740498 743474 746325 748796 751085 753621 756711 760349 764243 768036 771614
52186 771614 775122 778660 782035 784858 786731 787341 786559 784540 781497 777266 771358 763723 755306 747488 740971
52171 740971 735472 730448 725797 721703 718192 715266 713413 713465 715682 719249 723090 727061 731902 738012 744771
52156 744771 751252 757126 762494 767238 771022 773730 775471 776315 776516 776787 777814 779492 781182 782748 784755
52141 784755 787572 790822 793978 797043 800374 804229 808792 814338 821061 828911 837819 847919 859401 872325
52127 872325 886732 902751 920541 940295 962317 986818 1013592 1042127 1072030 1102983 1134348
52116 1134348 1165256 1195147 1223796 1250831 1275720 1298274 1318549 1336189 1350553 1361660 1370205
$$ packed form
52215G05590j99L42Q82J004Q96J198K014K778L103L129L006K649K135J790J741
52200G32058J791J863K144K642K976K851K471K289K536L090L638L894L793L578
52186G71614L508L538L375K823J873O10p82k019l043m231n908p635q417p818o517
52171G40971n499n024m651m094l511k926j853N2K217L567L841L971M841O110O759
52156G44771O481N874N368M744L784K708J741Q44K01K71J027J678J690J566K007
52141G84755K817L250L156L065L331L855M563N546O723P850Q908J0100J1482J2924
52127H72325J4407J6019J7790J9754K2022K4501K6774K8535K9903L0953L1365
52116A134348L0908K9891K8649K7035K4889K2554K0275J7640J4364J1107Q545
$$ plain form
52105 1370205 1376299 1379092 1378196 1374692 1369903 1363896 1356095 1346877 1337482 1328553 1319774 1310858 1301922 1292790
52091 1292790 1282831 1271731 1259683 1246586 1231722 1214577 1195580 1175817 1156503 1138781 1123451
52080 1123451 1110533 1099560 1090517 1084074 1080660 1079829 1080897 1083760 1088686 1095691 1104573 1115289 1127769
52067 1127769 1141487 1155693 1170104 1185010 1200647 1216635 1232114 1246264 1258690 1269415 1278574
52056 1278574 1286146 1292072 1296665 1300659 1304687 1308686 1311872 1313215 1312014 1308255 1302551 1295523 1287044 1276149
52042 1276149 1261863 1244101 1223695 1201687 1178711 1154979 1130684 1106424 1083302 1062451 1044310
52031 1044310 1028405 1014009 1000926 989418 979445 970291 961106 951535 941640 931426 920868 910317
52019 910317 900412 891313 882330 872711 862719 853561 846218 840590 835778 830903 825546 819753 813855 808074
$$ packed form
52105A370205O094K793q96l504m789o007p801r218r395q929q779q916q936r132
52091A292790r959j1100j2048j3097j4864j7145j8997j9763j9314j7722j5330
52080A123451j2918j0973r043o443l414q31J068K863M926P005Q882J0716J2480
52067A127769J3718J4206J4411J4906J5637J5988J5479J4150J2426J0725R159
52056A278574P572N926M593L994M028L999L186J343j201l759n704p028q479j0895
52042A276149j4286j7762k0406k2008k2976k3732k4295k4260k3122k0851j8141
52031A044310j5905j4396j3083j1508r973r154r185r571r895j0214j0558j0551
52019I10317r905r099q983r619r992r158p343n628m812m875n357n793n898n781
$$ plain form
52005 808074 802124 795384 787642 779379 771019 762185 752150 740970 729666 719233 709803 700931 692349
51992 692349 684279 677210 671591 667585 664930 663035 661228 658876 655408 650580 644793 638852 633127 627107
51978 627107 619955 611302 601320 590194 578047 565412 553332 542664 533400 525016 517435 511349 507468
51965 507468 505726 505464 506270 508392 512286 518053 525387 533860 543038 552318 560830 567614 571974 573760 573318
51950 573318 571069 567148 561514 554364 546328 538292 531199 525913 522973 522366 523815 527369 533420 542044
51936 542044 552631 564451 577278 591112 605472 619344 631787 642303 650680 656862 661032 663588
51924 663588 664816 664645 662785 659104 654040 648681 644170 640791 637687 633616 627775 619695 608671 593955
51910 593955 575693 555387 535235 517063 501770 489495 480087 473477 469693 468674 470278 474442 481007
$$ packed form
52005H08074n950o740p742q263q360q834j0035j1180j1304j0433r430q872q582
51992F92349q070p069n619m006k655j895j807k352l468m828n787n941n725o020
51978F27107p152q653r982j1126j2147j2635j2080j0668r264q384p581o086l881
51965E07468j742k62Q06K122L894N767P334Q473R178R280Q512O784M360J786m42
51950E73318k249l921n634p150q036q036p093n286k940o07J449L554O051Q624
51936E42044J0587J1820J2827J3834J4360J3872J2443J0516Q377O182M170K556
51924F63588J228j71j860l681n064n359m511l379l104m071n841q080j1024j4716
51910E93955j8262k0306k0152j8172j5293j2275r408o610l784j019J604M164O565
$$ plain form
51897 481007 489193 497553 504838 510717 515327 518290 518623 515632 509538 501209 491501 480804 469059 456393
51883 456393 443949 433656 426662 422229 418871 416384 415957 418266 422491 427565 433558 441168 450381 460358
51869 460358 470316 479834 488378 495164 499627 501691 501512 499247 495119 489546 483113 476471 470199 464689
51855 464689 460232 457222 456110 457114 460101 464723 470362 475944 480247 482660 483364 482573 479982 475275 468796
51840 468796 461283 453170 444637 436229 428817 422775 417631 412752 408166 404503 402249 401260 401001 401140 401734
51825 401734 402869 404257 405378 405860 405509 404080 401470 398152 394943 392096 389066 385490 382022 379742 379010
51810 379010 379370 380429 382292 385103 388596 392228 395490 398088 400067 401793 403539 405061 405764 405220 403356
51795 403356 400266 396225 391885 388026 384971 382458 380161 378106 376564 375769 375788 376414 377162 377644 378045 378937
$$ packed form
51897D81007Q186Q360P285N879M610K963L33k991o094q329r708j0697j1745j2666
51883D56393j2444j0293o994m433l358k487m27K309M225N074N993P610R213R977
51869D60358R958R518Q544O786M463K064j79k265m128n573o433o642o272n510
51855D64689m457l010j112J004K987M622N639N582M303K413P04p91k591m707o479
51840D68796p513q113q533q408p412o042n144m879m586l663k254r89k59J39N94
51825D01734J135J388J121M82l51j429k610l318l209k847l030l576l468k280p32
51810C79010L60J059J863K811L493L632L262K598J979J726J746J522P03n44j864
51795D03356l090m041m340l859l055k513k297k055j542p95J9O26P48M82M01Q92
$$ plain form
51779 378937 380557 382460 384002 384908 385321 385562 385992 386875 388270 390251 393237 397729 403691 410644 418594
51764 418594 428365 440532 454353 468204 480867 491908 501072 507992 512500 514537 513598 508857 500191
51751 500191 488715 475976 462948 450063 437787 426596 416572 407592 399877 393971 390104 387959
51739 387959 387163 387678 389586 392808 397204 402699 409170 416405 424298 432764 441270 448728 454171 457452 459094
51724 459094 459690 459679 459503 459504 459615 459357 458170 455624 451504 446042 440011 434307 429391 425296 421969 419180
51708 419180 416245 412402 407653 402830 398767 395852 394495 395381 398720 403544 408240 411729 413931 415338
51694 415338 416493 417691 418810 419517 419852 420415 421647 423151 424115 424241 423770 422748 420903 418304 415539 412957
51678 412957 410279 407315 404676 403236 403100 403650 404614 406567 410105 414882 419940 424918 430531 437605 445926
$$ packed form
51779C78937J620J903J542R06M13K41M30Q83J395J981K986M492N962O953P950
51764D18594R771J2167J3821J3851J2663J1041R164O920M508K037r39m741q666
51751E00191j1476j2739j3028j2885j2276j1191j0024q980p715n906l867k145
51739C87959p96N15J908L222M396N495O471P235P893Q466Q506P458N443L281J642
51724D59094N96j1j76JJ11k58j187k546m120n462o031n704m916m095l327k789
51708D19180k935l843m749m823m063k915j357Q86L339M824M696L489K202J407
51694D15338J155J198J119P07L35N63J232J504R64J26m71j022j845k599k765k582
51678D12957k678k964k639j440j36N50R64J953L538M777N058M978N613P074Q321
$$ plain form
51663 445926 454363 462051 468997 475461 481076 484878 486015 484248 480035 474487 469102 465077 462798 462119
51649 462119 462960 465245 468262 470602 470973 468915 464682 458751 451578 443542 434879 425796 416745 408359 400953
51634 400953 394324 388268 383110 379461 377565 377112 377561 378438 379403 380351 381468 382983 384825 386634 388075
51619 388075 388990 389291 388992 388353 387723 387064 385808 383396 379920 376120 372772 370202 368327 366950 365849 364710
51603 364710 363259 361626 360438 360317 361340 363210 365996 370343 376757 384977 394287 404179 414238 423524
51589 423524 430653 434713 435659 433728 429031 422120 414520 408008 403436 400610 399243 399477 401545 405475 411281
51574 411281 419009 428448 439224 451385 465482 481815 499974 519363 539707 560636 581274 600933
51562 600933 620070 639995 661657 685188 710539 738030 768273 802006 839832 881271 923824
$$ packed form
51663D45926Q437P688O946O464N615L802J137j767m213n548n385m025k279o79
51649D62119Q41K285L017K340L71k058m233n931p173q036q663r083r051q386p406
51634D00953o629o056n158l649j896m53M49Q77R65R48J117J515J842J809J441
51619C88075R15L01k99o39o30o59j256k412l476l800l348k570j875j377j101j139
51603C64710j451j633j188j21J023J870K786M347O414Q220R310R892J0059R286
51589D23524P129M060R46j931m697o911p600o512m572k826j367K34K068L930N806
51574D11281P728R439J0776J2161J4097J6333J8159J9389K0344K0929K0638J9659
51562F00933J9137J9925K1662K3531K5351K7491L0243L3733L7826M1439M2553
$$ plain form
51551 923824 963616 997344 1023338 1040771 1048746 1046742 1035280 1015426 987946 953660 914342 872405
51539 872405 829614 786724 744466 704273 667648 635234 606821 582020 560605 542283 526455
51528 526455 512448 499997 489379 480889 474229 468723 464200 461202 460020 459915 459797 459375 458970 458338 456424
51513 456424 452436 446587 439676 432570 426288 421752 418865 416266 412674 408219 403942 400259 396605 392547
51499 392547 388550 385413 383416 382293 381724 381530 381505 381360 380876 380076 379233 378701 378715 379325 380446 381781 382701
51482 382701 382543 381268 379586 378120 376594 374261 371020 367590 364543 361676 358552 355202 351963 349000
51468 349000 346426 344602 343815 343722 343570 342978 342177 341497 340999 340617 340313 340027 339833 340216 341733 344200 346625
51451 346625 348228 349242 350418 352138 354372 357157 360541 364290 368342 373501 381024 391261 403159 415233
$$ packed form
51551I23824L9792L3728K5994J7433P975k004j1462j9854k7480l4286l9318m1937
51539H72405m2791m2890m2258m0193l6625l2414k8413k4801k1415j8322j5828
51528E26455j4007j2451j0618q490o660n506m523k998j182j05j18m22m05o32j914
51513D56424l988n849o911p106o282m536k887k599l592m455m277l683l654m058
51499C92547l997l137j997j123n69j94k5j45m84q00q43n32J4O10J121J335R20
51482C82701j58j275j682j466j526k333l241l430l047k867l124l350l239k963
51468C49000k574j824p87r3j52n92q01o80m98l82l04k86j94L83J517K467K425
51451C46625J603J014J176J720K234K785L384L749M052N159P523J0237J1898J2074
$$ plain form
51437 415233 426497 436273 443770 448523 451026 452304 452889 452584 451170 448844 445838 441933 436680 430064
51423 430064 422847 416206 410992 407280 404675 402984 402372 402818 403757 404550 405092 405645 406211 406427 406108 405522 405059
51406 405059 404903 405084 405535 405927 405700 404581 403066 402186 402703 404496 406686 408384 409412 410415 412318 415743
51390 415743 420943 428044 437059 447670 459252 471391 484370 499157 516939 538697 565151 596885
51378 596885 634255 677092 724706 776476 832293 891918 953707 1014401 1070468 1119375 1159404
51367 1159404 1188784 1205819 1209814 1201264 1181134 1150506 1110975 1064695 1013664 959347 903204 847084
51355 847084 792654 740838 692202 647604 607944 573427 543500 517500 495017 475725 459282
51344 459282 445439 433964 424406 416184 408869 402151 395647 389133 382966 377842 373951 370736 367652 364789
$$ packed form
51437D15233J1264R776P497M753K503J278N85l05j414k326l006l905n253o616
51423D30064p217o641n214l712k605j691o12M46R39P93N42N53N66K16l19n86m63
51406D05059j56J81M51L92k27j119j515q80N17J793K190J698J028J003J903L425
51390D15743N200P101R015J0611J1582J2139J2979J4787J7782K1758K6454L1734
51378E96885L7370M2837M7614N1770N5817N9625O1789O0694N6067M8907M0029
51367A159404K9380J7035L995q550k0130l0628l9531m6280n1031n4317n6143n6120
51355H47084n4430n1816m8636m4598l9660l4517k9927k6000k2483j9292j6443
51344D59282j3843j1475r558q222p315o718o504o514o167n124l891l215l084k863
$$ plain form
51330 364789 362484 360635 358813 356871 355045 353497 352168 351131 350713 351075 351944 352932 353969 355269 357027
51315 357027 359322 362143 365247 368059 369997 370941 371282 371462 371574 371391 370661 369389 367862 366278 364343 361550
51299 361550 358037 354830 352751 351308 349321 346532 343903 342202 341134 340226 339739 340007 340485 340400 340055 340602
51283 340602 342558 345323 348219 351235 354600 358304 362369 366974 371906 376323 379483 381463 382881 384156
51269 384156 385309 386231 386891 387335 387614 387604 386993 385782 384778 384999 386514 388360 389822 391130 392492 393128
51253 393128 392016 389277 386094 383366 380971 378290 374872 370579 365641 360712 356530 353335 350848 348784
51239 348784 347151 346071 345587 345598 345751 345480 344492 343121 341875 340723 339288 337662 336501 336192 336432 336828
51223 336828 337469 338628 340251 342010 343654 345106 346464 348086 350334 352946 355012 355922 356131 356577 357566
$$ packed form
51330C64789k305j849j822j942j826j548j329j037m18L62Q69R88J037J300J758
51315C57027K295K821L104K812J938R44L41J80J12j83p30j272j527j584j935k793
51299C61550l513l207k079j443j987k789k629j701j068r08m87K68M78q5l45N47
51283C40602J956K765K896L016L365L704M065M605M932M417L160J980J418J275
51269C84156J153R22O60M44K79j0o11j211j004K21J515J846J462J308J362O36
51253C93128j112k739l183k728k395k681l418m293m938m929m182l195k487k064
51239C48784j633j080m84J1J53k71r88j371j246j152j435j626j161l09K40L96
51223C36828O41J159J623J759J644J452J358J622K248K612K066R10K09M46R89
$$ plain form
51208 357566 358683 359674 360794 362206 363551 364454 365109 366040 367459 369128 370703 371913 372505 372415 371954 371508
51192 371508 370951 369784 368052 366688 366516 367130 367319 366584 365696 365585 366195 366786 366985 367077 367417 368055 368951 370143
51174 370143 371549 372827 373611 373781 373488 372984 372438 371793 370858 369768 369221 369972 371986 374453 376820 379509
51158 379509 383377 388582 394263 399202 402529 403842 403107 400676 397224 393331 389128 384546 379884 375889
51144 375889 373106 371335 369918 368431 366844 365093 362919 360329 357966 356685 356736 357502 358036 357836 357188 356867
51128 356867 357436 358773 360372 362083 364301 367300 370680 373815 376624 379500 382568 385406 387603 389223
51114 389223 390626 392128 393967 396282 398908 401435 403659 405798 408065 410230 411894 413024 413960 414938 415892
51099 415892 416689 417242 417373 416871 415845 414795 414150 413861 413593 413141 412490 411628 410602 409692 409251 409280 409437 409508
$$ packed form
51208C57566J117R91J120J412J345R03O55R31J419J669J575J210N92r0m61m46
51192C71508n57j167j732j364j72O14J89p35q88j11O10N91J99R2L40O38Q96J192
51174C70143J406J278P84J70k93n04n46o45r35j090n47P51K014K467K367K689
51158C79509L868N205N681M939L327J313p35k431l452l893m203m582m662l995
51144C75889k783j771j417j487j587j751k174k590k363j281N1P66N34k00o48l21
51128C56867N69J337J599J711K218K999L380L135K809K876L068K838K197J620
51114C89223J403J502J839K315K626K527K224K139K267K165J664J130R36R78R54
51099D15892P97N53J31n02j026j050o45k89k68m52o51q62j026r10m41K9J57P1
$$ plain form
51081 409508 409602 409756 409708 409339 409054 409334 410097 410922 411791 413092 414903 416807 418553 420412 422682 425330 428476
51064 428476 432800 439008 447159 456906 468231 481511 496980 514373 532943 551528 568913 584584
51052 584584 599009 612899 626465 639778 653379 667687 681972 694718 705111 713386 719545 722572
51040 722572 721324 715629 706148 693806 679854 665914 653174 641653 630653 619713 608674 597108
51028 597108 584323 570021 554684 539369 525345 513695 504885 498699 494762 492913 492924 494266 496552
51015 496552 499904 504438 509648 514817 519861 525237 531220 537879 545565 554667 564858 575359 586068
51002 586068 597654 610252 622797 634107 644049 653138 661531 668998 675508 681062 685170 687176 687162 686053
50988 686053 684740 683542 682472 681610 681142 681420 683163 687251 694136 703624 715217 728335 742230 756144
$$ packed form
51081D09508R4J54m8l69k85K80P63Q25Q69J301J811J904J746J859K270K648L146
51064D28476M324O208Q151R747J1325J3280J5469J7393J8570J8585J7385J5671
51052E84584J4425J3890J3566J3313J3601J4308J4285J2746J0393Q275O159L027
51040G22572j248n695r481j2342j3952j3940j2740j1521j1000j0940j1039j1566
51028E97108j2785j4302j5337j5315j4024j1650q810o186l937j849J1J342K286
51015D96552L352M534N210N169N044N376N983O659P686R102J0191J0501J0709
51002E86068J1586J2598J2545J1310R942R089Q393P467O510N554M108K006j4j109
50988F86053j313j198j070q62m68K78J743M088O885R488J1593J3118J3895J3914
$$ plain form
50974 756144 769914 784119 799471 816356 835223 857044 882859 912990 947203 985618 1028917
50963 1028917 1077441 1130557 1187228 1246884 1309300 1373825 1439234 1504440 1568910 1632176 1693167
50952 1693167 1750239 1801712 1846231 1882877 1911269 1931549 1944028 1948822 1945982 1935971 1919886 1899210
50940 1899210 1875394 1849455 1821675 1791761 1759642 1726158 1692654 1659947 1628006 1596606 1565702
50929 1565702 1535032 1504072 1472995 1443099 1415445 1389186 1362018 1332382 1300606 1267800 1234397
50918 1234397 1200188 1165164 1129753 1094537 1060273 1027962 998369 971443 946614 923640 902851
50907 902851 884567 868589 854283 840952 828151 815874 804457 794131 784761 776229 768867 763075
50895 763075 758549 754400 750215 746585 744275 743168 742361 741198 739928 739382 740239 742574 745933 749693 753368
$$ packed form
50974G56144J3770J4205J5352J6885J8867K1821K5815L0131L4213L8415M3299
50963A028917M8524N3116N6671N9656O2416O4525O5409O5206O4470O3266O0991
50952A693167N7072N1473M4519L6646K8392K0280J2479M794k840j0011j6085k0676
50940A899210k3816k5939k7780k9914l2119l3484l3504l2707l1941l1400l0904
50929A565702l0670l0960l1077k9896k7654k6259k7168k9636l1776l2806l3403
50918A234397l4209l5024l5411l5216l4264l2311k9593k6926k4829k2974k0789
50907I02851j8284j5978j4306j3331j2801j2277j1417j0326r370q532p362n792
50895G63075m526m149m185l630k310j107q07j163j270n46Q57K335L359L760L675
$$ plain form
50880 753368 756699 759684 762704 766501 771687 778227 785619 793636 802554 812570 823332 834402 846013
50867 846013 859001 873998 890957 909575 929972 952792 978639 1007562 1039244 1073741 1111795
50856 1111795 1154211 1201087 1252085 1307468 1368443 1436270 1511443 1594033 1684493 1783603 1891725
50845 1891725 2008474 2133036 2264504 2401976 2544582 2691352 2840689 2989956 3135847
50836 3135847 3275046 3404220 3519514 3616774 3692673 3745501 3774765 3780381 3762644 3722894 3663967
50825 3663967 3589839 3504732 3412416 3316183 3219385 3125660 3038305 2959368 2889428 2828104 2774415
50814 2774415 2726680 2682597 2639741 2596015 2549651 2499182 2443588 2382350 2315269 2242467 2164647
50803 2164647 2083075 1999169 1914318 1830140 1748437 1670591 1597286 1529161 1467314 1412740 1365513
$$ packed form
50880G53368L331K985L020L797N186O540P392Q017Q918J0016J0762J1070J1611
50867H46013J2988J4997J6959J8618K0397K2820K5847K8923L1682L4497L8054
50856A111795M2416M6876N0998N5383O0975O7827P5173Q2590R0460R9110J08122
50845A891725J16749J24562J31468J37472J42606J46770J49337J49267J45891
50836C135847J39199J29174J15294R7260P5899N2828K9264N616j7737l9750n8927
50825C663967p4128q5107r2316r6233r6798r3725q7355p8937o9940o1324n3689
50814B774415m7735m4083m2856m3726m6364n0469n5594o1238o7081p2802p7820
50803B164647q1572q3906q4851q4178q1703p7846p3305o8125o1847n4574m7227
$$ plain form
50792 1365513 1325130 1291409 1264373 1243269 1226536 1213205 1203779 1199228 1199366 1202628 1207209 1211896 1215944
50779 1215944 1218744 1219928 1219514 1217777 1215069 1211795 1208282 1204453 1199747 1193551 1185651 1176212 1165459 1153583
50765 1153583 1140837 1127424 1113208 1097730 1080705 1062467 1043892 1025937 1009287 994279 981003
50754 981003 969433 959566 951484 945316 941185 939266 939885 943461 950242 960062 972440 987134 1004694
50741 1004694 1026363 1053237 1085475 1122374 1163154 1207492 1255426 1307052 1362518 1422100 1485953
50730 1485953 1553725 1624518 1697246 1771093 1845657 1920740 1995964 2070629 2143946 2215213 2283506
50719 2283506 2347246 2404359 2452880 2491160 2517462 2529878 2527022 2508637 2475379 2428427 2369717
50708 2369717 2302336 2230118 2156693 2085084 2017908 1957390 1904918 1860775 1824319 1794286 1769097
$$ packed form
50792A365513m0383l3721k7036k1104j6733j3331r426m551J38L262M581M687M048
50779A215944K800J184m14j737k708l274l513l829m706o196p900r439j0753j1876
50765A153583j2746j3413j4216j5478j7025j8238j8575j7955j6650j5008j3276
50754I81003j1570r867q082o168m131j919O19L576O781R820J2378J4694J7560
50741A004694K1669K6874L2238L6899M0780M4338M7934N1626N5466N9582O3853
50730A485953O7772P0793P2728P3847P4564P5083P5224P4665P3317P1267O8293
50719B283506O3740N7113M8521L8280K6302J2416k856j8385l3258m6952n8710
50708B369717o7381p2218p3425p1609o7176o0518n2472m4143l6456l0033k5189
$$ plain form
50697 1769097 1747335 1728022 1710231 1692484 1672905 1649954 1622741 1590749 1553819 1512572 1468444
50686 1468444 1423090 1377980 1334574 1294328 1258163 1226220 1198433 1175165 1157089 1144766 1138562
50675 1138562 1138599 1144399 1154847 1168939 1186511 1207914 1233158 1261625 1292436 1324590 1356793 1387687
50663 1387687 1416419 1442783 1466784 1488357 1507625 1525100 1541396 1556857 1571562 1585543 1598909
50652 1598909 1611937 1625146 1639092 1653937 1669360 1685148 1701783 1720249 1741214 1764689 1790567
50641 1790567 1819260 1851445 1887211 1925717 1965801 2006709 2048064 2089323 2129660 2168463 2205701
50630 2205701 2241643 2276430 2310147 2343277 2376635 2410359 2442695 2469878 2487485 2492253 2482937 2460031
50618 2460031 2425274 2381587 2332961 2283825 2238257 2199441 2169299 2148151 2134996 2128551 2127880 2131747
$$ packed form
50697A769097k1762j9313j7791j7747j9579k2951k7213l1992l6930m1247m4128
50686A468444m5354m5110m3406m0246l6165l1943k7787k3268j8076j2323o204
50675A138562L7N800J0448J4092J7572K1403K5244K8467L0811L2154L2203L0894
50663A387687K8732K6364K4001K1573J9268J7475J6296J5461J4705J3981J3366
50652A598909J3028J3209J3946J4845J5423J5788J6635J8466K0965K3475K5878
50641A790567K8693L2185L5766L8506M0084M0908M1355M1259M0337L8803L7238
50630B205701L5942L4787L3717L3130L3358L3724L2336K7183J7607M768r316k2906
50618B460031l4757m3687m8626m9136m5568l8816l0142k1148j3155o445o71L867
$$ plain form
50606 2131747 2137724 2142680 2144284 2141485 2133473 2118789 2095839 2063852 2022973 1973854 1917586 1855852
50594 1855852 1790651 1723745 1656515 1590298 1526645 1467159 1413015 1364454 1320694 1280519 1243081
50583 1243081 1208144 1175723 1145854 1118681 1094322 1072469 1052495 1034229 1018336 1005634 996285
50572 996285 989904 986171 984925 985847 988518 992889 999372 1008305 1019515 1032537 1047178 1063673 1082203
50559 1082203 1102432 1123827 1146530 1171535 1199613 1230262 1262050 1293882 1325456 1356670 1387233
50548 1387233 1416970 1445932 1474001 1500833 1526337 1550785 1574424 1597646 1621664 1648281 1678607
50537 1678607 1712650 1750548 1793489 1842760 1898422 1959646 2025964 2097582 2174717 2257279 2345020
50526 2345020 2437594 2534634 2635998 2741393 2849368 2957334 3063172 3166165 3265577 3359051
$$ packed form
50606B131747N977M956J604k799q012j4684k2950l1987m0879m9119n6268o1734
50594A855852o5201o6906o7230o6217o3653n9486n4144m8561m3760m0175l7438
50583A243081l4937l2421k9869k7173k4359k1853j9974j8266j5893j2702r349
50572I96285o381l733j246R22K671M371O483Q933J1210J3022J4641J6495J8530
50559A082203K0229K1395K2703K5005K8078L0649L1788L1832L1574L1214L0563
50548A387233K9737K8962K8069K6832K5504K4448K3639K3222K4018K6617L0326
50537A678607L4043L7898M2941M9271N5662O1224O6318P1618P7135Q2562Q7741
50526B345020R2574R7040J01364J05395J07975J07966J05838J02993R9412R3474
$$ plain form
50516 3359051 3443476 3516937 3578611 3627079 3660071 3675993 3674541 3655769 3619751 3567545 3501393
50505 3501393 3423554 3335846 3240785 3142227 3044226 2949949 2862235 2784435 2719795 2670260 2636478
50494 2636478 2618654 2616799 2630177 2656833 2693589 2736392 2780912 2823038 2858687 2883342 2892385 2882243
50482 2882243 2851105 2798767 2726468 2636946 2533948 2421286 2302639 2182048 2063576 1950087
50472 1950087 1842952 1743188 1652042 1570081 1496663 1431031 1373289 1323617 1281234 1244909 1213899
50461 1213899 1187459 1163994 1141874 1121042 1102826 1088125 1076492 1067033 1059400 1053751 1050444 1049969
50449 1049969 1052685 1058295 1065959 1075044 1085484 1097422 1110914 1125995 1142546 1159889 1176905 1192738
50437 1192738 1207212 1220524 1232791 1243953 1253813 1262092 1268686 1273981 1278790 1283988 1290257 1297950 1306821
$$ packed form
50516C359051Q4425P3461O1674M8468L2992J5922j452j8772l6018n2206o6152
50505C501393p7839q7708r5061r8558r8001r4277q7714p7800o4640m9535l3782
50494B636478j7824j855J3378K6656L6756M2803M4520M2126L5649K4655R043j0142
50482B882243l1138n2338p2299q9522j02998j12662j18647j20591j18472j13489
50472A950087j07135r9764r1146q1961p3418o5632n7742m9672m2383l6325l1010
50461A213899k6440k3465k2120k0832j8216j4701j1633r459p633n649l307m75
50449A049969K716N610P664R085J0440J1938J3492J5081J6551J7343J7016J5833
50437A192738J4474J3312J2267J1162R860Q279O594N295M809N198O269P693Q871
$$ plain form
50424 1306821 1316014 1324764 1333245 1342471 1353358 1366212 1381091 1398251 1418054 1440763 1466680 1496282
50412 1496282 1530024 1568096 1610494 1657101 1707497 1760758 1815667 1871173 1926544 1981019 2033417
50401 2033417 2082240 2126202 2164547 2196720 2221858 2238823 2246745 2245240 2234062 2212829 2181305 2139782
50389 2139782 2089160 2030914 1967182 1900584 1833656 1768470 1706851 1650645 1601532 1560712 1528915
50378 1528915 1506491 1493316 1488805 1492215 1502727 1519040 1539123 1560599 1581178 1598598 1610557 1615133
50366 1615133 1611127 1597782 1574560 1541616 1500352 1453087 1402180 1349611 1297044 1245794 1196738
50355 1196738 1150491 1107528 1067957 1031440 997672 966800 939188 915149 895150 879841 869445
50344 869445 863495 861584 863867 870167 878948 887840 894956 899157 899609 896086 889528 881335 872140 862055
$$ packed form
50424A306821R193Q750Q481R226J0887J2854J4879J7160J9803K2709K5917K9602
50412A496282L3742L8072M2398M6607N0396N3261N4909N5506N5371N4475N2398
50401B033417M8823M3962L8345L2173K5138J6965P922j505j1178k1233l1524m1523
50389B139782n0622n8246o3732o6598o6928o5186o1619n6206m9113m0820l1797
50378A528915k2424j3175m511L410J0512J6313K0083K1476K0579J7420J1959M576
50366A615133m006j3345k3222l2944m1264m7265n0907n2569n2567n1250m9056
50355A196738m6247m2963l9571l6517l3768l0872k7612k4039j9999j5309j0396
50344H69445n950j911K283O300Q781Q892P116M201M52l523o558q193r195j0085
$$ plain form
50330 862055 851894 843017 835919 830073 825383 822693 822496 824131 826745 830104 833997 837813 841416 845540
50316 845540 850506 855257 858558 860462 861678 862060 860888 858393 855867 854203 853223 852539 852253 852561 853386 854702
50300 854702 856732 859639 863449 868438 875130 883668 893598 904460 916311 929503 944282 960868 979667
50287 979667 1001095 1025271 1051877 1079857 1106870 1129294 1143420 1147112 1140367 1124449 1100888 1071514
50275 1071514 1039076 1006977 977891 952755 931318 913406 899217 888586 880594 874116 868433 863251
50263 863251 858591 854832 852384 851027 849985 848963 848729 850291 853959 859696 867930 879211 893157 908470
50249 908470 924195 940467 957842 976273 994949 1012896 1029613 1045265 1060331 1074975 1088882
50238 1088882 1101799 1113945 1125444 1135499 1142620 1145627 1144044 1137606 1126059 1109681 1089550 1067041
$$ packed form
50330H62055j0161q877p098n846m690k690j97J635K614L359L893L816L603M124
50316H45540M966M751L301J904J216L82j172k495k526j664r80o84k86L08Q25J316
50300H54702K030K907L810M989O692Q538R930J0862J1851J3192J4779J6586J8799
50287I79667K1428K4176K6606K7980K7013K2424J4126L692o745j5918k3561k9374
50275A071514l2438l2099k9086k5136k1437j7912j4189j0631p992o478n683n182
50263H63251m660l759k448j357j042j022k34J562L668N737Q234J1281J3946J5313
50249I08470J5725J6272J7375J8431J8676J7947J6717J5652J5066J4644J3907
50238A088882J2917J2146J1499J0055P121L007j583o438j1547j6378k0131k2509
$$ plain form
50226 1067041 1043355 1019719 997598 978347 962710 950713 941686 934225 926473 916795 904129 887707
50214 887707 866973 842175 814857 787277 761282 737757 716899 698726 683386 671208 662354 656304
50202 656304 651876 647994 644287 640790 637360 633779 630214 627064 624323 621476 618085 614139 609789 605117
50188 605117 600333 595840 591852 588107 584222 580192 576397 573168 570477 568012 565477 562894 560599 558872
50174 558872 557587 556461 555570 555282 555582 555911 555998 556499 558330 561529 565296 569147 573486 578864 585061 591217
50158 591217 596703 601654 606785 612873 620267 628783 638059 647981 658527 669271 679465 688814 697757
50145 697757 706674 715157 722536 728890 735037 741645 748951 757408 767996 781611 798540 818764 842476
50132 842476 869949 901124 935493 972176 1009893 1047164 1082987 1117270 1150421 1182637 1213789
$$ packed form
50226A067041k3686k3636k2121j9251j5637j1997r027p461p752r678j2666j6422
50214H87707k0734k4798k7318k7580k5995k3525k0858j8173j5340j2178q854o050
50202F56304m428l882l707l497l430l581l565l150k741k847l391l946m350m672
50188F05117m784m493l988l745l885m030l795l229k691k465k535k583k295j727
50174E58872j285j126q91k88L00L29Q7N01J831L199L767L851M339N378O197O156
50158E91217N486M951N131O088P394Q516R276R922J0546J0744J0194R349Q943
50145F97757Q917Q483P379O354O147O608P306Q457J0588J3615J6929K0224K3712
50132H42476K7473L1175L4369L6683L7717L7271L5823L4283L3151L2216L1152
$$ plain form
50121 1213789 1243716 1272171 1298446 1321364 1339627 1351964 1357086 1354009 1342652 1323846 1298585 1267483
50109 1267483 1231165 1190992 1149111 1107722 1068341 1031636 997819 967171 940202 917337 898444
50098 898444 882763 869212 856654 843966 830246 815258 799584 784151 769629 756426 745117
50087 745117 736492 731027 728362 727462 727289 727366 727827 729005 730932 733112 734795 735558 735593 735338 734784 733288 730253
50070 730253 725858 720926 715978 710718 704648 698070 692138 687803 684916 682443 679464 675854 672138 668851
50056 668851 666102 663613 661160 658900 657235 656358 656116 656363 657306 659336 662593 666892 671971 677618 683579
50041 683579 689680 696117 703367 711553 720106 728258 735863 743508 751836 760901 770128 778723 786175 792607
50027 792607 798699 805131 812019 819008 825830 832480 838839 844559 849645 854953 861716 870558 881225 893223
$$ packed form
50121A213789K9927K8455K6275K2918J8263J2337N122l077j1357j8806k5261l1102
50109A267483l6318m0173m1881m1389l9381l6705l3817l0648k6969k2865j8893
50098H98444j5681j3551j2558j2688j3720j4988j5674j5433j4522j3203j1309
50087G45117q625n465k665r00j73P7M61J178J927K180J683P63L5k55n54j496l035
50070G30253m395m932m948n260o070o578n932m335k887k473k979l610l716l287
50056F68851k749k489k453k260j665q77k42K47R43K030L257M299N079N647N961
50041F83579O101O437P250Q186Q553Q152P605P645Q328R065R227Q595P452O432
50027G92607O092O432O888O989O822O650O359N720N086N308O763Q842J0667J1998
$$ plain form
50013 893223 906374 920643 935691 950815 965240 978405 990103 1000537 1010215 1019605 1028890 1038090
50001 1038090 1047397 1057227 1067814 1078736 1088881 1096870 1101593 1102401 1098920 1090843 1077956 1060379 1038767
49988 1038767 1014268 988224 961796 935747 910533 886432 863448 841158 818928 796493 774263
49977 774263 752947 732940 714138 696207 678943 662513 647556 634936 625109 617698 611827 606805
49965 606805 602375 598414 594756 591314 588112 585158 582518 580595 579986 580897 582970 585813 589509 594468 601077
49950 601077 609712 620760 634179 649108 664304 678966 692886 705884 717518 727457 735711 742308
49938 742308 746992 749547 750272 749812 748479 745930 741445 734331 724123 710759 694860 677699 660630
49925 660630 644380 628979 614354 600906 589412 580470 574146 570099 567960 567525 568635 570910 573706
$$ packed form
50013H93223J3151J4269J5048J5124J4425J3165J1698J0434R678R390R285R200
50001A038090R307R830J0587J0922J0145P989M723Q08l481q077j2887j7577k1612
49988A038767k4499k6044k6428k6049k5214k4101k2984k2290k2230k2435k2230
49977G74263k1316k0007j8802j7931j7264j6430j4957j2620r827p411n871n022
49965F06805m430l961l658l442l202k954k640j923o09R11K073K843L696M959O609
49950F01077Q635J1048J3419J4929J5196J4662J3920J2998J1634R939Q254O597
49938G42308M684K555P25m60j333k549m485p114j0208j3364j5899j7161j7069
49925F60630j6250j5401j4625j3448j1494q942o324m047k139m35J110K275K796
$$ plain form
49912 573706 576484 579241 582413 586249 590429 594525 598712 603694 609884 616946 624337 632040 640562 650343
49898 650343 661487 674023 688038 703309 718915 733439 745640 754918 761198 764578 765233 763546 760039
49885 760039 755034 748492 740257 730288 718561 705039 690060 674619 659839 646098 633010 620269
49873 620269 608168 597137 587260 578494 571025 565038 560428 557124 555449 555629 557132 559088 561400 564775
49859 564775 569564 575154 580930 587308 595293 605336 617186 630605 645483 661190 676517 690619
49847 690619 703595 715763 726708 735532 741867 746151 748888 750080 749487 747050 742745 736305 727457 716430
49833 716430 703993 690992 678007 665475 653926 643927 635802 629506 624799 621451 619237 617817 616877
$$ packed form
49912E73706K778K757L172L836M180M096M187M982O190P062P391P703Q522R781
49898F50343J1144J2536J4015J5271J5606J4524J2201R278O280L380O55j687l507
49885G60039n005o542q235r969j1727j3522j4979j5441j4780j3741j3088j2741
49873F20269j2101j1031r877q766p469n987m610l304j675J80J503J956K312L375
49859E64775M789N590N776O378P985J0043J1850J3419J4878J5707J5327J4102
49847F90619J2976J2168J0945Q824O335M284K737J192n93k437m305o440q848j1027
49833G16430j2437j3001j2985j2532j1549r999q125o296m707l348k214j420r40
$$ [...]
##END NTUPLES=NMR SPECTRUM
##END=
