
##TITLE=AC1355_CPIAH12174_6648218_0SZLkQtrN2
##JCAMPDX= 6.0         $$ Bruker NMR JCAMP-DX V2.0
##DATA TYPE= NMR SPECTRUM
##DATA CLASS= NTUPLES
##ORIGIN= BRUKER
##OWNER= Administrator
$$ 1.72 TOPSPIN		Version 2.1
$$ 2012-08-10 23:15:32.500 -0500  Administrator@TOPSPIN
$$ Compression mode = diff/dup
##.OBSERVE FREQUENCY= 400.02188249412
##.OBSERVE NUCLEUS= ^1H
##.ACQUISITION MODE= SIMULTANEOUS (DQD)
##.ACQUISITION SCHEME= undefined
##.AVERAGES= 64
##.DIGITISER RES= 22
##SPECTROMETER/DATA SYSTEM= spect
##.PULSE SEQUENCE= noesygpps1d.comp
##.SOLVENT NAME= COFFEE_meoh
##.SHIFT REFERENCE= INTERNAL, COFFEE_meoh, 1, 14.96241
##AUDIT TRAIL= $$ (NUMBER, WHEN, WHO, WHERE, PROCESS, VERSION, WHAT)
$$ ##TITLE= Audit trail, TOPSPIN		Version 2.1
$$ ##JCAMPDX= 5.01
$$ ##ORIGIN= Bruker BioSpin GmbH
$$ ##OWNER= Administrator
$$ $$ C:\Bruker\TOPSPIN/data/COFFEE/nmr/AC1355_CPIAH12174_6648218_0SZLkQtrN2/12/pdata/1/auditp.txt
$$ ##AUDIT TRAIL=  $$ (NUMBER, WHEN, WHO, WHERE, PROCESS, VERSION, WHAT)
(   1,<2012-08-10 23:15:27.593 -0500>,<Administrator>,<TOPSPIN>,<go>,<TOPSPIN 2.1>,
      <created by zg
	started at 2012-08-10 23:03:57.421 -0500,
	POWCHK enabled, PULCHK disabled,
       configuration hash MD5:
       6B 1B 68 BB D9 2E 58 E2 7F 35 AD 54 07 DF 0E 41
       data hash MD5: 64K
       C5 3D 8B 34 6C E5 98 F2 99 10 93 66 2E EC 52 F2>)
(   2,<2012-08-10 23:15:30.546 -0500>,<Administrator>,<TOPSPIN>,<proc1d>,<TOPSPIN 2.1>,
      <Start of raw data processing
       efp LB = 0.3 FT_mod = 6 PKNL = 1 PHC0 = 0 PHC1 = 0 SI = 128K 
       data hash MD5: 128K
       CF 47 21 40 47 B6 64 55 36 BF 28 6B E7 05 99 11>)
(   3,<2012-08-10 23:15:31.609 -0500>,<Administrator>,<TOPSPIN>,<proc1d>,<TOPSPIN 2.1>,
      <pk PHC0 = 2.318115 PHC1 = 0 
       data hash MD5: 128K
       AD C1 47 86 2E 72 AC 73 32 3B B1 ED 4E 42 39 38>)
(   4,<2012-08-10 23:15:32.156 -0500>,<Administrator>,<TOPSPIN>,<proc1d>,<TOPSPIN 2.1>,
      <abs ABSG = 1 
       data hash MD5: 128K
       D2 5A 7D 80 B0 93 28 FF F0 59 D9 D7 AE 1A AF 27>)
(   5,<2012-08-10 23:15:32.234 -0500>,<Administrator>,<TOPSPIN>,<proc1d>,<TOPSPIN 2.1>,
      <abs ABSG = 2 
       data hash MD5: 128K
       4B AF A9 9C 7D 13 DC 9C 9F 53 4C 31 5B 09 18 FD>)
(   6,<2012-08-10 23:15:32.296 -0500>,<Administrator>,<TOPSPIN>,<proc1d>,<TOPSPIN 2.1>,
      <abs ABSG = 3 
       data hash MD5: 128K
       AD B0 4B 06 0E 45 DE BA 18 18 33 98 64 90 92 8E>)
(   7,<2012-08-10 23:15:32.359 -0500>,<Administrator>,<TOPSPIN>,<proc1d>,<TOPSPIN 2.1>,
      <abs ABSG = 4 
       data hash MD5: 128K
       1D AE 70 7C A2 92 FA A2 3B AE E2 6A C3 82 96 16>)
(   8,<2012-08-10 23:15:32.421 -0500>,<Administrator>,<TOPSPIN>,<proc1d>,<TOPSPIN 2.1>,
      <abs ABSG = 5 
       data hash MD5: 128K
       44 E2 02 DA 72 47 9F CD F6 D5 A8 11 56 9A B5 30>)
$$ ##END=
$$ 
$$ $$ hash MD5
$$ $$ 7D E6 4C 20 BA 73 44 89 9D FB 97 F6 F2 2C AC 62
##$RELAX= 
##$RELAX= 
##$RELAX= 
##$RELAX= 
##$RELAX= 
##$RELAX= 
##$RELAX= 
##$RELAX= 
$$ Bruker specific parameters
$$ [...]
##$TP07= 0
##$TPNAME0= <>
##$TPNAME1= <>
##$TPNAME2= <>
##$TPNAME3= <>
##$TPNAME4= <>
##$TPNAME5= <>
##$TPNAME6= <>
##$TPNAME7= <>
##$TPOAL= (0..7)
0.5 0.5 0.5 0.5 0.5 0.5 0.5 0.5
##$TPOFFS= (0..7)
0 0 0 0 0 0 0 0
##$TUNHIN= 0
##$TUNHOUT= 0
##$TUNXOUT= 0
##$USERA1= <user>
##$USERA2= <user>
##$USERA3= <user>
##$USERA4= <user>
##$USERA5= <user>
##$V9= 5
##$VALIST= <valist>
##$VCLIST= <CCCCCCCCCCCCCCC>
##$VD= 0
##$VDLIST= <DDDDDDDDDDDDDDD>
##$VPLIST= <PPPPPPPPPPPPPPP>
##$VTLIST= <TTTTTTTTTTTTTTT>
##$WBST= 1024
##$WBSW= 4
##$XGAIN= (0..3)
0 0 0 0
##$XL= 0
##$YL= 0
##$YMAX_a= 18444325
##$YMIN_a= -10678240
##$ZGOPTNS= <>
##$ZL1= 120
##$ZL2= 120
##$ZL3= 120
##$ZL4= 120
##$ABSF1= 14.96241
##$ABSF2= -5.595772
##$ABSG= 5
##$ABSL= 3
##$ALPHA= 0
##$AQORDER= 0
##$ASSFAC= 0
##$ASSFACI= 0
##$ASSFACX= 0
##$ASSWID= 0
##$AUNMP= <proc_prof1d_extract.lims>
##$AXLEFT= 0
##$AXNAME= <>
##$AXNUC= <1H>
##$AXRIGHT= 0
##$AXTYPE= 0
##$AXUNIT= <>
##$AZFE= 0.1
##$AZFW= 0.1
##$BCFW= 0
##$BC_mod= 0
##$BYTORDP= 0
##$COROFFS= 0
##$CY= 15
##$DATMOD= 1
##$DC= 0
##$DFILT= <>
##$DTYPP= 0
##$F1P= 0
##$F2P= 0
##$FCOR= 0.5
##$FTSIZE= 131072
##$FT_mod= 6
##$GAMMA= 0
##$GB= 0
##$INTBC= 1
##$INTSCL= 1
##$ISEN= 128
##$LB= 0.3
##$LEV0= 0
##$LPBIN= 0
##$MAXI= 10000
##$MC2= 0
##$MEAN= 0
##$ME_mod= 0
##$MI= 0
##$NCOEF= 0
##$NC_proc= -2
##$NLEV= 6
##$NOISF1= 0
##$NOISF2= 0
##$NSP= 0
##$NTH_PI= 0
##$NZP= 0
##$OFFSET= 14.96241
##$PC= 1
##$PHC0= 2.318115
##$PHC1= 0
##$PH_mod= 1
##$PKNL= yes
##$PPARMOD= 0
##$PPDIAG= 0
##$PPIPTYP= 0
##$PPMPNUM= 2147483647
##$PPRESOL= 1
##$PSCAL= 4
##$PSIGN= 0
##$PYNMP= <proc.py>
##$REVERSE= no
##$SF= 400.020009073529
##$SI= 131072
##$SIGF1= 0
##$SIGF2= 0
##$SINO= 400
##$SIOLD= 131072
##$SPECTYP= <>
##$SREGLST= <1H.CDCl3>
##$SSB= 0
##$STSI= 131072
##$STSR= 0
##$SW_p= 8223.68421052631
##$SYMM= 0
##$S_DEV= 0
##$TDeff= 65536
##$TDoff= 0
##$TI= <>
##$TILT= no
##$TM1= 0
##$TM2= 0
##$TOPLEV= 0
##$USERP1= <user>
##$USERP2= <user>
##$USERP3= <user>
##$USERP4= <user>
##$USERP5= <user>
##$WDW= 1
##$XDIM= 131072
##$YMAX_p= 357283990
##$YMIN_p= -12411
##$CURPLOT= <Network HP LaserJet P1505>
##$CURPRIN= <$Network HP LaserJet P1505>
##$DFORMAT= <normdp>
##$LAYOUT= <+/1D_H.xwp>
##$LFORMAT= <normlp>
##$PFORMAT= <normpl>
##$SURQMSG= 1
$$ End of Bruker specific parameters
$$ ---------------------------------
##NTUPLES= NMR SPECTRUM
##VAR_NAME=  FREQUENCY,     SPECTRUM/REAL,   SPECTRUM/IMAG
##SYMBOL=    X,             R,               I
##VAR_TYPE=  INDEPENDENT,   DEPENDENT,       DEPENDENT
##VAR_FORM=  AFFN,          ASDF,            ASDF
##VAR_DIM=   131072,        131072,          131072
##UNITS=     HZ,            ARBITRARY UNITS, ARBITRARY UNITS
##FACTOR=    0.0627417313425164, 1,          1
##FIRST=     8223.62146879497, 2842,         -64068
##LAST=      0,             3841,            -64606
##MIN=       0,             -12411,          0
##MAX=       8223.62146879497, 357283990,    0
$$ Real data points
##PAGE= N=1
##DATA TABLE= (X++(R..R)), XYDATA
$$ [...]
$$ plain form
63177 689501 694713 700624 708068 717432 728172 739497 751075 762717 773844 783924 793159 802066 810472
63164 810472 817626 823323 828126 832219 834789 834926 832570 828124 821659 813086 802721 791030 778052 763670
63150 763670 748390 733309 719294 706603 695225 685080 675859 667177 659072 651966 645930 640377 634849
63137 634849 629820 626369 625096 625645 627224 629248 631395 633396 635146 636986 639573 643272 647716 652067
63123 652067 655690 658533 660939 663252 665657 668326 671528 675382 679477 683038 685742 688202 691170 694386
63109 694386 696773 697869 698350 698932 699518 700009 701143 703565 706528 708641 709682 710561 711576 712001 711623 711379
63093 711379 711885 712436 712260 711873 712315 713711 715545 717811 720959 724989 729539 734654 740673 747482 754613
63078 754613 762017 770039 778706 787681 796832 806267 815977 826053 837107 849680 863335 877106 890856
$$ packed form
63177F89501N212N911P444R364J0740J1325J1578J1642J1127J0080R235Q907Q406
63164H10472P154N697M803M093K570J37k356m446o465q573j0365j1691j2978j4382
63150G63670j5280j5081j4015j2691j1378j0145r221q682q105p106o036n553n528
63137F34849n029l451j273N49J579K024K147K001J750J840K587L699M444M351
63123F52067L623K843K406K313K405K669L202L854M095L561K704K460K968L216
63109F94386K387J096M81N82N86M91J134K422K963K113J041Q79J015M25l78k44
63093G11379N06N51j76l87M42J396J834K266L148M030M550N115O019O809P131
63078G54613P404Q022Q667Q975R151R435R710J0076J1054J2573J3655J3771J3750
$$ plain form
63065 890856 905306 920644 936039 950938 966075 982685 1001210 1021262 1042412 1064611 1088155
63054 1088155 1113655 1141795 1172796 1206295 1241949 1279825 1320008 1362173 1405923 1451271 1498399
63043 1498399 1547128 1596947 1647453 1698477 1749850 1801386 1853100 1905303 1958370 2012358 2066778
63032 2066778 2120763 2173620 2225176 2275301 2323026 2366383 2403240 2432089 2452026 2462318 2462303 2451544
63020 2451544 2429922 2397707 2355678 2305047 2247151 2183423 2115725 2046337 1977258 1909550 1843584
63009 1843584 1779842 1719280 1663001 1611842 1566217 1526089 1491014 1460415 1433979 1411788 1394031
62998 1394031 1380663 1371379 1365787 1363404 1363467 1365051 1367606 1371322 1376619 1383309 1390583 1397924 1405575 1413812
62984 1413812 1422117 1429523 1435560 1440304 1443537 1444432 1442205 1436622 1427671 1415090 1398581 1378252 1354562
$$ packed form
63065H90856J4450J5338J5395J4899J5137J6610J8525K0052K1150K2199K3544
63054A088155K5500K8140L1001L3499L5654L7876M0183M2165M3750M5348M7128
63043A498399M8729M9819N0506N1024N1373N1536N1714N2203N3067N3988N4420
63032B066778N3985N2857N1556N0125M7725M3357L6857K8849J9937J0292j5j0759
63020B451544k1622l2215m2029n0631n7896o3728o7698o9388o9079o7708o5966
63009A843584o3742o0562n6279n1159m5625m0128l5075l0599k6436k2191j7757
62998A394031j3368r284n592k383O3J584K555L716N297O690P274P341P651Q237
62984A413812Q305P406O037M744L233Q95k227n583q951j2581j6509k0329k3690
$$ plain form
62971 1354562 1327848 1298168 1265657 1230970 1195305 1159961 1125783 1093004 1061581 1031531 1002939
62960 1002939 975872 950512 927187 906049 886838 869149 852775 837546 823065 809058 795846
62949 795846 783996 773498 763701 754114 744792 735828 726924 717769 708550 699768 691643 683818 675626 666693
62935 666693 657444 648908 641754 635583 629529 623459 618041 613577 609371 604585 599282 594256 590120 586951
62921 586951 584655 583305 583062 583859 585134 585947 585670 584627 583779 583648 583878 583944 583894 584126 584791 585757 586912 588165
62903 588165 589356 590465 591760 593389 594937 595725 595502 594603 593479 592365 591358 590522 589796 588922 587498 585109
62887 585109 581524 576927 571949 567308 563352 559925 556656 553427 550625 548823 548029 547403 545959 543554 540922
62872 540922 538777 537329 536617 536709 537265 537404 536542 535155 534276 534355 534923 535257 535017 534321 533559 533181 533354 533744
$$ packed form
62971A354562k6714k9680l2511l4687l5665l5344l4178l2779l1423l0050k8592
62960A002939k7067k5360k3325k1138j9211j7689j6374j5229j4481j4007j3212
62949G95846j1850j0498r797r587r322q964q904r155r219q782q125p825q192q933
62935F66693r249q536p154o171o054o070n418m464m206m786n303n026m136l169
62921E86951k296j350k43P97J275Q13k77j043q48j31K30O6n0K32O65R66J155J253
62903E88165J191J109J295J629J548P88k23q99j124j114j007q36p26q74j424k389
62887E85109l585m597m978m641l956l427l269l229k802j802p94o26j444k405k632
62872E40922k145j448p12R2N56J39q62j387q79P9N68L34k40o96p62l78J73L90
$$ plain form
62854 533744 533778 533127 531892 530420 529167 528625 529109 530517 532356 534004 534916 534791 533795 532577 531871 532019 532950
62837 532950 534511 536614 539030 541224 542536 542587 541592 540245 539285 539127 539938 541830 544691 547854 550342 551634
62821 551634 551978 551885 551589 551192 550987 551297 552099 553101 554155 555337 556719 558275 560003 561979 564285 566960
62805 566960 569940 572993 575812 578361 581035 584412 588916 594781 602146 610972 620938 631597 642649 654077
62791 654077 666142 679295 693943 710184 727912 747181 768339 791752 817643 846251 877921
62780 877921 912952 951595 994282 1041529 1093482 1149943 1211048 1277544 1349976 1427873 1510032
62769 1510032 1595379 1683093 1772038 1860481 1946357 2027450 2101464 2166309 2220384 2262381 2290959
62758 2290959 2305038 2304436 2289839 2262054 2221636 2169372 2106838 2036244 1959776 1879175 1795809 1711028
$$ packed form
62854E33744L4o51j235j472j253n42M84J408J839J648R12j25r96j218p06J48R31
62837E32950J561K103K416K194J312N1r95j347r60j58Q11J892K861L163K488J292
62821E51634L44r3k96l97k05L10Q02J002J054J182J382J556J728J976K306K675
62805E66960K980L053K819K549K674L377M504N865P365Q826R966J0659J1052J1428
62791F54077J2065J3153J4648J6241J7728J9269K1158K3413K5891K8608L1670
62780H77921L5031L8643M2687M7247N1953N6461O1105O6496P2432P7897Q2159
62769A510032Q5347Q7714Q8945Q8443Q5876Q1093P4014O4845N4075M1997K8578
62758B290959J4079o02j4597k7785m0418n2264o2534p0594p6468q0601q3366q4781
$$ plain form
62746 1711028 1626412 1543542 1463476 1386548 1312889 1243019 1177705 1117313 1061603 1010169 962846
62735 962846 919512 879753 842953 808700 776972 747849 721147 696499 673856 653694 636415
62724 636415 621554 607916 594686 582119 570978 561467 553072 545292 538166 532021 526996 522935 519631
62711 519631 517026 515179 514136 513969 514920 517319 521202 526208 532164 539574 549131 560813 574029 588651
62697 588651 605193 623692 643209 663072 684131 707953 734998 764312 794917 826738 859989
62686 859989 894314 928787 962318 993770 1022049 1046410 1066510 1081987 1092146 1096238 1093924 1085344
62674 1085344 1070920 1051208 1026862 998621 967369 934221 900384 866739 833523 800406 767000
62663 767000 733508 701000 670876 643782 619068 595561 572811 551455 532353 515648 500742
$$ packed form
62746A711028q4616q2870q0066p6928p3659o9870o5314o0392n5710n1434m7323
62735I62846m3334l9759l6800l4253l1728k9123k6702k4648k2643k0162j7279
62724F36415j4861j3638j3230j2567j1141r511q395p780p126o145n025m061l304
62711E19631k605j847j043j67R51K399L883N006N956P410R557J1682J3216J4622
62697E88651J6542J8499J9517J9863K1059K3822K7045K9314L0605L1821L3251
62686H59989L4325L4473L3531L1452K8279K4361K0100J5477J0159M092k314q580
62674A085344j4424j9712k4346k8241l1252l3148l3837l3645l3216l3117l3406
62663G67000l3492l2508l0124k7094k4714k3507k2750k1356j9102j6705j4906
$$ plain form
62652 500742 486967 474072 462134 451217 441268 432262 424235 417069 410354 403662 396879 390096 383290
62639 383290 376422 369765 363712 358205 352845 347728 343692 341351 340219 339141 337332 334705 331547 328406
62625 328406 326057 324990 324872 324865 324465 323749 322977 322366 322245 322911 324220 325596 326669 327719 329444 332353 336401
62608 336401 341103 346001 351054 356509 362501 369052 376493 385480 396389 409005 423064 438724 456237
62595 456237 475566 496724 520096 546012 574313 604900 638382 675530 716218 759409 804072
62584 804072 849573 895275 940397 984233 1025995 1064363 1097647 1124436 1143868 1155522 1159547 1156637
62572 1156637 1147328 1131473 1108995 1080879 1048714 1013485 975712 936553 897694 859966 823092
62561 823092 787066 752777 720885 691037 662760 636357 612275 590301 570047 551593 534926
$$ packed form
62652E00742j3775j2895j1938j0917r949r006q027p166o715o692o783o783o806
62639C83290o868o657o053n507n360n117m036k341j132j078j809k627l158l141
62625C28406k349j067j18pm00p16p72o11j21O66J309J376J073J050J725K909M048
62608C36401M702M898N053N455N992O551P441Q987J0909J2616J4059J5660J7513
62595D56237J9329K1158K3372K5916K8301L0587L3482L7148M0688M3191M4663
62584H04072M5501M5702M5122M3836M1762L8368L3284K6789J9432J1654M025k910
62572A156637r309j5855k2478k8116l2165l5229l7773l9159l8859l7728l6874
62561H23092l6026l4289l1892k9848k8277k6403k4082k1974k0254j8454j6667
$$ plain form
62550 534926 519238 503593 487989 473091 459229 446296 434376 423701 414100 405113 396664 389107
62538 389107 382644 377116 372347 368263 364727 361633 359095 357212 355773 354572 353884 354056 354769 355254 355345 355805
62522 355805 357390 360061 363373 367261 372050 377867 384457 391595 399459 408453 418797 430360 442902
62509 442902 456377 470988 486960 504385 523211 543226 563921 584436 603820 621464 637297
62498 637297 651506 663998 674191 681432 685544 686759 685128 680321 672129 660830 646927 630944 613772
62485 613772 596708 580555 565006 549578 534845 521968 511182 501710 493171 486000 480177 474675
62473 474675 468901 463852 460948 460240 460626 461417 462724 464514 466345 468208 470842 474809 479663 484365 488278
62458 488278 491622 495143 499450 504507 509699 514482 518898 523345 527988 532676 537353 542231 547530 553203
$$ packed form
62550E34926j5688j5645j5604j4898j3862j2933j1920j0675r601q987q449p557
62538C89107o463n528m769m084l536l094k538j883j439j201o88J72P13M85R1M60
62522C55805J585K671L312L888M789N817O590P138P864Q994J0344J1563J2542
62509D42902J3475J4611J5972J7425J8826K0015K0695K0515J9384J7644J5833
62498F37297J4209J2492J0193P241M112J215j631m807q192j1299j3903j5983j7172
62485F13772j7064j6153j5549j5428j4733j2877j0786r472q539p171n823n502
62473D74675n774n049k904p08L86P91J307J790J831J863K634L967M854M702L913
62458D88278L344L521M307N057N192M783M416M447M643M688M677M878N299N673
$$ plain form
62444 553203 558913 564108 568138 570499 570980 569534 566158 560951 554114 545745 535834 524677 513013 501522
62430 501522 490334 479312 468580 458441 449008 440332 432743 426545 421465 416900 412801 409800 408266
62417 408266 407684 407332 407220 408049 410377 414139 418895 424232 429868 435629 441446 447313 453166 458823 464079
62402 464079 468872 473354 477782 482282 486644 490363 492899 493968 493641 492257 490287 488241 486512 485106
62388 485106 483566 481306 478135 474392 470632 467360 465021 463943 464138 465412 467847 471904 477858 485438
62374 485438 494330 504734 517065 531401 547697 566279 587562 611464 637758 666863 699543 735798
62362 735798 774790 816018 859766 906149 954493 1004004 1054214 1104250 1152353 1196871 1237222
62351 1237222 1273173 1303649 1327061 1342609 1350568 1351565 1346253 1335595 1320590 1301596 1278440 1251296
$$ packed form
62444E53203N710N195M030K361M81j446l376n207o837q369r911j1157j1664j1491
62430E01522j1188j1022j0732j0139r433q676p589o198n080m565m099l001j534
62417D08266n82l52j12Q29K328L762M756N337N636N761N817N867N853N657N256
62402D64079M793M482M428M500M362L719K536J069l27j384j970k046j729j406
62388D85106j540k260l171l743l760l272k339j078J95J274K435M057N954P580
62374D85438Q892J0404J2331J4336J6296J8582K1283K3902K6294K9105L2680L6255
62362G35798L8992M1228M3748M6383M8344M9511N0210N0036M8103M4518M0351
62351A237222L5951L0476K3412J5548P959R97n312j0658j5005j8994k3156k7144
$$ plain form
62339 1251296 1220957 1188236 1153686 1118055 1082479 1047911 1014662 982696 952100 923085 895778
62328 895778 870115 845846 822634 800455 779955 762067 747049 734071 721980 710391 699846
62317 699846 690930 683463 676697 670177 664133 658956 654598 650778 647487 644766 642033 638290 633225 627573
62303 627573 622067 616509 610316 603597 597141 591497 586536 581829 577098 572406 568234 565222 563545 562751
62289 562751 562468 562978 564632 567054 569504 571935 575073 579447 584930 591238 598330 606118 614294 622710 631600
62274 631600 641186 651335 661875 673088 685670 700233 716869 735112 754373 774541 796264 820552
62262 820552 848196 879556 914742 953727 996348 1042376 1091522 1143205 1196369 1249627 1301486
62251 1301486 1350375 1394712 1433203 1464938 1489099 1504870 1511938 1510899 1502858 1488710 1468948 1443973
$$ packed form
62339A251296l0339l2721l4550l5631l5576l4568l3249l1966l0596k9015k7307
62328H95778k5663k4269k3212k2179k0500j7888j5018j2978j2091j1589j0545
62317F99846q916p467o766o520o044n177m358l820l291k721k733l743n065n652
62303F27573n506n558o193o719o456n644m961m707m731m692m172l012j677p94
62289E62751k83N10J654K422K450K431L138M374N483O308P092P788Q176Q416Q890
62274F31600R586J0149J0540J1213J2582J4563J6636J8243J9261K0168K1723K4288
62262H20552K7644L1360L5186L8985M2621M6028M9146N1683N3164N3258N1859
62251A301486M8889M4337L8491L1735K4161J5771P068j039q041j4148j9762k4975
$$ plain form
62239 1443973 1414343 1380882 1344740 1307098 1268703 1229981 1191739 1155216 1121201 1089664 1060698
62228 1060698 1035158 1013656 995462 979239 964589 952034 941775 933351 926456 921118 917004 913391
62216 913391 909989 907100 904869 903117 901998 902045 903310 905203 907431 910442 914694 920140 926757 934820 944223
62201 944223 954148 964003 974227 985763 999132 1014489 1032129 1052324 1074899 1099491 1126126 1155139
62189 1155139 1186552 1219752 1253753 1287638 1320862 1353129 1383856 1411840 1435843 1455452 1470995
62178 1470995 1482743 1490855 1496146 1500167 1504200 1508799 1514638 1523073 1535313 1551551 1571436 1594961 1622256
62165 1622256 1652894 1686073 1721206 1757714 1794375 1829548 1862110 1891769 1918492 1942041 1962107
62154 1962107 1978634 1991944 2002688 2011454 2018269 2022683 2024636 2024954 2024625 2023833 2022181 2019762 2017528 2016628
$$ packed form
62239A443973k9630l3461l6142l7642l8395l8722l8242l6523l4015l1537k8966
62228A060698k5540k1502j8194j6223j4650j2555j0259q424o895n338m114l613
62216I13391l402k889k231j752j119M7J265J893K228L011M252N446O617Q063R403
62201I44223R925R855J0224J1536J3369J5357J7640K0195K2575K4592K6635K9013
62189A155139L1413L3200L4001L3885L3224L2267L0727K7984K4003J9609J5543
62178A470995J1748Q112N291M021M033M599N839Q435J2240J6238J9885K3525K7295
62165A622256L0638L3179L5133L6508L6661L5173L2562K9659K6723K3549K0066
62154A962107J6527J3310J0744Q766O815M414J953L18l29p92j652k419k234r00
$$ plain form
62140 2016628 2017705 2020780 2025467 2031258 2037935 2045743 2054874 2064853 2074796 2084383 2094287 2105449 2118170
62127 2118170 2132034 2146571 2161757 2177858 2194970 2212831 2231155 2250002 2269741 2290693 2312937
62116 2312937 2336367 2360724 2385634 2410901 2436809 2463923 2492498 2522210 2552408 2582419 2611816
62105 2611816 2640877 2670763 2702670 2736652 2771727 2807256 2843643 2881409 2920291 2959822 3000295
62094 3000295 3042479 3086591 3132196 3179008 3227231 3277039 3328102 3379652 3430720 3480466 3528676
62083 3528676 3575974 3623316 3671281 3719941 3769038 3817766 3864450 3906966 3943713 3974120 3998463
62072 3998463 4017572 4032709 4045175 4055808 4064890 4072540 4079087 4085110 4091217 4097625 4103769 4108507 4110969
62059 4110969 4111072 4109008 4104551 4097229 4087000 4074252 4059193 4041652 4021506 3998917 3974088 3947100
$$ packed form
62140B016628J077L075M687N791O677P808R131R979R943R587R904J1162J2721
62127B118170J3864J4537J5186J6101J7112J7861J8324J8847J9739K0952K2244
62116B312937K3430K4357K4910K5267K5908K7114K8575K9712L0198L0011K9397
62105B611816K9061K9886L1907L3982L5075L5529L6387L7766L8882L9531M0473
62094C000295M2184M4112M5605M6812M8223M9808N1063N1550N1068M9746M8210
62083C528676M7298M7342M7965M8660M9097M8728M6684M2516L6747L0407K4343
62072C998463J9109J5137J2466J0633R082P650O547O023O107O408O144M738K462
62059D110969J03k064m457p322j0229j2748j5059j7541k0146k2589k4829k6988
$$ plain form
62047 3947100 3918086 3887319 3855140 3822025 3788698 3755873 3723919 3693035 3663665 3636340 3611094
62036 3611094 3587393 3564753 3543115 3522542 3502872 3483779 3464929 3445966 3426575 3406631 3386027
62025 3386027 3364316 3340848 3315357 3288154 3259603 3229694 3198305 3165655 3132314 3098914 3065917
62014 3065917 3033461 3001301 2969190 2937438 2906849 2877986 2850789 2825124 2801380 2780142 2761561
62003 2761561 2745479 2732034 2721576 2713929 2708174 2703359 2699036 2694794 2689562 2681729 2669967 2653706 2632890
61990 2632890 2607545 2577732 2543782 2506533 2467367 2427845 2388981 2350771 2312666 2274629 2237519
61979 2237519 2202362 2169472 2138560 2109368 2081771 2055363 2029506 2003986 1979333 1956271 1935075
61968 1935075 1915553 1897417 1880425 1864359 1849074 1834533 1820609 1807036 1793733 1781083 1769617
$$ packed form
62047C947100k9014l0767l2179l3115l3327l2825l1954l0884k9370k7325k5246
62036C611094k3701k2640k1638k0573j9670j9093j8850j8963j9391j9944k0604
62025C386027k1711k3468k5491k7203k8551k9909l1389l2650l3341l3400l2997
62014C065917l2456l2160l2111l1752l0589k8863k7197k5665k3744k1238j8581
62003B761561j6082j3445j0458p647n755m815m323m242n232p833j1762j6261k0816
61990B632890k5345k9813l3950l7249l9166l9522l8864l8210l8105l8037l7110
61979B237519l5157l2890l0912k9192k7597k6408k5857k5520k4653k3062k1196
61968A935075j9522j8136j6992j6066j5285j4541j3924j3573j3303j2650j1466
$$ plain form
61957 1769617 1759411 1749992 1740956 1732557 1725610 1720835 1718368 1717898 1719199 1722403 1727845 1735867 1746837 1761043
61943 1761043 1778313 1797958 1819439 1842941 1868967 1897558 1928430 1961796 1998359 2038290 2080810
61932 2080810 2125166 2171561 2220729 2272988 2328215 2386480 2448202 2513834 2583895 2659343 2741556
61921 2741556 2831935 2931846 3042927 3167321 3307640 3466899 3648305 3854855 4089239 4354495
61911 4354495 4654696 4994718 5379321 5812578 6297847 6837713 7433711 8086204 8794033
61902 8794033 9553135 10354287 11181269 12010336 12810760 13546199 14177496 14667472 14986875
61893 14986875 15119292 15063011 14829450 14439614 13920435 13301774 12613698 11883975 11136428
61884 11136428 10390509 9661511 8960867 8296687 7674494 7097630 6567218 6082493 5641779
$$ packed form
61957A769617j0206r419r036q399o947m775k467m70J301L204N442Q022J0970J4206
61943A761043J7270J9645K1481K3502K6026K8591L0872L3366L6563L9931M2520
61932B080810M4356M6395M9168N2259N5227N8265O1722O5632P0061P5448Q2213
61921B741556R0379R9911J11081J24394J40319J59259J81406K06550K34384K65256
61911D354495L00201L40022L84603M33257M85269N39866N95998O52493P07829
61902H794033P59102Q01152Q26982Q29067Q00424P35439O31297M89976L19403
61893A4986875J32417n6281k33561l89836n19179o18661o88076p29723p47547
61884A1136428p45919p28998p00644o64180o22193n76864n30412m84725m40714
$$ plain form
61875 5641779 5243125 4883997 4561012 4270597 4009727 3775647 3565351 3376017 3205758
61866 3205758 3053260 2916827 2794555 2685328 2588708 2503670 2428336 2361357 2302820 2253160
61856 2253160 2211803 2177579 2150049 2129510 2115703 2107249 2102559 2100841 2101965 2105703 2111393 2118110 2124902
61843 2124902 2130848 2135148 2137310 2137326 2135689 2133225 2130774 2128911 2127929 2128057 2129616 2132893 2137942 2144686 2153180
61828 2153180 2163495 2175192 2187096 2197962 2207315 2215371 2222153 2227104 2229650 2229843 2228258 2225653 2222953
61815 2222953 2221230 2221274 2223410 2228061 2236306 2249445 2268120 2292193 2321374 2355556 2394676 2438844 2488706
61802 2488706 2545283 2609265 2680809 2760088 2847640 2944007 3049448 3164360 3289712 3426752
61792 3426752 3576506 3740030 3919222 4116988 4336412 4579996 4850101 5150251 5485801
$$ packed form
61875E641779l98654l59128l22985k90415k60870k34080k10296j89334j70259
61866C205758j52498j36433j22272j09227r6620q5038p5334o6979n8537m9660
61856B253160m1357l4224k7530k0539j3807q454m690j718J124L738N690O717O792
61843B124902N946M300K162J6j637k464k451j863r82J28J559L277N049O744Q494
61828B153180J0315J1697J1904J0866R353Q056O782M951K546J93j585k605k700
61815B222953j723M4K136M651Q245J3139J8675K4073K9181L4182L9120M4168M9862
61802B488706N6577O3982P1544P9279Q7552R6367J05441J14912J25352J37040
61792C426752J49754J63524J79192J97766K19424K43584K70105L00150L35550
$$ plain form
61783 5485801 5863174 6288676 6768348 7308906 7918363 8605426 9378338 10244141 11208329
61774 11208329 12274427 13443332 14712257 16072675 17507302 18987387 20471498 21905845
61766 21905845 23226197 24362817 25249260 25832942 26083313 25994885 25585402 24890900 23959424
61757 23959424 22844865 21601808 20281436 18928413 17579334 16263021 15001495 13810368
61749 13810368 12699075 11672120 10730860 9874338 9099140 8399752 7769792 7202927 6692934
61740 6692934 6233778 5820041 5446927 5109747 4803973 4526028 4273527 4044469 3836632
61731 3836632 3647922 3476676 3321142 3179143 3048724 2928718 2818222 2715858 2620138 2530285
61721 2530285 2446083 2367001 2292051 2220546 2152561 2088481 2028426 1972205 1919616 1870612 1825258
$$ packed form
61783E485801L77373M25502M79672N40558O09457O87063P72912Q65803R64188
61774A1208329J066098J168905J268925J360418J434627J480085J484111J434347
61766B1905845J320352J136620Q86443N83682K50371q8428m09483o94502r31476
61757B3959424j114559j243057j320372j353023j349079j316313j261526j191127
61749A3810368j111293j026955r41260q56522p75198o99388o29960n66865n09993
61740F692934m59156m13737l73114l37180l05774k77945k52501k29058k07837
61731C836632j88710j71246j55534j41999j30419j20006j10496j02364r5720q9853
61721B530285q4202p9082p4950p1505o7985o4080o0055n6221n2589m9004m5354
$$ plain form
61710 1825258 1783554 1745271 1709983 1677248 1646666 1617814 1590324 1564074 1539057 1515090 1491878
61699 1491878 1469366 1447593 1426162 1404390 1382232 1360549 1340075 1320482 1300874 1280837 1260543
61688 1260543 1240230 1220226 1201265 1184062 1168453 1153479 1138388 1123210 1108409 1094470 1081790
61677 1081790 1070462 1060001 1049688 1039327 1029366 1020270 1012189 1005238 999518 994632 989727 984407 979236
61664 979236 974984 971696 968946 966683 965261 964714 964493 964042 963304 962566 962093 961983 962108 962106 961577 960474 959175
61647 959175 958068 957150 956064 954494 952506 950534 948940 947464 945294 941986 938284 935636 934792 935159 935716
61632 935716 936156 936856 938078 939733 941811 944470 947612 950696 953047 954086 953266 950280 945454 939534 932850
61617 932850 925082 916113 906612 897414 888697 880349 872829 866907 862567 858896 855289 852137 849936 848212
$$ packed form
61710A825258m1704l8283l5288l2735l0582k8852k7490k6250k5017k3967k3212
61699A491878k2512k1773k1431k1772k2158k1683k0474j9593j9608k0037k0294
61688A260543k0313k0004j8961j7203j5609j4974j5091j5178j4801j3939j2680
61677A081790j1328j0461j0313j0361r961r096q081o951n720m886m905n320n171
61664I79236m252l288k750k263j422n47k21m51p38p38m73j10J25kn29j103j299
61647I59175j107r18j086j570j988j972j594j476k170l308l702k648q44L67N57
61632I35716M40P00J222J655K078K659L142L084K351J039q20k986m826n920o684
61617I32850p768q969r501r198q717q348p520n922m340l671l607l152k201j724
$$ plain form
61603 848212 845898 842596 838929 835661 832926 830482 828395 827102 826859 827291 827640 827429 826869 826638 827314 829066
61587 829066 831816 835533 840244 845867 852243 859441 867882 877959 889587 902359 916228 931791 949737
61574 949737 970191 992836 1017530 1044433 1073537 1104434 1136659 1170036 1204542 1240040 1276268
61563 1276268 1312908 1349573 1385875 1421560 1456412 1490052 1522100 1552631 1582157 1611112 1639531
61552 1639531 1667192 1693625 1717937 1739118 1756746 1770959 1781627 1788150 1790430 1789405 1786085 1780505
61540 1780505 1772158 1761026 1747549 1732067 1715054 1697657 1681112 1665698 1651007 1637275 1625690
61529 1625690 1617290 1612226 1610219 1611159 1615059 1622035 1632637 1647851 1668567 1695259 1728152 1767359 1812995
61516 1812995 1865631 1926589 1997224 2078055 2169236 2271830 2387855 2518983 2665958 2829478
$$ packed form
61603H48212k314l302l667l268k735k444k087j293k43M32L49k11n60k31O76J752
61587H29066K750L717M711N623O376P198Q441J0077J1628J2772J3869J5563J7946
61574I49737K0454K2645K4694K6903K9104L0897L2225L3377L4506L5498L6228
61563A276268L6640L6665L6302L5685L4852L3640L2048L0531K9526K8955K8419
61552A639531K7661K6433K4312K1181J7628J4213J0668O523K280j025l320n580
61540A780505q347j1132j3477j5482j7013j7397j6545j5414j4691j3732j1585
61529A625690q400n064k007R40L900O976J0602J5214K0716K6692L2893L9207M5636
61516A812995N2636O0958P0635Q0831R1181J02594J16025J31128J46975J63520
$$ plain form
61506 2829478 3010834 3211230 3431036 3669948 3927183 4200941 4487923 4783363 5080794
61497 5080794 5371493 5645022 5891141 6101225 6268158 6386266 6452512 6467435 6434325 6357726
61487 6357726 6243092 6097110 5927258 5740834 5544539 5344411 5145401 4951182 4764836
61478 4764836 4589418 4427427 4280156 4148251 4032596 3933923 3851805 3784906 3732246 3693629
61468 3693629 3668876 3657261 3657779 3669353 3690717 3720533 3757717 3801245 3849678 3901373 3955111 4010063
61456 4010063 4065194 4119317 4171839 4222984 4273155 4322552 4371530 4420769 4470880 4522241 4575406
61445 4575406 4631200 4690074 4751620 4814923 4879156 4943635 5007567 5069893 5129111 5183170 5230011
61434 5230011 5268551 5298842 5320890 5333606 5335398 5325713 5305573 5276633 5240142 5196958 5148185 5095478
$$ packed form
61506B829478J81356K00396K19806K38912K57235K73758K86982K95440K97431
61497E080794K90699K73529K46119K10084J66933J18108O6246J4923l3110p6599
61487F357726j14634j45982j69852j86424j96295k00128j99010j94219j86346
61478D764836j75418j61991j47271j31905j15655r8673q2118o6899n2660l8617
61468C693629k4753j1615N18J1574K1364K9816L7184M3528M8433N1695N3738N4952
61456D010063N5131N4123N2522N1145N0171M9397M8978M9239N0111N1361N3165
61445D575406N5794N8874O1546O3303O4233O4479O3932O2326N9218N4059M6841
61434E230011L8540L0291K2048J2716J792r685k0140k8940l6491m3184m8773n2707
$$ plain form
61422 5095478 5040800 4985973 4932291 4880424 4830913 4784935 4744338 4710522 4683429 4662047 4645888
61411 4645888 4635331 4630383 4629751 4631675 4635162 4639747 4644341 4647160 4646758 4642490 4634057 4621538 4606149 4590179
61397 4590179 4575672 4563652 4555004 4551494 4555421 4568828 4593701 4632605 4688328 4762975 4857884 4974277
61385 4974277 5113427 5276265 5463297 5674884 5911105 6171121 6452736 6752334 7064832
61376 7064832 7383701 7701237 8008682 8296013 8552338 8767698 8935077 9050921 9114208 9125675
61366 9125675 9087617 9003447 8876847 8711588 8512169 8284062 8032927 7763881 7481788 7191920
61356 7191920 6899797 6610218 6326614 6051406 5786803 5535044 5297788 5075577 4868205
61347 4868205 4675611 4498145 4336027 4189155 4057620 3941853 3841759 3756170 3683732 3624100
$$ packed form
61422E095478n4678n4827n3682n1867m9511m5978m0597l3816k7093k1382j6159
61411D645888j0557m948o32J924L487M585M594K819m02m268q433j2519j5389j5970
61397D590179j4507j2020q648l510L927J3407K4873L8904N5723P4647R4909J16393
61385D974277J39150J62838J87032K11587K36221K60016K81615K99598L12498
61376G064832L18869L17536L07445K87331K56325K15360J67379J15844O3287J1467
61366I125675l8058q4170j26600j65259j99419k28107k51135k69046k82093k89868
61356G191920k92123k89579k83604k75208k64603k51759k37256k22211k07372
61347D868205j92594j77466j62118j46872j31535j15767j00094q5589p2438n9632
$$ plain form
61337 3624100 3577612 3543957 3521971 3510786 3510391 3520673 3540408 3567630 3600725 3638789 3681147 3726863
61325 3726863 3774705 3823331 3871546 3918530 3963845 4007102 4047619 4084506 4117282 4146484 4173539
61314 4173539 4199767 4225413 4249796 4272363 4293210 4312419 4329316 4342743 4351818 4355989 4354541 4346625
61302 4346625 4331777 4310014 4281357 4245642 4202935 4153848 4099286 4040096 3977081 3911173 3843462
61291 3843462 3775128 3707413 3641624 3579051 3520750 3467263 3418611 3374812 3336435 3304268 3278264
61280 3278264 3257226 3239817 3225574 3214511 3206040 3198828 3191612 3183679 3174599 3164079 3152240 3139669
61268 3139669 3127031 3114829 3103585 3093998 3086842 3082855 3082682 3086728 3095134 3108219 3126958 3152845 3187279
61255 3187279 3231276 3285668 3351286 3428910 3519201 3622452 3737984 3863772 3996909 4134323
$$ packed form
61337C624100m6488l3655k1986j1185l95J0282J9735K7222L3095L8064M2358M5716
61325C726863M7842M8626M8215M6984M5315M3257M0517L6887L2776K9202K7055
61314D173539K6228K5646K4383K2567K0847J9209J6897J3427R075M171j448p916
61302D346625j4848k1763k8657l5715m2707m9087n4562n9190o3015o5908o7711
61291C843462o8334o7715o5789o2573n8301n3487m8652m3799l8377l2167k6004
61280C278264k1038j7409j4243j1063q471p212p216p933r080j0520j1839j2571
61268C139669j2638j2202j1244r587p156l987j73M046Q406J3085J8739K5887L4434
61255C187279M3997N4392O5618P7624R0291J03251J15532J25788J33137J37414
$$ plain form
61245 4134323 4272592 4407000 4531213 4638167 4721273 4775059 4795420 4779998 4728674 4643749
61235 4643749 4529599 4391828 4236294 4068558 3893856 3717024 3542066 3371872 3208564
61226 3208564 3054003 2909799 2776990 2655898 2546153 2446728 2356393 2274549 2201516 2137649
61216 2137649 2082351 2034268 1992250 1955787 1924702 1898840 1877968 1861628 1849239 1840631 1836228 1836258
61204 1836258 1839999 1846270 1854462 1864589 1876570 1890137 1905287 1921997 1939347 1955563 1969197 1979893
61192 1979893 1987953 1993594 1996776 1997232 1994493 1988259 1978904 1967243 1953658 1937762 1918992 1897165 1872479
61179 1872479 1845433 1816899 1787819 1758561 1728836 1698313 1667062 1635370 1603500 1571720 1540160
61168 1540160 1508601 1476724 1444593 1412495 1380294 1347550 1314471 1282199 1251810 1223331 1196071
$$ packed form
61245D134323J38269J34408J24213J06954Q3106N3786K0361j5422n1324q4925
61235D643749j14150j37771j55534j67736j74702j76832j74958j70194j63308
61226C208564j54561j44204j32809j21092j09745r9425r0335q1844p3033o3867
61216B137649n5298m8083m2018l6463l1085k5862k0872j6340j2389q608m403L0
61204A836258L741O271Q192J0127J1981J3567J5150J6710J7350J6216J3634J0696
61192A979893Q060N641L182M56k739o234r355j1661j3585j5896j8770k1827k4686
61179A872479k7046k8534k9080k9258k9725l0523l1251l1692l1870l1780l1560
61168A540160l1559l1877l2131l2098l2201l2744l3079l2272l0389k8479k7260
$$ plain form
61157 1196071 1169634 1144320 1120757 1099409 1080323 1063090 1046992 1031148 1014609 996642 977283
61146 977283 957465 938212 919768 901904 884895 869556 856238 844417 833505 823681 815599 809606
61134 809606 805498 802904 801780 802611 806013 811866 818981 826035 832813 840099 848402 857374 866579 876197
61120 876197 886700 898224 910551 923410 936583 949930 963464 977171 990733 1003737 1016200
61109 1016200 1028486 1040584 1051769 1061052 1067630 1070860 1070250 1065793 1058174 1048490 1037828 1026966 1016077
61096 1016077 1004742 992523 979560 966395 953304 940106 926505 912349 897716 883080 869169
61085 869169 856246 843819 831485 819681 808959 798926 788805 778850 770277 763730 758699 754545
61073 754545 751198 748696 746874 745836 745960 747164 748799 750482 752359 754326 755746 756273 756283 756156 755675 754480
$$ packed form
61157A196071k6437k5314k3563k1348j9086j7233j6098j5844j6539j7967j9359
61146I77283j9818j9253j8444j7864j7009j5339j3318j1821j0912r824q082n993
61134H09606m108k594j124Q31L402N853P115P054O778P286Q303Q972R205R618
61120H76197J0503J1524J2327J2859J3173J3347J3534J3707J3562J3004J2463
61109A016200J2286J2098J1185R283O578L230o10m457p619r684j0662j0862j0889
61096A016077j1335j2219j2963j3165j3091j3198j3601j4156j4633j4636j3911
61085H69169j2923j2427j2334j1804j0722j0033j0121r955q573o547n031m154
61073G54545l347k502j822j038J24J204J635J683J877J967J420N27J0j27m81j195
$$ plain form
61057 754480 752596 750311 748009 746187 745027 743900 741999 739569 737768 737252 737798 739400 742671 747786 754051
61042 754051 760958 768768 777557 786695 795885 805872 817369 829944 842624 854947 866896 878459 889963
61029 889963 902208 915595 929567 943374 956793 969682 981543 992155 1002061 1011810 1021272 1030204
61017 1030204 1038945 1048110 1058146 1069488 1082466 1096714 1111524 1127196 1145090 1165869 1188734 1213017
61005 1213017 1239534 1269662 1304149 1343552 1388697 1439597 1494882 1553376 1615475 1682070 1753225
60994 1753225 1829158 1911659 2003182 2105158 2218302 2343753 2482633 2635237 2802056 2985350
60984 2985350 3189070 3418627 3682263 3991859 4361062 4803497 5333512 5966365 6715763
60975 6715763 7594190 8620049 9823694 11242303 12907482 14834639 17007406 19345084
$$ packed form
61057G54480j884k285k302j822j160j127j901k430j801n16N46J602L271N115O265
61042G54051O907P810Q789R138R190R987J1497J2575J2680J2323J1949J1563J1504
61029H89963J2245J3387J3972J3807J3419J2889J1861J0612R906R749R462Q932
61017A030204Q741R165J0036J1342J2978J4248J4810J5672J7894K0779K2865K4283
61005A213017K6517L0128L4487L9403M5145N0900N5285N8494O2099O6595P1155
60994A753225P5933Q2501R1523J01976J13144J25451J38880J52604J66819J83294
60984B985350K03720K29557K63636L09596L69203M42435N30015O32853P49398
60975F715763Q78427J025859J203645J418609J665179J927157K172767K337678
$$ plain form
60967 19345084 21673020 23746956 25350724 26406503 27004290 27326908 27545778 27773187 28070957
60958 28070957 28449203 28828527 29024144 28814609 28063816 26792323 25139765 23268417 21299175
60949 21299175 19311360 17367329 15521070 13811537 12259713 10873049 9649475 8579730
60941 8579730 7651284 6851721 6167911 5584191 5084262 4654454 4283530 3960573 3675421
60932 3675421 3420783 3192071 2985410 2797302 2625726 2469782 2328121 2198876 2080798
60923 2080798 1973141 1874493 1782888 1697061 1616610 1541071 1469867 1403062 1341143 1283943 1230621
60912 1230621 1180727 1134533 1092289 1053824 1018898 987349 958914 933391 910880 891352 874201
60901 874201 858830 845465 834760 826740 820673 815800 811558 807340 802882 798779 795878 794068 792367
$$ packed form
60967A9345084K327936K073936J603768J055779N97787L22618K18870K27409K97770
60958B8070957L78246L79324J95617k09535p50793j271493j652558j871348j969242
60949B1299175j987815j944031j846259j709533j551824j386664j223574j069745
60941H579730r28446p99563o83810n83720m99929m29808l70924l22957k85152
60932C675421k54638k28712k06661j88108j71576j55944j41661j29245j18078
60923B080798j07657r8648r1605q5827q0451p5539p1204o6805o1919n7200n3322
60912A230621m9894m6194m2244l8465l4926l1549k8435k5523k2511j9528j7151
60901H74201j5371j3365j0705q020o067m873m242m218m458m103k901j810j701
$$ plain form
60888 792367 790215 787956 785872 783470 780062 775515 770037 763673 756401 748453 740148 731488 722252 712435
60874 712435 702391 692563 683257 674743 667374 661416 656719 652804 649431 646934 645782 645935 646944 648660
60860 648660 651529 656129 662638 670752 679853 689341 699162 709976 722388 735976 749555 762528 775532
60847 775532 789602 805168 822048 839863 858052 875763 892193 906951 919986 931323 941005 948977
60835 948977 954920 958475 959768 959474 958256 956369 953776 950272 945503 939268 931838 923565 914273 903672
60821 903672 892232 880829 869414 856981 843182 829033 815534 802533 789729 777934 768263 760474
60809 760474 753215 745758 738598 732267 726460 720630 714921 710127 706960 705528 705447 706297 707973 710567 714069
60794 714069 718440 723887 730618 738294 746175 754041 762548 772539 784423 798282 813896 830378 846476
$$ packed form
60888G92367k152k259k084k402l408m547n478o364p272p948q305q660r236r817
60874G12435j0044r828r306q514p369n958m697l915l373k497j152J53J009J716
60860F48660K869M600O509Q114R101R488R821J0814J2412J3588J3579J2973J3004
60847G75532J4070J5566J6880J7815J8189J7711J6430J4758J3035J1337R682P972
60835I48977N943L555J293k94j218j887k593l504m769o235p430q273r292j0601
60821I03672j1440j1403j1415j2433j3799j4149j3499j3001j2804j1795r671p789
60809G60474p259p457p160o331n807n830n709m794l167j432q1Q50J676K594L502
60794G14069M371N447O731P676P881P866Q507R991J1884J3859J5614J6482J6098
$$ plain form
60781 846476 861722 876683 891693 906050 919075 931297 943693 956207 967937 978486 988218 997229
60769 997229 1004987 1011115 1015806 1019318 1021606 1022692 1022940 1022737 1022159 1020984 1018816 1015240 1010170 1004048 997477
60754 997477 990762 984021 977481 971267 965070 958459 951466 944433 937434 930303 923162 916372 909874 903080
60740 903080 895615 887832 880457 873976 868524 864034 860250 856735 853154 849662 846891 845455 845384 846102 846995
60725 846995 847906 849022 850527 852655 855806 860071 864649 868387 870984 873141 875323 877047 877694 877447 876877
60710 876877 876045 874490 871853 868019 862944 856739 849722 842040 833554 824359 815006 805778 796193 785730
60696 785730 774651 763512 752230 740319 727846 715444 703475 691809 680412 669623 659818 651167
60684 651167 643691 637189 631277 625876 621461 618404 616323 614601 613350 613197 614298 616188 618580 621586
$$ packed form
60781H46476J5246J4961J5010J4357J3025J2222J2396J2514J1730J0549R732R011
60769I97229P758O128M691L512K288J086K48k03n78j175k168l576n070o122o571
60754I97477o715o741o540o214o197o611o993p033o999p131p141o790o498o794
60740I03080p465p783p375o481n452m490l784l515l581l492k771j436p1P18Q93
60725H46995R11J116J505K128L151M265M578L738K597K157K182J724O47k47n70
60710H76877q32j555k637l834n075o205p017p682q486r195r353r228r585j0463
60696G85730j1079j1139j1282j1911j2473j2402j1969j1666j1397j0789r805q651
60684F51167p476o502n912n401m415l057k081j722j251j53J101J890K392L006
$$ plain form
60670 621586 625125 628840 632793 637615 643636 650325 656886 663042 668885 674260 678746 682238 685283 688698
60656 688698 692833 697207 701056 704287 707738 712358 718367 725384 733103 741518 750645 760305 770073 779287
60642 779287 787386 794510 801528 809205 817595 826449 835751 845465 855248 864953 875016 885690 896195
60629 896195 905380 913004 919595 925170 928960 930524 930310 928847 926029 921539 915523 908497 900901 892933
60615 892933 884589 875725 866339 856892 848094 840373 833778 828352 824287 821762 820918 821896 824532 828182 832247
60600 832247 836780 842059 847679 852605 856129 858287 859411 859880 860307 861310 862948 864861 867012 869719 872893
60585 872893 875960 878721 881592 884743 887660 889931 891747 893109 893228 891491 888650 886210 884743 883478
60571 883478 881572 879168 876992 875394 874067 872462 870223 867322 863955 860242 855950 850594 843964 836489
$$ packed form
60670F21586L539L715L953M822O021O689O561O156N843N375M486L492L045L415
60656F88698M135M374L849L231L451M620O009P017P719Q415R127R660R768R214
60642G79287Q099P124P018P677Q390Q854R302R714R783R705J0063J0674J0505
60629H96195R185P624O591N575L790J564k14j463k818m490o016p026p596p968
60615H92933q344q864r386r447q798p721o595n426m065k525q44R78K636L650M065
60600H32247M533N279N620M926L524K158J124M69M27J003J638J913K151K707L174
60585H72893L067K761K871L151K917K271J816J362J19j737k841k440j467j265
60571H83478j906k404k176j598j327j605k239k901l367l713m292n356o630p475
$$ plain form
60557 836489 828966 821872 815122 808533 802346 797056 792864 789613 787231 785911 785803 786885 789273 793300
60543 793300 799121 806607 815858 827404 841653 858538 878107 901047 928040 958913 993017 1030200
60531 1030200 1070684 1113906 1157996 1200348 1238244 1269020 1290504 1301741 1303169 1295985 1281659 1261941
60519 1261941 1238781 1213923 1188774 1164655 1142805 1124033 1108666 1096923 1089026 1084786 1083361 1083593
60507 1083593 1084519 1085644 1087053 1089402 1093629 1100487 1110318 1123154 1138928 1157734 1179971 1206094 1236180
60494 1236180 1270168 1308708 1353279 1404965 1463442 1527590 1596778 1670981 1750027 1833598 1922148
60483 1922148 2017414 2122109 2239550 2373376 2526964 2702931 2903259 3129232 3380082 3651194
60473 3651194 3933529 4214298 4477837 4706963 4885558 5001243 5046370 5017967 4918472 4756488
$$ packed form
60557H36489p523p094o750o589o187n290m192l251k382j320j08J082K388M027
60543G93300N821P486R251J1546J4249J6885J9569K2940K6993L0873L4104L7183
60531A030200M0484M3222M4090M2352L7896L0776K1484J1237J428p184j4326j9718
60519A261941k3160k4858k5149k4119k1850j8772j5367j1743p897m240j425K32
60507A083593R26J125J409K349M227O858R831J2836J5774J8806K2237K6123L0086
60494A236180L3988L8540M4571N1686N8477O4148O9188P4203P9046Q3571Q8550
60483A922148R5266J04695J17441J33826J53588J75967K00328K25973K50850K71112
60473C651194K82335K80769K63539K29126J78595J15685M5127k8403r9495j61984
$$ plain form
60463 4756488 4545132 4298522 4029602 3750266 3471273 3200837 2944017 2703981 2483114
60454 2483114 2282551 2101813 1939929 1796319 1669995 1558793 1460452 1373947 1298849 1233809
60444 1233809 1176714 1126155 1081692 1042666 1007705 975686 946547 920720 898126 878002 859438
60433 859438 841815 824848 808473 792798 778139 764933 753440 743476 734589 726425 718744 711229
60421 711229 703710 696590 690684 686470 683733 681933 680594 679347 678077 677091 676691 676541 676002 675180 674998 675971
60405 675971 677525 678897 680080 681369 682583 683438 684365 686226 689273 692926 696551 699971 703228 706285 709114
60390 709114 711844 714689 717782 721032 724086 726480 727826 727847 726415 723858 721046 718701 716650 714234 711445
60375 711445 708987 707127 705235 702877 700647 699314 698636 697752 696485 695584 695688 696605 697711 698694 699757 701219
$$ packed form
60463D756488k11356k46610k68920k79336k78993k70436k56820k40036k20867
60454B483114k00563j80738j61884j43610j26324j11202r8341q6505p5098o5040
60444A233809n7095n0559m4463l9026l4961l2019k9139k5827k2594k0124j8564
60433H59438j7623j6967j6375j5675j4659j3206j1493r964q887q164p681p515
60421G11229p519p120n906m214k737j800j339j247j270r86m00j50n39q22j82R73
60405F75971J554J372J183J289J214Q55R27J861L047L653L625L420L257L057K829
60390G09114K730K845L093L250L054K394J346K1j432k557k812k345k051k416k789
60375G11445k458j860j892k358k230j333o78q84j267r01J04R17J106R83J063J462
$$ plain form
60359 701219 702968 704423 705207 705811 707216 709816 713158 716786 720813 725384 730137 734625 738898 743347 748294
60344 748294 754034 760759 768033 774852 780752 786430 792682 799153 804893 809854 814971 820805 826830 832181
60330 832181 836454 839651 841967 844003 846722 850801 856093 861849 867234 871534 874198 875083 874613 873445 871835
60315 871835 869412 865778 861297 857057 853920 851793 850070 848495 847203 846136 845069 844168 843843 843872 843433
60300 843433 842346 841606 842159 843669 845134 846260 847572 849482 851987 855163 859196 863847 868461 872703 876869
60285 876869 881312 885923 890354 894551 898931 904040 910101 916840 923848 931132 939073 947849 957229 967071
60271 967071 977621 989053 1001103 1013561 1026752 1041106 1056528 1072773 1090269 1109967 1132420
60260 1132420 1157500 1185058 1215363 1248790 1285495 1325599 1369488 1417773 1471133 1530187 1595312
$$ packed form
60359G01219J749J455P84O04J405K600L342L628M027M571M753M488M273M449M947
60344G48294N740O725P274O819N900N678O252O471N740M961N117N834O025N351
60330H32181M273L197K316K036K719M079N292N756N385M300K664Q85m70j168j610
60315H71835k423l634m481m240l137k127j723j575j292j067j067r01l25K9m39
60300H43433j087p40N53J510J465J126J312J910K505L176M033M651M614M242M166
60285H76869M443M611M431M197M380N109O061O739P008P284P941Q776R380R842
60271I67071J0550J1432J2050J2458J3191J4354J5422J6245J7496J9698K2453
60260A132420K5080K7558L0305L3427L6705M0104M3889M8285N3360N9054O5125
$$ plain form
60249 1595312 1666636 1744426 1829454 1922681 2024532 2134696 2252679 2378274 2511376 2651478
60239 2651478 2797324 2946804 3097069 3245016 3387991 3524127 3651924 3769533 3874603
60230 3874603 3964954 4039355 4097440 4138846 4162829 4169093 4158813 4134480 4098778 4054022 4002627
60219 4002627 3947475 3891466 3836991 3786117 3741088 3704344 3678089 3663873 3662498 3674340 3699991
60208 3699991 3740502 3796742 3868684 3955768 4057784 4174560 4304593 4444669 4591150 4740985
60198 4740985 4891110 5037678 5176619 5304586 5418756 5516138 5593919 5650400 5684962 5697217
60188 5697217 5686834 5654232 5600960 5529282 5441862 5341935 5233395 5120358 5006645 4895592
60178 4895592 4790121 4692861 4606230 4532399 4473208 4430249 4404870 4397826 4408938 4437428 4482526
$$ packed form
60249A595312P1324P7790Q5028R3227J01851J10164J17983J25595J33102J40102
60239B651478J45846J49480J50265J47947J42975J36136J27797J17609J05070
60230C874603R0351P4401N8085M1406K3983O264j0280k4333l5702m4756n1395
60219D002627n5152n6009n4475n0874m5029l6744k6255j4216j375J1842K5651
60208C699991M0511N6240P1942Q7084J02016J16776J30033J40076J46481J49835
60198D740985J50125J46568J38941J27967J14170R7382P7781N6481L4562J2255
60188E697217j0383l2602n3272p1678q7420r9927j08540j13037j13713j11053
60178D895592j05471r7260q6631p3831n9191m2959k5379p044J1112K8490M5098
$$ plain form
60167 4482526 4543174 4616989 4700153 4788723 4879639 4970127 5056662 5135212 5202405 5256151 5295424
60156 5295424 5319977 5330192 5326854 5311079 5284634 5250098 5210535 5169191 5129581 5095419 5070107
60145 5070107 5056559 5057616 5076055 5113794 5171553 5249829 5349936 5473672 5622476 5797496 6000185
60134 6000185 6232078 6493993 6785888 7107435 7458208 7837199 8242274 8669883 9115013
60125 9115013 9571476 10032475 10490886 10939152 11369448 11774248 12146438 12478925 12764867
60116 12764867 12998748 13176796 13296129 13354175 13349431 13282207 13154219 12968197 12728586 12442107
60106 12442107 12116919 11761640 11385654 10999500 10613650 10236909 9876533 9539347 9231680
60097 9231680 8958311 8722389 8526319 8371979 8260051 8189817 8159675 8167425 8210176 8284415
$$ packed form
60167D482526O0648P3815Q3164Q8570R0916R0488Q6535P8550O7193N3746L9273
60156E295424K4553J0215l338j5775k6445l4536l9563m1344l9610l4162k5312
60145E070107j3548J057J8439L7739N7759P8276J00107J23736J48804J75020K02689
60134F000185K31893K61915K91895L21547L50773L78991M05075M27609M45130
60125I115013M56463M60999M58411M48266M30296M04800L72190L32487K85942
60116A2764867K33881J78048J19333N8046m744o7224j27988j86022k39611k86479
60106A2442107l25188l55279l75986l86154l85850l76741l60376l37186l07667
60097I231680k73369k35922j96070j54340j11928p0234l0142P750M2751P4239
$$ plain form
60087 8284415 8385845 8508657 8645369 8788086 8929741 9063737 9183254 9282064 9355897 9402190
60077 9402190 9418864 9404412 9359036 9284543 9182936 9055795 8904966 8732966 8542759 8337843
60067 8337843 8122429 7900650 7675647 7450173 7227896 7013091 6809178 6618532 6443535
60058 6443535 6286649 6149392 6032478 5937193 5865511 5818602 5796263 5798088 5824036 5873467 5944746
60047 5944746 6036278 6146823 6274073 6413846 6561390 6712621 6863346 7008044 7140471 7255269
60037 7255269 7348551 7417527 7460242 7475263 7461097 7416360 7341129 7237847 7110426 6962858 6799115
60026 6799115 6623834 6442206 6259137 6078859 5905142 5741391 5590501 5454843 5336340
60017 5336340 5236478 5156425 5097226 5059662 5044061 5050687 5080320 5133937 5211778 5313277 5437952
$$ packed form
60087H284415J01430J22812J36712J42717J41655J33996J19517R8810P3833M6293
60077I402190J6674j4452m5376p4493j01607j27141j50829j72000j90207k04916
60067H337843k15414k21779k25003k25474k22277k14805k03913j90646j74997
60058F443535j56886j37257j16914r5285p1682m6909k2339J825K5948M9431P1279
60047E944746R1532J10545J27250J39773J47544J51231J50725J44698J32427J14798
60037G255269R3282O8976M2715J5021j4166m4737p5231j03282j27421j47568j63743
60026F799115j75281j81628j83069j80278j73717j63751j50890j35658j18503
60017E336340r9862q0053n9199l7564j5601O626K9633N3617P7841J01499J24675
$$ plain form
60006 5437952 5585569 5755102 5944063 6149061 6366186 6590330 6814810 7032510 7237265
59997 7237265 7423903 7587546 7723742 7829193 7901815 7940117 7943012 7910331 7843321 7744634 7618049
59986 7618049 7468228 7300672 7121664 6937722 6754528 6576387 6406988 6250512 6111359
59977 6111359 5992787 5896355 5822786 5772769 5746707 5744272 5764581 5806458 5868309 5948108 6043728
59966 6043728 6152920 6272806 6399845 6530518 6661793 6790804 6914496 7029830 7134053
59957 7134053 7224831 7300615 7361115 7407031 7439213 7458475 7466322 7465355 7458887 7450652 7445011 7446828 7460808
59944 7460808 7491207 7542267 7618468 7724182 7863440 8040037 8257345 8517797 8822802 9172907
59934 9172907 9567320 10003171 10475703 10978903 11504942 12042687 12577470 13092513 13570196
$$ packed form
60006E437952J47617J69533J88961K04998K17125K24144K24480K17700K04755
59997G237265J86638J63643J36196J05451P2622L8302K895l2681o7010r8687j26585
59986G618049j49821j67556j79008j83942j83194j78141j69399j56476j39153
59977F111359j18572r6432p3569n0017k6062k435K0309M1877O1851P9799R5620
59966F043728J09192J19886J27039J30673J31275J29011J23692J15334J04223
59957G134053R0778P5784O0500M5916L2182J9262P847r67o468q235n641J817J3980
59944G460808L0399N1060P6201J05714J39258J76597K17308K60452L05005L50105
59934I172907L94413M35851M72532N03200N26039N37745N34783N15043M77683
$$ plain form
59925 13570196 13992505 14342167 14604825 14770399 14832966 14790892 14647863 14413007 14099151 13720975
59915 13720975 13294265 12835038 12357896 11875348 11398829 10939213 10505442 10103475 9737488
59906 9737488 9411509 9128937 8891189 8698089 8549575 8446155 8387894 8373741 8401870 8469892
59896 8469892 8574622 8712144 8878228 9068278 9276712 9496356 9718141 9931281 10124201
59887 10124201 10285864 10406463 10477458 10492170 10447030 10341919 10179085 9962442 9698281 9395661
59877 9395661 9064927 8715752 8356646 7995412 7639011 7293149 6962640 6651847 6364082
59868 6364082 6100751 5861734 5646503 5454369 5283975 5133339 5000455 4883316 4779321
59859 4779321 4685107 4597242 4513030 4430928 4350540 4272302 4197091 4126114 4060830 4002370 3950891
$$ packed form
59925A3570196M22309L49662K62658J65574O2567m2074j43029k34856l13856l78176
59915A3720975m26710m59227m77142m82548m76519m59616m33771m01967l65987
59906I737488l25979k82572k37748j93100j48514j03420n8261j4153K8129O8022
59896H469892J04730J37522J66084J90050K08434K19644K21785K13140J92920
59887A0124201J61663J20599P0995J4712m5140j05111j62834k16643k64161l02620
59877I395661l30734l49175l59106l61234l56401l45862l30509l10793k87765
59868F364082k63331k39017k15231j92134j70394j50636j32884j17139j03995
59859D779321r4214q7865q4212q2102q0388p8238p5211p0977o5284n8460n1479
$$ plain form
59848 3950891 3905944 3867501 3835992 3811129 3791299 3774344 3758295 3741092 3720354 3694056 3661088
59837 3661088 3620996 3573927 3521194 3465167 3408029 3351110 3295694 3243590 3196355 3154744 3119564
59826 3119564 3092254 3073804 3063750 3061188 3066256 3079938 3102933 3135553 3178011 3229739 3288766 3352809
59814 3352809 3420885 3493139 3569380 3648608 3729588 3810883 3890247 3964672 4031111 4086933 4130286
59803 4130286 4160798 4179761 4189123 4190657 4186493 4179668 4173168 4168899 4168476 4174524 4190146 4217489 4258000
59790 4258000 4313935 4388422 4484091 4602734 4746514 4918613 5122382 5360558 5635413 5948842
59780 5948842 6301813 6693702 7121548 7578568 8052412 8524411 8970244 9361947 9671987
59771 9671987 9879217 9973746 9957709 9842453 9645058 9385408 9083305 8756250 8419095 8084697
$$ packed form
59848C950891m4947l8443l1509k4863j9830j6955j6049j7203k0738k6298l2968
59837C661088m0092m7069n2733n6027n7138n6919n5416n2104m7235m1611l5180
59826C119564k7310j8450j0054k562N068J3682K2995L2620M2458N1728N9027O4043
59814C352809O8076P2254P6241P9228Q0980Q1295P9364P4425O6439N5822M3353
59803D130286L0512J8963R362J534m164o825o500m269m23O048J5622K7343M0511
59790D258000N5935P4487R5669J18643J43780J72099K03769K38176K74855L13429
59780E948842L52971L91889M27846M57020M73844M71999M45833L91703L10040
59771I671987K07230R4529j6037j15256j97395k59650l02103l27055l37155l34398
$$ plain form
59761 8084697 7763646 7463367 7188451 6941933 6725647 6539706 6382989 6254556 6153976
59752 6153976 6080275 6031508 6005739 6001897 6019514 6058222 6117689 6197637 6297885 6418723 6561116
59741 6561116 6726100 6914285 7126543 7364833 7631617 7928766 8257918 8621609 9022935
59732 9022935 9464080 9946179 10470625 11039328 11653153 12310655 13008318 13740999 14501537
59723 14501537 15280395 16066088 16846012 17607540 18339802 19035494 19691469 20308469 20891207
59714 20891207 21448493 21992062 22534563 23088295 23664592 24272580 24917750 25601805 26323020
59705 26323020 27075213 27846195 28618336 29371198 30083435 30733344 31300226 31767142 32122802
59696 32122802 32361664 32484009 32496701 32412863 32249808 32027141 31766202 31489515 31219360 30976661
$$ packed form
59761H084697l21051l00279k74916k46518k16286j85941j56717j28433j00580
59752F153976p3701m8767k5769l842J7617L8708N9467P9948J00248J20838J42393
59741F561116J64984J88185K12258K38290K66784K97149L29152L63691M01326
59732I022935M41145M82099N24446N68703O13825O57502O97663P32681P60538
59723A4501537P78858P85693P79924P61528P32262O95692O55975O17000N82738
59714B0891207N57286N43569N42501N53732N76297O07988O45170O84055P21215
59705B6323020P52193P70982P72141P52862P12237O49909N66882M66916L55660
59696C2122802K38862J22345J2692q3838j63055k22667k60939k76687k70155k42699
$$ plain form
59686 30976661 30780763 30649068 30596402 30635436 30777858 31034132 31411840 31915263 32546816 33307386
59676 33307386 34194047 35197690 36302792 37487549 38722428 39968677 41179336 42302131
59668 42302131 43282382 44066377 44606736 44868601 44833899 44502566 43891688 43033181 41969840
59659 41969840 40750331 39424542 38040215 36640594 35262374 33933425 32670615 31478793
59651 31478793 30351497 29272761 28219758 27167452 26095382 24993282 23861809 22709093
59643 22709093 21547222 20390496 19253787 18150319 17090614 16083130 15134555 14248820
59635 14248820 13426696 12667063 11968198 11327817 10743046 10211094 9729331 9294247 8901165
59626 8901165 8545653 8224693 7936038 7677234 7445938 7240469 7059193 6899723 6759290
$$ packed form
59686C0976661j95898j31695n2666L9034J42422K56274L77708N03423O31553P60570
59676C3307386Q86661J003643J105102J184757J234879J246249J210659J122795
59668D2302131R80251P83995N40359K61865l4702l31333o10878q58507j063341
59659D1969840j219509j325789j384327j399621j378220j328949j262810j191822
59651C1478793j127296j078736j053003j052306j072070j102100j131473j152716
59643B2709093j161871j156726j136709j103468j059705j007484r48575q85735
59635A4248820q22124p59633o98865o40381n84771n31952m81763m35084l93082
59626H901165l55512l20960k88655k58804k31296k05469j81276j59470j40433
$$ plain form
59617 6759290 6635485 6526067 6428411 6339693 6257226 6178188 6099446 6018104 5931991 5839536 5739912
59606 5739912 5633569 5521859 5405612 5284911 5160734 5035831 4913024 4793372 4677055
59597 4677055 4565469 4461183 4366004 4280181 4203594 4136669 4079828 4032740 3994665 3965255 3944705
59586 3944705 3933189 3930204 3934511 3944739 3959925 3979218 4001269 4024548 4048391 4073157 4099147 4125976
59574 4125976 4153300 4181611 4211940 4245325 4282955 4326247 4376286 4433668 4499344 4575092 4662623
59563 4662623 4762680 4875632 5002555 5145057 5304299 5480858 5675464 5889327 6123697
59554 6123697 6379385 6656601 6954932 7273455 7610823 7964944 8332620 8709913 9092930
59545 9092930 9477738 9859628 10233376 10594688 10940776 11269345 11577993 11865320 12131944
$$ packed form
59617F759290j23805j09418r7656q8718q2467p9038p8742q1342q6113r2455r9624
59606E739912j06343j11710j16247j20701j24177j24903j22807j19652j16317
59597D677055j11586j04286r5179q5823p6587o6925n6841m7088l8075k9410k0550
59586C944705j1516k985M307J0228J5186J9293K2051K3279K3843K4766K5990K6829
59574D125976K7324K8311L0329L3385L7630M3292N0039N7382O5676P5748Q7531
59563D662623J00057J12952J26923J42502J59242J76559J94606K13863K34370
59554F123697K55688K77216K98331L18523L37368L54121L67676L77293L83017
59545I092930L84808L81890L73748L61312L46088L28569L08648K87327K66624
$$ plain form
59536 12131944 12379481 12608720 12819195 13010266 13182441 13338342 13482959 13622419 13761763
59527 13761763 13903912 14050494 14202352 14358232 14513453 14660450 14790103 14892140 14955416
59518 14955416 14969419 14925849 14818772 14644381 14401880 14094347 13727838 13309866 12849312 12356881
59508 12356881 11844000 11320874 10796086 10277510 9772315 9286009 8822458 8384964 7976447
59499 7976447 7598463 7251041 6933883 6647128 6390636 6163143 5962658 5787496 5636727
59490 5636727 5509735 5405456 5322086 5257810 5211977 5185256 5178389 5191267 5223532 5275565 5348226
59479 5348226 5442020 5557258 5694754 5855567 6040020 6247635 6478008 6731038 7006025 7300606
59469 7300606 7610405 7929326 8250332 8566186 8869220 9150254 9398563 9603783 9757835
$$ packed form
59536A2131944K47537K29239K10475J91071J72175J55901J44617J39460J39344
59527A3761763J42149J46582J51858J55880J55221J46997J29653J02037O3276
59518A4955416J4003m3570j07077j74391k42501l07533l66509m17972m60554m92431
59508A2356881n12881n23126n24788n18576n05195m86306m63551m37494m08517
59499G976447l77984l47422l17158k86755k56492k27493k00485j75162j50769
59490E636727j26992j04279q3370o4276m5833k6721o867J2878L2265N2033P2661
59479E348226R3794J15238J37496J60813J84453K07615K30373K53030K74987K94581
59469G300606L09799L18921L21006L15854L03034K81034K48309K05220J54052
$$ plain form
59460 9757835 9854875 9890484 9862305 9771406 9622090 9420357 9173166 8888767 8576269 8244239
59450 8244239 7900078 7550590 7202178 6860188 6528727 6211355 5911287 5630569 5369584
59441 5369584 5127755 4904406 4698932 4510701 4339217 4184112 4044826 3920474 3810095
59432 3810095 3712714 3627185 3552387 3487677 3432831 3387525 3351132 3322989 3302463 3288797 3281306
59421 3281306 3279697 3283771 3292717 3305228 3320457 3338553 3360085 3385280 3414081 3446782 3484251 3527191
59409 3527191 3574913 3624930 3674371 3722368 3771042 3824099 3884769 3955209 4037140 4132329 4242615
59398 4242615 4369954 4516081 4681482 4865061 5065873 5285528 5528520 5800258 6105319
59389 6105319 6447363 6829714 7255389 7726806 8245609 8812240 9425176 10080391 10771328
$$ packed form
59460I757835R7040L5609k8179r0899j49316k01733k47191k84399l12498l32030
59450H244239l44161l49488l48412l41990l31461l17372l00068k80718k60985
59441E369584k41829k23349k05474j88231j71484j55105j39286j24352j10379
59432C810095r7381q5529p4798o4710n4846m5306l6393k8143k0526j3666p491
59421C281306j609M074Q946J2511J5229J8096K1532K5195K8801L2701L7469M2940
59409C527191M7722N0017M9441M7997M8674N3057O0670P0440Q1931R5189J10286
59398D242615J27339J46127J65401J83579K00812K19655K42992K71738L05061
59389F105319L42044L82351M25675M71417N18803N66631O12936O55215O90937
$$ plain form
59380 10771328 11488971 12221884 12956751 13679613 14377306 15038602 15654829 16219994 16730539
59371 16730539 17185145 17584558 17930924 18226636 18473432 18672036 18821862 18920759 18965662 18953911
59361 18953911 18883705 18753453 18562149 18311597 18007980 17660500 17278900 16872965 16453499
59352 16453499 16031656 15616186 15211419 14817720 14433167 14054748 13678948 13302106 12920662
59343 12920662 12531613 12133387 11726402 11312604 10894761 10476587 10063016 9659407 9270266
59334 9270266 8898999 8548531 8221389 7919217 7642721 7392035 7166689 6965500 6787173
59325 6787173 6630812 6495197 6377825 6275516 6185866 6107200 6037088 5971914 5908273 5844216
59315 5844216 5779004 5712277 5643742 5573053 5499640 5422979 5343128 5260777 5176917 5092912 5010640
$$ packed form
59380A0771328P17643P32913P34867P22862O97693O61296O16227N65165N10545
59371A6730539M54606L99413L46366K95712K46796J98604J49826R8897M4903j1751
59361A8953911p0206j30252j91304k50552l03617l47480l81600m05935m19466
59352A6453499m21843m15470m04767l93699l84553l78419l75800l76842l81444
59343A2920662l89049l98226m06985m13798m17843m18174m13571m03609l89141
59334I270266l71267l50468l27142l02172k76496k50686k25346k01189j78327
59325F787173j56361j35615j17372j02309q9650p8666p0112o5174o3641o4057
59315E844216o5212o6727o8535p0689p3413p6661p9851q2351q3860q4005q2272
$$ plain form
59304 5010640 4931879 4857501 4787816 4723576 4665910 4615475 4572533 4537973 4513417 4500078 4498217
59293 4498217 4507883 4529488 4563439 4609955 4669648 4743751 4833422 4939159 5060962 5198619 5351818
59282 5351818 5520558 5705386 5906522 6122555 6350589 6587536 6830418 7075255 7316638
59273 7316638 7548724 7765857 7962046 8131021 8267552 8368039 8429282 8447706 8420910 8349736
59263 8349736 8238216 8091903 7916886 7719712 7506940 7284310 7056667 6828531 6604165
59254 6604165 6387146 6180327 5986186 5806762 5643273 5496340 5366822 5256171 5165761 5096008
59244 5096008 5046385 5016426 5006760 5019239 5056100 5119133 5209738 5329564 5480776 5665603 5885876
59233 5885876 6143039 6438441 6773428 7148983 7564819 8018246 8503579 9012415 9533982
$$ packed form
59304E010640p8761p4378o9685o4240n7666n0435m2942l4560k4556j3339j861
59293D498217R666K1605L3951M6516N9693P4103Q9671J05737J21803J37657J53199
59282E351818J68740J84828K01136K16033K28034K36947K42882K44837K41383
59273G316638K32086K17133J96189J68975J36531J00487O1243J8424k6796p1174
59263H349736j11520j46313j75017j97174k12772k22630k27643k28136k24366
59254F604165k17019k06819j94141j79424j63489j46933j29518j10651r0410o9753
59244E096008m9623k9959r666J2479L6861O3033R0605J19826J51212J84827K20273
59233E885876K57163K95402L34987L75555M15836M53427M85333N08836N21567
$$ plain form
59224 9533982 10055009 10559731 11030936 11451564 11805764 12079474 12261289 12343443 12322192 12197876
59214 12197876 11975355 11664178 11277431 10829809 10336597 9813592 9276459 8739167 8212894
59205 8212894 7706141 7225173 6774188 6355669 5971070 5620983 5304752 5020576 4766489
59196 4766489 4541036 4342788 4169476 4017881 3884669 3767376 3664685 3575659 3498596 3430899
59186 3430899 3370315 3316046 3268352 3227435 3193147 3165427 3144289 3129510 3120928 3118888 3123727 3134899
59174 3134899 3151316 3172558 3199057 3231040 3267922 3308828 3353034 3399746 3448086 3497470 3547356
59163 3547356 3596405 3642417 3683408 3718387 3746946 3768539 3782396 3787823 3784481 3772627 3753136 3727008
59151 3727008 3695002 3658008 3617524 3575232 3532252 3489257 3447039 3406397 3367759 3331682 3299526
$$ packed form
59224I533982N21027N04722M71205M20628L54200K73710J81815Q2154k1251j24316
59214A2197876k22521l11177l86747m47622m93212n23005n37133n37292n26273
59205H212894n06753m80968m50985m18519l84599l50087l16231k84176k54087
59196D766489k25453j98248j73312j51595j33212j17293j02691q9026p7063o7697
59186C430899o0584n4269m7694m0917l4288k7720k1138j4779q582k040M839J1172
59174C134899J6417K1242K6499L1983L6882M0906M4206M6712M8340M9384M9886
59163C547356M9049M6012M0991L4979K8559K1593J3857N427l342j1854j9491k6128
59151C727008l2006l6994m0484m2292m2980m2995m2218m0642l8638l6077l2156
$$ plain form
59140 3299526 3272869 3252355 3237845 3229477 3227735 3232764 3244635 3264145 3292236 3328674 3372550 3424228
59128 3424228 3485556 3557832 3640805 3734145 3838706 3955750 4085942 4229850 4388430 4562239
59118 4562239 4750893 4953994 5171913 5404861 5651815 5911030 6181055 6460495 6747199
59109 6747199 7038200 7329856 7617179 7893279 8150007 8378945 8571516 8718980 8813580 8850139
59099 8850139 8826639 8743800 8604623 8414134 8179039 7907402 7608293 7290880 6963147 6631330
59089 6631330 6300376 5974388 5656576 5349472 5055462 4776705 4514458 4269048 4040674
59080 4040674 3829625 3635567 3457318 3293622 3143586 3006201 2880128 2764233 2657709
59071 2657709 2559563 2468750 2384985 2308559 2239053 2175120 2115890 2061648 2012719 1968636 1928967
$$ packed form
59140C299526k6657k0514j4510q368j742N029J1871J9510K8091L6438M3876N1678
59128C424228O1328P2276Q2973R3340J04561J17044J30192J43908J58580J73809
59118D562239J88654K03101K17919K32948K46954K59215K70025K79440K86704
59109F747199K91001K91656K87323K76100K56728K28938J92571J47464R4600L6559
59099H850139k3500q2839j39177j90489k35095k71637k99109l17413l27733l31817
59089F631330l30954l25988l17812l07104k94010k78757k62247k45410k28374
59080D040674k11049j94058j78249j63696j50036j37385j26073j15895j06524
59071B657709r8146r0813q3765p6426o9506o3933n9230n4242m8929m4083l9669
$$ plain form
59060 1928967 1893930 1863446 1836448 1811918 1789836 1770301 1752499 1735430 1718956 1703091 1686832
59049 1686832 1668830 1648961 1628277 1607594 1587019 1566761 1547575 1530233 1515031 1501840 1490343
59038 1490343 1480386 1472388 1467195 1465186 1465889 1468744 1473890 1481879 1493064 1507603 1525559 1546481 1569295
59025 1569295 1593049 1617368 1641770 1664971 1685354 1701813 1713902 1721703 1725958 1727807 1728051 1727108 1725905
59012 1725905 1725995 1728338 1732798 1739354 1748897 1762006 1777737 1794613 1812214 1830747 1849484 1866688 1880973
58999 1880973 1891864 1899215 1902918 1903216 1900607 1895483 1888323 1880019 1871425 1862743 1853891 1845306 1837867 1832229
58985 1832229 1828675 1827371 1828223 1830705 1834350 1839258 1845843 1854396 1865263 1878902 1895195 1913182 1932158
58972 1932158 1952714 1975962 2002030 2030095 2059739 2091454 2125747 2162420 2200896 2240797 2282032
$$ packed form
59060A928967l5037l0484k6998k4530k2082j9535j7802j7069j6474j5865j6259
59049A686832j8002j9869k0684k0683k0575k0258j9186j7342j5202j3191j1497
59038A490343r957p998n193k009P03K855N146P989J1185J4539J7956K0922K2814
59025A569295K3754K4319K4402K3201K0383J6459J2089P801M255J849K44r43j203
59012A725905R0K343M460O556R543J3109J5731J6876J7601J8533J8737J7204J4285
58999A880973J0891P351L703K98k609n124p160q304q594q682q852q585p439n638
58985A832229l554j304Q52K482L645M908O585Q553J0867J3639J6293J7987J8976
58972A932158K0556K3248K6068K8065K9644L1715L4293L6673L8476L9901M1235
$$ plain form
58961 2282032 2324569 2368284 2412941 2458398 2504851 2552662 2601852 2652097 2703377 2756389 2812153
58950 2812153 2871523 2935159 3003588 3077167 3156308 3241696 3333924 3433061 3539284 3653764 3778082
58939 3778082 3912776 4057528 4212958 4381134 4563982 4762298 4976800 5209106 5461102
58930 5461102 5734373 6030962 6353800 6705714 7088943 7506264 7961537 8458280 8998634
58921 8998634 9584605 10219243 10905399 11643841 12433372 13271683 14154605 15074742 16021596
58912 16021596 16982184 17940262 18875338 19763620 20579963 21298893 21895630 22348799 22643334
58903 22643334 22771046 22729681 22523007 22161572 21661944 21044462 20331360 19545630 18709692
58894 18709692 17844111 16967105 16094347 15238615 14410114 13617451 12867414 12163428 11505585
$$ packed form
58961B282032M2537M3715M4657M5457M6453M7811M9190N0245N1280N3012N5764
58950B812153N9370O3636O8429P3579P9141Q5388R2228R9137J06223J14480J24318
58939C778082J34694J44752J55430J68176J82848J98316K14502K32306K51996
58930E461102K73271K96589L22838L51914L83229M17321M55273M96743N40354
58921H998634N85971O34638O86156P38442P89531Q38311Q82922R20137R46854
58912A6021596R60588R58078R35076Q88282Q16343P18930N96737M53169K94535
58903B2643334J27712m1365k06674l61435m99628o17482p13102p85730q35938
58894A8709692q65581q77006q72758q55732q28501p92663p50037p03986o57843
$$ plain form
58885 11505585 10893133 10325973 9802972 9320456 8873980 8460667 8078362 7723623 7392491
58876 7392491 7082761 6793721 6524050 6271689 6035517 5815502 5611151 5421214 5244803
58867 5244803 5081441 4930115 4789589 4659564 4540325 4431392 4331714 4240988 4159493 4086857
58857 4086857 4022343 3966092 3918672 3879529 3847419 3822295 3805287 3796716 3795562 3801082 3813556 3833284
58845 3833284 3860174 3894588 3937275 3988131 4046176 4111171 4184313 4267020 4359920 4463130 4576662
58834 4576662 4700551 4835555 4983682 5147029 5326179 5520921 5732504 5963879 6217646
58825 6217646 6495089 6797552 7127564 7488178 7882267 8312924 8783754 9298350 9859924
58816 9859924 10471251 11134017 11848123 12612182 13424165 14280185 15172429 16089013 17015387
$$ packed form
58885A1505585o12452n67160n23001m82516m46476m13313l82305l54739l31132
58876G392491l09730k89040k69671k52361k36172k20015k04351j89937j76411
58867E244803j63362j51326j40526j30025j19239j08933r9678r0726q1495p2636
58857D086857o4514n6251m7420l9143l2110k5124j7008q571j154N520J2474J9728
58845C833284K6890L4414M2687N0856N8045O4995P3142Q2707R2900J03210J13532
58834D576662J23889J35004J48127J63347J79150J94742K11583K31375K53767
58825F217646K77443L02463L30012L60614L94089M30657M70830N14596N61574
58816I859924O11327O62766P14106P64059Q11983Q56020Q92244R16584R26374
$$ plain form
58807 17015387 17934480 18825523 19664322 20425418 21083837 21616042 22001947 22227706 22286695
58798 22286695 22178630 21909302 21491084 20941828 20282151 19533796 18719447 17861549 16979962
58789 16979962 16091125 15209224 14346649 13512904 12714284 11955122 11238547 10566047 9937584
58780 9937584 9352576 8809982 8307539 7842188 7411477 7013558 6645861 6305059 5988401
58771 5988401 5693907 5419302 5162216 4921532 4697076 4487813 4291786 4107963 3936532
58762 3936532 3777070 3628068 3488684 3359348 3240082 3129755 3027576 2933807 2848328 2769982
58752 2769982 2698042 2632929 2574682 2522095 2474147 2430919 2392296 2357092 2324486 2295125 2269773
58741 2269773 2247852 2228162 2210026 2192827 2175428 2157000 2137581 2117031 2094389 2069152 2042320
$$ packed form
58807A7015387R19093Q91043Q38799P61096O58419N32205L85905K25759N8989
58798B2286695j08065k69328m18218n49256o59677p48355q14349q57898q81587
58789A6979962q88837q81901q62575q33745p98620p59162p16575o72500o28463
58780I937584n85008n42594n02443m65351m30711l97919l67697l40802l16658
58771E988401k94494k74605k57086k40684k24456k09263j96027j83823j71431
58762C936532j59462j49002j39384j29336j19266j10327j02179r3769q5479p8346
58752B769982p1940o5113n8247n2587m7948m3228l8623l5204l2606k9361k5352
58741B269773k1921j9690j8136j7199j7399j8428j9419k0550k2642k5237k6832
$$ plain form
58730 2042320 2015201 1987836 1959440 1929690 1898681 1866171 1831700 1795240 1757256 1718444 1679682
58719 1679682 1641648 1604261 1567028 1530127 1494466 1460626 1428535 1398247 1370105 1344033 1319580
58708 1319580 1296765 1275904 1256657 1238405 1221572 1207320 1195809 1186124 1177986 1172006 1167952 1164280
58696 1164280 1159840 1154631 1148556 1141032 1132310 1123459 1114356 1103290 1089392 1073991 1058759 1044000 1029651
58683 1029651 1016387 1004643 993812 983477 974291 966652 959741 952941 947057 943140 941113 940507 941467
58670 941467 943999 947243 950483 954016 958209 962662 967134 972228 978210 984086 988792 992484 995904 999356
58656 999356 1002994 1007191 1011878 1016457 1020963 1026364 1033161 1040790 1048989 1058535 1070032 1083162 1097692
58643 1097692 1113964 1131848 1150672 1170888 1194268 1221684 1252181 1285044 1321130 1361250 1404922
$$ packed form
58730B042320k7119k7365k8396k9750l1009l2510l4471l6460l7984l8812l8762
58719A679682l8034l7387l7233l6901l5661l3840l2091l0288k8142k6072k4453
58708A319580k2815k0861j9247j8252j6833j4252j1511r685q138n980m054l672
58696A164280m440n209o075p524q722q851r103j1066j3898j5401j5232j4759j4349
58683A029651j3264j1744j0831j0335r186p639o911o800n884l917k027o06R60
58670I41467K532L244L240L533M193M453M472N094N982N876M706L692L420L452
58656I99356L638M197M687M579M506N401O797P629Q199R546J1497J3130J4530
58643A097692J6272J7884J8824K0216K3380K7416L0497L2863L6086M0120M3672
$$ plain form
58632 1404922 1451955 1503725 1561697 1626028 1696789 1775180 1862430 1958949 2065697 2184916 2318301
58621 2318301 2465934 2628259 2807411 3005070 3220509 3452299 3700376 3964520 4241798
58612 4241798 4526952 4813935 5095263 5360995 5600309 5803714 5962922 6070274 6120468 6112448
58602 6112448 6048630 5933445 5773776 5579101 5359092 5121515 4873329 4622062 4374250 4133738
58592 4133738 3903152 3685790 3484306 3298862 3128581 2973887 2835644 2713190 2605149
58583 2605149 2511083 2430349 2360341 2297983 2242121 2192535 2147483 2104328 2061870 2020123 1978611
58572 1978611 1936943 1896323 1858403 1823203 1790001 1759471 1732851 1709668 1688359 1668532 1650460
58561 1650460 1632908 1613686 1592075 1568689 1543337 1515129 1484498 1453119 1421899 1390789 1360264
$$ packed form
58632A404922M7033N1770N7972O4331P0761P8391Q7250R6519J06748J19219J33385
58621B318301J47633J62325J79152J97659K15439K31790K48077K64144K77278
58612D241798K85154K86983K81328K65732K39314K03405J59208J07352N0194q020
58602F112448o3818j15185j59669j94675k20009k37577k48186k51267k47812k40512
58592D133738k30586k17362k01484j85444j70281j54694j38243j22454j08041
58583B605149r4066q0734p0008o2358n5862m9586m5052m3155m2458m1747m1512
58572A978611m1668m0620l7920l5200l3202l0530k6620k3183k1309j9827j8072
58561A650460j7552j9222k1611k3386k5352k8208l0631l1379l1220l1110l0525
$$ plain form
58550 1360264 1331129 1303087 1275312 1248299 1223473 1201164 1180515 1161078 1142942 1125750 1109145
58539 1109145 1093724 1079911 1066525 1052211 1037707 1024858 1013888 1003480 992993 982701 972364
58528 972364 961578 951144 942123 933867 924847 914992 905388 896231 887063 878429 871174 864610 857530 850577
58514 850577 845328 841559 837837 834499 833402 834747 836707 838386 840740 844332 848502 853166 859256 866867
58500 866867 874905 883013 892053 902410 913514 925248 937993 951139 963285 974055 983952 992412
58488 992412 997939 1000294 1000683 999586 996323 990993 984977 979086 972839 965786 957996 949170 938870 927746
58474 927746 916970 906559 895849 885380 876471 869090 862100 855506 850409 846610 842334 836612 830190
58461 830190 823914 817927 812544 808173 804256 799902 795572 792526 790782 789342 788209 788343 789786 791720
$$ packed form
58550A360264k9135k8042k7775k7013k4826k2309k0649j9437j8136j7192j6605
58539A109145j5421j3813j3386j4314j4504j2849j0970j0408j0487j0292j0337
58528I72364j0786j0434r021q256r020r855r604r157r168q634p255o564p080o953
58514H50577n249l769l722l338j097J345J960J679K354L592M170M664O090P611
58500H66867Q038Q108R040J0357J1104J1734J2745J3146J2146J0770R897Q460
58488I92412N527K355L89j097l263n330o016n891o247p053p790q826j0300j1124
58474I27746j0776j0411j0710j0469q909p381o990o594n097l799m276n722o422
58461H30190o276n987n383m371l917m354m330l046j744j440j133J34J443J934
$$ plain form
58447 791720 794244 798303 804034 810899 819084 828913 839359 849200 859186 870926 884102 896960 909006
58434 909006 920768 931418 939254 944285 947757 949407 947855 943510 938295 932624 925428 917105 909511 902910
58420 902910 895865 888440 882678 879515 877915 877375 878623 881510 884916 889071 895405 903805 912630 921550
58406 921550 931634 942545 952548 961427 970395 978914 984719 987376 988694 989217 987543 983617 979451 975869
58392 975869 971652 966551 962064 958604 955102 952054 951629 953995 956769 958914 961934 966480 971261 976211
58378 976211 983193 992404 1001485 1009337 1017515 1026702 1035303 1042707 1050480 1058997 1066462 1072595 1079725 1088651
58364 1088651 1096991 1103337 1109581 1117352 1125566 1133301 1141694 1151056 1159449 1166231 1173846 1184130 1195783
58351 1195783 1207331 1219368 1231903 1242674 1250253 1255978 1260911 1263897 1264487 1264750 1266186 1267812 1269097
$$ packed form
58447G91720K524M059N731O865Q185R829J0446R841R986J1740J3176J2858J2046
58434I09006J1762J0650P836N031L472J650j552m345n215n671p196q323p594o601
58420I02910p045p425n762l163j600n40J248K887L406M155O334Q400Q825Q920
58406I21550J0084J0911J0003Q879Q968Q519N805K657J318N23j674l926m166l582
58392I75869m217n101m487l460l502l048m25K366K774K145L020M546M781M950
58378I76211O982R211R081P852Q178R187Q601P404P773Q517P465O133P130Q926
58364A088651Q340O346O244P771Q214P735Q393R362Q393O782P615J0284J1653
58351A195783J1548J2037J2535J0771P579N725M933K986N90K63J436J626J285
$$ plain form
58338 1269097 1271695 1276348 1281201 1285177 1290021 1297106 1305238 1313471 1323020 1334540 1346612 1358633 1371997
58325 1371997 1386775 1400674 1413024 1426275 1441779 1457667 1472701 1488409 1505611 1522733 1539541
58314 1539541 1558410 1579741 1600264 1618062 1635056 1652274 1667256 1678804 1689731 1701982 1713490
58303 1713490 1722897 1732903 1745620 1758929 1770830 1783249 1798156 1814037 1829547 1846503 1865973
58292 1865973 1885674 1904559 1925576 1950440 1976283 2000990 2027124 2056731 2087124 2115972 2145854
58281 2145854 2179437 2214793 2249901 2287195 2329111 2373589 2418445 2465543 2516101 2566572 2613971
58270 2613971 2660636 2708980 2756328 2799887 2841990 2885403 2928385 2969512 3012320 3059775 3109207
58259 3109207 3158057 3209393 3266260 3326071 3386357 3450384 3521020 3594762 3668229 3744802 3828318
$$ packed form
58338A269097K598M653M853L976M844P085Q132Q233R549J1520J2072J2021J3364
58325A371997J4778J3899J2350J3251J5504J5888J5034J5708J7202J7122J6808
58314A539541J8869K1331K0523J7798J6994J7218J4982J1548J0927J2251J1508
58303A713490R407J0006J2717J3309J1901J2419J4907J5881J5510J6956J9470
58292A865973J9701J8885K1017K4864K5843K4707K6134K9607L0393K8848K9882
58281B145854L3583L5356L5108L7294M1916M4478M4856M7098N0558N0471M7399
58270B613971M6665M8344M7348M3559M2103M3413M2982M1127M2808M7455M9432
58259C109207M8850N1336N6867N9811O0286O4027P0636P3742P3467P6573Q3516
$$ plain form
58248 3828318 3916060 4004764 4097508 4197577 4301677 4406596 4516401 4635471 4760761 4888730
58238 4888730 5023295 5168804 5321975 5479322 5645511 5825521 6015839 6212682 6421389
58229 6421389 6647979 6889301 7141692 7411088 7703862 8016455 8345513 8699114 9085754
58220 9085754 9501894 9943536 10420016 10942258 11508183 12115268 12776633 13508141 14311148
58211 14311148 15186216 16152144 17232325 18435342 19771079 21273593 22985787 24936931
58203 24936931 27163164 29738164 32758486 36318590 40536592 45591221 51698382 59066343
58195 59066343 67906777 78460690 90965660 105634524 122741155 142701596 165967978
58188 165967978 192793689 223032966 255859811 289235214 319559357 342375625 354191961
$$ packed form
58248C828318Q7742Q8704R2744J00069J04100J04919J09805J19070J25290J27969
58238D888730J34565J45509J53171J57347J66189J80010J90318J96843K08707
58229F421389K26590K41322K52391K69396K92774L12593L29058L53601L86640
58220I085754M16140M41642M76480N22242N65925O07085O61365P31508Q03007
58211A4311148Q75068R65928J080181J203017J335737J502514J712194J951144
58203B4936931K226233K575000L020322L560104M218002N054629O107161P367961
58195E9066343Q840434J0553913J2504970J4668864J7106631J9960441K3266382
58188A65967978K6825711L0239277L2826845L3375403L0324143K2816268J1816336
$$ plain form
58181 354191961 354114520 343884720 326437241 304422759 279744837 253841771 227930704
58174 227930704 202975477 179631207 158292922 139146654 122195908 107336147 94445796
58167 94445796 83396633 74013868 66091856 59452298 53950642 49438921 45770977 42843529
58159 42843529 40592804 38954434 37868225 37322222 37349007 37969472 39168053 40902374 43049652
58150 43049652 45289475 47089840 47908219 47470050 45875049 43457238 40560417 37419697
58142 37419697 34181876 30966471 27883408 25012624 22393023 20036257 17942057 16099634
58134 16099634 14487696 13083502 11869351 10826913 9931659 9158934 8490828 7911769 7402738
58125 7402738 6946487 6534309 6161266 5818648 5497609 5196481 4917467 4658840 4416746
$$ packed form
58181C54191961p7441j0229800j7447479k2014482k4677922k5903066k5911067
58174B27930704k4955227k3344270k1338285j9146268j6950746j4859761j2890351
58167I4445796j1049163r382765p922012o639558n501656m511721l667944k927448
58159D2843529k250725j638370j086209n46003K6785O20465J198581J734321K147278
58150D3049652K239823J800365Q18379m38169j595001k417811k896821l140720
58142C7419697l237821l215405l083063k870784k619601k356766k094200j842423
58134A6099634j611938j404194j214151j042438q95254p72725o68106n79059n09031
58125G402738m56251m12178l73043l42618l21039l01128k79014k58627k42094
$$ plain form
58116 4416746 4191733 3986655 3800106 3628070 3470096 3327873 3199380 3079892 2967007
58107 2967007 2859778 2755319 2651616 2551500 2458534 2371166 2286088 2204693 2130488 2062448
58097 2062448 1996895 1934053 1876758 1824263 1773178 1723313 1676909 1633212 1589314 1545554 1504824
58086 1504824 1467353 1431123 1396456 1365117 1335730 1305147 1273785 1244873 1219084 1194449 1170753
58075 1170753 1149366 1129450 1109044 1089229 1072714 1058963 1045192 1031457 1020111 1010907 1001366 991516
58063 991516 983594 977309 970061 961715 954633 948945 942155 933515 924645 915780 905548 894523 884933 876728
58049 876728 867886 858563 850909 844796 837918 830213 824039 819722 815150 810168 807138 806522 806006 804796 804808
58034 804808 806632 808259 808931 810557 814016 817459 819617 821630 824281 826438 827557 828934 831266 833520
$$ packed form
58116D416746k25013k05078j86549j72036j57974j42223j28493j19488j12885
58107B967007j07229j04459j03703j00116r2966q7368q5078q1395p4205o8040
58097B062448o5553o2842n7295n2495n1085m9865m6404m3697m3898m3760m0730
58086A504824l7471l6230l4667l1339k9387l0583l1362k8912k5789k4635k3696
58075A170753k1387j9916k0406j9815j6515j3751j3771j3735j1346r204r541r850
58063I91516p922o285p248q346p082n688o790q640q870q865j0232j1025r590q205
58049H76728q842r323p654o113o878p705o174m317m572m982l030o16n16j210J2
58034H04808J824J627O72J626L459L443K158K013K651K157J119J377K332K254
$$ plain form
58020 833520 835246 837438 840139 841783 841913 842104 843194 843925 843273 841882 840374 838411 836168 834625 833761
58005 833761 832488 830760 829577 828635 826364 822685 819259 816591 813411 809324 805490 802046 797604 792094
57991 792094 787536 784993 783168 780965 779075 777998 776827 775158 774111 774313 774764 774761 775166 776772 779131 781797
57975 781797 785027 788479 791041 792653 794610 797340 799679 800934 801804 802608 802548 801503 800631 800336 799452 797370
57959 797370 795242 794095 793310 791902 789877 787537 784816 781965 779530 777232 774389 771818 771581 774237 778111
57944 778111 781887 786179 791770 798013 803842 808850 812625 814542 814924 814963 814864 813519 810541 806991 803380
57929 803380 798650 791984 784207 776531 769157 761812 754443 746932 739393 733081 729537 728464 728023 727512 728043
57914 728043 730181 732888 735497 738889 743791 749590 755671 762413 770066 778087 786308 795290 804862 813871
$$ packed form
58020H33520J726K192K701J644J30J91J090P31o52j391j508j963k243j543q64
58005H33761j273j728j183r42k271l679l426k668l180m087l834l444m442n510
57991G92094m558k543j825k203j890j077j171j669j047K02M51lM05J606K359K666
57975G81797L230L452K562J612J957K730K339J255Q70Q04o0j045q72k95q84k082
57959G97370k128j147p85j408k025k340k721k851k435k298k843k571k37K656L874
57944G78111L776M292N591O243N829N008L775J917L82L9r9j345k978l550l611
57929H03380m730o666p777p676p374p345p369p511p539o312l544j073m41n11N31
57914G28043K138K707K609L392M902N799O081O742P653Q021Q221Q982R572R009
$$ plain form
57900 813871 822002 830248 838967 847110 854026 860318 866270 871270 875479 880099 885002 888086 888077 886219 884073
57885 884073 881412 877519 872830 867973 862777 857538 853655 851662 850153 848000 846106 845561 845678 845481 845746
57870 845746 847816 851526 855936 861132 867725 875447 883589 891943 900076 906767 911578 915918 921096 926340
57856 926340 930192 932801 935165 937028 937375 936415 935393 934751 934006 933148 932771 932972 933236 933198 932673 931357 929434
57839 929434 927938 927616 927949 928179 928556 929564 930627 930791 930100 929166 927855 925566 922357 918647 914180 908411
57823 908411 901667 894905 888453 881926 875161 868407 861748 855048 848371 841953 836035 831050 827464 825003
57809 825003 822692 820114 817966 816837 816317 815932 816100 817385 819569 822311 826024 831273 837979 846001 855722
57794 855722 867169 879231 890724 901672 912735 923958 934912 945487 955745 965479 974615 983439
$$ packed form
57900H13871Q131Q246Q719Q143O916O292N952N000M209M620M903L084rj858k146
57885H84073k661l893m689m857n196n239l883j993j509k153j894n45J17j97K65
57870H45746K070L710M410N196O593P722Q142Q354Q133O691M811M340N178N244
57856I26340L852K609K364J863L47r60j022o42p45q58l77K01K64l8n25j316j923
57839I29434j496l22L33K30L77J008J063J64o91r34j311k289l209l710m467n769
57823I08411o744o762o452o527o765o754o659o700o677o418n918m985l586k461
57809H25003k311k578k148j129n20l85J68J285K184K742L713N249O706Q022R721
57794H55722J1447J2062J1493J0948J1063J1223J0954J0575J0258R734R136Q824
$$ plain form
57782 983439 991781 998718 1003726 1007316 1009822 1010524 1008865 1005691 1002284 998914 995310 991819 989093 987248
57768 987248 986215 986143 986681 986769 986165 986269 988323 991689 995123 998884 1004122 1010865 1018061 1025182 1032410 1039567
57752 1039567 1046159 1052275 1058385 1064503 1070560 1077145 1084833 1093152 1101216 1108945 1116703 1124288 1131399 1138587
57738 1138587 1146590 1155134 1163521 1171952 1181143 1191054 1201198 1211745 1223145 1235020 1246667 1258365
57726 1258365 1271021 1284889 1299710 1315691 1333121 1351404 1369738 1388368 1407992 1428367 1448947
57715 1448947 1470477 1494391 1520776 1548441 1576971 1607256 1639870 1674403 1710678 1749493 1791874
57704 1791874 1838555 1890252 1947545 2010520 2079512 2156074 2242186 2338712 2445814 2564712 2697721
57693 2697721 2846554 3011789 3194044 3394446 3613740 3851913 4108549 4382156 4668847
$$ packed form
57782I83439Q342O937N008L590K506P02j659l174l407l370l604l491k726j845
57768I87248j033p2N38Q8o04J04K054L366L434L761N238O743P196P121P228P157
57752A039567O592O116O110O118O057O585P688Q319Q064P729P758P585P111P188
57738A138587Q003Q544Q387Q431R191R911J0144J0547J1400J1875J1647J1698
57726A258365J2656J3868J4821J5981J7430J8283J8334J8630J9624K0375K0580
57715A448947K1530K3914K6385K7665K8530L0285L2614L4533L6275L8815M2381
57704A791874M6681N1697N7293O2975O8992P6562Q6112R6526J07102J18898J33009
57693B697721J48833J65235J82255K00402K19294K38173K56636K73607K86691
$$ plain form
57684 4668847 4962538 5256231 5541855 5808996 6045561 6240683 6386807 6479805 6519089 6508178
57674 6508178 6453869 6364147 6247419 6113300 5972129 5832440 5698854 5571590 5446356 5315041
57664 5315041 5169301 5005606 4826886 4639323 4448769 4260254 4078740 3908409 3751548
57655 3751548 3609001 3481251 3368615 3271008 3188205 3119883 3065006 3021776 2988627 2964886 2950314
57644 2950314 2944669 2947936 2960297 2981590 3011437 3050092 3098460 3157228 3226796 3308211 3403233 3513205
57632 3513205 3638652 3780193 3938888 4115338 4309220 4519797 4745778 4984186 5230192
57623 5230192 5478215 5722007 5953212 6161122 6334879 6465746 6547478 6576349 6552074 6478092
57613 6478092 6360018 6204162 6017693 5808933 5586216 5356585 5125887 4899231 4680589
$$ packed form
57684D668847K93691K93693K85624K67141K36565J95122J46124R2998L9284j0911
57674F508178n4309q9722j16728j34119j41171j39689j33586j27264j25234j31315
57664E315041j45740j63695j78720j87563j90554j88515j81514j70331j56861
57655C751548j42547j27750j12636r7607q2803o8322n4877m3230l3149k3741j4572
57644B950314n645L267J2361K1293K9847L8655M8368N8768O9568Q1415R5022J09972
57632C513205J25447J41541J58695J76450J93882K10577K25981K38408K46006
57623E230192K48023K43792K31205K07910J73757J30867Q1732K8871k4275p3982
57613F478092j18074j55856j86469k08760k22717k29631k30698k26656k18642
$$ plain form
57604 4680589 4472516 4276834 4095023 3927479 3773226 3631207 3501330 3383657 3277274
57595 3277274 3180731 3093122 3013997 2942700 2878443 2820641 2768629 2721525 2678878 2640900 2607479
57584 2607479 2577536 2550019 2524909 2502563 2482634 2464433 2447887 2433329 2420748 2410010 2401502
57573 2401502 2395683 2392230 2390297 2389435 2389702 2391146 2393836 2398098 2404041 2411193 2419307 2429208 2441970 2457412
57559 2457412 2474266 2491771 2510267 2530212 2551528 2574253 2599085 2626837 2657729 2691653 2728866
57548 2728866 2770085 2815943 2866574 2921797 2981748 3047390 3120335 3202108 3293591 3395189 3507323
57537 3507323 3630644 3765957 3914000 4075142 4249140 4435226 4632228 4838059 5048859
57528 5048859 5258881 5461369 5649350 5815697 5953159 6055104 6116579 6135089 6111051 6047826
$$ packed form
57604D680589k08073j95682j81811j67544j54253j42019j29877j17673j06383
57595C277274r6543q7609p9125p1297o4257n7802n2012m7104m2647l7978l3421
57584B607479k9943k7517k5110k2346j9929j8201j6546j4558j2581j0738q508
57573B401502n819l453j933q62K67J444K690M262N943P152Q114R901J2762J5442
57559B457412J6854J7505J8496J9945K1316K2725K4832K7752L0892L3924L7213
57548B728866M1219M5858N0631N5223N9951O5642P2945Q1773R1483J01598J12134
57537C507323J23321J35313J48043J61142J73998J86086J97002K05831K10800
57528E048859K10022K02488J87981J66347J37462J01945O1475J8510k4038o3225
$$ plain form
57518 6047826 5950929 5826769 5681911 5523000 5356413 5187447 5020071 4857585 4703055 4558815
57508 4558815 4425887 4304190 4193156 4092201 4001127 3920301 3850025 3789562 3737303 3692096
57498 3692096 3653939 3623103 3599113 3580972 3567924 3559623 3555966 3557217 3563940 3576374 3594079 3616486
57486 3616486 3643603 3676032 3714686 3760663 3814932 3877791 3949023 4028905 4118696 4219896 4333415
57475 4333415 4459722 4599318 4752503 4918911 5097462 5286445 5483255 5684123 5884078
57466 5884078 6076755 6254278 6408096 6530482 6615315 6658066 6656416 6611554 6528155 6412484
57456 6412484 6270829 6109655 5935879 5755892 5574678 5396335 5224695 5062664 4911564
57447 4911564 4771884 4644133 4528267 4423067 4327218 4240679 4164026 4096785 4037426 3984794
$$ packed form
57518F047826r6897j24160j44858j58911j66587j68966j67376j62486j54530j44240
57508D558815j32928j21697j11034j00955r1074q0826p0276o0463n2259m5207
57498C692096l8157l0836k3990j8141j3048q301l657J251O723J2434J7705K2407
57486C616486K7117L2429L8654M5977N4269O2859P1232P9882Q9791J01200J13519
57475D333415J26307J39596J53185J66408J78551J88983J96810K00868J99955
57466E884078J92677J77523J53818J22386Q4833M2751j650m4862q3399j15671
57456F412484j41655j61174j73776j79987j81214j78343j71640j62031j51100
57447D911564j39680j27751j15866j05200r5849q6539p6653o7241n9359n2632
$$ plain form
57437 3984794 3938526 3898125 3862655 3831524 3804663 3781742 3761913 3744530 3729479 3716580 3705308
57426 3705308 3695435 3687422 3681777 3678309 3676343 3675486 3675969 3678197 3682119 3687084 3692459 3698301 3705183 3713336
57412 3713336 3722319 3731634 3741223 3751137 3761179 3771211 3781442 3792103 3803190 3814865 3827647 3841778
57400 3841778 3856764 3871985 3887409 3903318 3919727 3936496 3953587 3970683 3987070 4002548 4018060
57389 4018060 4034742 4052563 4070503 4087807 4104450 4120656 4136684 4152931 4169612 4186433 4203047
57378 4203047 4219628 4236439 4253167 4269357 4285263 4301543 4318268 4335002 4351725 4368895 4386593
57367 4386593 4404336 4421880 4439524 4457490 4475549 4493427 4511119 4528713 4546300 4564118 4582416
57356 4582416 4601189 4620324 4639891 4659890 4679928 4699599 4719075 4738815 4758817 4778705 4798453
$$ packed form
57437C984794m6268m0401l5470l1131k6861k2921j9829j7383j5051j2899j1272
57426C705308r873q013n645l468j966q57M83K228L922M965N375N842O882Q153
57412C713336Q983R315R589R914J0042J0032J0231J0661J1087J1675J2782J4131
57400C841778J4986J5221J5424J5909J6409J6769J7091J7096J6387J5478J5512
57389D018060J6682J7821J7940J7304J6643J6206J6028J6247J6681J6821J6614
57378D203047J6581J6811J6728J6190J5906J6280J6725J6734J6723J7170J7698
57367D386593J7743J7544J7644J7966J8059J7878J7692J7594J7587J7818J8298
57356D582416J8773J9135J9567J9999K0038J9671J9476J9740K0002J9888J9748
$$ plain form
57345 4798453 4818488 4839017 4859727 4880142 4899989 4919403 4939093 4960045 4982510 5005483 5027649
57334 5027649 5048623 5068857 5088805 5108845 5129615 5151453 5173629 5195019 5215547 5236199 5257673
57323 5257673 5279779 5302145 5324636 5346952 5368649 5389796 5411009 5432731 5455075 5478334 5502796
57312 5502796 5527911 5552501 5576127 5599599 5623858 5648936 5674288 5699581 5724926 5750800 5777902
57301 5777902 5806536 5836029 5865408 5894758 5925188 5957241 5990157 6023120 6056500 6091299 6127922
57290 6127922 6166097 6205532 6246055 6287372 6329236 6371696 6414809 6458180 6501094 6542918 6583156
57279 6583156 6621253 6656569 6688430 6716062 6738625 6755484 6766424 6771691 6772087 6768906 6763445 6756413
57267 6756413 6748003 6738371 6727791 6716496 6704849 6693558 6683241 6673767 6664576 6655741 6648286 6643310 6641104
$$ packed form
57345D798453K0035K0529K0710K0415J9847J9414J9690K0952K2465K2973K2166
57334E027649K0974K0234J9948K0040K0770K1838K2176K1390K0528K0652K1474
57323E257673K2106K2366K2491K2316K1697K1147K1213K1722K2344K3259K4462
57312E502796K5115K4590K3626K3472K4259K5078K5352K5293K5345K5874K7102
57301E777902K8634K9493K9379K9350L0430L2053L2916L2963L3380L4799L6623
57290F127922L8175L9435M0523M1317M1864M2460M3113M3371M2914M1824M0238
57279F583156L8097L5316L1861K7632K2563J6859J0940N267L96l181n461p032
57267F756413q410r632j0580j1295j1647j1291j0317r474r191q835p455m976k206
$$ plain form
57254 6641104 6641059 6642056 6643017 6643662 6644803 6647433 6651482 6655949 6660264 6664897 6670556 6677383 6685149 6693660 6702677
57239 6702677 6711859 6721076 6730524 6740371 6750581 6761073 6771743 6782288 6792389 6802044 6811346 6820105 6828102
57226 6828102 6835603 6842985 6850013 6856117 6861302 6865973 6869906 6872266 6872910 6872786 6872730 6872473 6871126 6867964 6862434
57211 6862434 6854145 6843443 6831585 6819895 6808977 6798877 6789523 6780800 6772634 6765198 6758626 6752489 6746122
57198 6746122 6739531 6733268 6727305 6720818 6713453 6705986 6699291 6693317 6687665 6682582 6678782 6676609 6675935 6676568
57184 6676568 6678381 6681236 6685112 6690086 6695918 6701838 6706860 6710046 6710504 6707615 6701479 6692823 6682398 6670758
57170 6670758 6658472 6645888 6632672 6618156 6602199 6585212 6567460 6549124 6530905 6513571 6496764
57159 6496764 6479228 6460513 6441508 6422983 6404574 6385591 6365873 6345390 6324004 6302254 6281378
$$ packed form
57254F641104m5R97R61O45J141K630M049M467M315M633N659O827P766Q511R017
57239F702677R182R217R448R847J0210J0492J0670J0545J0101R655R302Q759P997
57226F828102P501P382P028O104N185M671L933K360O44j24n6k57j347l162n530
57211F862434q289j0702j1858j1690j0918j0100r354q723q166p436o572o137o367
57198F746122o591o263n963o487p365p467o695n974n652n083l800k173o74O33
57184F676568J813K855L876M974N832N920N022L186M58k889o136q656j0425j1640
57170F670758j2286j2584j3216j4516j5957j6987j7752j8336j8219j7334j6807
57159F496764j7536j8715j9005j8525j8409j8983j9718k0483k1386k1750k0876
$$ plain form
57148 6281378 6261772 6242154 6221035 6198342 6174905 6151178 6127351 6104038 6081681 6059562 6036298
57137 6036298 6011159 5984140 5954960 5922846 5887243 5848113 5805565 5759849 5711876 5663286 5615727
57126 5615727 5570149 5526792 5485726 5447228 5411434 5377562 5343905 5309045 5272901 5236194 5199378
57115 5199378 5162971 5128845 5100343 5080987 5073458 5079275 5098298 5128561 5167959 5216801 5278471 5357990
57103 5357990 5461017 5594211 5765514 5984159 6261727 6613633 7058932 7618852 8316180
57094 8316180 9174966 10218149 11463953 12924177 14604131 16501617 18605532 20896904
57086 20896904 23351959 25945485 28656282 31475092 34408597 37476148 40707428 44143007
57078 44143007 47814307 51681593 55561828 59121308 61967626 63783784 64412597 63858245
$$ packed form
57148F281378j9606j9618k1119k2693k3437k3727k3827k3313k2357k2119k3264
57137F036298k5139k7019k9180l2114l5603l9130m2548m5716m7973m8590m7559
57126E615727m5578m3357m1066l8498l5794l3872l3657l4860l6144l6707l6816
57115E199378l6407l4126k8502j9356p529N817J9023L0263L9398M8842O1670P9519
57103E357990J03027J33194J71303K18645K77568L51906M45299N59920O97328
57094H316180Q58786J043183J245804J460224J679954J897486K103915K291372
57086B0896904K455055K593526K710797K818810K933505L067551L231280L435579
57078D4143007L671300L867286L880235L559480K846318J816158O28813n54352
$$ plain form
57070 63858245 62241953 59754227 56612791 53025223 49167670 45186567 41209583 37348701
57062 37348701 33695360 30316634 27254431 24525628 22125455 20035592 18231542 16684649
57054 16684649 15362382 14231468 13261429 12424942 11697420 11058739 10494352 9992916 9543512
57045 9543512 9136103 8762906 8417392 8092920 7783768 7486330 7197769 6914499 6633493
57036 6633493 6354175 6077690 5805209 5538239 5279431 5031256 4794317 4568066 4352528
57027 4352528 4148145 3954774 3772047 3599999 3438113 3284530 3137511 2997182 2864744
57018 2864744 2740684 2624857 2517437 2418327 2326113 2239032 2156697 2079834 2008807 1943577 1884698
57007 1884698 1833181 1789744 1755203 1731118 1718889 1718667 1730438 1755886 1798063 1859463 1941053 2041576
$$ packed form
57070F3858245j616292k487726l141436l587568l857553l981103l976984l860882
57062C7348701l653341l378726l062203k728803k400173k089863j804050j546893
57054A6684649j322267j130914r70039q36487p27522o38681n64387n01436m49404
57045I543512m07409l73197l45514l24472l09152k97438k88561k83270k81006
57036F633493k79318k76485k72481k66970k58808k48175k36939k26251k15538
57027D352528k04383j93371j82727j72048j61886j53583j47019j40329j32438
57018B864744j24060j15827j07420r9110r2214q7081q2335p6863p1027o5230n8879
57007A884698n1517m3437l4541k4085j2229k22J1771K5448M2177O1400Q1590J00523
$$ plain form
56995 2041576 2154839 2267044 2359262 2415073 2426934 2396256 2329235 2233482 2117210 1989253
56985 1989253 1858223 1731022 1611843 1502362 1402668 1311933 1228622 1151059 1078414 1011092
56975 1011092 950020 895833 848754 808580 774487 745355 720646 700525 684940 673216 664857
56964 664857 660012 658757 660613 665291 673121 684185 697730 713037 729999 747770 763439 773186 774832
56951 774832 768815 757077 741714 724354 705972 687171 668791 651855 636699 622868 610410 600572
56939 600572 594528 591993 591876 593802 598251 605732 616674 631684 650882 673039 695888 716921 733390
56926 733390 742367 742031 732887 716970 696127 671672 645125 618114 591609 566121 542514 521739
56914 521739 503819 487912 473402 460295 448671 438519 430082 423592 418618 414294 410292 407039 405035
$$ packed form
56995B041576J13263J12205R2218N5811J1861l0678o7021r5753j16272j27957
56985A989253j31030j27201j19179j09481r9694r0735q3311p7563p2645o7322
56975A011092o1072n4187m7079m0174l4093k9132k4709k0121j5585j1724q359
56964F64857m845j255J856M678P830J1064J3545J5307J6962J7771J5669R747J646
56951G74832o017j1738j5363j7360j8382j8801j8380j6936j5156j3831j2458r838
56939F00572o044k535j17J926M449P481J0942J5010J9198K2157K2849K1033J6469
56926G33390Q977l36r144j5917k0843k4455k6547k7011k6505k5488k3607k0775
56914E21739j7920j5907j4510j3107j1624j0152q437o490m974m324m002l253k004
$$ plain form
56901 405035 404455 405360 407723 411269 415811 421758 429866 440502 453507 468655 485861 505049 526194
56888 526194 549414 574786 602224 631524 661813 690570 713882 728499 733531 729981 719319 703195
56876 703195 683818 663524 643911 625832 609857 596206 584780 575984 571151 571509 577226 588233
56864 588233 605336 629547 660815 698518 742766 793587 848464 901594 946011 976219 989456
56853 989456 986064 969192 943241 911744 876775 840208 804722 773206 747608 728709 716839 712586
56841 712586 716816 730019 751943 782380 822387 874064 938795 1016135 1104097 1198706 1291993 1371704
56829 1371704 1425473 1446559 1435936 1399834 1346185 1282309 1213595 1143245 1073523 1007238 947408
56818 947408 895834 852959 819085 794835 780451 775574 780075 794532 819707 855936 902966 959589
$$ packed form
56901D05035n80R05K363L546M542N947Q108J0636J3005J5148J7206J9188K1145
56888E26194K3220K5372K7438K9300L0289K8757K3312J4617N032l550j0662j6124
56876G03195j9377k0294j9613j8079j5975j3651j1426q796m833L58N717J1007
56864E88233J7103K4211L1268L7703M4248N0821N4877N3130M4417L0208J3237
56853I89456l392j6872k5951l1497l4969l6567l5486l1516k5598j8899j1870m253
56841G12586M230J3203K1924L0437M0007N1677O4731P7340Q7962R4609R3287P9711
56829A371704N3769K1086j0623l6102n3649o3876o8714p0350o9722o6285n9830
56818I47408n1574m2875l3874k4250j4384m877M501J4457K5175L6229M7030N6623
$$ plain form
56806 959589 1022786 1086853 1143176 1181755 1195125 1182460 1149574 1104130 1051155 993245 933207
56795 933207 874386 818913 767507 721120 681292 648759 623005 603508 590441 584025 584228 591218
56783 591218 605287 626174 653048 684644 718208 748545 769587 777480 771733 753961 726838 693992
56771 693992 659055 624038 589348 555463 523488 494010 466621 440970 417328 395999 377153
56760 377153 361279 348671 338332 328580 318963 310372 303154 296516 290161 285100 282086 280414 278926
56747 278926 277229 275335 273119 270834 269192 268213 266754 263906 260159 256589 253588 250954 248554 246334
56733 246334 244246 242637 242039 242143 241633 239595 236498 233347 230470 227601 224602 221580 218729 216419 215046
56718 215046 214532 214343 214136 213917 213577 212910 212129 211629 211241 210489 209643 209598 210550 211642 212115 211982 211497 210913 210938
$$ packed form
56806I59589O3197O4067N6323L8579J3370j2665l2886m5444n2975n7910o0038
56795I33207n8821n5473n1406m6387l9828l2533k5754j9497j3067o416K03O990
56783E91218J4069K0887K6874L1596L3564L0337K1042P893n747j7772k7123l2846
56771F93992l4937l5017l4690l3885l1975k9478k7389k5651k3642k1329j8846
56760C77153j5874j2608j0339r752r617q591p218o638o355n061l014j672j488
56747B78926j697j894k216k285j642r79j459k848l747l570l001k634k400k220
56733B46334k088j609n98J04n10k038l097l151k877k869k999l022k851k310j373
56718B15046n14j89k07k19l40o67p81n00l88p52q46m5R52J092M73j33m85n84K5
$$ plain form
56699 210938 212307 214598 216469 217405 218218 219476 220556 220762 220346 219799 219075 218122 217346 216860 216047 214438 212438
56682 212438 210652 209099 207536 205967 204489 203178 202312 202088 202084 201838 201923 203357 205861 207933 208910 209630 210734
56665 210734 211681 211999 212109 212150 211341 209444 207730 207408 207978 208053 207056 205338 203418 201873 201183 201032 200456 199187
56647 199187 197981 197243 196492 195624 195306 195389 194469 192111 190031 189811 190665 190932 190590 190634 190904 190405 189255 188604
56629 188604 188803 189161 189408 190065 191389 193059 194868 196805 198582 199994 201574 203942 206656 208562 209240
56614 209240 209397 209955 211350 213458 215588 216855 217141 217364 218296 219589 220562 221270 222079 222748 222884 222827 223165
56597 223165 223744 224010 223990 224136 224456 224613 224614 224692 224720 224377 223673 222761 221559 220059 218623 217460 216324 215199
56579 215199 214708 215291 216529 217913 219678 222274 225572 229135 232743 236126 238938 241493 244732 248900 253179
$$ packed form
56699B10938J369K291J871R36Q13J258J080K06m16n47p24r53p76m86q13j609k000
56682B12438j786j553j563j569j478j311q66k24mk46Q5J434K504K072R77P20J104
56665B10734R47L18J10M1q09j897j714l22N70P5r97j718j920j545o90j51n76j269
56647A99187j206p38p51q68l18Q3r20k358k080k20Q54K67l42M4K70m99j150o51
56629A88604J99L58K47O57J324J670J809J937J777J412J580K368K714J906O78
56614B09240J57N58J395K108K130J267K86K23R32J293R73P08Q09O69J36n7L38
56597B23165N79K66k0J46L20J57JP8K8l43p04r12j202j500j436j163j136j125
56579B15199m91N83J238J384J765K596L298L563L608L383K812K555L239M168M279
$$ plain form
56564 253179 257226 261975 268106 274833 281241 287745 295049 302660 309789 316892 324862 333284 340910 347400
56550 347400 353253 358461 362555 365685 368360 370361 371045 370475 369208 367248 364201 360145 355406 349867 343485
56535 343485 336973 331008 325240 319126 313112 307870 303052 298059 293405 289912 287032 283459 279060 274802
56521 274802 271041 267329 263631 260306 257011 253021 248554 244505 241036 237683 234750 233194 233123 233619 234046
56506 234046 234396 234545 234372 234447 235304 236180 235847 234555 233718 233729 233591 232807 232136 232203 232701 233337 234301 235471 236276
56487 236276 236704 237401 238508 239488 240356 241960 244644 247634 250130 252158 254084 256101 258450 261351 264518
56472 264518 267482 270486 274285 278971 283812 288328 292697 297067 301240 305145 308855 312210 315175 318396
56458 318396 322498 326879 330166 331849 332653 333390 334292 335311 336127 335975 334456 332416 331130 330758 330591 330518
$$ packed form
56564B53179M047M749O131O727O408O504P304P611P129P103P970Q422P626O490
56550C47400N853N208M094L130K675K001O84n70j267j960l047m056m739n539o382
56535C43485o512n965n768o114o014n242m818m993m654l493k880l573m399m258
56521B74802l761l712l698l325l295l990m467m049l469l353k933j556p1M96M27
56506B34046L50J49j73P5Q57Q76l33j292q37J1j38p84o71O7M98O36R64J170Q05
56487B36276M28O97J107R80Q68J604K684K990K496K028J926K017K349K901L167
56472B64518K964L004L799M686M841M516M369M370M173L905L710L355K965L221
56458C18396M102M381L287J683Q04P37R02J019Q16j52j519k040j286l72j67p3
$$ plain form
56442 330518 331048 332038 332713 332978 333486 334266 334442 333551 332066 330406 328385 325922 323433 321259 319304 317269
56426 317269 314662 310797 305552 299904 294921 290538 286122 281782 278065 274882 271948 269853 269310 269595 269177
56411 269177 267768 266348 265290 263941 262215 261141 261458 262747 264199 265338 265967 266288 266946 268069 268621
56396 268621 267799 266616 266769 268327 270016 271438 273397 276142 278982 281650 284411 286823 288008 288374 289448
56381 289448 291735 294219 296195 298120 300280 302082 303073 303439 303248 302403 301514 301564 302552 303584 304274 304780 304703
56364 304703 303498 301961 301681 302922 304504 305805 307215 308598 309138 309002 309470 311027 312817 314221 315395
56349 315395 316145 316007 315757 317082 320337 324200 327853 331856 336600 341664 347061 353368 360211 366404 372016
56334 372016 378513 386361 394331 401690 409230 417409 425305 432240 438903 446074 453702 461787 470644 479719
$$ packed form
56442C30518N30R90O75K65N08P80J76q91j485j660k021k463k489k174j955k035
56426C17269k607l865n245n648m983m383m416m340l717l183k934k095n43K85m18
56411B69177j409j420j058j349j726j074L17J289J452J139O29L21O58J123N52
56396B68621q22j183J53J558J689J422J959K745K840K668K761K412J185L66J074
56381B89448K287K484J976J925K160J802R91L66j91q45q89N0R88J032O90N06p7
56364C04703j205j537k80J241J582J301J410J383N40j36M68J557J790J404J174
56349C15395P50j38k50J325L255L863L653M003M744N064N397O307O843O193N612
56334C72016O497P848P970P359P540Q179P896O935O663P171P628Q085Q857R075
$$ plain form
56320 479719 487689 494244 500215 505527 508838 509811 509982 510650 511568 512342 513361 514556 514885 513841 512126 510260
56304 510260 508090 506071 505293 505701 505958 505610 505687 506769 508346 510494 514137 519089 523895 528244 533401 539718
56288 539718 546033 552346 560613 571759 584219 596636 609810 624660 640470 656623 674168 694189
56276 694189 716372 740494 767501 797838 830473 864900 902462 944506 990932 1041682 1097854
56265 1097854 1160274 1228870 1304561 1389733 1485602 1591110 1705628 1830563 1966846 2112931
56255 2112931 2266826 2428037 2595831 2767453 2939647 3110173 3276321 3433809 3578730
56246 3578730 3708854 3821725 3913626 3982128 4027780 4051852 4054519 4036899 4002529 3954788 3894747
56235 3894747 3823448 3744238 3660672 3573927 3484229 3393009 3301492 3208900 3114191 3018133 2921727
$$ packed form
56320D79719P970O555N971N312L311R73J71O68R18P74J019J195L29j044j715j866
56304E10260k170k019p78M08K57l48P7J082J577K148L643M952M806M349N157O317
56288E39718O315O313Q267J1146J2460J2417J3174J4850J5810J6153J7545K0021
56276F94189K2183K4122K7007L0337L2635L4427L7562M2044M6426N0750N6172
56265A097854O2420O8596P5691Q5172R5869J05508J14518J24935J36283J46085
56255B112931J53895J61211J67794J71622J72194J70526J66148J57488J44921
56246C578730J30124J12871R1901O8502M5652K4072K667j7620l4370m7741o0041
56235C894747p1299p9210q3566q6745q9698r1220r1517r2592r4709r6058r6406
$$ plain form
56224 2921727 2824165 2724298 2622657 2520263 2417060 2313229 2210329 2109434 2009893 1911633
56214 1911633 1816727 1726914 1641671 1560599 1485414 1417274 1354361 1294641 1239077 1189496 1145105
56203 1145105 1103781 1065235 1030291 998438 968676 941500 917726 896558 876924 859356 844558
56192 844558 831602 819487 808839 800182 792395 784920 779397 776937 775920 774858 775159 778414 783200 787456
56178 787456 791963 798390 805820 812372 818501 825530 832525 837775 841872 846201 849868 851220 850995 850844 850211
56163 850211 847788 844655 842815 841943 840759 840277 842445 846696 851081 855746 862310 870888 880660 892171
56149 892171 906172 921538 937337 955590 978989 1007313 1039210 1075970 1120294 1172827 1233300
56138 1233300 1303717 1386917 1483162 1591339 1712087 1846230 1991188 2142064 2294848 2445478
$$ packed form
56224B921727r7562r9867j01641j02394j03203j03831j02900j00895r9541r8260
56214A911633r4906q9813q5243q1072p5185o8140o2913n9720n5564m9581m4391
56203A145105m1324l8546l4944l1853k9762k7176k3774k1168j9634j7568j4798
56192H44558j2956j2115j0648q657p787p475n523k460j017j062L01L255M786M256
56178G87456M507O427P430O552O129P029O995N250M097M329L667J352k25j51o33
56163H50211k423l133j840q72j184m82K168M251M385M665O564Q578R772J1511
56149H92171J4001J5366J5799J8253K3399K8324L1897L6760M4324N2533O0473
56138A233300P0417Q3200R6245J08177J20748J34143J44958J50876J52784J50630
$$ plain form
56128 2445478 2587888 2717188 2833830 2941245 3040712 3131700 3214993 3290998 3356265 3405929
56118 3405929 3438790 3456501 3459493 3447809 3424482 3393420 3354585 3304858 3242427 3166631 3075387
56107 3075387 2967569 2846988 2719861 2589513 2457510 2328066 2206266 2093071 1986862
56098 1986862 1888820 1801952 1725907 1657742 1596980 1545006 1500395 1459905 1423438 1393103 1368127
56087 1368127 1345636 1325710 1310567 1299335 1288702 1278249 1270229 1264661 1259594 1255506 1254410 1255321 1255671
56074 1255671 1256359 1260215 1266409 1271782 1276785 1284416 1294135 1302678 1310194 1319678 1330974 1341374 1351590
56061 1351590 1364939 1381029 1396425 1411167 1428349 1447547 1465138 1480980 1498432 1517869 1536513
56050 1536513 1554519 1574837 1597168 1618502 1639331 1662788 1688086 1711631 1734203 1759966 1788729
$$ packed form
56128B445478J42410J29300J16642J07415R9467R0988Q3293P6005O5267M9664
56118C405929L2861J7711K992j1684k3327l1062l8835m9727o2431p5796r1244
56107C075387j07818j20581j27127j30348j32003j29444j21800j13195j06209
56098A986862r8042q6868p6045o8165o0762n1974m4611m0490l6467l0335k4976
56087A368127k2491j9926j5143j1232j0633j0453q020n568n067m088j096R11L50
56074A255671O88L856O194N373N003P631R719Q543P516R484J1296J0400J0216
56061A351590J3349J6090J5396J4742J7182J9198J7591J5842J7452J9437J8644
56050A536513J8006K0318K2331K1334K0829K3457K5298K3545K2572K5763K8763
$$ plain form
56039 1788729 1816455 1843082 1872429 1904602 1936145 1967474 2002368 2040336 2077477 2114601 2156231
56028 2156231 2201800 2246431 2290270 2338100 2389808 2440495 2490101 2543355 2599984 2654932 2708704
56017 2708704 2767258 2830922 2893888 2955581 3021851 3093768 3166254 3239114 3318231 3404204 3491215
56006 3491215 3578862 3673564 3776437 3881684 3988841 4104296 4228686 4355579 4484854 4624203
55996 4624203 4774934 4930011 5088891 5260105 5446009 5639495 5839137 6052630 6281662
55987 6281662 6519053 6764905 7029638 7316902 7619940 7939012 8285073 8661923 9063196
55978 9063196 9491790 9962836 10482202 11042637 11646959 12313528 13052733 13861420 14747661
55969 14747661 15736836 16846224 18080428 19460750 21031527 22829673 24880631 27236876
$$ packed form
56039A788729K7726K6627K9347L2173L1543L1329L4894L7968L7141L7124M1630
56028B156231M5569M4631M3839M7830N1708N0687M9606N3254N6629N4948N3772
56017B708704N8554O3664O2966O1693O6270P1917P2486P2860P9117Q5973Q7011
56006C491215Q7647R4702J02873J05247J07157J15455J24390J26893J29275J39349
55996D624203J50731J55077J58880J71214J85904J93486J99642K13493K29032
55987F281662K37391K45852K64733K87264L03038L19072L46061L76850M01273
55978I063196M28594M71046N19366N60435O04322O66569P39205Q08687Q86241
55969A4747661R89175J109388J234204J380322J570777J798146K050958K356245
$$ plain form
55961 27236876 29989801 33236225 37075181 41655191 47185804 53886318 61963419 71646436
55953 71646436 83184266 96793903 112695296 131238179 152907186 178116831 206981047
55946 206981047 239105255 273139914 306173013 333810576 351633834 357283990 351426783
55939 351426783 336804210 316447298 292632046 266945022 240678610 214932307 190520605
55932 190520605 167961262 147533589 129313254 113225753 99145154 86946573 76475157
55925 76475157 67527126 59894934 53401485 47877584 43147164 39059665 35510778 32415765
55917 32415765 29689081 27263817 25103481 23177264 21443932 19871005 18446780 17159892
55909 17159892 15986108 14905924 13915683 13010138 12171845 11388038 10660782 9990486 9365708
$$ packed form
55961B7236876K752925L246424L838956M580010N530613O700514Q077101R683017
55953G1646436J1537830J3609637J5901393J8542883K1669007K5209645K8864216
55946B06981047L2124208L4034659L3033099K7637563J7823258N650156n857207
55939C51426783j4622573k0356912k3815252k5687024k6266412k5746303k4411702
55932A90520605k2559343k0427673j8220335j6087501j4080599j2198581j0471416
55925G6475157q948031p632192o493449n523901m730420m087499l548887l095013
55917C2415765k726684k425264k160336j926217j733332j572927j424225j286888
55909A7159892j173784j080184r90241r05545q38293p83807p27256o70296o24778
$$ plain form
55900 9365708 8778711 8235128 7738432 7279488 6850534 6455116 6094957 5760728 5445097
55891 5445097 5152239 4885531 4637885 4402974 4184504 3985789 3800914 3624531 3460166
55882 3460166 3310802 3170957 3035837 2909051 2793904 2685953 2581338 2483802 2396437 2314803
55872 2314803 2234962 2160252 2093590 2030962 1968996 1911176 1860148 1811435 1761261 1713420 1671947
55861 1671947 1633793 1595130 1558449 1527253 1499770 1473816 1452128 1437203 1426314 1416621 1409512 1404912
55849 1404912 1397272 1382479 1363297 1343200 1320556 1293770 1266348 1241537 1217196 1190917 1164967
55838 1164967 1141259 1116716 1088672 1059861 1033198 1006628 978056 950427 926782 904911 881920
55827 881920 859634 840520 822587 803274 784272 767702 751541 733591 716077 701664 688640
$$ packed form
55900I365708n86997n43583m96696m58944m28954l95418l60159l34229l15631
55891E445097k92858k66708k47646k34911k18470j98715j84875j76383j64365
55882C460166j49364j39845j35120j26786j15147j07951j04615r7536q7365q1634
55872B314803p9841p4710o6662o2628o1966n7820n1028m8713n0174m7841m1473
55861A671947l8154l8663l6681l1196k7483k5954k1688j4925j0889r693p109m600
55849A404912p640j4793j9182k0097k2644k6786k7422k4811k4341k6279k5950
55838A164967k3708k4543k8044k8811k6663k6570k8572k7629k3645k1871k2991
55827H81920k2286j9114j7933j9313j9002j6570j6161j7950j7514j4413j3024
$$ plain form
55816 688640 674599 661135 650429 640822 630224 620406 613634 608548 603431 599881 599019 597830 593643
55803 593643 588710 585951 583790 579698 575257 572942 571051 566564 560094 553475 545412 534168 521812 511132
55789 511132 500844 488420 475242 464416 455650 446726 437987 431086 425197 418673 412696 409325 407668
55776 407668 405615 403459 402035 399285 392675 383384 374430 366215 357483 348886 341930 335915 329522 323958
55762 323958 321105 319914 317852 314513 310712 305708 298557 290722 284176 278287 271525 264654 259258 254713
55748 254713 249630 244737 241401 238984 236529 235238 236181 237314 236021 233068 230946 229850 228463 227166
55734 227166 227196 227864 227719 227332 228074 229323 229512 228616 227084 223952 218687 213157 209038 205079 199656 194084
55718 194084 190384 187828 184910 182687 182661 183233 182030 180134 180253 182196 184026 186342 191313 198378 204915
$$ packed form
55816F88640j4041j3464j0706r607j0598r818o772n086n117l550q62j189m187
55803E93643m933k759k161m092m441k315j891m487o470o619q063j1244j2356j0680
55789E11132j0288j2424j3178j0826q766q924q739o901n889o524n977l371j657
55776D07668k053k156j424k750o610r291q954q215q732q597o956o015o393n564
55762C23958k853j191k062l339l801n004p151p835o546n889o762o871n396m545
55748B54713n083m893l336k417k455j291R43J133j293k953k122j096j387j297
55734B27166L0O68j45l87P42J249J89q96j532l132n265n530m119l959n423n572
55718A94084l700k556k918k223k6N72j203j896J19J943J830K316M971P065O537
$$ plain form
55703 204915 210539 216952 224063 230001 234654 239583 244603 247817 248992 249763 250640 250720 250070 249435 247955 244164
55687 244164 238951 234589 231172 227000 222100 218279 215837 213325 210530 208735 207990 207073 206192 206865 208852
55672 208852 209999 209383 208074 206559 203996 200412 197173 194798 192436 189891 188145 187647 187925 188971 191104
55657 191104 193507 194811 195095 195500 196059 195811 194814 194017 193267 191401 188236 184656 180896 176488 171645 166993
55641 166993 162318 157245 152579 149152 146030 141833 137111 133329 130225 126459 122252 118932 116338 113127
55627 113127 109403 106602 104910 103111 100876 99017 97545 95632 93387 91649 90127 87747 84647 81907
55613 81907 79672 77477 75983 76224 77564 78515 79053 79931 80290 78532 75206 72531 71212 70143 68970 68417
55597 68417 68253 67478 66451 66404 66965 66712 65946 66283 67573 68009 67343 67118 67549 67123 65720 65211 66286 67382
$$ packed form
55703B04915N624O413P111N938M653M929N020L214J175P71Q77Q0o50o35j480l791
55687B44164n213m362l417m172m900l821k442k512k795j795p45r17q81O73J987
55672B08852J147o16j309j515k563l584l239k375k362k545j746m98K78J046K133
55657A91104K403J304K84M05N59k48r97p97p50j866l165l580l760m408m843m652
55641A66993m675n073m666l427l122m197m722l782l104l766m207l320k594l211
55627A13127l724k801j692j799k235j859j472j913k245j738j522k380l100k740
55613H1907k235k195j494K41J340R51N38Q78L59j758l326k675j319j069j173n53
55597F8417j64p75j027m7N61k53p66L37J290M36o66k25M31m26j403n09J075J096
$$ plain form
55579 67382 67546 67677 68093 67488 65442 63630 63343 63819 64046 64315 64995 65578 65897 66644 67953 69046 69786 70880
55561 70880 72082 72074 70633 69023 67709 65616 62265 58688 55606 52642 50033 49100 50142 51777 53244
55546 53244 55534 59285 63296 66248 68327 70165 71547 72185 72530 72953 73225 73459 74430 76442 78936 81465
55530 81465 83883 85514 85658 85083 85392 86715 87672 87771 87947 88444 88133 86479 84306 82058 79164 75643 72429
55513 72429 69461 65458 60352 55963 53340 51345 48881 46661 45495 44532 42613 40107 38177 37248 37186
55498 37186 37855 38714 38868 38257 37769 37706 37425 36862 36912 37686 37883 36612 34462 32199 29906 28046 27764 29229
55480 29229 31071 32229 33063 34011 34651 34811 35124 35688 35589 34533 33518 33126 32599 31349 29951 28931 28061
55463 28061 27551 28295 30102 31285 30971 30296 30389 30772 30775 30889 31559 32064 31817 31422 31402 31212 30585 30405 31066 31432
$$ packed form
55579F7382J64J31M16o05k046j812k87M76K27K69O80N83L19P47J309J093P40J094
55561G0880J202qj441j610j314k093l351l577l082k964k609r33J042J635J467
55546E3244K290L751M011K952K079J838J382O38L45M23K72K34R71K012K494K529
55530H1465K418J631J44n75L09J323R57R9J76M97l11j654k173k248k894l521l214
55513G2429k968m003n106m389k623j995k464k220j166r63j919k506j930r29o2
55498C7186O69Q59J54o11m88o3k81n63N0P74J97j271k150k263k293j860k82J465
55480B9229J842J158Q34R48O40J60L13N64r9j056j015l92n27j250j398j020q70
55463B8061n10P44J807J183l14o75R3L83LJ14O70N05k47l95k0j90o27j80O61L66
$$ plain form
55443 31432 30617 29487 29137 29225 29081 29117 29762 30237 29853 29404 29857 30666 30759 30303 30134 30353 30782 31927 34140
55424 34140 36539 37988 38495 38604 38211 37107 35961 35600 35926 36444 37109 37764 37592 36159 34265 32914 32205
55407 32205 32066 33017 35214 37633 39294 40494 41875 43099 43447 42968 42135 41137 40267 40099 40497 40497 39916 39914
55389 39914 41057 42135 41957 41027 40225 39191 37459 35958 35693 35904 35254 34042 33564 33857 33773 32870 31740
55372 31740 30748 29852 29415 29913 31007 31955 32670 33407 33852 33618 33190 33279 33538 32968 31299 29163 27214 25892
55354 25892 25551 26028 26493 26495 26559 27180 27971 28548 29292 30293 30555 29362 27583 26447 25892 25371 25362 26528 28052
55335 28052 28435 27573 26606 26058 25559 25130 25328 26157 27029 27739 28429 28729 28069 26710 25479 24600 23727 22908
55317 22908 22592 22848 23432 24363 25628 26617 26781 26520 26579 26894 26901 26592 26378 26272 26144 26374 27244 28024 27705 26457
$$ packed form
55443C1432q15j130l50Q8j44L6O45M75l84m49M53Q09R3m56j69K19M29J145K213
55424C4140K399J449N07J09l93j104j146l61L26N18O65O55j72j433j894j351p09
55407C2205j39R51K197K419J661J200J381J224L48m79q33r98q70j68L98%n81k
55389C9914J143J078j78r30q02j034j732j501k65K11o50j212m78K93q4r03j130
55372C1740r92q96m37M98J094R48P15P37M45k34m28Q9K59n70j669k136j949j322
55354B5892l41M77M65KO4O21P91N77P44J001K62j193j779j136n55n21rJ166J524
55335B8052L83q62r67n48m99m29J98Q29Q72P10O90L00o60j359j231q79q73q19
55317B2908l16K56N84R31J265R89J64k61N9L15Pl09k14j06j28K30Q70P80l19j248
$$ plain form
55297 26457 25406 25148 25321 25472 25515 25478 25487 25725 25844 24945 22868 20924 20508 21418 22412 22937 23391 24102 24985
55278 24985 25891 26530 26466 25850 25614 26269 27188 27801 28584 29921 31020 31160 31147 32092 33504 34118 34015 34244 34750
55259 34750 34408 33046 31837 31535 31660 31574 31269 30965 30896 31524 33002 34563 35277 35159 34673 33659 31941 30496
55241 30496 30596 31998 33300 33911 34296 34463 33774 32354 31257 30973 31040 31263 32022 33114 33631 33451 33687 35067
55223 35067 36825 37753 37603 36967 36443 36333 36676 37232 37737 38291 39097 40021 40806 41539 42387 43159 43707 44372 45362
55204 45362 46153 46291 46293 46807 47335 46900 45642 44582 44052 43485 42572 41482 40072 38122 36295 35664 36210 36907
55186 36907 37288 37791 38483 38677 38069 37216 36626 36271 36133 36361 36705 36694 36472 36662 37310 37812 37849 37594 37059 36158
55166 36158 35304 34990 34915 34553 34440 35642 37916 39648 39845 39062 38193 37445 36788 36346 35952 35205 34251 33744
$$ packed form
55297B6457j051k58J73J51M3l7RK38J19q99k077j944m16R10R94N25M54P11Q83
55278B4985R06O39o4o16k36O55R19O13P83J337J099J40j3R45J412O14j03K29N06
55259C4750l42j362j209l02J25q6l05l04o9O28J478J561P14j18m86j014j718j445
55241C0496J00J402J302O11L85J67o89j420j097k84O7K23P59J092N17j80K36J380
55223C5067J758R28j50o36n24j10L43N56N05N54Q06R24P85P33Q48P72N48O65R90
55204D5362P91J38KN14N28m35j258j060n30n67r13j090j410j950j827o31N46O97
55186C6907L81N03O92J94o08q53n90l55j38K28L44j1k22J90O48N02L7k55n35r01
55166C6158q54l14p5l62j13J202K274J732J97p83q69p48o57m42l94p47r54n07
$$ plain form
55148 33744 33877 34230 34568 34939 35056 34604 34098 34292 34788 34475 33417 32960 33756 35006 35930 36647 37226 37280 37118
55129 37118 37919 39985 41940 42516 42209 42351 43409 44985 46750 48518 49921 50699 51055 51293 51516 51874 52524
55112 52524 53164 53244 52828 52490 52290 51748 51032 51113 52292 53591 54103 54086 54148 54298 54421 54943 56244 58038 59953
55093 59953 62099 64481 66465 67521 68000 68584 69350 69940 70270 70557 70892 71215 71449 71479 71315 71375 72094 73119
55075 73119 73460 72774 71963 72231 73881 76175 77877 77888 76049 73559 72060 72089 72827 73375 73588 73605 73355 72793
55057 72793 71991 70801 68991 66828 64862 63101 61169 59347 58557 59094 60223 61297 62407 63607 64303
55042 64303 63913 62601 61080 60125 60239 61146 61690 61133 60403 61018 62877 64374 64742 64760 64910 64506 63315 62499
55024 62499 62912 63746 63966 63956 64594 65624 66184 66278 66494 66751 66462 65606 64721 64047 63400 62645 61747 60714 59968
$$ packed form
55148C3744J33L53L38L71J17m52n06J94M96l13j058m57P96J250R24P17N79N4j62
55129C7118Q01K066J955N76l07J42J058J576J765J768J403P78L56K38K23L58O50
55112E2524O40Q0m16l38k00n42p16Q1J179J299N12j7O2J50J23N22J301J794J915
55093E9953K146K382J984J056M79N84P66N90L30K87L35L23K34L0j64O0P19J025
55075G3119L41o86q11K68J650K294J702J1j839k490j499K9P38N48K13J7k50n62
55057G2793q02j190j810k163j966j761j932j822p90N37J129J074J110J200O96
55042F4303l90j312j521r55J14R07N44n57p30O15J859J497L68J8J50m04j191q16
55024F2499M13Q34K20j0O38J030N60R4K16K57k89q56q85o74o47p55q98j033p46
$$ plain form
55005 59968 60227 61434 62449 62376 61633 61106 60940 60887 61138 61953 62975 63733 64299 64683 64197 62454 60511 59911
54987 59911 60779 61847 62203 62124 62188 62440 62631 62699 62855 63467 64742 66265 67206 67315 67238 67450 67481 66933 66668 67975
54967 67975 70798 73810 76182 78393 81146 84350 87506 90530 93840 97929 103003 108787 114668 120349
54953 120349 126370 133628 142258 151311 159674 167059 173869 180210 185364 188364 188949 187634 184835 180375
54939 180375 174129 166717 158935 150811 141891 132423 123474 115781 109154 103138 97693 92994 89122 86154
54925 86154 84051 82409 80844 79684 79607 80551 81737 82845 84373 86594 89123 91856 95403 100098 105372
54910 105372 110640 116106 122177 128839 136119 144381 153425 161934 168513 172837 175228 175726 174231 171046
54896 171046 166536 160648 153304 144952 136224 127533 119359 112319 106381 100626 94460 88513 83709 80005
$$ packed form
55005E9968K59J207J015p3p43n27j66n3K51Q15J022P58N66L84m86j743j943o00
54987E9911Q68J068L56p9O4K52J91O8J56O12J275J523R41J09p7K12L1n48k65J307
54967F7975K823L012K372K211K753L204L156L024L310M089N074N784N881N681
54953A20349O021P258Q630R053Q363P385O810O341N154L000N85j315k799m460
54939A80375o246p412p782q124q920r468q949p693o627o016n445m699l872k968
54925H6154k103j642j565j160p7R44J186J108J528K221K529K733L547M695N274
54910A05372N268N466O071O662P280Q262R044Q509O579M324K391M98j495l185
54896A71046m510n888p344q352q728q691q174p040n938n755o166n947m804l704
$$ plain form
54882 80005 76776 73991 72129 71287 71142 71551 72516 73752 74917 76118 77651 79381 80806 81500 81180 79700
54866 79700 77414 75220 73794 73080 72777 72789 72841 72307 71045 69792 69134 68587 67413 65892 64980 65039 65564 65929
54848 65929 65762 64863 63410 62079 61403 61214 61085 60969 60928 60683 60114 59821 60471 61796 62921 63553 64261 65565
54830 65565 67282 68821 69836 70522 71359 72466 73338 73602 73835 74929 76703 78028 78481 78873 79769 80582 80696
54813 80696 80471 80442 80508 80747 82053 84946 88550 91798 94950 98831 103250 107410 111415 116218 122369 129806
54797 129806 138527 148458 158948 169395 179968 190711 200403 207431 211543 213649 214175 212847 209874
54784 209874 206123 202031 197379 192093 186314 179877 172879 166656 162817 161126 159563 156823 153622 151146
54770 151146 149409 147817 146421 145713 145724 146121 146983 148903 152327 157140 162970 169729 177759 187366 198293
$$ packed form
54882H0005l229k785j862q42j45M09R65J236J165J201J533J730J425O94l20j480
54866G9700k286k194j426p14l03J2N2n34j262j253o58n47j174j521r12N9N25L65
54848F5929j67q99j453j331o76j89j29j16m1k45n69k93O50J325J125O32P08J304
54830F5565J717J539J015O86Q37J107Q72K64K33J094J774J325M53L92Q96Q13J14
54813H0696k25k9O6K39J306K893L604L248L152L881M419M160M005M803O151P437
54797A29806Q721R931J0490J0447J0573J0743R692P028M112K106N26j328k973
54784B09874l751m092m652n286n779o437o998o223l839j691j563k740l201k476
54770A51146j737j592j396p08J1L97Q62J920L424M813N830O759Q030R607J0927
$$ plain form
54755 198293 209975 222274 235505 249577 263753 277543 291105 304202 315448 323298 327245 327348
54743 327348 323343 315228 304211 291947 279047 265383 251511 238645 227243 216659 206293 196209
54731 196209 186650 177842 170333 164713 160843 158029 155863 154242 152754 150879 148702 146623 144496 141904
54717 141904 139183 137187 136105 135444 135164 135769 137168 138382 138680 138215 137421 136559 136042 136357 137377 138361 138846
54700 138846 138978 138965 138826 138727 138864 138980 138632 137942 137428 137194 136984 136872 137100 137337 137001 136244 135738 135576 135384
54681 135384 135420 136374 138014 139254 139864 140935 143233 146199 149128 152318 156371 161134 166020 170792 175457
54666 175457 179952 184430 189407 195135 201203 207035 212373 217038 220778 223703 226465 229663 233308 236972
54652 236972 240202 242837 245374 248911 254216 260962 268377 276409 285524 295682 306444 317872 330218
$$ packed form
54755A98293J1682J2299J3231J4072J4176J3790J3562J3097J1246P850L947J03
54743C27348m005q115j1017j2264j2900j3664j3872j2866j1402j0584j0366j0084
54731A96209r559q808p509n620l870k814k166j621j488j875k177k079k127k592
54717A41904k721j996j082o61k80O05J399J214K98m65p94q62n17L15J020R84M85
54700A38846J32j3j39r9J37J16l48o90n14k34k10j12K28K37l36p57n06j62j92
54681A35384L6R54J640J240O10J071K298K966K929L190M053M763M886M772M665
54666A75457M495M478M977N728O068N832N338M665L740K925K762L198L645L664
54652B36972L230K635K537L537N305O746P415Q032R115J0158J0762J1428J2346
$$ plain form
54639 330218 342640 353343 361172 366030 367651 365200 358573 349009 337846 325507 312175 298510 285121
54626 285121 272086 259564 248136 238018 228653 219650 211502 204887 199893 196383 194361 193428 192553 191047
54612 191047 189285 188001 187378 187299 187785 188610 189032 188609 187842 187404 187052 185881 183405 179990 176442 173426 171002
54595 171002 168428 164806 160124 155309 151059 147118 142909 138328 133623 128949 124405 120137 116158 112417
54581 112417 109144 106654 104755 102877 100883 99174 97940 96967 96223 95886 95649 94840 93447 92220 91480 90724
54565 90724 89634 88600 87868 87124 86385 86319 87077 87701 87359 86378 85485 84830 84512 85169 87100 89392 90906 91732
54547 91732 92842 94651 96714 98619 100464 102563 105209 108604 112711 117349 122580 128521 134654 140033
54533 140033 144532 149189 154817 160961 166668 171538 175379 177565 177600 175863 173051 169325 164672 159603 154764
$$ packed form
54639C30218J2422J0703P829M858J621k451o627r564j1163j2339j3332j3665j3389
54626B85121j3035j2522j1428j0118r365r003q148o615m994l510k022r33q75j506
54612A91047j762j284o23p9M86Q25M22m23p67m38l52j171k476l415l548l016k424
54595A71002k574l622m682m815m250l941m209m581m705m674m544m268l979l741
54581A12417l273k490j899j878j994j709j234r73p44l37k37q09j393j227p40p56
54565I0724j090j034p32p44p39o6P58O24l42r81q93o55l18O57J931K292J514Q26
54547I1732J110J809K063J905J845K099K646L395M107M638N231N941O133N379
54533A40033M499M657N628O144N707M870L841K186L5j737k812l726m653n069m839
$$ plain form
54518 154764 150159 145421 140507 135547 130391 124951 119646 114906 110565 106308 102361 99072 96206 93306
54504 93306 90512 88388 87177 86688 86620 86499 85695 84116 82643 82246 82867 83612 83794 83351 82572 81950 82044 83002
54486 83002 84329 85422 86088 86337 86128 85635 85260 85082 84791 84503 84950 86451 88315 89790 90923 91990 92822
54469 92822 93322 93878 94535 94489 93326 92113 92213 93449 94453 94454 93775 92857 91811 90868 90375 90373 90745 91555 92624
54450 92624 93104 92303 90728 89605 89493 90004 90571 90795 90308 89104 87841 87196 87101 87148 87339 87746 87862 87175
54432 87175 86064 85310 85010 84824 84971 86025 87904 89969 91947 93881 95375 95889 95744 95956 97047 98819
54416 98819 101085 103694 105975 107278 108089 109620 112126 114631 116479 118181 120429 123180 126123 129282 132748
54401 132748 136416 140343 144860 150037 155486 160804 165737 169925 173137 175803 178613 181416 183236 183575
$$ packed form
54518A54764m605m738m914m960n156n440n305m740m341m257l947l289k866k900
54504I3306k794k124j211m89o8j21q04j579j473l97O21P45J82m43p79o22R4R58
54486H3002J327J093O66K49k09m93l75j78k91k88M47J501J864J475J133J067Q32
54469I2822N00N56O57m6j163j213J00J236J004Jo79r18j046r43m93kL72Q10J069
54450I2624M80q01j575j123j12N11N67K24m87j204j263o45r5M7J91M07J16o87
54432H7175j111p54l00j86J47J054J879K065J978J934J494N14j45K12J091J772
54416I8819K266K609K281J303Q11J531K506K505J848J702K248K751K943L159L466
54401A32748L668L927M517N177N449N318M933M188L212K666K810K803J820L39
$$ plain form
54387 183575 183034 182331 181345 179496 176564 172738 168284 163509 158805 154496 150777 147812 145570 143620 141453
54372 141453 138997 136439 133688 130489 127029 123894 121483 119921 119332 119579 119832 119161 117601 116030 115018
54357 115018 114512 114567 115462 116895 117991 118524 119413 121569 124805 128276 131452 134287 136929 139743 143233 147497
54341 147497 151995 156162 160062 164121 168454 172580 175709 177227 177205 176450 175749 175045 173696 171481 168821
54326 168821 165953 162515 158195 153326 148458 143716 138926 134145 129751 126063 123022 120149 116781 112583
54312 112583 107885 103395 99566 96453 94036 92371 91302 90323 88892 86796 84244 81716 79587 77836
54298 77836 76282 75124 74841 75332 75680 75212 74364 73924 73820 73351 72358 71400 70858 70567 70353 70270 70293 70353 70635
54279 70635 71346 72174 72525 72270 71736 71057 70162 69320 69093 69652 70695 71928 73129 73875 73933 73856 74438 75583
$$ packed form
54387A83575n41p03r86j849k932l826m454m775m704m309l719k965k242j950k167
54372A41453k456k558k751l199l460l135k411j562n89K47K53o71j560j571j012
54357A15018n06N5Q95J433J096N33Q89K156L236L471L176K835K642K814L490M264
54341A47497M498M167L900M059M333M126L129J518k2p55p01p04j349k215k660
54326A68821k868l438m320m869m868m742m790m781m394l688l041k873l368m198
54312A12583m698m490l829l113k417j665j069r79j431k096k552k528k129j751
54298G7836j554j158k83M91L48m68q48m40j04m69r93r58n42k91k14q3K3O0K82
54279G0635P11Q28L51k55n34o79q95q42k27N59J043J233J201P46N8p7N82J145
$$ plain form
54261 75583 76438 76614 76511 76396 76046 75460 75094 75061 74877 74307 73832 73976 74734 75896 77308 78556 79051 78753
54243 78753 78291 78110 78049 77865 77549 76914 75624 73992 72999 73120 73720 74048 74166 74412 74564 74209 73563 73284 73639
54224 73639 74272 74661 74517 73967 73579 73964 75128 76438 77361 77948 78508 79185 79927 80543 80729 80480 80473 81434 83015
54205 83015 83934 83449 82150 81044 80522 80489 80848 81370 81593 81373 81182 81443 81898 81961 81352 80086 78240 76094
54187 76094 74223 73100 72781 73022 73335 72958 71383 69231 67998 68502 69989 71090 71272 71035 71143 72005 73427
54170 73427 74615 74791 74065 73292 72833 72058 70429 68538 67511 67744 68743 69899 70920 71719 72372 73076 73846
54153 73846 74380 74482 74444 74790 75815 77487 79466 81151 82053 82306 82457 82601 82236 81101 79683 78611 78014
54136 78014 77731 77679 77738 77703 77651 77895 78296 78137 77004 75308 73627 72064 70580 69371 68416 67239 65657 64329
$$ packed form
54261G5583Q55J76j03j15l50n86l66l3j84n70m75J44P58J162J412J248M95k98
54243G8753m62j81o1j84l16o35j290j632r93J21O00L28J18K46J52l55o46k79L55
54224G3639O33L89j44n50l88L85J164J310R23N87N60O77P42O16J86k49pR61J581
54205H3015R19m85j299j106n22l3L59N22K23k20j91K61M55O3o09j266j846k146
54187G6094j871j123l19K41L13l77j575k152j233N04J487J101J82k37J08Q62J422
54170G3427J188J76p26p73m59p75j629j891j027K33R99J156J021P99O53P04P70
54153G3846N34J02l8L46J025J672J979J685R02K53J51J44l65j135j418j072n97
54136G8014k83n2N9l5n2K44M01j59j133j696j681j563j484j209r55j177j582j328
$$ plain form
54118 64329 63998 64527 65160 65354 64891 63658 61957 60699 60561 61024 60775 59040 56263 53730 52808 54159 57175
54101 57175 60318 62416 63490 64140 64585 64671 64465 64274 64249 64354 64565 64791 64852 64771 64749 64676 64137 63262 62978 63884
54081 63884 65338 66258 66457 66568 66978 67538 68125 68789 69406 69696 69616 69352 69000 68625 68487 68826 69551 70452 71539
54062 71539 72864 74238 75475 76675 77907 78827 79063 78836 78838 79571 80960 82404 83104 82718 81938 82033 83571
54045 83571 85992 88566 91172 93873 96488 99083 102134 105591 108490 110318 112125 115301 119740 124273
54031 124273 128525 133228 138834 144968 151323 158118 165446 172996 180580 188198 195383 201311 205847 209859
54017 209859 214200 218869 223426 227634 231340 234204 235976 236851 237309 237715 238127 238227 237403 235173 231634 227316
54001 227316 222602 217501 211959 206146 200503 195622 191917 189171 186593 183614 180373 177178 173889 170344
$$ packed form
54118F4329l31N29O33J94m63j233j701j258j38M63k49j735k777k533r22J351L016
54101E7175L143K098J074O50M45Q6k06j91k5J05K11K26O1q1k2p3n39q75k84R06
54081F3884J454R20J99J11M10N60N87O64O17K90q0k64l52l75j38L39P25R01J087
54062G1539J325J374J237J200J232R20K36k27KP33J389J444P00l86p80R5J538
54045H3571K421K574K606K701K615K595L051L457K899J828J807L176M439M533
54031A24273M252M703N606O134O355O795P328P550P584P618P185N928M536M012
54017B09859M341M669M557M208L706K864J772Q75M58M06M12J00q24k230l539m318
54001B27316m714n101n542n813n643m881l705k746k578k979l241l195l289l545
$$ plain form
53987 170344 167084 164933 163914 163139 161785 159715 157221 154703 152572 150982 149580 147907 146046 144479
53973 144479 143346 142345 141343 140561 140109 139822 139667 139885 140522 141198 141505 141454 141406 141699 142394 143272 144137 145150
53955 145150 146606 148305 149601 150354 151386 153491 156370 159091 161283 163196 164871 166040 166781 167581 168755
53940 168755 170449 173087 177037 181746 185990 189228 192027 194870 197202 198116 197577 196513 195889 195982 196434 196729
53924 196729 196656 196369 196131 196208 197060 199245 202810 207162 211911 217439 224071 231121 237558 243371 249473 256337
53908 256337 263686 271430 279856 288617 296495 302730 307868 312781 317487 321476 324616 327120 328951 329903
53894 329903 330113 329963 329561 328727 327377 325569 323181 319892 315525 310248 304333 297799 290357 281794 272456
53879 272456 263283 255180 248417 242653 237358 232074 226535 220872 215522 210678 206034 201320 196767 192610
$$ packed form
53987A70344l260k151j019p75j354k070k494k518k131j590j402j673j861j567
53973A44479j133j001j002p82m52k87j55K18O37O76L07n1m8K93O95Q78Q65J013
53955A45150J456J699J296P53J032K105K879K721K192J913J675J169P41Q00J174
53940A68755J694K638L950M709M244L238K799K843K332R14n39j064o24R3M52K95
53924A96729p3k87k38P7Q52K185L565M352M749N528O632P050O437N813O102O864
53908B56337P349P744Q426Q761P878O235N138M913M706L989L140K504J831R52
53894C29903K10j50m02q34j350j808k388l289m367n277n915o534p442q563r338
53879B72456r173q103o763n764n295n284n539n663n350m844m644m714m553m157
$$ plain form
53865 192610 188516 184151 179965 176634 173816 170409 166220 162485 160307 159199 157616 154525 150092 145210
53851 145210 140793 137300 134665 132619 131010 129594 127775 125143 122246 120139 119046 118125 116782 115523
53837 115523 115108 115456 115924 116217 116438 116567 116478 116326 116399 116613 116522 115877 114890 114011 113632 113973 114943 116063 116690
53818 116690 116484 115702 114978 114785 115058 115427 115810 116553 117930 119801 121998 124666 127866 131109 133784 135941
53802 135941 138197 141016 144503 148688 153400 158020 162060 165957 170566 175775 180443 183964 187188 191360
53788 191360 196711 202532 208140 213267 217753 221351 223861 225319 226191 227282 229028 230868 231792 231594 230976
53773 230976 230289 228877 226087 222331 218620 215456 212629 209801 206762 203380 199767 196358 193538 191288
53759 191288 189430 187940 186712 185314 183311 180724 177875 174981 172127 169503 167399 166056 165558 165679 165812
$$ packed form
53865A92610m094m365m186l331k818l407m189l735k178j108j583l091m433m882
53851A45210m417l493k635k046j609j416j819k632k897k107j093r21j343j259
53837A15523m15L48M68K93K21J29q9j52P3K14r1o45r87q79l79L41R70J120O27
53818A16690k06p82p24j93K73L69L83P43J377J871K197K668L200L243K675K157
53802A35941K256K819L487M185M712M620M040L897M609N209M668L521L224M172
53788A91360N351N821N608N127M486L598K510J458Q72J091J746J840R24j98o18
53773B30976o87j412k790l756l711l164k827k828l039l382l613l409k820k250
53759A91288j858j490j228j398k003k587k849k894k854k624k104j343m98J21J33
$$ plain form
53744 165812 165439 164800 164648 165146 165473 164844 163504 162307 161716 161660 162049 162841 163715 164204 164104 163448 162206 160404
53726 160404 158504 157253 157075 157754 158664 159141 158777 157614 156087 154627 153414 152566 152314 152774 153732 154924
53710 154924 156415 158426 160892 163370 165345 166479 166781 166743 167180 168606 170783 173066 175127 177163 179437
53695 179437 181914 184424 186989 189807 192911 196036 198938 201801 205093 208989 213187 217446 221985 226984
53681 226984 231944 236042 239061 241500 243779 245871 247757 249609 251244 251987 251535 250620 250313 250763 251037 250197
53665 250197 248269 246104 244421 243101 241446 239085 236463 234278 232641 231099 229344 227555 226102 225223
53651 225223 224958 225008 224736 223733 222361 221291 220538 219524 218119 217005 216743 217016 217104 216707 216007 215301 214887
53634 214887 215050 215869 217202 218931 220967 222952 224347 224977 225188 225424 225953 227011 228729 230801 232747 234627
$$ packed form
53744A65812l73o39j52M98L27o29j340j197n91n6L89P92Q74M89j00o56j242j802
53726A60404j900j251j78O79R10M77l64j163j527j460j213q48k52M60R58J192
53710A54924J491K011K466K478J975J134L02l8M37J426K177K283K061K036K274
53695A79437K477K510K565K818L104L125K902K863L292L896M198M259M539M999
53681B26984M960M098L019K439K279K092J886J852J635P43m52r15l07M50K74q40
53665B50197j928k165j683j320j655k361k622k185j637j542j755j789j453q79
53651B25223k65N0k72j003j372j070p53j014j405j114k62K73Q8l97p00p06m14
53634B14887J63Q19J333J729K036J985J395O30K11K36N29J058J718K072J946J880
$$ plain form
53618 234627 236981 239885 242622 244568 245976 247616 250099 253730 258495 263837 268857 273129 277089 281420
53604 281420 286418 292013 297940 303692 308796 313332 317811 322451 327167 332271 338356 345256 351893 357553
53590 357553 362570 367441 372108 376605 381535 387133 392594 397111 401007 405034 409106 412550 415207 417463
53576 417463 419498 421286 423109 425304 427658 429622 430951 431670 431764 431427 431259 431600 432025 432047 431952 432298 432993
53559 432993 433526 433771 433892 433851 433687 433875 434627 435273 435165 434772 434933 435384 435144 434173 433532 433871 434835 436029 437575
53540 437575 439516 441559 443656 446017 448433 450341 451798 453580 456050 458686 461027 463429 466513 470470
53526 470470 475227 480750 486925 493536 500623 508396 516741 525291 534111 543679 554010 564424 574483
53513 574483 584671 595904 608815 623701 640554 658778 677300 695378 713165 731358 750614
$$ packed form
53618B34627K354K904K737J946J408J640K483L631M765N342N020M272L960M331
53604B81420M998N595N927N752N104M536M479M640M716N104O085O900O637N660
53590C57553N017M871M667M497M930N598N461M517L896M027M072L444K657K256
53576D17463K035J788J823K195K354J964J329P19R4l37j68L41M25K2r5L46O95
53559D32993N33K45J21m1j64J88P52O46j08l93J61M51k40r71o41L39R64J194J546
53540D37575J941K043K097K361K416J908J457J782K470K636K341K402L084L957
53526D70470M757N523O175O611P087P773Q345Q550Q820R568J0331J0414J0059
53513E74483J0188J1233J2911J4886J6853J8224J8522J8078J7787J8193J9256
$$ plain form
53502 750614 771364 793791 817755 843008 869557 897502 926499 955848 985202 1014840 1045245
53491 1045245 1076708 1109219 1142185 1174413 1205035 1234481 1263878 1293507 1322704 1351327 1380360
53480 1380360 1410601 1441589 1472388 1502722 1532814 1562603 1591829 1620484 1648626 1676055 1702610
53469 1702610 1728447 1753546 1777277 1798934 1818441 1836129 1852133 1866427 1879135 1890373 1900029
53458 1900029 1908169 1915329 1921853 1927137 1930092 1930225 1927731 1922746 1915195 1905435 1894351 1882409 1868965
53445 1868965 1852851 1833522 1811546 1788098 1764041 1739273 1712932 1684384 1654107 1623434 1593300
53434 1593300 1563444 1532993 1501727 1470494 1440391 1411859 1384744 1359014 1335037 1313140 1293189
53423 1293189 1274696 1257114 1240000 1223332 1207903 1195020 1185361 1178300 1172647 1167868 1164271 1162327
$$ packed form
53502G50614K0750K2427K3964K5253K6549K7945K8997K9349K9354K9638L0405
53491A045245L1463L2511L2966L2228L0622K9446K9397K9629K9197K8623K9033
53480A380360L0241L0988L0799L0334L0092K9789K9226K8655K8142K7429K6555
53469A702610K5837K5099K3731K1657J9507J7688J6004J4294J2708J1238R656
53458A900029Q140P160O524N284K955J33k494m985p551r760j1084j1942j3444
53445A868965j6114j9329k1976k3448k4057k4768k6341k8548l0277l0673l0134
53434A593300k9856l0451l1266l1233l0103k8532k7115k5730k3977k1897j9951
53423A293189j8493j7582j7114j6668j5429j2883r659p061n653m779l597j944
$$ plain form
53411 1162327 1162393 1164882 1170020 1177414 1186428 1197047 1209846 1225040 1242191 1260969 1281577 1304150 1328398
53398 1328398 1354254 1382345 1413217 1446490 1481289 1517242 1554589 1593570 1634397 1677626 1723814
53387 1723814 1772651 1823056 1874499 1927833 1984361 2044293 2106556 2170050 2234641 2300768 2368538
53376 2368538 2437630 2507796 2578863 2650166 2720574 2789372 2856737 2922965 2987557 3049510 3108265
53365 3108265 3163796 3215802 3263333 3305390 3341695 3372847 3399872 3423491 3443527 3459073 3469446
53354 3469446 3474688 3474895 3469453 3457635 3439766 3417010 3389953 3358074 3320736 3277983 3230039 3176719
53342 3176719 3117946 3054623 2988509 2921284 2853794 2785987 2717414 2648017 2578602 2510380 2444034
53331 2444034 2379485 2316552 2255428 2196416 2139514 2084465 2030961 1978839 1928373 1880325 1835221
$$ packed form
53411A162327O6K489N138P394R014J0619J2799J5194J7151J8778K0608K2573K4248
53398A328398K5856K8091L0872L3273L4799L5953L7347L8981M0827M3229M6188
53387A723814M8837N0405N1443N3334N6528N9932O2263O3494O4591O6127O7770
53376B368538O9092P0166P1067P1303P0408O8798O7365O6228O4592O1953N8755
53365C108265N5531N2006M7531M2057L6305L1152K7025K3619K0036J5546J0373
53354C469446N242K07n442j1818j7869k2756k7057l1879l7338m2753m7944n3320
53342C176719n8773o3323o6114o7225o7490o7807o8573o9397o9415o8222o6346
53331B444034o4549o2933o1124n9012n6902n5049n3504n2122n0466m8048m5104
$$ plain form
53320 1835221 1792643 1751775 1712703 1676503 1643806 1613971 1585971 1559483 1534643 1511318 1489227
53309 1489227 1468412 1449051 1431060 1414413 1399573 1387079 1376888 1368577 1362061 1357613 1355264 1354601
53297 1354601 1355169 1356701 1359012 1362080 1366243 1372007 1379553 1388574 1398595 1409307 1420751 1433372 1447901
53284 1447901 1464964 1484750 1507044 1531413 1557374 1584638 1613369 1643924 1676081 1708717 1740606
53273 1740606 1771506 1802180 1833390 1864981 1895910 1924960 1951431 1975331 1997002 2016657 2034323
53262 2034323 2050015 2063669 2074922 2083350 2088998 2092350 2093602 2092290 2087856 2080265 2069833 2056729 2041025
53249 2041025 2023051 2003310 1981989 1958709 1932753 1903506 1870964 1836012 1800090 1764307 1728830
53238 1728830 1693123 1656618 1619241 1581553 1544562 1509054 1474890 1441146 1407125 1373113 1340047
$$ packed form
53320A835221m2578m0868l9072l6200l2697k9835k8000k6488k4840k3325k2091
53309A489227k0815j9361j7991j6647j4840j2494j0191q311o516m448k349o63
53297A354601N68J532K311L068M163N764P546R021J0021J0712J1444J2621J4529
53284A447901J7063J9786K2294K4369K5961K7264K8731L0555L2157L2636L1889
53273A740606L0900L0674L1210L1591L0929K9050K6471K3900K1671J9655J7666
53262B034323J5692J3654J1253Q428N648L352J252j312m434p591j0432j3104j5704
53249B041025j7974j9741k1321k3280k5956k9247l2542l4952l5922l5783l5477
53238A728830l5707l6505l7377l7688l6991l5508l4164l3744l4021l4012l3066
$$ plain form
53227 1340047 1308678 1279191 1251404 1225002 1199694 1175316 1151774 1128872 1106441 1084636 1063829
53216 1063829 1044095 1025115 1006750 989361 973306 958311 943638 928753 913731 899117 885541
53205 885541 873210 861613 849832 837240 823807 809775 795318 780552 765622 750780 736578
53194 736578 723747 712364 701317 689308 676382 663641 651348 638369 623944 608949 594611
53183 594611 580806 566693 552430 539041 526773 514785 502530 490411 478837 467532 456180
53172 456180 445141 435016 425932 417665 410098 403164 396534 389694 382323 374496 366630 359271 352772 347012
53158 347012 341512 335894 330154 324539 319271 314361 309596 304718 299708 294859 290487 286666 283306 280353
53144 280353 277766 275438 273359 271772 270991 271074 271694 272297 272406 272012 271670 271939 272747 273612 274564 276302 279291
$$ packed form
53227A340047l1369k9487k7787k6402k5308k4378k3542k2902k2431k1805k0807
53216A063829j9734j8980j8365j7389j6055j4995j4673j4885j5022j4614j3576
53205H85541j2331j1597j1781j2592j3433j4032j4457j4766j4930j4842j4202
53194G36578j2831j1383j1047j2009j2926j2741j2293j2979j4425j4995j4338
53183E94611j3805j4113j4263j3389j2268j1988j2255j2119j1574j1305j1352
53172D56180j1039j0125r084q267p567o934o630o840p371p827p866p359o499n760
53158C47012n500n618n740n615n268m910m765m878n010m849m372l821l360k953
53144B80353k587k328k079j587p81Q3O20O03J09l94l42K69Q08Q65R52J738K989
$$ plain form
53127 279291 283157 287329 291689 296141 300044 302859 305076 307749 311094 314177 316042 316584 316151 314857 312599
53112 312599 309454 305728 301679 297286 292290 286557 280449 274650 269439 264333 258716 252621 246587 240893
53098 240893 235362 229812 224296 218924 213814 209260 205569 202677 200149 197619 195024 192410 189767 187168
53084 187168 184849 183073 181828 180630 178704 175690 172214 169435 167809 166664 165117 163020 160734 158565
53070 158565 156873 156155 156373 156617 156132 155358 155206 155598 155654 155110 154578 154406 154228 153799 153316 152690 151451 149803
53052 149803 148880 149282 150042 149741 148172 146286 144891 144036 143407 142656 141457 139758 137943 136468 135451 134900
53036 134900 135032 135895 136849 136901 135578 133210 130468 127963 126156 125197 124791 124460 124019 123648 123556 123702 123755 123198
53018 123198 121742 119895 118853 119429 121184 122947 124019 124430 124249 123433 122418 122138 122982 124225 124974 125274
$$ packed form
53127B79291L866M172M360M452L903K815K217K673L345L083J865N42m33j294k258
53112C12599l145l726m049m393m996n733o108n799n211n106n617o095o034n694
53098B40893n531n550n516n372n110m554l691k892k528k530k595k614k643k599
53084A87168k319j776j245j198j926l014l476k779j626j145j547k097k286k169
53070A58565j692p18K18K44m85p74j52L92N6n44n32j72j78m29m83o26j239j648
53052A49803r23M02P60l01j569j886j395q55o29p51j199j699j815j475j017n51
53036A34900J32Q63R54N2j323k368k742k505j807r59m06l31m41l71r2J46N3n57
53018A23198j456j847j042N76J755J763J072M11j81q16j015k80Q44J243P49L00
$$ plain form
53002 125274 125769 126565 127107 127134 127059 127237 127453 127497 127782 128930 130889 132935 134511 135763 137287 139553 142595
52985 142595 146031 149403 152629 156058 159972 164226 168585 173192 178292 183663 188797 193563 198186 202563
52971 202563 206157 208692 210431 211611 212125 211980 211422 210253 207697 203531 198817 194834 191623 188322 184608
52956 184608 180962 177659 174464 171449 169193 167797 166408 164221 161527 159229 157702 156581 155454 154204
52942 154204 152781 151111 149327 147829 146977 146867 147385 148296 149272 150013 150450 150720 150912 150932 150651 150051 149156 147957
52924 147957 146645 145816 146128 147608 149533 151192 152496 153650 154499 154745 154645 154864 155481 155734 155082 154059
52908 154059 153601 153778 153708 152692 151067 149910 150120 151722 153844 155317 155566 155024 154745 155613 157814 160768
52892 160768 163445 165035 165515 165507 165557 165772 166150 166859 167914 168879 169189 168689 167735 166961 167051 168343 170438 172435
$$ packed form
53002A25274M95P96N42K7p5J78K16M4K85J148J959K046J576J252J524K266L042
52985A42595L436L372L226L429L914M254M359M607N100N371N134M766M623M377
52971B02563L594K535J739J180N14j45n58j169k556m166m714l983l211l301l714
52956A84608l646l303l195l015k256j396j389k187k694k298j527j121j127j250
52942A54204j423j670j784j498q52j10N18R11R76P41M37K70J92K0k81o00q95j199
52924A47957j312q29L12J480J925J659J304J154Q49K46j00K19O17K53o52j023
52908A54059m58J77p0j016j625j157K10J602K122J473K49n42k79Q68K201K954
52892A60768K677J590M80qN0K15L78P09J055R65L10n00r54p74R0J292K095J997
$$ plain form
52874 172435 173770 174623 175464 176617 178395 181050 184198 186783 188159 188902 190111 192232 194989 198125 201625
52859 201625 205403 209285 213221 217138 220817 224249 227803 231676 235531 239078 242561 246119 249150 251017
52845 251017 252013 252863 253597 253782 253558 253503 253504 252719 250690 247733 244240 240426 236799 233915 231455 228371 224301
52828 224301 220076 216530 213477 210234 206565 202768 199317 196654 194789 192999 190474 187454 184993 183407
52814 183407 181721 179076 175927 173319 171579 170305 169177 168168 167278 166539 166021 165497 164488 163004 161816
52799 161816 161541 161800 161747 161049 159885 158350 156467 154594 153210 152336 151602 150871 150366 150144 149861 149203 148366
52782 148366 147924 148215 148853 148981 148090 146467 144642 142686 140531 138738 138211 138892 139497 138967 137709 136889 136883
52765 136883 136964 136351 135032 133555 132450 131933 131899 132030 131937 131339 130235 128996 128112 127657 127092 125846 123969
$$ packed form
52874A72435J335Q53Q41J153J778K655L148K585J376P43J209K121K757L136L500
52859B01625L778L882L936L917L679L432L554L873L855L547L483L558L031J867
52845B51017R96Q50P34J85k24n5Jp85k029k957l493l814l627k884k460l084m070
52828B24301m225l546l053l243l669l797l451k663j865j790k525l020k461j586
52814A83407j686k645l149k608j740j274j128j009q90p39n18n24j009j484j188
52799A61816k75K59n3o98j164j535j883j873j384q74p34p31n05k22k83o58q37
52782A48366m42K91O38J28q91j623j825j956k155j793n27O81O05n30j258q20o
52765A36883Q1o13j319j477j105n17l4J31r3n98j104j239q84m55n65j246j877
$$ plain form
52748 123969 121959 120159 118731 117968 118007 118335 118234 117736 117472 117558 117409 116876 116659 117155 117619 117115 115824 114766
52730 114766 114532 114801 114898 114395 113352 112307 111930 112433 113495 114840 116506 118402 120046 121019 121395 121507 121735
52713 121735 122625 124635 127425 129955 131703 133322 135689 138798 142120 145572 149423 153441 156740 158513
52699 158513 158636 157673 156494 155656 155000 154077 152904 151784 150335 147601 143535 139562 136964 135404 133798
52684 133798 132052 130918 130443 129643 127785 125200 122658 120551 118805 117104 115073 112568 109858 107265 104698
52669 104698 101867 98875 96285 94604 93835 93471 92849 91817 91042 91208 91861 91738 90490 89284 89123 89404
52653 89404 88990 88018 87548 87788 87856 87236 86451 86138 86341 86905 87743 88458 88396 87500 86593 86504 87227 88165 88852 89248
52633 89248 89572 90041 90678 91402 92336 93784 95655 97239 97967 98079 98135 98116 97625 96755 96104 95983 96196 96567 97107
$$ packed form
52748A23969k010j800j428p63L9L28j01m98k64Q6j49n33k17M96M64n04j291j058
52730A14766k34K69R7n03j043j045l77N03J062J345J666J896J644R73L76J12K28
52713A21735Q90K010K790K530J748J619K367L109L322L452L851M018L299J773
52699A58513J23r63j179q38o56r23j173j120j449k734m066l973k598j560j606
52684A33798j746j134m75q00j858k585k542k107j746j701k031k505k710k593k567
52669A04698k831k992k590j681p69l64o22j032p75J66O53j23j248j206j61K81
52653H9404m14r72m70K40O8o20p85l13K03N64Q38P15o2q96r07q9P23R38O87L96
52633H9248L24M69O37P24R34J448J871J584P28J12N6j9m91q70o51j21K13L71N40
$$ plain form
52614 97107 97610 97725 97552 97693 98517 99714 100643 100832 100175 99026 98071 97812 98181 98912 99986 101338 102476
52597 102476 102978 103166 103674 104540 105426 106514 108285 110438 111974 112579 113096 114269 115748 116767 117272 117901
52581 117901 119190 121143 123287 124957 125808 126194 126736 127480 127901 127779 127562 127741 128377 129437 131047 133129
52565 133129 135229 136970 138359 139467 140227 140777 141530 142670 143880 144888 145873 147105 148474 149708 150718
52550 150718 151502 151969 152122 152179 152311 152502 152875 153792 155375 157206 158806 160204 161686 163170 164156 164284 163706
52533 163706 162849 161977 161090 160222 159760 160238 161759 163751 165446 166420 166615 166189 165649 165709 166572 167590 168134 168467
52515 168467 169175 170091 170595 170804 171489 172727 173620 173602 173137 172788 172491 172241 172637 173986 175526 176387 176843 177822
52497 177822 179448 180951 181914 182831 184276 186121 187776 188835 189324 189620 190179 191173 192313 193200 193848 194722
$$ packed form
52614I7107N03J15j73J41Q24J197R29J89o57j149r55k59L69P31J074J352J138
52597A02476N02J88N08Q66Q86J088J771K153J536O05N17J173J479J019N05O29
52581A17901J289J953K144J670Q51L86N42P44M21j22k17J79O36J060J610K082
52565A33129K100J741J389J108P60N50P53J140J210J008R85J232J369J234J010
52550A50718P84M67J53N7J32J91L73R17J583J831J600J398J482J484R86J28n78
52533A63706q57q72q87q68m62M78J521J992J695R74J95m26n40O0Q63J018N44L33
52515A68467P08R16N04K09O85J238Q93j8m65l49k97k50L96J349J540Q61M56R79
52497A77822J626J503R63R17J445J845J655J059M89K96N59R94J140Q87O48Q74
$$ plain form
52481 194722 196261 198460 200824 202675 203638 204049 204746 206313 208598 211108 213663 216383 219146 221456 222935
52466 222935 223709 224212 224743 225390 226269 227567 229232 230771 231605 231660 231443 231447 231640 231618 231098 230171 229245 228795 228931
52447 228931 229103 228559 227248 225931 225117 224367 223059 221416 220172 219475 218742 217476 215663 213559 211661 210756
52431 210756 211182 212112 212284 211506 210723 210520 210408 209827 209036 208565 208375 208045 207372 206454 205590 205297 205984 207315
52413 207315 208361 208623 208439 208195 207762 207026 206324 205857 205252 204292 203602 203961 205188 206326 206719 206428 205797 205140
52395 205140 204793 204968 205472 205865 205900 205672 205470 205646 206460 207840 209408 210827 211982 212807 213342 214013 215396
52378 215396 217461 219467 220873 221920 223007 223914 224118 223634 223140 223389 224742 227051 229734 232192 234335
52363 234335 236502 238769 240720 242066 243060 243988 244714 245045 245163 245380 245763 246299 247062 247998 248944 250070 251765
$$ packed form
52481A94722J539K199K364J851R63M11O97J567K285K510K555K720K763K310J479
52466B22935P74N03N31O47Q79J298J665J539Q34N5k17MJ93k2n20r27r26m50J36
52447B28931J72n44j311j317q14p50j308j643j244o97p33j266j813k104j898r05
52431B10756M26R30J72p78p83k03j12n81p91m71j90l30o73r18q64k93O87J331
52413B07315J046K62j84k44m33p36p02m67o05r60o90L59J227J138L93k91o31o57
52395B05140l47J75N04L93L5k28k02J76Q14J380J568J419J155Q25N35O71J383
52378B15396K065K006J406J047J087R07K04m84m94K49J353K309K683K458K143
52363B34335K167K267J951J346R94R28P26L31J18K17L83N36P63R36R46J126J695
$$ plain form
52346 251765 253831 255428 256228 256972 258379 260145 261654 263036 264719 266488 267879 269097 270663 272422 273858
52331 273858 275111 276725 278446 279285 278890 278029 277572 277727 278426 279712 281484 283458 285595 288062 290720 293253
52315 293253 295885 299261 303486 307973 312481 317555 323480 329530 334850 339645 344885 351115 358102 365507
52301 365507 373348 381783 390781 400109 409520 418971 428675 438812 449167 459328 469387 480177 492553
52288 492553 506555 521443 536436 551240 565996 580887 595826 610449 624544 638527 653230
52277 653230 668978 684996 699998 713410 725784 738002 750222 761753 771783 780078 787009 793077
52265 793077 798481 803052 806488 808742 810117 810897 810846 809420 806576 803068 799660 796340 792691 788722 784803
52250 784803 780954 776893 772802 769354 766864 765067 763903 763803 764840 766354 767982 770460 774775 780986
$$ packed form
52346B51765K066J597Q00P44J407J766J509J382J683J769J391J218J566J759J436
52331B73858J253J614J721Q39l95q61m57J55O99J286J772J974K137K467K658K533
52315B93253K632L376M225M487M508N074N925O050N320M795N240O230O987P405
52301C65507P841Q435Q998R328R411R451R704J0137J0355J0161J0059J0790J2376
52288D92553J4002J4888J4993J4804J4756J4891J4939J4623J4095J3983J4703
52277F53230J5748J6018J5002J3412J2374J2218J2220J1531J0030Q295O931O068
52265G93077N404M571L436K254J375P80n1j426k844l508l408l320l649l969l919
52250G84803l849m061m091l448k490j797j164j00J037J514J628K478M315O211
$$ plain form
52236 780986 788542 797303 807433 818597 830160 842143 855153 869211 883311 896384 908249 919371
52224 919371 930054 940080 948999 956604 963179 969209 974728 979129 981783 982619 981909 979807 976465 972219
52210 972219 967181 960852 952656 942718 931651 919750 906922 893280 879228 865043 850897 837222
52198 837222 824465 812466 800640 788854 777603 767309 757964 749475 741764 734442 727011 719601 712952
52185 712952 707425 702498 697525 692515 687819 683445 679044 674303 669107 663517 657870 652698 648293 644544
52171 644544 641282 638508 636060 633383 629979 625945 621785 617758 613680 609386 605191 601749 599415 597807
52157 597807 596072 593642 590689 587821 585509 583821 582440 580803 578471 575621 572935 570775 568734 566291
52143 566291 563580 561045 558566 555565 551918 548293 545419 543354 541496 539069 535705 531850 528467 526076
$$ packed form
52236G80986P556Q761J0130J1164J1563J1983J3010J4058J4100J3073J1865J1122
52224I19371J0683J0026Q919P605O575O030N519M401K654Q36p10k102l342m246
52210I72219n038o329q196r938j1067j1901j2828j3642j4052j4185j4146j3675
52198H37222j2757j1999j1826j1786j1251j0294r345q489p711p322p431p410o649
52185G12952n527m927m973n010m696m374m401m741n196n590n647n172m405l749
52171F44544l262k774k448k677l404m034m160m027m078m294m195l442k334j608
52157E97807j735k430k953k868k312j688j381j637k332k850k686k160k041k443
52143E66291k711k535k479l001l647l625k874k065j858k427l364l855l383k391
$$ plain form
52129 526076 524275 522490 520802 519519 518323 516637 514606 512890 511504 509777 507575 505649 504524 503862
$$ packed form
52129E26076j801j785j688j283j196j686k031j716j386j727k202j926j125o62
$$ [...]
##END NTUPLES=NMR SPECTRUM
##END=
