
##TITLE=AC1356_CPIAH12175_6945563_JRe93f0Dzk
##JCAMPDX= 6.0         $$ Bruker NMR JCAMP-DX V2.0
##DATA TYPE= NMR SPECTRUM
##DATA CLASS= NTUPLES
##ORIGIN= BRUKER
##OWNER= Administrator
$$ 1.72 TOPSPIN		Version 2.1
$$ 2012-10-18 13:46:50.975 -0700  Administrator@X
$$ Compression mode = diff/dup
##.OBSERVE FREQUENCY= 400.02188249412
##.OBSERVE NUCLEUS= ^1H
##.ACQUISITION MODE= SIMULTANEOUS (DQD)
##.ACQUISITION SCHEME= undefined
##.AVERAGES= 8
##.DIGITISER RES= 22
##SPECTROMETER/DATA SYSTEM= spect
##.PULSE SEQUENCE= zg30
##.SOLVENT NAME= COFFEE_meoh
##.SHIFT REFERENCE= INTERNAL, COFFEE_meoh, 1, 14.98509
##AUDIT TRAIL= $$ (NUMBER, WHEN, WHO, WHERE, PROCESS, VERSION, WHAT)
$$ ##TITLE= Audit trail, TOPSPIN		Version 2.1
$$ ##JCAMPDX= 5.01
$$ ##ORIGIN= Bruker BioSpin GmbH
$$ ##OWNER= Administrator
$$ $$ C:\Bruker\TOPSPIN/data/COFFEE/nmr/AC1356_CPIAH12175_6945563_JRe93f0Dzk/10/pdata/1/auditp.txt
$$ ##AUDIT TRAIL=  $$ (NUMBER, WHEN, WHO, WHERE, PROCESS, VERSION, WHAT)
(   1,<2012-10-13 21:38:41.218 -0500>,<Administrator>,<TOPSPIN>,<go>,<TOPSPIN 2.1>,
      <created by zg
	started at 2012-10-13 21:37:34.296 -0500,
	POWCHK enabled, PULCHK disabled,
       configuration hash MD5:
       6B 1B 68 BB D9 2E 58 E2 7F 35 AD 54 07 DF 0E 41
       data hash MD5: 64K
       2C 0A 3A 4A 60 EE D8 24 6A 12 30 85 CB 40 45 9A>)
(   2,<2012-10-13 21:38:43.906 -0500>,<Administrator>,<TOPSPIN>,<proc1d>,<TOPSPIN 2.1>,
      <Start of raw data processing
       efp LB = 0 FT_mod = 6 PKNL = 1 PHC0 = 0 PHC1 = 0 SI = 32K 
       data hash MD5: 32K
       43 CD 67 82 02 C9 87 18 C7 CD D0 8C 07 34 84 F4>)
(   3,<2012-10-13 21:38:44.296 -0500>,<Administrator>,<TOPSPIN>,<proc1d>,<TOPSPIN 2.1>,
      <pk PHC0 = 182.8015 PHC1 = 0 
       data hash MD5: 32K
       41 0F A8 75 3E 94 3F 0C 56 DB FC C3 F0 1C D9 E3>)
(   4,<2012-10-13 21:38:44.390 -0500>,<Administrator>,<TOPSPIN>,<proc1d>,<TOPSPIN 2.1>,
      <abs ABSG = 1 
       data hash MD5: 32K
       D3 83 0D 3F 9F 58 B6 D2 1E 73 88 60 5E A9 96 97>)
(   5,<2012-10-13 21:38:44.421 -0500>,<Administrator>,<TOPSPIN>,<proc1d>,<TOPSPIN 2.1>,
      <abs ABSG = 2 
       data hash MD5: 32K
       0B BE D0 EF FE 75 42 2D 12 9E 2A D0 05 EB FF 8D>)
(   6,<2012-10-13 21:38:44.453 -0500>,<Administrator>,<TOPSPIN>,<proc1d>,<TOPSPIN 2.1>,
      <abs ABSG = 3 
       data hash MD5: 32K
       C6 3F F7 12 20 A8 13 0C 4B 39 9F A0 2F 45 53 B6>)
(   7,<2012-10-13 21:38:44.484 -0500>,<Administrator>,<TOPSPIN>,<proc1d>,<TOPSPIN 2.1>,
      <abs ABSG = 4 
       data hash MD5: 32K
       01 B3 E7 ED 69 A3 04 82 23 08 67 48 11 6B 97 D6>)
(   8,<2012-10-13 21:38:44.515 -0500>,<Administrator>,<TOPSPIN>,<proc1d>,<TOPSPIN 2.1>,
      <abs ABSG = 5 
       data hash MD5: 32K
       42 A2 76 F3 19 52 CC 6A CA B9 FF C3 5E 09 8C AE>)
(   9,<2012-10-13 21:38:48.421 -0500>,<Administrator>,<TOPSPIN>,<audit>,<TOPSPIN 2.1>,
      <user comment:
       ICON-NMR User ID: COFFEE
       data hash MD5: 32K
       42 A2 76 F3 19 52 CC 6A CA B9 FF C3 5E 09 8C AE>)
$$ ##END=
$$ [...]
150 150 150 150 150 150 150 150
##$TP07= 0
##$TPNAME0= <>
##$TPNAME1= <>
##$TPNAME2= <>
##$TPNAME3= <>
##$TPNAME4= <>
##$TPNAME5= <>
##$TPNAME6= <>
##$TPNAME7= <>
##$TPOAL= (0..7)
0.5 0.5 0.5 0.5 0.5 0.5 0.5 0.5
##$TPOFFS= (0..7)
0 0 0 0 0 0 0 0
##$TUNHIN= 0
##$TUNHOUT= 0
##$TUNXOUT= 0
##$USERA1= <user>
##$USERA2= <user>
##$USERA3= <user>
##$USERA4= <user>
##$USERA5= <user>
##$V9= 5
##$VALIST= <valist>
##$VCLIST= <CCCCCCCCCCCCCCC>
##$VD= 0
##$VDLIST= <DDDDDDDDDDDDDDD>
##$VPLIST= <PPPPPPPPPPPPPPP>
##$VTLIST= <TTTTTTTTTTTTTTT>
##$WBST= 2048
##$WBSW= 25
##$XGAIN= (0..3)
0 0 0 0
##$XL= 0
##$YL= 0
##$YMAX_a= 493211
##$YMIN_a= -634350
##$ZGOPTNS= <>
##$ZL1= 120
##$ZL2= 120
##$ZL3= 120
##$ZL4= 120
##$ABSF1= 14.98509
##$ABSF2= -5.573092
##$ABSG= 5
##$ABSL= 3
##$ALPHA= 0
##$AQORDER= 0
##$ASSFAC= 0
##$ASSFACI= 0
##$ASSFACX= 0
##$ASSWID= 0
##$AUNMP= <proc_prof1d_extract_pilot.lims>
##$AXLEFT= 0
##$AXNAME= <>
##$AXNUC= <1H>
##$AXRIGHT= 0
##$AXTYPE= 0
##$AXUNIT= <>
##$AZFE= 0.1
##$AZFW= 0.1
##$BCFW= 0
##$BC_mod= 0
##$BYTORDP= 0
##$COROFFS= 0
##$CY= 15
##$DATMOD= 1
##$DC= 0
##$DFILT= <>
##$DTYPP= 0
##$F1P= 0
##$F2P= 0
##$FCOR= 0.5
##$FTSIZE= 32768
##$FT_mod= 6
##$GAMMA= 0
##$GB= 0
##$INTBC= 1
##$INTSCL= 1
##$ISEN= 128
##$LB= 0
##$LEV0= 0
##$LPBIN= 0
##$MAXI= 10000
##$MC2= 0
##$MEAN= 0
##$ME_mod= 0
##$MI= 0
##$NCOEF= 0
##$NC_proc= -8
##$NLEV= 6
##$NOISF1= 0
##$NOISF2= 0
##$NSP= 0
##$NTH_PI= 0
##$NZP= 0
##$OFFSET= 14.98509
##$PC= 1
##$PHC0= 182.8015
##$PHC1= 0
##$PH_mod= 1
##$PKNL= yes
##$PPARMOD= 0
##$PPDIAG= 0
##$PPIPTYP= 0
##$PPMPNUM= 2147483647
##$PPRESOL= 1
##$PSCAL= 4
##$PSIGN= 0
##$PYNMP= <proc.py>
##$REVERSE= no
##$SF= 400.02
##$SI= 32768
##$SIGF1= 0
##$SIGF2= 0
##$SINO= 400
##$SIOLD= 32768
##$SPECTYP= <>
##$SREGLST= <1H.CDCl3>
##$SSB= 0
##$STSI= 32768
##$STSR= 0
##$SW_p= 8223.68421052631
##$SYMM= 0
##$S_DEV= 0
##$TDeff= 65536
##$TDoff= 0
##$TI= <>
##$TILT= no
##$TM1= 0
##$TM2= 0
##$TOPLEV= 0
##$USERP1= <user>
##$USERP2= <user>
##$USERP3= <user>
##$USERP4= <user>
##$USERP5= <user>
##$WDW= 1
##$XDIM= 32768
##$YMAX_p= 448921633
##$YMIN_p= -691742
##$CURPLOT= <Network HP LaserJet P1505>
##$CURPRIN= <$Network HP LaserJet P1505>
##$DFORMAT= <normdp>
##$LAYOUT= <+/1D_H.xwp>
##$LFORMAT= <normlp>
##$PFORMAT= <normpl>
##$SURQMSG= 1
$$ End of Bruker specific parameters
$$ ---------------------------------
##NTUPLES= NMR SPECTRUM
##VAR_NAME=  FREQUENCY,     SPECTRUM/REAL,   SPECTRUM/IMAG
##SYMBOL=    X,             R,               I
##VAR_TYPE=  INDEPENDENT,   DEPENDENT,       DEPENDENT
##VAR_FORM=  AFFN,          ASDF,            ASDF
##VAR_DIM=   32768,         32768,           32768
##UNITS=     HZ,            ARBITRARY UNITS, ARBITRARY UNITS
##FACTOR=    0.250966925370066, 1,           1
##FIRST=     8223.43324360094, -41185,       -185690
##LAST=      0,             84422,           42127
##MIN=       0,             -691742,         0
##MAX=       8223.43324360094, 448921633,    0
$$ Real data points
##PAGE= N=1
##DATA TABLE= (X++(R..R)), XYDATA
$$ [...]
19565a03293o5300o27l5483b3593B09162e3325C9335a41489a8655A30225O7884
19554A98109d00545g9189D4735h6077k03786e3580q5018d8494B00711p1497n9676
19543F9538b17538l4333r4333E9148a42352l675a6013o3061B18275d0932A16548
19531a12730H8936c36434D7523J2079b1536B275d0323k36289h9770r92C04452
19519e327k5713j28181k28638E6377A7824K32265g8847A08797c4790m2113b8467
19507a42696A2767N9800b92583A48721a51665A0162J45183i1399B3929d07083
19496a58747j01512i8641d7351A3283b62182J00378p3551A22843E7567B1262c01697
19484A0675b38493f0659j64933A71701K5668g4870B5380J34930c74488c2699P334
$$ plain form
19565 -103293 -168593 -169220 -204703 -23593 209162 -53325 39335 -141489 -18655 130225 198109
19554 198109 -400545 -79189 44735 -86077 -289863 -53580 -138598 -48494 200711 129214 69538
19543 69538 -217538 -251871 -346204 59148 -142352 -146027 -16013 -79074 218275 -40932 116548
19531 -112730 88936 -336434 47523 59602 -21536 2275 -40323 -276612 -89770 -90762 304452
19519 -5327 -31040 -159221 -387859 56377 17824 250089 -78847 108797 -34790 -76903 -28467
19507 -142696 12767 72567 -292583 148721 -151665 10162 155345 -91399 23929 -407083
19496 -158747 -260259 -98641 -47351 13283 -262182 -161804 -235355 122843 57567 21262 -301697
19484 10675 -238493 -60659 -225592 171701 197369 -74870 25380 160310 -374488 -32699 -25365
19473b5365H1016J6958a59179B05182b15320c8626k53612h1778B458b06058L0616
19462a75442J5048B5216c09406o1208R6960d3819M153I2318g9532k03611a572
19450g5047q3765n4185E998a85590h3932c1681C7099b55445A67218a12796c6750
19438h650k641m8232A02787g1388B62218b43056B96062f039k05315c4033j68569
19427b02602K0579B87233C0884K24873e5908k08571a04365A15882D3299J93321
19417B36620c37941J11623j0931j0779f3197b3039j7810k0300m0357A95327a02537
19405B23919c36376A2808a48115E3796h2949j10873c9589r3834A50233b48839
19394e2996a746A2290e5470A52548K00347b51995g4998l39512G5362f3130m82987
$$ plain form
19473 -25365 81016 97974 -159179 205182 -215320 -38626 -292238 -81778 2458 -206058 -175442
19462 -175442 -160394 25216 -309406 -370614 -273654 -43819 -39666 92318 -79532 -283143 -1572
19450 -75047 -158812 -212997 5998 -185590 -83932 -31681 37099 -255445 167218 -112796 -36750
19438 -8650 -11291 -59523 102787 -71388 262218 -243056 296062 -6039 -211354 -34033 -202602
19427 -202602 -182023 287233 30884 255757 -55908 -264479 -104365 115882 43299 236620
19417 236620 -337941 -226318 -237249 -248028 -63197 -23039 -40849 -61149 -101506 195327 -102537
19405 223919 -336376 12808 -148115 53796 -82949 -193822 -39589 -133423 150233 -248839
19394 -52996 -1746 12290 -55470 152548 352895 -251995 -74998 -414510 75362 -63130 -546117
19383e46117b7614o698A91923a16514B4295c29699a35931C511J25195b3943q8711
19372a12654K1642B02189n1635a31904A56412a01955A61923a34562L6717A53320
19361c19070i556E517R887i1131e652A17636A3674a74709k09894b8108I521a7367
19348C116J84779a76272B02104a36415A65177l7477H083a79848B93237O3317E2931
19336a36207J0643C704b09475r321O8188Q096d5481A55769b46939e2580C32572
19324a65511d2362b0666A21055c51150J49963H5523K7779a8379p9115p9673M1663
19313a35504f6847F9293f1894r9093b5129p0299A00581J05638h8269n7908o6163
19302b12340R7357A13742M0648b38121j64877a53315g2785I6993a37723f6358
$$ plain form
19383 -546117 -27614 -34312 191923 -116514 24295 -329699 -135931 3511 128706 -23943 -112654
19372 -112654 -91012 202189 150554 -131904 156412 -101955 161923 -134562 -97845 153320
19361 -319070 -9556 5517 15404 -91131 -5652 117636 13674 -174709 -384603 -28108 9521 -17367
19348 3116 187895 -176272 202104 -136415 165177 127700 8083 -179848 293237 356554 52931
19336 -136207 -125564 3704 -209475 -218796 -150608 -142512 -45481 155769 -246939 -52580 332572
19324 -165511 -42362 -20666 121055 -351150 -201187 85523 113302 -18379 -97494 -177167 -135504
19313 -135504 -66847 69293 -61894 -160987 -25129 -95428 100581 206219 -88269 -146177 -212340
19302 -212340 -114983 113742 154390 -238121 -402998 -153315 -72785 96993 -137723 -66358
19291a04164q715m2157F5521d5910J3000A00057l0937B4242K19588c56729a23288
19279a00219l02410J68984N5291N6106D1847c16860C69442A2534N8212a01956
19268b62843L2803F1520J45948a27009H2282b7759j9948j02716H7645a76847E1424
19256b01609i5848G2080b69625B45987A21952a22408B6223f0610B03706a95843
19245a52424j4502F2494f3691j63895e2835j19703j34813j0862C012M3430J23515
19234A69957c75997Q3054I3471e3190k28525j44744A49414a33325J8216k7348
19224a42457B55765b38081l4501A67564l3006a43482B0919b71971a16863A62526
19213a18716j83470H9628I200f123B80109j4386F8662a64861A50542a48060D1498
$$ plain form
19291 -104164 -112879 -155036 65521 -45910 -32910 100057 69120 24242 243830 -356729 -123288
19279 -100219 -402629 -233645 -178354 -122248 41847 -316860 369442 12534 70746 -101956
19268 -262843 -230040 61520 207468 -127009 82282 -27759 -47707 -150423 87645 -176847 51424
19256 -201609 -95848 72080 -269625 245987 121952 -122408 26223 -60610 203706 -195843
19245 -152424 -166926 62494 -63691 -227586 -52835 -172538 -307351 -318213 3012 46442 169957
19234 169957 -375997 -292943 93471 -53190 -281715 -426459 149414 -133325 -115109 -142457
19224 -142457 255765 -238081 -272582 167564 134558 -143482 20919 -271971 -116863 162526
19213 -118716 -302186 89628 9200 -6123 280109 265723 68662 -164861 150542 -148060 41498
19201A49613J13636b57979O6764A60015b03604c9170B18716A7319b58871B1664
19190i2569J1139I3743a15281B11808b88401h4052j57978A5554J4620i6975l1858
19179a28833k0025M7983C77670a87287r6974R0443M1416j1258F71J01935A8379
19167d6800k9892p8189p9329l3844A00741b0555m2015k4946j78588k02021G3781
19155e7665q2192j02167g6570a7370o3539b6680n103I0835B6083b50965f1513
19143c80460H987K16442a65282M5486e9657j33660M4086M8993k36395J09704Q2973
19132a43956B32392G0156b07702A65294o5902D9678b1339j10936A53824f1660
19121I3040d2204j13a2601n9431l39744c3414F4970a65357O6814a4679j02186
$$ plain form
19201 149613 263249 -257979 -191215 160015 -203604 -39170 218716 17319 -258871 21664
19190 -92569 -81430 93743 -115281 211808 -288401 -84052 -242030 15554 30174 -96975 -128833
19179 -128833 -148858 -100875 377670 -187287 -284261 -193818 -152402 -163660 671 102606 18379
19167 -46800 -76692 -154881 -234210 -268054 100741 -20555 -62570 -87516 -266104 -468125 73781
19155 -57665 -139857 -242024 -76570 -17370 -80909 -26680 -31783 90835 26083 -250965 -61513
19143 -380460 8987 225429 -165282 -119796 -59657 -193317 -149231 -100238 -336633 -226929 -143956
19132 -143956 232392 70156 -207702 165294 99392 49678 -21339 -132275 153824 -61660
19121 93040 -42204 -42317 -12601 -72032 -411776 -33414 64970 -165357 -98543 -14679 -116865
19110a16865B35663b35989B08317l4299a46876L8630j39962A64364a96439A30629
19099d46499a92718j96810J861C00665b1221j01211I0645a63212c1866j25788
19089a57654B11283d9470l9841A16093D6856m257d5795q2408c43j96620A33053
19077A58901c48125a73911m0321A35127k8394K1829a45032r5112h0128B61338
19066a313m3767k01087A59436o002a96246j85571P7145d5044j6884H2792a41893
19054a15777j55460a4611l2276H8452M4599O0554b15912A63865L0822p4605A4220
19042C5603J50040a15207D24797A20403d48897A53927f0229A01607c56920A9869
19031a58483n7527N6549r8657f8577A05270f3854E9745k112M6965A5749J58972
$$ plain form
19110 -116865 235663 -235989 208317 174018 -146876 -108246 -248208 164364 -196439 130629
19099 -446499 -192718 -389528 -387667 300665 -21221 -122432 90645 -163212 -31866 -157654
19089 -157654 211283 -49470 -89311 116093 46856 42599 -45795 -128203 -343 -196963 133053
19077 158901 -348125 -173911 -214232 135127 106733 128562 -145032 -240144 -80128 261338
19066 -1313 -45080 -246167 159436 153434 -196246 -381817 -304672 -45044 -61928 82792 -141893
19054 -115777 -271237 -14611 -46887 88452 133051 193605 -215912 163865 194687 120082 14220
19042 35603 185643 -115207 424797 120403 -448897 153927 -60229 101607 -356920 19869
19031 -158483 -216010 -159461 -258118 -68577 105270 -63854 59745 57633 104598 15749 174721
19020A74721J61253A60326M95d26232J35639J09107C21593c23819D4259b4310
19009C49358b53215a25344B95289a48618K9415C79192i4753l081B47513a52944
18998b15668d6308o8166k75050F5292a35622b9244m1884C2919J992A4551K50790
18987B65341c43972i8725F7295P2518b55496O3271B08599c29321A30928n998m8129
18976G6801a37608A45353L8733d9602j13132N0107I9230b66029Q7759D9291b63416
18964h7205p4424g057C3571i1799F2326e0784m8261d3381p559k95961C4170a47819
18951a58794M4257A48068b48932C2704J04982c55679f8393a0242n1860D84855
18940a77133M5168n4597A48729a7822k2746F3252Q9159c15537E9851d8154j59101
$$ plain form
19020 174721 335974 160326 160821 -426232 -290593 -181486 321593 -323819 44259 -24310
19009 349358 -253215 -125344 295289 -148618 -119203 379192 -94753 -97834 247513 -152944
18998 -215668 -46308 -114474 -389524 65292 -135622 -29244 -71128 32919 34911 14551 265341
18987 265341 -343972 -98725 67295 139813 -255496 -192225 208599 -329321 130928 124930 76801
18976 76801 -137608 145353 184086 -49602 -162734 -112627 99230 -266029 -178270 49291 -263416
18964 -87205 -161629 -7057 33571 -91799 62326 -50784 -99045 -43381 -50940 -346901 34170 -147819
18951 -158794 -114537 148068 -248932 32704 137686 -355679 -68393 -10242 -62102 484855
18940 -177133 -131965 -186562 148729 -17822 -40568 63252 152411 -315537 59851 -48154 -207255
18929b07255m1244J21125J2747L7401n2963A18056O4204c69537a68076C692a58049
18917A37930a95473A67403k0779D3427i6059J8480K0788A17301c48570B31179
18906e6259m9087j85958d7636k7778j58409i4707B1080J91297C7898a9344j95436
18895b14780F7204J178k930a30329m2103A67576j2364b84849R2207A4897a08851
18883G159a22572C191I74K81475A28747b13474J7709e0098j10956r8584j01991
18872c61629h0949B72293f3354A088d8466n0179m298A98739C0549b97089R8757
18861a98332K3509q4978B5281a28904B46252a54149G0911b00698A32242k0065
18851A12177g5392B03988p5101f9296j11225l6071F5536d33508A84823b46310
$$ plain form
18929 -207255 -248499 -127374 -114627 -77226 -130189 118056 182260 -369537 -168076 3692 -158049
18917 137930 -195473 167403 146624 43427 -96059 -77579 -56791 117301 -348570 231179
18906 -56259 -105346 -291304 -47636 -75414 -233823 -94707 21080 212377 37898 -19344 -214780
18895 -214780 67204 68382 65452 -130329 -172432 167576 155212 -284849 -192642 14897 -108851
18883 7159 -122572 3191 974 282449 128747 -213474 -195765 -50098 -161054 -259638 -361629
18872 -361629 -80949 272293 -63354 1088 -48466 -98645 -102943 198739 30549 -297089 -198332
18861 -198332 -174823 -259801 25281 -128904 246252 -154149 70911 -200698 132242 112177
18851 112177 -75392 203988 128887 -69296 -180521 -216592 65536 -433508 184823 -246310
18840h2328I4029e0520A08351g128k5222k24892g6612G7242b52862R7906b1371
18828G0325d44138A19031h3839A56715J19050c90099a54419O3298m1818O4962
18818f7977A22665J29744D2145a18615c5692A70205R956h1809j40461A15379a18297
18806B76210H4584a35010L3888A40230M0849l5003o2410a87619A75187E6399a07016
18794b09769A03852b27996R1871A19877D3714a73657h3900j15138H3499j5547
18784F7952B3981l068f394A88446M2057c760k78583Q6926P0023l09847a7350I359
18771b67567J1846i4366A63157p2484c80225D4178J00244a77390A41939a97412
18760c6805b520m20124a09528d9237E4692d1259j39613A16495a41871o7444e141
$$ plain form
18840 -82328 94029 -50520 108351 -7128 -32350 -257242 -76612 77242 -252862 -154956 -21371
18828 70325 -444138 119031 -83839 156715 275765 -390099 -154419 -91121 -132939 -67977
18818 -67977 122665 252409 42145 -118615 -35692 170205 180161 -81809 -222270 115379 -118297
18806 276210 84584 -135010 -101122 140230 181079 146076 83666 -187619 175187 56399 -107016
18794 -209769 103852 -227996 -136125 119877 43714 -173657 -83900 -199038 83499 67952
18784 67952 23981 20913 -6394 188446 230503 -3760 -282343 -195417 -125394 -435241 -17350 9359
18771 -267567 -255721 -94366 163157 90673 -380225 44178 144422 -177390 141939 -197412
18760 -36805 -2520 -422644 -109528 -49237 54692 -41259 -180872 116495 -141871 -209315 -5141
18748A23531a11822A69034a23630O1610j73951g3383j97321c1549A77103p8628
18738I8475a88201e9670k18482g4767a3098b428A47159f0941a0752o7859C26181
18726G9037a6076j57085f1397j39737a945B81112g7249o6339L0502A24210A4272
18714C33717A52649b78176M5860M3583b0763A10140f1253A04404a30318A6325
18703a98042R3140C61206a91329A07840K906e4046G9035b7014A36670b9955j7959
18692d7914A9849K36244b27608o9099h2104J4117m6253j99933J40776A30315D6620
18680a18843N1339H437a80046g5k61299B70714e5587j69189J05118b445o3184
18669f5629q2553C9576b6135n0229A70966b21464C65981h2465j57667A3146a06843
$$ plain form
18748 123531 -111822 169034 -123630 -62020 -235971 -73383 -270704 -31549 177103 98475
18738 98475 -188201 -59670 -278152 -74767 -13098 -2428 147159 -60941 -10752 -78611 326181
18726 79037 -16076 -173161 -61397 -201134 -1945 281112 -77249 -143588 -113086 124210 14272
18714 333717 152649 -278176 -232316 -188733 -20763 110140 -61253 104404 -130318 16325
18703 -198042 -104902 361206 -191329 107840 110746 -54046 79035 -27014 136670 -29955 -47914
18692 -47914 19849 256093 -227608 -296707 -82104 -67987 -114240 -314173 -173397 130315 46620
18680 -118843 -67504 8437 -180046 -75 -261374 270714 -55587 -224776 -119658 -2445 -65629
18669 -65629 -148182 39576 -26135 -76364 170966 -221464 365981 -82465 -240132 13146 -106843
18657c5713l3515j40339A4821a27642n2980g384A66250h6220I5220h0297l5030
18646a15327A5855b7593F6504c61216A54596e0474A83455d9291m57252b20858
18635e22971e3271l6101B81026A02937c135B68676L5382c46576b168E403c28655
18623a75318f5094D170A893a11956J1296r8895A90529K1380r7110a39592A73931
18611i3852B40090b75921K9563A64142a1125r341C01887a01951q7840d0528j42303
18600a82831K6165A05572e2955p289k2259j26506C7671J22108g5202A70249h1072
18588c35386A29656c47334a7695A14992a92160C20448b17633C46177A2645a99709
18577H2317Q0090a90050G740g6684c2916k64079a27878I0091b18810j28997F1468
$$ plain form
18657 -35713 -69228 -209567 14821 -127642 -180622 -7384 166250 -86220 95220 -80297 -115327
18646 -115327 15855 -27593 66504 -361216 154596 -50474 183455 -49291 -506543 -220858
18635 -522971 -53271 -89372 281026 102937 -3135 268676 304058 -346576 -2168 5403 -328655
18623 -175318 -65094 4170 1893 -111956 -100660 -199555 190529 211909 114799 -139592 173931
18611 -93852 240090 -275921 -246358 164142 -11125 -20466 301887 -101951 -189791 -40528 -182831
18600 -182831 -156666 105572 -52955 -60244 -82503 -209009 37671 159779 -75202 170249 -81072
18588 -335386 129656 -347334 -17695 114992 -192160 320448 -217633 346177 12645 -199709
18577 82317 162407 -190050 7740 -76684 -32916 -296995 -127878 90091 -218810 -347807 61468
18565B66273F0993d75361C0408d07356B93690i5595E2913b29126F0498Q5978a14865
18553I3565a19486m75721b35565N0681j42626J10571M7089B72086a07585d0706
18542H6720f3821A60395J71002A43872O1524b51620h4054c0655a2500j69676g2272
18530a50560J102h835H2330N8454b06440B3352f8553K4082B1516K11419b05526
18518A79967a94988K5389d4751A12092a24472E316J9456a30403C3834M5316K58845
18507C37995b10907H3569J05938a13436q5219B0194P5810M2474J2753F3245a8915
18495a35147k63593b0823B17948c66770a26629p4271j3719l8994A30619C7776
18484a08347n1283d1809j08482p9456A20249E1994J47989c66766A128J78058D7572
$$ plain form
18565 266273 60993 -475361 30408 -407356 293690 -95595 52913 -229126 60498 146476 -114865
18553 93565 -119486 -595207 -235565 -184884 -327510 -216939 -169850 272086 -107585 -40706
18542 86720 -63821 160395 331397 143872 205396 -251620 -84054 -30655 -12500 -182176 -72272
18530 -150560 -149458 -8835 82330 140784 -206440 23352 -68553 -44471 21516 232935 -205526
18518 179967 -194988 -169599 -44751 112092 -124472 5316 24772 -130403 33834 79150 337995
18507 337995 -210907 83569 189507 -113436 -198655 20194 96004 138478 151231 63245 -18915
18495 -135147 -398740 -20823 217948 -366770 -126629 -200900 -214619 -253613 130619 37776
18484 -108347 -159630 -41809 -150291 -229747 120249 51994 199983 -366766 1128 179186 47572
18472C7407i5309j62906o5258f2055j51908I3357b31769A1105c5936k22187I5696
18460c6956B5674K1091O8342k2192i6162A40a99604F8598a24020F942b16454F0665
18447F9086d5486p2537A07628E756J84887a41511B35159i6239r6566a9770o0866
18436h0636j41628c8897a4681B71344D6775c86039O3064P6652E1718J87811a1355
18424a07614k32551A57292l1265a44968A78922b93209A76858o7679c5013j04042
18414a39055b3476k90078g6027F2416J35534M0793L6430m8467K04234B07837p7608
18403A30229E2428a67762q0296B12520d4340k3744m791C4373J20967E3964d3124
18391b54730A41914h8763j06190j86180C0245c02880F2571k6765a44848G1610
$$ plain form
18472 37407 -95309 -258215 -323473 -62055 -213963 93357 -231769 11105 -35936 -258123 95696
18460 -36956 25674 46765 115107 92915 -96162 140 -199604 68598 -124020 6942 -216454 60665
18447 69086 -45486 -118023 107628 5756 190643 -141511 235159 -96239 -192805 -19770 -80636
18436 -80636 -222264 -38897 -14681 271344 46775 -386039 -322975 -246323 51718 239529 -11355
18424 -107614 -340165 157292 126027 -144968 178922 -293209 176858 109179 -35013 -139055
18414 -139055 -23476 -313554 -76027 62416 197950 238743 275173 226706 430940 207837 130229
18403 130229 52428 -167762 -248058 212520 -44340 -68084 -72875 34373 155340 53964 -43124
18391 -254730 141914 -88763 -194953 -381133 30245 -302880 62571 35806 -144848 71610
18380h243j37156A87244d71926E8498b48886l4512A17966B3912A413h1161o6248
18369a47409B01382a26987E55542b9571B7088J8143K58389C1074a19447C707J5216
18358A8923J38250a22371j76562A25990C3491b05305e2709k05448c318C7250a02525
18346A26307b86004a20912j06845R6018B73010a04041l1187k9102m4814j61870
18336c71014A83119g9978l12004a70954c4520j06478I6995d2841m6741k0378b4756
18324a08759A63540J913C6034c4872I2984J48506a02628A15877j4044d60873J65201
18313b95672L2749q053B04985e8304E8082M8200h9499A42604l1098a37310C29681
18301b15594B28024c8736P946j19369l8738Q4255q1852K1850H428J66190a9963
$$ plain form
18380 -8243 -145399 187244 -471926 58498 -248886 -283398 117966 23912 1413 -81161 -147409
18369 -147409 201382 -126987 555542 -29571 27088 45231 303620 31074 -119447 3707 18923
18358 18923 157173 -122371 -298933 125990 33491 -205305 -52709 -258157 -3318 37250 -102525
18346 126307 -286004 -120912 -227757 -131739 273010 -104041 -135228 -164330 -209144 -371014
18336 -371014 183119 -79978 -391982 -170954 -34520 -140998 96995 -42841 -89582 -109960 -24756
18324 -108759 163540 165453 36034 -34872 92984 241490 -102628 115877 101833 -460873 -295672
18313 -295672 -262923 -270976 204985 -58304 58082 106282 -89499 142604 111506 -137310 329681
18301 -215594 228024 -38736 -30790 -150159 -188897 -104642 -186494 -164644 8428 174618 -19963
18289D9116L77613d0982j38r6114O0554j92279g653k09605b20B2696c31383a09564
18276i5128k43256J56927B3135o168d3863A40955m2091a22324p2771L5137l1013
18265a90971N4847e1726A24581E9361c85761H4386a93620L9023g4849j57509d4054
18253f5681A39629a81334A14316J5822n4168b12666A22336b76439i5170n7073
18243a52243A79736j3342a33466E8591c52455J70402d312C3245a89301f322I3378
18231B65641b64452o0594A69641f5808A16333K16706D2882K6236M3841a57813
18220b72719f1787j1336p2260B18308j405b5892B9897J47649a47683h60D26213
18208B01935E3209e2878n3142f593j9078n6696B57396j23205c2038j62055d4802
$$ plain form
18289 49116 426729 -40982 -41120 -137234 -76680 -268959 -7653 -217258 -220 22696 -331383 -109564
18276 -95128 -338384 -181457 23135 16967 -43863 140955 98864 -122324 -195095 -159958 -190971
18265 -190971 -136124 -51726 124581 59361 -385761 84386 -193620 -154597 -74849 -232358 -44054
18253 -65681 139629 -181334 114316 130138 75970 -212666 122336 -276439 -95170 -152243
18243 -152243 179736 166394 -133466 58591 -352455 -182053 -4312 33245 -189301 -6322 93378
18231 265641 -264452 -325046 169641 -65808 116333 333039 42882 69118 112959 -157813
18220 -272719 -61787 -73123 -145383 218308 216903 -25892 29897 177546 -147683 -860 426213
18208 201935 53209 -52878 -106020 -6593 -25671 -82367 257396 134191 -32038 -194093 -44802
18196E7918J27998A9165K11282a05686F569a11298I4579b7573i53l7859j18405
18185a57217a1397B91097a16602l4027J9605B51434B8259e8736E9429L8603L34101
18174D32133a011A24303b00828D2569J30445a64055C7080a06735I5981a69440
18163a27350k33185e2294k18693B09078b29325Q5125c5377j10468A15016g4014
18152b57495a26789B05832d6139j10744A65810H2539J2835D6175q848q543e0750
18140i7698l3330A21834b0074G9058b78484C0797a90964A60895a12331A98402
18129e9434j46938q3153b5779B08263G2946a17196B41153b58157a3905A33190
18118a69198Q1120j05015B92945C3504a43565k1032B00516b05650A62849a16919
$$ plain form
18196 57918 185916 19165 230447 -105686 6569 -111298 94579 -27573 -953 -38812 -157217
18185 -157217 -11397 291097 -116602 -150629 -131024 251434 28259 -58736 59429 98032 432133
18174 432133 -1011 124303 -200828 42569 173014 -164055 37080 -106735 95981 -169440
18163 -127350 -360535 -52294 -270987 209078 -229325 -144200 -35377 -145845 115016 -74014
18152 -257495 -126789 205832 -46139 -156883 165810 82539 95374 46175 37327 28784 -50750
18140 -97698 -131028 121834 -20074 79058 -278484 30797 -190964 160895 -112331 198402
18129 -59434 -206372 -289525 -25779 208263 72946 -117196 241153 -258157 -13905 133190
18118 -169198 -88078 -193093 292945 33504 -143565 -164597 200516 -205650 162849 -116919
18107A477a0662B6360b52769K7799d5656E0024K59607a28058l36121b17713j5745
18096b33458C9521J37509c9042B21595j4217a21926k11244q7148A64719a59961
18085B05013b25675I29a18428C4651r562J95974b92301c9912A56571n2098e7281
18073B87386c9804A4472K31089E5013k5814a75690L1871k6142l2022h0733D7653
18061A25837i0262n8573E300b25418a05747E6522c75431H7305f2785A8412P7128
18050I5540a85800J4430j4232n0661J03061A4842K01345b27387d9099j471r5792
18039a46362j37309J11633c1257n066j26412C7728c51645a50346K099D1124a70314
18027a94860j35161G8936b13685B81255g714C3108K06473c02321D2087R6829K30338
$$ plain form
18107 1477 -10662 26360 -252769 -224970 -45656 50024 309631 -128058 -464179 -217713 -233458
18096 -233458 39521 177030 -39042 221595 207378 -121926 -333170 -420318 164719 -159961
18085 205013 -225675 929 -118428 34651 25089 221063 -292301 -39912 156571 104473 -57281
18073 287386 -39804 14472 245561 55013 29199 -175690 -143819 -169961 -201983 -80733 47653
18061 125837 -90262 -148835 5300 -225418 -105747 56522 -375431 87305 -62785 18412 95540
18050 95540 -185800 -171370 -185602 -236263 -133202 14842 216187 -227387 -49099 -50570 -146362
18039 -146362 -283671 -172038 -31257 -36323 -162735 37728 -351645 -150346 -148247 41124 -170314
18027 -194860 -330021 78936 -213685 281255 -7714 33108 239581 -302321 42087 138916 369254
18016C69254B7224b5504j19204A88826B974J95772r463P8944H96J78880b5131
18004h7464A60141g4286j58231e4359A30157J99480E9424K3622a33026c3273B34923
17992D7975K46829C202g509k06284E29371A61379M7716B1709K4598b98611G221
17980E2990d6945o2347I5489a03253B12253J0559b81757O5208b9803F9215d2776
17968a23222F1260P1932B8697A0435b62250A27353C7294O3344J40515b09440A69352
17956A02783a32195G9622q870a33708A92196k4479a8921k558j33761H4381K2746
17945A07127a3473G2094a09809A13191h7762L2640C6946J2286F993Q3882e8124
17933h7710B8953J14749n449C7040b19341A81613c7728J8050q9263c7330J4722
$$ plain form
18016 369254 27224 -25504 -144708 188826 2974 198746 189283 268227 896 179776 -25131
18004 -87464 160141 -74286 -232517 -54359 130157 329637 59424 83046 -133026 -33273 234923
17992 47975 294804 3202 -7509 -213793 529371 161379 209095 21709 46307 -298611 7221
17980 52990 -46945 -109292 95489 -103253 212253 222812 -281757 -216549 -29803 69215 -42776
17968 -123222 61260 133192 28697 10435 -262250 127353 37294 100638 241153 -209440 169352
17956 102783 -132195 79622 70752 -133708 192196 167717 -18921 -21479 -155240 84381 107127
17945 107127 -13473 72094 -109809 113191 -87762 -55122 36946 49232 6993 90875 -58124
17933 -87710 28953 143702 138253 37040 -219341 181613 -37728 -19678 -108941 -37330 -22608
17922b2608j54726h3567B28684H126h1497k22920J30487B20660e6874e140k57567
17911b62707H6954C7861e9277B0254L0406K59650b5035A1978b71791B4605a35999
17899H0139L1451J41035b50051c2461j46146C20595f4114k2946C051K05490c81058
17887b7182A0611a50888A98720O7473c5290B362O0294K85141j70789m4951o58
17876A31399D1666Q2649g1016b1342B55713e2120D5640b13662h2336l3116A98549
17864A9361N0762O2327m0384l9074h6190I0010j409O6932a37974A6398K89337
17853C05735A00500g3038k3762b8586I5706b34278D7633b9513F5497C1840a43894
17841d3665j34767F022c52158a55129F841Q5897e4978A01269d1801I5949C1206
$$ plain form
17922 -22608 -177334 -83567 228684 8126 -81497 -304417 -173930 220660 -56874 -5140 -262707
17911 -262707 86954 37861 -59277 20254 50660 310310 -25035 11978 -271791 24605 -135999
17899 80139 111590 252625 -250051 -32461 -178607 320595 -64114 -87060 3051 208541 -381058
17887 -27182 10611 -150888 198720 266193 -35290 2362 62656 347797 177008 132057 131399
17876 131399 41666 124315 -71016 -21342 255713 -52120 45640 -213662 -82336 -115452 198549
17864 19361 70123 132450 92066 52992 -86190 90010 88601 155533 -137974 16398 305735
17853 305735 100500 -73038 -96800 -28586 95706 -234278 47633 -29513 65497 31840 -143894
17841 -43665 -178432 6022 -352158 -155129 6841 92738 -54978 101269 -41801 95949 31206
17829a81844B00948b08053G1769b4923A45261b83626B57940a27648D3975K95018
17819C38993C0159f3942m3399k6748A05516M9277N9121d47863A63790g5181c1910
17807a59881M67k399c77A66112C5376b03329E7787c139l84702a82866f815j73228
17795a80043B25782d05486d2695H8543e2218K4602j48783E7293J29578i7310k16691
17784c14001C73468A3744c2496F1717a17660K7792C20248h4403D2274O9034A6143
17772A13691h6590A3563a95660M7961e2926j79023D5154J19401d0863p3408E3865
17760H7017h4162j72711B01149G0488d3171j55814A41059b6851B55575q8137a98797
17748a79809r6214J22771B08521a26196b3285A11463C3262B023L4187f3057a7122
$$ plain form
17829 -181844 200948 -208053 71769 -24923 145261 -283626 257940 -127648 43975 338993
17819 338993 30159 -63942 -107341 -134089 105516 154793 213914 -447863 163790 -75181 -31910
17807 -159881 -159414 -161813 -377 166112 35376 -203329 57787 -3139 -387841 -182866 -6815 -180043
17795 -180043 225782 -405486 -42695 88543 -52218 -27616 -176399 57293 186871 -97310 -314001
17784 -314001 373468 13744 -32496 61717 -117660 -89868 320248 -84403 42274 111308 16143
17772 113691 -86590 13563 -195660 -147699 -52926 -231949 45154 164555 -40863 -114271 53865
17760 87017 -84162 -256873 201149 70488 -43171 -198985 141059 -26851 255575 167438 -198797
17748 -179809 -276023 -153252 208521 -126196 -23285 111463 33262 2023 36210 -63057 -17122
17736E8083n924L4214f6848j58530A07402a26038j9998A230K8024K90543j03229
17725B16568B0296Q3870b0113C02557a25656B01347A1709a28328N2044j47679
17715b23963E2600J43404a34907C5224R3664l5927b03422C17412n6020a2733A54523
17703b00828H6213m429a59936E9041K4143C0266K52624a92268k1413Q0867j9146
17692a51960f2243A79772c343F1611a4992j1139A8311J77606d9759n120F1776
17680g1948B79772b1075B49962b62804D96827a65777G8520l0853L218g462j87360
17669a94822C7191c3561o9236p0096B80177a70373g3213j33271M4730A81220f5862
17657e72l8125j02097C60550I1793j0585l8991e8888I9222a11796A11030A9429
$$ plain form
17736 58083 52159 86373 -66848 -225378 107402 -126038 -146036 1230 29254 319797 216568
17725 216568 20296 104166 -20113 302557 -125656 201347 11709 -128328 -76284 -223963
17715 -223963 52600 196004 -134907 35224 128888 92961 -203422 317412 261392 -12733 154523
17703 -200828 86213 81784 -159936 59041 83184 30266 282890 -192268 -213681 -132814 -151960
17692 -151960 -62243 179772 -3343 61611 -14992 -26131 18311 195917 -49759 -54879 61776
17680 -71948 279772 -21075 249962 -262804 496827 -165777 78520 47667 50885 -7462 -194822
17669 -194822 37191 -33561 -102797 -172893 280177 -170373 -73213 -206484 -161754 181220 -65862
17657 -572 -38697 -140794 360550 91793 81208 42217 -58888 99222 -111796 111030 19429
17645E1295d1715C9757b2277o1483K6707J6921j93492A75886J23565h8479q066
17634i6545A94467c17404h7613C3044L2619a55995A40558o3668c51771D03834
17623A91965i5545H9622l2168L0662B855Q6584i2082a006B0068a75132A79089
17611H1777k3763N501J02134K49130e1665a9149k4995A59255H799P5303J19912
17600B04014a80610j17037A99151r3721c5106c051C64556M4713b85537a30229
17589b76894a2055j7336j19160H5210N3874J18313b07176N8206H2660a72911D8335
17577e7281B793L06687J00916C2527K13019b96435C5765J62362J5430a16173K3427
17566i2746G7616K2441J8654L4682K49623g5169B54969j23745Q539h0411j32309
$$ plain form
17645 51295 -41715 39757 -22277 -83760 -57053 -40132 -233624 175886 299451 -88479 -96545
17634 -96545 194467 -317404 -87613 33044 65663 -155995 140558 76890 -351771 403834
17623 191965 -95545 89622 57454 88116 2855 89439 -92082 -1006 20068 -175132 179089
17611 81777 58014 63515 165649 414779 -51665 -19149 -44144 159255 8799 84102 204014
17600 204014 -180610 -297647 199151 105430 -35106 -3051 364556 409269 -285537 -130229
17589 -276894 -12055 -29391 -148551 85210 139084 257397 -207176 -148970 82660 -172911 48335
17577 -57281 2793 309480 410396 32527 245546 -296435 35765 198127 213557 -116173 -92746
17566 -92746 77616 100057 118711 153393 403016 -75169 254969 131224 139763 -80411 -212720
17555b12720B97312h5948A02769J66656C9393P9159c4551a2948C6534g605B48361
17543B1299I777i5687n3404B60716J87382A19746f0810A936N972K76450j34780
17532A49578J064B2834b9057I2213N9839K3083J49069I0071C9119b53500C26179
17520C38648A37972J13826r8973F7238d2898B98295e1213k61411B49079a45562
17509a16738A09575K7318a71099K307c8074C9255K8282J40108M7893a40933A29935
17497D1323K44754f1107k21589E149M291g6434E8473K30543Q6071I0609b98248
17485a187B23496R668d1209B74658p1712j1881J52790L3993o370f9934C04297
17473B1238a46715l1588B59955Q0785a39531N9970q1391C02449r1379J83755a73397
$$ plain form
17555 -212720 297312 -85948 102769 269425 39393 118552 -34551 -12948 36534 -7605 248361
17543 21299 9777 -95687 -149091 260716 448098 119746 -60810 1936 7908 284358 149578
17532 149578 150642 22834 -29057 92213 152052 175135 324204 90071 39119 -253500 326179
17520 338648 137972 251798 152825 67238 -42898 298295 -51213 -312624 249079 -145562
17509 -116738 109575 136893 -171099 -168792 -38074 39255 67537 207645 255538 -140933 129935
17497 41323 286077 -61107 -282696 5149 9440 -76434 58473 289016 375087 90609 -298248
17485 -1187 223496 233164 -41209 274658 202946 191065 343855 377848 371478 -69934 304297
17473 21238 -146715 -178303 259955 340740 -139531 -79561 -160952 302449 211070 394825 -173397
17461A72715c692A14015J5982o0395R5910J19870B5744J15296K08984F3424J44563
17450B07987O8121A37284J99558B7056a99510a2012C86676j50532J17674O3519
17440D17337G4972J34481a02329c0728m1864B77076q6875J10636J24928A14936
17429A78649M7586K02627H637M7952J36364C9191L07004A34660K33339A61538
17418B9995K03699Q5585k1879d4618H809J91640l3213L0553E9297A2167K23411
17407B35578O0963A3772M20530D4188K02695E9973L7352l7873K08890b4164C26338
17395H411J24664M8596d3208B83778A37012k3443K49598I7795h938o5266A38766
17383B85409H5418O6351D1570j4585J08776I621h0710C50495B1797J11369a9776
$$ plain form
17461 172715 -3692 114015 129997 69602 165512 285382 25744 141040 350024 63424 207987
17450 207987 276108 137284 336842 27056 -199510 -12012 386676 236144 353818 417337
17440 417337 74972 209453 -102329 -30728 -72592 277076 190201 300837 425765 114936
17429 178649 226235 428862 8637 56589 192953 39191 346195 134660 367999 161538
17418 29995 233694 319279 297400 -44618 8809 200449 167236 197789 59297 12167 235578
17407 235578 296541 13772 434302 44188 246883 59973 97325 59452 268342 -24164 326338
17395 8411 133075 181671 -43208 283778 137012 113569 363167 97795 -8938 -74204 138766
17383 285409 85418 151769 41570 26985 135761 9621 -80710 350495 21797 133166 -19776
17371F1903K44657e6597D20305j88139j10456Q347k2201J45305J06654A72113
17360B49130q0015K12137A02985O3238J3062J12910d1184A27425h7341A67009
17349i587G10213k82613e5268p0536J9858K5690j71906A98004I1660K08786q1546
17338B18900P2186J2247A25942K43852f6055B23628o3020K09807O7476A25215
17327A39095g3028g251l12890h4074C184J39126m1472D4285M4386K27578G4853
17315B1706J2395N27027k64502a13715K1736a8560j0644j7555A43822J237J5591
17304A60650K04522j66495J54498a46884D566J62645c4946G6382K18792L83505
17294F78679C25491K11987B38638o4861m2356D170J93921F4352J15946N0543g7203
$$ plain form
17371 61903 306560 -56597 420305 232166 121710 130057 107856 253161 359815 172113
17360 249130 169115 381252 102985 166223 179285 292195 -41184 127425 -87341 167009
17349 -9587 710213 427600 -55268 -125804 -105946 -80256 -252162 198004 91660 300446 218900
17338 218900 291086 303333 125942 369794 -66055 223628 160608 370415 437891 125215
17327 139095 -73028 -7251 -320141 -84074 3184 142310 100838 44285 88671 316249 74853
17315 21706 34101 561128 296626 -113715 -91979 -18560 -29204 -46759 143822 145059 160650
17304 160650 365172 198677 353175 -146884 4566 167211 -34946 76382 295174 678679
17294 678679 325491 537478 238638 173777 131421 4170 198091 64352 180298 230841 -77203
17282H6455Q4584c8962I7992J5327b50368f2683B33002r6742o4466a04768J7329
17271h7439A0105K92761D2614a7913A51960D1986L08599j23116q8636G97J77050
17260A77847n7131J32892j24077K50724j08683j10314J30117r1677m814o0159
17250A34725J64298a47016A91927L47951B05539c25701C49574D8392K98751n0468
17240B96675P2233H0816J90356j17557n7529C151L37208I4597K63663J67459g4285
17228G6888K15221M6643I0392P6469N3679J17248J89986j1164A06640A259M21970
17217D23229j19296P8897K7208l3824q8302q0622p1075J84206A10974L35593j17510
17206C29057r8486n3672K50331g1929C09157q6326J59439A5281L45932n1716N726
$$ plain form
17282 86455 171039 -38962 97992 113319 -250368 -62683 233002 136260 71794 -104768 -87439
17271 -87439 10105 302866 42614 -17913 151960 41986 350585 227469 138833 797 177847
17260 177847 120716 253608 129531 380255 271572 161258 291375 199698 194884 134725
17250 134725 299023 -147016 191927 539878 205539 -325701 349574 48392 347143 296675
17240 296675 368908 80816 271172 153615 96086 3151 340359 94597 358260 525719 -74285
17228 76888 292109 338752 90392 166861 220540 337788 527774 516610 106640 1259 423229
17217 423229 303933 382830 410038 376214 287912 207290 136215 320421 110974 446567 329057
17206 329057 230571 176899 427230 -71929 309157 222831 382270 15281 361213 309497 315223
17195C15223A37427N6564r2355p355c413C10979m9953n9620R2125r024C7388M96845
17183E34233A63567L77243p6908A09782K9066M86392F5601O8775M38784j78518
17173C94642H1115J17518J95407A11619K52779c2756A82272D9530J75200c510
17162C87928J15823q4246L36740A63358K82062k2083E9784K99802K4976K24461
17152F09023j71979A19046D6790L25525C7735J09013J32188L24905B46234m1385
17142B04849E1824J97217F3800K99479q7035K30106j07541I0524K30602n3858
17132B67268j3205I6486a0050H4042k7837M31053r4384L1461j97449L04757l4648
17121D96995B16393q9530M89885A48161L0289L97242B81580M48968C42046K3408
$$ plain form
17195 315223 137427 193991 101636 94281 -3413 310979 261026 201406 293531 284507 37388 534233
17183 534233 163567 540810 463902 109782 138848 625240 65601 134376 573160 394642
17173 394642 81115 198633 394040 111619 364398 -32756 182272 49530 224730 -3510
17162 387928 503751 419505 756245 163358 445420 423337 59784 359586 384562 609023
17152 609023 437044 119046 46790 372315 37735 146748 278936 603841 246234 204849
17142 204849 51824 249041 63800 363279 276244 506350 398809 90524 321126 267268
17132 267268 254063 96486 -10050 84042 56205 487258 392874 424335 226886 531643 496995
17121 496995 216393 126863 616748 148161 178450 575692 281580 730548 342046 365454
17111C65454P2533D3793J48900J15876p8492o6722L80904j56831r3597k6495L5753
17100C03089D0720N06548H9457K56508A00833K86057n733O2847j38782J59390
17090D64612n4120g362B44557L78995B12337j7195J69208J4462J39390O3263p2225
17079E09240j72682J23021j2453j65873J91845A89257L11519l9840m668q1089
17069C75179L61529j57096j04564J53829o5850r5142J394j54125l9509J3808J86389
17058D75842P4400J16400k27423J53338m7196J46665k17988L38664k43420L8923
17048F08205m0402J83220k22722O689K65696C66952r7140M22562M841n1597j70661
17037D74957r9285n7360J6062L89613l2204O8560j88192n4934J754J15599j99209
$$ plain form
17111 365454 437987 43793 192693 308569 230077 163355 544259 387428 293831 267336 303089
17100 303089 40720 547268 89457 345965 100833 386890 381157 444004 305222 464612
17090 464612 410492 -7362 244557 623552 212337 195142 364350 378812 518202 581465 509240
17079 509240 336558 459579 447126 281253 473098 189257 500776 460936 456268 375179
17069 375179 736708 579612 475048 628877 563027 467885 469279 315154 275645 289453 475842
17058 475842 550242 666642 439219 592557 545361 692026 474038 812702 569282 608205
17048 608205 567803 751023 528301 534990 800686 366952 269812 692374 697215 645618 474957
17037 474957 375672 318312 334374 723987 691783 760343 572151 517217 518971 634570 435361
17026D35361J59302K85034j71856j93952K32609k5409l24250K76437M23966D70786
17015G39976k98873K22800J41970M9144k75669L37976C71285K12152L28050j67064
17005G44423k48561L22316R9044k40586J5735J78307l11251N79851E43494K49833
16995G93327Q3525O8995l75464j9330L54540j10281R0087j25238K16098r4230
16985H82029L7911P8263l6717j02186l98225M89177k01946J23330k64350l1392
16975E75894J56035N5966J63311K17708E70715L34649J5814M6252L52k68154N15713
16964A215341l01673j59873j59844J30548L307K42392o0906J59239k06595o6430
16954G95506J73326J76670j25140J54351j44829J13244R6694R4149F38518M17181
$$ plain form
17026 435361 594663 879697 707841 513889 746498 721089 396839 673276 1097242 470786
17015 739976 441103 663903 805873 855017 579348 917324 371285 583437 911487 744423
17005 744423 495862 818178 917222 676636 692371 870678 559427 1139278 543494 793327
16995 793327 876852 945847 570383 551053 905593 795312 885399 760161 976259 882029
16985 882029 919940 998203 961486 859300 461075 950252 748306 871636 607286 575894
16975 575894 731929 787895 951206 1168914 570715 905364 921178 967430 967782 699628 1215341
16964 1215341 913668 753795 593951 724499 727806 970198 909292 1068531 861936 795506
16954 795506 968832 1145502 1020362 1174713 1029884 1143128 1239822 1333971 638518 1055699
16944A055699k1441J70187k91176L70295l8282r2387K62113j56338L6832l13216
16934I82286K01673k1283L9592l1953J64101m9763L2835J32858l13357L66584
16924A503573j21027l09731L55625k92413K89881k19968M45806P8558j76178j2516
16914A541610k26741K20658L1763P6511j99496j1839K96957p7529k00864M9289
16904A500319N5700M43284k69369Q9669k67355r9533L14565j13471K9526J55137
16894A838472R5114J31513p9701m8046J76612n12280L05555K47259l01085R6770
16884A950183J21467Q2310j29980J92903k24940n8216L13879Q0826l74929L67651
16874B321154k12055K95017j15647K08445j69541K32719k26878N6602K69365j62747
$$ plain form
16944 1055699 1034258 1204445 913269 1283564 1245282 1152895 1415008 1258670 1295502 982286
16934 982286 1183959 1162676 1202268 1170315 1334416 1284653 1317488 1450346 1136989 1503573
16924 1503573 1382546 1072815 1428440 1136027 1425908 1205940 1651746 1730304 1554126 1541610
16914 1541610 1314869 1535527 1567290 1643801 1444305 1432466 1729423 1651894 1451030 1500319
16904 1500319 1556019 1999303 1729934 1819603 1552248 1452715 1767280 1653809 1683335 1838472
16894 1838472 1933586 2065099 1985398 1937352 2113964 1601684 1907239 2154498 1853413 1950183
16884 1950183 2071650 2153960 2023980 2216883 1991943 1933727 2247606 2328432 1953503 2321154
16874 2321154 2109099 2404116 2288469 2496914 2327373 2560092 2333214 2389816 2659181 2496434
16864B496434J30025k54779L86247J30049j28551Q3227M7644p5622K58515j4496
16854C058693o4578J30005k91783L67279j66803L53013k28012L57440m18353N97701
16844C694602m66500N55778k59106K60649O1201l01566L39348j38158K09849o6618
16834C889479J50965N2522J4821K88169j90823k324L06603K66343r4236L59671
16824E041190k25662M8833J25845L53248N8736K8871n8926L9468J98613L3453
16814E643669j82321N61100K22266O4379L61720n0373q2467K59658R4391J36930
16804G028952j50972O36566k47470L23921J21833N76522k19593K69446j87642
16795H151563M25398L38619K18765M28629r306N72088N350L6977R2897O43589
$$ plain form
16864 2496434 2626459 2371680 2757927 2887976 2759425 2842652 2890296 2814674 3073189 3058693
16854 3058693 2994115 3124120 2832337 3199616 3032813 3385826 3157814 3515254 3096901 3694602
16844 3694602 3228102 3783880 3524774 3785423 3846624 3545058 3884406 3746248 3956097 3889479
16834 3889479 4040444 4092966 4107787 4395956 4205133 4202809 4509412 4775755 4681519 5041190
16824 5041190 4815528 4864361 4990206 5343454 5402190 5431061 5372135 5411603 5610216 5643669
16814 5643669 5461348 6022448 6244714 6309093 6670813 6620440 6537973 6797631 6892022 7028952
16804 7028952 6877980 7514546 7267076 7590997 7712830 8289352 8069759 8339205 8151563
16795 8151563 8576961 8915580 9134345 9562974 9553668 10125756 10131106 10168083 10260980 10904569
16785A0904569N35204k03595O06922M62864J68410J66325N12358M12551J96470
16776A3762078O75994L65226M18690N70701K29687O95536M97103R03357N03105
16767A8621477N06574P77161M60900J026565O75869Q56700P92562Q11501J517277
16758B6046586O69865J341717J091128J087989J478027J490907J303758J606183
16750C6116160J593324J608495K037804J991856J764968K476419K514677K565765
16742E2669468K889123L130082L213292L262225L778460L651003L646617M468116
16734H0708386M562263N296843M628431N704653N394360N561928O143653N966087
16726A23966604O132327O347610N833644O084834N557558N702429M692086M838447
$$ plain form
16785 10904569 11439773 11236178 11843100 12305964 12474374 12640699 13153057 13565608 13762078
16776 13762078 14438072 14803298 15221988 15792689 16022376 16717912 17215015 18118372 18621477
16767 18621477 19128051 19905212 20366112 21392677 22068546 22925246 23717808 24529309 26046586
16758 26046586 26716451 28058168 29149296 30237285 31715312 33206219 34509977 36116160
16750 36116160 37709484 39317979 41355783 43347639 45112607 47589026 50103703 52669468
16742 52669468 55558591 58688673 61901965 65164190 68942650 72593653 76240270 80708386
16734 80708386 85270649 90567492 95195923 100900576 106294936 111856864 118000517 123966604
16726 123966604 130098931 136446541 142280185 148365019 153922577 159625006 164317092 169155539
16718A69155539L424694K792242J750531J037754k04668j331956k038669l280762
16710A71304705l896726m195383n566030n489277n907871o193925n839643o370587
16702A27845263o057393n675538n562179n855231n179857n095362m875668m469085
16694H5074950m373601m191902l416989l794610l528790l275655k812067k817827
16686E6863509k844909k488189k316314k380970k192395j947937j592470k453897
16678C8646428j280651j632596j803852j069464j210580j520474q54425j233600
16670B8040786j232703j146230n33662j387959p50570p33449q49444j008298k59010
16661B0139461j300124n89479p75938J28194r78929n68861n13430m88531o85042
$$ plain form
16718 169155539 172580233 175372475 177123006 178160760 177956092 176624136 174585467 171304705
16710 171304705 167407979 163212596 157646566 152157289 146249418 140055493 134215850 127845263
16702 127845263 121787870 116112332 110550153 104694922 99515065 94419703 89544035 85074950
16694 85074950 80701349 76509447 73092458 69297848 65769058 62493403 59681336 56863509
16686 56863509 54018600 51530411 49214097 46833127 44640732 42692795 41100325 38646428
16678 38646428 37365777 35733181 33929329 32859865 31649285 30128811 29274386 28040786
16670 28040786 26808083 25661853 25128191 23740232 22989662 22256213 21406769 20398471 20139461
16661 20139461 18839337 18249858 17473920 17602114 16623185 16054324 15540894 15052363 14367321
16652A4367321l57876m60535j74346l99204m55982m03800o17291J02237m14916
16643A1185608p42220l9189k58340l27786m23650o8956m61469j03579k91567l13571
16633H155281J98798o12149J05958n98456j4111j00887p2332j18890j58505m39139
16623F345568l68757L4135J0445M2966m37194K16698l26684j68805J1963k56508
16613E103827j59331O2858J8762n54532M38303k53968o9482k17722j06871j55795
16603D106049R713N7113k23915k09610l0629j85750l5365N8049M2961N4304k93431
16592C349489M4549l61808K0503L19897j54604k61522N13583m66497k19398j10454
16582B673738K93375M3621k13527k26618k8298n5249j04392J31738l1602k02973
$$ plain form
16652 14367321 14009445 13548910 13374564 12975360 12519378 12115578 11498287 11600524 11185608
16643 11185608 10443388 10404199 10145859 9818073 9394423 9325467 8863998 8760419 8468852 8155281
16633 8155281 8354079 7741930 7847888 7249432 7235321 7134434 7062102 6943212 6784707 6345568
16623 6345568 5976811 6010946 6021391 6064357 5627163 5843861 5517177 5348372 5360335 5103827
16613 5103827 4944496 5007354 5026116 4471584 4909887 4655919 4586437 4368715 4261844 4106049
16603 4106049 4115762 4172875 3948960 3739350 3708721 3522971 3487606 3545655 3588616 3642920 3349489
16592 3349489 3394038 3032230 3052733 3372630 3218026 2956504 3470087 3003590 2784192 2673738
16582 2673738 2967113 3010734 2797207 2570589 2542291 2487042 2382650 2514388 2482786 2279813
16572B279813n6698L43843j47115J63160k81436K45084k21033j35798K42326l53714
16562B078432K91172j02011n93534M94907m4964J29632n29065p1323K264L64316
16552B019826n9781J35920N3218O4716m15798n94946L12074L67324l18692R0245
16542A654106J72080l14080j80122j40349J79295j16265j9655L23857j79612j76735
16532A202520m9380J20221l0823Q5726L5451r6820l4457O845K1138K23964n50794
16521I33591L75142j72094l50236M61360j33038J84677n38313O75428k78737J54164
16511A311944j16341j27327j60195K00879k91515r2104L24376l5189J27470m71808
16501F70190K02420K85034k80697K26090j36218J35166j8798j06755K29626k17118
$$ plain form
16572 2279813 2223115 2566958 2419843 2583003 2301567 2546651 2325618 2189820 2432146 2078432
16562 2078432 2369604 2267593 1674059 2168966 2124002 2253634 1724569 1653246 1655510 2019826
16552 2019826 1960045 2095965 2149183 2213899 1798101 1203155 1515229 1882553 1563861 1654106
16542 1654106 1826186 1512106 1331984 1191635 1370930 1254665 1235010 1558867 1379255 1202520
16532 1202520 1153140 1273361 1242538 1328264 1363715 1266895 1232438 1239283 1260421 1484385 933591
16521 933591 1308733 1136639 786403 1247763 1114725 1299402 761089 1436517 1157780 1311944
16511 1311944 1195603 1068276 908081 1108960 817445 725341 1049717 1014528 1141998 670190
16501 670190 872610 1157644 876947 1103037 966819 1101985 1083187 976432 1206058 988940
16491I88940K79160k42987k50932l6478L25214j72866l44169M22424k77094P9316
16481G70528J03185j00935L7565j59779B52144M83002J52107j92168K16910l83303
16471E28692K77511C72921N47623l49757J01202j46073J85582k3767p0408j95217
16461D22106M67016j74911j78102L18920C06880J18704K15795K12711j04123k07708
16451E42259J32120m8377p8582J84481Q0073k21922j40377K69985j085C23113
16440C83676L07025j73060o6288M4927P5421J28776q8490j72846q3633K93412
16430F48920L1959j16715j14238A06632N17863C9052J63391k5627K69632j54154
16420B92294q5009J75882J39317j99811K794J8333m1071p3575K88521j39812m2144
$$ plain form
16491 988940 1268100 1025113 774181 737703 1062917 890051 545882 968306 691212 770528
16481 770528 873713 772778 810343 650564 252144 735146 887253 695085 911995 528692
16471 528692 806203 372921 920544 570787 671989 525916 711498 687731 617323 422106
16461 422106 889122 714211 536109 855029 306880 425584 641379 854090 749967 542259
16451 542259 674379 626002 547420 731901 811974 590052 449675 719660 718575 323113
16440 383676 690701 517641 451353 496280 571701 700477 611987 439141 355508 648920
16430 648920 680879 564164 449926 106632 624495 39052 202443 176816 446448 292294
16420 292294 207285 383167 522484 322673 325467 343800 302729 229154 517675 377863 335719
16409C35719M46422B88149N892l4717j18934M80030j75195j35674K32203k35912
16399C05842J55803j67780J02228j11448G2908L82492j63088K89139j75141j21619
16389B84691A34101L52767l9893p482j38567J79236J9948j19418E4290N68681
16379F22971q71i5178C60321j71418L95047j10864j45916o5622e0407B2318L99245
16368D21563j11853o801n8632K184q8834j3738o1984A5165L53800o8616P9603
16357C79952j83970c1280B31004l1184K86538B38803J2649K25418B30360M44134
16347F74494A57598K51155j13862a8372A48253G3529R5410A864L95873o1043E6064
16335A30671L3284n5462g2378A42895K49931r5815J61434q804B06316j0804O399
$$ plain form
16409 335719 782141 288149 294041 259324 140390 620420 445225 309551 541754 305842
16399 305842 461645 293865 396093 284645 72908 455400 292312 581451 406310 284691
16389 284691 134101 486868 446975 439493 300926 480162 500110 380692 54290 622971
16379 622971 622100 -95178 360321 188903 583950 473086 327170 261548 -50407 22318 421563
16368 421563 309710 302909 244277 246461 157627 143889 81905 15165 368965 300349 379952
16357 379952 195982 -31280 231004 199820 486358 238803 251452 476870 230360 674494
16347 674494 157598 408753 294891 -18372 148253 73529 168939 1864 397737 336694 56064
16335 130671 163955 108493 -72378 142895 392826 297011 458445 449641 206316 195512 201911
16324B01911R6834I0333K49924L6531A7206e933C56769k0595J60873A13123A2691
16312B2465h0954A42549J58608j2278m8622J13289A25563C6005L67752j62125
16302B41632F3046J19713K36922b6519B02467l488K13811j33470A2776J50328
16292A63104B4395K27234j04712L1023K09450J1354I9250k5563M12872F0659j6133
16281D4526o241K08175B3241J9999L5908J00719H8193p071M12991G822K02526
16270B10348o9235M1558b2075A18607e0431G0664f385A52232J33156F6993g9880
16258A72813d5623A31409a00974B04452b65237G7500M7749g8582B76053g1620
16247A07339K18008I8860N9293L341F5822b9764C10296j43993P1950Q7305E8340
$$ plain form
16324 201911 298745 90333 340257 376788 17206 -5933 356769 336174 497047 113123 12691
16312 22465 -80954 142549 301157 288879 240257 353546 125563 36005 403757 241632
16302 241632 63046 182759 419681 -26519 202467 198979 412790 279320 12776 163104
16292 163104 24395 251629 146917 177940 387390 398744 99250 73687 486559 60659 44526
16281 44526 38285 246460 23241 43240 79148 179867 88193 81122 494113 7822 210348
16270 210348 141113 182671 -22075 118607 -50431 70664 -6385 152232 285388 66993 -79880
16258 172813 -45623 131409 -100974 204452 -265237 77500 125249 -78582 276053 -71620
16247 107339 325347 98860 158153 161494 65822 -29764 310296 166303 238253 325558 58340
16235c8559G5137K16188F886a29892D542K14712N9092c428E202a15424C00195
16223b04664A16587f6216A45059n5422R1167k7700E8947b74043B95365C0017J97327
16212B27344I7702C979f0359B28629f3834L1526j37476A18351a31953C29253j57702
16201A71551C535a50984j23265G0441i6684a2211C45306j8250b10793A66415b6788
16189A44904d3082A81522Q3396E9654L14258e2911a6390n9025n8240q3863A39515
16177C98239A03594a4444j4332E5775i7888F3331a29787A09621h1609A26991L42577
16166D69568h2464K5204o7385I7270b946A37916j4658K0950d95533a95465H8440
16154B61856G1583O4154c99077H240d6283D6708b03555A21693J19541E2794J61580
$$ plain form
16235 -38559 75137 291325 6886 -129892 4542 219254 278346 -3428 5202 -115424 300195
16223 -204664 116587 -66216 145059 89637 180804 153104 58947 -274043 295365 30017 227344
16212 227344 97702 3979 -60359 228629 -63834 -32308 -169784 118351 -131953 329253 171551
16201 171551 3535 -150984 -274249 70441 -96684 -12211 345306 327056 -210793 166415 -26788
16189 144904 -43082 181522 264918 59654 373912 -52911 -16390 -75415 -133655 -217518 139515
16177 398239 103594 -14444 -28776 55775 -97888 63331 -129787 109621 -81609 126991 469568
16166 469568 -82464 -57260 -124645 97270 -2946 137916 123258 144208 -495533 -195465 88440
16154 261856 71583 135737 -399077 8240 -46283 46708 -203555 121693 241234 52794 214374
16143B14374q9833b70637C8941a11851G4466Q3390F9680J47755F6695a80551B1912
16131b45688C0115c54591c3398o103k4915B12528l1201C0826a37491c9253j02191
16120a41444b4925A42278i1778o3080A84398b20533A39759c38640J8011A98070
16109A40013F5345P3355F6590a71086h5175B31263g449A46627I711J07020d3191
16097B63107h3233k30981a23478A24499M5737a41373A11140N0844B8576j0724
16087A7852M1041E148b05529F688O6296B7147c07138A2582b64720B7703K0247
16076D7950L5283h815A71364f5187j05502B15041g353k29568a09770B17286a13112
16064B61816a13391A86812r670J2554b18568i0581a0942j95713c2493B34432E8541
$$ plain form
16143 214374 124541 -270637 38941 -111851 74466 157856 69680 217435 66695 -180551 21912
16131 -245688 30115 -354591 -33398 -39501 -64416 212528 181327 30826 -137491 -39253 -141444
16120 -141444 -24925 142278 -91778 -154858 184398 -220533 139759 -338640 -320629 198070
16109 140013 65345 138700 66590 -171086 -85175 231263 -7449 146627 9711 116731 -43191
16097 263107 -83233 -314214 -123478 124499 170236 -141373 111140 161984 28576 17852
16087 17852 58893 5148 -205529 6688 72984 27147 -307138 12582 -264720 27703 47950
16076 47950 83233 -8815 171364 -65187 -170689 215041 -7353 -236921 -109770 217286 -113112
16064 261816 -113391 186812 177142 189696 -218568 -90581 -10942 -206655 -32493 234432 58541
16052f5696B24058F0719B2798g3193j7921A39244P1820J42971A5963a37838d7929
16040B00207c3805C43701b22874j8984A51385b19919B91959D4397a25457o6094
16030a91551a1486j4335B09377a76049C29601A6085Q7199b8440r9055D1708N4590
16019I6298M6088E3172k3498b84181B9147J95531B3718L61803b61689D0997c48893
16007G9628K44001c4890j865j96485A35457a56200j7504A05679f6979A25527a50716
15995g5503G0633a37249B3349a95000A33183J2856a90261k5123h568j19330B96140
15983E56378f530A94840K9928a30326r3819g0444B16297B9786e05466D37556a60908
15971d5763k34316J04346A02675f0993G4173g818n820A80069c5514D9811k0619
$$ plain form
16052 -65696 224058 60719 22798 -73193 -91114 139244 211064 354035 15963 -137838 -47929
16040 200207 -33805 343701 -222874 -241858 151385 -219919 291959 44397 -125457 -191551
16030 -191551 -11486 -25821 209377 -176049 329601 16085 103284 -28440 -127495 41708 96298
16019 96298 142386 53172 29674 -284181 29147 224678 23718 385521 -261689 40997 -348893
16007 79628 323629 -34890 -36755 -233240 135457 -156200 -173704 105679 -66979 125527 -150716
15995 -75503 70633 -137249 23349 -195000 133183 146039 -190261 -215384 -8568 -127898 296140
15983 556378 -6530 194840 224768 -130326 -224145 -70444 216297 29786 -505466 437556 -160908
15971 -45763 -280079 -175733 102675 -60993 74173 -7818 -13638 180069 -35514 49811 29192
15960B9192M5839k1059A3427J42812a77535A82658l5860c17232h2730j94186A97216
15948C52273H3401a06788B52520a60050n6830E4146g5015b4139c634o2739o0513
15937a26886D93403b5172j2971j35827I3599L9297E7714c726r9324j79290d0932
15925B68250a1172A26939b15750A2866g8526r5120A41545k6136a08540J969N1065
15914e5506A25151E7606e6818p3256k43515E1282q889a9157m7703k94737b7497
15902b04604g6235k92693A50392B477i0850B36357r2583A7079e7538A90194a07821
15890A87909c38301a12136j09405A51335a40354E6472J03839a36272A29014a59063
15879I2115L7273Q5085c25351A25259b54595A6467b61814A184b01463l8433H8248
$$ plain form
15960 29192 75031 53972 13427 156239 -177535 182658 146798 -317232 -82730 -276916 197216
15948 352273 83401 -106788 252520 -160050 -216880 54146 -75015 -24139 -3634 -66373 -126886
15937 -126886 493403 -25172 -38143 -173970 93599 132896 57714 -3726 -103050 -282340 -40932
15925 268250 -11172 126939 -215750 12866 -78526 -173646 141545 115409 -108540 -106571 -55506
15914 -55506 125151 57606 -56818 -130074 -373589 51282 42393 -19157 -66860 -361597 -27497
15902 -204604 -76235 -368928 150392 2477 -90850 236357 143774 17079 -57538 190194 -107821
15890 187909 -338301 -112136 -221541 151335 -140354 56472 160311 -136272 129014 -159063
15879 92115 129388 214473 -325351 125259 -254595 16467 -261814 1184 -201463 -239896 88248
15867I9579a47700L0769H9676b04650A38335c13594C28223A49842m4543J16253
15857B21552a17228J3212B03888k2054b863j20816j90673g4947E4923J26319a57181
15845a81021N3023F9598a32176k5047d5710D8809c2913H4579A4673a6722D5956
15833B06080b2113o31j38922L4848B750b4981l1479A46111b18967l3862l7782
15822b90611a9538M265C5011a41761j13935N7205g8317k3431J6012l2330n1759
15811a69825k6839R4017m2018H1149a42068l3872F1898f0386J5060A04385c90494
15799C8892a06639E2447J46485l9412a10301A4479D513b71573M7991f7877J1029
15788e6848j15140B1135O58a65697B0248J36055b44968r1471B15258O8779i5210
$$ plain form
15867 99579 -147700 -116931 89676 -204650 138335 -313594 328223 149842 105299 221552
15857 221552 -117228 -104016 203888 181834 -2863 -123679 -314352 -74947 54923 181242 -157181
15845 -181021 -127998 69598 -132176 -157223 -45710 48809 -32913 84579 14673 -16722 45956
15833 206080 -22113 -22744 -161666 -126818 2750 -24981 -56460 146111 -218967 -252829 -290611
15822 -290611 -19538 -15273 35011 -141761 -255696 -198491 -78317 -101748 -85736 -118066 -169825
15811 -169825 -196664 -102647 -144665 81149 -142068 -175940 61898 -60386 -45326 104385 -390494
15799 38892 -106639 52447 198932 159520 -110301 14479 4513 -271573 -223582 -67877 -56848
15788 -56848 -171988 21135 21793 -165697 20248 156303 -244968 -336439 215258 284037 -95210
15776D6981a18106A67933C5172c22270c743m620j91315e555j9341j34548a0976
15764B49943j0692E5900A9130a28216e9465A92110A1434Q2098B5730J51916K7371
15753B05017r9862J26023a3288B1057R4977h3003R713k1683M0773B99643f6237
15741a66120J2541r0769c2376j09945A007a43499A74533g0469A79835a06554F0348
15729A01058a20685C41505b25254A00028a24673D7391a16524e806C26998b1056
15718A57013a79356J08c3899l7746k93631J12036c1336A12975k2249a7612j85529
15707b03141F6619b56909b9393I7131b48793O4759Q97k83270a12544A57545c03650
15695E6254J14862d4958q5635A31558c66293e3595A52156D9722J2123h3467P135
$$ plain form
15776 46981 -118106 167933 35172 -322270 -3743 -8363 -199678 -5555 -24896 -159444 -10976
15764 249943 239251 55900 19130 -128216 -59465 192110 11434 93532 25730 177646 205017
15753 205017 105155 231178 -13288 21057 116034 -83003 -73290 -94973 -54200 299643 -66237
15741 -166120 -153579 -244348 -32376 -142321 1007 -143499 174533 -70469 179835 -106554 60348
15729 101058 -120685 341505 -225254 100028 -124673 47391 -116524 -5806 326998 -21056
15718 157013 -179356 -179248 -33899 -71645 -365276 -253240 -31336 112975 90726 -17612 -203141
15707 -203141 66619 -256909 -29393 97131 -248793 -184034 -183137 -466407 -112544 157545 -303650
15695 56254 171116 -44958 -130593 131558 -366293 -53595 152156 49722 61845 -83467 -76332
15684g6332k96327A21725a78319D5809c0123A52453b23676e3049j37897i3134
15673F2067b05647n5638I3645m3387K69716A42221a97373A17651e439G8974J8372
15662I7346c17221a55139e446o1600j49548e5430C0773a71318E4110j3332a89506
15650a37997a5521B20695K9184m8965b43944H4281c58740a4723D491a74689C88238
15638B41373H4612a09113e1678F395h7316d2638k20166f9871m5221A54049h8523
15626e2258G5445f8279A2999J5798a55156n7724c8154k5834j40418E7760h735
15614A94769e2040A42089C3895d65618A26475b21441H8986K9929c6701H8314N9861
15603A48175a01001A03614B8737a81759F9697a9543A91337K3974f3139A53232
$$ plain form
15684 -76332 -372659 121725 -178319 45809 -30123 152453 -223676 -53049 -190946 -93134
15673 62067 -205647 -261285 93645 50258 319974 142221 -197373 117651 -5439 78974 97346
15662 97346 -317221 -155139 -5446 -67046 -216594 -55430 30773 -171318 54110 40778 -189506
15650 -137997 -15521 220695 249879 200914 -243944 84281 -358740 -14723 4491 -174689 388238
15638 241373 84612 -109113 -51678 6395 -87316 -42638 -262804 -69871 -115092 154049 -88523
15626 -52258 75445 -68279 12999 28797 -155156 -212880 -38154 -63988 -204406 57760 -8735
15614 194769 -52040 142089 33895 -465618 126475 -221441 88986 118915 -36701 88314 148175
15603 148175 -101001 103614 28737 -181759 69697 -19543 191337 215311 -63139 153232
15592c45823J22428J8670J00048I778L75907b4292C38441b91827B25354h9352
15581F1200a72044L024k3148B91174c7810B96589L8711a58314L7222j63946c940
15569d01313a97198j20438B6236R6159O5116n5587n1349N1450a57D9563K0221
15558F9784c47840H2614a67351B19806m4126C957a27678a9344C7963R5956A1251
15546I7020b7023j2464A98659a3005j20106K8081o8309F4773K30918q1525l5503
15535A78663J01495h4347B8810M1420J40654A157L6944J06596f0464j93420K9480
15524b24404A58987P1154c1883C9017q008J1747a04470n5642k34727C4410h075
15512b66820N3654A14039g5785j83372E065a29755A43640a91756g7073B5852b45765
$$ plain form
15592 -345823 -223395 -204725 -104677 9778 385685 -24292 338441 -291827 225354 -89352
15581 61200 -172044 -169020 -192168 291174 -37810 296589 335300 -158314 -121092 -285038 -3940
15569 -401313 -197198 -317636 26236 122395 187511 131924 80575 132025 -157 49563 69784
15558 69784 -347840 82614 -167351 219806 175680 3957 -127678 -19344 37963 133919 11251
15546 97020 -27023 -39487 198659 -13005 -133111 -105030 -173339 64773 295691 214166 178663
15535 178663 280158 -84347 28810 70230 210884 1157 38101 144697 -60464 -253884 -224404
15524 -224404 158987 230141 -31883 39017 31009 42756 -104470 -160112 -394839 34410 -8075
15512 -266820 -213166 114039 -75785 -259157 5065 -129755 143640 -191756 -77073 25852 -245765
15500a41999A39584i573a334H3152J18806M54a35260e2966o3926j886A4930J06658
15488A21588d8818D2045O8903J98952C0147i554A2623a46215D066K1856b72824
15476F9131b67296L2288D00173i4724I0263a78153d9470B35878d7019l2181j67741
15465b46941R7768a2780k2180o241A95017E0384K06001j17918l6106D6876J4634
15454F1510J78344B6354K58235a22525A58960e7591H9177i3082c4648l7901b1232
15442H2475a6784A42661A074L35714E8395c33266F3076d64365c6484j57246l2428
15431b26158N314h6755F0514c5555j66833H1609K00718c31220c1527B35162i4584
15419B0740b05458k13066G982b18320q4131a50262K4363I7711K0844C8580b18628
$$ plain form
15500 -141999 139584 -9573 -1334 83152 201958 202412 -135260 -52966 -116892 -118778 14930 121588
15488 121588 -48818 42045 110948 309900 30147 -9554 12623 -146215 4066 25922 -272824
15476 69131 -267296 -235008 400173 -94724 90263 -178153 -49470 235878 -47019 -79200 -246941
15465 -246941 -149173 -12780 -34960 -41201 195017 50384 256385 138467 102361 46876 61510
15454 61510 239854 26354 284589 -122525 158960 -57591 89177 -93082 -34648 -72549 -21232
15442 82475 -16784 142661 1074 336788 58395 -333266 63076 -464365 -36484 -193730 -226158
15431 -226158 -220844 -86755 60514 -35555 -202388 81609 282327 -331220 -31527 235162 -94584
15419 20740 -205458 -418524 7982 -218320 -302451 -150262 -125899 97711 118555 38580 -218628
15407D860O5008J4507a37870B27689A08025j2632a28653n1724k4769I5033a75689
15395A5328i8332A60759j0715l0477D0114L7294K19422A1202J67238p9062a00385
15383B84245B143a49270c1962D2511a66126C4521K06888p3188e6535j91833N5252
15372a93116A21083J0484b41578B5200K7113L2435J42520a49600F8613J07409
15362A76022i1956I3794L3846i7797A45513B7063J4188L839K28187K5298g0264
15350A04035a42671j454k62303a24791m3873d8202k51838O0948k3659r2639J38380
15339b17010a04091A14024j7113c0395A01367K87751D6307A2014a31821A31172
15328E4083c1809B04465a34857M4486B48211E1168N2404a45146B77582j27041
$$ plain form
15407 4860 69868 84375 -137870 227689 108025 95393 -128653 -180377 -205146 95033 -175689
15395 15328 -98332 160759 150044 119567 40114 77408 296830 11202 178440 99378 -100385
15383 284245 2143 -149270 -31962 42511 -166126 34521 241409 168221 -56535 -248368 -193116
15372 -193116 121083 131567 -241578 25200 52313 84748 227268 -149600 68613 176022
15362 176022 -91956 93794 127640 -97797 145513 27063 41251 45090 273277 298575 -70264
15350 104035 -142671 -144125 -406428 -124791 -168664 -48202 -300040 -239092 -262751 -355390 -217010
15339 -217010 -104091 114024 96911 -30395 101367 389118 46307 12014 -131821 131172
15328 54083 -31809 204465 -134857 -90371 248211 51168 103572 -145146 277582 150541
15318A50541D3796O8915k3608J02565g9765A2701a64927A24009b899q2551A68026
15306B73683M0956C8470g4902l7062j53413F2418e3774B75367b29777h8731o6234
15295a54965J2316n3991C74728B0499a46381F3661a90528L6856I8362R3945e6635
15283E8051J41451K19431a64390A64954K6030l475d3554p248B81110c50946f9331
15271a64788f3280K6809A41373B8874M53335A5301O2307m018a3586A09359m4763
15260F4596L00315A21116n7507e5513A48539g9711B71796H3630g5492C25827J75863
15249E01690O85234j55971j74660L60168E70184j26342r0711p8024A08511P4659
15239A83170K7990r7086L4272m8030B4431a1090C86531H5320e5385b0442C47744
$$ plain form
15318 150541 43796 112711 89103 191668 -79765 12701 -164927 124009 -2899 -85450 168026
15306 273683 314639 38470 -74902 -111964 -265377 62418 -53774 275367 -229777 -88731 -154965
15295 -154965 -142649 -196640 374728 20499 -146381 63661 -190528 -153672 98362 192307 -56635
15283 58051 199502 418933 -164390 164954 190984 187509 -43554 -50802 281110 -350946 -69331
15271 -164788 -63280 -36471 141373 28874 482209 15301 77608 73590 -13586 109359 64596
15260 64596 364911 121116 63609 -55513 148539 -79711 271796 83630 -75492 325827 501690
15249 501690 1186924 1030953 856293 1216461 570184 443842 353131 275107 108511 183170
15239 183170 211160 114074 148346 100316 24431 -11090 386531 85320 -55385 -20442 347744
15227A90831k3404n6748l7762n729K16491Q1589j02885o4726I3823B3836O8478
15216I2314J26742J31044b91587B86999a43594D3045a12357A76820B9957A2592
15205A45572N834N2244F9479R3203f7242r2039D1698i9691A06488K6760h2236
15193A31894a44221I0023L6954D9088O440O4289a68375A20071a26702B9784J82213
15182B11997b80804B16250K8294J0163A19107B8455a74985B1491M8478J7014L9673
15171A26656a15328G3775J3717M5361H942a04464K5800G76a6943C1757c8857P433
15159c1424B56723e2964k22529a5513N544j5401E8490e3343A42639L2698p9723
15148I5614j6403l4653a80829A62983K5206o0215J74470A14192L04906H7502b55995
$$ plain form
15227 190831 167427 110679 72917 67188 283679 365268 262383 197657 93823 23836 92314
15216 92314 219056 350100 -291587 286999 -143594 43045 -112357 176820 29957 12592
15205 145572 151406 203650 69479 162682 -67242 -159281 41698 -99691 106488 133248 -82236
15193 131894 -144221 90023 126977 49088 55528 119817 -168375 120071 -126702 29784 211997
15182 211997 -280804 216250 244544 254707 119107 28455 -174985 21491 69969 86983 126656
15171 126656 -115328 73775 87492 132853 8942 -104464 -78664 776 -16943 31757 -38857 -31424
15159 -31424 256723 -52964 -275493 -15513 -9969 -25370 58490 -53343 142639 175337 95614
15148 95614 79211 44558 -180829 162983 188189 127974 302444 114192 419098 87502 -255995
15136B33850B6799J3274L0078J0612K65292H0969R4210K5992m4084J81913O957
15125C45957L30020F5061J43087k1298J2874o6855K155D3941N6395a69220G8587
15113A1549L1060c3589B51873L6167o4164M1167I9110j4041e2304C83844A16546
15101C12530p7131i2263H9497A6984L19030a19115A86176K0063K74765b1405B11307
15089C0462J7306A0361R3137M3578L5872D0724i2211B38938p53C3467K45710I9175
15076b6627F7098K7873b22439I1596q082a98842A07606P8918P7091F2673M1385
15065A04058n0250J39585J74516a94626R2319F0185J04348j6469K77433i0750
15054b55788A79175F7524K101K25893H4082J40290O2865j08172J4840L097A9050
$$ plain form
15136 233850 26799 40073 70151 80763 346055 80969 175179 201171 157087 339000 345957
15125 345957 675977 65061 208148 186850 199724 132869 135024 43941 100336 -169220 78587
15113 11549 42609 -33589 251873 288040 223876 265043 99110 85069 -52304 383844 116546
15101 312530 235399 -92263 89497 16984 336014 -119115 186176 206239 481004 -21405 211307
15089 30462 47768 10361 103498 147076 182948 40724 -92211 238938 238185 33467 279177 99175
15076 -26627 67098 94971 -222439 91596 83514 -198842 107606 186524 263615 62673 104058
15065 104058 53808 193393 367909 -194626 -102307 60185 164533 148064 425497 -90750
15054 -255788 179175 67524 69625 295518 84082 224372 287237 179065 193905 197002 19050
15042G0674J68376a883B9990J34336c583A12848P6444L45516o3026j95026R3577
15031C70333B0467O3551K65871H0357b8869A13935a7975B21252K30561j06141
15021C45672i927l4649D38060A27509A7417K94965k0159G5676P0040C9067H146
15009B56428P982K83774I6074b0402A84134a9199A07817e2560B06802q8802K38103
14998C56103j44893N4470a2862A34198a13021I4789J58547p794B6869Q7946O8550
14987A83365c5328k39660D3885K17285e6111B51622H8464p832J64841r9200b9757
14975D22306L9878F7143J81555J35211m3707h0975G2036L14583d969D19690q7573
14964C32117I9652O0662l5299K23092K94946B22036O821M6153P251L78947A00665
$$ plain form
15042 70674 239050 -1883 29990 164326 -3583 112848 189292 534808 471782 276756 370333
15031 370333 20467 84018 349889 80357 -28869 113935 -17975 221252 451813 345672
15021 345672 -9927 -44576 438060 127509 17417 312382 292223 75676 145716 39067 8146
15009 256428 264410 548184 96074 -20402 184134 -19199 107817 -52560 206802 118000 356103
14998 356103 211210 265680 -12862 134198 -113021 94789 253336 245542 26869 114815 183365
14987 183365 -35328 -274988 43885 261170 -56111 251622 88464 80632 245473 146273 -29757
14975 422306 462184 67143 248698 383909 340202 -80975 72036 386619 -4969 419690 332117
14964 332117 99652 160314 125015 348107 643053 222036 228857 275010 282261 661208 100665
14952B43437J36963J11478e1402B16579C8369K20134A9786K97948a19415H990
14941C65056n9690j10996J35422R5379A36580B2847M94853B41482D4048R9681
14931A43729J72417A25349K33486j47233O214K18209J4562m1660M7087k14026
14921B41988n870e8881F43043C19843E2554L61367J11611j24762A66732J56229
14911C22961I0698O07425k66125p577o0912j0774j50776L58122p5088j60353K12772
14900E37412k33932n914A796L41499d4786E30424j77963a4090C14011p1354K42364
14889D85021c606k72543D77402B09502N3285n928J17809o4862j20129L78600k52477
14878C15800J09265j20300r7674C2134K23036K42313j09872J52852q6494A52938
$$ plain form
14952 243437 380400 491878 -51402 216579 38369 258503 19786 317734 -119415 8990
14941 365056 305366 194370 329792 425171 136580 22847 517700 241482 44048 143729
14931 143729 316146 125349 358835 211602 217816 436025 450587 408927 456014 241988
14921 241988 236118 -58881 643043 319843 52554 413921 525532 400770 166732 322961
14911 322961 90698 698123 431998 424421 363509 352735 201959 560081 484993 324640 537412
14900 537412 303480 297566 1796 343295 -44786 530424 352461 -14090 314011 242657 485021
14889 485021 -3606 -276149 477402 209502 262787 256859 374668 309806 189677 568277 315800
14878 315800 425065 304765 207091 32134 255170 497483 387611 540463 453969 152938
14867B63743l1540R939J94561J99839A53290K59969K02593B66286J1853K002J40002
14856D20143q6817h2200E36652k6035H1061L28286j36450M5223K38351B13927
14845C74174J0334n5499L1816j77673O5775O3779r5810J72927K00863j64337j13246
14834C13103K10684o3715P2534B22108K27830J44508k66839R8338R6522j44294
14824C78173J64689k33907N53656C71290J02469k11988O2044L28053B99610K759
14814C02369L27103o5293m1490j08026p6476m6121J65898Q3993J86805k68891
14804D59871Q077j67966J55242R4758N4460J58970l32059p1185r920K69558j32281
14793D87525L5410j03818n5714K70869K98826l44011j31886j00607J65685J3980
$$ plain form
14867 263743 232203 242142 436703 636542 153290 413259 615852 266286 278139 280141 420143
14856 420143 333326 -82200 536652 510617 81061 409347 272897 318120 556471 213927
14845 374174 384508 329009 360825 183152 248927 312706 216896 389823 590686 426349 313103
14834 313103 523787 460072 532606 222108 449938 594446 327607 425945 522467 378173
14824 378173 542862 308955 862611 371290 473759 261771 323815 651868 299610 302369
14814 302369 629472 564179 522689 414663 338187 292066 457964 541957 728762 459871
14804 459871 467948 299982 455224 549982 604442 763412 431353 360168 350248 619806 487525
14793 487525 522935 419117 363403 634272 933098 589087 457201 356594 522279 536259
14783E36259B59519L71848k20808R9427k9284J73960K12978l04030r6j12994j24565
14772C25955K56653K26115l95501K24899q3407n3424M8602O1285m6062o7344P3119
14761E70890j45567k0824K74881q8066J17669r792C14952N15102p5977B92371
14750E82180k65405L74000n790l7833j62917N9572P8616N0156j76464M8106k7811
14739E16410J02970N3474K38865l38896J06936O4933j0061K08455l46766J8020
14729F14340L06426k87235J90161J09373m65744K35463L1911j40923O260J07870
14719G07902J06414C35037O8081N84275k41741K38255l04581K4003L5336K40781
14709I79446k0667j34973m4852O5908K08901j36828j72884M8896k55791M63467
$$ plain form
14783 536259 259519 631367 410559 509986 480702 654662 867640 563610 563514 450520 325955
14772 325955 582608 808723 413222 638121 554714 501290 549892 611177 565115 497771 570890
14761 570890 425323 404499 679380 591314 708983 699191 314952 830054 754077 292371
14750 582180 316775 690775 684985 647152 484235 543807 622423 672579 496115 544221 516410
14739 516410 619380 672854 911719 572823 679759 744692 734631 943086 596320 614340
14729 614340 920766 633531 823692 933065 467321 702784 734695 593772 600032 707902
14719 707902 814316 335037 403118 987393 745652 983907 679326 703329 738665 979446
14709 979446 958779 823806 778954 844862 1053763 916935 744051 792947 537156 1000623
14699A000623j78973j82335J59490L07746k79410p1045J86807j4358L7772O853
14689I73170p4423j09596J5597L9650M2631P5375l12271N46969j80424D29587
14678A238709j39350l4629j23594j14409j70858j8575L09037L78351l98917l7825
14668H87940J69385N7365j64851D49645M88787L12638m2952m28775K37379l4770
14658I81952j25030L63592j78843K581q4942O3464p3382K31748J77877n74302
14648G84715K14086J48844N4464J58347q8342j33327r0902J71872j63356K51586
14638A307987m63672O30751P098j90572j25983j67144M56068k44930L6938J89885
14628A436426j1819l37119K48675J1923m2632M7831q6414J89460K1109r7996M7441
$$ plain form
14699 1000623 821650 639315 798805 1106551 827141 756096 942903 928545 966317 973170
14689 973170 898747 789151 804748 844398 887029 962404 650133 1197102 1016678 429587
14678 1238709 1099359 1064730 941136 826727 655869 637294 946331 1324682 925765 887940
14668 887940 1057325 1114690 949839 449645 938432 1251070 1208118 779343 1016722 981952
14658 981952 856922 1220514 1041671 1044252 959310 1022774 949392 1181140 1359017 784715
14648 784715 998801 1147645 1202109 1360456 1272114 1138787 1047885 1219757 1056401 1307987
14638 1307987 844315 1475066 1482164 1291592 1165609 998465 1454533 1209603 1246541 1436426
14628 1436426 1424607 1087488 1336163 1348086 1305454 1353285 1266871 1456331 1477440 1379444 1426885
14617A426885j49434N3145k32571J68643r1992K34909J07831k37336J72298N1290
14607A503668k42042K12547j28788L90649k68056j17937K36561q8863N65840m95742
14597A567837r056P9385m1757j47802K14386m0783j27206L20518K27231j84985
14587A857768K6796l11274J78687L1496M30380m02734k313M1865Q5107k62225
14577A673553N93830n82366M16217Q5922J38076l14801k96178L01322K40312k94758
14567A961129M14441J04287r1330O1354J54001K55199k08454M27455K07854M359
14557C290295k73100M74980O57332k73260N36393O75711M37581J362124J551487
14548H439543M142014P005797J1338439Q02860j4835115p003803l930574j452327
$$ plain form
14617 1426885 1277451 1330596 1098025 1266668 1174676 1409585 1517416 1280080 1452378 1503668
14607 1503668 1261626 1474173 1345385 1736034 1467978 1350041 1586602 1497739 2063579 1567837
14597 1567837 1558781 1638166 1596409 1448607 1662993 1622210 1495004 1815522 2042753 1857768
14587 1857768 1884564 1573290 1751977 1783473 2213853 1811119 1808806 1850671 1935778 1673553
14577 1673553 2267383 1685017 2101234 2187156 2325232 2010431 1714253 2015575 2255887 1961129
14567 1961129 2375570 2479857 2388527 2449881 2603882 2859081 2650627 3078082 3285936 3290295
14557 3290295 3017195 3492175 4149507 3876247 4412640 5088351 5525932 6888056 8439543
14548 8439543 12581557 19587354 30925793 31728653 16893538 9889735 5959161 4506834
14540D506834j047328l21457n03284J70230k8045K48530o89927L30766k20377
14531B445942j41997J46219K9248k32741J30521K02015k74306J17261J22355J27536
14521B672053j71707N8687Q4957P6623j92568l8920J63295j95287K58102K46140
14511B961375k18097J08643Q4553P7035n9115j86521J71573L4546m1998L3564
14501B965558Q3439J2324j83580M03707j24890L39454m13038K1722k00887M52369
14491C356178Q6139l01718O13042n25540L79082k07807p5656M53846O938j28365
14481C656139q4830K53920J24044j69768J65769k33813N1888K98451J45629l39908
14471C867521J80533p9970M42064j47893J04878R6881l0904k53322K21113l4510
$$ plain form
14540 4506834 3459506 3138049 2634765 2804995 2776950 3025480 2335553 2666319 2445942
14531 2445942 2303945 2450164 2479412 2246671 2377192 2579207 2304901 2422162 2544517 2672053
14521 2672053 2500346 2559033 2643990 2720613 2528045 2489125 2652420 2457133 2715235 2961375
14511 2961375 2743278 2851921 2936474 3013509 2954394 2767873 2939446 2973992 2931994 2965558
14501 2965558 3048997 3061321 2877741 3281448 3156558 3496012 3082974 3104696 2903809 3356178
14491 3356178 3442317 3140599 3753641 3228101 3607183 3399376 3323720 3777566 3784504 3656139
14481 3656139 3571309 3825229 3949273 3779505 3945274 3711461 3763349 4061800 4207429 3867521
14471 3867521 4048054 3968084 4410148 4262255 4367133 4464014 4433110 4179788 4400901 4366391
14461D366391k5436k5945O03380j41069K2779k86358N01927J29352k03409J49834
14451E091446m923J85014m1748k7992K77280J70938j32396K66929j75294K06721
14441E815975J32404M5026r6967K67698J10637n4777j04257P9536J05965K42208
14431F543448j411J16828K91592j02306J66090L2263L06645k52480L70042p2145
14421G398566J19191M33944k78657K35391M4293q5135J17509M55444R8106O2394
14411H601046P4580J19494J28044K64326N4018J29178J37147k1412M80707N5592
14401A0022720l14458N28933R2534K39698N9124Q2014O11135R3384K2788J45711
14391A1583583P5291K34362M73302q6277M35962k67511M37332N58223J5982J08368
$$ plain form
14461 4366391 4340955 4315010 4918390 4777321 4800100 4513742 5015669 5145021 4941612 5091446
14451 5091446 5086523 5271537 5229789 5201797 5479077 5650015 5517619 5784548 5609254 5815975
14441 5815975 5948379 5993405 5896438 6164136 6274773 6219996 6115739 6195275 6301240 6543448
14431 6543448 6542037 6658865 6950457 6848151 7014241 7046504 7353149 7100669 7470711 7398566
14421 7398566 7517757 7951701 7673044 7908435 7952728 7867593 7985102 8440546 8538652 8601046
14411 8601046 8675626 8795120 8923164 9187490 9241508 9370686 9507833 9486421 9967128 10022720
14401 10022720 9708262 10237195 10329729 10569427 10628551 10710565 11321700 11415084 11437872 11583583
14391 11583583 11658874 11893236 12366538 12280261 12716223 12448712 12886044 13444267 13460249 13568617
14381A3568617O15623J79651J52544J40862O44339n3851L94111L75229K54815
14372A6271940K95512M48919L71241Q7470N34387L18406M51659K83544K92202
14363A9355280L77825O06719J38420M62071P80545K84964N54007O09648O13594
14354B3783073L97833R46866N7691P04371M01985R75578P95487P45441N38278
14345B9346603O87265O04110J131010L37400J163932Q82905J360136P71697Q85223
14336C7170281J067473J266305J282760Q80077J542653J218126J322776J529115
14328D7279566J249841J565569J933313J618752K102891J240255K401955K315175
14320F1707317J945319K317057K328609K582294K433885L207796K673314L465362
$$ plain form
14381 13568617 14184240 14363891 14516435 14657297 15301636 15247785 15641896 16017125 16271940
14372 16271940 16567452 17016371 17387612 17475082 18009469 18327875 18779534 19063078 19355280
14363 19355280 19733105 20339824 20478244 20940315 21720860 22005824 22559831 23169479 23783073
14354 23783073 24180906 25127772 25185463 25889834 26291819 27267397 28062884 28808325 29346603
14345 29346603 30033868 30637978 31768988 32106388 33270320 34153225 35513361 36285058 37170281
14336 37170281 38237754 39504059 40786819 41666896 43209549 44427675 45750451 47279566
14328 47279566 48529407 50094976 52028289 53647041 55749932 56990187 59392142 61707317
14320 61707317 63652636 65969693 68298302 70880596 73314481 76522277 79195591 82660953
14312H2660953L277128L580484M028637L678911M307597M453408M874356M963036
14304A15824510N256346N971206N986436O224289P041265O891265Q074608P973849
14296A69243774Q657955Q914678R829240J0192595J0552716J1554634J2290599
14289B41236191J2978715J3631548J3368914J3289329J2996845J1478872J0701455
14282C29681869J0976386J1365086J1580550J0909570J0192241J0646617J1631803
14275D06984122J1400728J0594661R220494N475652L437049J808927k00981o714978
14267D42005674m281768n744842j1674885j4294061j3834774j3299990j3814313
14260C65061041j3545585j3237552j2701779j1668537j2478340j2138098j1716750
$$ plain form
14312 82660953 85938081 89518565 93547202 97226113 101533710 105987118 110861474 115824510
14304 115824510 121080856 127052062 133038498 139262787 146304052 153195317 161269925 169243774
14296 169243774 177901729 186816407 196645647 206838242 217390958 228945592 241236191
14289 241236191 254214906 267846454 281215368 294504697 307501542 318980414 329681869
14282 329681869 340658255 352023341 363603891 374513461 384705702 395352319 406984122
14275 406984122 418384850 428979511 438200005 443675657 447112706 448921633 448720652 442005674
14267 442005674 437723906 431979064 420304179 406010118 392175344 378875354 365061041
14260 365061041 351515456 338277904 325576125 313907588 301429248 289291150 277574400
14253B77574400j1090910j1116002j0905440j1003724j0129806r230522r310589
14246B04787407q809645q027610p708751p899925p168201p305718o249711n669826
14238A45948020o295558n279760n838945m856425m864770m557170m641271l907585
14230A05706536l733694l940440l752855l716933l412965l309402l208169k445781
14222G8186297k765559k473950k514527k447997k492327k092729j909685k250114
14214E9239409j593536j742375j965925j827368j584888j563732j218044j232865
14206D6510676j540905r87718j611965j285195j234264r82160o00837j417635
14198C6849997j048102j018773j281094o23891q20837m52182j275481q04146q28958
$$ plain form
14253 277574400 266483490 255367488 244462048 233458324 223328518 214097996 204787407
14246 204787407 195977762 187950152 180241401 172341476 165173275 157867557 151617846 145948020
14238 145948020 139652462 134372702 128533757 123677332 118812562 114255392 109614121 105706536
14230 105706536 101972842 98032402 94279547 90562614 87149649 83840247 80632078 78186297
14222 78186297 75420738 72946788 70432261 67984264 65491937 63399208 61489523 59239409
14214 59239409 57645873 55903498 53937573 52110205 50525317 48961585 47743541 46510676
14206 46510676 44969771 43982053 42370088 41084893 39850629 38868469 38267632 36849997
14198 36849997 35801895 34783122 33502028 32878137 32057300 31605118 30329637 29525491 28696533
14189B8696533p07120o60470m98565r64389p15316n57514q45752m33353o789q09678
14179B2497587o88553m11527k15768q06803m27043o81490M36730r15099m24891
14170A8363143j26808n22259m14983k45996m51717J5289n77582k08560k42806
14161A5587721m97620r1956m0139o10410l43094J9347l87949m37621j24499J75313
14151A3249093o10171R6145k86528k83871l38287J90370m15795j05464l30144
14142A1165348j14932k15064j22648j23218l78479m245k68370q2561r368j21222
14132I725241l82574k76978j17869p7789k25179P5709J37120l16065l58508K76157
14122H459265m88854J67031J33414m76527K03318q12013M73818k55077l18972
$$ plain form
14189 28696533 27989413 27328943 26830378 25865989 25150673 24593159 23747407 23314054 23307265 22497587
14179 22497587 21809034 21397507 21181739 20374936 19947893 19266403 19703133 18788034 18363143
14170 18363143 18236335 17714076 17299093 17053097 16601380 16616669 16039087 15830527 15587721
14161 15587721 15090101 14998145 14958006 14347596 14004502 14023849 13635900 13198279 13073780 13249093
14151 13249093 12638922 12735067 12448539 12164668 11826381 12016751 11600956 11495492 11165348
14142 11165348 11050416 10835352 10712704 10589486 10211007 10206762 9938392 9855831 9846463 9725241
14132 9725241 9342667 9065689 8947820 8870031 8644852 8720561 8857681 8541616 8183108 8459265
14122 8459265 7970411 8137442 8270856 7794329 7997647 7185634 7659452 7404375 7085403
14113G085403K39138m7185l10560K4431k07235m1887R102J32586l94204m0784
14103F448805q633j75143J62132k34075L580k77726l598n6486m69150L55136L7056
14092E781898j62709m71736R4415L40567j41127n61339P7336K00961O013j06627
14082E057652N3604k18501J01046p1081l10491L02813l84914R9029j71778L23216
14072D780595j45104k29305Q4933J83642m28333m0223k37672J72449j97284N87355
14062D531053k29286k55288k0533L07150l5360k62395j01505J76354k93254n4564
14052C762372j082m3638j7887J37373j96126J07150k58267j11943K26884l38751
14042C266085J2899M09246k91115k60648J42041J10683j26745j96179K16186p0175
$$ plain form
14113 7085403 7324541 7277356 6966796 6991227 6783992 6742105 6751207 6883793 6489589 6448805
14103 6448805 6440172 6265029 6427161 6193086 6196666 5918940 5915342 5858856 5389706 5744842 5781898
14092 5781898 5619189 5147453 5241868 5582435 5441308 4879969 4957305 5158266 5164279 5057652
14082 5057652 5111256 4892755 4993801 4922720 4612229 4915042 4530128 4629157 4457379 4780595
14072 4780595 4635491 4406186 4491119 4674761 4246428 4206205 3968533 4140982 3943698 4531053
14062 4531053 4301767 4046479 4025946 4333096 4297736 4035341 3933836 4110190 3816936 3762372
14052 3762372 3761290 3717652 3699765 3837138 3641012 3748162 3489895 3377952 3604836 3266085
14042 3266085 3278984 3688230 3397115 3136467 3278508 3389191 3262446 3066267 3282453 3212278
14032C212278j87795p5781J08412N74440m00060l3576j32660k78031n4285L52449
14022C085391j64156J18256k10466k5611j51654j11948P8968O7503p7618p139
14012B601526M5559j49721K98642n49278K43198O8424j70797R1117L25567k78193
14002B526044k50893K76420J3965o9889J76632r2277R929L16200n3900J76982
13992C029213M67241J04176P32955J058762K758472O086001J1559216P236511
13984C3032547j2650738p035961m496427k110069j318630n53292o31504p5417
13976D160509k41575l97534j48426l82203L89350m31741k15481j4909K4926k14553
13966B528363J05119k65701M4459J91480j69104k35631M00596l85237J13377k7469
$$ plain form
14032 3212278 3024483 2948702 3057114 3631554 3231494 3197918 3065258 2787227 2732942 3085391
14022 3085391 2921235 3039491 2829025 2803414 2651760 2539812 2618780 2686283 2608665 2601526
14012 2601526 2647085 2497364 2796006 2246728 2489926 2558350 2387553 2478670 2804237 2526044
14002 2526044 2275151 2551571 2565536 2495647 2672279 2580002 2589931 2906131 2852231 3029213
13992 3029213 3496454 3600630 4333585 5392347 8150819 14236820 25796036 33032547
13984 33032547 20381809 13345848 8849421 6739352 5420722 4867430 4235926 4160509
13976 4160509 3918934 3521400 3372974 2990771 3380121 2948380 2732899 2717990 2742916 2528363
13966 2528363 2633482 2367781 2412240 2603720 2434616 2198985 2599581 2214344 2327721 2300252
13956B300252l10535K36208j37392l0391j69852L07750j74167N5704n07982M66886
13946B036481k53731J23291J4175J34876r4082P749N5950j21975n9258j05879
13936A737597J16558j71611k11292O63508p30324L81213n810J58307n15693L1149
13926A453602M74513k62396M187j86620J70983k76550K54956l677J12885N7480
13916A799363j92486K58970k98871j04395k83544J09678L68255j52156J40510
13907A645324k07722L6077P3845l5935n4289P1553q4985j39150J70457J27635
13897A602810j33043j15793p6453j03526K46777l929j77135K40260j21827j34439
13887A223702J6405L91239k73402j24414J24812m3008m15723O05885k50354k2214
$$ plain form
13956 2300252 1989717 2225925 2088533 2058142 1888290 2196040 2021873 2077577 1569595 2036481
13946 2036481 1782750 1906041 1920216 2055092 1961010 1968759 2024709 1902734 1843476 1737597
13936 1737597 1854155 1682544 1471252 2134760 1404436 1785649 1779839 1938146 1422453 1453602
13926 1453602 1928115 1665719 1669906 1483286 1654269 1377719 1632675 1628998 1741883 1799363
13916 1799363 1606877 1865847 1566976 1462581 1179037 1288715 1656970 1504814 1645324
13907 1645324 1437602 1473679 1547524 1511589 1457300 1528853 1443868 1304718 1475175 1602810
13897 1602810 1469767 1353974 1277521 1173995 1420772 1416843 1239708 1479968 1358141 1223702
13887 1223702 1240107 1631346 1357944 1233530 1358342 1315334 899611 1505496 1255142 1232928
13877A232928J39795K33742l22369k00576J00772j22766L5258J49197m0898J22932
13867A328015j59547J70233j48496l41000K50839p1424K6947j59676K13585P0386
13857A179862l52468M78149l20168N16127n47878M7721N3861J79662E81255L15461
13847H96716L32820j85294Q6333j71505J92690k85906j9165L14689m54169l7840
13837F69369L02270k565l6354K71288k33452k40609K46495m19600M19296n9915
13827I16223p7511K82410k05621K57192l03558k10448M23839k65472J83160j09211
13817H91003Q9711K78015l82892n9267o9677J6127j68026Q3198K06368k64226
13807F20334K67202n3773R1351j9930J4168N1104k79993J61656j91541L38289
$$ plain form
13877 1232928 1372723 1606465 1284096 1083520 1184292 1061526 1096784 1245981 1205083 1328015
13867 1328015 1168468 1338701 1190205 849205 1100044 1028620 1055567 895891 1109476 1179862
13857 1179862 827394 1305543 985375 1501502 953624 1001345 1055206 1234868 581255 896716
13847 896716 1229536 1044242 1130575 959070 1151760 865854 846689 1161378 707209 669369
13837 669369 971639 969074 932720 1204008 970556 729947 976442 556842 976138 916223
13827 916223 838712 1121122 915501 1172693 869135 658687 1082526 817054 1000214 891003
13817 891003 980714 1258729 875837 816570 746893 763020 594994 678192 884560 620334
13807 620334 887536 833763 925114 905184 919352 970456 690463 852119 660578 998867
13797I98867m14733J50887J42747Q6693M1032D35878M46272J38638k15326k9003
13787G76459C51199M56267l962K1707j44534J89845L5069j21306j46553j3474
13777F24258A80162Q16649j16990j4128p3464j08706M0955K0222N5961j045j51294
13766F48322k24474J64033O7694K96771j60562C39589K24261j96306L94751k63996
13756D98299Q3802R5356K41133k90345j40658L90887C65097M89178j33484l15820
13746D04971J18976R6488k6665J18375l187M03902E07662J39206J07475l4371
13736G19972J83260D01412K53791B44999K85751j38555K33903Q5669j22736A91043
13725G02864R3604q8576j44847M1694p960R9459m4071m4877k7136l3072j41761
$$ plain form
13797 998867 584134 735021 877768 964461 1005493 435878 882150 1020788 805462 776459
13787 776459 351199 807466 803504 825211 680677 870522 905591 784285 637732 624258
13777 624258 180162 996811 879821 865693 792229 683523 724478 744700 800661 799616 648322
13766 648322 423848 587881 655575 952346 791784 339589 563850 367544 762295 498299
13756 498299 582101 677457 918590 628245 487587 878474 365097 854275 720791 404971
13746 404971 523947 620435 593770 712145 708958 1112860 507662 646868 754343 719972
13736 719972 903232 401412 655203 244999 530750 392195 626098 711767 589031 191043
13725 702864 796468 707892 563045 604739 596779 696238 652167 607290 580154 547082 405321
13714D05321J07840n1372K0211J17052J66033j15101j92894R0903J53123O6685
13704G67801n3912B86485j3779J92538m6415J9255K2773R4179J90154l04807K98277
13693G38660j83357k21832K04896j35347A34015N92358B99425K13386J3666j93588
13683C32889J8050N4981A46681M83776k34721L02449B31423M6117N6783j43232
13673A91091L41893j46090K68798k20268j76058J92273n7835J66037k19738k4076
13663C16027R6890K1533o0506K3130j28098J28974R5041O2501m3671L00469C70637
13651E92898k76846N7522k1849K3372P6404R0372J44717L4293k57932L01050B88294
13639E78155R1626l2910N2014B30507L25189L444k31156J80268B41487J94574
$$ plain form
13714 405321 513161 461789 482000 599052 765085 649984 457090 547993 701116 767801
13704 767801 713889 286485 272706 465244 418829 438084 460857 555036 745190 440383 738660
13693 738660 555303 333471 538367 403020 134015 726373 299425 512811 526477 332889
13683 332889 350939 405920 146681 630457 395736 698185 231423 277540 334323 191091
13673 191091 532984 386894 655692 435424 259366 451639 393804 559841 340103 316027
13663 316027 412917 434450 373944 397074 268976 397950 492991 555492 511821 812290 370637
13651 592898 316052 373574 351725 375097 451501 541873 686590 720883 462951 764001 288294
13639 578155 669781 636871 688885 230507 555696 559140 327984 508252 241487 436061
13629D36061j5339k04159L72524B91752A18742L55240Q424A83645J43808Q9864
13619D17317j44306K04096j67623J76167R4648k74471O2180R4681j6743J33795
13609E79741A26234j9780L85083J02144k35156L6208p3855r3852H3485K46252
13599C29737M7653o9514L06332k09598L02114l2057k82438N1582j94791J60390
13589D09410l7818A76658J68335Q0269J15229k15166J3241j5174J30771j73890
13579B80273J27327o0578Q0815j32127r6986Q7607q8595N50973k88474F6899K16071
13568B82970E9331J91591k0621A10557J39903J02101C0143K78493k0174j6316
13558B72146J16084n7070j56094N3344J10871j41652J33429j17149K43667B07025
$$ plain form
13629 436061 420722 216563 589087 291752 118742 473982 482406 183645 327453 417317
13619 417317 273011 477107 309484 485651 580299 305828 368008 462689 445946 579741
13609 579741 126234 106454 491537 593681 358525 394733 320878 227026 83485 329737
13599 329737 377390 307876 614208 404610 706724 674667 392229 443811 249020 409410
13589 409410 371592 176658 344993 425262 540491 325325 338566 323392 454163 280273
13579 280273 407600 347022 427837 295710 198724 286331 197736 748709 460235 66899 282970
13568 282970 59331 250922 230301 110557 250460 352561 30143 308636 288462 272146
13558 272146 388230 331160 175066 228410 339281 197629 331058 213909 457576 207025
13547A73309L65155B29262K46103N9002E7026M49700j44808J63311a63095C19122
13536A10856j066R9231b3512E17299j87823j156p6792d2062C7850K55827r0212
13525B03465Q1325J664R4161F8744N5889C4552K77255J59068j88693m4908q1023
13514A56251P2778J13096L9846p8442P3231j65895J73684P9676N1565A64889K74391
13503D39280A6117N22117B30345K14417G9855K63702a04082A65071K87898A25076
13492B31665p2462L7779K15421D0270M88608E9496K56167j16312O536E8379L20246
13481C78625j21035j15356J70254J23018J42788A67204N4548J14787A47832J41383
13471B89215M4382C2242K07402o5518J02683R4596A6167K72738L2123J0724A5060
$$ plain form
13547 173309 538464 229262 475365 534367 57026 506726 361918 525229 -163095 319122
13536 110856 109790 209021 -23512 517299 329476 328320 251528 -42062 37850 293677 203465
13525 203465 284790 286454 380615 68744 124633 34552 311807 470875 282182 237274 156251
13514 156251 229029 342125 381971 303529 376760 210865 384549 464225 515790 164889 439280
13503 439280 16117 538234 230345 444762 79855 343557 -104082 165071 452969 125076
13492 231665 159203 196982 412403 40270 528878 59496 315663 199351 205887 58379 378625
13481 378625 257590 142234 312488 435506 578294 167204 221752 336539 147832 289215
13471 289215 333597 32242 239644 174126 276809 371405 16167 288905 321028 331752 15060
13459b7960A40461b5858A31724J58218L8449A18540J56218N5813A57784J38792
13449B96576n4138G1241J66470G2247K67965A56612L5271Q214f0200B64907o6176
13438A98731L30265b2743A12590K52331A21687K1949O2068M2228A18002J29763
13428B47765K90858k66967k6982B6556J70576K42950A81648p9182J46819g742
13417B74283a20280k3841B00471l3801J5614J41964m9434j0835f1814F3938M43494
13406E07432B11519J64116q242D9421L62936j50581m3578H7366J09387L32414
13396E29167j79689q6789c27p0882H194c1711C01661A11163J98582A50542l3435
13385A17107L916M06214j27813k7045B0101K33007J10950L4529A66094o592R4120
$$ plain form
13459 -27960 140461 -25858 131724 289942 328391 118540 274758 330571 157784 296576
13449 296576 242438 71241 237711 72247 340212 156612 191883 200097 -60200 264907 198731
13438 198731 528996 -22743 112590 364921 121687 143636 205704 247932 118002 247765
13428 247765 538623 271656 244674 26556 197132 440082 181648 102466 249285 -7742
13417 274283 -120280 -144121 200471 166670 182284 324248 274814 263979 -61814 63938 507432
13406 507432 211519 375635 367393 49421 412357 261776 218198 87366 196753 529167
13396 529167 349478 262689 -327 -71209 8194 -31711 301661 111163 309745 150542 117107
13385 117107 121023 527237 399424 372379 20101 253108 364058 398587 166094 159502 253622
13374B53622L85667B86418M9300O1600j44268H4202K44405L4381A79087n8628
13364A20459m9983J78272I8911L87928j57792C1412m021J29848J87876a15761
13353D17158j72440f0605A72231B0953R9632C2561L23184F2809J01192J02098
13343B66099H0113M49329k08375K18782H5891J14355K73943j07914A00674J11712
13333B12386J90786A90360K6174K62862a99295C00090j5573o1445q2229g9623
13322D17211j42916M1653j0808p2954q0468m8792a9690A82405m9460j9411J63350
13311B76884j7902k8396J17127J59979j7333j66455j4537h3072l27133C93007
13300A35105L06730A72989q1381f7762C44708j26262i2879A49763J92799a09382
$$ plain form
13374 253622 639289 286418 335718 397318 253050 84202 328607 362988 179087 120459
13364 120459 70476 248748 98911 486839 329047 31412 27391 157239 345115 -115761
13353 417158 244718 -60605 172231 20953 120585 32561 355745 62809 164001 266099
13343 266099 80113 529442 321067 539849 85891 200246 474189 366275 100674 212386
13333 212386 403172 190360 216534 479396 -199295 300090 284517 223072 140843 -79623
13322 417211 274295 315948 305140 232186 151718 102926 -19690 182405 132945 113534 276884
13311 276884 258982 230586 347713 507692 490359 323904 309367 -83072 -410205 393007
13300 135105 441835 172989 91608 -67762 344708 218446 -92879 149763 342562 -109382
13289A13427k1052J75289I3377K04353a77176A88205l9236k1259m5238P1488K24303
13278C78263j70063A1733C580L06810b00389A84921i7180j4358C3787c3075m3739
13267g6814B67608a1815B67056o0962l3846G8988P7884b2326B49859p7784K64239
13256D36314j25171a43557B46514a54419O2058B23532a60397K9748A91482J53972
13246C45454j57928H9672L2444Q3821J08516d1617E7432a26970A10511e5576D7514
13234C29962b08492G693a42005e9954B94217l4370A26997k592K28598I423a63365
13222B63832D9107J57355d4425C33878A25564k4248o021L9763L004J50013E2620
13210b66628B75069A15663B4735d510B46622a96191A80050L1471q1653c5582C20585
$$ plain form
13289 113427 92375 267664 93377 297730 -177176 188205 148969 127710 82472 153960 378263
13278 378263 208200 11733 3580 310390 -200389 184921 -97180 -111538 33787 -33075 -76814
13267 -76814 267608 -11815 267056 206094 172248 78988 156872 -22326 249859 172075 436314
13256 436314 311143 -143557 246514 -154419 -92361 223532 -160397 -130649 191482 345454
13246 345454 187526 89672 122116 205937 314453 -41617 57432 -126970 110511 -55576 47514
13234 329962 -208492 7693 -142005 -59954 294217 259847 126997 124405 353003 9423 -163365
13222 263832 49107 206462 -44425 333878 125564 101316 95295 135058 138062 288075 52620
13210 -266628 275069 115663 24735 -4510 246622 -196191 180050 211521 129868 -35582 320585
13198G6158j7045a25735D9819b11096G3106K20390R9101j33839Q8495q0758q0182
13187A86313H1403c0261p5642H1287b63576A94052b45742H1347j7473j1061g031
13175A56966c07043C49031H2661a01075q8190d0366B02209G4758A0801L69188
13165C79989a6517D50509A52978m2646L1991g3332G252O7344K51513a87749C08928
13153f9587G7563J30974d9661A25850a28565B89399b51164F0645a63526A63723
13142D3210a5618H6342g3681B41465O5451a55624A76345k4902O5976p1359k5631
13131A20429Q8962G6206Q2064B7662R5873a24908q7700D19090c51262d5476p0907
13120a16383G69184a95655C5924J85009K13856f9988A58304a276I816J51229J05574
$$ plain form
13198 76158 59113 -125735 49819 -211096 73106 293496 392597 258758 347253 266495 186313
13187 186313 81403 -30261 -105903 81287 -263576 194052 -245742 81347 63874 52813 -7031
13175 156966 -307043 349031 82661 -101075 -189265 -40366 202209 74758 10801 379989
13165 379989 -16517 450509 152978 110332 142323 -73332 7252 74596 326109 -187749 308928
13153 -69587 77563 208537 -49661 125850 -128565 289399 -251164 60645 -163526 163723
13142 43210 -15618 86342 -73681 241465 306916 -155624 176345 151443 217419 146060 120429
13131 120429 209391 76206 158270 27662 123535 -124908 -212608 419090 -351262 -45476 -116383
13120 -116383 769184 -195655 35924 220933 434789 -69988 158304 -1276 9816 161045 266619
13109B66619h366C65248e3305B37622e1464I0837N9545k7876J10287D9277K39375
13098B88652A27916A7298N8454l4458J05240b66653F00876G6251d5680Q496j89806
13087b26990N7989E1233Q7029a88392H1533b17095J03775E86416A2530K30306
13077B42836c6375n0486C2779h1980B71108o7995A2120K07698d5129C27148P4971
13066D02119F1414J40682D7444K1807K18475m1273E5455P3240L7315k0925d5403
13054B70291f676A48300K5781N284d4577j12994B51094n1021c25281a41443B68918
13042A55342Q0135f8378q9976b9507j56246M9457C32813l8977j08136c6970j3886
13031e0856D9824j5524K54472a9115a510B3158a10954C81831g888B90397p7480
$$ plain form
13109 266619 -8366 365248 -53305 237622 -51464 90837 150382 122506 232793 49277 288652
13098 288652 127916 17298 75752 41294 146534 -266653 600876 76251 -45680 -37184 -226990
13087 -226990 -169001 51233 138262 -188392 81533 -217095 -113320 586416 12530 242836
13077 242836 -36375 -86861 32779 -81980 271108 203113 12120 219818 -45129 327148 402119
13066 402119 61414 202096 47444 69251 287726 246453 55455 128695 166010 145085 -45403
13054 270291 -6676 148300 174081 179365 -44577 -157571 251094 200073 -325281 -141443 268918
13042 155342 235477 -68378 -158354 -29507 -185753 -136296 332813 293836 185700 -36970 -50856
13031 -50856 49824 34300 288772 -19115 -1510 23158 -110954 381831 -7888 290397 212917
13020B12917q4331K16201D7771a3892A21061r937D8505J06284o8701P5845B7644
13008A53080K47278j99593K6535b6409I4549J13120F926a62976A25821L1354a31826
12996D68824b44444G1898k236j4493J08990n8598l6078A1021L13656a51744G0901
12984B32495q9285M9639N6819e0918C61247A38991C3198J1966J24619b704B25804
12972I0475Q196D2136A3045a55122J116O7548H9595O7082b96555E133M4081J42220
12960A91434a01105m2743L4031I0676g2211j93513A49330n047b46882a18046E1376
12948a14611A97372p972c39400a5541A09773M2507l8360e2854K816A44975c79354
12936b0180A24170a4647A52505C6666a36774l7970e6728B83065f3189a9328B23160
$$ plain form
13020 212917 128586 344787 47771 -13892 121061 111124 48505 154789 86088 161933 27644
13008 153080 400358 200765 227300 -26409 94549 207669 6926 -162976 125821 157175 -131826
12996 468824 -244444 71898 69662 55169 164159 105561 69483 11021 324677 -151744 70901
12984 232495 143210 192849 249668 -50918 361247 138991 33198 45164 169783 -2704 225804
12972 90475 98671 42136 13045 -155122 -154006 -86458 89595 156677 -296555 5133 49214 191434
12960 191434 -101105 -143848 -109817 90676 -72211 -265724 149330 144283 -246882 -118046 51376
12948 -114611 197372 189400 -339400 -15541 109773 152280 113920 -52854 -50038 144975 -379354
12936 -20180 124170 -14647 152505 36666 -136774 -174744 -56728 283065 -63189 -19328 223160
12924a95337h617I4711J53214G3088M5578A9465m182P3020b33937p6984a37555
12912B97488A13478a84381A82558J54742D983a2863C38593i8261A86849D0314
12901i9093A65537C8647h3753A97103a66659D4855k1657h7508B239M7803i42A51058
12888a27910H0012P4355a15404A84123g6456B33136b05613j95101D3654O2462
12878A06116J2998K33047b32114K4821A17241a51552B03584a77405N6800a3314
12867B66396F2596a96631A08942m6470a79914A34038j2138k8848A2956b81005
12856A39450D5793R109k4904O393K89613d8047a5472G639b55211l3097a07903
12844C16681A08031P0663j753o459J03088f2605D3620c2795E44005A18967b77089
$$ plain form
12924 -195337 -8617 94711 247925 73088 118666 19465 15283 88303 -233937 -310921 -137555
12912 297488 113478 -184381 182558 337300 4983 -12863 338593 -98261 186849 40314
12901 -99093 165537 38647 -83753 197103 -166659 44855 23198 -87508 2239 50042 -942 151058
12888 -127910 80012 154367 -115404 184123 -76456 233136 -205613 -400714 43654 106116
12878 106116 119114 352161 -232114 -207293 117241 -151552 203584 -177405 -120605 -13314
12867 266396 62596 -196631 108942 62472 -179914 134038 121900 93052 12956 -281005
12856 139450 45793 54902 29998 36391 326004 -48047 -15472 7639 -255211 -288308 -107903
12844 316681 108031 178694 176941 170482 273570 -62605 43620 -32795 544005 118967 -277089
12832A20640D622J87642p5183A5295a97938J046p8366J21082k3492A43590E1452
12820a22487b8493A18242a1151A21777a14723A04650a94434A03566K58834a39085
12809b42791q3219A40760j3272a02053b1937B98675a85810r016P1799D936J74497
12798A79433m6523F3595a59335g0099j6040j06229A34509e918A304d6465a4025
12786b9890j03475C2935J95007A5523g3537R049H0968f7771K3421A47230e625
12774A00914b11373B1695k811K48819D0580d836G1913a70527A88863c71501e9891
12762E7211J29831q7105a16856o5650e0862q3436D435J28192o1448b0766C9301
12750b01098B4221e3519m5660A04917j7130a35312H3066J44705a57599b4827B42353
$$ plain form
12832 120640 4622 192264 117081 15295 -197938 -196892 -275258 -154176 -177668 143590 51452
12820 -122487 -28493 118242 -11151 121777 -114723 104650 -194434 103566 362400 -139085
12809 -242791 -326010 140760 127488 -102053 -21937 298675 -185810 -194826 -123027 4936 179433
12798 179433 132910 63595 -159335 -70099 -86139 -192368 134509 -5918 1304 -46465 -14025
12786 -29890 -133365 32935 227942 15523 -73537 -64488 80968 -67771 -44350 147230 -5625
12774 100914 -211373 21695 18884 267703 40580 -4836 71913 -170527 188863 -371501 -59891
12762 57211 187042 99937 -116856 -182506 -50862 -134298 4435 132627 71179 -20766 39301
12750 -201098 24221 -53519 -99179 104917 87787 -135312 83066 227771 -157599 -24827 242353
12738F711a34169J6440A70039K4382J16770Q4902b3679A59338D0070L30005c6161
12726c2423D60336A28768J74667C9063N6342A9113N8443i7522b1641B03430a13297
12714A76009A4608K61533I0392J7879e2622A01413L44596a46348M9494D84025
12703B60872B2277K85185a38379n6041A90018l2599e5872E109K16188k7883a2200
12691A97614k8169R545q926E2052R5044O4918a92501C17885D5852O4784P7283
12680A87919B5376b246A03152K96805b60872B9173J92049F101a68576E9275K04985
12669B64260j15365l0350n8300a1980H6370a02880A96316D7729J53296K55623
12659D56648a5161D7054K85828N5168p1803a30154A72602d1632J4489A72302n5545
$$ plain form
12738 6711 -134169 -117729 170039 194421 311191 396093 -23679 159338 40070 370075 -36161
12726 -32423 460336 128768 303435 39063 95405 19113 77556 -97522 -21641 203430 -113297
12714 176009 14608 276141 90392 108271 -52622 101413 446009 -146348 -96854 484025
12703 260872 22277 307462 -138379 -194420 190018 157419 -55872 5109 221297 193414 -12200
12691 197614 169445 178990 170064 52052 147096 212014 -192501 317885 45852 110636 187919
12680 187919 25376 -2246 103152 399957 -260872 29173 221222 6101 -168576 59275 264260
12669 264260 148895 118545 60245 -11980 86370 -102880 196316 47729 201025 456648
12659 456648 -15161 47054 332882 388050 316247 -130154 172602 -41632 -27143 172302 116757
12648A16757j835n2861i9523A9927I558J75336b57847A90725I263J71724a46420
12636A28512J5239g2935E09323j05978r6547B5124N0495J19855e9321B48829k542
12625B46287G7121K50291j21212L3037b46631B65604C3624J849J97518g3410j36599
12614b10009o193A53206B9622J47693p5536D9778h3224A44120R0358d7755j66520
12603b14275A27270d6015G8144b30432B87502a20336c2766C80689F3950L7657
12593A01607K0996D3131J87921B8415K5593i1670m536d415B13250h1970B37341
12581a10241B47814a04291A77006k6534h3895F67678A6188Q330p881a91174a81
12569D8129a24438o5843A19393o093i1053K015A44955d3080B05960p7581b73793
$$ plain form
12648 116757 114922 62061 -99523 19927 9558 184894 -257847 190725 9263 180987 -146420
12636 128512 143751 -72935 509323 403345 306798 25124 75619 195474 -59321 248829 246287
12625 246287 77121 327412 206200 239237 -246631 265604 33624 35473 232991 -73410 -210009
12614 -210009 -216202 153206 29622 177315 101779 49778 -83224 144120 234478 -47755 -214275
12603 -214275 127270 -46015 78144 -230432 287502 -120336 -32766 380689 63950 101607
12593 101607 122603 43131 231052 28415 54008 -91670 -96206 -4415 213250 -81970 237341
12581 -110241 247814 -104291 177006 150472 -83895 667678 16188 24518 16637 -191174 -181
12569 48129 -124438 -190281 119393 113300 -91053 -89038 144955 -43080 205960 128379 -273793
12557A06336b12890J02568A07392h6248A96305p5447B1915F794e8904l6604j35676
12546b31184R7294c9857J3592A45573c48179J25179A2993b8551C0745J07686h0691
12534A34382H353J30865J14011d3331k06472C58332f5942l1022A61308k0930M9579
12523A89957J01496H4289h3446H0275K41833d8952h600B36248G2037e1176I0529
12511F4591Q0444a89071b0977n2391A03239Q2462a12833B54615a71420j41679
12501c13099f6127B00119k9506j7409D7242a38324A09822a63602A06612a05999
12490a4243G1190b1790A85624a14451D1854d5847C24555I1828a73432A8171e7795
12478C42259D5812b84382P2384A11510c8705A01613K14901a2920A30417J01682
$$ plain form
12557 106336 -212890 -110322 107392 -86248 196305 120858 21915 6794 -58904 -95508 -231184
12546 -231184 -133890 -39857 -26265 145573 -348179 -223000 12993 -28551 30745 138431 -80691
12534 134382 8353 139218 253229 -43331 -249803 358332 -65942 -96964 161308 140378 189957
12523 189957 291453 84289 -83446 80275 322108 -48952 -8600 236248 72037 -51176 90529
12511 64591 145035 -189071 -20977 -73368 103239 185701 -112833 254615 -171420 -313099
12501 -313099 -66127 200119 170613 153204 47242 -138324 109822 -163602 106612 -105999
12490 -14243 71190 -21790 185624 -114451 41854 -45847 324555 91828 -173432 18171 -57795
12478 342259 45812 -284382 -211998 111510 -38705 101613 316514 -12920 130417 232099
12468B32099E9805K1574J21973a22094j40088L5542A72280g1392q0363K3779j45739
12457b73715C59846a35614B97780d10990e4817j31149A38111L0195a0570D1949
12446a19911K7508l62247A67145J6152n3442a04282K0097j19304R7737J7811d267
12434g8225A67455a78050M7772B25447o2038K00483b25145O8642g1456l18514
12424c89970e3972k47063R4856E2767j607R0671I011a76549F288b02792Q3022
12413a19770d7278D3660Q7184n8471K31630g2134n2055I560g3958G998Q4178i1276
12400g0145D7986A9316K8934E433a64370O0759A19922e9942q4141c3026l1404
12389f4430H3937b6920j38538A2632J14203B2833J36796e0866j62202A00438b14396
$$ plain form
12468 232099 59805 81379 203352 -122094 -262182 -226640 172280 -71392 -151755 -127976 -273715
12457 -273715 359846 -135614 297780 -410990 -54817 -185966 138111 168306 -10570 41949
12446 -119911 -92403 -454650 167145 183297 129855 -104282 -84185 -203489 -105752 -87941 -4267
12434 -78225 167455 -178050 -130278 225447 163409 363892 -225145 -156503 -71456 -389970
12424 -389970 -53972 -301035 -206179 52767 51160 141831 9011 -176549 6288 -202792 -119770
12413 -119770 -47278 43660 130844 72373 304003 -72134 -124189 9560 -73958 7998 92176 -91276
12400 -70145 47986 19316 48250 5433 -164370 -103611 119922 -59942 -144083 -33026 -64430
12389 -64430 83937 -26920 -165458 12632 126835 22833 159629 -50866 -213068 100438 -214396
12377A1297J93376c226A64444a52507F0253B1174b5676C4791g6095B49945b2047
12365A44596f0693D20000B07942G8640b91750m928A25186M1894a30983c1435A43255
12353B2076i0461E2450a32784N6562B1554N2710b34084C0011J46423a30805m4727
12342a75532e2793I9009g0907A67536o5768J01705b44352a9544k9750E717i2333
12330a73451b2469C6603R4917h1787C28486j41127c59506A78021J174a20461A21996
12318f5863A46203a75561j99400a24172C6862f1038I691C041b10080m0715D6320
12306A17486k5960J14375r4865K17230E9742g1015J0712m1911B10989D2159b68418
12294A01634O1675c65697a43274r217B1638J20571a40555A87214J0857j4365p0020
$$ plain form
12377 11297 204673 -3226 164444 -152507 60253 21174 -25676 34791 -76095 249945 -22047
12365 144596 -60693 420000 207942 78640 -291750 -296678 125186 167080 -130983 -31435 143255
12353 22076 -90461 52450 -132784 -76222 21554 74264 -234084 30011 176434 -130805 -175532
12342 -175532 -52793 99009 -70907 167536 101768 203473 -244352 -19544 -49294 5717 -92333
12330 -173451 -22469 36603 131520 -81787 328486 187359 -359506 178021 179195 -120461 121996
12318 -65863 146203 -175561 -374961 -124172 36862 -61038 9691 3041 -210080 -250795 46320
12306 117486 91526 205901 111036 328266 59742 -71015 -60303 -102214 210989 42159 -268418
12294 101634 163309 -365697 -143274 -152491 21638 142209 -140555 187214 198071 183706 113686
12283A13686M5670m2615b07079B14118E2899J30083C1059L51864e4494C45193
12272A59014f6544B44834p0738F5145g7608a7534B4608L95177a07811E0963b04986
12260f3893B13150A6528L27123a09557b9829d550A94214E4216P6916J042m0624
12249I1550N9573C8355M9254k1535A1536K65045A8530K17377F0024L04080b52022
12237b12635B25187J25537b46609K9895B0849K28091A2585K43459l2391j00865
12227A22788K51588j66177q7673L61770E5110J08277j9627K26163j40949n0614
12217A78360J12538j436f171B75542M2950j07820H5551J88932q5556O566Q1769
12206B77262a39628D75119E9207J16493F3830a35606B14141J98500I6605K21077
$$ plain form
12283 113686 159356 116741 -207079 214118 52899 182982 31059 382923 -54494 345193
12272 159014 -66544 244834 174096 65145 -77608 -17534 24608 419785 -107811 50963 -204986
12260 -63893 213150 16528 343651 -109557 -29829 -4550 194214 54216 131132 132174 91550
12249 91550 151123 38355 87609 66074 11536 276581 18530 235907 60024 364104 -252022
12237 -212635 225187 350724 -246609 -216714 20849 248940 12585 256044 223653 122788
12227 122788 374376 208199 120526 482296 55110 163387 143760 369923 228974 178360
12217 178360 290898 289462 -6171 275542 318492 210672 85551 274483 188927 195493 277262
12206 277262 -139628 475119 59207 175700 63830 -135606 214141 412641 96605 317682
12196C17682O226d067p7164F7031Q7883E829K26105p9016L30434e4823E071J32717
12184A37788o2376B4806a50211A08232f843A23352b43878A59456K0087o9868L1041
12173A40716l5051A3769L9529K03879I4187J35370Q1813j39073e2361D20013c9644
12161c1529A99307q1789j7093J9346K74321c24679A85471G6783c5742j55176d392
12149d2285H1327J48986d733k32846g5161c1216j16758q7900F4114a02341k44196
12138c46537B0119K1467J28521F9709f7063j5993A27518R7771E0622a22550j29794
12127b52344G2182a96414H5279K272f2092J4148A65624c4927A05754M0574n6213
12116I0115a87232B82631a04640h336E8667J18364a40555I4666b72512D4063J23469
$$ plain form
12196 317682 323908 -4067 -81231 67031 154914 5829 231934 152918 483352 -54823 5071 137788
12184 137788 75412 24806 -150211 108232 -6843 123352 -243878 159456 179543 109675 140716
12173 140716 105665 13769 53298 257177 94187 229557 311370 172297 -52361 420013 -39644
12161 -31529 199307 117518 100425 119771 394092 -324679 185471 76783 -35742 -190918 -4392
12149 -42285 81327 230313 -4733 -237579 -75161 -31216 -147974 -235874 64114 -102341 -346537
12138 -346537 20119 41586 170107 69709 -67063 -83056 127518 225289 50622 -122550 -252344
12127 -252344 72182 -196414 85279 87551 -62092 -47944 165624 -34927 105754 146328 90115
12116 90115 -187232 282631 -104640 -8336 58667 177031 -140555 94666 -272512 44063 167532
12105A67532a75281h5118C09096H2028b82480B56131a84937K58j63216G0385a96997
12093E6521P0231c68061a71940D629J57964o067d5026I5893K4770P2065a63115
12081A32807J03933N01190P85836k14022D23889r9608d2768G5723g3744A85441
12070A57286o0378J01446b21138a246m5248J3493G0086K69518a39615J2137K9282
12059i8196B92860b99821j14986a66269j18830A49240K0070D0578c60816G9175
12048c1038m1303E0860i2545C5965n93j1085g5958j50630d5977b1128G9834H043
12035a82518i619A71582m1456J9860N0031b6594E5740J34679c1201j36771k813
12024a70785B62869g6825q5490b7193B05283b5431q9978A74193h500A5571f9560
$$ plain form
12105 167532 -175281 -85118 309096 82028 -282480 256131 -184937 -184679 -347895 70385 -196997
12093 56521 126752 -368061 -171940 4629 162593 156526 -45026 95893 120663 192728 -163115
12081 132807 236740 737930 1523766 1309744 423889 324281 -42768 75723 -73744 185441
12070 157286 96908 198354 -221138 -1246 -46494 -33001 70086 339604 -139615 -127478 -98196
12059 -98196 292860 -299821 -414807 -166269 -285099 149240 169310 40578 -360816 79175
12048 -31038 -72341 50860 -92545 35965 35372 24287 -75958 -226588 -45977 -21128 79834 8043
12035 -182518 -9619 171582 130126 149986 200017 -26594 55740 190419 -31201 -167972 -170785
12024 -170785 262869 -76825 -162315 -27193 205283 -25431 -115409 174193 -8500 15571 -69560
12012a72037C2030K79390r7740a6834f162A5660c32590a9480C63731d7991B0974
12000g95I5197O2397a97279k1316M4493c6305A45703f5133J9740C59369a74815
11988a16309A46274K10285E153a62630A05885J16695b18527I4781N9462E2171
11977D17879D8226i90A08380a62296L8855H9378a10071D05990d0092D22025e1532
11965G2769b2866k19904D1902N2928b42362A61448n7783L9195L1021H4528c27792
11953A18994A0746Q1356J9135a16469H3286I799N1776K26016a75074O7724o4000
11942a71350A98995a86291h8355A69105F6469L6723j6798b16465A46953a49209
11931b76228a28842H1088c7748k84741J53596e9045j30086C80809A22910d281
$$ plain form
12012 -172037 32030 311420 213680 -16834 -6162 15660 -332590 -19480 363731 -47991 20974
12000 -795 95197 157594 -197279 -218595 -174102 -36305 145703 -65133 -45393 359369 -174815
11988 -116309 146274 356559 5153 -162630 105885 222580 -218527 94781 154243 52171
11977 417879 48226 -990 108380 -162296 -123441 89378 -110071 405990 -40092 422025 -51532
11965 72769 -22866 -242770 41902 94830 -242362 161448 103665 142860 173881 84528 -327792
11953 118994 10746 92102 111237 -116469 83286 9799 61575 287591 -175074 -107350 -171350
11942 -171350 198995 -186291 -88355 169105 66469 103192 86394 -216465 146953 -149209
11931 -276228 -128842 81088 -37748 -322489 -168893 -59045 -189131 380809 122910 -4281
11920a77215C60394F3683B7691e5785I1662b4248D5208k194b8014j7589k77879
11909c23482h5746c4222l28234B32864c5186j32763A4756b69214M9167a04460
11898B8121L7123O5713J25589e5230A23257a11867A02381a4213G6137b05671O2348
11887a43323A44048b48774Q782R6523B94551g5872G5887J9379L9155b97234a46426
11875b24218B33998h3700d1693B2243M6911k1631h3302C21082B2969K49034c0900
11863a98979A48183p1090c89675H7522C4824a64418k0163j81271C11315A28087
11852C25626b25030c0586B7341J34068B5398c248A52205a41228F9354J74145a33749
11840A08423R0661b6759G4280J77419G8499e479o4580B35219c734B0196b73144
$$ plain form
11920 -177215 360394 63683 27691 -55785 91662 -24248 45208 43014 -28014 -45603 -323482
11909 -323482 -85746 -34222 -362456 232864 -35186 -167949 14756 -269214 -220047 -104460
11898 28121 65244 130957 256546 -55230 123257 -111867 102381 -14213 76137 -205671 -143323
11887 -143323 144048 -248774 -239992 -143469 294551 -75872 75887 95266 134421 -297234 -146426
11875 -224218 233998 -83700 -41693 22243 69154 47523 -83302 321082 22969 272003 -30900
11863 -198979 148183 77093 -389675 87522 34824 -164418 -184581 -365852 311315 128087
11852 325626 -225030 -30586 27341 161409 25398 -3248 152205 -141228 69354 243499 -133749
11840 108423 199084 -26759 74280 251699 78499 -5479 -70059 235219 -3734 20196 -273144
11828D5520a49593a9460j77185d6817h939n6921J9765I6392b78388B3255c4367
11816h6560D1659i6043B45800f1821b1351B42008I5114d3272N755k86390J19301
11805b04606n8959J5064F9843i9975A34257P984a656j1217l0328G8799Q1059j9988
11793A39870a10830N4770j22862p835A47513b65638J24534K627B2047c11434e2528
11781C9437J9683g184D6505b07601C36232f6446B32035a67258D3968b15818C0509
11769a70481o6081c7750j67249l3102j72009C6861J713K5486c0812E0540a94298
11757A59358J9403b29082B03474i2405r9381A21477a49894L0498A4050O4866P4978
11746A53894J60252a53942e0349d415D9480j5705J8383f5272p3287m466C90775
$$ plain form
11828 45520 -149593 -19460 -196645 -46817 -8939 -65860 -46095 96392 -278388 23255 -34367
11816 -86560 41659 -96043 245800 -61821 -21351 242008 95114 -43272 -37517 -323907 -204606
11805 -204606 -263565 -248501 69843 -99975 134257 142241 -1656 -12873 -43201 78799 159858 139870
11793 139870 -110830 -56060 -178922 -186757 147513 -265638 -141104 -138477 22047 -311434 -52528
11781 39437 59120 -7184 46505 -207601 336232 -66446 232035 -167258 43968 -215818 30509
11769 -170481 -236562 -37750 -204999 -238101 -410110 36861 38574 64060 -30812 50540 -194298
11757 159358 178761 -229082 203474 -92405 -191786 121477 -149894 -119396 14050 78916 153894
11746 153894 314146 -153942 -50349 -4415 49480 33775 52158 -65272 -138559 -143025 390775
11734f1526j51191c718A23441D7879a08628P985B63583j19480b71118A84503a22378
11722b39767R5830D07244b20151A53463j9429b92819B85730A9049e0586C03307
11711d797j9686k49531B8264a12822A24878Q6262a27622F7864J35114G9345b8714
11699A56003L4686C9581M1116O8133a26554I8356a97568A31578a95988A66456
11688b71543A444c19489E6150k7052L59747D0903J87569k5750C0812b65460N9157
11677b06303B3185K17795K33600c83971a67899D6919b0831k10209L8132A21343
11666e5826H0685a19432D485f6943A05379J17982a74659D14880i2548j73151G7544
11654G8753e8384a5151C51096a4451j85320D4031L61330j34530o8250A5608M23517
$$ plain form
11734 -61526 -212717 -3718 123441 47879 -108628 -100643 263583 144103 -271118 184503 -122378
11722 -239767 -143937 407244 -220151 153463 134034 -292819 285730 19049 -50586 303307
11711 -4797 -24483 -274014 28264 -112822 124878 211140 -127622 67864 202978 79345 -28714
11699 156003 190689 39581 80697 148830 -126554 98356 -197568 131578 -195988 166456
11688 -271543 1444 -319489 56150 29098 388845 40903 228472 202722 30812 -265460 -206303
11677 -206303 23185 240980 474580 -383971 -167899 46919 -20831 -231040 -192908 121343
11666 -55826 80685 -119432 4485 -66943 105379 223361 -174659 414880 -92548 -265699 77544
11654 78753 -58384 -15151 351096 -14451 -199771 44031 405361 270831 202581 15608 439125
11643D39125A38563B425L7200J86060p3621c11425a50267m330B2001L1299c31196
11631a65537A09511J29819G040a19374E0730c11606L1669J31915N9315k01377
11621b90084A00619d6578D7092h8186n1657A05132B0659a2917D7538b62459i471
11609g6475c5954G2698c03512B16177r4428k6432A2023b31364B43797a23349A76532
11597A01174m4419a51443B13007q1964L3479F0091c74201B68565a7149A69589
11586C25193e0707j62438A4479d34799a44802m1778A0614J01441D3507j4491L64678
11575C93694A13204k792E1811K14318g4375C1605L40423j11200g1223j06771K3637
11564a54357B14701A5958N3896d3633o6373A37083e2507p3331C61576C0626a34396
$$ plain form
11643 439125 138563 2425 39625 225685 152064 -311425 -150267 -154597 22001 53300 -331196
11631 -165537 109511 239330 7040 -119374 50730 -311606 -279937 -148022 -88707 -290084
11621 -290084 100619 -46578 47092 -88186 -139843 105132 20659 -12917 47538 -262459 -9471
11609 -76475 -35954 72698 -303512 216177 121749 95317 12023 -231364 243797 -123349 176532
11597 101174 56755 -151443 213007 131043 164522 60091 -374201 268565 -17149 169589
11586 325193 -50707 -213145 14479 -434799 -144802 -186580 10614 112055 43507 29016 393694
11575 393694 113204 110412 51811 266129 -74375 31605 372028 260828 -71223 -177994 -154357
11564 -154357 214701 15958 69854 -43633 -110006 137083 -52507 -125838 361576 30626 -134396
11552a50360D5579f3452A63626f8988E1456K8199A605J58877l0249a18674D0048
11540a59002D00341j71110e5543J7463D72084p7347j37495J44450c07972C40713
11529e2299A83885b0218j00851A46231h0678n4212j15829A16321m1835p26K32322
11518C06082f8732B25073h8356C6520M7902P1854n6702j9168N6244J3820c0375
11506A00511l3201c6828F9700J91780n3516H4178a23268n2293A64406E8330b03448
11494E4698B2374K18199E4593j2717a4564j59272A49943n3343J32990f666A7341
11482a3622C12199a5352A61400M7294l2016Q8603K5915p3421P2450c6475p368
11471d3843B6432a27725D51182B569N9743L15443j56071p1314L0652g2358j14366
$$ plain form
11552 -150360 45579 -63452 163626 -68988 51456 79655 1605 160482 130233 -118674 40048
11540 -159002 400341 229231 -55543 -38080 472084 394737 257242 401692 -307972 340713
11529 -52299 183885 -20218 -121069 146231 -80678 -134890 -250719 116321 74486 73760 306082
11518 306082 -68732 225073 -88356 36520 84422 156276 99574 80406 136650 150470 -30375
11506 100511 67310 -36828 69700 261480 207964 84178 -123268 -175561 164406 58330 -203448
11494 54698 22374 240573 54593 41876 -14564 -173836 149943 96600 229590 -6666 17341
11482 -13622 312199 -15352 161400 208694 176678 265281 291196 217775 290225 -36475 -43843
11471 -43843 26432 -127725 451182 2569 62312 377755 221684 150370 181022 -72358 -186724
11460a86724d3293j67932H6018N1979N190e2173k4238C04509j7380M4582b3927
11448e7673b4753k4757j28422j54602A58499D6423N2359J10437J71371a49662
11437A53941a30439B95395A01171a25959D2676q601g5480p4168n9741A87386e1742
11425D1364f2631k8676o8265A09211a32190C2660a13974A01601a42876e4937j9990
11414g4927A45637C1041h337m4417A32714C9156a3345j82192R5967D88606i9074
11402D06673c40146D2294R910L4051f8559h288A10096Q3562c71631b8311D8957
11390d2551m6456c5862A28570P1370f0877A58925R0172E3232L0286J5919a82958
11378C928a85416j07948Q7072e2630j91006A81520J59596b1303r0834I7356N1844
$$ plain form
11460 -186724 -43293 -211225 86018 137997 143187 -52173 -76411 304509 287129 331711 -23927
11448 -57673 -24753 -49510 -177932 -332534 158499 46423 98782 209219 380590 -149662
11437 153941 -130439 295395 101171 -125959 42676 34075 -75480 -149648 -209389 187386 -51742
11425 41364 -62631 -91307 -159572 109211 -132190 32660 -113974 101601 -142876 -54937 -74927
11414 -74927 145637 31041 -8337 -52754 132714 39156 -13345 -195537 -99570 488606 -99074
11402 406673 -340146 42294 52204 86255 -68559 -8288 110096 193658 -371631 -28311 48957
11390 -42551 -89007 -35862 128570 199940 -60877 158925 249097 53232 83518 99437 -182958
11378 3928 -185416 -293364 -206292 -52630 -243636 181520 341116 -21303 -112137 97356 149200
11367A49200n2655J65780G8357d2003B18316b14169l6509A79997g2902k17495
11357b90397C9943c4188A04193b92637P249B72178k4382D2884G272J56497a0244
11345a75100E7741i8417I8167J82761j20180a65430P8546k30858Q085C28551A26298
11333B56938E3340a65673M1817j35658A27186h16m1342B11258b7625j01307f1172
11321a05200C46186a84243F0025l984f549l59641a52683j77210C05483d078o7697
11310g1775I6088a61643k09735a0435H7426b14459M9811j44878F1207a36867d1158
11298a3483j75945H2849Q8200b48838F6547d2510j07415A08690K520B773a44213
11286I7127i0825A03823a11316j09316G095J67249p2652A0935c5806G4755a3146
$$ plain form
11367 149200 96545 262325 78357 -42003 218316 -214169 -250678 179997 -72902 -290397
11357 -290397 39943 -34188 104193 -292637 -285388 272178 247796 42884 7272 163769 -10244
11345 -175100 57741 -98417 98167 280928 160748 -165430 -86884 -317742 -309657 328551 126298
11333 256938 53340 -165673 -123856 -259514 127186 -816 -42158 211258 -27625 -128932 -61172
11321 -105200 346186 -184243 60025 56041 -6549 -366190 -152683 -329893 305483 -4078 -71775
11310 -71775 96088 -161643 -371378 -10435 87426 -214459 -164648 -309526 61207 -136867 -41158
11298 -13483 -189428 82849 171049 -248838 66547 -42510 -149925 108690 111210 2773 -144213
11286 97127 -90825 103823 -111316 -220632 7095 174344 101692 10935 -35806 74755 -13146
11274a83759G5202c74572r963A65511d0019k21651a18203j03260k9616P6756j47090
11263c21413A24693a71912A06881d07299C8422a84926l5195J05412e6602l5635
11253i2237a1653k17869f4647F0926J66228b10708A15416f507F4966e8876I1541
11241b01012f0608B2368g0802k6412k445K8567H596a76777C3498b48866A17203
11229E3380C0K75477b20081a05737A56982a76854b2746j68717A01943c0976p657
11218c8633I4727A6287a13059B1967a76130A02430a25730A3401J58328B1517a22702
11206a02535H1826b5661A9507c1938O571j20977f1272q3214d1361m5505n9033
11195a45899o4068o755A87881a07176l4716F5098j1607i9891B58903b28967B49740
$$ plain form
11274 -183759 75202 -374572 -384535 165511 -40019 -261670 -118203 -221463 -251079 -174323 -321413
11263 -321413 124693 -171912 106881 -407299 38422 -184926 -220121 -114709 -56602 -92237
11253 -92237 -11653 -229522 -64647 60926 227154 -210708 115416 -6507 64966 -58876 91541
11241 -201012 -60608 22368 -70802 -97214 -99659 -71092 8596 -176777 33498 -248866 117203
11229 53380 30 275507 -220081 -105737 156982 -176854 -22746 -191463 101943 -30976 -38633
11218 -38633 94727 16287 -113059 21967 -176130 102430 -125730 13401 171729 21517 -122702
11206 -102535 81826 -25661 19507 -31938 -25367 -146344 -61272 -144486 -41361 -86866 -145899
11195 -145899 -209967 -216722 187881 -107176 -141892 65098 53491 -99891 258903 -228967 249740
11183b51491N6840j671B46709A8603K27844e7235j92036b3231m2894o0334P275
11172a19184e3620k78632h531B6774L13155H892J12926j3135M7505b6546C46612
11160a7186j68099p7583G3874a93114F6626K50879A34569f6188A39278a11473
11149a72777d2366A29954b16612d6808D2315f0836I0490c04202a28800I9710k9737
11138F9973D292N8463M8907a05561D89290A29153m643l3063a17599A80446H0946
11126A54501b95183H6873e4838G6475K13923b09924D0404d845B42563l9050h7332
11114b19494I4162a61284n4320B7352b59384O5687C32560j59791J19551j24556
11104A67764J20242a15022G9332J25036Q1382D9472k1282l505L74358I6186P1421
$$ plain form
11183 -251491 -194651 -196322 246709 18603 246447 -57235 -249271 -23231 -66125 -126459 -119184
11172 -119184 -53620 -332252 -8531 26774 339929 8892 121818 108683 156188 -26546 346612
11160 -17186 -185285 -262868 73874 -193114 66626 317505 134569 -66188 139278 -111473
11149 -172777 -42366 129954 -216612 -46808 42315 -60836 90490 -304202 -128800 99710 69973
11138 69973 4292 62755 111662 -105561 489290 129153 124510 91447 -117599 180446 80946
11126 154501 -295183 86873 -54838 76475 290398 -209924 40404 -4845 242563 203513 -87332
11114 -219494 94162 -161284 -215604 27352 -259384 -193697 332560 172769 292320 167764
11104 167764 288006 -115022 79332 204368 285750 49472 28190 24685 399043 96186 167607
11093A67607k6426A6216L26022A68933c6258B300J2232K02385I1464J24996J18730
11082C35190b9470B01313H6967J25846M6477A23934P9549P9546a85797C19982
11071C51227j51291K76896A24530O58023C3096L50088A48795J31582J77592K1254
11061D79223J50774J38998C69749M6687j87748Q1521J43923o855M41286j26065
11051G62498l01271j41298K70046p3745J62517J5401r7390j62666J54348k0762
11041E67678R6722M8897j88635j77276M52901k3306j06857j52323J50947j60969
11031E07779J30906m732l15966K80048L72239o5993k09510A95290K18503J75386
11021E89179B81881J54342j69158M83907q3804j42860K21144k65728J18693B83104
$$ plain form
11093 167607 141181 16216 342238 168933 -36258 2300 14532 216917 91464 216460 335190
11082 335190 -29470 201313 86967 212813 259290 123934 203483 283029 -185797 319982
11071 351227 199936 476832 124530 782553 33096 383184 148795 280377 457969 479223
11061 479223 629997 768995 369749 416436 228688 310209 454132 447277 888563 762498
11051 762498 461227 319929 589975 516230 678747 694148 596758 434092 588440 567678
11041 567678 664400 713297 524662 347386 800287 776981 670124 517801 668748 507779
11031 507779 638685 633953 317987 598035 970274 904281 694771 195290 413793 589179
11021 589179 281881 436223 267065 750972 667168 524308 745452 479724 598417 283104
11010D32184R6042M295K39748j88722j56137L58143o978C15414K96318j26048
11000D85684K56619j46024j5072j17804J75709Q92J95223l11469K21125k19211
10990E25672J19034K84483m9245j70450j13161M48765k27853J03176J64602N4934
10980A139957Q0943P2102K84003N2966K23637J05072j45456M8574L50163n111
10970B206850j06449R6977j09526K659m39923k69641O5392l68553J10396J23693
10960A311875J57095r901r0608O7502j21320J21177o825k73014m2209k35362l08467
10949E69943J37190o4017p9818j95735R4684j66585J46601r2999E1576K44835
10939B96411j08369Q5944J2983o4668F4341Q7168d3280A45051b24369C77375E3667
$$ plain form
11010 432184 528226 532521 772269 583547 427410 785553 778575 315414 611732 485684
11000 485684 742303 596279 581207 463403 639112 640004 835227 523758 744883 525672
10990 525672 644706 929189 879944 709494 596333 1045098 817245 920421 1085023 1139957
10980 1139957 1220900 1293002 1577005 1629971 1853608 1958680 1813224 1861798 2211961 2206850
10970 2206850 2100401 2197378 2087852 2090511 1650588 1380947 1446339 1077786 1188182 1311875
10960 1311875 1468970 1459069 1368461 1435963 1314643 1435820 1428995 1155981 1113772 878410 569943
10949 569943 707133 643116 563298 367563 462247 295662 442263 349264 51576 296411
10939 296411 188042 273986 286969 222301 64341 151509 -43280 145051 -224369 377375 53667
10927A24711K41366d3864O791j71699A66314C0268Q7629a87305r7021C2430K9152
10916F1582a29786j57048A08286c3380A31459f013j10500j26411A23894c6673
10905b6017A93215a02135A17230J9629a30608A48941k6748d3666j99780B118J81313
10894A83431b9143k08257d8857A2722O6353O6844q616b05400a7254l3626I0078
10882A69632J56594b6892j50819j39626A97153a80454A08071b31980A40907E5540
10871b84271B3688a22636a5847D3471b34394D05526a38732D44976a79462e1263
10860g74k57065I990O0832c39302e5616F9500c59756J28389j99640a57032M9989
10849a07043A97252K242h7532J8962j20281D1009a79056m9297b2760j30641n6485
$$ plain form
10927 124711 366077 -43864 -37073 -208772 166314 30268 117897 -187305 -284326 32430 61582
10916 61582 -129786 -286834 108286 -33380 131459 -6013 -116513 -242924 123894 -36673
10905 -26017 193215 -102135 117230 136859 -130608 148941 122193 -43666 -243446 2118 183431
10894 183431 -29143 -237400 -48857 12722 79075 145919 137303 -205400 -17254 -50880 90078
10882 169632 326226 -26892 -177711 -317337 197153 -180454 108071 -231980 140907 55540
10871 -284271 23688 -122636 -15847 43471 -234394 405526 -138732 444976 -179462 -51263
10860 -774 -257839 9990 70822 -339302 -55616 69500 -359756 -231367 -431007 -157032 -107043
10849 -107043 197252 199494 -87532 -68570 -188851 41009 -179056 -228353 -22760 -153401 -209886
10838b09886B38565c360A38946N7214C2252d5127j54647h2282F5534o92L58330
10827D23172d496k47540J06280O1611M0125j21211B11792o1794a64754D1743J9493
10816F1236K5467d8926B68699b5503j60948A25091E4189b87979J32238q5768e3609
10804A86062p1039J06812J47266d4185A67581A9553b30905A38365g8998c9054
10793i9520k2691j53360D6438a23486r0360B44343a17273o139m8708P266F3045
10781B10239F9345J29009c137l8865C2446a96533K13c3647B0079c98932a388l18076
10769c19464I9214B354d3699J1753j03118b1460o6269I7393a07413j51986N3280
10758b06119B50854a97715n8673k49120I2257q773b33226G0132b5860B6776J9618
$$ plain form
10838 -209886 238565 -3360 138946 196160 32252 -45127 -199774 -82282 65534 64842 423172
10827 423172 -4496 -252036 -145756 -84145 -44020 -165231 211792 149998 -164754 41743 61236
10816 61236 86703 -48926 268699 -25503 -186451 125091 54189 -287979 -155741 -241509 -53609
10804 186062 115023 221835 369101 -44185 167581 19553 -230905 138365 -78998 -39054
10793 -99520 -122211 -275571 46438 -123486 -213846 244343 -117273 -123412 -172120 -164854 63045
10781 210239 69345 198354 -3137 -42002 32446 -196533 -196320 -33647 20079 -398932 -1388 -319464
10769 -319464 99214 2354 -43699 -31946 -135064 -21460 -87729 97393 -107413 -259399 -206119
10758 -206119 250854 -197715 -256388 -505508 92257 83484 -233226 70132 -25860 26776 46394
10747D6394a2275j70950M1039a7459q438D05412c65464Q2963j38160B48163H0594
10735A69094K1131a08284a3957C03783A2464a97584M5850a272j1234F6483b16819
10723A36355g3153C52701c15877A78124o6839K27216l0305A48444a51655C1480
10712D5956h3123j0512A81931C9184d8923k84423E8422b97555J46051H5541d4983
10700a36793j37549f8922j56443K3227I001J57345c2556k21002a15987C85243
10689F3623B9707a05420B6602J52826b47322a007A02650i2229j90068o9486B80982
10677c37332A60861c94108C65845A62572D8012k3121L493O9521b37226N3277Q4211
10666i9738j06756C1423a85249n7439j0777J05479n4131e6329q3886d9471J3523
$$ plain form
10747 46394 -12275 -183225 -142186 -17459 -25897 405412 -365464 -282501 -420661 248163 80594
10735 169094 190225 -108284 -13957 303783 12464 -197584 -151734 -1272 -12506 66483 -216819
10723 136355 -73153 352701 -315877 178124 111285 338501 308196 148444 -151655 31480
10712 45956 -83123 -93635 181931 39184 -48923 -333346 58422 -297555 -151504 85541 -44983
10700 -136793 -274342 -68922 -225365 -202138 9001 166346 -32556 -253558 -115987 385243
10689 63623 29707 -105420 26602 179428 -247322 -1007 102650 -92229 -282297 -351783 280982
10677 -337332 160861 -394108 365845 162572 48012 24891 28384 97905 -237226 -183949 -99738
10666 -99738 -206494 31423 -185249 -242688 -253465 -147986 -202117 -56329 -140215 -49471 -35948
10655c5948A2523a71709h0743o4076A8372b35146c3233A83036E6606a60293l0777
10644a91070j06075D07302j70268A08972a83686A78554m3313c5033r5242j5652
10634a45927b3324k68833A34447D3184d5222j41705B33866a62108k52365a24435
10623a99246E4840f1497j48287r3937B5363d9344j607k06241k35534A31822a33271
10611a70568j1050F1434P5793a87190B84591n1109h4982J0596r8043D2310H713
10599c79261B29616a56157c2778C6635Q7829h4963o621k7630A54718a39859A44409
10587h8469p6278B17206a20147A23697J15330J26191A23147a16262D4112K88263
10577C32375e66640A76964a35719k1133j76626J51557Q1697C8735a09466D16138
$$ plain form
10655 -35948 12523 -171709 -80743 -144819 18372 -235146 -33233 183036 56606 -160293 -191070
10644 -191070 -297145 407302 237034 108972 -183686 178554 135241 -35033 -130275 -145927
10634 -145927 -23324 -292157 134447 43184 -45222 -186927 233866 -162108 -414473 -124435
10623 -199246 54840 -61497 -209784 -303721 25363 -49344 -50951 -257192 -492726 131822 -133271
10611 -170568 -181618 61434 137227 -187190 284591 233482 -84982 -74386 -172429 42310 8713
10599 -379261 229616 -156157 -32778 36635 124464 -84963 -91584 -119214 154718 -139859 144409
10587 -88469 -164747 217206 -120147 123697 239027 365218 123147 -116262 44112 332375
10577 332375 -566640 176964 -135719 -156852 -333478 -181921 -100224 38735 -109466 416138
10566e6768j26418H8900K07302M7528A60191k3260b26719C5755J65137a60134
10555d6455D4278e4884j29584g8486n8088j72177g4059j00240F4770j348k066
10544F1356a56923I545J62837a35633j12025D7811J30126a9427r1913A63359i1169
10532a95503M4352a584k14157j50658o0110J74744L8096m3929B22061H8273L1238
10521A19511B9283L7660a874j82185B80142a7581g939F9959e5404C0498J24723
10510A55221a66825F5714F276b37743G9946a20159e9901l1970j60839j2325M7813
10499b17222l3364l0180q2972f8016A35165a23920e1521R777B06275g3146j37681
10488b10827C5987a05021G9849Q4506a42988A21112Q0464C9528M56744j73437
$$ plain form
10566 -56768 -183186 88900 296202 343730 160191 136931 -226719 35755 200892 -160134
10555 -46455 44278 -54884 -184468 -78486 -136574 -308751 -74059 -174299 64770 63422 61356
10544 61356 -156923 9545 172382 -135633 -247658 47811 177937 -19427 -111340 163359 -91169
10532 -195503 -151151 -1584 -215741 -366399 -426509 -251765 -213669 -257598 222061 88273 119511
10521 119511 29283 66943 -1874 -184059 280142 -17581 -7939 69959 -55404 30498 155221
10510 155221 -166825 65714 6276 -237743 79946 -120159 -59901 -91871 -252710 -265035 -217222
10499 -217222 -250586 -280766 -363738 -68016 135165 -123920 -51521 -41744 206275 -73146 -210827
10488 -210827 35987 -105021 79849 164355 -142988 121112 201576 39528 496272 322835
10478C22835A49130c12208B65098b30468I899R5785P4042H9398g8471L0985B49825
10466B16815I8640D4685i0831B00558f8873A34877L3447k00i0203j88316a2020
10454a25868a8216H8695a10154C64720a39468J5877p3103G4640K20067g9618Q745
10443g0873B27009h4049j96L0852l0172B87970j1658A24535a91599A35271h8171
10431i624l46646J44210d3102M140j33824H3148j1529a04447l33548A26841B9438
10419b7370j08746H9996a82237A30507J7736l02K2268e0845C3229K81864h5510
10407A069a69433c8755A4803h9448j60971P0728A75405k1091o8031C4172L33876
10396C68048c472B238b85919Q466b3262A05352c189C71182A60896C1218g4597
$$ plain form
10478 322835 149130 -312208 265098 -230468 9899 105684 179726 89398 -78471 -47486 249825
10466 216815 98640 44685 -90831 200558 -68873 134877 168324 168124 -90203 -278519 -12020
10454 -125868 -18216 88695 -110154 364720 -139468 -123591 -196694 74640 294707 -79618 -70873
10443 -70873 227009 -84049 -84245 -53393 -83565 287970 276312 124535 -191599 135271 -88171
10431 -9624 -356270 -212060 -43102 -38962 -172786 83148 71619 -104447 -437995 126841 29438
10419 -27370 -136116 89996 -182237 130507 148243 147941 170209 -50845 33229 315093 -85510
10407 1069 -169433 -38755 14803 -89448 -250419 -179691 175405 154314 86283 34172 368048
10396 368048 -3472 2238 -285919 -277453 -23262 105352 -3189 371182 160896 31218 -74597
10384B76931l800H9548o235R2046G3329i7852B14420a2610B61093j03989a04117
10372B54261O5598F3982Q9510M1245N4378M13577A56912R4650K36340j64531J65057
10361D88428I5481K57807J86007B08342q1392J13890K9324A28899k4476K23668
10351C28091k2901K89J52645B14213b0201H7806M8148L02539j56523p1887K10399
10340D20482A80118K87679O1639D4645c0549l87359C11565D4852K89121a16472
10329B28372F6128j9064h221B53943p0486N7936a2184k79C36987a46715C67620
10317A0733J72563J74745C9535J36630b51896b9694j07857o9257R3254A88107
10306B95512b14163A28990l1175b90533R3838n6120A65805b73179R9862k0787
$$ plain form
10384 276931 273131 89548 83313 175359 73329 -97852 214420 -12610 261093 157104 -104117
10372 254261 319859 63982 153492 194737 249115 662692 156912 251562 487902 323371 488428
10361 488428 95481 353288 539295 208342 126950 240840 270164 128899 104423 328091
10351 328091 305190 305479 458124 214213 -20201 87806 135954 438493 281970 210083 420482
10340 420482 180118 467797 529436 44645 -30549 -417908 311565 44852 333973 -116472
10329 228372 66128 47064 -8221 253943 183457 241393 -12184 -12463 336987 -146715 367620
10317 10733 183296 358041 39535 176165 -251896 -29694 -137551 -206808 -113554 188107
10306 295512 -214163 128990 97815 -290533 -196695 -252815 165805 -273179 -173317 -194104
10296a94104E483J12057a17211j1476H651k050L8620K8614a93677A05603g3684
10284c89801H7082a43344A79720N7200H2480a8532j38945A78972p1580c56394
10273i7075n2449j24499b1160C17034a90191A6634g4817B00629b20048C04609
10262D10952q3311A28141J42691I5229k1829c2528B06574H0328c9618k11755D6418
10250B20881a54518q5727Q535E638a83881j48553C4845K29543d027D6037A2628
10238b08574j17096A8249b9953E4821b28272G5096K7145a72471P6773j0447r2400
10227a98545B03401K8295b32381A58781g7594L4277G3059a08462c5919j90373
10217b26292M3672E0315b68168O2535E7606J25244D4324g9577j17865N6964D6407
$$ plain form
10296 -194104 5483 117540 -117211 -128687 8651 6601 45221 73835 -193677 105603 -73684
10284 -389801 87082 -143344 179720 236920 82480 -18532 -157477 178972 107392 -356394
10273 -97075 -149524 -274023 -21160 317034 -190191 16634 -74817 200629 -220048 304609
10262 410952 327641 128141 270832 95229 73400 -32528 206574 80328 -39618 -251373 46418
10250 220881 -154518 -240245 -231710 5638 -183881 -332434 34845 264388 -4027 46037 12628
10238 -208574 -325670 18249 -29953 54821 -228272 75096 102241 -172471 -95698 -106145 -198545
10227 -198545 203401 231696 -232381 158781 -77594 -43317 73059 -108462 -35919 -226292
10217 -226292 -182620 50315 -268168 -205633 57606 182850 44324 -79577 -197442 -140478 46407
10205D6583a11191A33160J52059n2661a0625j93924R9499B6700a36549B4845g7877
10193d61459B89948b96994B63421j23554g3101M2F6407J72463b17269m3172M3634
10182b16807j54410P5041e8980J7209A67471a2598n3976k21039a37939d0395r453
10171d9848A44354o5093J738Q042J43204b96395D8152g3183j29151j07408C33
10159b61795N1893A4583a56689A78939b26683K1979b485A42797b21999B39443
10148A89655i7156k71339B37764a40687b7824k24367N5164j21848f4367o4511
10138a28878j15661B61024b65261D0214a43984d5016j8268F423b31096I198f5297
10126b24543L3366B24460f2955l17887A43527b49586C0671M8706J30084r9988
$$ plain form
10205 46583 -111191 133160 285219 232558 -10625 -204549 -105050 26700 -136549 24845 -77877
10193 -461459 289948 -296994 263421 139867 -73101 -73059 66407 238870 -217269 -260441 -216807
10182 -216807 -371217 -296176 -58980 -41771 167471 -12598 -66574 -287613 -137939 -40395 -49848
10171 -49848 144354 79261 80999 89041 232245 -296395 48152 -73183 -202334 -309742 333
10159 -261795 -209902 14583 -156689 178939 -226683 -204704 -2485 142797 -221999 239443
10148 189655 -97156 -368495 237764 -140687 -27824 -252191 -197027 -318875 -64367 -128878
10138 -128878 -244539 261024 -265261 40214 -143984 -45016 -63284 6423 -231096 9198 -65297
10126 -224543 -191177 224460 -62955 -380842 143527 -249586 30671 79377 209461 109473
10116A09473J55460a48986N9121F0656a42598j75100B91588H780i8097k86878
10106c84975i2247I3051c8614a8062q8888K6045j70000a05018B0784c94600A06393
10094b24183B05566J25324f6071j17541B81838D5143d8874m6151B86972A37919
10083a51981A0729a61386d0286j61202Q2384b936A9874c54123I6352c1377m7493
10072g8870A08580a20411e2532A914f5838r7562A72282A5594M6090J48733a88248
10060g3725j51416A98216b1620r1601b8666o6154A71809c3800M758n7102C9563
10048a33676N9004j99863j12731a75022M7907H0084a85054r1598B5113c7712B28999
10036a89701D484J47742b47436B02985a44043k65126i1939o9951M6317j28912
$$ plain form
10116 109473 264933 -148986 -89865 60656 -142598 -317698 291588 8780 -98097 -384975
10106 -384975 -92247 93051 -38614 -18062 -106950 -80905 -250905 -105018 20784 -394600 106393
10094 -224183 205566 330890 -66071 -183612 281838 45143 -48874 -95025 286972 137919
10083 -151981 10729 -161386 -40286 -201488 -119104 -2936 19874 -354123 96352 -31377 -78870
10072 -78870 108580 -120411 -52532 1914 -65838 -163400 172282 15594 61684 210417 -188248
10060 -73725 -225141 198216 -21620 -113221 -28666 -94820 171809 -33800 -29042 -86144 39563
10048 -133676 -74672 -274535 -387266 -175022 -127115 80084 -185054 -276652 25113 -37712 228999
10036 -189701 4484 152226 -247436 202985 -144043 -409169 -91939 -161890 -115573 -244485
10026b44485A56214b47849m8938i1914A57703h8809E7684e3870A23731d99393
10015a6853E5437d2136k51744g0420B02907b74176A588d9160j14352D4033J51394
10004A95427J11706f3982o8802l6424b8014r1002l4306G3940d0215j26058C03843
9992b17315C8379b67509B408c22549A9530O2080N336b43539D770J9596a04989
9980a99388h0448c2998A11505N6470a28051B5483c43048a58506j99262a031H5841
9968b53157Q5418e4517A58359a27813E5749b5263r3376A34325m5225a14060k6628
9957a40688O2271c6486a1473r5379A8342f1278J0972l4984F7947a33010l8875
9946a71885l9209j9330E3901a19380J6821L7706j87059D97748B11319d9082j37084
$$ plain form
10026 -244485 156214 -247849 -296787 -91914 157703 -88809 57684 -53870 123731 -499393
10015 -16853 55437 -42136 -293880 -70420 202907 -274176 1588 -49160 -163512 44033 195427
10004 195427 307133 -63982 -132784 -169208 -28014 -119016 -153322 73940 -40215 -166273 303843
9992 -217315 38379 -267509 2408 -322549 19530 81610 86946 -243539 4770 24366 -104989
9980 -199388 -80448 -32998 111505 167975 -128051 25483 -343048 -158506 -357768 -1031 85841
9968 -253157 -167739 -54517 158359 -127813 55749 -25263 -118639 134325 89100 -114060 -140688
9957 -140688 -78417 -36486 -11473 -106852 18342 -61278 -50306 -85290 67947 -133010 -171885
9946 -171885 -211094 -230424 53901 -119380 -102559 -64853 -251912 497748 211319 -49082 -186166
9935a86166A5645J50831b05581a8721p937j60414n9880A80791C5530c7306j86371
9924b23677a08859a6285j46337O7767j14311B2399a59228E1513k41a13013I5667
9912b96977J41220f0490j03539j5069A12628h7564j14263g8485B82950b00170
9901a0043k31299f8176k35248d2857I3602c79596J56921O6682B09119a95401A20981
9889e5619j45414A33692a50038B22995b70463d3609j8731j71730D3680a2784B9590
9877a66356A00054D8015i5853j41328N2586B81587a03580G9486I604h3003B06345
9865A2706c23464E3630c07960d7157C74081a71055P6672k39298A27511j8214a38175
9853a01291A54318l4415B4046j0287a02999j97467P4066h5399B83350B1487i0530
$$ plain form
9935 -186166 15645 166476 -205581 -18721 -26658 -187072 -246952 180791 35530 -37306 -223677
9924 -223677 -108859 -16285 -162622 -94855 -209166 22399 -159228 51513 51272 -113013 95667
9912 -296977 -155757 -60490 -164029 -179098 112628 -87564 -201827 -78485 282950 -200170
9901 -10043 -241342 -68176 -303424 -42857 93602 -379596 -222675 -155993 209119 -195401 120981
9889 -55619 -201033 133692 -150038 222995 -270463 -43609 -62340 -234070 43680 -12784 29590
9877 -166356 100054 48015 -95853 -237181 -184595 281587 -103580 79486 9604 -83003 206345
9865 12706 -323464 53630 -307960 -47157 374081 -171055 -94383 -333681 127511 109297 -138175
9853 -101291 154318 119903 24046 13759 -102999 -300466 -226400 -85399 283350 21487 -90530
9841C190K9307R3562n747a34120B8475L24636f6118r6415j23490g6308J1760k0711
9829h5259j45723A05642A3428C516O5411d12018a03836k45943E0528b8692j80647
9818b09339A9972c9976J1679D31695B0876b58165a23791A483b66917a01197l08498
9807d09695A93143a61576A02630h1978I6314i4975o5429g7521F3252a80213A66211
9795b89372F6598j0447b94085A53407k5870a85128o5600A63434f7420H04J66972
9784A67776a73147e9370r9801f5241k30201J45489J9640l9705m6109j37037f1986
9772E9212i4319c0057N572j08829n4806o1868B6277J21815P863c57071A72209
9760d7486p1501I1600h408o2022B16854L4402e03662e700j53826m0912g6680A93714
$$ plain form
9841 3190 32497 126059 120312 -134120 28475 353111 -66118 -162533 -286023 -76308 -64548 -85259
9829 -85259 -230982 105642 13428 3516 68927 -412018 -103836 -349779 50528 -28692 -209339
9818 -209339 19972 -39976 -28297 431695 20876 -258165 -123791 1483 -266917 -101197 -409695
9807 -409695 193143 -161576 102630 -81978 96314 -94975 -160404 -77521 63252 -180213 166211
9795 -289372 66598 56151 -294085 153407 127537 -185128 -250728 163434 -67420 804 167776
9784 167776 -173147 -59370 -159171 -65241 -295442 -149953 -130313 -170018 -216127 -353164 -61986
9772 59212 -94319 -30057 -24485 -133314 -188120 -249988 26277 148092 155955 -357071 172209
9760 -47486 -118987 91600 -8408 -70430 216854 251256 -503662 -5700 -159526 -200438 -76680 193714
9747H8752f2281B99444D8502a56368c7082F1138N3107d8825A32832e1591k7103
9736g8694p4778N5764j63121f7710B2330N3095b20040M730C3697b78345K6327
9725b52018A7035a23704b8080J1740l84945a4653j30965a6303I583a57196N1337
9714a05859a2803A35121a03114j13632M3678K4114b7154j70033I5452b52425b0527
9702e4546D9770a41382B90715a17113b3513o7079q7309G2169c55608a18166F5846
9690a79298H3001d4039I0736a7444l28606R0894B51104C3579Q630c4927k54819
9679b89746k9709a22125D9213O0891b96660R6138B1323b05500A7516L1014L34919
9668C83449a93303I316L58320a43531G8205p104c7122p215A50681n5204D4986
$$ plain form
9747 88752 -62281 299444 48502 -156368 -37082 61138 114245 -48825 132832 -51591 -78694
9736 -78694 -153472 -97708 -260829 -67710 22330 75425 -220040 -215310 33697 -278345 -252018
9725 -252018 17035 -123704 -28080 -16340 -401285 -14653 -145618 -16303 9583 -157196 -105859
9714 -105859 -12803 135121 -103114 -216746 -173068 -148954 -27154 -197187 95452 -252425 -20527
9702 -54546 49770 -141382 290715 -117113 -23513 -90592 -177901 72169 -355608 -118166 65846
9690 -179298 83001 -44039 90736 -17444 -346050 -255156 251104 33579 42209 -34927 -289746
9679 -289746 -319455 -122125 49213 110104 -296660 -200522 21323 -205500 17516 48530 383449
9668 383449 -193303 9316 367636 -143531 78205 71101 -37122 -44337 150681 95477 44986
9656a0731k31296A95108e4292j24843I3297R0460b28135B00673g3132J2359j88854
9645b49627c5939g611k57689a08073a9906j25264A0664a84783f3361C37837i9318
9633c29608g3613j09879r828j49607D2387b24450A20972A0793g170B8254a30700
9621b41940F10J60423L714O6012b4815j6619B117a80834e9585H2140b09818A23581
9608G8831a33232A98179E0225a89303i0897A05384e81821a4325n5088p1515C2006
9596a92507D0458N0421K65656b26241B09434d9602k76212D48414c8722j20705
9586a59427J0286E373a14580M9942k35138J5468D4840J2744J66398B0517d254
9574a34819b9590l82926a73756c2698B27370a13083m2487H5508l9327b75558i1568
$$ plain form
9656 -10731 -242027 195108 -54292 -179135 93297 183757 -228135 200673 -73132 -60773 -249627
9645 -249627 -35939 -7611 -265300 -108073 -19906 -145170 10664 -184783 -63361 337837 -99318
9633 -329608 -73613 -183492 -193320 -342927 42387 -224450 120972 10793 -7170 28254 -130700
9621 -241940 610 161033 164747 230759 -24815 -41434 2117 -180834 -59585 82140 -209818 123581
9608 78831 -133232 198179 50225 -189303 -90897 105384 -581821 -14325 -69413 -140928 32006
9596 -192507 40458 90879 356535 -226241 209434 -49602 -325814 448414 -38722 -159427
9586 -159427 -149141 5373 -114580 -64638 -299776 -284308 44840 57584 223982 20517 -4254
9574 -134819 -29590 -412516 -173756 -32698 227370 -113083 -155570 85508 46181 -275558 -91568
9562a57598k39853c6175l7312C88319f8722E7987b06731B8127K63301H6116b08339
9550d74898a69560D01595f1407l38235a9969j59376C64724a17620J5529j33666
9540b35757a06824j82505a12412o2854p7871G154d6713j6484B7145a23564I8556
9528B49049a2979B0619P259c84174a49237A09504a05538r5693i7463A3690a36376
9516c78386f5078A245b39340Q0358o090B77601A04685J47403c44301e281k90j01574
9504a07145o4111C33412A14916i5477M3579n7499j30558J04091O2730A37308A4977
9492a70830j49242a50424b3173l20093J69801f9381A49939o3566J26653I6091
9481e4920a3237k75540B49514A12328b96497a01081A49669b33113l7615L6153
$$ plain form
9562 -157598 -397451 -36175 -73487 388319 -68722 57987 -206731 28127 291428 86116 -208339
9550 -474898 -169560 401595 -61407 -399642 -19969 -179345 364724 -117620 -102091 -235757
9540 -235757 -106824 -289329 -112412 -175266 -253137 7154 -46713 -63197 27145 -123564 98556
9528 249049 -12979 20619 27878 -384174 -149237 109504 -105538 -201231 -97463 13690 -136376
9516 -378386 -65078 1245 -239340 -158982 -165072 277601 104685 252088 -344301 -5281 -5571 -107145
9504 -107145 -171256 333412 114916 -95477 -51898 -109397 -239955 -135864 -73134 137308 14977
9492 -170830 -320072 -150424 -23173 -343266 -173465 -69381 149939 86373 213026 96091
9481 -54920 -13237 -288777 249514 112328 -296497 -101081 149669 -233113 -270728 -234575
9471b34575d7691A48299k8904f8970j27851j0067h7338F1870a78253A78969p0131
9460A08838b24127A29668E7590a31638C79554A57202E7254J50752j2237p987j2361
9449A75421G5480P4800M0426e4117A54150b51666B03830b43813A80033H0589c46149
9437b39475C30448D0761d66120a63707A30156c00721e8998j86704A85423m6140
9427A39283a82953m7851c2964C16476e7449B5689A2087e5554b4019l26669c9056
9415b67544E7225a73267C3013c12310B4019c6170k5390j78574E5952R6145K32854
9404C84951D1627b45525a16034A20247b02111k69333B47538a36710a6738j09800
9394a26538j49140c2098C35661a19133q4263o8750G8444c78349B29206C726J34824
$$ plain form
9471 -234575 -47691 148299 119395 -68970 -196821 -206888 -87338 61870 -178253 178969 108838
9460 108838 -224127 129668 57590 -131638 379554 157202 57254 208006 195769 187782 175421
9449 175421 75480 150280 190706 -54117 154150 -251666 203830 -243813 180033 80589 -346149
9437 -239475 330448 40761 -466120 -163707 130156 -300721 -58998 -245702 185423 139283
9427 139283 -182953 -230804 -32964 316476 -57449 25689 12087 -55554 -24019 -350688 -39056
9415 -267544 57225 -173267 33013 -312310 24019 -36170 -61560 -240134 55952 152097 384951
9404 384951 41627 -245525 -116034 120247 -202111 -471444 247538 -136710 -16738 -126538
9394 -126538 -275678 -32098 335661 -119133 -203396 -272146 78444 -378349 229206 3726 138550
9383A38550a57834d4538j74374l1626D1707J86280i1817A19527B8302b53484R9228
9372a54256C762a25864j45713c1918f368j52330A59858E6970b38132R4682C03929
9360A3652b97331A18559a80336A34415n4742J65215i3607L9822l00599A16345
9349f9431r3028C33443b71495m2668a53245j23111A31375a18775a4450r526B59609
9337H9704j4562J13990J51623b55932e588B70699a11193A4951f5958G3150h5683
9325c05576p6777F3014P6293b4623A05006G38J98901b66786I893J00833f5621
9313A31220n410b55913f0385k11994a14791A97602b38892D1442a9281B13060H6788
9301b40421P0887B8287a09484p0659A55275J94962H4965M7005b28796B7713a23065
$$ plain form
9383 138550 -157834 -44538 -218912 -250538 41707 227987 -91817 119527 28302 -253484 -154256
9372 -154256 3762 -125864 -271577 -31918 -6368 -158698 159858 56970 -238132 -143450 303929
9360 13652 -297331 118559 -180336 134415 79673 244888 -93607 -53785 -354384 116345
9349 -69431 -162459 333443 -271495 -314163 -153245 -276356 131375 -118775 -14450 -23976 259609
9337 89704 75142 189132 340755 -255932 -5588 270699 -111193 14951 -65958 73150 -85683
9325 -305576 -382353 63014 139307 -24623 105006 738 199639 -266786 9893 110726 -65621
9313 131220 125810 -255913 -60385 -272379 -114791 197602 -238892 41442 -19281 213060 86788
9301 -240421 -169534 28287 -109484 -180143 155275 350237 84965 131970 -228796 27713 -123065
9289A158b06920B4082K7574i6924A08116b90922j8631J43816M4219A29669f8981
9277a10200B48497j05159r713e5137k21387c0619l5182n9234B63347E6677b54960
9265A03989a02949k07314M5953B04166a43499J3141D2401A0881c54254g1163j6736
9254h7899A67026i5601l40858d0320A44251j3984b91442e2541A65913a86712A78361
9242H1892a07028j46267O4876P5323l58856A57848f1183J6738p1110a0612A68746
9230I5770d0217m412j99120g6162j05785a8371n6628b7064o2979j74740A12143
9218c75041A07225L5734h3637D2030P636d37872i8273b9181k86033R5547q5306
9207c04973A16617A7616R8028a30585a7250F6806a32092l36248D3193a37537n4769
$$ plain form
9289 1158 -206920 24082 51656 -96924 108116 -290922 -309553 -165737 -121518 129669 -68981
9277 -110200 248497 143338 133625 -55137 -276524 -30619 -65801 -125035 263347 56677 -254960
9265 103989 -102949 -310263 -264310 204166 -143499 -130358 42401 10881 -354254 -71163 -87899
9254 -87899 167026 -95601 -436459 -40320 144251 130267 -291442 -52541 165913 -186712 178361
9242 81892 -107028 -253295 -188419 -113096 -471952 157848 -61183 -44445 -115555 -10612 168746
9230 95770 -40217 -44629 -243749 -76162 -181947 -18371 -74999 -27064 -90043 -264783 112143
9218 -375041 107225 142959 -83637 42030 49666 -437872 -98273 -29181 -315214 -219667 -304973
9207 -304973 116617 17616 115644 -130585 -17250 66806 -132092 -468340 43193 -137537 -192306
9196a92306P297f4208l34581A7429a03410j8448D803a29476f0268k2737J542n1615
9184a33078f4631B52775b06205k0728B38274g7432A07424N4366a53926A87965
9173A61327a92587Q7093j16414B21368C0626M2776J13605i0494j6968k08346J24829
9162a90979B5857a91922Q3694j08616A49595a21585M7433B90095A12798b35644
9151c6824F8485h3119F2419J24751e4559G358d80136I8407C0534P8183n0364a76442
9138f2117k88843J39700P3053c8402k41127J17863p240q8285O8504N0626e6556
9126A98719J16156b02381C1691a62592B53124M8290j077d9243k66061j80650K33516
9115b62438A11739P5861b36296B11819D2781N2547b89777J10898n8609a1843p5355
$$ plain form
9196 -192306 -185009 -64208 -398789 17429 -103410 -121858 4803 -129476 -60268 -83005 -81463 -133078
9184 -133078 -64631 252775 -206205 -226933 238274 -77432 107424 161790 -153926 187965
9173 161327 -192587 -105494 -221908 221368 30626 73402 187007 -90494 -107462 -315808 -190979
9162 -190979 25857 -191922 -108228 -216844 149595 -121585 -74152 290095 112798 -235644
9151 -36824 68485 -83119 62419 187170 -54559 7358 -480136 98407 30534 108717 58353 -176442
9138 -62117 -350960 -211260 -138207 -38402 -279529 -161666 -168906 -257191 -188687 -138061 -56556
9126 198719 314875 -202381 31691 -162592 253124 301414 300337 -49243 -315304 -495954 -262438
9115 -262438 111739 187600 -236296 211819 42781 95328 -289777 -178879 -237488 -11843 -87198
9104h7198j42956b6048l01421Q3255f5669j07478b1674E8601c51170a50975j23367
9093b74342j2864B08401i2666c3596j20357j04112b5286C0821E203P7824a77912
9081A54428Q1550a4200k31562A94620p8094A1573b64626i7059j05336O7932k0193
9070a54656j778E33339b16726a02052C58297P6098A35298o0737d86835A68653
9059b679A62539F2063e05912g2339K6505J438j09948l2483N955n1655M0777l768
9047a95518B13273B5282L51i5426d5284k13405g3934m090G1768c4095I3319J04377
9035A97696d5214k70507A78359l8436l3050m2028J62107b30510a04738C8954J8467
9024E7421b22125b5724p4237k8148k45708J06168J2526n121a26883k51038a13740
$$ plain form
9104 -87198 -230154 -26048 -327469 -244214 -65669 -173147 -21674 58601 -351170 -150975 -274342
9093 -274342 -287206 208401 -92666 -33596 -153953 -258065 -25286 30821 5203 83027 -177912
9081 154428 235978 -14200 -245762 194620 116526 11573 -264626 -97059 -202395 -134463 -154656
9070 -154656 -156434 533339 -216726 -102052 358297 434395 135298 74561 -486835 168653
9059 -2679 162539 62063 -505912 -72339 -45834 -44396 -154344 -186827 -180872 -232527 -191750 -195518
9047 -195518 213273 25282 25633 -95426 -45284 -258689 -73934 -78024 71768 -34095 93319 197696
9035 197696 -45214 -315721 178359 139923 106873 64845 226952 -230510 -104738 38954 57421
9024 57421 -222125 -25724 -99961 -128109 -373817 -267649 -255123 -260244 -126883 -377921 -113740
9012a33090G4239b7360A23392c8688j82959m4747D6709b00211Q9343r4672B47123
9000A0085b41568H3777d9018B16902a45061D5656a39704A7926a97510A69528b2465
8988c54137A29125E3609i3208b6355j5596A67701f1090j44099B8286J00738c8682
8976e815n9317H6868q350n377a6969C7437b15920j23176a34283l2403B24396L4617
8964B59013D7237G5a31134A39560b1880j41365B15251R3461a05985B04810a38074
8952D9245J11835a72120d0359j47534B52579d5160j0058A38147J56858a06404
8941c09916d4213k66235B25075J29123a14268B12469p8341f3219B61152J60576
8931D21728j21295R8354K1345A36211L93344J78823O68050P18818J752905M790618
$$ plain form
9012 -133090 74239 -27360 123392 -38688 -221647 -266394 46709 -200211 -110868 -205540 247123
9000 10085 -241568 83777 -49018 216902 -145061 45656 -139704 17926 -197510 169528 -22465
8988 -354137 129125 53609 -93208 -26355 -41951 167701 -61090 -205189 28286 129024 -38682
8976 -5815 -65132 86868 78518 73141 -16969 37437 -215920 -339096 -134283 -166686 224396 259013
8964 259013 47237 75 -131134 139560 -21880 -163245 215251 308712 -105985 204810 -138074
8952 49245 161080 -172120 -40359 -187893 252579 -45160 -55218 138147 295005 -106404
8941 -309916 -44213 -310448 225075 354198 -114268 212469 134128 -63219 261152 421728
8931 421728 300433 398787 420132 136211 529555 708378 1376428 2095246 3848151 8638769
8921H638769k392729C068473j435648F07298p7156A73364J11038K32615D6185
8911A91523K09362f9957j31066A93704j9709C6985K66848b08478A14391a57808
8900E4212L6838B3227P7815a55492k49662g1502J1554B14023J47775A70192e7104
8888b98763A04666C0758a54713l14345B35950p7536p569a05965E0924A3921a8859
8876f2902o9118A71246j4456a10460p6533B42262c5453A85828R5074e7486E0268
$$ plain form
8921 8638769 6246040 3068473 1632825 607298 530142 173364 284402 517017 46185
8911 191523 400885 -69957 -201023 193704 173995 36985 303833 -208478 114391 -157808
8900 54212 91050 23227 101042 -155492 -405154 -71502 -59948 214023 361798 170192 -57104
8888 -298763 104666 30758 -154713 -469058 235950 158414 150845 -105965 50924 13921 -18859
8876 -62902 -132020 171246 156790 -110460 -186993 242262 -35453 185828 280902 -57486 50268
$$ [...]
##END NTUPLES=NMR SPECTRUM
##END=
