
##TITLE=AC1356_CPIAH12175_6945563_JRe93f0Dzk
##JCAMPDX= 6.0         $$ Bruker NMR JCAMP-DX V2.0
##DATA TYPE= NMR SPECTRUM
##DATA CLASS= NTUPLES
##ORIGIN= BRUKER
##OWNER= Administrator
$$ 1.72 TOPSPIN		Version 2.1
$$ 2012-10-23 13:27:33.127 -0700  Administrator@X
$$ Compression mode = diff/dup
##.OBSERVE FREQUENCY= 400.02188249412
##.OBSERVE NUCLEUS= ^1H
##.ACQUISITION MODE= SIMULTANEOUS (DQD)
##.ACQUISITION SCHEME= undefined
##.AVERAGES= 64
##.DIGITISER RES= 22
##SPECTROMETER/DATA SYSTEM= spect
##.PULSE SEQUENCE= noesygpps1d.comp
##.SOLVENT NAME= COFFEE_meoh
##.SHIFT REFERENCE= INTERNAL, COFFEE_meoh, 1, 14.96078
##AUDIT TRAIL= $$ (NUMBER, WHEN, WHO, WHERE, PROCESS, VERSION, WHAT)
$$ ##TITLE= Audit trail, TOPSPIN		Version 2.1
$$ ##JCAMPDX= 5.01
$$ ##ORIGIN= Bruker BioSpin GmbH
$$ ##OWNER= Administrator
$$ $$ C:\Bruker\TOPSPIN/data/COFFEE/nmr/AC1356_CPIAH12175_6945563_JRe93f0Dzk/12/pdata/1/auditp.txt
$$ ##AUDIT TRAIL=  $$ (NUMBER, WHEN, WHO, WHERE, PROCESS, VERSION, WHAT)
(   1,<2012-10-13 21:51:48.671 -0500>,<Administrator>,<TOPSPIN>,<go>,<TOPSPIN 2.1>,
      <created by zg
	started at 2012-10-13 21:40:17.984 -0500,
	POWCHK enabled, PULCHK disabled,
       configuration hash MD5:
       6B 1B 68 BB D9 2E 58 E2 7F 35 AD 54 07 DF 0E 41
       data hash MD5: 64K
       BE 83 18 C4 D7 EB 84 98 29 73 65 2D E9 E7 EB D1>)
(   2,<2012-10-13 21:51:51.406 -0500>,<Administrator>,<TOPSPIN>,<proc1d>,<TOPSPIN 2.1>,
      <Start of raw data processing
       efp LB = 0.3 FT_mod = 6 PKNL = 1 PHC0 = 0 PHC1 = 0 SI = 128K 
       data hash MD5: 128K
       05 7C 9C 5B 78 AF 2D E1 24 B6 F9 54 14 99 26 C6>)
(   3,<2012-10-13 21:51:52.546 -0500>,<Administrator>,<TOPSPIN>,<proc1d>,<TOPSPIN 2.1>,
      <pk PHC0 = 5.097656 PHC1 = 0 
       data hash MD5: 128K
       81 B6 E8 89 3A F3 8D 72 E4 92 96 4A 20 F4 91 DF>)
(   4,<2012-10-13 21:51:52.781 -0500>,<Administrator>,<TOPSPIN>,<proc1d>,<TOPSPIN 2.1>,
      <abs ABSG = 1 
       data hash MD5: 128K
       80 F9 F7 A8 4C E4 05 03 18 03 EE 19 C2 D9 B2 A3>)
(   5,<2012-10-13 21:51:52.859 -0500>,<Administrator>,<TOPSPIN>,<proc1d>,<TOPSPIN 2.1>,
      <abs ABSG = 2 
       data hash MD5: 128K
       A9 2F 2B A3 B0 40 41 44 DE 36 2D BB ED 62 7B DF>)
(   6,<2012-10-13 21:51:53.062 -0500>,<Administrator>,<TOPSPIN>,<proc1d>,<TOPSPIN 2.1>,
      <abs ABSG = 3 
       data hash MD5: 128K
       7B 63 3F 4E DA DD 8C B4 07 83 B4 4F 5E B0 66 23>)
(   7,<2012-10-13 21:51:53.140 -0500>,<Administrator>,<TOPSPIN>,<proc1d>,<TOPSPIN 2.1>,
      <abs ABSG = 4 
       data hash MD5: 128K
       7F 74 1F F3 C9 84 C1 0C 7D B0 4A A1 1C 04 B7 D3>)
(   8,<2012-10-13 21:51:53.203 -0500>,<Administrator>,<TOPSPIN>,<proc1d>,<TOPSPIN 2.1>,
      <abs ABSG = 5 
       data hash MD5: 128K
       FE AB 97 68 11 B9 4F BF E8 33 0A F1 6E 71 50 B7>)
(   9,<2012-10-13 21:51:53.484 -0500>,<Administrator>,<TOPSPIN>,<audit>,<TOPSPIN 2.1>,
      <user comment:
       ICON-NMR User ID: COFFEE
       data hash MD5: 128K
$$ [...]
##$TP07= 0
##$TPNAME0= <>
##$TPNAME1= <>
##$TPNAME2= <>
##$TPNAME3= <>
##$TPNAME4= <>
##$TPNAME5= <>
##$TPNAME6= <>
##$TPNAME7= <>
##$TPOAL= (0..7)
0.5 0.5 0.5 0.5 0.5 0.5 0.5 0.5
##$TPOFFS= (0..7)
0 0 0 0 0 0 0 0
##$TUNHIN= 0
##$TUNHOUT= 0
##$TUNXOUT= 0
##$USERA1= <user>
##$USERA2= <user>
##$USERA3= <user>
##$USERA4= <user>
##$USERA5= <user>
##$V9= 5
##$VALIST= <valist>
##$VCLIST= <CCCCCCCCCCCCCCC>
##$VD= 0
##$VDLIST= <DDDDDDDDDDDDDDD>
##$VPLIST= <PPPPPPPPPPPPPPP>
##$VTLIST= <TTTTTTTTTTTTTTT>
##$WBST= 2048
##$WBSW= 25
##$XGAIN= (0..3)
0 0 0 0
##$XL= 0
##$YL= 0
##$YMAX_a= 12435248
##$YMIN_a= -8835534
##$ZGOPTNS= <>
##$ZL1= 120
##$ZL2= 120
##$ZL3= 120
##$ZL4= 120
##$ABSF1= 14.96078
##$ABSF2= -5.597402
##$ABSG= 5
##$ABSL= 3
##$ALPHA= 0
##$AQORDER= 0
##$ASSFAC= 0
##$ASSFACI= 0
##$ASSFACX= 0
##$ASSWID= 0
##$AUNMP= <proc_prof1d_extract.lims>
##$AXLEFT= 0
##$AXNAME= <>
##$AXNUC= <1H>
##$AXRIGHT= 0
##$AXTYPE= 0
##$AXUNIT= <>
##$AZFE= 0.1
##$AZFW= 0.1
##$BCFW= 0
##$BC_mod= 0
##$BYTORDP= 0
##$COROFFS= 0
##$CY= 15
##$DATMOD= 1
##$DC= 0
##$DFILT= <>
##$DTYPP= 0
##$F1P= 0
##$F2P= 0
##$FCOR= 0.5
##$FTSIZE= 131072
##$FT_mod= 6
##$GAMMA= 0
##$GB= 0
##$INTBC= 1
##$INTSCL= 1
##$ISEN= 128
##$LB= 0.3
##$LEV0= 0
##$LPBIN= 0
##$MAXI= 10000
##$MC2= 0
##$MEAN= 0
##$ME_mod= 0
##$MI= 0
##$NCOEF= 0
##$NC_proc= -2
##$NLEV= 6
##$NOISF1= 0
##$NOISF2= 0
##$NSP= 0
##$NTH_PI= 0
##$NZP= 0
##$OFFSET= 14.96078
##$PC= 1
##$PHC0= 5.097656
##$PHC1= 0
##$PH_mod= 1
##$PKNL= yes
##$PPARMOD= 0
##$PPDIAG= 0
##$PPIPTYP= 0
##$PPMPNUM= 2147483647
##$PPRESOL= 1
##$PSCAL= 4
##$PSIGN= 0
##$PYNMP= <proc.py>
##$REVERSE= no
##$SF= 400.020009724965
##$SI= 131072
##$SIGF1= 0
##$SIGF2= 0
##$SINO= 400
##$SIOLD= 131072
##$SPECTYP= <>
##$SREGLST= <1H.CDCl3>
##$SSB= 0
##$STSI= 131072
##$STSR= 0
##$SW_p= 8223.68421052631
##$SYMM= 0
##$S_DEV= 0
##$TDeff= 65536
##$TDoff= 0
##$TI= <>
##$TILT= no
##$TM1= 0
##$TM2= 0
##$TOPLEV= 0
##$USERP1= <user>
##$USERP2= <user>
##$USERP3= <user>
##$USERP4= <user>
##$USERP5= <user>
##$WDW= 1
##$XDIM= 131072
##$YMAX_p= 326763694
##$YMIN_p= -12524
##$CURPLOT= <Network HP LaserJet P1505>
##$CURPRIN= <$Network HP LaserJet P1505>
##$DFORMAT= <normdp>
##$LAYOUT= <+/1D_H.xwp>
##$LFORMAT= <normlp>
##$PFORMAT= <normpl>
##$SURQMSG= 1
$$ End of Bruker specific parameters
$$ ---------------------------------
##NTUPLES= NMR SPECTRUM
##VAR_NAME=  FREQUENCY,     SPECTRUM/REAL,   SPECTRUM/IMAG
##SYMBOL=    X,             R,               I
##VAR_TYPE=  INDEPENDENT,   DEPENDENT,       DEPENDENT
##VAR_FORM=  AFFN,          ASDF,            ASDF
##VAR_DIM=   131072,        131072,          131072
##UNITS=     HZ,            ARBITRARY UNITS, ARBITRARY UNITS
##FACTOR=    0.0627417313425164, 1,          1
##FIRST=     8223.62146879497, 213,          -59680
##LAST=      0,             1575,            -60152
##MIN=       0,             -12524,          0
##MAX=       8223.62146879497, 326763694,    0
$$ Real data points
##PAGE= N=1
##DATA TABLE= (X++(R..R)), XYDATA
$$ [...]
64048C21618K736L945N015N953O666O972O946O995P427Q060Q296P707O481N166
$$ 321618 324354 328299 333314 339267 345933 352905 359851 366846 374273 382333 390629 398336 404817 409983
64034D09983M006K824J652R60R20R52M32m49j147j659k208k387j635n07l44j449
$$ 409983 413989 416813 418465 419425 420345 421297 421729 421280 420133 418474 416266 413879 412244 411737 411393 409944
64018D09944k636k930k747k868l229l429l620l986l946k874j230q8K63M03P63
$$ 409944 407308 404378 401631 398763 395534 392105 388485 384499 380553 377679 376449 376361 376624 377027 377790
64003C77790J275J950K975M140M817M590L596K282J268J148J949K925L414L644
$$ 377790 379065 381015 383990 388130 392947 397537 401133 403415 404683 405831 407780 410705 414119 417763
63989D17763M177M933N545O210P301Q336Q411P717P541Q585J0241J1707J2853
$$ 417763 421940 426873 432418 438628 445929 454265 462676 470393 477934 486519 496760 508467 521320
63976E21320J3671J3906J3771J4142J5381J6667J7213J7449J8330J9898K1349
$$ 521320 534991 548897 562668 576810 592191 608858 626071 643520 661850 681748 703097
63965G03097K2270K3107K4474K6510K8899L1266L3623L6488M0369M5061M9950
$$ 703097 725367 748474 772948 799458 828357 859623 893246 929734 970103 1015164 1065114
63954A065114N5058O1204O8867P7574Q6757R6559J07222J18265J28953J39119
$$ 1065114 1120172 1181376 1250243 1327817 1414574 1511133 1618355 1736620 1865573 2004692
63944B004692J48849J57737J65080J70581J74141J75232J73114J67530J58595
$$ 2004692 2153541 2311278 2476358 2646939 2821080 2996312 3169426 3336956 3495551
63935C495551J46200J30135J10743Q8895O5351M0649J5416r807l4931n9905q4013
$$ 3495551 3641751 3771886 3882629 3971524 4036875 4077524 4092940 4083133 4048202 3988297 3904284
63924C904284j06106j25463j41817j54689j63515j68522j70719j70688j68041
$$ 3904284 3798178 3672715 3530898 3376209 3212694 3044172 2873453 2702765 2534724
63915B534724j62373j54254j44829j34812j24347j13567j02853r2501q2486p2664
$$ 2534724 2372351 2218097 2073268 1938456 1814109 1700542 1597689 1505188 1422702 1350038
63905A350038o3209n4802m8242m3698m0432l7435l4290l1182k8258k5413k2741
$$ 1350038 1286829 1232027 1183785 1140087 1099655 1062220 1027930 996748 968490 943077 920336
63894I20336k0762j9893j9903k0066j9807j9068j8127j7207j6298j5329j4300
$$ 920336 899574 879681 859778 839712 819905 800837 782710 765503 749205 733876 719576
63883G19576j3153j1699r943q350p265o225m444k128m34J87P79K338M319N607
$$ 719576 706423 694724 684781 676431 669166 662941 658497 656369 655935 656122 656901 659239 663558 669165
63869F69165O308P340Q577Q815P688O345N902O236O657O782O283M779K639J086
$$ 669165 675473 682813 691390 700205 707893 714238 720140 726376 733033 739815 746098 750877 753516 754602
63855G54602O79M04r76l310n565p415r238j0911j1770j1763j1784j2558j3862
$$ 754602 755281 755685 754709 751399 745834 738419 729181 718270 706500 694737 682953 670395 656533
63842F56533j5014j5640j5791j5789j6092j6905j7751j7863j7084j6038j5250
$$ 656533 641519 625879 610088 594299 578207 561302 543551 525688 508604 492566 477316
63831D77316j4567j3649j2587j1730j1148j0613r948r110q135p184o578o497o723
$$ 477316 462749 449100 436513 424783 413635 403022 393074 383964 375829 368645 362067 355570 348847
63818C48847o844o610o002n125m190l533l282l132k639j745q23k68k65q60j882
$$ 348847 342003 335393 329391 324266 320076 316543 313261 310129 307490 305745 304922 304654 304389 303529 301647
63803C01647k724k746k041j515j871k808l569l914m082l996l262j964q51m98p72
$$ 301647 298923 296177 294136 292621 290750 287942 284373 280459 276377 272381 269119 267155 266304 265806 265034
63788B65034j364k235l203l605l044k071j521j367r14n7M05q4r89j357r45l37
$$ 265034 263670 261435 258232 254627 251583 249512 247991 246624 245710 245653 246058 245974 244985 243628 242683 242346
63772B42346j75n84j195j457j092l38K14J74l01p54q27m38K52R07J165R06L28
$$ 242346 242171 241587 240392 238935 237843 237505 237719 237893 237592 236838 236011 235573 235825 236732 237897 238803 239131
63755B39131k18m52k77J11L07J02k01r2M23P91O60M64Q61J816K525K318J369M16
$$ 239131 238913 238461 238184 238295 238602 238704 238503 238411 238834 239625 240285 240749 241610 243426 245951 248269 249638 250054
63737B50054r3l11m73l96J89R59J141N42o8Q7Q21J472J980K840M082N041N200
$$ 250054 249961 249650 249177 248781 248970 249929 251070 251612 251544 251631 252452 253924 255904 258744 262826 267867 273067
63720B73067M681L724K368Q83j42n39q22j297j466q78p4Oo32j063p37q3K07J2
$$ 273067 277748 281472 283840 284723 284581 284042 283220 281923 280457 279579 279505 279511 278879 277816 277079 276996 277203 277215
63702B77215k65j52N74J648K387K323J750J274R13K02p74j110k02J331K285K179
$$ 277215 276950 276798 277372 279020 281407 283730 285480 286754 287667 287869 287095 285985 285783 287114 289399 291578
63686B91578J470P79L13P0Q9M07R22J418J645J450R33M00Q2o4j80k55j95j9K02
$$ 291578 293048 293827 294140 294210 294299 294706 295628 297046 298691 300141 301074 301474 301556 301492 301312 301057 300862 300843 301045
63667C01045M48O20M43j79q22r10m47o9k66q34j236j199r20r03j635l016l997
$$ 301045 301493 302113 302556 302377 301555 300645 300198 300129 299863 299029 297793 296594 295674 294771 293136 290120 286123
63650B86123l352j189P97J157L41n0O26J586K116K427K784K798K237J799K230
$$ 286123 282771 281582 282379 283536 283877 283827 284453 286039 288155 290582 293366 296164 298401 300200 302430
63635C02430L164L651L581L693M340N063N503N901O463O905P033P272Q142R456
$$ 302430 305594 309245 312826 316519 320859 325922 331425 337326 343789 350694 357727 364999 373141 382597
63621C82597J0493J0854J0827J1067J2049J3704J5427J6590J7221J7982J9275
$$ 382597 393090 403944 414771 425838 437887 451591 467018 483608 500829 518811 538086
63610E38086K0628K1208K0795J9897J8972J7871J6061J3210R449N276J358j686
$$ 538086 558714 579922 600717 620614 639586 657457 673518 686728 696177 701453 702811 701125
63598G01125l464m009l797l582l955n025o456p845r003r994j1077j2526j4292
$$ 701125 697661 693652 689855 686273 682318 677293 670837 662992 653989 643995 632918 620392 606100
63585F06100j5750j6070j5048j3381j1968j1043j0204r151q090p332o768n944
$$ 606100 590350 574280 559232 545851 533883 522840 512636 503485 495395 488063 481295 475351
63573D75351m513k488j39K139L845M565M402M096M453N575O827P626Q044Q549
$$ 475351 470838 468350 468211 470350 474195 478760 483162 487258 491711 497286 504113 511739 519783 528332
63559E28332R342J0226J0941J1436J1924J2828J4524J6889J9224K0949K2262K3736
$$ 528332 537674 547900 558841 570277 582201 595029 609553 626442 645666 666615 688877 712613
63547G12613K5297K6004K4905K1743J6798J0569L989j535m958o490p227p922q430
$$ 712613 737910 763914 788819 810562 827360 837929 841918 840383 835425 828935 821708 813786 805356
63534H05356q451q297q596r478j0528j1566j2948j4930j7129j8926k0143k0901
$$ 805356 796905 788608 780012 770534 760006 748440 735492 720562 703433 684507 664364 643463
63522F43463k1118k0721k0174j9999j9764j8458j6109j4089j3242j2669j1235
$$ 643463 622345 601624 581450 561451 541687 523229 507120 493031 479789 467120 455885
63511D55885r447q629q692q225o711n276m886n027m732l884k927k132j747k125
$$ 455885 446438 437809 429117 420892 414181 408905 404019 398992 394260 390376 387449 385317 383570 381445
63497C81445k934l055k009q73q27j361j020L58J394J196N47O77J625K386K272
$$ 381445 378511 375456 373447 372574 371747 370386 369366 369724 371118 372314 372861 373538 375163 377549 379821
63482C79821J556R50Q44J117J440J630J643J412R00K93j59n21j104j874k334k207
$$ 379821 381377 382327 383171 384288 385728 387358 389001 390413 391313 391606 391447 390926 389822 387948 385614 383407
63466C83407j877j882k231k567k638k325j560o23q3rL84J741L504M546M622M471
$$ 383407 381530 379648 377417 374850 372212 369887 368327 367704 367621 367612 367996 369737 373241 377787 382409 386880
63450C86880M600M814M977N421O297P216P889Q622R784J1174J2334J3194J4131
$$ 386880 391480 396294 401271 406692 412989 420205 428094 436716 446500 457674 470008 483202 497333
63437D97333J5506J7381J9396K0723K0387J8105J4761J1770R859Q645P469O460
$$ 497333 512839 530220 549616 570339 590726 608831 623592 635362 645221 653866 661335 667795
63425F67795O499Q120J0756J3413J5837J8438K1091K2823K3085K2596K2213K1474
$$ 667795 674294 682414 693170 706583 722420 740858 761949 784772 807857 830453 852666 874140
63413H74140J9198J5198J0526O037J761k205n177o750p498q211r025r750j0599
$$ 874140 893338 908536 919062 925099 926860 924655 919478 912728 905230 897019 887994 878244 867645
63400H67645j1936j3694j5519j7357j9341k1283k2681k3266k3150k2503k1377
$$ 867645 855709 842015 826496 809139 789798 768515 745834 722568 699418 676915 655538
63389F55538j9823j7985j6036j4125j2340j0657r058p685o663n714m312k358l70
$$ 655538 635715 617730 601694 587569 575229 564572 555514 547829 541166 535452 531140 528782 528412
63376E28412J222K634M199N730O807P503Q323R493J0753J1878J2979J4234J5621
$$ 528412 529634 532268 536467 542197 549004 556507 564830 574323 585076 596954 609933 624167 639788
63363F39788J7007J8351J9676K1049K2484K3746K4321K3909K2815K1571K0094
$$ 639788 656795 675146 694822 715871 738355 762101 786422 810331 833146 854717 874811
63352H74811J7628J3686Q769L942q4l292n953q195r915j0912j1094j0643j0090
$$ 874811 892439 906125 914894 918836 918752 915460 909507 901312 891397 880485 869391 858748 848658
63339H48658j0148j1390j3904j7114j9965k1561k1818k1411k0954k0380j9281
$$ 848658 838510 827120 813216 796102 776137 754576 732758 711347 690393 670013 650732
63328F50732j7691j6089j4664j3016j0760q114n623l633k410k442m041o654r146
$$ 650732 633041 616952 602288 589272 578512 570398 564775 561142 558732 556290 552249 545595 536449
63315E36449j0863j1978j2681j2626j1593j0125q971q190p370o522o038n791n070
$$ 536449 525586 513608 500927 488301 476708 466583 457612 449422 442052 435530 429492 423701 418631
63302D18631l674k440k192k570k497j649q60r38j573j849j538j353j839k568k763
$$ 418631 414957 412517 410325 407755 405258 403609 402749 401811 400238 398389 396851 395498 393659 391091 388328
63287C88328k398k144k322k499k236j721j359j172r72p50n21p3O08R74N05m69
$$ 388328 385930 383786 381464 378965 376729 375008 373649 372477 371505 370755 370234 370161 370769 371743 372248 371779
63271C71779j074r58n19j43K24O50R33R78J022J341J981K829L637L895L278K278
$$ 371779 370705 369747 369228 369085 369309 369959 370892 371870 372892 374233 376214 379043 382680 386575 389853 392131
63255C92131J959K772L983M540M247L815M026N103O631P911Q525Q745R180J0010
$$ 392131 394090 396862 400845 405385 409632 413447 417473 422576 429207 437118 445643 454388 463568 473578
63241D73578J0858J1453J2037J2915J4035J5272J6704J8266J9525K0164K0444
$$ 473578 484436 495889 507926 520841 534876 550148 566852 585118 604643 624807 645251
63230F45251K0687K0596J9649J8080J6946J6977J7776J8342J8222J7836J7712
$$ 645251 665938 686534 706183 724263 741209 758186 775962 794304 812526 830362 848074
63219H48074J7706J7282J6452J5884J5774J5118J2777R065N444K590l33m180q488
$$ 848074 865780 883062 899514 915398 931172 946290 959067 968132 973576 976166 975833 971653 963165
63206I63165j2232j5185j7784k0081k1668k2461k2774k2656k1788k0092j7946
$$ 963165 950933 935748 917964 897883 876215 853754 830980 808324 786536 766444 748498
63195G48498j5757j3759j2120j0851r577p881n855l933k224m71J341K831L755
$$ 748498 732741 718982 706862 696011 686434 678553 672698 668765 666541 666070 667411 670242 673997
63182F73997M346M987N872O933P880Q321Q183P880P719P385O533N667N683O486
$$ 673997 678343 683330 689202 696135 704015 712336 720519 728399 736118 743503 750036 755703 761386 767872
63168G67872O825N738L506R76j425l610n490p217r326j1958j4317j5438j5336
$$ 767872 774697 780435 783941 784917 783492 779882 774392 767175 757849 745891 731574 716136 700800
63155G00800j4889j4756j4880j4901j4565j3729j2451j1130j0221r739r278q574
$$ 700800 685911 671155 656275 641374 626809 613080 600629 589499 579278 569539 560261 551687
63143E51687p709o767n629m310l217k835l134l490l270k469j629j051l46R23K288
$$ 551687 543978 537211 531582 527272 524055 521220 518086 514596 511326 508857 507228 506177 505831 506754 509042
63128E09042K657J812R87J480L006M083L893L089K713K980L391L530L390L218
$$ 509042 511699 513511 514498 515978 518984 523067 526960 530049 532762 535742 539133 542663 546053 549271
63114E49271L322L770M062L434J866M63L87J496K497K408J438L82l42p57q06k18
$$ 549271 552593 556363 560425 563859 565725 566188 566575 568071 570568 572976 574414 574796 574454 573697 572891 572673
63098E72673R98K280K864K472J551Q28O88J001J498K063K641L063L222L321L668
$$ 572673 573671 575951 578815 581287 582838 583666 584354 585355 586853 588916 591557 594620 597842 601163 604831
63083F04831M269M849N269N638N959O055N962O128O885P966Q851R501J0349J1529
$$ 604831 609100 613949 619218 624856 630815 636870 642832 648960 655845 663811 672662 682163 692512 704041
63069G04041J2506J2698J2355J2445J3654J5635J7455J8715J9964K1893K4381
$$ 704041 716547 729245 741600 754045 767699 783334 800789 819504 839468 861361 885742
63058H85742K6659K8344K9865L1770L4042L6324L8411M0252M1664M2565M3258
$$ 885742 912401 940745 970610 1002380 1036422 1072746 1111157 1151409 1193073 1235638 1278896
63047A278896M4096M4905M5176M4755M3976M3149M2359M1780M1653M1777M1470
$$ 1278896 1322992 1367897 1413073 1457828 1501804 1544953 1587312 1629092 1670745 1712522 1753992
63036A753992M0346L8796L7378L5973L3874L0481K5660J9524J2296M374l737j1768
$$ 1753992 1794338 1833134 1870512 1906485 1940359 1970840 1996500 2016024 2028320 2032694 2028957 2017189
63024B017189j9802k7971l5992m3125m8640n2380n4733n6000n5980n4355n1368
$$ 2017189 1997387 1969416 1933424 1890299 1841659 1789279 1734546 1678546 1622566 1568211 1516843
63013A516843m7763m4127m0572l6965l3122k8787k3909j8972j4622j0845p050
$$ 1516843 1469080 1424953 1384381 1347416 1314294 1285507 1261598 1242626 1228004 1217159 1210109
63002A210109l101L40K820M849P117R389J0871J1377J1477J1649J1834J1816J1493
$$ 1210109 1207008 1207348 1210168 1215017 1222134 1231523 1242394 1253771 1265248 1276897 1288731 1300547 1312040
62989A312040J0809R830Q890Q123O980M751J568j693m562p466j0897j4751j8724
$$ 1312040 1322849 1332679 1341569 1349692 1356672 1361423 1362991 1361298 1356736 1349270 1338373 1323622 1304898
62976A304898k2747k6600k9570l1083l1446l1459l1462l1174l0349k9155k7862
$$ 1304898 1282151 1255551 1225981 1194898 1163452 1131993 1100531 1069357 1039008 1009853 981991
62965I81991k6535k5113k3572k1903k0085j8157j6248j4626j3675j3633j4152
$$ 981991 955456 930343 906771 884868 864783 846626 830378 815752 802077 788444 774292
62954G74292j4360j3681j2502j1784j1967j2523j2599j1876j0709r742r417r680
$$ 774292 759932 746251 733749 721965 709998 697475 684876 673000 662291 652549 643132 633452
62942F33452j0016r908r343q721q202p457o236m966m346m432m535m127l510l282
$$ 633452 623436 613528 604185 595464 587262 579805 573569 568603 564257 559825 555290 551163 547653 544371
62928E44371l401l167k215j127q02j390k151k389k151j886j702j398j091j321
$$ 544371 540970 537803 535588 534461 533659 532269 530118 527729 525578 523692 521990 520592 519501 518180
62914E18180k262l270l610l353l097k986k678k213k177k714l055k557j702j413
$$ 518180 515918 512648 509038 505685 502588 499602 496924 494711 492534 489820 486765 484208 482506 481093
62900D81093j722j872j550j259j400j710j720j288n27K36M15k76j116r44K50J092
$$ 481093 479371 477499 475949 474690 473290 471580 469860 468572 468045 468281 468696 468420 467304 466360 466610 467702
62884D67702O37l52n95r9K05J12K96R20J209O98q3n35q97j611k348k320j415l63
$$ 467702 468339 467987 467392 467293 467498 467610 467906 468826 470035 470733 470650 470115 469218 467607 465259 462939 461524 461161
62866D61161J22j1m30r10j365j623j427p84j03J62P6J61O69J110Q70J10l19K2
$$ 461161 461283 461272 460842 459932 458567 456944 455517 454733 454630 454792 454868 455029 455698 456808 457678 457788 457469 457491
62848D57491O09O65J67k11oN00O82L34j56l16j37j0j39k61l0M99R24J022R38R42
$$ 457491 458100 458765 458932 458721 458715 459215 459897 460231 460075 459759 459622 459612 459473 459212 459182 459681 460605 461627 462565 463507
62828D63507J166J573J979K167K189K478L366M514N187N182N081N412N937O106
$$ 463507 464673 466246 468225 470392 472581 475059 478425 482939 488126 493308 498389 503801 509738 515844
62814E15844N941N932O214O382O204O096O510P248P735P853Q042Q570R184R659
$$ 515844 521785 527717 533931 540313 546517 552613 559123 566371 574106 581959 590001 598571 607755 617414
62800F17414J0286J1350J2468J2935J2800J3042J4459J6709J8774K0179K1471
$$ 617414 627700 639050 651518 664453 677253 690295 704754 721463 740237 760416 781887
62789G81887K3542K6703L0432L3965L7060M0188M3908M8204N2571N6620O0280
$$ 781887 805429 832132 862564 896529 933589 973777 1017685 1065889 1118460 1175080 1235360
62778A235360O3484O6035O7872O9034O9248O7931O4786N9996N3678M5583L5735
$$ 1235360 1298844 1364879 1432751 1501785 1571033 1638964 1703750 1763746 1817424 1863007 1898742
62767A898742K4860J3794K799q155j8815k8839l8211m6858n4171n9566o3270o5865
$$ 1898742 1923602 1937396 1940195 1932040 1913225 1884386 1846175 1799317 1745146 1685580 1622310 1556445
62755A556445o7270o6949o5078o2604o0033n7002n3297m9557m6436m3719m0835
$$ 1556445 1489175 1422226 1357148 1294544 1234511 1177509 1124212 1074655 1028219 984500 943665
62744I43665l7796l5042l2592k9948k6859k3707k1068j9062j7332j5523j3696
$$ 943665 905869 870827 838235 808287 781428 757721 736653 717591 700259 684736 671040
62733F71040j2147j0915r740q542p617p020o193m702l081k256k260k217j640r20
$$ 671040 658893 647978 638238 629696 622079 615059 608866 604164 601083 598827 596567 594350 592710 591790
62719E91790m16J84J235K498L599M572N520O282O928Q083J0135J2430J3947J4626
$$ 591790 591374 591558 592793 595291 598890 603462 608982 615264 622192 630275 640410 652840 666787 681413
62705F81413J5446J7219J9772K2361K4513K6370K8429L0886L3180L4361L4151
$$ 681413 696859 714078 733850 756211 780724 807094 835523 866409 899589 933950 968101
62694I68101L3336L2817L2514L1524K9173K5470K0766J5500J0205N216K26n507
$$ 968101 1001437 1034254 1066768 1098292 1127465 1152935 1173701 1189201 1199406 1204622 1204848 1199341
62682A199341j2184j8982k4657k8571l1061l2931l4669l6099l6709l6317l5287
$$ 1199341 1187157 1168175 1143518 1114947 1083886 1050955 1016286 980187 943478 907161 871874
62671H71874l4100l2839l1256k9201k6836k4452k2237k0289j8651j7295j6079
$$ 871874 837774 804935 773679 744478 717642 693190 670953 650664 632013 614718 598639
62660E98639j4772j3274j1812j0724r948q994p701o723o737p353p431o569n569
$$ 598639 583867 570593 558781 548057 538109 529115 521414 514691 507954 500601 493170 486601 481032
62647D81032n218n252m917m035k974k043j313q34m99q8L04J76n51j124r10l62
$$ 481032 475814 470562 465645 461610 458636 456593 455280 454446 453947 453859 454163 454339 453788 452664 451754 451392
62631D51392l57r10j268j108p70m07K28J074J596J627J653K044K584L084L756
$$ 451392 451035 450125 448857 447749 446979 446572 446800 447874 449470 451097 452750 454794 457378 460462 464218
62616D64218M580M867M149L121L075M444O351P662Q066Q150Q606R560J0618J1523
$$ 464218 468798 473665 477814 480935 484010 488454 494805 502467 510533 518683 527289 536849 547467 558990
62602E58990J2628J4411J6667J8653K0182K1983K4587K7345K9209L0216L1393
$$ 558990 571618 586029 602696 621349 641531 663514 688101 715446 744655 774871 806264
62591H06264L3139L4457L4099L1921K8644K4780K0345J5380J0121M643j173p186
$$ 806264 839403 873860 907959 939880 968524 993304 1013649 1029029 1039150 1043793 1042620 1035434
62579A035434j2933j8044k2459k6082k8642l0038l0512l0327k9668k8903k8486
$$ 1035434 1022501 1004457 981998 955916 927274 897236 866724 836397 806729 777826 749340
62568G49340k8220k7146k4711k1681j9322j7959j6935j5763j4531j3279j1797
$$ 749340 721120 693974 669263 647582 628260 610301 593366 577603 563072 549793 537996
62557E37996j0153q753p637o418n048m006l454k894j973r98l30J31M24K60k15
$$ 537996 527843 519090 511453 505035 499987 495981 492527 489633 487660 486662 486332 486463 486887 487147 486932
62542D86932q9J066K230K121R41K8l1O2l33q96r53l19P99K127L375M364N312O564
$$ 486932 486843 487909 490139 492260 493201 493229 493198 493260 492927 492031 491078 490759 491558 493685 497060 501424 506736 513300
62524E13300P974Q952R304R597J0455J1861J3384J4794J6216J7823J9593K1287
$$ 513300 521274 530226 539530 549127 559582 571443 584827 599621 615837 633660 653253 674540
62512F74540K2567K3249K3427K3237K2639K1568K0228J8888J7523J5862J3730
$$ 674540 697107 720356 743783 767020 789659 811227 831455 850343 867866 883728 897458
62501H97458J1059P800M193J018r20j558j463j013m7J655M008O779R676J2307
$$ 897458 908517 916317 920510 921528 920608 919050 917587 916574 916527 918182 922190 928969 938645 950952
62487I50952J4466J6561J9257K2601K5882K8542L0709L2593L3749L3288L0642
$$ 950952 965418 981979 1001236 1023837 1049719 1078261 1108970 1141563 1175312 1208600 1239242
62476A239242K5904J9691J2963O699J317l716r478j6676k4907l2731l8592m1976
$$ 1239242 1265146 1284837 1297800 1304499 1305816 1302100 1292622 1275946 1251039 1218308 1179716 1137740
62464A137740m3670m4750m5412m5067m3400m0788l7707l4283l0625k7172k4315
$$ 1137740 1094070 1049320 1003908 958841 915441 874653 836946 802663 772038 744866 720551
62453G20551k1951j9712j7466j5333j3326j1288r153p137n539m373l218j565O05
$$ 720551 698600 678888 661422 646089 632763 621475 612322 605185 599646 595273 592055 590490 591095
62440E91095K702M108M636M343L197J357m34j341j358j372k262m134o383q118
$$ 591095 593797 597905 602541 606884 610081 611438 611004 609663 608305 606933 604671 600537 594154 586036
62426E86036q646q030p253p300q047q441p845o693n784n409n365n332n010m238
$$ 586036 577390 569360 562107 554807 546760 538319 530474 523781 517997 512588 507223 501891 496881 492643
62412D92643l277k609k371k236k014j881j918j842j439q73l77k3J46K03O57K018
$$ 492643 489366 486757 484386 482150 480136 478255 476337 474495 473056 472183 471806 471783 471929 472132 472789 474807
62396D74807L812M697M039K795K261K503K685K503K487L015L883M825N783O482
$$ 474807 478619 483316 487355 490150 492411 494914 497599 500102 502589 505604 509487 514312 520095 526577
62382E26577O353N297M157M062N298P048Q231Q531Q506Q805R439J0009J0433J1136
$$ 526577 532930 538227 542384 546446 551744 558792 567023 575554 584060 592865 602304 612313 622746 633882
62368F33882J2417J3998J5363J6397J7517J9265K1781K4669K7395K9903L2605
$$ 633882 646299 660297 675660 692057 709574 728839 750620 775289 802684 832587 865192
62357H65192L5544L7908L8789L8216L6884L5075L2482K8904K4432J8999J2621
$$ 865192 900736 938644 977433 1015649 1052533 1087608 1120090 1148994 1173426 1192425 1205046
62346A205046O158Q17l266p069j1019j4363j6640j8666k1207k3639k4865k4846
$$ 1205046 1211204 1212021 1208755 1201686 1190667 1176304 1159664 1140998 1119791 1096152 1071287 1046441
62334A046441k4239k3183k1509j9637j8153j6782j4910j2920j1913j2210j3024
$$ 1046441 1022202 999019 977510 957873 939720 922938 908028 895108 883195 870985 857961
62323H57961j3630j3935j4029j3980j4169j4903j5797j6222j6322j6595j6744
$$ 857961 844331 830396 816367 802387 788218 773315 757518 741296 724974 708379 691635
62312F91635j6001j4563j3448j2824j1704r719p897p122o933o503n871n332m619
$$ 691635 675634 661071 647623 634799 623095 613376 605479 598357 591424 584921 579050 573718 569099
62299E69099l527k662k487k304j212L30J064P85O09J310K381K957K892K693K851
$$ 569099 565572 562910 560423 558119 556907 557237 558301 559086 559695 561005 563386 566343 569235 571928 574779
62284E74779L510M414N083N326N513O019O560O606O290O260O618O801O721P206
$$ 574779 578289 582703 587786 593112 598625 604644 611204 617810 624100 630360 636978 643779 650500 657706
62270F57706Q834J0967J2600J3745J5168J7003J8519J9440K0591K2748K5480K7823
$$ 657706 666540 677507 690107 703852 719020 736023 754542 773982 794573 817321 842801 870624
62258H70624K9793L2318L5661L8735M0360M0475L9586L7586L3953K8889K3341
$$ 870624 900417 932735 968396 1007131 1047491 1087966 1127552 1165138 1199091 1227980 1251321
62247A251321J7796J1899N554l42m877q404j2149j6766k1831k6682l1127l5062
$$ 1251321 1269117 1281016 1286570 1286228 1281351 1272947 1260798 1244032 1222201 1195519 1164392 1129330
62235A129330l7925l9066l8587l7395l6167l4520l1649k7721k4075k1677j9919
$$ 1129330 1091405 1052339 1013752 976357 940190 905670 874021 846300 822225 800548 780629
62224G80629j7589j4754j2668j1817j1072r275o869n193m740m882m938m638l775
$$ 780629 763040 748286 735618 723801 712729 703454 696585 691392 686652 681770 676832 672194 668419
62211F68419k324r51n21r57j289j017p20r94j514j529p91L83J596K486K811K852
$$ 668419 666095 665144 664623 663666 662377 661360 660640 659646 658132 656603 655812 656195 657791 660277 663088 665940
62195F65940L318M419N432N658N438N615O314O977P355P716Q076Q018P463O958
$$ 665940 669258 673677 679109 684767 690205 695820 702134 709111 716466 724182 732258 740276 747739 754697
62181G54697O954P245P347P083O647O478P115Q687J0472J1537J1950J2766J4554
$$ 754697 761651 768896 776243 783326 789973 796451 803566 812253 822725 834262 846212 858978 873532
62168H73532J6758J8820K1113K3993K6605K7606K6772K4964K2766K0002J6542
$$ 873532 890290 909110 930223 954216 980821 1008427 1035199 1060163 1082929 1102931 1119473
62157A119473J2652Q455L877o88m436p174r596j2299j5141j7862k0549k3036k4539
$$ 1119473 1132125 1140580 1144457 1143769 1139333 1132159 1122563 1110264 1095123 1077261 1056712 1033676 1009137
62144A009137k4576k3765k2946k1955k0058j7443j5288j4166j3242j1432q883
$$ 1009137 984561 960796 937850 915895 895837 878394 863106 848940 835698 824266 815383
62133H15383o727n695n476n416n350n432n524n136m086k823j937j483j059l45
$$ 815383 808656 802961 797485 792069 786719 781287 775763 770627 766541 763718 761781 760298 759239 758894
62119G58894N75J327J387L04j797m021n367n606n189m462l495k673k764m086o065
$$ 758894 759469 760796 762183 762487 760690 756669 751302 745696 740507 736045 732550 729877 727113 723027 716962
62104G16962p860r016r317q594p087n587m656m011l082j856p01L93J737L215M233
$$ 716962 709102 700086 690769 682175 675088 669501 664845 660834 657752 655896 655195 655588 657325 660540 664773
62089F64773M495M445M728N456O188O484O375O228O272O452O821P754R370J1021
$$ 664773 669268 673713 678441 683897 690085 696569 702944 709172 715444 721896 728717 736471 745841 756862
62075G56862J1912J2223J2923J4425J6122J7370J8164J8590J8441J7965J8114
$$ 756862 768774 780997 793920 808345 824467 841837 860001 878591 897032 914997 933111
62064I33111J9323K0597K0584J9059J6653J3705J0222O562L188l1l393o589r170
$$ 933111 952434 973031 993615 1012674 1029327 1043032 1053254 1059816 1063004 1062973 1059580 1052991 1043821
62051A043821j1515j4338j7428j9918k1678k3400k5262k6565k6970k7052k7372
$$ 1043821 1032306 1017968 1000540 980622 958944 935544 910282 883717 856747 829695 802323
62040H02323k7709k7576k6759k5167k2860k0444j8700j7581j6269j4419j2595
$$ 802323 774614 747038 720279 695112 672252 651808 633108 615527 599258 584839 572244
62029E72244j1323j0461r805r436r214q652p708o981o777o721o544o454o420n974
$$ 572244 560921 550460 540655 531219 522005 513353 505645 498664 491887 485166 478622 472168 465748 459774
62015D59774n112m511m350l893k765j679j219q76j82K55j33n25K13J722K692K788
$$ 459774 454662 450151 445801 441908 439143 437464 436245 435369 435187 435442 435309 434784 434997 436719 439411 442199
61999D42199K788L083L315L349L364L013J700j50j280j282j089j492k168k585
$$ 442199 444987 448070 451385 454734 458098 461111 462811 462661 461381 460099 459010 457518 455350 452765
61985D52765k959l716m651n258n393n199m770m308m206m561m861m498l443k218
$$ 452765 449806 446090 441439 436181 430788 425589 420819 416511 412305 407744 402883 398385 394942 392724
61971C92724j406j288j687k052j918j351p31j81L93P88O25J2m02k61J15L16L47
$$ 392724 391318 390030 388343 386291 384373 383022 382291 382110 382503 383291 383916 383928 383526 383265 383380 383696 384043
61954C84043L80M94Q80J756K829L351L095K839L345M342M984N079N293O291Q042
$$ 384043 384423 384917 385797 387553 390382 393733 396828 399667 403012 407354 412338 417417 422710 429001 437043
61939D37043R869J0849J0452R125Q083Q069Q578Q645Q104P478O918O006M675L553
$$ 437043 446912 457761 468213 477338 485421 493490 502068 510713 518817 526295 533213 539219 543894 547447
61925E47447L090K920K424J463K59j072k413l392l686l342k510j155N82K027K627
$$ 547447 550537 553457 555881 557344 557603 556531 554118 550726 547040 543698 541188 540033 540615 542642 545269
61910E45269K863L784N589P268P880P569O986O306N336M178L080J933M34j258
$$ 545269 548132 551916 557505 564773 572653 580222 587208 593514 598850 603028 606108 608041 608475 607217
61896F07217k686l771m778n620n844n463n167n425n884n973n671n294m936m528
$$ 607217 604531 600760 595982 590362 584518 579055 573888 568463 562579 556606 550935 545641 540705 536177
61882E36177m179m017l972m039m476n265n662m880l143j533p75o81p77r09j002
$$ 536177 531998 527981 524009 519970 515494 510229 504567 499687 496544 495011 494236 493555 492778 491869 490867
61867D90867p41M2R00J248J227J750L468N904P872Q688Q741Q878R552J0710J2192
$$ 490867 490126 490168 491068 492316 493543 495293 498761 504665 512537 521225 529966 538844 548396 559106 571298
61852E71298J3741J4827J4993J4505J4185J4462J4922J4947J4334J3129J1365
$$ 571298 585039 599866 614859 629364 643549 658011 672933 687880 702214 715343 726708
61841G26708R251P169N180K928L97j798l255m362n415n776m731k781j093R9J540
$$ 726708 735959 743128 748308 751236 751633 749835 746580 742218 736803 731027 726296 723515 722422 722521 724061
61826G24061L379M664M722M131L875M161M428M012K474j75l241n773p482q830
$$ 724061 727440 732104 736826 740957 744832 748993 753421 757433 759907 759732 756491 750718 743236 734406
61812G34406j0077j0924j1322j1843j2718j3283j2976j2287j1919j1563j0454
$$ 734406 724329 713405 702083 690240 677522 664239 651263 638976 627057 615494 605040
61801F05040q815p770p823q307q347p699o526n178m324m506n248n271m057k590
$$ 605040 596225 588455 580632 572325 563978 556279 549753 544575 540251 535745 530497 525226 521169 518579
61787E18579k046k286k330j892j637j969k404k355j969j796k026k374k512k263
$$ 518579 516533 514247 511917 510025 508388 506419 504015 501660 499691 497895 495869 493495 490983 488720
61773D88720j513m04N14O46J1p81j228j357j326r90j34J013J898K230K204K178
$$ 488720 487207 486803 487317 487963 487974 487193 485965 484608 483282 482292 482158 483171 485069 487299 489503 491681
61757D91681K351K695K956K759J941Q03j52q02j413k090k532k457k052j793j986
$$ 491681 494032 496727 499683 502442 504383 505186 505034 504232 502819 500729 498197 495740 493688 491895 489909
61742D89909k553l177l510l431l125k805k363j582o82k26l43m81j79K87L59O5
$$ 489909 487356 484179 480669 477238 474113 471308 468945 467363 466681 466455 466112 465631 465452 465739 466098 466163
61726D66163j20j0J49K55N24J024J408J300P10jm12k94J22J53o45j824k455k347
$$ 466163 466043 466033 466182 466437 466961 467985 469393 470693 471403 471402 470990 470696 470818 470971 470326 468502 466047 463700
61708D63700k292k854l455l180k153j399j468j870k034k145k634l314l548l112
$$ 463700 461408 458554 455099 451919 449766 448367 446899 445029 442995 440850 438216 434902 431354 428242
61694D28242k421j975j936k211k598k791k584k184k034k212k278j880j274r69
$$ 428242 425821 423846 421910 419699 417101 414310 411726 409542 407508 405296 403018 401138 399864 398895
61680C98895j096j396j638j801j953k178k532k837k656j805p46r1J65M79R29J072
$$ 398895 397799 396403 394765 392964 391011 388833 386301 383464 380808 379003 378257 378166 378331 378810 379739 380811
61664C80811P26K61qj60r1O57J955K598J669Po30J68J031P98n9m83l35j08K48
$$ 380811 381537 381798 381790 381630 381539 382196 384151 386749 388418 388425 387795 387963 388994 389792 389733 389250 388915 388807 389055
61645C89055J127K184K465J752R80R63J409J574J323R43L99n15j408j466o27L5
$$ 389055 390182 392366 394831 396583 397563 398526 399935 401509 402832 403775 404174 403659 402251 400785 400158 400193
61629D00193m87j875k866k782k226k184k790l267k942k005j173q72q89p91m49
$$ 400193 399706 397831 394965 392183 389957 387773 384983 381716 378774 376769 375596 374724 373835 373044 372595
61614C72595j01p7n30j369k303k963l102k772k319k143k374k725k787k522k322
$$ 372595 372494 372417 371887 370518 368215 365252 362150 359378 357059 354916 352542 349817 347030 344508 342186
61599C42186k412k387j751q70q57k206l968m727m161l115k342j807j250p55m60
$$ 342186 339774 337387 335636 334766 333909 331703 327735 323008 318847 315732 313390 311583 310333 309578 309118
61584C09118j62L42P66O15j48j018j455j279o46Q2M35J17o63j234j013p6Q43J094
$$ 309118 308956 309298 310064 310679 310531 309513 308058 306779 306133 306215 306650 306767 306104 304870 303857 303781 304624 305718
61566C05718Q31Q25J450K147K126J395O22J41k85o80n85J10O45K34r01j836j940
$$ 305718 306549 307374 308824 310971 313097 314492 315114 315255 314970 314290 313705 313815 314460 314694 313793 311957 310017
61549C10017j200O7J282J681J041J86J35P61J015N24J67P44J774K133J496N51
$$ 310017 308817 308884 310166 311847 312888 313074 313209 313970 314985 315509 315676 316420 318194 320327 321823 322374
61533C22374L8J05N64J194J655J438L58r45j385m77J031J790J197j40j224j622
$$ 322374 322412 322517 323081 324275 325930 327368 327726 326781 325396 324919 325950 327740 328937 328797 327573 325951
61517C25951j492j034m12O4K17L62Q98J498J296Q1j230j594r35R2J034J824K253
$$ 325951 324459 323425 323013 323077 323294 323656 324554 326052 327348 327429 326199 324605 323670 323762 324796 326620 328873
61500C28873J893P53l75o10K9N79J94q96j685j581r83n40k61K52R45J261R86N79
$$ 328873 330766 331519 331144 330534 330563 331142 331336 330440 328755 327174 326191 325651 325390 325642 326587 327848 328834 329413
61482C29413M91N57M39K50L88Q73J216R55J19p38r43k74P26J175P63Pm96q06j254
$$ 329413 329904 330461 330900 331150 331538 332411 333627 334582 334701 333963 333020 332746 333472 334647 335410 335417 334921 334115 332861
61463C32861j662j499p54o1J84L49Q77J454J393O70R6K81R12J266J189J150J479
$$ 332861 331199 329700 328946 328885 329069 329418 330295 331749 333142 333812 333908 334189 335101 336367 337556 338706 340185
61446C40185J924K036J692J095N38L30P04J548K348K633K400J983J611J343J258
$$ 340185 342109 344145 345837 346932 347470 347800 348504 350052 352400 355033 357433 359416 361027 362370 363628
61431C63628J380J485J330J092J254J943K666K847K449J917J696J904K353K687
$$ 363628 365008 366493 367823 368915 370169 372112 374778 377625 380074 381991 383687 385591 387944 390631
61417C90631K598K103J532J150Q36K76m66q35m10M45P94J78q36j341j135p91p89
$$ 390631 393229 395332 396864 398014 398850 399126 398660 397825 397415 397860 398654 398832 397996 396655 395520 394729 393940
61400C93940j044j258j298j051m27K26K27n88j460j608j130o85n41n21n46o72
$$ 393940 392896 391638 390340 389289 388862 389088 389315 388727 387267 385659 384529 383844 383303 382782 382236 381564
61384C81564p68o31l85k68k21p8Qj29k47j20j5j68j20N92J401J402Q70R74J926
$$ 381564 380796 380165 379780 379512 379291 379213 379221 379092 378845 378725 378710 378542 378422 379014 380415 381817 382687 383661 385587
61365C85587K668K553K167K036J778J156Q59J376K046K168K239L050M215M688
$$ 385587 388255 390808 392975 395011 396789 397945 398804 400180 402226 404394 406633 409683 413898 418586
61351D18586M375M097M258M549M823N189N244M292K562J321J402K183K509K113
$$ 418586 422961 427058 431316 435865 440688 445877 451121 455413 457975 459296 460698 462881 465390 467503
61337D67503J726J942K427K320J320J22l52m9L14L59M01N68L45m47r81n08L95
$$ 467503 469229 471171 473598 475918 477238 477360 477008 476959 477273 477632 478033 478601 478946 478499 477518 477010 477405
61320D77405N78M0j26O47J746K447K817L274L979M918O006O900P187O957O795
$$ 477405 477983 478023 477897 478544 480290 482737 485554 488828 492807 497725 503731 510631 517818 524775 531570
61305E31570P056P547Q011Q333Q229P270N578L943K906K083P77r73k435l130l393
$$ 531570 538626 546173 554184 562517 570746 578016 583594 587537 590443 592526 593303 592330 589895 586765 583372
61290E83372l852m658n340n461n257n372n990o579o661o392o060n418m091k369
$$ 583372 579520 574862 569522 564061 558804 553432 547442 540863 534202 527810 521750 516332 512241 509872
61276E09872r75q1P51J678K267K191J755J406J251J228J367J646J894K069K381
$$ 509872 508897 508816 509567 511245 513512 515703 517458 518864 520115 521343 522710 524356 526250 528319 530700
61261E30700K953L561L907L953L919M000M107L808K732J192J29O1L64J50m14m01
$$ 530700 533653 537214 541121 545074 548993 552993 557100 560908 563640 564832 564961 565022 565386 565536 565122 564721
61245E64721L64R98Q83M85M23M83J16n87r74o65J71J145J908K305K536L003L739
$$ 564721 565085 566083 566966 567451 567874 568357 568473 567886 566912 566247 566418 567563 569471 571776 574312 577315 581054
61228E81054M276M357M409M943N663N751N025M335M605N714O604O493N765N462
$$ 581054 585330 589687 594096 599039 604702 610453 615478 619813 624418 630132 636736 643229 648994 654456
61214F54456N964O552O368N451M477L808L333L066L239L735M032L899L760M150
$$ 654456 660420 666972 673340 678791 683268 687076 690409 693475 696714 700449 704481 708380 712140 716290
61200G16290N117O270P184P704Q136R013J0334J1205J0776R432Q291P613O514
$$ 716290 721407 727677 734861 742565 750701 759714 770048 781253 792029 801461 809752 817365 823879
61187H23879M447K098M44l41o01n44m07o48j364j998k200k468l371m514m987m590
$$ 823879 828326 830424 830868 830527 829926 829382 828975 828327 826963 824965 822765 820297 816926 812412 807425 802835
61171H02835m050m143n035o235o796o030m355l219l560m756n479n198m365l511
$$ 802835 798785 794642 789607 783372 776576 770546 766191 762972 759412 754656 749177 743979 739614 736103
61157G36103k875k542k232j222P79K956M325N092O167P537Q152P496O298N384
$$ 736103 733228 730686 728454 727232 728011 730967 735292 740384 746551 754088 762240 769736 776034 781418
61143G81418M725M092L880M665O292P939Q945R318R665J0703J2565J4496J5562
$$ 781418 786143 790235 794115 798780 805072 813011 821956 831274 840939 851642 864207 878703 894265
61130H94265J5779J6176J7639J9979K2336K4107K5319K6415K7834K9556L1009
$$ 894265 910044 926220 943859 963838 986174 1010281 1035600 1062015 1089849 1119405 1150414
61119A150414L1622L1553L1475L1658L1695L1210L0328K9261K7922K6217K4239
$$ 1150414 1182036 1213589 1245064 1276722 1308417 1339627 1369955 1399216 1427138 1453355 1477594
61108A477594K1921J8915J5245J1633Q670N920K409k100o829j0982j4572j8096
$$ 1477594 1499515 1518430 1533675 1545308 1553978 1559898 1562307 1560207 1553378 1542396 1527824 1509728
61096A509728k1731k5100k7686k9267k9972l0081k9910k9749k9691k9420k8457
$$ 1509728 1487997 1462897 1435211 1405944 1375972 1345891 1315981 1286232 1256541 1227121 1198664
61085A198664k6834k5286k4476k4122k3304k1602j9508j7673j6213j4877j3512
$$ 1198664 1171830 1146544 1122068 1097946 1074642 1053040 1033532 1015859 999646 984769 971257
61074I71257j2090j0539q854p207n752m457l201j916n39R35K327L389M121M738
$$ 971257 959167 948628 939774 932567 926815 922358 919157 917241 916702 917637 919964 923353 927474 932212
61060I32212N394O219P512R416J1470J3007J4037J5163J6572J7871J9045K0700
$$ 932212 937606 943825 951337 960753 972223 985230 999267 1014430 1031002 1048873 1067918 1088618
61048A088618K2909K4820K6012K7388K9740L2242L3583L4120L5495L8228M1068
$$ 1088618 1111527 1136347 1162359 1189747 1219487 1251729 1285312 1319432 1354927 1393155 1434223
61037A434223M2947M4300M6016M8106N0105N1974N3956N5984N7842N9569O1341
$$ 1434223 1477170 1521470 1567486 1615592 1665697 1717671 1771627 1827611 1885453 1945022 2006363
61026B006363O3280O5597O8548P2123P6274Q1510Q8444R6588J04551J11951J20333
$$ 2006363 2069643 2135240 2203788 2275911 2352185 2433695 2522139 2618727 2723278 2835229 2955562
61015B955562J31669J46883J66469J91521K23244K62339L09739L66814M33601
$$ 2955562 3087231 3234114 3400583 3592104 3815348 4077687 4387426 4754240 5187841
61006E187841N08163N89226O77924P74881Q77855R85593J099379J208991J273170
$$ 5187841 5696004 6285230 6963154 7738035 8615890 9601483 10700862 11909853 13183023
60997A3183023J227451J031432P15877L75718J08521m1458q4087m8145L4982J14889
$$ 13183023 14410474 15441906 16157783 16533501 16642022 16600564 16516477 16468332 16503314 16618203
60987A6618203J16011k4609l04578o46961r49303j144549j222963j211733j145353
$$ 16618203 16734214 16709605 16405027 15758066 14808763 13664214 12441251 11229518 10084165
60978A0084165j051198r47857q45719p48202o55648n69163m90548m20340l57977
$$ 10084165 9032967 8085110 7239391 6491189 5835541 5266378 4775830 4355490 3997513
60969C997513l03541k57913k21161j91907j68306j48940j32791j19169j07716
$$ 3997513 3693972 3436059 3214898 3022991 2854685 2705745 2572954 2453785 2346069
60960B346069r8042q9377q1082p3311o6627o1075n6174n1716m8027m5397m3632
$$ 2346069 2248027 2158650 2077568 2004257 1937630 1876555 1820381 1768665 1720638 1675241 1631609
60949A631609m2213m0539l8240l5570l3340l2026l1170l0053k8660k7444k6481
$$ 1631609 1589396 1548857 1510617 1475047 1441707 1409681 1378511 1348458 1319798 1292354 1265873
60938A265873k5476k4480k3816k3426k2969k2435k2030k1559k0689j9744j9315
$$ 1265873 1240397 1215917 1192101 1168675 1145706 1123271 1101241 1079682 1058993 1039249 1019934
60927A019934j9180j8535j7381j6579j6333j5723j4304j2998j2733j3085j3136
$$ 1019934 1000754 982219 964838 948259 931926 916203 901899 888901 876168 863083 849947
60916H49947j2874j2745j2461j1433j0023r293r489r767r448q759q121p512o820
$$ 849947 837073 824328 811867 800434 790411 781118 771629 761862 752414 743655 735534 728022 721202
60903G21202o305o248o462o443n991n455n379n827o213n942n309n256o110p020
$$ 721202 714897 708649 702187 695744 689753 684298 678919 673092 666879 660937 655628 650372 644262 637242
60889F37242o985o059n054m490m408m815n583o027n476m263l491l655m095l965
$$ 637242 630257 624198 619144 614654 610246 605431 599848 593821 588345 584082 580591 576936 572841 568876
60875E68876l141j980q35j02k31j142k032k123j441n52J89P64J185J431J589J690
$$ 568876 565735 563755 562920 562818 562587 561445 559413 557290 555849 555297 555486 556250 557435 558866 560455 562145
60859E62145J516Q94Q8m60p19j025j479j805j844j820j888j866j707j909k963
$$ 562145 563661 564555 564643 564183 563464 562439 560960 559155 557311 555491 553603 551737 550030 548121 545158
60844E45158m515n604n781n554n550n750n820n832o124o691p162p326p230o730
$$ 545158 540643 535039 529258 523704 518154 512404 506584 500752 494628 487937 480775 473449 466219 459489
60830D59489n535l838k490k218k864l646m014m038m035m066l865l234k466k157
$$ 459489 453954 450116 447626 445408 442544 438898 434884 430846 426811 422745 418880 415646 413180 411023
60816D11023k519l031l006k362j538q04j27M30O32M53J06l33q96j279j030k62
$$ 411023 408504 405473 402467 400105 398567 397763 397636 398066 398698 399151 399257 398924 398028 396749 395719 395457
60800C95457L90O75R82J442J556J029L85K06L07K11r2l77p39j283j709j803j947
$$ 395457 395847 396522 397504 398946 400502 401531 401916 402122 402429 402640 402548 402171 401432 400149 398440 396637 394690
60783C94690k501l066l093k816k811k948k666k065j766j814j637j141q95j061
$$ 394690 392189 389123 386030 383214 380403 377455 374789 372724 370958 369144 367507 366366 365471 364410
60769C64410j036m56K39N15L75j6o66j376j680j462j139q97m16L64Q49N98K1k88
$$ 364410 363374 362918 363157 363672 364047 364031 363365 361989 360309 358847 357708 356811 356395 356759 357608 358206 358227 357939
60751C57939l49m78o29n94n11n12k49N96J574J929J636J353J318J031J58q71j467
$$ 357939 357590 357112 356483 355889 355378 354866 354617 355213 356787 358716 360352 361705 363023 364054 364212 363341 361874
60734C61874j646j851k188k241j630n21N09J012J022Q60O94M39J00o3J17M25N59
$$ 361874 360228 358377 356189 353948 352318 351797 352306 353318 354340 355200 355894 356333 356433 356370 356487 356912 357471
60717C57471O24R65J478J477M94r43j721j344m82j99q30j855k676l132l232k815
$$ 357471 358095 359060 360538 362015 362509 361566 359845 358501 358019 357820 356990 355135 352459 349327 346095 343280
60701C43280j848q32n10j095j968k264j719q88m99o88r19o99j52L16O91J193J605
$$ 343280 341432 340600 340090 338995 337027 334763 333044 332156 331657 330969 330050 329351 329199 329515 330206 331399 333004
60684C33004J369N82J89Q03J802K165J782J324J182J215J418J961K597K627J762
$$ 333004 334373 334955 335144 335947 337749 339914 341696 343020 344202 345417 346835 348796 351393 354020 355782
60669C55782M81o03j312j773k080k275k301j947j097p6O24Q86Q74N62j17o84m07
$$ 355782 356263 355660 354348 352575 350495 348220 345919 343972 342875 342799 343423 344309 345183 345745 345628 344944 344537
60652C44537P15J838K324K341K274K200K170K335K409J699J50j203j437r54q37
$$ 344537 345252 347090 349414 351755 354029 356229 358399 360734 363143 364842 364992 363789 362352 361398 360561
60637C60561j360j853j885j782j907k060j841j240o27l50m82p99q87m61L17R03
$$ 360561 359201 357348 355463 353681 351774 349714 347873 346633 346006 345656 345174 344375 343488 343027 343344 344247
60621C44247Q97M77K24M61P67M41n86j498j498o81J93O51P52O10K25j54r2M08
$$ 344247 345144 345621 345845 346306 347073 347514 346928 345430 343932 343251 343444 344095 344847 345457 345682 345528 345436 345844
60603C45844P85O87M51N76R85J157Q37L63K95Q46J590J822J329O58M04N06N83
$$ 345844 346629 347316 347767 348343 349328 350485 351322 351685 351980 352826 354416 356238 357567 358225 358629 359135 359718
60586C59718O21Q06R34P52P20J514K753L265K804K429K792L147K762K281K665
$$ 359718 360339 361145 362079 362831 363551 365065 367818 371083 373887 376316 379108 382255 385017 387298 389963
60571C89963L586M021L960M370N620O960P615P502O890O026N182M431L369J602
$$ 389963 393549 397570 401530 405900 411520 418480 426095 433597 440487 446513 451695 456126 459495 461097
60557D61097m91k049k703k680k087q83M37J069J049J402K716M247M968M995N330
$$ 461097 460606 458557 455854 453174 451087 450204 450641 451710 452759 454161 456877 461124 466092 471087 476417
60542D76417O435P710Q378Q451Q651R589J1177J2743J3585J3403J2244J0288P822
$$ 476417 482852 490562 498940 507391 516042 525631 536808 549551 563136 576539 588783 599071 606893
60529F06893N306L175J487o3j723l354m590n245n505n683n843n696n072m265l687
$$ 606893 612199 615374 616861 616798 615075 611721 607131 601886 596381 590698 584855 579159 574087 569822 566135
60514E66135l213k314q91N02J501K527M103N959P347Q110Q943J0590J3142J6109
$$ 566135 562922 560608 559717 560219 561720 564247 568350 574309 581656 589766 598709 609299 622441 638550
60500F38550J8895K1136K2878K4432K5944K7186K7832K7746K6857K5012K2288
$$ 638550 657445 678581 701459 725891 751835 779021 806853 834599 861456 886468 908756
60489I08756J9119J5743J1737O512J90o418j2602j8130k2971k7057l0327l2666
$$ 908756 927875 943618 955355 961867 962057 955639 943037 924907 901936 874879 844552 811886
60477H11886l3814l3654l2519l0930k9077k6895k4499k2151j9906j7641j5417
$$ 811886 778072 744418 711899 680969 651892 624997 600498 578347 558441 540800 525383
60466E25383j3399j1483r480p611o376n878n684n453n262n205n062m636m131l910
$$ 525383 511984 500501 491021 483410 477034 471156 465472 460019 454757 449552 444490 439854 435723 431813
60452D31813m045m204l959l190k279j862k167k722k820k214j176j68L17q9j157
$$ 431813 427768 423564 419605 416415 414136 412274 410107 407385 404565 402351 401175 401007 401324 401235 400078
60437D00078k022k076j728j731j960j627o27K00K52j44m90p77r85o96J97R45Q35
$$ 400078 398056 395980 394252 392521 390561 388934 388307 388507 388759 388615 388125 387348 386363 385667 385864 386809 387644
60420C87644K35L1L72P06Q33J092J519J657J453J550K236K778K368J300N22L00
$$ 387644 387879 387910 388282 388988 389821 390913 392432 394089 395542 397092 399328 402106 404474 405774 406296 406596
60404D06596J07k57l32L6K54l9k59J65P37O54K40N74J803K864L037K731K434J935
$$ 406596 406703 406446 406114 406150 406404 406365 406106 406271 407008 407662 407902 408476 410279 413143 416180 418911 421345 423280
60386D23280J156Q15J411K281K520K303K325K418J826O58j2L89J265J837K016
$$ 423280 424436 425251 426662 428943 431463 433766 436091 438509 440335 440993 440981 441370 442635 444472 446488
60371D46488K036J941J739J604J619J657J669J709J679J374Q81N34N10Q38J635
$$ 446488 448524 450465 452204 453808 455427 457084 458753 460462 462141 463515 464396 464930 465440 466278 467913
60356D67913K833L816M003L737L878M470M592L746K574J819J318M97o30j598k191
$$ 467913 470746 474562 478565 482302 486180 490650 495242 498988 501562 503381 504699 505196 504566 502968 500777
60341E00777k494k506k169j665j265j026r19j067j589k307k867l061k937k631
$$ 500777 498283 495777 493608 491943 490678 489652 488733 487666 486077 483770 480903 477842 474905 472274
60327D72274k183j489m98M02M95m14j420j370j74J255K345L374M521N234N016
$$ 472274 470091 468602 468104 468506 469001 468587 467167 465797 465623 466878 469223 472597 477118 482352 487368
60312D87368M252L697L548L533L560L781M172M467M526M474M570M977N459N307
$$ 487368 491620 495317 498865 502398 505958 509739 513911 518378 522904 527378 531948 536925 542384 547691
60298E47691L842J193j785m336o191p197p190o508n970n915n847n286m460l725
$$ 547691 551533 552726 550941 546605 540414 533217 526027 519519 513549 507634 501787 496501 492041 488316
60284D88316k917j906j241j460k123k299j856j578j990k757l245l196k725k117
$$ 488316 485399 483493 482252 480792 478669 476370 474514 472936 470946 468189 464944 461748 459023 456906
60270D56906j680j520j421j205j109j475k136k532k377j859j245o35j40J03J78
$$ 456906 455226 453706 452285 451080 449971 448496 446360 443828 441451 439592 438347 437712 437572 437675 437853
60255D37853L40O67J024J379J866K430K663K184J099L4l27J38P76P32q8q45p52
$$ 437853 438193 438860 439884 441263 443129 445559 448222 450406 451505 451539 451212 451350 452126 452858 452770 451925 451173
60238D51173m9L11j22q16r43k60P84J570J831J731J585J553J684K150L102M206
$$ 451173 451124 451435 451313 450497 449554 449294 450078 451648 453479 455210 456795 458348 460032 462182 465284 469490
60222D69490M666M069K993K431K691L218L479L622M116M972N626N560M931M399
$$ 469490 474156 478225 481218 483649 486340 489558 493037 496659 500775 505747 511373 516933 521864 526263
60208E26263M391M646M698M559M681N201N656N524M813L927L267L052L189L119
$$ 526263 530654 535300 539998 544557 549238 554439 560095 565619 570432 574359 577626 580678 583867 586986
60194E86986K185M96r20j217p58o25j268k182k788l131l492l825l862l662l645
$$ 586986 589171 589667 588747 587530 586772 586147 584879 582697 579909 576778 573286 569461 565599 561937 558292
60179E58292m069m581m581l899l007k423k156j932j762j856k063j924j302n35
$$ 558292 554223 549642 545061 541162 538155 535732 533576 531644 529882 528026 525963 524039 522737 522202
60165E22202J19O70R74P03L8k41J98P10N99J58J10M65O37M47K86L77N89R34J549
$$ 522202 522321 522991 523965 524668 524706 524465 524663 525373 525972 526130 526240 526705 527342 527789 528075 528452 529041 529975 531524
60146E31524K124K079J483J202J853L012L853M159M370M877N594O155O343O275
$$ 531524 533648 535727 537210 538412 540265 543277 547130 551289 555659 560536 566130 572285 578628 584903
60132E84903O224O254O117N616M951M434L991L290K325J511J106R06O37L98M09
$$ 584903 591127 597381 603498 609114 614065 618499 622490 625780 628105 629616 630722 631628 632265 632663 633072
60117F33072O37Q10P58M89J10k31m30n88r68j579j985j825j439j609k527l423
$$ 633072 633709 634519 635277 635766 635876 635645 635215 634627 633659 632080 630095 628270 626831 625222 622695 619272
60101F19272l450k748k207k408l139l859m086l400j790j91J31q15j474p47M83
$$ 619272 615822 613074 610867 608459 605320 601461 597375 593975 592185 591994 592125 591310 589836 589089 589572
60086E89572P02L4r5P38J444J257P14M28K09n2K22J100J396R4k237m323n783o918
$$ 589572 590274 590308 590213 590951 592395 593652 594366 594794 595003 594951 595173 596273 597669 597763 595526 591203 585420 578502
60068E78502p573p399o728o194n718m957m393m780n717n927n039l998l577l471
$$ 578502 570929 563530 556802 550608 544890 539933 535540 530760 525043 519116 514077 510079 506502 503031
60054E03031l084k308j275j60N93O30M71J112K565L621L443K616K226K577L267
$$ 503031 499947 497639 496364 496204 496797 497427 497898 499010 501575 505196 508639 511255 513481 516058 519325
60039E19325L876M124L889L532L644M027L595J856j03q61n24n02j661l455m949
$$ 519325 523201 527325 531214 534746 538390 542417 546012 547868 547765 546904 546380 545878 544217 540762 535813
60024E35813n910o627p206p436p218o758o348o060n773n438n202n166n134m813
$$ 535813 529903 523276 516070 508634 501416 494658 488310 482250 476477 471039 465837 460671 455537 450724
60010D50724m173l404k556j509l70M03L76m03j377j799j224L6J055J202Q67R13
$$ 450724 446551 443147 440591 439082 438712 439115 439491 439088 437711 435912 434688 434724 435779 436981 437848 438761
59994D38761J539K098K070J721J618J941K454K843K849K406J758J249R41P05O14
$$ 438761 440300 442398 444468 446189 447807 449748 452202 455045 457894 460300 462058 463307 464248 464953 465567
59979D65567P97Q73K22j003j760j405n63k51o02r95j067r07m46O06K142L563M404
$$ 465567 466364 467237 467459 466456 464696 463291 462728 462477 461875 460880 459813 458906 458460 459066 461208 464771 469175
59962D69175M704M628M184L524L144L390L973M233L825K945J904P67n00j743k613
$$ 469175 473879 478507 482691 486215 489359 492749 496722 500955 504780 507725 509629 510396 509896 508153 505540
59947E05540k823k327j389n59m08j032j879k285k171j959j834j538r30k49L83
$$ 505540 502717 500390 499001 498442 498034 497002 495123 492838 490667 488708 486874 485336 484406 484157 484540
59932D84540J301K700M098M781M567L724K415Q00n84j117q41m23l95p14j053j118
$$ 484540 485841 488541 492639 497420 501987 505711 508126 508926 508342 507225 506384 505961 505566 504852 503799 502681
59916E02681p84k20K17N70J378K796L939L900L140L025L948M899N031M635M216
$$ 502681 501897 501677 501894 502464 503842 506638 510577 514477 517617 520642 524590 529489 534520 539155 543371
59901E43371L494K026K12j027j325j093q56q39j016j174j036m82L73J313K062
$$ 543371 546865 548891 549103 548076 546751 545658 544802 543963 542947 541773 540737 540255 540628 541941 544003
59886E44003K259J863J534K014L093L846L997M316N263O112N923M745L253J857
$$ 544003 546262 548125 549659 551673 554766 558612 562609 566925 572188 578300 584223 588968 592221 594078
59872E94078Q08N58J064J221Q0j581j908l38J630K310J657Q38O52R29J128R44
$$ 594078 594886 595444 596508 597729 597809 596228 594320 593982 595612 597922 599579 600417 601069 601998 603126 604070
59856F04070L86l07p04m02N99J795K578K787K751K683K254J115l13j022o08K71
$$ 604070 604456 604149 603445 603043 603642 605437 608015 610802 613553 616236 618490 619605 619292 618270 617662 617933
59840F17933P82P80M97r7j025j798j878j451j133r63m61L42O60j0j214k231k943
$$ 617933 618715 619495 619992 619895 618870 617072 615194 613743 612610 611647 611186 611528 612188 612178 610964 608733 605790
59823F05790l618m227m540m659m962n519n934n859n326m525l496k317j351j050
$$ 605790 602172 597945 593405 588746 583784 578265 572331 566472 561146 556621 553125 550808 549457 548407
59809E48407j472k115k368k007j294o57l82n15r13j335j522j351r24n22l58l38
$$ 548407 546935 544820 542452 540445 539151 538494 538112 537597 536684 535349 533827 532476 531552 531030 530672 530334
59793E30334j66J97L72Po78j108j096r51q46n31Q7N79O02M61O34R94J114J035
$$ 530334 530168 530365 530737 530744 530066 528958 527862 526911 526065 525534 525621 526200 526802 527263 527897 528891 530005 531040
59775E31040J111J194P57j13n47pR86J560J518J303J273J423J646J947K363K859
$$ 531040 532151 533345 534102 533989 533442 533435 534421 535981 537499 538802 540075 541498 543144 545091 547454 550313
59759E50313L319L659L994M581N493O432P118P637Q153Q543Q693Q888R366R658
$$ 550313 553632 557291 561285 565866 571359 577791 584909 592546 600699 609242 617935 626823 636189 645847
59745F45847R046P658O435O010O148O340O270N629M235K548J375Q63M42q5k50
$$ 645847 654893 662551 668986 674996 681144 687484 693754 699383 703618 706166 707541 708404 708846 708761 708511
59730G08511l6l24j625l095l596l168k728k758l016l240l422l554l670l933m297
$$ 708511 708475 708151 706526 703431 699835 696667 693939 691181 688165 684925 681503 677949 674279 670346 666049
59715F66049m327l825l255l077l033k695k300k302k406j873p59jj06m41j17Q72
$$ 666049 661722 657897 654642 651565 648532 645837 643537 641235 638829 636956 636197 636196 636090 635649 635532 636404
59699F36404J746J919J602J452J765K181K248K052J980J982J633R38M17K08j10
$$ 636404 638150 640069 641671 643123 644888 647069 649317 651369 653349 655331 656964 657902 658319 658527 658417
59684F58417n96n66K62J105J262J144J313J145l75k907m962n697n415m508l111
$$ 658417 657821 657255 657517 658622 659884 661028 662341 663486 663111 660204 655242 649545 644130 639622 636511
59669F36511j964k229l896n399n424m348l324k687k021j282q87q78o91M8R64J364
$$ 636511 634547 632318 628422 623023 617599 613251 609927 607240 605219 603937 603050 602172 601481 601529 602493 603857
59653F03857J003L11p4P8M36M94J9q99k012k975l494l627l837m350m695m267l269
$$ 603857 604860 605171 605097 605175 605611 606105 606124 605225 603213 600238 596744 593117 589280 584930 580235 575968 572699
59636E72699k600k788l444l852l703l103k317j724j735k416l325l899l947l660
$$ 572699 570099 567311 563867 560015 556312 553209 550892 549168 547433 545017 541692 537793 533846 530186
59622E30186l259k827k448k315k584l135l545l485l081k748k609k345j682q27
$$ 530186 526927 524100 521652 519337 516753 513618 510073 506588 503507 500759 498150 495805 494123 493296
59608D93296k51j86m57o94n85m0P06J289J594J760J856J725J302P98M51L62N89
$$ 493296 493045 492859 492402 491708 491123 491083 491789 493078 494672 496432 498288 500013 501315 502113 502564 502926 503515
59591E03515J108J589J630J274R22O45K21j58N7P36Q82mj099j460j294j315j457
$$ 503515 504623 506212 507842 509116 510038 510683 510904 510746 510803 511539 512421 512417 511318 509858 508564 507249 505792
59574E05792j225q29r43j549j951j874j623j284o17K37P58Q22P77P22M40K8j69
$$ 505792 504567 503738 502795 501246 499295 497421 495798 494514 493897 494134 494892 495714 496491 497213 497653 497681 497512
59557D97512k56n90r10n43L90R52Q21Q21J604K668L243L401L662M116M653N513
$$ 497512 497256 496666 495756 495213 495603 496555 497376 498197 499801 502469 505712 509113 512775 516891 521544 527057
59541E27057O884Q263R042R492J0288J1087J0331P024K144k122m403m953m668
$$ 527057 533941 542204 551246 560738 571026 582113 592444 599468 601612 599490 595087 590134 585466
59528E85466l965k918j907j382j076k45J166K183K019J067K67p8l15p10j265k059
$$ 585466 581501 578583 576676 575294 574218 573973 575139 577322 579341 580408 580675 580597 580282 579572 578307 576248
59512E76248l096m006m415m545m893n463n810n699n217m374l207k152j733j882
$$ 576248 573152 569146 564731 560186 555293 549830 544020 538321 533104 528730 525523 523371 521638 519756
59498E19756k015j769j174l12O55J232J023L34k00m90q05q98j84J166K141K190
$$ 519756 517741 515972 514798 514486 515141 516373 517396 517730 517530 517040 516235 515337 515153 516319 518460 520650
59482E20650J871J936K412K887L161L236L132K998L092L375L437L048K437J934
$$ 520650 522521 524457 526869 529756 532917 536153 539285 542283 545375 548750 552187 555235 557672 559606
59468E59606J597J379J314J421J557J553J389J317J745K788L798L920L308L198
$$ 559606 561203 562582 563896 565317 566874 568427 569816 571133 572878 575666 579464 583384 586692 589890
59454E89890M212N349N368M555M071M096L851L241L016L266L054J863L50p62j512
$$ 589890 594102 599451 604819 609374 613445 617541 621392 624633 627649 630915 633969 635832 636182 635420 633908
59439F33908k061k206j993j909j954j420j24R64R62K76n7L88J416K828M409N742
$$ 633908 631847 629641 627648 625739 623785 622365 622241 623205 624167 624443 624386 624774 626190 629018 633427 639169
59423F39169O752Q017R928J1856J2858J2993J3275J4374J5991J7613J9286K1090
$$ 639169 645921 653938 663866 675722 688580 701573 714848 729222 745213 762826 782112 803202
59411H03202K2051K0279J4801P124L27l546m794m772m266l428k260l77K651N714
$$ 803202 825253 845532 860333 867457 867784 864238 859444 854672 850406 846978 844718 844341 846992 852706
59397H52706N888J338o062j2462j5987j7454j7760j6756j4813j3285j2645j1838
$$ 852706 858594 859932 853870 841408 825421 807967 790207 773451 758638 745353 732708 720870
59385G20870j0230q651p779o977n675m501m058l770k976k101j713j451q32j71
$$ 720870 710640 701989 694210 687233 681558 677057 672999 669229 666253 664152 662439 660988 660156 659985
59371F59985K25P89J762K435K348K197K641L101K918K671L167L971M235M253M812
$$ 659985 660210 660999 662761 665196 667544 669741 672382 675483 678401 681072 684239 688210 692445 696698 701510
59356G01510N672O033O086O705P903Q826R106R129R157R136R198R433R443Q874
$$ 701510 707182 713215 719301 726006 733909 742735 751841 760970 770127 779263 788461 797894 807337 816211
59342H16211Q060P355O330M543K540J048l35k463n103p242q670r956j1124j1628
$$ 816211 824271 831626 837956 842499 845039 846087 845752 843289 838186 830944 822274 812318 801194 789566
59328G89566j1539j1552j1743j1453j0506r477q635p684o719o380o713o822o047
$$ 789566 778027 766475 754732 743279 732773 723296 714661 706977 700258 693878 687165 680343 674296
59315F74296m826l963l597l274k643j722p43J46J096K375L857M993N578O069O760
$$ 674296 669470 665507 661910 658636 655993 654271 653528 653674 654770 657145 661002 665995 671573 677642 684402
59300F84402O974N728K867r03m775q094j0175j0630r734q083o154m446l519l404
$$ 684402 691376 697104 699971 699068 694293 686199 676024 665394 655660 647577 641423 636977 633458 630054
59286F30054l414l047k520j978r47P81K469L409L873M372M741M897N633P460R362
$$ 630054 626640 623593 621073 619095 618148 618929 621398 624807 628680 633052 637793 642690 648323 655783 665145
59271F65145R958R403Q934R040R302R541R739R266P556N336L829L076K320J575
$$ 665145 675103 684506 693440 702480 711782 721323 731062 740328 747884 753220 757049 760125 762445 764020
59257G64020J362J176J1j762k743k783l113m043m305l275k182k304l296m045m113
$$ 764020 765382 766558 766569 764807 762064 759281 756168 752125 747820 744545 742363 740059 736763 732718 728605
59242G28605l697l108k861l370m121m074l176k454k360k212j698j668k752m299
$$ 728605 724908 721800 718939 715569 711448 707374 704198 701744 699384 697172 695474 693806 691054 686755
59228F86755n439o179o726o676n786m775m473m674m610m132l721l684l846l875
$$ 686755 681316 675137 668411 661735 655949 651174 646701 642027 637417 633285 629564 625880 622034 618159
59214F18159l591l084k644k311j631m29M57N8j200j844j269l52J1p8k36m90q50
$$ 618159 614568 611484 608840 606529 604898 604469 604926 604984 603784 601940 600671 600319 600330 600252 600016 599526 598676
59197E98676j042j096j360j696j499p90k95k23j2L74J16r14j489p12O46J338J311
$$ 598676 597634 596538 595178 593482 591983 591193 590898 590675 590663 591037 591153 590239 588750 588038 588684 590022 591333
59180E91333J315J584J783J725J384O26m13j121j144q94q45q49n41P4Q29J628
$$ 591333 592648 594232 596015 597740 599124 599750 599337 598216 597072 596178 595333 594484 593943 594017 594846 596474
59164E96474K112J742N93n35j109j320j377j211j155j907l322m284m308m256m776
$$ 596474 598586 600328 600921 600386 599277 597957 596580 595369 594214 592307 588985 584701 580393 576137 571361
59149E71361n161m567l422k665k405k325k666l668m688m846m153l170k099j109
$$ 571361 566200 561633 558211 555546 553141 550816 548150 544482 539794 534948 530795 527625 525526 524417
59135E24417q39j502k046j356J32J064J086R95J319J848K505L456M403M729M581
$$ 524417 523578 522076 520030 518674 518806 519870 520956 521951 523270 525118 527623 531079 535482 540211 544792
59120E44792M810N673O367O174N451N082N394N881N770M774L487K874L240L917
$$ 544792 549602 555275 561642 567816 573267 578349 583743 589624 595394 600168 603655 606529 609769 613686
59106F13686M203M205M292M207L394J963O78k9l99p13q80p91o34o90j031j521
$$ 613686 617889 622094 626386 630593 633987 635950 636628 636599 636200 635487 634607 633816 633182 632492 631461 629940
59090F29940j998k379k640k712k460j954j615j817k373k838l171l567l854l742
$$ 629940 627942 625563 622923 620211 617751 615797 614182 612365 609992 607154 603983 600416 596562 592820
59076E92820l665m381n594n966m903l408k636k536k529k597k823k662j718o83
$$ 592820 589155 584774 579180 573214 568311 564903 562267 559731 557202 554605 551782 549120 547402 546719
59062E46719m73q61r43o45o81j186j465j119n57k20m5J24J81J15K31P85J572K071
$$ 546719 546246 545385 544442 543797 543116 541930 540465 539346 538789 538569 538524 538648 538829 538944 539175 539960 541532 543603
59044E43603J880J050Q7m50m48j88J42N97J150J658K206K972L698L861L533L469
$$ 543603 545483 546533 546620 546170 545722 545534 545676 546273 547423 549081 551287 554259 557957 561818 565351 568820
59028E68820M059M960N927P241Q844R931J0065R991J0597J1599J1954J1158R442
$$ 568820 572879 577839 583766 591007 599851 609782 619847 629838 640435 652034 663988 675146 684588
59015F84588P113M385J582r69l024m188m153l493l433m279m847m121k720j880
$$ 684588 691701 696086 697668 696699 693675 689487 685334 681841 678408 674129 669282 665161 662441 660561
59001F60561j672j250l65M18P41Q05Q77J139J751K424K355J240l7m64k02n2j09
$$ 660561 658889 657639 657274 657692 658433 659238 660115 661254 663005 665429 667784 669024 668987 668523 668321 668269 668160
58984F68160J31O93J089J210J376J684K073K790M020N310O105O590P175P493O961
$$ 668160 668291 668984 670073 671283 672659 674343 676416 679206 683226 688536 694641 701231 708406 715899 722860
58969G22860O077O068P142Q152Q138P363O592O066N554M914M194L394K283N10
$$ 722860 728937 735005 742147 750299 758437 765800 772392 778458 784012 788926 793120 796514 798797 799307
58955G99307j916m313n899o793p759q858r251q797q698r721j0777j0401q845p443
$$ 799307 797391 793078 787179 780386 772627 763769 754518 745721 737023 727302 716525 706124 697279 689836
58941F89836o547n528m352l633l261k447j158j97K30P99J729K396K530K655L015
$$ 689836 683289 677761 673409 669776 666515 664068 662910 662713 662943 663742 665471 667867 670397 673052 676067
58926F76067L090K582J898J271L47r36j854j863j369j075j078j101j111j230j338
$$ 676067 679157 681739 683637 684908 685255 684319 682465 680602 679233 678158 677080 675979 674868 673638 672300
58911F72300j121m15O88J885K835L534M342N453O534P233P753Q395Q866Q683Q056
$$ 672300 671179 670764 671452 673337 676172 679706 684048 689501 696035 703268 711021 719416 728282 736965 745021
58896G45021P662P662P683P686Q121R115J0122J0605J0603J0566J0904J1639J2166
$$ 745021 752683 760345 768028 775714 783835 792950 803072 813677 824280 834846 845750 857389 869555
58883H69555J1599R697P237N131L526K181J108L11o90k337m336o109p478q280
$$ 869555 881154 890851 898088 903219 906745 908926 910034 910345 909655 907318 902982 896873 889395 881115
58869H81115p940o333m601m101m753n313n090m476m034l948m147m303l991l482
$$ 881115 873175 866842 862241 858140 853387 848074 842984 838508 834474 830526 826379 822076 818085 814603
58855H14603l841n367o677o448n361m986n325n121m271m037m822n455n188m872
$$ 814603 810762 805395 798718 792270 786909 781923 776598 771477 767206 763169 758347 752892 747704 742832
58841G42832n540p011q443r363r649r350q898q800q838q306p078n699m471l329
$$ 742832 737292 730281 721838 712475 702826 693476 684578 675778 666940 658634 651556 645857 641386 638057
58827F38057k488k196j929q95O22J559J686J705J798J478R94J403K802L815L475
$$ 638057 635569 633373 631444 630549 631171 632730 634416 636121 637919 639397 640391 641794 644596 648411 651886
58812F51886K377J469Q18J59l51o66j165j876k156j765j427j861k848l748m289
$$ 651886 654263 655732 656550 656709 656358 655692 654527 652651 650495 648730 647303 645442 642594 638846 634557
58797F34557m531m661n018n673n943n120l700k919l043l179k827k398k022j194
$$ 634557 630026 625365 620347 614674 608731 603611 599911 596992 593949 590770 587943 585545 583523 582329
58783E82329K7P79Q41J066J852K419K253K031K322K476J679J90j293k596l625
$$ 582329 582356 583135 583976 585042 586894 589313 591566 593597 595919 598395 600074 600264 598971 596375 592750
58768E92750l861l205k575k804l509l769l341k549j593o35q2l0N1N97J357J887
$$ 592750 588889 585684 583109 580305 576796 573027 569686 567137 565544 564909 564827 564797 564848 565445 566802 568689
58752E68689K144K212K003J572J209R18M31m7R0P92J184Q68N26Q32J496J866J800
$$ 568689 570833 573045 575048 576620 577829 578747 579178 579131 579221 580013 581197 582065 582591 583423 584919 586785 588585
58735E88585J497J151J085J661K728L727M441M952M962M149L151L001L502L429
$$ 588585 590082 591233 592318 593979 596707 600434 604875 609827 614789 618938 622089 625090 628592 632021
58721F32021K595K228K906L653L749L896M734N566N674N593N997O220N219L211
$$ 632021 634616 636844 639750 643403 647152 651048 655782 661348 667022 672615 678612 684832 690051 693262
58707F93262J153p24k781m858o365p246q069r284j0833j2228j2791j2316j1616
$$ 693262 694415 693691 690910 686052 679687 672441 664372 655088 644255 632027 619236 606920 595304
58694E95304j1624j1878j0892q433o178n576o068o224n610m750m061l648l518
$$ 595304 583680 571802 560910 552477 546299 540723 534655 528431 522821 518071 514010 510362 506844
58681E06844l371k795k061j896k199j964q90Q8M49R56K172L310L544L408L879
$$ 506844 503473 500678 498617 496721 494522 492558 491668 491756 492205 493161 495333 498643 502187 505595 509474
58666E09474M909N845O567P297P869P869O990M939J797j218k548k304k239l219
$$ 509474 514383 520228 526795 534092 541961 549830 556820 561759 563556 562338 559790 557486 555247 552028
58652E52028m123l931l436l765m571m845m494l979l379k752k518k611k225j204
$$ 552028 547905 543974 540538 536773 532202 527357 522863 518884 515505 512753 510235 507624 505399 504195
58638E04195m83m52k12O48J055L88j99K96Q60J47j301k051j943j676j268n25p1
$$ 504195 503712 503260 503048 503696 504751 505139 504940 505236 506096 506243 504942 502891 500948 499272 498004 497479 497408
58621D97408m22q73o54k01J04J189L574N648N649M420M141N031N465M876M345
$$ 497408 496986 496113 495459 495258 495362 496551 500125 505773 511422 515842 519983 525014 530479 535355 539700
58606E39700M446M484L973L271K579J745J049R68J158Q00j25q85j148j083o75
$$ 539700 544146 548630 552603 555874 558453 560198 561247 562215 563373 564173 564048 563163 562015 560932 560257
58591E60257J50J155K335M210O673Q375Q375P574P379P793Q096Q422R203R861
$$ 560257 560407 561562 563897 568107 574780 583155 591530 599104 606483 614276 622372 630794 639997 649858
58577F49858R599Q770Q101P318O078N374O282P989Q845Q798R065R960J0871J1958
$$ 649858 659457 668227 676328 683646 689724 695098 701380 709369 718214 727012 736077 746037 756908 768866
58563G68866J3952J6469J8257J8966J9162J8830J7431J5227J2947J0391O813K598
$$ 768866 782818 799287 817544 836510 855672 874502 891933 907160 920107 930498 937311 939909
58551I39909r68l350m917n692n410m596m225m479n031o095p986j0099j1651j2930
$$ 939909 938941 935591 930674 924982 919572 914976 910751 906272 901241 895146 887160 877061 865410 852480
58537H52480j4496j5840j6150j5752j5319j4452j2588j0604r710r516q850p829
$$ 852480 837984 822144 805994 790242 774923 760471 747883 737279 727569 718053 709203 701374
58525G01374p253o711n293l640l197l798m029l566l222l043k452j860k074k401
$$ 701374 694121 687410 682117 678477 675280 671482 667453 663887 660665 657622 655170 653310 651236 648835
58511F48835j515P2N48l28j044r51q68j073q37r4L16K59L35L31m28j264p35R71
$$ 648835 647320 647392 647940 647612 646568 645617 644749 643676 642839 642745 643061 643320 643655 643986 643558 642294 641559 642530
58493F42530K153K267K458L394M386M968N464N866N814N751O447P520Q096Q688
$$ 642530 644683 646950 649408 652802 657188 662156 667620 673486 679300 685051 691498 699018 707114 715802
58479G15802J0403J2613J3507J2862J2079J1503R934O969L718Q78j910m568o316
$$ 715802 726205 738818 752325 765187 777266 788769 798703 805672 809390 810268 808358 803790 797474
58466G97474p051p317o941n441l531k338j426L72K560L663L946M997O847P998
$$ 797474 790423 783106 776165 770724 767193 764855 763429 763801 766361 770024 773970 778967 785814 793812
58452G93812Q163Q354Q321O658L555P96j216l708o635q280q191p821p737o925
$$ 793812 801975 810329 818650 825308 828863 829659 828443 824735 818100 809820 801629 793808 786071 779146
58438G79146n331m423m440l793j929l75q8j73N8Q7l7P83K643M181M752M997N009
$$ 779146 773815 769392 764952 761159 759230 758855 758767 758594 758652 758739 758702 759485 762128 766309 771061 776058 781067
58421G81067M162K939K511K351Q21j671k944k697k937m333n203m723m151m109
$$ 781067 785229 788168 790679 793030 793851 792180 789236 786539 783602 779269 774066 769343 765192 761083
58407G61083l624k640k505l117k566n60P30J84p29p93m82J55J984M233M656L225
$$ 761083 757459 754819 752314 749197 746631 746071 746801 746985 746256 745463 744981 745136 747120 751353 756009 759234
58391G59234K560L600M191L109K101K461K932K576K558L384L442K068J131J923
$$ 759234 761794 765394 769585 772694 774795 777256 780188 782764 785322 788706 792148 794216 795347 797270
58377G97270L235M047N176O803P357O498O225P410Q208P532O971P650Q241P915
$$ 797270 800505 804552 809728 816531 823888 830386 836611 844021 852229 859761 866732 874382 882623 890538
58363H90538Q117R546J0438R771R200R913J0480R688Q665Q349P690O094M766M110
$$ 890538 898655 908201 918639 928410 937610 947523 958003 967691 976356 984705 992395 998489 1003255 1007365
58349A007365K824R95Q13K730M313M417M843O357P091O611P376J0022J1551J0573
$$ 1007365 1010189 1011184 1011997 1014727 1019040 1023457 1028300 1034657 1041748 1048359 1055735 1065757 1077308 1087881
58335A087881J0088J2243J4615J4708J4008J4409J4482J2801J1200J1298J1260
$$ 1087881 1097969 1110212 1124827 1139535 1153543 1167952 1182434 1195235 1206435 1217733 1228993
58324A228993R414P647P846Q294P058N699O207P387P565P816R341J0695J0694
$$ 1228993 1238407 1246054 1253900 1262194 1269252 1274951 1281158 1288545 1296110 1303926 1313267 1323962 1334656
58311A334656J0905J2477J3792J3976J5056J7869J9771J9301J9054K0809K2175
$$ 1334656 1345561 1358038 1371830 1385806 1400862 1418731 1438502 1457803 1476857 1497666 1519841
58300A519841K1353K0782K2435K4014K3522K3170K4852K6283K5588K5200K7006
$$ 1519841 1541194 1561976 1584411 1608425 1631947 1655117 1679969 1706252 1731840 1757040 1784046
58289A784046K8447K7617K7474L0349L3249L3396L3461L6271L9284L9642L9805
$$ 1784046 1812493 1840110 1867584 1897933 1931182 1964578 1998039 2034310 2073594 2113236 2153041
58278B153041M2703M6058M7107M8180N1824N5395N6353N7932O3326O9209P1606
$$ 2153041 2195744 2241802 2288909 2337089 2388913 2444308 2500661 2558593 2621919 2691128 2762734
58267B762734P3344P8920Q6683R2886R8850J07218J15761J21851J28522J39015
$$ 2762734 2836078 2914998 3001681 3094567 3193417 3300635 3416396 3538247 3666769 3805784
58257C805784J50044J57524J64113J73860J84506J92604K01095K14039K28969
$$ 3805784 3955828 4113352 4277465 4451325 4635831 4828435 5029530 5243569 5472538
58248E472538K42324K56917K76028K95669L11095L25146L41620L56764L66390
$$ 5472538 5714862 5971779 6247807 6543476 6854571 7179717 7521337 7878101 8244491
58239H244491L74819L87123L99218M05765M11029M21263M33468M42958M54607
$$ 8244491 8619310 9006433 9405651 9811416 10222445 10643708 11077176 11520134 11974741
58230A1974741M74755M99286N22303N48997N86652O30342O71172P10740P53279
$$ 11974741 12449496 12948782 13471085 14020082 14606734 15237076 15908248 16618988 17372267
58221A7372267P92088Q19529Q42364Q71301R04175R36057R75856J034220J104937
$$ 17372267 18164355 18983884 19826248 20697549 21601724 22537781 23513637 24547857 25652794
58212B5652794J178213J262228J370307J497609J633294J784520J964315K168881
$$ 25652794 26831007 28093235 29463542 30961151 32594445 34378965 36343280 38512161
58204C8512161K394604K664909L011311L442373L963673M612259N435127O450315
$$ 38512161 40906765 43571674 46582985 50025358 53989031 58601290 64036417 70486732
58196G0486732P665380R106293J0777801J2624304J4589374J6677240J8882144
$$ 70486732 78152112 87258405 98036206 110660510 125249884 141927124 160809268
58189A60809268K1111631K3277105K5325313K6859534K6674257K3093074J5279499
$$ 160809268 181920899 205198004 230523317 257382851 284057108 307150182 322429681
58182C22429681M334013p095438j6420790k2419115k5271823k5803001k4859311
$$ 322429681 326763694 319668256 303247466 280828351 255556528 229753527 204894216
58175B04894216k3118060k1053582j8914484j6787712j4722798j2779270j0994397
$$ 204894216 181776156 160722574 141808090 125020378 110297580 97518310 86523913
58168H6523913r380094p956712o746508n737425m891762m186814l615426l155439
$$ 86523913 77143819 69187107 62440599 56703174 51811412 47624598 44009172 40853733
58160D0853733k772962k451920k191427j978755j792030j625286j485270j367016
$$ 40853733 38080771 35628851 33437424 31458669 29666639 28041353 26556083 25189067
58152B5189067j255883j150135j059054r81433r06745q34825p74617p25422o77714
$$ 25189067 23933184 22783049 21723995 20742562 19835817 19000992 18226375 17500953 16823239
58143A6823239o30626n91463n59993n29485n01083m81337m67456m50251m29675
$$ 16823239 16192613 15601150 15041157 14511672 14010589 13529252 13061796 12611545 12181870
58134A2181870m12807l98643l79683l56915l38581l25066l08989k89682k74133
$$ 12181870 11769063 11370420 10990737 10633822 10295241 9970175 9661186 9371504 9097371
58125I097371k63648k52346k39025k28575k21300k12236k01369j93900j90144
$$ 9097371 8833723 8581377 8342352 8113777 7892477 7680241 7478872 7284972 7094828
58116G094828j85245j78786j74807j72624j67482j59953j54994j52027j45638
$$ 7094828 6909583 6730797 6555990 6383366 6215884 6055931 5900937 5748910 5603272
58107E603272j35917j28598j24775j19883j13047j08313j06177j02724r7746r5184
$$ 5603272 5467355 5338757 5213982 5094099 4981052 4872739 4766562 4663838 4566092 4470908
58097D470908r4958r2565q7476q3986q3201q1755p8961p7610p7349p4753p0389
$$ 4470908 4375950 4283385 4195909 4111923 4028722 3946967 3868006 3790396 3713047 3638294 3567905
58086C567905o8382o8675o7056o3265o1508o2456o2145n9556n8018n8242n7138
$$ 3567905 3499523 3430848 3363792 3300527 3239019 3176563 3114418 3054862 2996844 2938602 2881464
58075B881464n4389n3168n3427n1467m7219m4943m5568m5191m2569m1164m2205
$$ 2881464 2827075 2773907 2720480 2669013 2621794 2576851 2531283 2486092 2443523 2402359 2360154
58064B360154m2341m0112l8446l8690l8198l5868l4389l4914l4932l3374l2603
$$ 2360154 2317813 2277701 2239255 2200565 2162367 2126499 2092110 2057196 2022264 1988890 1956287
58053A956287l3500l3592l1855l0516l0477k9725k7718k6647k6954k6308k4330
$$ 1956287 1922787 1889195 1857340 1826824 1796347 1766622 1738904 1712257 1685303 1658995 1634665
58042A634665k3581k4597k4813k3583k3392k4715k4664k2236k0105j9630j8884
$$ 1634665 1611084 1586487 1561674 1538091 1514699 1489984 1465320 1443084 1422979 1403349 1384465
58031A384465j7271j7224j9483k1272k1066k0813k1611k1592j9932j8722j8978
$$ 1384465 1367194 1349970 1330487 1309215 1288149 1267336 1245725 1224133 1204201 1185479 1166501
58020A166501j8821j7430j6784j7689j8047j6805j5746j5748j5161j3496j2803
$$ 1166501 1147680 1130250 1113466 1095777 1077730 1060925 1045179 1029431 1014270 1000774 987971
58009I87971j3681j3848j2312j1108j1285j1057r626q901r679r982q908q225q545
$$ 987971 974290 960442 948130 937022 925737 914680 905054 896153 886474 876492 867584 859359 850814
57996H50814p861n727m690n680o119m762m219o169q145p834o861p401q427q355
$$ 850814 842953 837226 832536 826856 820737 815975 811756 805587 797442 789608 782747 775346 766919 758564
57982G58564q189r137r915r237q402q755r146q384p654q023q073o480m675m505
$$ 758564 750375 741238 731323 722086 713684 704929 695783 687399 679745 671722 663649 657169 652494 647989
57968F47989n382n905o167o463n944m492l783m565n138m281l341l611m055l546
$$ 647989 642607 636702 630535 624072 618128 613636 609853 605288 600150 595869 592528 588917 584862 581316
57954E81316l034l567m382m760n472o667o726n066l682m060m844m434l421k637
$$ 581316 578282 574715 570333 565573 560101 553434 546708 541642 537960 533900 529056 524622 521201 518564
57940E18564j332P69K003J438O99J252K107K149K215K862K545K75k217l212l728
$$ 518564 517232 518001 520004 521442 522141 523393 525500 527649 529864 532726 535271 535546 533329 530117 526389
57925E26389n278p085p831q141r071r933r815r371r178q259o212m783n179n879
$$ 526389 521111 514026 506195 498054 488983 479050 469235 459864 450686 442427 436215 431432 426253 420374
57911D20374n143l737l045k539j320k35k38n39m55j108l076m437l527j738j256
$$ 420374 415231 411494 408449 405910 404590 404355 404117 403578 403123 402015 398939 394502 390975 389237 387981
57896C87981j786j914j843k338k664j952j060q88n45O50J221r3j840k143j667
$$ 387981 386195 384281 382438 380100 377436 375484 374424 373536 372991 373641 374862 374769 372929 370786 369119
57881C69119j811j917r70j93j119k588k612j762j810k318j571K02J395J898K644
$$ 369119 367308 365391 364421 364228 363109 360521 357909 356147 354337 352019 350448 350650 352045 353943 356587
57866C56587L254K789K012K275K993K727J958K205L265L786L814M274M766M296
$$ 356587 359841 362630 364642 366917 369910 372637 374595 376800 380065 383851 387665 391939 396705 401001
57852D01001L490L547L793K723P92k77l53o24j186j311j465k591l955m092l358
$$ 401001 404491 408038 411831 414554 415346 415069 414716 414092 412906 411595 410130 407539 403584 399492 396134
57837C96134l239l701l578l028l115l455k777j386p48r50q24k23K7M1N74J248
$$ 396134 392895 389194 385616 382588 379473 376018 373241 371855 371107 370157 369333 369110 369137 369178 369752 371000
57821C71000J242J167K059L166L024K053J615J225n64l113m368m249m463n188
$$ 371000 372242 373409 375468 378634 381658 383711 385326 386551 385987 382874 378506 374257 369794 364606
57807C64606m871l401k480k624k560j996k131l015l110k210k086l400m504m297
$$ 364606 359735 356334 353854 351230 348670 346674 344543 341528 338418 336208 334122 330722 326218 321921
57793C21921l862m139m180l044j598j027j079r08m43J36J035K135K665K369K054
$$ 321921 318059 313920 309740 306696 305098 304071 302992 302084 301641 301777 302812 304947 307612 309981 312035
57778C12035K384L019L377L317K840J971J101N70l5j150k088j891j084j134k232
$$ 312035 314419 317438 320815 324132 326972 328943 330044 330614 330579 329429 327341 325450 324366 323232 321000
57763C21000l079k971k522k250j913j455j236j163p98m59p90j303p75P30J746
$$ 321000 317921 314950 312428 310178 308265 306810 305574 304411 303613 303154 302364 301061 300286 301016 302762
57748C02762J560J037J009J181J093R52J075J349J585J674J404P98M14O27J049
$$ 302762 304322 305359 306368 307549 308642 309594 310669 312018 313603 315277 316681 317479 317893 318520 319569
57733C19569J426K340L956N022M552L610L758M500M207K894J994J748J114K4m94
$$ 319569 320995 323335 327291 332313 336865 340475 344233 348733 352940 355834 357828 359576 360690 360714 360220
57718C60220l83o66j338j392r62j316k453k909k339k127k851l256k541j727j897
$$ 360220 359837 359171 357833 356441 355479 354163 351710 348801 346462 344335 341484 338228 335687 333960 332063
57703C32063k700l325l537l143j857k69M93M05M89R02P27j06m58O0N52O79J202
$$ 332063 329363 326038 322501 319358 317501 317232 317725 318130 318619 319521 320248 320142 319684 319744 320296 320975 322177
57686C22177K223K731K548K876M177N287N430N355N706O023O326P841J1027J4430
$$ 322177 324400 327131 329679 332555 336732 342019 347449 352804 358510 364533 370859 378700 389727 404157
57672D04157J6657J8076J9587K1197K2865K5175K7712K8005K3632J4694L337q227
$$ 404157 420814 438890 458477 479674 502539 527714 555426 583431 607063 621757 625094 616867
57660F16867j8242k5203k8552k9233k8569k7075k4812k2069j9107j5897j2741
$$ 616867 598625 573422 544870 515637 487068 459993 435181 413112 394005 378108 365367
57649C65367j0352q930p879o815n923n136m031k881k502k778k565j512o40o27
$$ 365367 355015 346085 338206 331391 325468 320332 316301 313420 310918 308140 305575 304063 303423 302796
57635C02796q98r81j276j818j776j042q59j881k949k854k116j881k110k083j803
$$ 302796 301898 300917 299641 297823 296047 295005 294146 292265 289316 286462 284346 282465 280355 278272 276469
57620B76469j736j813j702j461j230q95o30r83j829k155j457m77k7k5k22p83j480
$$ 276469 274733 272920 271218 269757 268527 267632 267002 266019 264190 262035 260578 260101 260074 260049 259827 259044 257564
57603B57564j434m66K82o8r48j397j391j364j322j192j258j539j569j316j397
$$ 257564 256130 255664 255946 255878 254930 253533 252142 250778 249456 248264 247006 245467 243898 242582 241185
57588B41185j898k053j588j219j312j244p67o45j213j578j158p02q53r68m55o9
$$ 241185 239287 237234 235646 234427 233115 231871 231104 230459 229246 227668 226510 225808 224955 223987 223532 223463
57572B23463o58j650j975j611j132n91J25O09N90M62M02j34j158j587q67k7p0
$$ 223463 222805 221155 219180 217569 216437 215846 215971 216580 217170 217632 218034 217900 216742 215155 214288 214261 214191
57555B14191l76O1Q82J166J003R90R64N53K12M27O19J19n17m86k37o28j221r51
$$ 214191 213815 213876 214758 215924 216927 217917 218881 219434 219646 220073 220692 220811 220294 219808 219571 218943 217722 216771
57537B16771o6J55o33j477j669j483j337j220r84n65M1N81O51L90M72R93J142
$$ 216771 216705 216860 216227 214750 213081 211598 210261 209041 208057 207492 207533 208114 208765 209155 209627 210620 211762
57520B11762N29o8j3J81j8j0P69J569J443R12J086J795J958J415R74R58R39P78
$$ 211762 212291 212223 212210 212391 212373 212363 213132 214701 216144 217056 218142 219937 221895 223310 224284 225242 226181 226959
57502B26959P47O77M3j126k154k520k192j385n50j93k53j13L66N57K40J48O41
$$ 226959 227706 228383 228426 227300 225146 222626 220434 219049 218499 218306 218053 217940 218306 218863 219103 219251 219892
57485B19892R28M56N4N94J462J628J333J406J646J288N58K71L05r6p88q59j36
$$ 219892 220820 221276 221330 221924 223386 225014 226347 227753 229399 230687 231245 231516 231821 231725 230937 230078 229942
57468B29942N46O16K57j85m50k65J94J09q80j818j633p01k06m20o70o49o39o61
$$ 229942 230488 231104 231361 231176 230726 230461 230655 230764 229884 228066 226433 225732 225526 225106 224436 223787 223148 222487
57450B22487m38k9L05N80P76N24j48l57M35J437J710J641K023K481K111J202Q05
$$ 222487 222049 222020 222325 222905 223681 224205 224057 223700 224135 225572 227282 228923 230946 233427 235538 236740 237545
57433B37545R92R03L79J32M25O97N89K89k0j92J44R42J259L90q61j149m27K80
$$ 237545 238537 239440 239819 239951 240376 241073 241662 241951 241931 241739 241883 242825 244084 244474 243613 242464 242037 242317
57415B42317N31P36J060J357J892K869L480K692R39j87QP59J210J289J167Q95
$$ 242317 242848 243584 244644 246001 247893 250762 254242 256934 257873 257686 257694 258453 259663 260952 262119 263014
57399B63014P06Q17R93R61J080J774K665L050K952K808K557K015J706K290L493
$$ 263014 263720 264537 265530 266491 267571 269345 272010 275060 278012 280820 283377 285392 287098 289388 292881
57384B92881M525N147N366M838L625K916L587M653M523L293K285J910J595J427
$$ 292881 297406 302553 307919 312757 316382 319298 322885 327538 332061 335354 337639 339549 341144 342571
57370C42571K043L061L357K862K561K746K845K869L332L824L317K091J597K233
$$ 342571 344614 347675 351032 353894 356455 359201 362046 364915 368247 372071 375388 377479 379076 381309
57356C81309K937L180L626M398M512L678L061L469M193M418M448M693M635L821
$$ 381309 384246 387426 391052 395450 399962 403640 406701 410170 414363 418781 423229 427922 432557 436378
57342D36378K935K933L738M533M839M786M724N019N777O523O633O084N406M944
$$ 436378 439313 442246 445984 450517 455356 460142 464866 469885 475662 482185 488818 494902 500308 505252
57328E05252M749M948N555O086O155O115O387O543O088N660O219P393P906P531
$$ 505252 510001 514949 520504 526590 532745 538860 545247 551790 557878 563538 569757 577150 585056 592587
57314E92587P206P347P438P260P174P115O642O042O099O688O974O991P583Q601
$$ 592587 599793 607140 614578 621838 629012 636127 642769 648811 654910 661598 668572 675563 683146 691747
57300F91747Q771P692O573O514P279Q199R022R514R324Q746Q608R089R548R691
$$ 691747 700518 708210 714783 721297 728576 736775 745797 755311 764635 773381 781989 791078 800626 810317
57286H10317R878J0163J0208J0167J0610J1370J1642J1275J0833J0415R655Q842
$$ 810317 820195 830358 840566 850733 861343 872713 884355 895630 906463 916878 926533 935375
57274I35375Q693Q988Q843Q374Q534R294R576R240R433J0593J1696J1968J1887
$$ 935375 944068 953056 961899 970273 978807 988101 997677 1006917 1016350 1026943 1038639 1050607 1062494
57261A062494J2054J2435J3015J3951J4737J4641J4095J4257J5102J5588J5723
$$ 1062494 1074548 1086983 1099998 1113949 1128686 1143327 1157422 1171679 1186781 1202369 1218092
57250A218092J6605J8202J9069J8796J8755J9853K1275K2125K2516K2463K1518
$$ 1218092 1234697 1252899 1271968 1290764 1309519 1329372 1350647 1372772 1395288 1417751 1439269
57239A439269K0150J9701K0346K0885K1029K1888K3622K4886K5426K6870K9787
$$ 1439269 1459419 1479120 1499466 1520351 1541380 1563268 1586890 1611776 1637202 1664072 1693859
57228A693859L2319L3068L3226L4233L5507L6139L6893L8607M0325M1026M1705
$$ 1693859 1726178 1759246 1792472 1826705 1862212 1898351 1935244 1973851 2014176 2055202 2096907
57217B096907M3772M6659M8942N0636N2607N4740N6525N8434O1068O3710O5336
$$ 2096907 2140679 2187338 2236280 2286916 2339523 2394263 2450788 2509222 2570290 2634000 2699336
57206B699336O6187O7035O7837O8439O9463P1085P2103P1752P1255P2002P3325
$$ 2699336 2765523 2832558 2900395 2968834 3038297 3109382 3181485 3253237 3324492 3396494 3469819
57195C469819P3890P4147P5484P7753P9615Q0718Q1725Q2683Q3003Q2751Q2395
$$ 3469819 3543709 3617856 3693340 3771093 3850708 3931426 4013151 4095834 4178837 4261588 4343983
57184D343983Q1723Q0288P8472P6913P5444P3828P2774P3013P4013P4904P5828
$$ 4343983 4425706 4505994 4584466 4661379 4736823 4810651 4883425 4956438 5030451 5105355 5181183
57173E181183P7148P8195P8242P7857P7842P7672P6563P5295P5438P7416Q0751
$$ 5181183 5258331 5336526 5414768 5492625 5570467 5648139 5724702 5799997 5875435 5952851 6033602
57162F033602Q5535R2133J00150J09165J19842J32726J46669J59941J72279J84327
$$ 6033602 6119137 6211270 6311420 6420585 6540427 6673153 6819822 6979763 7152042 7336369
57152G336369J95784K05682K13858K20607K25587K28608K30897K33924K37660
$$ 7336369 7532153 7737835 7951693 8172300 8397887 8626495 8857392 9091316 9328976
57143I328976K41454K45714K50839K55110K55610K50908K41332K27166K08338
$$ 9328976 9570430 9816144 10066983 10322093 10577703 10828611 11069943 11297109 11505447
57134A1505447J85438J59301J30019R7892O4857L3454M956k0012l9954n3571o1784
$$ 11505447 11690885 11850186 11980205 12078097 12142954 12176408 12181364 12161352 12121398 12067827 12006043
57123A2006043o6821o9875p1407p2965p6564q2579r0082r8765j08747j19140j28818
$$ 12006043 11939222 11869347 11797940 11724975 11648411 11565832 11475750 11376985 11268238 11149098 11020280
57112A1020280j38168j48080j57740j65143j69173j69305j64218j52907j36367
$$ 11020280 10882112 10734032 10576292 10411149 10241976 10072671 9908453 9755546 9619179
57103I619179j15991r0991n9475k0817K5485Q1943J51076K32186L22964M23071
$$ 9619179 9503188 9412197 9352722 9331905 9357390 9439333 9590409 9822595 10145559 10568630
57093A0568630N33201O52139P78405R13248J058301J212630J376752J555362J746146
$$ 10568630 11101831 11753970 12532375 13445623 14503924 15716554 17093306 18648668 20394814
57084B0394814J925218K053194K099140K051533J904344J645538J270631Q02908
$$ 20394814 22320032 24373226 26472366 28523899 30428243 32073781 33344412 34147320
57076C4147320K90443k15368o72967j049897j325411j500221j596821j643874
$$ 34147320 34437763 34222395 33549428 32499531 31174120 29673899 28077078 26433204
57068B6433204j660525j654117j625529j572095j489365j375893j237064j083084
$$ 26433204 24772679 23118562 21493033 19920938 18431573 17055680 15818616 14735532
57060A4735532r24323p69338o24918m95411l82422k86424k07804j45584r6497
$$ 14735532 13811209 13041871 12416953 11921542 11539120 11252696 11044892 10899308 10802811
57051A0802811n6783k4199K561K5194M5108O2107P5262Q4946R2962J00870J08996
$$ 10802811 10746028 10721829 10724390 10749584 10794692 10856799 10932061 11017007 11109969 11210839 11319835
57040A1319835J17085J25114J33336J42120J51729J61613J69742J73122J69709
$$ 11319835 11436920 11562034 11695370 11837490 11989219 12150832 12320574 12493696 12663405
57031A2663405J60053J47097J34278J23491J14330J04841R3149P9071O4805N3813
$$ 12663405 12823458 12970555 13104833 13228324 13342654 13447495 13540644 13619715 13684520 13738333
57021A3738333M8418M8165N0568N3190N4654N4225N1594M7369M2943L9263L6257
$$ 13738333 13786751 13834916 13885484 13938674 13993328 14047553 14099147 14146516 14189459 14228722 14264979
57010A4264979L3782L2404L2629L3908L5269L6784L9678M4918N2144O0075O7631
$$ 14264979 14298761 14331165 14363794 14397702 14432971 14469755 14509433 14554351 14606495 14666570 14734201
56999A4734201P4395Q0142Q4207Q5714Q4553Q1826P8944P6456P4075P1555O8843
$$ 14734201 14808596 14888738 14972945 15058659 15143212 15225038 15303982 15380438 15454513 15526068 15594911
56988A5594911O5644O1698N7700N5028N4214N4273N3814N2284M9786M6366M2102
$$ 15594911 15660555 15722253 15779953 15834981 15889195 15943468 15997282 16049566 16099352 16145718 16187820
56977A6187820L7542L3592L0998L0110L0838L2708L5195L8027M0965M3469M5104
$$ 16187820 16225362 16258954 16289952 16320062 16350900 16383608 16418803 16456830 16497795 16541264 16586368
56966A6586368M6187M7272M8054M7564M5591M3095M0789L8088L4067K8927K3893
$$ 16586368 16632555 16679827 16727881 16775445 16821036 16864131 16904920 16943008 16977075 17006002 17029895
56955A7029895J9781J6157J1903O477O37m080o724p643p760p570p275p366q271
$$ 17029895 17049676 17065833 17077736 17084213 17084850 17080770 17074046 17066403 17058643 17051073 17043798 17036432 17028161
56942A7028161r656j0892j2171j4375j7904k2272k6687l0235l1663l0047k5769
$$ 17028161 17018505 17007613 16995442 16981067 16963163 16940891 16914204 16883969 16852306 16822259 16796490
56931A6796490k0191j4537r957q253j1074j8157k7469l7292m7183n6979o6186
$$ 16796490 16776299 16761762 16751805 16743552 16732478 16714321 16686852 16649560 16602377 16545398 16479212
56920A6479212p4620q2315q8446r1675r2063r1418r1229r1388r1409r1599r2288
$$ 16479212 16404592 16322277 16233831 16142156 16050093 15958675 15867446 15776058 15684649 15593050 15500762
56909A5500762r3131r3989r5332r6920r7286r5536r2626q9867q7054q3270p8704
$$ 15500762 15407631 15313642 15218310 15121390 15024104 14928568 14835942 14746075 14659021 14575751 14497047
56898A4497047p4402p0700o7143o3635o0738n8856n7742n6710n4986n2224m8946
$$ 14497047 14422645 14351945 14284802 14221167 14160429 14101573 14043831 13987121 13932135 13879911 13830965
56887A3830965m5968m3322m0807l9845m3382n2958o6860q2015r6648j09935j20206
$$ 13830965 13784997 13741675 13700868 13661023 13617641 13564683 13497823 13415808 13319160 13209225 13089019
56876A3089019j25460j25551j22469j18309j13797j08833j03445r7967r2781q8025
$$ 13089019 12963559 12838008 12715539 12597230 12483433 12374600 12271155 12173188 12080407 11992382
56866A1992382q3362p8258p2742o7508o2902n8417n3650m9463m7796n0643n9278
$$ 11992382 11909020 11830762 11758020 11690512 11627610 11569193 11515543 11466080 11418284 11367641 11308363
56855A1308363p3431r0474j06187j17335j23470j25978j26080j24324j21249j17402
$$ 11308363 11234932 11144458 11038271 10920936 10797466 10671488 10545408 10421084 10299835 10182433
56845A0182433j12935j07781j02124r6177q9803q2753p4959o6407n7219m8181
$$ 10182433 10069498 9961717 9859593 9763416 9673613 9590860 9515901 9449494 9392275 9344094
56835I344094m0418l4269k9467k6989k9862m0999o0428q4958j09919j30957j45441
$$ 9344094 9303676 9269407 9239940 9212951 9183089 9142090 9081662 8996704 8886785 8755828 8610387
56824H610387j53329j56528j56789j54668j50658j46037j41636j36733j30339
$$ 8610387 8457058 8300530 8143741 7989073 7838415 7692378 7550742 7414009 7283670
56815G283670j22974j16010j09805j03535r6554q8903q0742p2257o4160n7834
$$ 7283670 7160696 7044686 6934881 6831346 6734792 6645889 6565147 6492890 6428730 6370896
56805F370896n5180n8414o8877q5060j02430j16278j24572j27746j26830j22921
$$ 6370896 6315716 6257302 6188425 6103365 6000935 5884657 5760085 5632339 5505509 5382588
56795E382588j17624j12364j07261j01689r5702r0054q5086q0561p6428p2872
$$ 5382588 5264964 5152600 5045339 4943650 4847948 4757894 4672808 4592247 4515819 4442947
56785D442947o9719o6567o3321o0119n7109n4967n5137n8753o5557p4360q3951
$$ 4442947 4373228 4306661 4243340 4183221 4126112 4071145 4016008 3957255 3891698 3817338 3733387
56774C733387r2896r9471j02940j04460j05548j06101j04970j02023r8354r4716
$$ 3733387 3640491 3541020 3438080 3333620 3228072 3121971 3017001 2914978 2816624 2721908
56764B721908r0883q6537q1726p6540p1258o6670o3376o0944n8551n6232n4596
$$ 2721908 2631025 2544488 2462762 2386222 2314964 2248294 2184918 2123974 2065423 2009191 1954595
56753A954595n3572n2428n0855m9114m7228m4976m2570m0468l8654l6854l5318
$$ 1954595 1901023 1848595 1797740 1748626 1701398 1656422 1613852 1573384 1534730 1497876 1462558
56742A462558l4457l3942l3065l1953l1435l1716l2027l1720l1011l0507l0516
$$ 1462558 1428101 1394159 1361094 1329141 1297706 1265990 1233963 1202243 1171232 1140725 1110209
56731A110209l0813l0738k9744k8110k6712k5815k4723k3099k1696k1051k0456
$$ 1110209 1079396 1048658 1018914 990804 964092 938277 913554 890455 868759 847708 827252
56720H27252j9199j7998j7893j8421j8305j7462j6824j6528j5880j5005j4957
$$ 827252 808053 790055 772162 753741 735436 717974 701150 684622 668742 653737 638780
56709F38780j5918j6662j6155j4791j3669j3451j4032j4690j4555j3540j2607
$$ 638780 622862 606200 590045 575254 561585 548134 534102 519412 504857 491317 478710
56698D78710j2483j2490j1562r855q390p462o651o056o140o510o178n129m366
$$ 478710 466227 453737 442175 432320 423930 416468 409817 403761 397621 391111 384933 379804 375438
56685C75438m345m553m655m913n346n608n905o855q271r088q789p932p150o542
$$ 375438 371093 366540 361885 356972 351626 346018 340113 333258 324987 315899 307110 299178 292028 285486
56671B85486o212o385o703o347n199m044l539l624m067m699n071m780m237m254
$$ 285486 279274 272889 266186 259839 254640 250596 247057 243433 239366 234667 229596 224816 220579 216325
56657B16325m818n091m718m229m006l830l590l636m131m748n155n226m738l590
$$ 216325 211507 206416 201698 197469 193463 189633 186043 182407 178276 173528 168373 163147 158409 154819
56643A54819k305j671j887k556l290l689l203j902r14j097j687j420n24k52p28
$$ 154819 152514 150843 148956 146400 143110 139421 136218 134316 133402 132305 130618 129198 128674 128422 127694
56628A27694q70m16l78j224k059k089j662j372j203j074j198j511j576j405j540
$$ 127694 126824 126408 126030 124806 122747 120658 118996 117624 116421 115347 114149 112638 111062 109657 108117
56613A08117k005k111j589j106j223j621j684j275o65k42l03p33r90q26o74p63
$$ 108117 106112 104001 102412 101306 100083 98462 96778 95503 94838 94596 94293 93560 92570 91744 91070 90307
56597I0307m45O83J673J377J75o46p63o67k44Q38J742J270l2m12M40J117R61Q65
$$ 90307 89862 90545 92218 93595 93770 93124 92361 91694 91450 92288 94030 95300 95268 94856 95296 96413 97374 98239
56579I8239J300J454R16M70N17L59k10k37P16J608J564J170J340K040K881L805
$$ 98239 99539 100993 101909 102379 102896 103255 103045 102808 103524 105132 106696 107866 109206 111246 114127 117932
56563A17932M499M306L424L093L902M912N035M198K696O62j244j959j528j308
$$ 117932 122431 126737 130161 133254 137156 142068 147103 151301 153997 154659 153415 151456 149928 148620
56549A48620j970k580k315j764j656j640j296j130j475j569q07R1K59R7L77P37
$$ 148620 146650 144070 141755 139991 138335 136695 135399 134269 132794 131225 130418 130509 130768 130865 131242 131979
56533A31979L02q07j636j720j339q58m85l50k57K64J235K070K380K261J665L22
$$ 131979 132281 131474 129838 128118 126779 125921 125436 125086 124829 125093 126328 128398 130778 133039 134704 135026
56517A35026j346k218j866j088o42l82m7Q2j33k40j0J77J18J10J03m17j288j560
$$ 135026 133680 131462 129596 128508 127866 127484 127437 127519 127386 127146 127136 127313 127431 127541 127644 127227 125939 124379
56499A24379j019o54j045j419r88j47L97O26O85L37k87m03K12P12M96Q9P1J16
$$ 124379 123360 122706 121661 120242 119254 119107 119504 120130 120815 121152 120865 120462 120674 121386 121882 121971 122042 122158
56481A22158j62l55o3L17K43k08p34j145r65K26J705K016R61o6j67qk66m86k73
$$ 122158 121996 121641 121578 121895 122138 121930 121196 120051 119086 119312 121017 123033 123994 123928 123761 123753 123487 123001 122728
56462A22728j55l79j72P50J274O01l30l06L84P40O54N72M80K63K84O84Q63M77
$$ 122728 122573 122194 122022 122772 124046 124647 124317 124011 124395 125135 125789 126361 126841 127104 127388 128072 128935 129412
56444A29412J14K43M51M74Q35J689K096J418L83j11k43m51n24l71n76j180j110
$$ 129412 129526 129769 130220 130694 131529 133218 135314 136732 137115 137004 136761 136310 135786 135415 134839 133659 132549
56427A32549K04J677K086J679J315J067P43P08J126J304Q03K91L81O44N67M25
$$ 132549 132753 134430 136516 138195 139510 140577 141320 142028 143154 144458 145261 145552 145933 146577 147144 147569
56411A47569M43K30j13L07J506K040J104j95o70o68q03n61M45J287J198R71J532
$$ 147569 148012 148242 148129 148436 149942 151982 153086 152891 152221 151553 150750 150189 150634 151921 153119 154090 155622
56394A55622K326K409J937J377N10n14n93N12J213M03p44p22K9L52M17Q07J010
$$ 155622 157948 160357 162294 163671 164181 163667 163074 163586 164799 165202 164458 163736 163765 164117 164534 165341 166351
56377A66351N17J57O40J076O00P8M82J051R20R97K159L141K523J390J586K515
$$ 166351 166868 167025 167665 168741 169341 169419 169901 170952 171872 172869 175028 178169 180692 182082 183668 186183
56361A86183K310J124O33J015J013N24O24J333J651J550J849K376K222J571J367
$$ 186183 188493 189617 190250 191265 192278 192802 193426 194759 196410 197960 199809 202185 204407 205978 207345
56346B07345J551J385J047J228J679J833K180L267M154L759K903L009L552L025
$$ 207345 208896 210281 211328 212556 214235 216068 218248 221515 225669 229428 232331 235340 238892 241917
56332B41917J691J064J247J100N92P53J547J974J968K213K412J807R66J043J614
$$ 241917 243608 244672 245919 247019 247611 248364 249911 251885 253853 256066 258478 260285 261251 262294 263908
56317B63908J389N99N68J274J555J421J967L103L589L288L379M290N228N724N962
$$ 263908 265297 265896 266464 267738 269293 270714 272681 275784 279373 282661 286040 290330 295558 301282 307244
56302C07244N822N174M786N326O045N990N841O724Q041Q381P904P785Q099Q243
$$ 307244 313066 318240 323026 328352 334397 340387 346228 352952 360993 369374 377278 385063 393162 401405
56288D01405Q565R543J0162R427Q456Q799R720R671R412J0806J3312J4673J4535
$$ 401405 409970 419513 429675 439102 447558 456357 466077 475748 485160 495966 509278 523951 538486
56275E38486J4453J4829J4800J4741J5898J7831J9050J9880K1746K4023K4800
$$ 538486 552939 567768 582568 597309 613207 631038 650088 669968 691714 715737 740537
56264G40537K4486K5494K8376L1464L4276L8027M2647M6592M9961N4670O1025
$$ 740537 765023 790517 818893 850357 884633 922660 965307 1011899 1061860 1116530 1177555
56253A177555O7228P2682P8857Q6291R3561R9768J05382J10194J13183J14721
$$ 1177555 1244783 1317465 1396322 1482613 1576174 1675942 1781324 1891518 2004701 2119422
56243B119422J16127J16767J14282J07972R9139Q8036P3574N6263L8346K0548
$$ 2119422 2235549 2352316 2466598 2574570 2673709 2761745 2835319 2891582 2929928 2950476
56233B950476J838j7329l4677m9457o2989p5411q5145r2020r7607j01930j03237
$$ 2950476 2952314 2934985 2900308 2850851 2787862 2712451 2627306 2535286 2437679 2335749 2232512
56222B232512j01745j00052r9045r6812r2556q8076q4247p9564p3455o7729o3365
$$ 2232512 2130767 2030715 1931670 1834858 1742302 1654226 1569979 1490415 1416960 1349231 1285866
56211A285866n8984n3830m9201m5688m2041l7990l5068l3442l1096k7464k4628
$$ 1285866 1226882 1173052 1123851 1078163 1036122 998132 963064 929622 898526 871062 846434
56200H46434k3572k2426k0014j7870j7099j6332j4488j2699j1793j0684q869p719
$$ 846434 822862 800436 780422 762552 745453 729121 714633 701934 690141 679457 670588 662869
56188F62869p727p285n671m463m490m252k923k031k564l184k771k108j670n28
$$ 662869 655142 647857 642186 637723 633233 628981 626058 624027 621463 618279 615508 613400 611730 611202
56174F11202J208J796R70P01J705K289J883K307M149N304M709M209N082O126O632
$$ 611202 612410 614206 615176 615877 617582 619871 621754 624061 628210 633514 638223 642432 647514 653640 660272
56159F60272P799R661J0212R242R278J1084J2139J1447J1679J4423J7451J9134
$$ 660272 668071 677732 687944 697186 706464 717548 729687 741134 752813 767236 784687 803821
56147H03821K1395K5596K9666L2278L5923M2449M9354N3823N6984O0614O3027
$$ 803821 825216 850812 880478 912756 948679 991128 1040482 1094305 1151289 1211903 1274930
56136A274930O1804N7775N2891M6963L9765L3527L0016K7683K4564K1306J8563
$$ 1274930 1336734 1394509 1447400 1494363 1534128 1567655 1597671 1625354 1649918 1671224 1689787
56125A689787J4484P921J144l638p565j2072j5841j8070k1502k8586l7412m4815
$$ 1689787 1704271 1712192 1713336 1709698 1702133 1690061 1674220 1656150 1634648 1606062 1568650 1523835
56113A523835n0722n6035n9128n8205n4723n1041m6944m1538l6069l1747k7311
$$ 1523835 1473113 1417078 1357950 1299745 1245022 1193981 1147037 1105499 1069430 1037683 1010372
56102A010372k1679j6537j3485j1302q679o734o237n447l412j973j903q19K237
$$ 1010372 988693 972156 958671 947369 938690 931956 925719 920272 916860 914887 912984 912165 914402
56089I14402M229L257K116L284M719M302M137O246Q204P547O517P888R855R750
$$ 914402 918631 921888 924004 927288 932007 936309 940446 946692 954896 962443 968960 976848 986703 996453
56075I96453R116J0441J2369J2805J3223J5362J7184J6692J6081J7618J9201J8565
$$ 996453 1005569 1016010 1028379 1041184 1054407 1069769 1086953 1103645 1119726 1137344 1156545 1175110
56063A175110J7868J9339K0584J9265J8138K0113K2544K1917K0089K0233K0836
$$ 1175110 1192978 1212317 1232901 1252166 1270304 1290417 1312961 1334878 1354967 1375200 1396036
56052A396036J9528J8641K0852K3450K3081K2157K4313K7590K8562K9035L2064
$$ 1396036 1415564 1434205 1455057 1478507 1501588 1523745 1548058 1575648 1604210 1633245 1665309
56041A665309L5385L5593L4859L6737L9493M0319M1734M6718N1974N3443N3945
$$ 1665309 1700694 1736287 1771146 1807883 1847376 1887695 1929429 1976147 2028121 2081564 2135509
56030B135509N7725O2184O3127O3541O8503P5808Q0415Q3981R0972R9599J05717
$$ 2135509 2193234 2255418 2318545 2382086 2450589 2526397 2606812 2690793 2781765 2881364 2987081
56019B987081J11713J22047J34000J42286J48877J58779J70218J78833J87249
$$ 2987081 3098794 3220841 3354841 3497127 3646004 3804783 3975001 4153834 4341083
56010D341083K00403K15665K27878K39732K56441K74841K88798L00712L16156
$$ 4341083 4541486 4757151 4985029 5224761 5481202 5756043 6044841 6345553 6661709
56001F661709L32105L42448L50161L61437L72921L77957L80382L88306L99497
$$ 6661709 6993814 7336262 7686423 8047860 8420781 8798738 9179120 9567426 9966923
55992I966923M07329M15865M33600M57343M78439N00110N31910N71465O08790
$$ 9966923 10374252 10790117 11223717 11681060 12159499 12659609 13191519 13762984 14371774
55983A4371774O43904O82549P19560P45590P65767P92512Q24939Q55373Q90250
$$ 14371774 15015678 15698227 16417787 17163377 17929144 18721656 19546595 20401968 21292218
55974B1292218R42499J008892J078047J155094J253831J370869J493854J628922
$$ 21292218 22234717 23243609 24321656 25476750 26730581 28101450 29595304 31224226
55966C1224226J792206J982144K191485K439021K755963L149892L619601M195958
$$ 31224226 33016432 34998576 37190061 39629082 42385045 45534937 49154538 53350496
55958E3350496M926757N831645O915332Q205262R717081J1401916J3198239J5112289
$$ 53350496 58277253 64108898 71024230 79229492 88946573 100348489 113546728 128659017
55950A28659017J7158899J9257280K1306205K3276635K4908341K5190936K2515224
$$ 128659017 145817916 165075196 186381401 209658036 234566377 259757313 282272537
55943B82272537J5860487N988840m719524j3745535j9783444k2887725k3766858
$$ 282272537 298133024 304121864 299402340 285656805 265873361 242985636 219218778
55936B19218778k3174520k1731666j9902595j7953756j5989266j4066495j2249122
$$ 219218778 196044258 174312592 154409997 136456241 120466975 106400480 94151358
55929I4151358j0575041r051488p695913o535973n567463m754668m073679l519296
$$ 94151358 83576317 74524829 66828916 60292943 54725480 49970812 45897133 42377837
55921D2377837l072409k698513k380283k119940j909162j725988j561560j422300
$$ 42377837 39305428 36606915 34226632 32106692 30197530 28471542 26909982 25487682
55913B5487682j305126j195904j092534j005337r33817q65426p97776p40658o95225
$$ 25487682 24182556 22986652 21894118 20888781 19954964 19089538 18291762 17551104 16855879
55904A6855879o51451o07073n69894n40384n10295m79496m56677m42031m25855
$$ 16855879 16204428 15597355 15027461 14487077 13976782 13497286 13040609 12598578 12172723
55895A2172723m05592l88318l75075l58371l36984l18432l04750k89627k71572
$$ 12172723 11767131 11378813 11003738 10645367 10308383 9989951 9685201 9395574 9124002
55886I124002k56667k46419k35520k23385k15735k12892k08316k00387j94430
$$ 9124002 8867335 8620916 8385396 8162011 7946276 7733384 7525068 7324681 7130251
55877G130251j91483j86306j78209j72881j71570j68782j62572j57089j53203
$$ 7130251 6938768 6752462 6574253 6401372 6229802 6061020 5898448 5741359 5588156
55868E588156j46448j36225j27578j22062j15835j08338j03795j02539r9834r4902
$$ 5588156 5441708 5305483 5177905 5055843 4940008 4831670 4727875 4625336 4525502 4430600
55858D430600r2303r2772r1477q7204q4523q4857q3882q0023p7246p7097p5873
$$ 4430600 4338297 4245525 4154048 4066844 3982321 3897464 3813582 3733559 3656313 3579216 3503343
55847C503343p2183o9681o9784o8983o5858o3728o3867o2979n9790n7503n7355
$$ 3503343 3431160 3361479 3291695 3222712 3156854 3093126 3029259 2966280 2906490 2848987 2791632
55836B791632n6145n2596m9779m9024m7566m4445m2594m2763m1576l7992l5718
$$ 2791632 2735487 2682891 2633112 2584088 2536522 2492077 2449483 2406720 2365144 2327152 2291434
55825B291434l6699l7920l7210l6647l7624l7987l6646l5982l7056l7246l5105
$$ 2291434 2254735 2216815 2179605 2142958 2105334 2067347 2030701 1994719 1957663 1920417 1885312
55814A885312l2863l1942l0553k7923k6211k6173k5406k2997k1463k2004k2258
$$ 1885312 1852449 1820507 1789954 1762031 1735820 1709647 1684241 1661244 1639781 1617777 1595519
55803A595519k0712j9150j8767j8052j6378j5504j5849j5413j3971j4053j6204
$$ 1595519 1574807 1555657 1536890 1518838 1502460 1486956 1471107 1455694 1441723 1427670 1411466
55792A411466j7650j7269j7456j9353k0705k0193j9530j9545j8688j7160j7814
$$ 1411466 1393816 1376547 1359091 1339738 1319033 1298840 1279310 1259765 1241077 1223917 1206103
55781A206103k0940k2778k1415j9544j9069j7742j3926j0166q765p881n341k940
$$ 1206103 1185163 1162385 1140970 1121426 1102357 1084615 1070689 1060523 1051758 1043877 1038536 1035596
55769A035596l628p356j2357j7732k2309k4017k2831k1568k1648k1052j8424j5798
$$ 1035596 1031968 1024612 1012255 994523 972214 948197 925366 903798 882150 861098 842674 826876
55757H26876j5043j4850j3713j2760j3122j3483j2735j2332j3584j5221j5808
$$ 826876 811833 796983 783270 770510 757388 743905 731170 718838 705254 690033 674225
55746F74225j5955j6057j4699j1522q925q634r154q717q074q282q424p763p536
$$ 674225 658270 642213 627514 615992 607067 598433 589279 580562 572488 564206 555782 548019 540483
55733E40483q427q818p665o480o494o506n720n750p482q708p555n716n604o572
$$ 540483 532056 523238 515573 509093 502599 496093 490373 484623 477141 468433 460878 455162 449558 442986
55719D42986o624n727m898l859k133o94l30j07O61Q26m25j878k602l639n469o268
$$ 442986 436362 430635 425737 421878 419745 419051 418721 418614 419275 420101 419676 417798 415196 411557 406088 399820
55703C99820m911l378l851n565o813p794r089r490q044o325o101o509n937m921
$$ 399820 394909 391531 387680 382115 375302 367508 358419 348929 340885 334560 328459 321950 316013 311092
55689C11092m710m752m042l329l547l663k513j172j172j864j876j592j853j799
$$ 311092 306382 301630 297588 294259 290712 287049 284536 283364 282192 280328 278452 276860 275007 273208
55675B73208n16O62N3j503k123j982k449l346l484k969k682k422j701j306j973
$$ 273208 272692 273354 273407 271904 269781 267799 265350 262004 258520 255551 252869 250447 248746 247440 245467
55660B45467k606j912o73l33m70J22J005R62K68p8l89j396k307j967j097j198
$$ 245467 242861 240949 240276 239943 239473 239595 240600 241562 241830 241752 241363 239967 237660 235693 234596 233398
55644B33398j989k151j820k185l227l890m077m555n318n750n908o071n738m569
$$ 233398 231409 229258 227438 225253 222026 218136 214059 209504 204186 198436 192528 186457 180719 176150
55630A76150l574l781m518m521l819l020j846o2J161O93o36j223r92q61q96o99
$$ 176150 172576 168795 164277 159756 155937 152917 151071 151009 152170 152863 152227 151004 150012 149151 148255 147556
55614A47556o92j329j923j825j807k606l289k754j771j663k100k039j719j774
$$ 147556 146864 145535 143612 141787 139980 137374 134085 131331 129560 127897 125797 123758 122039 120265
55600A20265j546l76N91Q6q92n88M68L93r32j972k158k098j739o25M71M43j17
$$ 120265 118719 118343 118934 119020 118128 117540 118008 118401 117469 115497 113339 111241 109502 108877 109348 109791 109674
55583A09674J00O65J85r64j125k93j11r77j466q14J19N92Q03P78K03n40o63l06
$$ 109674 109774 110439 110624 109660 108535 108242 108131 107154 105688 104874 104993 105585 106388 107166 107369 106829 106166 105860
55565A05860k44m60n39r55k277l497l135j746j321k370l501l849l893l786k818
$$ 105860 105616 105156 104617 103662 101385 97888 94753 93007 91686 89316 85815 81966 78073 74287 71469
55550G1469r74N98J124R30M83o0l92l05k23l86M1J675L341L430K356J887K402
$$ 71469 70495 71093 72217 73147 73630 73570 73178 72873 72650 72264 72305 73980 77321 80751 83107 84994 87396
55533H7396K693K212J650J300P19M4j17q8p84j906k223j658j423j947k269j668
$$ 87396 90089 92301 93951 95251 95970 96014 95897 95809 95025 93119 90896 89238 87815 85868 83599 81931
55517H1931m37R97K290K672J702M27J89N24k5j301j684q65l02p39j234j085q64
$$ 81931 81494 82491 84781 87453 89155 89582 89771 90295 90270 88969 87285 86420 86118 85379 84145 83060 82196
55500H2196r76r37o58q49j518j533l39J147J844J622Q36j15n45PQ97J130Q79R92
$$ 82196 81220 80283 79625 78776 77258 75725 75386 76533 78377 79999 80835 80720 80175 80182 81079 82209 83088 84080
55482H4080J245P00l58o46j07k1p50j177p73l09j62K28P14K32j159j891j291n97
$$ 84080 85325 86025 85667 85021 84914 84893 84143 82966 82193 81884 81722 81950 82664 82896 81737 79846 78555 77958
55464G7958o84o20L71J264Q31m11j223j417j415j093l37J44j93o08j05R80J488
$$ 77958 77274 76654 77025 78289 79120 78709 77486 76069 74654 73561 73224 73368 73175 72567 72462 73442 74930
55447G4930J074L84o2l62o87r14q30m10N8J37j99l45J21O97O85L43L74N76J09
$$ 74930 76004 76388 76326 75964 75277 74363 73533 73123 73181 73318 73119 72774 72895 73592 74277 74620 74994 75570 75679
55428G5679r11j329n90O18J456J679J221J62p42o23K21O85N57O81J321J673J285
$$ 75679 74768 73439 72849 73467 74923 76602 77823 77985 77243 76620 76841 77526 78083 78764 80085 81758 83043
55411H3043O91K83j72o29n63j07j12o84r43o06m98r56j117n42j14n34j036p06
$$ 83043 83734 84017 83845 83216 82653 82546 82434 81750 80807 80201 79703 78747 77630 77088 76974 76440 75404 74698
55393G4698j8J8n25p57l84N6R5k15m83k88L84R36P85K11l9O1r6n76p80o01o06
$$ 74698 74680 74698 74173 73416 73032 73088 73183 72968 72485 72197 72581 73517 74302 74513 74474 74535 74439 73863 73083 72482 71876
55372G1876q51o60P6N18K09k12j43J31K01K44M46N37L51J15j50o82j225j055q5
$$ 71876 71025 70365 70441 70959 71168 70956 70813 70944 71145 71389 71835 72372 72723 72838 72688 72006 70781 69726 69641
55353F9641Q92J339J445J298O20l24o65j77L25K05l14q47j249j145j80R65J062
$$ 69641 70533 71872 73317 74615 75235 74911 74246 74069 74394 74599 74285 73438 72189 71044 70864 71829 72891
55336G2891Q9o42m55mK81R11J876K056R71j41j11M79M48j66m95l03p3j89p45j610
$$ 72891 72980 72338 71883 71879 72160 73071 74947 77003 77974 77833 77722 78201 78649 78483 77988 77685 77612 77423 76678 75068
55316G5068k127j464J83J490J570Q71J74l42o58n59k41k92o02l86L04L78m18q67
$$ 75068 72941 71477 71660 73150 74720 75591 75765 75423 74765 74206 73965 73673 73071 72685 72989 73367 72949 72082
55298G2082k32N27M22L3L06R24J055P79N50J98m58q24m41Q2J19J13O10J021N24
$$ 72082 71850 72377 72799 72832 73138 74062 75117 75896 76446 76644 76186 75362 74921 75003 75122 75235 75845 76866 77390
55279G7390n08j124j235j269j067k30Q40J396J440J460J440J016K87l03n95n97
$$ 77390 76882 75758 74523 73254 72187 71957 72797 74193 75633 77093 78533 79549 79836 79533 78938 78341
55263G8341k47K19K85k7j14K5m31j549k055j172J12O26O64R40J080N54Q6N01J058
$$ 78341 78094 78313 78598 78571 78457 78482 78051 76502 74447 73275 73387 74013 74677 75617 76697 77251 77337 77838 78896
55244G8896N79m34o09r7k98j358j831r66K68P93P42O65N87L36O0j4J51N02Q35
$$ 78896 79475 79041 78432 78335 78037 76679 74848 73882 74150 74943 75685 76350 76937 77273 77333 77319 77470 77972 78807
55225G8807P53J60m28n70n69q78j197r58l06J17P3k83r37j709j884r94K72Q23
$$ 78807 79560 79720 79292 78722 78153 77275 76078 75120 74814 74931 75004 74721 73784 72075 70191 69197 69469 70292
55207G0292O10M69Q39J450K051K507K392J357q0r00p62j85K61L80J18l77o89n88
$$ 70292 70902 71371 72210 73660 75711 78218 80610 81967 81887 80987 80225 80040 80301 80681 80799 80422 79733 79145
55189G9145l94m15l63Q0N74N83K14l6QK78P87J286J224O24M24J102J736J303L05
$$ 79145 78751 78336 77973 78053 78627 79210 79424 79388 79396 79674 80461 81747 82971 83595 84019 85121 86857 88160 88465
55170H8465J5N97J125J065O94K12l81p01l18L53M26k01p87q64p10o93q97j307
$$ 88465 88480 89077 90202 91267 91961 92173 91792 91091 90773 91126 91552 91351 90564 89700 88990 88297 87400 86093
55152H6093j818k115k016j683j175l17N86O36l03r28j62J212J614Q19j30o38r49
$$ 86093 84275 82160 80144 78461 77286 76969 77555 78191 77888 76960 76798 78010 79624 80443 80313 79675 78726
55135G8726j087p00O6O40Q84J067J110P35J76j17k69o45j009q80l84M6M60J029
$$ 78726 77639 76939 77005 77645 78529 79596 80706 81441 81617 81500 81231 80586 79577 78697 78313 78359 78819 79848
55117G9848J350R93L21j40n67j122j096k7J035Q05k37o34k07O1j6K35O47L52l59
$$ 79848 81198 82191 82512 82372 81805 80683 79587 79560 80595 81400 81163 80529 80322 80383 80367 80602 81249 81601 81242
55098H1242j62J058J877J596J156J279J358R30P03J252J880J717R70L11j14l68
$$ 81242 81080 82138 84015 85611 86767 88046 89404 90334 91037 92289 94169 95886 96856 97167 97053 96685
55082I6685k46K25M14j05q99j230q80j42N06O34J88l66o46q18r61n00P95J799
$$ 96685 96439 96664 97078 96973 96074 94844 93964 93822 94328 94962 95150 94784 94138 93320 92359 91859 92654 94453
55064I4453J295j55r24o71m71p06o08l1Q7m64n68L10J103P76k77j221j925k382
$$ 94453 95748 95593 94669 93998 93527 92821 92213 92182 92269 91805 91237 91547 92650 93426 93149 91928 90003 87621
55046H7621k130j137k78j26j77J20M34L69K30L34L85K15K06M08J97n46q44p6R50
$$ 87621 85491 84354 84076 83950 83773 83893 84327 84696 84926 85260 85645 85860 86066 86474 86671 86125 85281 85205 86155
55027H6155J135N92J44N4M2J3J9k4m6K18N82M23k46n36k0N70N24J80J07J51nj40
$$ 86155 87290 87882 88026 88080 88122 88135 88154 88130 88084 88302 88884 89307 89061 88525 88505 89075 89599 89779 89886 90037 90032 89892
55005H9892m8l7k23j22L87O12K67J99R79J700J267J30m73l44k31l25j65J81N6
$$ 89892 89844 89807 89584 89462 89849 90461 90728 90927 91906 93606 94873 95003 94530 94186 93955 93630 93465 93646 93702
54986I3702n80q95l27O45J125P73P4j81K70Q05O31j39o15l68J82O29R81J024L25
$$ 93702 93122 92227 91900 92545 93670 94443 94517 94336 94606 95411 96042 95903 95288 94920 95102 95731 96712 97736 98061
54967I8061p38j026k78L98L16K78J016J776J613J060J118J437R99M7k48K92P01
$$ 98061 97323 96297 96019 96417 96733 97011 98027 99803 101416 102476 103594 105031 106030 106077 105829 106121 106822
54950A06822N17K21J7m68j112j158m61P7k84j192j765j491m41Q81J719J600Q37
$$ 106822 107339 107560 107577 107109 105997 104839 104378 104455 104171 102979 101214 99723 99282 100163 101882 103482 104319
54933A04319J30j78j28K90R53J291Q45R7lP24J586K119K613L370M138M463M228
$$ 104319 104449 104271 104143 104433 105386 106677 107522 107619 107616 108340 109926 112045 114658 118028 122166 126629 130857
54916A30857L635K879K003R24l39j460k060k220k376k548k291j662j525k320l218
$$ 130857 134492 137371 139374 140298 139959 138499 136439 134219 131843 129295 127004 125342 123817 121497 118279
54901A18279l217k458j721j100j91P75J091O89J91o0k18k57N3N28P83J011J660
$$ 118279 115062 112604 110883 109783 109592 110367 111458 112147 112338 112278 112060 111803 111856 112384 113167 114178 115838
54884A15838K378K276J364P68J117J662J529J017J064J838K631K834K460J804
$$ 115838 118216 120492 121856 122624 123741 125403 126932 127949 129013 130851 133482 136316 138776 140580
54870A40580J014J74n61j059j416j876k439k710k376j798j683k087k291j869j348
$$ 140580 141594 141768 141207 140148 138732 136856 134417 131707 129331 127533 125850 123763 121472 119603 118255
54855A18255j424j961k304k189j835j461j228j331j603j453p05j63n54j360j494
$$ 118255 116831 114870 112566 110377 108542 107081 105853 104522 102919 101466 100761 100598 100044 98684 97190
54840I7190q73l64l40k92Q5L76K78R0Q3J00O5K36O73R89R52P55M67j58r74j157
$$ 97190 96317 95953 95613 95321 95406 95782 96060 96150 96233 96333 96398 96634 97307 98296 99248 100003 100470 100312 99338 98181
54820I8181k24J088J604J127N17M22M99J09p04j233j019l38K79O92J002J016M19
$$ 98181 97957 99045 100649 101776 102293 102715 103214 103323 102619 101386 100367 100029 100308 101000 102002 103018 103437
54803A03437m83q02j80O67Q82N45L55N32O82N42L04J66O9r0l36o77j026j104p52
$$ 103437 102954 102152 101972 102639 103521 104066 104421 104953 105635 106177 106481 106647 106716 106626 106290 105613 104587 103483 102731
54784A02731j94K43N57R15J322J719K118K342J997J141O26J161K270K853K568
$$ 102731 102537 102780 103337 104252 105574 107293 109411 111753 113750 114891 115517 116678 118948 121801 124369
54769A24369K034J797J822J925K090K225K231K298K659L031K805J823M58r28k158
$$ 124369 126403 128200 130022 131947 134037 136262 138493 140791 143450 146481 149286 151109 151567 150639 148481
54754A48481k940l091k963l044l224l072k720k661k706k114r58l34q27j618j641
$$ 148481 145541 142450 139487 136443 133219 130147 127427 124766 122060 119946 118988 118654 117827 116209 114568
54739A14568r27j31M98J043J289J049P60J005J526J518Q49L49O63J422J847J776
$$ 114568 113641 113510 114008 115051 116340 117389 118149 119154 120680 122198 123047 123396 124059 125481 127328 129104
54723A29104J693J873K041J910J774K120K785K866J735j29j600k072j962k072
$$ 129104 130797 132670 134711 136621 138395 140515 143300 146166 147901 147772 146172 144100 142138 140066
54709A40066k707l437l630l140k450k041j776j210m88l65j057j671j328l84J14
$$ 140066 137359 133922 130292 127152 124702 122661 120885 119675 119187 118822 117765 116094 114766 114382 114496
54694A14496r2k89qL32J62m46r44r64n55j05M4m2N3L88L51m44j319j300n78l96
$$ 114496 114404 114115 114107 114439 114601 114155 113211 112247 111692 111587 111631 111589 111642 112030 112381 111937 110618 109318 108740 108344
54674A08344j278k240k097r54J28M46J70k16m83o69q27q11l66M58J109J080O08
$$ 108344 107066 104826 102729 101775 101903 102349 102519 102303 101820 101151 100324 99513 99147 99605 100714 101794 102402
54657A02402M35Q34J256J132O28L00L23L70J66j16m3N22J157J218N89j33l24m8
$$ 102402 102837 103671 104927 106059 106687 106987 107310 107680 107846 107730 107687 108209 109366 110584 111173 111040 110716 110668
54639A10668J45pk96m77n58o42p64q72p23l3J073J887J766Q91l0n76p71o42j95
$$ 110668 110813 110806 110510 110033 109475 108833 108069 107197 106474 106441 107514 109401 111167 112058 112028 111452 110681 110039 109844
54620A09844K23J17m86r80r12m07J85O50Q82Q64O53K63l81j066j233o96j09j22
$$ 109844 110067 110184 109698 108718 107806 107399 107584 108234 109116 109980 110633 110896 110515 109449 108216 107520 107411 107289
54602A07289l45O5R90J445J097P28R49J287J021K50l83n56l71l9J70l5o00j020
$$ 107289 106944 107009 107999 109444 110541 111269 112218 113505 114526 114776 114393 113837 113466 113427 113597 113562 112962 111942
54584A11942q94m05n4r2l47m32j03M14N28j9p66j128j124r72l87R11K220K414
$$ 111942 111048 110643 110589 110497 110150 109718 109615 110029 110557 110538 109772 108644 107520 106548 106161 107072 109292 111706
54566A11706J449L68k94r85j790j909j062k45k27k59O36J924K274J534Q03P42
$$ 111706 113155 113523 113229 112244 110454 108545 107483 107238 107011 106752 107388 109312 111586 113120 113923 114665
54550A14665R26R04Q61R88J027P28J88m17j020j329r36J6P23O34J67J03M59M56
$$ 114665 115591 116495 117356 118344 119371 120099 120287 119870 118850 117521 116585 116601 117324 117958 118125 118228 118687 119143
54532A19143l53j271j208q8R13P49k07p17l17K38J74k61l68p1J10p0k57q8L25
$$ 119143 118790 117519 116311 116223 117136 117885 117678 116961 116644 116882 117056 116795 116427 116356 116466 116396 116139 116051 116376
54513A16376O00N32K06j74l86k63K01O90P02N6p59j000n21J07M23N94Q55R20M66
$$ 116376 116976 117508 117714 117540 117154 116891 117092 117782 118484 118540 117781 116781 116260 116367 116790 117384 118239 119159 119625
54494A19625j50k67J40N09N62N01M30J95j65l80m31m36k28L84R84R40M35K81O30
$$ 119625 119475 119208 119348 119857 120419 120920 121350 121545 121380 121000 120569 120133 119905 120289 121273 122213 122648 122929 123559
54475A23559P79M08Q4K09L70K09J23M93R76J096R09N77Lo01n32K84P60Q2j022
$$ 123559 124338 124746 124830 125039 125409 125618 125741 126234 127210 128306 129215 129792 129795 129194 128662 128946 129706 129788 128766
54456A28766j323q71o58r16r54n31k85n78q87o76j79P4j2j66j86lM07R48J323
$$ 128766 127443 126572 125914 124998 124044 123513 123228 122650 121763 121087 120908 120982 120970 120804 120618 120615 121022 121970 123293
54437A23293J229N78l99j232j459j001k03N48J095J368J244P67L01K55P02J315
$$ 123293 124522 125100 124701 123469 122010 121009 120806 121354 122449 123817 125061 125828 126129 126384 127086 128401
54421A28401J604J289O28L21O99J165Q47k49j265j589j284n03O61J605J491M03
$$ 128401 130005 131294 131922 132243 132942 134107 134954 134705 133440 131851 130567 130064 130725 132330 133821 134224
54405A34224n79q44q11p44r0J256K149J641M49j35lJ51L24R26J534J292M41Q8
$$ 134224 133645 132801 131990 131246 131156 132412 134561 136202 136651 136516 136513 136664 136988 137914 139448 140740 141181 141269
54387A41269N01Q05N14J49J24J14j30k18J65P32J111J320J477J610J919K626L374
$$ 141269 141770 142575 143089 143238 143362 143476 143346 143128 143293 144025 145136 146456 147933 149543 151462 154088 157462
54370A57462L404K552J459P06K70k2j28j47l62p11p96o07n84q25q56n33m11q04
$$ 157462 160866 163418 164877 165583 165853 165831 165703 165556 165194 164483 163687 163080 162496 161671 160815 160282 159871 159067
54352A59067j198j085q13r67j365j370r46p23j051j573j754j479j030p13n63l22
$$ 159067 157869 156784 155971 155004 153639 152269 151323 150600 149549 147976 146222 144743 143713 143000 142437 142115
54336A42115J75O29M90k90j051j177q16n49n57m91j72Q1o6l50k13M06R24Q39L85
$$ 142115 142290 142919 143409 143119 142068 140891 140075 139526 138969 138478 138306 138387 138321 137971 137758 138164 139088 139927 140312
54317A40312J41J69N1l32n34k91L1Lk88o01r90j459j570j068m74m21o32l82K75
$$ 140312 140453 140622 140673 140341 139807 139516 139547 139550 139262 138661 137671 136212 134642 133574 133100 132679 132047 131665 131940
54298A31940N51J86k81n16q02j150r79j13O77P23M29N87J140J385J054N16J09
$$ 131940 132491 132677 132396 131880 131078 129928 128949 128836 129513 130236 130665 131252 132392 133777 134831 135347 135456
54281A35456j38j81L7K62J08l13l48L49J270J614J276R75J329K011K094J173p9
$$ 135456 135318 135137 135174 135436 135544 135231 134883 135232 136502 138116 139392 140367 141696 143707 145801 146974 146895
54264A46895o58l00M24Q84Q82M49k80q28n45N52J430J087j62r29n07K39K3j148
$$ 146895 146237 145937 146361 147245 148127 148576 148296 147468 146923 147475 148905 149992 149830 148901 148394 148633 148656 147508
54246A47508j967j524l59M31N81O50R19J037P69L84J11k36p05q42l16M42P26M72
$$ 147508 145541 144017 143658 144089 144670 145320 146239 147276 148045 148429 148540 148304 147599 146757 146441 146883 147609 148081
54228A48081J62K9j26m54q49j158j254r39k20L79K29o46j555j878j496o17L91
$$ 148081 148243 148272 148146 147692 146843 145685 144431 143492 143272 143651 143880 143234 141679 139801 138305 137688 138079
54211A38079J002Q41J69l34l17p0pj87m46o61o95l73K95R37J079N96j54o57p04
$$ 138079 139081 139922 140091 139757 139440 139370 139363 139176 138730 138069 137374 137001 137296 138233 139312 139908 139754 139097 138393
54192A38393n12l17l8M34P53M75j40k95J97N89M37L29Q07J235P12l52o91l1N65
$$ 138393 137881 137564 137526 137960 138713 139188 139048 138753 138950 139539 139976 140305 141112 142347 143059 142707 142016 141985 142550
54173A42550L16l27o36o21o40o66m47o2J27n1m08n21j04N82Q15K85l18j22O72
$$ 142550 142866 142539 141903 141282 140642 139976 139529 139467 139594 139543 139135 138614 138510 139092 139907 140192 139874 139752 140424
54154A40424J013M70k25k67K79Q99J323J486J255O24n8m25m19j96P7K31K24K28
$$ 140424 141437 141907 141682 141415 141694 142593 143916 145402 146657 147281 147223 146798 146379 146183 146260 146491 146715 146943
54136A46943L66M22K02R1O45J722K539K667K373J954J431R97J086J661K087K022
$$ 146943 147309 147731 147933 148024 148669 150391 152930 155597 157970 159924 161355 162352 163438 165099 167186 169208
54120A69208J832J853J790J332Q05P14R58R87N63pl17l21l93r45j917k752l114
$$ 169208 171040 172893 174683 176015 176820 177534 178492 179479 180042 180035 179718 179397 179004 178059 176142 173390 170276
54103A70276l341l781l978l251j875q14k91L86J450K135J863J080M45k4m21m58
$$ 170276 166935 163154 159176 155925 154050 153236 152945 153331 154781 156916 158779 159859 160304 160280 159859 159401
54087A59401p9J06l12q00p11k75r6j32Q7N89R58R49O01P4k02K93J339J910J490
$$ 159401 159322 159428 159116 158316 157605 157330 157234 157102 157189 157778 158736 159685 160286 160360 160158 160451 161790 163700 165190
54068A65190Q84R57J243P39l41q69n50k41m14m90pN59O53N89R76J686J977J572
$$ 165190 166074 167031 168274 169013 168672 167803 167253 167012 166598 166108 166101 166660 167313 167902 168878 170564 172541 174113
54050A74113J085J331K374L394L533K854K262K462L185L644L475L001K720K870
$$ 174113 175198 176529 178903 182297 185830 188684 190946 193408 196593 200237 203712 206713 209433 212303
54036B12303L324L735L851L899M301M931N013M144K917K135J780J369J012J235
$$ 212303 215627 219362 223213 227112 231413 236344 241357 245501 248418 250553 252333 253702 254714 255949
54022B55949J866J944R39n14j470j734j776j953k216k445k702l091l595m095m453
$$ 255949 257815 259759 260698 260184 258714 256980 255204 253251 251035 248590 245888 242797 239202 235107 230654
54007B30654m517m086l113j999j424j573j774j270k87K11j59p86j039j035j161
$$ 230654 226137 222051 218938 216939 215515 213942 212168 210898 210611 210822 210663 209877 208838 207803 206642
53992B06642j373j447j332q79K63J946L163L072K060J269J335K089L090L760L261
$$ 206642 205269 203822 202490 201611 201874 203820 206983 210055 212115 213384 214719 216808 219898 223658 226919
53977B26919J165j696l751m213l638l001k715k637k498k095j450q78o96p85p14
$$ 226919 228084 226388 222637 218424 214786 211785 209070 206433 203935 201840 200390 199512 198816 198031 197317
53962A97317k63L87R28J205J253J272J411J468J027J36n28m52J00O49J196J865
$$ 197317 197054 197441 198369 199574 200827 202099 203510 204978 206005 206141 205613 205161 205261 205910 207106 208971
53946B08971K282K087J787K167L029L366K868K355K522L061L353L316L135K794
$$ 208971 211253 213340 215127 217294 220323 223689 226557 228912 231434 234495 237848 241164 244299 247093
53932B47093K391K378K937L453L199K350J748J793K141K510L160M280N315N425
$$ 247093 249484 251862 254799 258252 261451 263801 265549 267342 269483 271993 275153 279433 284748 290173
53918B90173M551L557L235L571M165M913N750O110N381L900K775K486K268J272
$$ 290173 294724 298281 301516 305087 309252 314165 319915 326025 331406 335306 338081 340567 342835 344107
53904C44107l15j634k172j926j097k22j58j257k814l931m615n374o075o125n618
$$ 344107 343792 342158 339986 338060 336963 336741 336583 335326 332512 328581 323966 318592 312517 306392 300774
53889C00774n421n899o348o030n135m366m029l928l843l753l701l654l460k973
$$ 300774 295353 289454 283106 277076 271941 267575 263546 259618 255775 252022 248321 244667 241207 238234
53875B38234k297j849j960k459k872k962k818k523k054j443q77n85p20j192j515
$$ 238234 235937 234088 232128 229669 226797 223835 221017 218494 216440 214997 214120 213535 212815 211623 210108
53860B10108j131j28O82O60L3n86r73j225j296j116r31r58j010q57p16q49j004
$$ 210108 208977 208849 209531 210191 210224 209638 208665 207440 206144 205028 204097 203139 202129 201272 200556 199707 198703
53843A98703q32n53n47n82j59N71R83R48Q16O47K20k27j69K74L80j22p72j191
$$ 198703 197871 197318 196771 196189 196030 196601 197584 198532 199348 199995 200215 199988 199819 200093 200473 200351 199579 198388
53825A98388j407j260m16Q17J526J410J220J614K257K427J896R16r6n00K50J814
$$ 198388 196981 195721 195305 196122 197648 199058 200278 201892 204149 206576 208472 209388 209292 208792 209042 210856
53809B10856K995L069K616K646L379M249M720M631M116L567L391L459L182K465
$$ 210856 213851 216920 219536 222182 225561 229810 234530 239161 243277 246844 250235 253694 256876 259341
53795B59341K074K620L527L619K580J261N81N36M20k39j106j445j041n66q07j721
$$ 259341 261415 264035 267562 271181 273761 275022 275603 276139 276559 276320 275214 273769 272728 272162 271355 269634
53779B69634k570k919l082l464l918l950l356k508k063k374l057l362l059k706
$$ 269634 267064 264145 261063 257599 253681 249731 246375 243867 241804 239430 236373 233011 229952 227246
53765B27246k756k890k658k318k294k244j503k58O41Q93Q80O88K6q49j208j000
$$ 227246 224490 221600 218942 216624 214330 212086 210583 210325 210966 211859 212739 213427 213453 212604 211396 210396
53749B10396r15j082q25PN59L16j09p2J50J85L21P85J017M52n71j342j587j264
$$ 210396 209481 208399 207574 207581 208140 208456 208347 208275 208425 208610 208931 209716 210733 211185 210614 209272 207685 206421
53731B06421l01Q26J123L66l51j20O08J071J484K260K816K409J522J099R43K93
$$ 206421 206120 206946 208069 208435 208084 207964 208572 209643 211127 213387 216203 218612 220134 221233 222176 222469
53715B22469m34KJ588K844K932K599K696K926K697K217K044K218K443K706L104
$$ 222469 222035 222037 223625 226469 229401 232000 234696 237622 240319 242536 244580 246798 249241 251947 255051
53700B55051L387L110K190J110N87J058K230L224L386K840K046J078j42j186j394
$$ 255051 258438 261548 263738 264848 265435 266493 268723 271947 275333 278173 280219 281297 281155 279969 278575
53685B78575p84j08J42J90L12K85k08r70j396j116l93N8k32q77r84k94L51J70
$$ 278575 277791 277683 277825 278015 278327 278612 278404 277434 276038 274922 274529 274587 274355 273478 272494 272200 272551 272721
53667B72721l81k75N13R93O99L31N76J079J117O99M02M24M80M41N42Q51R83O24
$$ 272721 272340 272065 272578 273571 274270 274601 275177 276256 277373 278072 278474 278898 279378 279819 280361 281212 282195 282819
53649B82819Q7N0P90J852K591K784K597K182J608J055O94M26K11M77J622L060
$$ 282819 282906 282956 283746 285598 288189 290973 293570 295752 297360 298415 299109 299535 299746 300223 301845 304905
53633C04905L490K488J107M89N41N64M96P14J107J199J007R89J225J447J654K023
$$ 304905 308395 310883 311990 312479 313020 313584 314080 314794 315901 317100 318107 319096 320321 321768 323422 325445
53617C25445K293K010J405J192J504J781J827K145K985L816M061L787L302K661
$$ 325445 327738 329748 331153 332345 333849 335630 337457 339602 342587 346403 350464 354251 357553 360214
53603C60214J951J574J705J849J446O30J2j64j81l09m14k30K06N11L71o0k98j87
$$ 360214 362165 363739 365444 367293 368739 369369 369381 369217 369036 368727 368313 368083 368289 368800 369171 369111 368813 368626
53585C68626j85p85j729k214j831r79l13j34l80q49j310j579j661j669j571j244
$$ 368626 368441 367656 365927 363713 361882 360903 360590 360456 360076 359227 357917 356338 354677 353008 351437 350193
53569C50193p33k83j7K08N16Q42J055J140J160J151J108J002Q41O76N61M67M15
$$ 350193 349460 349177 349160 349368 349884 350726 351781 352921 354081 355232 356340 357342 358183 358859 359420 359887 360302
53552C60302O47J345K225K709K652K464K395K211J804J583J845K262K525K945
$$ 360302 360949 362294 364519 367228 369880 372344 374739 376950 378754 380337 382182 384444 386969 389914
53538C89914L765M417M277L854M241N525O681P085P200P651Q364Q976R417R797
$$ 389914 393679 398096 402373 406227 410468 415993 422674 429759 436959 444610 452974 461950 471367 481164
53524D81164J0243J0987J2070J2844J2470J1175J0401J1259J3288J5135J6029
$$ 481164 491407 502394 514464 527308 539778 550953 561354 572613 585901 601036 617065
53513F17065J6194J6198J6413J6931J7599J8126J8342J8350J8356J8417J8416
$$ 617065 633259 649457 665870 682801 700400 718526 736868 755218 773574 791991 810407
53502H10407J8097J7249J5986J4765J3953J3450J3032J2799J2966J3406J3784
$$ 810407 828504 845753 861739 876504 890457 903907 916939 929738 942704 956110 969894
53491I69894J3930J3688J2814J1541J0903J1632J2956J3411J2782J2245J2505
$$ 969894 983824 997512 1010326 1021867 1032770 1044402 1057358 1070769 1083551 1095796 1108301
53480A108301J2896J2588J1682J0569R115P190N301L929K748J149p70k373l374
$$ 1108301 1121197 1133785 1145467 1156036 1165151 1172341 1177642 1181571 1184319 1185468 1184698 1182325 1178951
53467A178951l997m466m868n383o177p091p755q064q383r252j0791j2305j2726
$$ 1178951 1174954 1170488 1165620 1160237 1154060 1146969 1139214 1131150 1122767 1113515 1102724 1090419 1077693
53454A077693j1899j1121j1700j3118j3526j2188j0441r822j0213j0504j0257
$$ 1077693 1065794 1054673 1042973 1029855 1016329 1004141 993700 983878 973665 963161 952904
53443I52904r750q960p506n483l511j940o04O39J604K124K348K661L449M797O228
$$ 952904 943154 934194 926688 921205 917694 915754 915150 915789 917393 919517 921865 924526 927975 932772 939000
53428I39000P001O927O635O848P647Q677R727J0839J2120J3667J5373J6676J6967
$$ 939000 946001 952928 959563 966411 974058 982735 992462 1003301 1015421 1029088 1044461 1061137 1078104
53415A078104J6563J6672J8035K0049K1647K2545K3092K3499K3872K4583K5901
$$ 1078104 1094667 1111339 1129374 1149423 1171070 1193615 1216707 1240206 1264078 1288661 1314562
53404A314562K7413K8564K9438L0469L1627L2615L3594L4927L6323L7039L6973
$$ 1314562 1341975 1370539 1399977 1430446 1462073 1494688 1528282 1563209 1599532 1636571 1673544
53393A673544L6864L7240L7818L8105L8012L7624L6822L5441L3627L1835L0508
$$ 1673544 1710408 1747648 1785466 1823571 1861583 1899207 1936029 1971470 2005097 2036932 2067440
53382B067440K9651K8659K6715K3703K0366J7302J4134J0226N939K431J72j693
$$ 2067440 2097091 2125750 2152465 2176168 2196534 2213836 2227970 2238196 2244135 2246566 2246738 2245045
53370B245045m280p810j1705j5478j9215k3245k7431l0883l2704l3140l3596l5075
$$ 2245045 2240765 2232955 2221250 2205772 2186557 2163312 2135881 2104998 2072294 2039154 2005558 1970483
53358A970483l6953l7888l7575l6860l6277l5403l3865l2161l1017l0399k9596
$$ 1970483 1933530 1895642 1858067 1821207 1784930 1749527 1715662 1683501 1652484 1622085 1592489
53347A592489k8137k6271k4770k4293k4742k5199k4685k3115k1236j9761j8772
$$ 1592489 1564352 1538081 1513311 1489018 1464276 1439077 1414392 1391277 1370041 1350280 1331508
53336A331508j7916j6748j4911j2489j0218q921q645q781q996r481j0183j0472
$$ 1331508 1313592 1296844 1281933 1269444 1259226 1250305 1241660 1232879 1223883 1214402 1204219 1193747
53324A193747r970r144q668q566q411q072p735p384o751n801m910m460m431m365
$$ 1193747 1183777 1174633 1165965 1157399 1148988 1140916 1133181 1125797 1119046 1113245 1108335 1103875 1099444 1095079
53310A095079l750k463r77J34Q69J756K967L860L848L470M047O193R080J1352
$$ 1095079 1091329 1088866 1087889 1088023 1088892 1090648 1093615 1097475 1101323 1104793 1108840 1115033 1124113 1135465
53296A135465J2421J2671J2721J2893J3302J3990J4791J5385J5606J5545J5164
$$ 1135465 1147886 1160557 1173278 1186171 1199473 1213463 1228254 1243639 1259245 1274790 1289954
53285A289954J4180J2518J0614Q899P206N205L171J700O44q85l249n707p486q807
$$ 1289954 1304134 1316652 1327266 1336165 1343371 1348576 1351747 1353447 1354091 1353206 1349957 1344250 1336764 1327957
53271A327957j0299j1930j3262j4369j5783j7573j9156k0051k0335k0320k0212
$$ 1327957 1317658 1305728 1292466 1278097 1262314 1244741 1225585 1205534 1185199 1164879 1144667
53260A144667k0158k0223k0333k0407k0532k0734k0785k0539k0214j9978j9596
$$ 1144667 1124509 1104286 1083953 1063546 1043014 1022280 1001495 980956 960742 940764 921168
53249I21168j8954j8551j8777j8970j8087j6265j4833j4587j4824j4424j3238
$$ 921168 902214 883663 864886 845916 827829 811564 796731 782144 767320 752896 739658
53238G39658j2025j1422j1369j1255j0516r241q152p708p493p005o718p424q690
$$ 739658 727633 716211 704842 693587 683071 673830 665678 657970 650477 643472 636754 629330 620640
53225F20640r072q116p034p027p900q895r840j0686j0860j0109r302r331r715
$$ 620640 611568 603452 596418 589391 581491 572596 562756 552070 541210 531101 521799 512468 502753
53212E02753r400q522q167q516q523p602o524o233o688p300p785q102q094p740
$$ 502753 493353 484831 476664 468148 459625 452023 445499 439266 432578 425278 417493 409391 401297 393557
53198C93557p374p211p003o511n996n866o004n943n521n041m767m608m310l804
$$ 393557 386183 378972 371969 365458 359462 353596 347592 341649 336128 331087 326320 321712 317402 313598
53184C13598l252k888k815k939l046k972k719k446k359k474k515k237j890k044
$$ 313598 310346 307458 304643 301704 298658 295686 292967 290521 288162 285688 283173 280936 279046 277002
53170B77002k728l123k561j560j244j779k153j642p85m71o59o36k10O9j83p15
$$ 277002 274274 271151 268590 267030 265786 264007 261854 260212 259427 258956 258297 257661 257451 257520 257337 256622
53154B56622j147j470j834k135k125j716j075n47m91r43j426j362p56j92k8O5
$$ 256622 255475 254005 252171 250036 247911 246195 245120 244573 244082 243139 241713 240351 239595 239403 239375 239440
53138B39440M97J043J175Q49M82K54n0l99l42K79Q83Q37K98n1M7J88L0j61P8P37
$$ 239440 239937 240980 242155 243004 243486 243740 243690 243291 242949 243228 244111 244948 245246 245195 245242 245430 245460 245299 245377 246114
53118B46114J294J355J099J005J184J159M92m99j024p95m13m95q41q43m53j86
$$ 246114 247408 248763 249862 250867 252051 253210 253702 253203 252179 251384 250971 250476 249635 248792 248339 248153
53102B48153k48k76m5J22r4n17q61j212j671j858j307l04K28j85r91j363j161
$$ 248153 247905 247629 247584 247706 247612 247095 246234 245022 243351 241493 240186 239882 240110 239925 238934 237571 236410
53085B36410r13r72j099r13m87k70n13r59j207j204j244j507j780j668j029j25
$$ 236410 235497 234525 233426 232513 232026 231756 231243 230284 229077 227873 226629 225122 223342 221674 220645 220520
53069B20520N80P44L47l17q43r79p33l12P6L71O77J035J208Q93J95k87r9M94Q63
$$ 220520 221100 221844 222191 221874 221031 220052 219319 219007 219083 219454 220131 221166 222374 223267 223462 223175 223076 223570 224433
53050B24433Q27P18O94M78qk79M2N40M72j91p68q45o95o48n67l23k67p25j261
$$ 224433 225260 225978 226672 227150 227142 226863 226905 227445 227917 227726 226958 226113 225418 224770 224203 223880 223613 222888 221627
53031B21627j092j92N50M84Kj28J36K27MO7Q41J826K083J347K90k73j53K71O00
$$ 221627 220535 220343 220893 221377 221379 221251 221387 221614 221618 221685 222526 224352 226435 227782 228072 227799 227646 227917 228517
53012B28517O90N34J30m49r53j099q45m42j64m3N6J32K2l11n69l28M69J342J703
$$ 228517 229207 229741 229871 229422 228469 227370 226525 226083 225919 225876 225932 226064 226086 225775 225206 224878 225347 226689 228392
52993B28392J475J126J053J065P67L15L20R10J340R71K32R2P12J279J106L60m07
$$ 228392 229867 230993 232046 233111 233878 234193 234513 235423 236763 237734 237966 238058 238770 240049 241155 241515 241108
52976B41108q83r28m68K49O42M52J12J94P49J400J769J558O35o28j407j192l60
$$ 241108 240225 239297 238829 239078 239720 240172 240284 240478 241227 242627 244396 245954 246589 245961 244554 243362 243002
52959B43002L34N03K00l78r59j274j430j781k175j885q13j6l43j071r23QM67p8
$$ 243002 243336 243839 244039 243661 242702 241428 239998 238217 236042 234157 233344 233328 232985 231914 230991 230999 231466 231388
52941B31388r05j383j647j729j181l3Q56R44P05O85P00N19N84J250J914J674N61
$$ 231388 230483 229100 227453 225724 224543 224510 225366 226310 227015 227700 228400 228919 229503 230753 232667 234341 234902
52924B34902n80j113r56k86M86P40K77k71j76M17P60M96j33q37j484j854j740
$$ 234902 234322 233209 232253 231967 232453 233193 233470 233199 233023 233440 234200 234696 234563 233726 232242 230388 228648
52907B28648j236n86J55Q94J278J133Q77R73J173R05J61n53r50j038o78J69Q66
$$ 228648 227412 226826 226981 227875 229153 230286 231163 232136 233309 234214 234375 233822 232872 231834 231156 231325 232191
52890B32191O96Jj33N14R82O56J93L70Q26P26M9n08n57k12L80R87J013J59p90
$$ 232191 232887 232888 232755 233269 234251 234907 235100 235470 236296 237022 237071 236563 236006 235794 236174 237161 238174 238333 237543
52871B37543o00Q92K582L468L508K954J728qj312j296l01M35J67p70j687k257
$$ 237543 236943 237835 240417 243885 247393 250347 252075 252067 250755 249459 249158 249593 249760 248990 247303 245046
52855B45046k452k340k159k221k484k509k024j273o40k41j08m13j123j693j559
$$ 245046 242594 240254 238095 235874 233390 230881 228857 227584 226944 226703 226595 226182 225059 223366 221807
52840B21807q09n0K97K36r0m81n80j90L41N09L88M74P58O18j57q70q44l38q0k77
$$ 221807 220998 220948 221245 221481 221391 220910 220330 220140 220481 220990 221378 221852 222610 223228 223071 222201 221357 221019 220939 220662
52820B20662n96q52j117j308j191q07m63k54M9O07J260J720J742J178J49q08j092
$$ 220662 220066 219214 218097 216789 215598 214791 214328 214074 214123 214730 215990 217710 219452 220630 220779 219971 218879
52803B18879o51p5M1l40q53j192j281j172r65q14p83p29m26Q2M23L63J75K67M51
$$ 218879 218228 218153 218194 217854 217001 215809 214528 213356 212391 211577 210794 210065 209639 209721 210144 210507 210682 210949 211400
52784B11400R8q07j255l89J225K125J645M56n50j166j470j301o56r9k01p93j137
$$ 211400 211498 210691 209436 209047 210272 212397 214042 214498 213948 212782 211312 210011 209355 209256 209055 208262 207125
52767B07125p05L83J458J677P85l63n22M31J282J139O25Q03J536J790J201M83
$$ 207125 206420 206803 208261 209938 210723 210360 209838 210269 211551 212690 213315 214118 215654 217444 218645 219128
52751B19128L10O32J024J154R11N93P94J586K045J341P4l53L87J217J318J106
$$ 219128 219438 220070 221094 222248 223159 223752 224546 226132 228177 229518 229592 229239 229626 230843 232161 233267
52735B33267J198J323R02J50j29L79J095J191M38n39q81n03k75q77j814k076j595
$$ 233267 234465 235788 236690 236840 236711 237090 238185 239376 239814 239275 238394 237891 237616 236739 234925 232849 231254
52718B31254j136j000p20j79L6k46l74pK39q5l91p8L73K15l46o47p62j105j279
$$ 231254 230118 229118 228398 228219 228255 228009 227635 227628 227867 227782 227391 227313 227686 227901 227555 226908 226146 225041 223762
52699B23762n20Q44J484P97m11j104j119q33m96k73l18n02m46j04J65K82O54J432
$$ 223762 223242 224086 225570 226367 225956 224852 223733 222900 222404 222131 221813 221311 220865 220761 220926 221208 221862 223294
52681B23294K000J739R25M51O99J122R37L9r13j226q49k89J00N05J186J878K002
$$ 223294 225294 227033 227958 228409 229108 230230 231167 231206 230293 229067 228218 227929 228029 228534 229720 231598 233600
52664B33600J406N25p3o7N74J517K044J620O19O3M87J332J630J056O7o90r45q83
$$ 233600 235006 235531 235458 235391 235965 237482 239526 241146 241765 241828 242315 243647 245277 246333 246400 245710 244765 243882
52646B43882q55r09p38j65M26N02J14k34l40m32m93r2P82J378J101L59k3J49M22
$$ 243882 243027 242118 241380 241215 241641 242143 242257 242023 241683 241251 240758 240666 241448 242826 243927 244286 244263 244412 244834
52627B44834M84L69J13k65m97l24k1j25n84p34k19M84P21M78K57M01P22P44J75
$$ 244834 245318 245687 245800 245535 245038 244714 244693 244568 243984 243250 243031 243515 244236 244714 244971 245372 246094 246838 247013
52608B47013p57j365j104j70O54Q24N49M17O99J132J268R51M79K61L29K64j80
$$ 247013 246256 244891 243787 243617 244271 245095 245644 246061 246760 247892 249160 250111 250590 250851 251180 251444 251264
52591B51264n69k85N94J265J113L07n91j177j227o33L70J195J405J026K75o82
$$ 251264 250695 250410 251004 252269 253382 253689 253098 251921 250694 250061 250431 251626 253031 254057 254332 253650
52575B53650j490j572p36M40J213J350R51M2j116j765j425p26o50j116j109k93
$$ 253650 252160 250588 249852 250292 251505 252855 253806 253848 252732 250967 249542 248816 248166 247050 245941 245648
52559B45648M98O01M21N01N41Q4m82m02K76Q66J065J058P85O1o52n49J66K55q05
$$ 245648 246146 246747 247168 247669 248210 248294 247812 247410 247686 248552 249617 250675 251460 251521 250869 250320 250486 250741 249936
52540B49936j857j599l88M02L76L33O22N68j36n67M8R23P46l31q64k09O96Q78
$$ 249936 248079 246480 246092 246494 246870 247203 247825 248393 248257 247690 247738 248661 249407 249076 248212 248003 248699 249577
52522B49577O25O85J063J329J509J801J824J065q5n95j26O24R68R43Q72Q86J055
$$ 249577 250202 250887 251950 253279 254788 256589 258413 259478 259393 258798 258672 259296 260264 261207 262079 262965 264020
52505B64020J405J601J157J92o20j004j418k101k468j868n28P57J390J158J74
$$ 264020 265425 267026 268183 268375 267755 266751 265333 263232 260764 258896 258368 259125 260515 261673 261847
52490B61847q72r86j6Q87O12m46r83n20J68K70k38r22j347j127j47J114J899J939
$$ 261847 260975 259989 259973 260860 261472 261026 260043 259523 259691 259961 259723 258801 257454 256327 256180 257294 259193 261132
52472B61132J491P51k08r34p76K75J416J998K123K090J854J392J127J448K000
$$ 261132 262623 263374 263166 262232 261456 261731 263147 265145 267268 269358 271212 272604 273731 275179 277179
52457B77179J935Q28q82k325k914k698k198j881j749j567j339j349j659j917j790
$$ 277179 279114 279942 279060 276735 273821 271123 268925 267044 265295 263728 262389 261040 259381 257464 255674
52442B55674j369r58o29j74N63J424K022K030J454N92k71r78j392j373j051p55
$$ 255674 254305 253347 252718 252544 253107 254531 256553 258583 260037 260629 260358 259380 257988 256615 255564 254809
52426B54809m71K70J557K561K402J385P29J083J947K527K585K303J983K005K575
$$ 254809 254338 254608 256165 258726 261128 262513 263242 264325 266272 268799 271384 273687 275670 277675 280250
52411B80250L271L377K931K857L817N323O281N983M367J896n75k235l089l829
$$ 280250 283521 286898 289829 292686 296503 301826 308107 314090 318457 320353 319778 317543 314454 310625
52397C10625m739n173m552l341k449k060j642q99j26L03L05N8r3J60P19J097J021
$$ 310625 305886 300713 296161 292820 290371 288311 286669 285770 285644 285947 286252 286310 286217 286377 287096 288193 289214
52380B89214P49N41K85rJ85J232K582L386L573L733M075M233L942L334K546J698
$$ 289214 289963 290504 290789 290780 290965 292197 294779 298165 301738 305471 309546 313779 317721 321055 323601 325299
52364C25299J227J530K268K595K215J675J464J463J409J311J152P50K46K29R87
$$ 325299 326526 328056 330324 332919 335134 336809 338273 339736 341145 342456 343608 344358 344604 344833 345820
52349C45820K038K750L057L284L583L915M257M498M440M206M370N242O320O852
$$ 345820 347858 350608 353665 356949 360532 364447 368704 373202 377642 381848 386218 391460 397780 404632
52335D04632O735O452O410O754P644R078J0502J1211J1223J1255J1760J2488J3125
$$ 404632 411367 417819 424229 430983 438627 447705 458207 469418 480641 491896 503656 516144 529269
52322E29269J3764J4459J4857J4729J4465J4492J4536J4037J3179J2765J3071
$$ 529269 543033 557492 572349 587078 601543 616035 630571 644608 657787 670552 683623
52311F83623J3451J3324J2964J2990J3475J4024J4380J4453J3986J2718J0870
$$ 683623 697074 710398 723362 736352 749827 763851 778231 792684 806670 819388 830258
52300H30258Q985P279N563L854K622K171K117J714N39j256l154m552n097m965
$$ 830258 839243 846522 852085 855939 858561 860732 862849 864563 865102 863846 860692 856140 851043 846078
52286H46078m744m814m979m785m035k854j462r8R85J705K299L076M050N003N837
$$ 846078 841334 836520 831541 826756 822721 819867 818405 818307 819292 820997 823296 826372 830422 835425 841262
52271H41262O660P555Q412R064R445R587R510R179Q569P895P627Q063Q823R081
$$ 841262 847922 855477 863889 872953 882398 891985 901495 910674 919243 927138 934765 942828 951651 960732
52257I60732Q497P652P388P740P919P231N719L929K370J164M2j488l638n967p720
$$ 960732 969229 976881 984269 992009 999928 1007159 1012878 1016807 1019177 1020341 1020383 1018895 1015257 1009290 1001570
52242A001570q698r481j0605j1803j2408j2348j2209j2319j2284j1720j0931j0496
$$ 1001570 992872 983391 972786 960983 948575 936227 924018 911699 899415 887695 876764 866268
52230H66268j0375j0039r336q696q303p731o623n357m577m305l958l139k055j175
$$ 866268 855893 845854 836518 827822 819519 811788 805165 799808 795231 790926 786968 783829 781774 780599
52216G80599p77q28j057j092p39j28M94J026J480J870K212K448K283J509N86M24
$$ 780599 779822 778994 777937 776845 776106 775978 776472 777498 778978 780848 783060 785508 787791 789300 789886 790310
52200G90310J192J878J642J069J323K414L277L415L399L650L725L182K251J258
$$ 790310 791502 793380 795022 796091 797414 799828 803105 806520 809919 813569 817294 820476 822727 823985
52186H23985Q3j305k430k942l191l679m390n012n407n465m968m043l286l025k832
$$ 823985 824068 822763 820333 817391 814200 810521 806131 801119 795712 790247 785279 781236 777950 774925 772093
52171G72093k181j192l04L95J084J770K337K773L020K932K618K475K626K782K911
$$ 772093 769912 768720 768416 768811 769895 771665 774002 776775 779795 782727 785345 787820 790446 793228 796139
$$ [...]
##END NTUPLES=NMR SPECTRUM
##END=
