
##TITLE=AC1356_CPIAH12175_6945563_JRe93f0Dzk
##JCAMPDX= 6.0         $$ Bruker NMR JCAMP-DX V2.0
##DATA TYPE= NMR SPECTRUM
##DATA CLASS= NTUPLES
##ORIGIN= BRUKER
##OWNER= Administrator
$$ 1.72 TOPSPIN		Version 2.1
$$ 2012-12-11 22:09:06.776 -0500  Administrator@X
$$ Compression mode = diff/dup
##.OBSERVE FREQUENCY= 400.02188249412
##.OBSERVE NUCLEUS= ^1H
##.ACQUISITION MODE= SIMULTANEOUS (DQD)
##.ACQUISITION SCHEME= undefined
##.AVERAGES= 8
##.DIGITISER RES= 22
##SPECTROMETER/DATA SYSTEM= spect
##.PULSE SEQUENCE= zg30
##.SOLVENT NAME= COFFEE_meoh
##.SHIFT REFERENCE= INTERNAL, COFFEE_meoh, 1, 14.98509
##AUDIT TRAIL= $$ (NUMBER, WHEN, WHO, WHERE, PROCESS, VERSION, WHAT)
$$ ##TITLE= Audit trail, TOPSPIN		Version 2.1
$$ ##JCAMPDX= 5.01
$$ ##ORIGIN= Bruker BioSpin GmbH
$$ ##OWNER= Administrator
$$ $$ E:\/data/COFFEE/nmr/AC1356_CPIAH12175_6945563_JRe93f0Dzk/20/pdata/1/auditp.txt
$$ ##AUDIT TRAIL=  $$ (NUMBER, WHEN, WHO, WHERE, PROCESS, VERSION, WHAT)
(   1,<2012-12-11 22:08:58.276 -0500>,<Administrator>,<X>,<go>,<TOPSPIN 2.1>,
      <created by zg
	started at 2012-12-11 22:07:52.135 -0500,
	POWCHK enabled, PULCHK disabled,
       configuration hash MD5:
       86 BA 57 50 F2 9D 5C 9B 26 00 A9 28 5F 66 2E 89
       data hash MD5: 64K
       56 5A C9 EC BB 56 92 C0 19 5E 7C 33 AE C7 1C 80>)
(   2,<2012-12-11 22:09:01.495 -0500>,<Administrator>,<X>,<proc1d>,<TOPSPIN 2.1>,
      <Start of raw data processing
       efp LB = 0 FT_mod = 6 PKNL = 1 PHC0 = 0 PHC1 = 0 SI = 32K 
       data hash MD5: 32K
       BB 3D 39 C2 0F 94 49 AF C8 32 7C 70 DE DB A0 57>)
(   3,<2012-12-11 22:09:01.995 -0500>,<Administrator>,<X>,<proc1d>,<TOPSPIN 2.1>,
      <pk PHC0 = 98.26172 PHC1 = 0 
       data hash MD5: 32K
       75 9E 38 0D 34 EE 15 C5 14 01 D0 00 98 75 F8 58>)
(   4,<2012-12-11 22:09:02.276 -0500>,<Administrator>,<X>,<proc1d>,<TOPSPIN 2.1>,
      <abs ABSG = 1 
       data hash MD5: 32K
       21 AE 6F 20 46 D0 ED 7B 58 6E CE 25 C5 D7 D7 0A>)
(   5,<2012-12-11 22:09:02.432 -0500>,<Administrator>,<X>,<proc1d>,<TOPSPIN 2.1>,
      <abs ABSG = 2 
       data hash MD5: 32K
       86 C2 AB 03 D6 53 5C 02 4C 36 FB AC 15 37 AA 84>)
(   6,<2012-12-11 22:09:02.588 -0500>,<Administrator>,<X>,<proc1d>,<TOPSPIN 2.1>,
      <abs ABSG = 3 
       data hash MD5: 32K
       7B 0B 18 9B E8 F6 37 14 59 30 11 2C 02 3A F6 1D>)
(   7,<2012-12-11 22:09:02.745 -0500>,<Administrator>,<X>,<proc1d>,<TOPSPIN 2.1>,
      <abs ABSG = 4 
       data hash MD5: 32K
       17 27 42 AD F2 50 FD 36 C9 EC D7 EA 48 9C 50 14>)
(   8,<2012-12-11 22:09:02.901 -0500>,<Administrator>,<X>,<proc1d>,<TOPSPIN 2.1>,
      <abs ABSG = 5 
       data hash MD5: 32K
       62 AB C6 27 81 00 3E C2 69 8E 97 28 A2 16 BC 9E>)
$$ ##END=
$$ 
$$ $$ hash MD5
$$ $$ A5 9F 6C E2 2B C5 09 31 51 33 BE 91 3E EE 4C 06
##$RELAX= 
##$RELAX= 
##$RELAX= 
##$RELAX= 
##$RELAX= 
##$RELAX= 
##$RELAX= 
##$RELAX= 
$$ Bruker specific parameters
$$ --------------------------
##$DU= <E:\>
##$EXPNO= 20
$$ [...]
150 150 150 150 150 150 150 150
##$TP07= 0
##$TPNAME0= <>
##$TPNAME1= <>
##$TPNAME2= <>
##$TPNAME3= <>
##$TPNAME4= <>
##$TPNAME5= <>
##$TPNAME6= <>
##$TPNAME7= <>
##$TPOAL= (0..7)
0.5 0.5 0.5 0.5 0.5 0.5 0.5 0.5
##$TPOFFS= (0..7)
0 0 0 0 0 0 0 0
##$TUNHIN= 0
##$TUNHOUT= 0
##$TUNXOUT= 0
##$USERA1= <user>
##$USERA2= <user>
##$USERA3= <user>
##$USERA4= <user>
##$USERA5= <user>
##$V9= 5
##$VALIST= <valist>
##$VCLIST= <CCCCCCCCCCCCCCC>
##$VD= 0
##$VDLIST= <DDDDDDDDDDDDDDD>
##$VPLIST= <PPPPPPPPPPPPPPP>
##$VTLIST= <TTTTTTTTTTTTTTT>
##$WBST= 2048
##$WBSW= 25
##$XGAIN= (0..3)
0 0 0 0
##$XL= 0
##$YL= 0
##$YMAX_a= 632691
##$YMIN_a= -540149
##$ZGOPTNS= <>
##$ZL1= 120
##$ZL2= 120
##$ZL3= 120
##$ZL4= 120
##$ABSF1= 14.98509
##$ABSF2= -5.573092
##$ABSG= 5
##$ABSL= 3
##$ALPHA= 0
##$AQORDER= 0
##$ASSFAC= 0
##$ASSFACI= 0
##$ASSFACX= 0
##$ASSWID= 0
##$AUNMP= <proc_prof1d_extract_pilot.lims>
##$AXLEFT= 0
##$AXNAME= <>
##$AXNUC= <1H>
##$AXRIGHT= 0
##$AXTYPE= 0
##$AXUNIT= <>
##$AZFE= 0.1
##$AZFW= 0.1
##$BCFW= 0
##$BC_mod= 0
##$BYTORDP= 0
##$COROFFS= 0
##$CY= 15
##$DATMOD= 1
##$DC= 0
##$DFILT= <>
##$DTYPP= 0
##$F1P= 0
##$F2P= 0
##$FCOR= 0.5
##$FTSIZE= 32768
##$FT_mod= 6
##$GAMMA= 0
##$GB= 0
##$INTBC= 1
##$INTSCL= 1
##$ISEN= 128
##$LB= 0
##$LEV0= 0
##$LPBIN= 0
##$MAXI= 10000
##$MC2= 0
##$MEAN= 0
##$ME_mod= 0
##$MI= 0
##$NCOEF= 0
##$NC_proc= -8
##$NLEV= 6
##$NOISF1= 0
##$NOISF2= 0
##$NSP= 0
##$NTH_PI= 0
##$NZP= 0
##$OFFSET= 14.98509
##$PC= 1
##$PHC0= 98.26172
##$PHC1= 0
##$PH_mod= 1
##$PKNL= yes
##$PPARMOD= 0
##$PPDIAG= 0
##$PPIPTYP= 0
##$PPMPNUM= 2147483647
##$PPRESOL= 1
##$PSCAL= 4
##$PSIGN= 0
##$PYNMP= <proc.py>
##$REVERSE= no
##$SF= 400.02
##$SI= 32768
##$SIGF1= 0
##$SIGF2= 0
##$SINO= 400
##$SIOLD= 32768
##$SPECTYP= <>
##$SREGLST= <1H.CDCl3>
##$SSB= 0
##$STSI= 32768
##$STSR= 0
##$SW_p= 8223.68421052631
##$SYMM= 0
##$S_DEV= 0
##$TDeff= 65536
##$TDoff= 0
##$TI= <>
##$TILT= no
##$TM1= 0
##$TM2= 0
##$TOPLEV= 0
##$USERP1= <user>
##$USERP2= <user>
##$USERP3= <user>
##$USERP4= <user>
##$USERP5= <user>
##$WDW= 1
##$XDIM= 32768
##$YMAX_p= 483431767
##$YMIN_p= -803275
##$CURPLOT= <Network HP LaserJet P1505>
##$CURPRIN= <$Network HP LaserJet P1505>
##$DFORMAT= <normdp>
##$LAYOUT= <+/1D_H.xwp>
##$LFORMAT= <normlp>
##$PFORMAT= <normpl>
##$SURQMSG= 1
$$ End of Bruker specific parameters
$$ ---------------------------------
##NTUPLES= NMR SPECTRUM
##VAR_NAME=  FREQUENCY,     SPECTRUM/REAL,   SPECTRUM/IMAG
##SYMBOL=    X,             R,               I
##VAR_TYPE=  INDEPENDENT,   DEPENDENT,       DEPENDENT
##VAR_FORM=  AFFN,          ASDF,            ASDF
##VAR_DIM=   32768,         32768,           32768
##UNITS=     HZ,            ARBITRARY UNITS, ARBITRARY UNITS
##FACTOR=    0.250966925370066, 1,           1
##FIRST=     8223.43324360094, -146011,      -74314
##LAST=      0,             -174213,         -42657
##MIN=       0,             -803275,         0
##MAX=       8223.43324360094, 483431767,    0
$$ Real data points
##PAGE= N=1
##DATA TABLE= (X++(R..R)), XYDATA
$$ [...]
19542A21695n0746J37562A03550l7630b17574A00673p617Q1658a31481p099B88006
19530A48998d843l08373j56473J41853G3870d95851K06700J7474R1492k17921
19520c98106B9012a83776A08350E1574K67642a03789r8850a7572C83622a95496
19509b08236A4780a83385b6270B70276a10079k40097h9911o4660C8912a09330
19498A00386f4538D8451J76902Q0386I9629J7874d8160j12141F286e2413j44619
19487a97032f797m2377D2389a60582c2347D8749J01748J3521A7490b98362e712
19475A17645J11023r7197K1940A6142c48220g6431B8549J09636f9906l57693J98379
19464b29220B8309b20755k8224M5210A63821M6293e221j002C0491b64789C3780
$$ y = [121695, 70949, 208511, 103550, 65920, -217574, 100673, 93056, 174714, -131481, -138580, 288006, 148998, -4843, -313216, -469689, -327836, 73870, -495851, -289151, -271677, -180185, -398106, 29012, -183776, 108350, 51574, 319216, -103789, -202639, -17572, 383622, -195496, -208236, 14780, -183385, -26270, 270276, -110079, -350176, -89911, -154571, 38912, -109330, 100386, -64538, 48451, 225353, 305739, 99629, 117503, -48160, -160301, 6286, -52413, -197032, -6797, -49174, 42389, -160582, -32347, 48749, 150497, 164018, 17490, -298362, -5712, 117645, 228668, 131471, 153411, 16142, -348220, -76431, 28549, 138185, -69906, -427599, -229220, 28309, -220755, -248979, -203769, 163821, 210114, -5221, -6223, 30491, -264789, 33780]
19452A9362P010c9861m00280g5020G7487c04395J07011a4757E867a03569d2178
19440f7083A04078a5513j29544P904A57839c70844a39295b3216j85989E1361a7745
19428A2381N4939I373O4386b8188j44900j44720e4693H987b57676a9168A03747
19416e2953k55158D6720b19057j86602g6400D2598b21260c064m24900J16568J37471
19405a73925j48466d3580k72281J14875A58724a47091n0808f2792H5400a31928
19394b29187j92432E1488k4306a45089c8482j03932E3075O4323b97179A67951
19383a06969J3547A38418a95642d7064B32975f9785I3835J2314b42059A34965
19372A74565F4170J2216B1531i0585k99472C3157K62882a54274N4192k79743a02214
$$ y = [19362, 26372, -39861, -440141, -75020, 77487, -304395, -197384, -14757, 5867, -103569, -42178, -67083, 104078, -15513, -145057, -137153, 157839, -370844, -139295, -23216, -209205, 51361, -17745, 12381, 67320, 9373, 73759, -28188, -173088, -317808, -54693, 8987, -257676, -19168, 103747, -52953, -308111, 46720, -219057, -405659, -76400, 42598, -221260, -3064, -427964, -311396, -173925, -322391, -43580, -315861, -200986, 158724, -147091, -197899, -62792, 85400, -131928, -229187, -421619, 51488, 27182, -145089, -38482, -142414, 53075, 117398, -297179, 167951, -106969, -93422, 138418, -195642, -47064, 232975, -69785, 93835, 106149, -242059, 134965, 174565, 64170, 76386, 21531, -90585, -390057, 33157, 296039, -154274, -100082, -379825, -102214]
19360i0356H0710c68871a71556b6710j2469I2472b00862d2657a9141D0140a58380
19348B5764c96292D17498D0038a7091l32158A14480b30517D39394c51130d6716
19337b95778D2230b44204B17463o9804a19413A00993R4542b24968C1784K30547
19327B62331I2458g6823k73723D2016b86757A270a744l27305J40339j11909H4179
19315a3256j57052m2386Q2558q1193e1995A50181b15277p6709g1085A28499M7331
19304A75830L021a52873j26277L4324Q2595A51898O3424i4068G4884a50220j22823
19293b73043f5534n2315A01883L62715b21515A12851E3655a9964k28633C2486
19282a16627A94437A5615a9834A8427M6075K4842l0216P5267l1696f8512E8677
$$ y = [-90356, 80710, -368871, -171556, -26710, -39179, 92472, -200862, -42657, -19141, 40140, -158380, 25764, -396292, 417498, 40038, -17091, -349249, 114480, -230517, 439394, -351130, -46716, -295778, 42230, -244204, 217463, 147659, -119413, 100993, 195535, -224968, 31784, 262331, 92458, -76823, -350546, 42016, -286757, 1270, -1744, -329049, -188710, -300619, 84179, -13256, -170308, -212694, -130136, -211329, -51995, 150181, -215277, -291986, -71085, 128499, 175830, 178851, -152873, -279150, -244826, -162231, 151898, 215322, -94068, 74884, -150220, -273043, -65534, -117849, 101883, 464598, -221515, 112851, 53655, -19964, -248597, 32486, -116627, 194437, 15615, -19834, 18427, 64502, 89344, 59128, 134395, 102699, -68512, 58677]
19270A94708b55777A15633b17310o225A1494a02252j40095Q1126c6584k0772b4231
19258b03247d8820K548p0373e7929p7390N4956k20192J13739A3452g0340F7174
19246D9361g2367o6349f5526o1797F7514b05369j0930E74511b42539A99920f1954
19234b05514A1286b8848B6278J35738J1105a37935C39680a86684B6234i7281I1120
19222a3566k15133j23460B5529L7957d75237e2044k77774B76888F7345a26542
19211c2615r513R599n0625k41953a17179C7350a0818A42165d7778r0401B3835
19199a64972O0057I0097A2723J43383d9538B56144c15835J4370a12415G7300g4040
19187G1776J35485h170D0144d1851j97961A94972b31288g618B19537l6603i9698
$$ y = [194708, -255777, 115633, -217310, -223535, 11494, -102252, -242347, -161221, -36584, -57356, -24231, -203247, -48820, -46272, -116645, -57929, -135319, -80363, -300555, -186816, 13452, -70340, 67174, 49361, -72367, -138716, -65526, -127323, 67514, -205369, -216299, 574511, -242539, 199920, -61954, -205514, 11286, -28848, 26278, 162016, 173121, -137935, 339680, -186684, 26234, -97281, 91120, -13566, -228699, -352159, 25529, 63486, -475237, -52044, -329818, 276888, 67345, -126542, -32615, -42128, -32529, -83154, -325107, -117179, 37350, -10818, 142165, -47778, -138179, 23835, -164972, -104915, 90097, 12723, 156106, -49538, 256144, -315835, -301465, -112415, 77300, -74040, 71776, 207261, -8170, 40144, -41851, -239812, 194972, -231288, -7618, 219537, 182934, -99698]
19175b50158A48213f7672B1275b40893a20284c2043A53039a71003n3908h8447
19164B77397b17496D2048J12954c9690j99555D2395c90797a15229j36804j23360
19154c75393c643j73375b9904r156k20223j4216a12601a3925j40241n3644c8742
19142B62053a4587r6684k244a5824A07947O7739a09208K0919J7004B46569m7788
19131A98781a18457C4796b63286A77954J04757A7198f616A56391a86260n724A07824
19119i3020l7087e9077j56010O5814k26964C6703a91665M7460L9714a0829m45505
19108d56334C38201c70029g7933r8312e2736k8501A8921f6918R130m9183A29290
19096b11773p3247h9727A21260D2752a65215D3983j2414d0469m9815E2703b22402
$$ y = [-250158, 148213, -67672, 21275, -240893, -120284, -32043, 153039, -171003, -224911, -88447, 277397, -217496, 42048, 155002, -39690, -239245, 42395, -390797, -115229, -252033, -375393, -3643, -177018, -29904, -39060, -259283, -273499, -112601, -13925, -154166, -207810, -38742, 262053, -14587, -111271, -113515, -15824, 107947, 175686, -109208, -88289, -71285, 246569, 198781, -118457, 34796, -263286, 177954, 282711, 17198, -6616, 156391, -186260, -191984, 107824, -93020, -130107, -59077, -215087, -149273, -376237, 36703, -191665, -144205, -104491, -10829, -456334, 338201, -370029, -77933, -176245, -52736, -81237, 18921, -66918, -57788, -106971, 129290, -211773, -285020, -89727, 121260, 42752, -165215, 43983, 31569, -40469, -90284, 52703, -222402]
19084d68696e5022E8955Q7418p850B6667L88284a31430F6280a91115N7786H8964
19072A49900g9204p3008j7485b5442r6787C19689D3562Q1182c17605N8110C741
19060C65564b59072J28794a4826k83369R0550f8390A06371A2346a12806d8833
19049I9867c4552A19653a67336P0161D0770i8091k32603C05106B1860a97382K6618
19038a70764P7137A04284K7865a5701B9124P508J38096c7526C13830F309J48403
19027A54712c01049a1675D60328D0540L02504B1442a30572H5099B5427b56387
19016f0373A77945H956L21325H3320C7056a67885H2438c72027c7415C38561a71304
19004f1306j23290j05625A7970a34889E5639m518a47593B21466p8378a18856E4974
$$ y = [-468696, -55022, 58955, 146373, 138523, 26667, 414951, -131430, 66280, -191115, -133329, 88964, 149900, -79204, -152212, -169697, -25442, -122229, 319689, 43562, 124744, -317605, -259495, 3741, 365564, -259072, -130278, -14826, -298195, -207645, -68390, 106371, 12346, -112806, -48833, 99867, -34552, 119653, -167336, -97175, 40770, -98091, -330694, 305106, 21860, -197382, -170764, -93627, 104284, 132149, -15701, 29124, 36632, 174728, -37526, 313830, 6309, 154712, -301049, -11675, 460328, 40540, 343044, 21442, -130572, 85099, 25427, -256387, -60373, 177945, 8956, 330281, 83320, 37056, -167885, 82438, -372027, -37415, 338561, -171304, -61306, -184596, -290221, 17970, -134889, 55639, 51121, -147593, 221466, 143088, -118856, 54974]
18992H1731j3991d3730l53526A4599d22320a24047C93578d9982A74462B4451j2139
18981A2312c544l3497D0086b7618B21779i9042m9252k76457a4640k57970A6879
18969a07054I7373C4783a07254A96229f1939A7517M7704A8107a02011k25847B0728
18957b41431i6672K7140A55377b08826A2356a90793a5595j62109C50763d4180
18946A2745a62877B20191h7666F4713a46863b7092r7244E3754f9700A7708L9212
18935E6920J10767b72885G228c655k13479I2491G776J22609B8418a01765I9177
18923b00071C7197c2665j12710F337K98821m7650a48862K3341A29935b25086E9826
18911G4423a00858J3324j37967N049o9499h5342m2044B81874A04056J43083c53914
$$ y = [81731, 67740, -43730, -397256, 14599, -422320, -124047, 393578, -49982, 174462, 24451, 12312, -3544, -37041, 40086, -27618, 221779, -99042, -148294, -424751, -14640, -272610, 16879, -107054, 97373, 34783, -107254, 196229, -61939, 17517, 65221, 18107, -102011, -327858, 20728, -241431, -96672, -69532, 155377, -208826, 12356, -190793, -15595, -177704, 350763, -44180, 12745, -162877, 220191, -87666, 64713, -146863, -27092, -124336, 53754, -69700, 17708, 56920, 167687, -272885, 7228, -3655, -217134, 92491, 7776, 130385, 28418, -101765, 99177, -200071, 37197, -32665, -145375, 6337, 305158, 257508, -148862, -125521, 129935, -225086, 59826, 74423, -100858, -87534, -225501, -220452, -289951, -85342, -127386, 281874, 104056, 247139, -353914]
18899E9008Q4246D2301J6281d6396C67755I7988J8876a34148j48421O3482B4600
18887A91594b18923i4224C32310B4199b02920C60313c40315C07247b33392H444
18876B20539f5197n1916o3800a9579l69921A58720g3857j06472j48349D3652H257
18864a10840K1144H6745j6937R7017f22027C2630M7692a50567I6416g4439A05684
18852e4632A13347J38375n7404q2052D0953a65723F9879a72703E7135A6064i0742
18840b65557a2021o1324C51130i4981J501C734i2241A06129M25d7454J2406l39983
18828c75031i3291j05544B128C47a45340J2541f5153A25352k4794J35925A14858
18816A194a9168k844I1822J2963J74575J40264j61882j02702d5811C4546J44874
$$ y = [59008, 143254, 42301, 58582, -46396, 367755, 97988, 116864, -134148, -282569, -219087, 24600, 191594, -218923, -94224, 332310, 24199, -202920, 360313, -340315, 307247, -233392, 8444, 220539, -65197, -117113, -180913, -19579, -389500, 158720, -73857, -180329, -328678, 43652, 8257, -110840, -89696, 86745, 69808, 166825, -622027, 32630, 80322, -150567, 96416, -74439, 105684, -54632, 113347, 251722, 194318, 112266, 40953, -165723, 69879, -172703, 57135, 16064, -90742, -265557, -12021, -73345, 351130, -94981, -93480, 3734, -92241, 106129, 106554, -47454, -35048, -375031, -93291, -198835, 2128, 347, -145340, -132799, -65153, 125352, 100558, 236483, 114858, 1194, -19168, -22012, 91822, 104785, 279360, 419624, 257742, 155040, -45811, 34546, 179420]
18805A79420h826D1899a69625E21a02776m22490H5695d3051j90976A9581N4547
18794G4128a97809d2710k07773b5784A19004n6532J6975P4882p4737e2007B27153
18782A3148b38660g5449p168D11441A9577J20138k5356b9850j36327p4116c0512
18770d618j51982F3050b85986E5615a07161j02673B85882b07169k64053A13032
18759F322J71629L1407c18786a46455N0246l6599C2375b62446P794M9008n4412
18748b60056A40874K439d10211a90965A25418b63403A01229a55971c2399B49160
18737A75554d6250m86673a65122C06713A52380b17982o5552J09696L8304C4391
18726a35508H614a49351e4030A07190a70439A67507d0156J6256a1255j43217E8224
$$ y = [179420, -8826, 41899, -169625, 521, -102776, -525266, 85695, -43051, -234027, 19581, 74128, -197809, -42710, -250483, -25784, 119004, 62472, 79447, 154329, 79592, -52007, 227153, 13148, -238660, -75449, -82617, 411441, 19577, 139715, 114359, -29850, -166177, -240293, -30512, -4618, -156600, 63050, -285986, 55615, -107161, -209834, 285882, -207169, -471222, 113032, 6322, 177951, 209358, -318786, -146455, -96209, -132808, 32375, -262446, -254652, -205644, -260056, 140874, 143313, -410211, -190965, 125418, -263403, 101229, -155971, -32399, 249160, 175554, -46250, -532923, -165122, 306713, 152380, -217982, -283534, -173838, -135534, 34391, -135508, 8614, -149351, -54030, 107190, -170439, 167507, -40156, -23900, -11255, -154472, 58224]
18714d8848k9293L7309n3792A9405d6475a4374j40479G9805d3159J9603j91885
18703b15441F1885J62812b5596j70907c3171q2451l26050J10678K8415I8872J48383
18692B47255c67011c4161A60605f2613l2941O547k7937p5122k6793L8731A1906
18680d9743G179M4857d57091C7570b3329r2616D9007a76010B23100b23452M716
18669b18736I9462b64748M2688j19326a62128c0454k79469g2882j0211j93906
18659b76999C76665c23089J45982G9834J28156c78223G8164J44641C5427b524
18648f2095a9060E0475P7059b66049A38726a23992l0583l5627E3408J78248c9956
18636C3202b25522L7998j52896C74160I6709c21019D04265a467n798l66956a77103
$$ y = [-48848, -78141, -40832, -94624, 19405, -46475, -14374, -154853, 79805, -43159, -23556, -215441, 61885, 224697, -25596, -196503, -33171, -115622, -441672, -330994, -302579, 98872, 247255, -367011, -34161, 160605, -62613, -95554, -89007, -116944, -192066, -218859, -180128, 11906, -49743, 7179, 52036, -457091, 37570, -23329, -115945, 49007, -176010, 223100, -223452, -218736, 99462, -264748, -222060, -341386, -162128, -30454, -309923, -72882, -83093, -276999, 376665, -323089, -177107, 79834, 207990, -378223, 78164, 222805, 35427, -2524, -62095, -19060, 50475, 127534, -266049, 138726, -123992, -154575, -190202, 53408, 231656, -39956, 33202, -225522, -187524, -340420, 374160, 96709, -321019, 404265, -1467, -7265, -374221, -177103]
18624D1676K74023i9262k1939B15246a76676E3071K6239d97429B17680a6387B53322
18612A32974i7833F7987a67641P493m2452Q3180B55563j12148m5229a52130B76918
18600a72273A66153a02274n0080D01276b91583A20679E1447a89029P7454k68481
18590c80056a62988d4988A69712H1594L5007c82994f7580r9706A60862c56333
18579F8179b3972n771j83626k27239g1173l04038Q4947A7240a21664j7104k55462
18568c94230e5174A67003b98843g6470a7343C14598d62058a08797I2240M2111
18558A34351c10456A43866d9826k11504a29470p3277A95669n3888c36343b3115
18547c84466A04598a52178J2284p6820g5429K0164j04334A8048L41570e54E262
$$ y = [41676, 315699, -99262, -121201, 215246, -176676, 53071, 79310, -497429, 217680, -16387, 253322, 132974, -97833, 67987, -167641, -160148, -202600, -119420, 255563, 143415, 98186, -152130, 276918, -172273, 166153, -102274, -152354, 401276, -291583, 120679, 51447, -189029, -111575, -380056, -162988, -44988, 169712, 81594, 116601, -382994, -67580, -167286, 160862, -356333, 68179, -23972, -29743, -213369, -440608, -71173, -375211, -290264, 17240, -121664, -138768, -394230, -55174, 167003, -298843, -76470, -17343, 314598, -462058, -108797, 92240, 134351, -310456, 143866, -49826, -261330, -129470, -202747, 195669, 141781, -336343, -23115, -384466, 104598, -152178, -139894, -216714, -75429, -55265, -159599, 18048, 359618, -554, 5262]
18535A95744C959K58346f0970l5070G7464A337d3495p654o346l05491i4444n9626
18523a54070f6630k81524J19369G5225c0485B7123d9989B25660d6083G3826J16522
18512A90348m8834h0162o7792j19640g1709G2876b25699l9210A95220p9082b59148
18500a76113Q2899A61132a17521j1754B29713a04228k3802L7777F911J81867m9368
18489A39410b37028h9741H1040a18153K0383B7568b6451l49047C43107F2781i3721
18477b47243b764p7336b5069k93257Q1642B0372c68217d494l13127D639Q5837
18466I0476f508r0137d1861H1520a17732A79713C5091e8594E9641f4180k47908
18455c12088A60073a61291B49613q5901b8959j16309O0458a2952B6242J16555
$$ y = [195744, 3959, 262305, -60970, -96040, 77464, 1337, -43495, -51149, -57495, -362986, -94444, -154070, -66630, -348154, -228785, 75225, -30485, 27123, -49989, 225660, -46083, 73826, 190348, 141514, -80162, -147954, -267594, -71709, 72876, -225699, -264909, 195220, 116138, -259148, -176113, -93214, 161132, -117521, -129275, 229713, -104228, -128030, -90253, 6911, 188778, 139410, -237028, -89741, 81040, -118153, -97770, 27568, -26451, -375498, 343107, 62781, -93721, -247243, -2764, -80100, -25069, -318326, -236684, 20372, -368217, -4494, -317621, 4639, 90476, -6508, -96645, -41861, 81520, -117732, 179713, 35091, -58594, 59641, -64180, -312088, 160073, -161291, 249613, 163712, -28959, -145268, -84810, -12952, 26242, 142797]
18445A42797L38155e5178n5535j08765A37949b71763A4302P4079b15856i8823
18434a49084j12173A55062E8250O3606m0767B6338e8515C0230L4344L1385G398
18422b85573d5281I300c31109J56035G0425J67275a03002j31505a4422A50591
18411d9052n4866o8215b5825q0012a8249B5204c7499D3136A582M836c96703h227
18398d96051g9243j49749H4090N2711g1934A59592a86331B03661a37828J6559
18388a21269A28009a02576j70854J23906A66935m5032g4890b5944A50537c34280
18377F0878a76030q2207F1652J92261f1696G8227c7996E6281b59972C9211K53742
18366B92953q0408r4191i2249E8261R0748a33043G4235b37724k39586c1481A8087
$$ y = [142797, 480952, -55178, -110713, -219478, 137949, -271763, 14302, 88381, -215856, -98823, -149084, -261257, 155062, 58250, 121856, 81089, 26338, -58515, 30230, 64574, 95959, 7398, -285573, -45281, 9300, -331109, -175074, 70425, 237700, -103002, -234507, -14422, 150591, -49052, -103918, -172133, -25825, -105837, -18249, 25204, -37499, 43136, 1582, 6418, -396703, -8227, -496051, -79243, -228992, 84090, 136801, -71934, 159592, -186331, 203661, -137828, -121269, 128009, -102576, -273430, -149524, 166935, 121903, -74890, -25944, 150537, -334280, 60878, -176030, -258237, 61652, 253913, -61696, 78227, -37996, 56281, -259972, 39211, 292953, 212545, 118354, -92249, 58261, 149009, -133043, 74235, -237724, -477310, -31481, 18087]
18354B47905H8941J01106H4202b08809g9376q6843G8211C108K89503e2647j24436
18343a77083Q1559l23655d0607A02147e39640e584j23387A35806b25688E6795
18332B72519h0772F2685J793a30105A8207J72440c8087k49186f7615C27764b63126
18320B20002b69908B60104D7334e3222B05951p0309a42637o2283e8071A9416b20649
18308a42683H3869K336b15573B46230b06454i4999K8234A60212J1316H3633N7294
18297A40927d89115a71705A36317J90898N9596d04520J21384D0878J88806I808
18286d4799H0005b70508B26488c76297J38426P4086B44043B1505O0513j7888R0173
18275A54303b06721p7860i949B67518a35526J094j0375j59200A61993a31215A39293
$$ y = [247905, 88941, 190047, 84202, -208809, -79376, -166219, 78211, 3108, 292611, -52647, -177083, -95524, -419179, -40607, 102147, -539640, -5584, -128971, 135806, -225688, 56795, 272519, -80772, 62685, 64478, -130105, 18207, 190647, -38087, -287273, -67615, 327764, -263126, 220002, -269908, 260104, 47334, -53222, 205951, 135642, -142637, -204920, -58071, 19416, -220649, -142683, 83869, 86205, -215573, 246230, -206454, -94999, -66765, 160212, 171528, 83633, 140927, -489115, -171705, 136317, 327215, 386811, -404520, -283136, 40878, 229684, 9808, -44799, 80005, -270508, 226488, -376297, -237871, -163785, 244043, 21505, 82018, 64130, 154303, -206721, -284581, -9949, 267518, -135526, -134432, -144807, -304007, 161993, -131215, 139293]
18263A16611J13783a8042k71043j18699J72487D0687d8469A65949b2261j90417
18253b12678D37702E2393K17391a52213A47549a76575J8392J720A0991a40155
18242A28970c5002A90142b32494F5082K24698d3167a3034I1370f3559o5489j90924
18231c19972J33033L0604b0930m8993A25201l4118M5797h838j63238H2860i0784
18219a2840k26543a00514n0536J7458c8463a780C23439a15201j67233G0652c9660
18207E9512b44838j64902H8734a92080f4955B2249c4640B0525c85537h401j16552
18196a24953p2112e2042j59951k20779J76878a00253d145G1348a88515P9312H2934
18184i0652B3212a26340e0172H409b58346d9196B3771O9885Q8983c51679k07923
$$ y = [116611, 230394, -18042, -289085, -407784, -235297, 40687, -48469, 165949, -22261, -212678, 437702, 52393, 269784, -152213, 147549, -176575, -158183, -156463, 10991, -140155, 128970, -35002, 190142, -232494, 65082, 289780, -43167, -13034, 91370, -63559, -129048, -319972, -186939, -156335, -20930, -69923, 125201, 91083, 136880, -8838, -172076, 82860, -90784, -12840, -239383, -100514, -151050, -133592, -38463, -1780, 323439, -115201, -282434, 70652, -39660, 59512, -244838, -409740, 88734, -192080, -64955, 22249, -34640, 20525, -385537, -8401, -124953, -197065, -52042, -211993, -432772, -255894, -100253, -4145, 71348, -188515, -109203, 82934, -90652, 23212, -126340, -50172, 8409, -258346, -49196, 23771, 93656, 182639, -351679, -559602]
18173e59602a21695D4434h9456l1441G1588c04093B56592a17208m8129a9621j73441
18162a93062E8773b73883F1971b99183R7013h7473B68346F8582e0577k24536A68722
18150b61974c8599C47929f8806J036b8510E6656b86781F9851O3952C0783a02937
18138C51132a03653F2542a72128j08589e8150A85898b2772J0186k09577A76577
18127d0477F1900b26042P8748d9960E8114f5320j28814Q9922j51751M3315G4565
18115a14092m1409j18114D4650b15510c3689A02964i0015j43208A20855c04539
18104H8266b961C2410Q2369b02302a3869I7906J1469a66324B2105f2627I2828
18092B09405c08377J44771H8088a36950G7233d12769b9848k3998C97866A06157
$$ y = [-559602, -121695, 44434, -89456, -120897, 71588, -304093, 256592, -117208, -165337, -19621, -193062, 58773, -273883, 61971, -299183, -202170, -87473, 268346, 68582, -50577, -275113, 168722, -261974, -38599, 347929, -68806, -67770, -28510, 56656, -286781, 69851, 133803, 30783, -102937, 351132, -103653, 62542, -172128, -280717, -58150, 185898, -22772, -12586, -222163, 176577, -40477, 61900, -226042, -147294, -49960, 58114, -65320, -194134, -104212, -255963, -212648, 74565, -114092, -155501, -273615, 44650, -215510, -33689, 102964, -90015, -233223, 120855, -304539, 88266, -2961, 32410, 114779, -202302, -13869, 97906, 109375, -166324, 22105, -62627, 92828, 209405, -308377, -163606, 88088, -136950, 77233, -412769, -29848, -53846, 397866, 106157]
18081B34661i837p6017j57444a14789m17D4594a28718A57251J9106J0564C0863
18069a69277A94369K9756D0460A4019L2701c92720a82668A11047b7983j62928
18059a90911H1193b5282A88054o1365A9834a25878a5761D4824J97296b8351j35108
18048a63459N6370J9589j57952a15604k12197e7966A23436J44017C2275I962a45104
18036a37052b0469A30730a39823F588L56149A41497D9225l666K6876a18434D2128
18024A09302r579J6121p040K28C3846e1826C90345a83469b8414a3984k26011b9955
18011A65710B9263j0948J04469B4072C581J64311B90R2386h63B6018J72665b90831
17998c26547A06536e0916p001A47497C484d5875k23139J6629c8808B53535a5758
$$ y = [234661, -9837, -85854, -243298, -114789, -115206, 44594, -128718, 157251, 176357, 186921, 30863, -169277, 194369, 224125, 40460, 14019, 46720, -392720, -182668, 111047, -27983, -190911, 81193, -25282, 188054, 126689, 19834, -125878, -15761, 44824, 242120, -28351, -163459, -107089, -87500, -245452, -115604, -327801, -57966, 123436, 267453, 32275, 9962, -145104, -137052, -20469, 130730, -139823, 6588, 362737, 141497, 49225, 45559, 72435, -118434, 42128, 109302, 99723, 115844, 108804, 109032, 33846, -51826, 390345, -183469, -28414, -13984, -239995, -29955, 165710, 29263, 18315, 122784, 24072, 3581, 167892, 290, 92676, -863, 26018, 198683, -290831, -326547, 106536, -50916, -57917, 147497, 3484, -45875, -269014, -252385, -38808, 253535, -15758]
17986a17575A0840K20339D0919A2789a49380L1871j58307a31960j45074B64895
17975B38900c4680j450n7375A01062b29797i0046C3586A5166L80990d4757A10848
17963b69686A07695c0255q308F3316b34445a15064C1134b86254K9762a25542a6759
17951G5164O1920b85468a7962l38148A11268b4720B69379e9613A46532C2644M9437
17940H2081d6532l5763J460L9241A5220a88741B57135b00668f151j29478l45303
17929d80932K5150e2477A69025a4744j10941k2182D3622F463b59734c8837D50053
17917b13848M320C14740b38075A36786c6810k4638F8023f2318G0e8714A03818
17905A31105h133B4604J50135a37270j92091b0192A5065a46442A62555F2017c26443
$$ y = [-117575, 10840, 231179, 40919, 12789, -149380, -117509, -275816, -131960, -277034, 264895, 238900, -34680, -36130, -93505, 101062, -229797, -90046, 33586, 15166, 396156, -44757, 110848, -269686, 107695, -30255, -38563, 63316, -234445, -115064, 31134, -286254, -256492, -125542, -16759, 75164, 137084, -285468, -17962, -356110, 111268, -24720, 269379, -59613, 146532, 32644, 82081, -46532, -82295, -80835, -41594, 15220, -188741, 257135, -200668, -6151, -135629, -480932, -455782, -52477, 169025, -14744, -125685, -147867, 43622, 6463, -259734, -38837, 450053, -213848, -209528, 314740, -238075, 136786, -36810, -61448, 68023, -62318, 70, -58714, 103818, 131105, -8133, 24604, 174739, -137270, -329361, -20192, 15065, -146442, 162555, 62017, -326443]
17893h1273G250J51145c66671g4432B44164n3977g7712F4830d0365k53936L3452
17882b60849r4759A56459J20423j36022e6309A16241Q6864n100F9802k5223a2626
17870b71473P7134g6141j3752i54l31402a46926I7459h8014I7622B7098P3679
17859A00777b55708A66593a78978m297G4586b58975C5323N9388d5552p8509H5740
17847a14053j52504A30641j9855a43300I830a6440k97606J10697B20249e2491
17836a15238A23197e19047a72521g0846H4369B0576L10421G3937K64426c67277
17825A38583l2219a5750j14559N0959o1384j7641l34802d8115j46106A46351d3111
17813b121H8887C1996i3750l08265a12728A21213c34733J57677B2322d9832B2965
$$ y = [-81273, 7250, 158395, -366671, -74432, 244164, 190187, -77712, 64830, -40365, -294301, -260849, -355608, 156459, 276882, 140860, -56309, 116241, 203105, 198005, 69802, 44579, -12626, -271473, -194339, -76141, -89893, -954, -332356, -146926, 97459, -88014, 97622, 27098, 100777, -255708, 166593, -178978, -183275, 74586, -258975, 35323, 94711, -45552, -124061, 85740, -114053, -266557, 130641, 110786, -143300, 9830, -16440, -314046, -203349, 220249, -52491, -115238, 123197, -519047, -172521, -70846, 84369, 20576, 330997, 73937, 338363, -367277, 138583, 106364, -15750, -130309, -79350, -140734, -158375, -493177, -48115, -194221, 146351, -43111, -2121, 88887, 31996, -93750, -402015, -112728, 121213, -334733, -177056, 22322, -49832, 22965]
17801C18508A05869J97099a35826E8688a52547b945H9034J37525b88516c9949
17790B5315A1989e8924A24681P1543G1966a3882A57705a95495H2068J91968c48548
17778d3865A29497f4125c187l60016A19317a5087F5746a56371K0306D8245c5244
17766A2443i365r1815a7196k35500H8118c72013B00523a453k09876F9696i6688
17754A64258K299a19197a3697k56388A60815D2398a71481a2465B8639a01248F2782
17742a1690j79363A5047K47559F3816a90560c2327B35912g1429g52q4734B8295
17730E75106A71842C6344J76750p7406n9370C535a10288j49910A61074b94186
17719H0851J8816O5123b15071A94342D5916J6229P1174d240k74902B42678r7543
$$ y = [318508, 105869, 302968, -135826, 58688, -152547, -2945, 89034, 226559, -288516, -39949, 25315, 11989, -58924, 124681, 196224, 71966, -13882, 157705, -195495, 82068, 274036, -348548, -43865, 129497, -64125, -3187, -363203, 119317, -15087, 65746, -156371, -136065, 48245, -35244, 12443, -9365, -101180, -17196, -252696, 88118, -372013, 200523, -1453, -211329, 69696, -96688, 164258, 166557, -119197, -13697, -270085, 160815, 42398, -171481, -12465, 28639, -101248, 62782, -11690, -191053, 15047, 262606, 63816, -190560, -32327, 235912, -71429, -752, -85486, 28295, 575106, 171842, 36344, 213094, 135688, 76318, 3535, -110288, -260198, 161074, -294186, 80851, 99667, 164790, -215071, 194342, 45916, 62145, 133319, -4240, -279142, 242678, 145135]
17708A45135n4222b81100C56845A03350a32234D8011K78637F2220P2678a55056
17697c0285C96847a74675E1332J06905a55498j37388D7782K2998J7897J47927
17687B36604K2696E7818k6589Q1653j3582C4565b05461Q8479B9010c25549f0075
17675f113r3801A62097E0290i5206A12485b91615B63645q4998J72952a28747J0517
17664a18230A14336P3852b72922l635E4273a07320l6108L291f0257B59023c02573
17652b61089B25557E1600b13758J8937k8643j14105B35895b02997A22293i5653
17641E7072d5697k34898G395a12135E8323a23119j19005K6493A92556J06183a46954
17629a63788B70003o3171c57729G5349b74256A40597C1608L877K02300F3928K37461
$$ y = [145135, 90913, -281100, 356845, 103350, -132234, 48011, 326648, 62220, 134898, -155056, -30285, 396847, -174675, 51332, 158237, -155498, -292886, 47782, 70780, 88677, 236604, 259300, 57818, 31229, 112882, 99300, 34565, -205461, -116982, 29010, -325549, -60075, -6113, -99914, 162097, 50290, -95206, 112485, -291615, 263645, 178647, 351599, -128747, -118230, 114336, 188188, -272922, -276557, 54273, -107320, -143428, -140137, -60257, 259023, -302573, -261089, 225557, 51600, -213758, -194821, -223464, -337569, 235895, -202997, 122293, -95653, 57072, -45697, -280595, 7395, -112135, 58323, -123119, -242124, -215631, 192556, 298739, -146954, -163788, 270003, 206832, -357729, 75349, -274256, 140597, 31608, 35485, 237785, 63928, 301389]
17618C01389a98245G1860J86403j29109a04027c7154k52631A34777D9289a34081
17607F1099J3371D894J37164E5480a22260m1715F45749j90668a6115I7038J65348
17596B62386e8942E5566K41271A3182C774a06584K3942b9922q1675A51875n2277
17585I9598L8587D959J2956C622L4325P6247m1926h2087C97976A33621h850j7963
17573b6813k1481A90916c1721C5022a12175H3626e546A55581e8017j97622J23954
17562a31685A17236J21033a69074H4147a69A43944K42804a14897j47110C42079
17551e5268A02601f397C4523O4976B0299a86985d7157F7346a03742q5092N3158
17540a35676C0798a68813l695d3935a2494B07124B9287a74308j10174a16032I5363
$$ y = [301389, -198245, 71860, 258263, 129154, -104027, -37154, -289785, 134777, 49289, -134081, 61099, 74470, 4894, 142058, 55480, -122260, -163975, 645749, 455081, -16115, 97038, 262386, -58942, 55566, 296837, 13182, 3774, -106584, -82642, -29922, -111597, 151875, 99598, 138185, 4959, 17915, 3622, 37947, 114194, 72268, -82087, 397976, 133621, -8850, -26813, -48294, 190916, -31721, 35022, -112175, 83626, -5546, 155581, -58017, -255639, -131685, 117236, 238269, -169074, 84147, -169, 143944, 386748, -114897, -262007, 342079, -55268, 102601, -6397, 34523, 99499, 20299, -186985, -47157, 67346, -103742, -188834, -135676, 30798, -168813, -172508, -43935, -12494, 207124, 29287, -174308, -284482, -116032, 95363]
17528i194D5248N7706N9007J79350o5696a40033I9980J49858j04183e4120j0862
17517f4982C18968a44957j3559C06447j3256m9369A06688L8896b28674i5809k5659
17506a21468K2930H4285a9009C11755j1411D4867M27M5149J6065L54454j68481
17495B92481a11666A05021N9264J52985j49862A6853J60254D0528J41029g0632
17484G1518A2500M31265E5269P238k669K23497I6583o14j704a13047b2106A97569
17471d0596C01915o2168d7549A41168J05033g0260I0157d3895B0819L24331A57117
17459B83318A0398d149A49621a42685B21527k4939j1008R6847A06517R824K96799
17448D13140l1979j23808d0680D38712o6377A82906l8165P5311F7489K49834j05803
$$ y = [-9194, 45248, 102954, 161961, 341311, 275615, -140033, 99980, 249838, 145655, -54120, -64982, 318968, -144957, -158516, 306447, 293191, 243822, 106688, 145584, -228674, -95809, -121468, -98538, 84285, -19009, 311755, 300344, 44867, 45294, 90443, 106508, 460962, 292481, -111666, 105021, 164285, 317270, 167408, 16853, 177107, 40528, 181557, -70632, 71518, 12500, 443765, 55269, 62507, 59838, 283335, 96583, 95969, 94265, -113047, -22106, 197569, -40596, 301915, 239747, -47549, 141168, 246201, -70260, 90157, -43895, 20819, 345150, 157117, 283318, 10398, -4149, 149621, -142685, 221527, 196588, 185580, 282427, 106517, 116341, 413140, 381161, 257353, -40680, 438712, 372335, 182906, 144741, 220052, 67489, 317323, 211520]
17437B11520J93131A95370a52425B76252j11714J9285O2832c07613F2424K00084
17427B62508J37459j16596m3016J0156k1182J35962A67282J15525a37738D28359
17416C21016n1934A23790J88899n9814j9608A04188j7708J16400a6148k68368
17406b84516B15577H8030K00167D699M1006K08870N02976A45634J47342c12361
17395D07341H4715a72380B17986K64751j99416H3791i8294H24262B52314d2702
17384B28647J22807j54858k8175G6933J57321n5630J63947A11620a3044F6893
17373C03551p2185q6080o9937J22130J51160e0213D17775A53123o1216K88659
17363C80566E7652J73048a66276N4613A29442M56677A32103O3625n3719d8570
$$ y = [211520, 404651, 195370, -152425, 276252, 164538, 183823, 246655, -307613, 62424, 262508, 399967, 283371, 240355, 250511, 229329, 365291, 167282, 282807, -137738, 428359, 321016, 269082, 123790, 312689, 252875, 233267, 104188, 86480, 202880, -16148, -284516, 215577, 88030, 288197, 4699, 45705, 254575, 757551, 145634, 292976, -312361, 407341, 84715, -172380, 217986, 482737, 283321, 83791, -98294, 824262, 252314, -42702, 228647, 351454, 196596, 168421, 76933, 234254, 178624, 342571, 111620, -13044, 66893, 303551, 231366, 145286, 75349, 197479, 348639, -50213, 417775, 153123, 91907, 380566, 57652, 230700, -166276, -111663, 129442, 586119, 132103, 195728, 142009, -48570]
17352A21784H870L05994J46661b26780B00284e9105o8581B44750b3380D31525
17341A89442E4545J00705d1563E27197D432R4977P5844l3933i4890A45105l558
17330A41547a30213A59006K03171A45720C2439Q7682J77644A16618E877J97917
17320B03794L45887A66278B7142O1772J73380L08840D8520M2170b16983e8954
17309b92731A40874a15080C35523A50566K11799l3049j43999D0292L16496a37575
17298A34369J3751J01675B9822L41984F5149M83625k07877a10614D8178K99487
17288C47665b79291A98290J04524K97487A77951b05765A14261M01416A03663K13985
17278C17648j46598B2362J12683p139E7599N49636B92270b13322I534J80345J5724
$$ y = [121784, 8870, 314864, 461525, -226780, 200284, -59105, -127686, 244750, -23380, 431525, 189442, 54545, 155250, -41563, 527197, 4432, 99409, 175253, 141320, -94890, 145105, 141547, -130213, 159006, 362177, 145720, 32439, 120121, 297765, 116618, 5877, 203794, 549681, 166278, 27142, 88914, 262294, 571134, 48520, 90690, -216983, -58954, -292731, 140874, -115080, 335523, 150566, 362365, 329316, 185317, 40292, 356788, -137575, 134369, 148120, 249795, 29822, 371806, 65149, 548774, 340897, -110614, 48178, 347665, -279291, 198290, 302814, 600301, 177951, -205765, 114261, 515677, 103663, 317648, 171050, 22362, 135045, 127906, 57599, 607235, 292270, -213322, 9534, 189879, 205603]
17267B05603J33464e1765C29318g5903A75755J95656E8886k7591K96833H5616
17256D20079H7898m0878K70078j58326k7231J82073b06512A67947J45737a14716
17245C00296a82193A78039N6586q3220P6410c4762A95043J17198r5235J01864
17235C18870l0512j43696l5300K10237r1885l6157o5666J03572q011f9958B4468
17223A69443K6804K11649P0629o4300r5219d791C07340c3679A82245J51890d2344
17211A64950p9092M51848g2023C51170i649A73713E3135a1019B20379i1122A49004
17199B75410L1228M65915A42189b628B47575L6492a40398C76270A83454e3480
17188A71792k3067K07525R0603j78589J4066A36422K03757A01692L16213c0729
$$ y = [205603, 339067, -51765, 329318, -75903, 175755, 371411, 58886, 31295, 328128, 85616, 420079, 87898, 47020, 317098, 158772, 131541, 313614, -206512, 167947, 313684, -114716, 300296, -182193, 178039, 234625, 151405, 227815, -34762, 195043, 312241, 217006, 318870, 288358, 144662, 109362, 319599, 227714, 191557, 125891, 229463, 221452, -69958, 24468, 169443, 196247, 407896, 478525, 414225, 319006, -4791, 307340, -33679, 182245, 334135, -42344, 164950, 85858, 537706, -72023, 351170, -9649, 173713, 53135, -11019, 220379, -91122, 149004, 275410, 306638, 772553, 142189, -2628, 247575, 284067, -140398, 376270, 183454, -53480, 171792, 148725, 356250, 446853, 268264, 282330, 136422, 340179, 101692, 417905, -30729]
17177C03144n430J41220G1535M63766j09309A56411L00640n7709J63672N1599
17167F14613j64507a33074C17788m4314K35839o2034j39250P2811J13898A09958
17156B52386p6819N748O120O8333M0745J25198a05330A73296F5655K80074A47493
17144C20421I5258M53544n5885j42548j5490N6739J35143i4160D40510N3671j369
17133D92812j05137j0377a1597B64469j03464M53276O0433A84040J67185L0219
17123C81444j77077K75335R8614B73033j2249J32062P1730A62788K09095j44312
17113B27571J70441K44800j38988B31047j13206M37677k57060J32218J5012L91269
17103H36957l46218k18439q1931J81943K80742j13791H8379J72816M3665j3620
$$ y = [303144, 297714, 438934, 71535, 535301, 425992, 156411, 457051, 399342, 563014, 614613, 450106, -133074, 317788, 273474, 509313, 447279, 308029, 380840, 494738, 109958, 252386, 175567, 181315, 187435, 255768, 296513, 421711, -105330, 173296, 65655, 345729, 147493, 320421, 95258, 548802, 492917, 350369, 334879, 391618, 526761, -94160, 440510, 494181, 492812, 387675, 377298, -11597, 264469, 161005, 614281, 674714, 184040, 351225, 381444, 204367, 479702, 578316, 273033, 260784, 392846, 464576, 162788, 371883, 227571, 398012, 642812, 503824, 231047, 117841, 555518, 298458, 430676, 445688, 836957, 490739, 272300, 190369, 372312, 653054, 539263, 88379, 261195, 304860, 291240]
17093B91240M4785L11621B86860G0605L95347l8217j70513M42744p5711L6550
17083F60805k9408B94184L80728k46014O2085L33825l1099I6351K48734P7680
17073D22765I8105O39666K907j74316j10748B04499L05641K95848C14014q9238
17063B24776M30436j84575J35617B91299N5122K61501J0331k9290B55792K51118
17053E06910k13214J11022j38484K63948j02821p124J22947A60719F4091K91807
17043C55898O9685P4682J02465J25803j27058L576L9791B25400K47183j3483K50964
17032G10064j84385p6823M24289j23722k05219k0376j25725J34953m3200N5933
17022E45789J84234j07215j77671K9936K59518m7446m3297K6635L4593L4678n3855
$$ y = [291240, 336025, 647646, 286860, 70605, 465952, 427735, 257222, 699966, 624255, 660805, 631397, 294184, 674912, 428898, 490983, 824808, 793709, 96351, 345085, 422765, 98105, 737771, 740678, 566362, 455614, 204499, 510140, 805988, 314014, 224776, 655212, 470637, 606254, 291299, 346421, 607922, 618253, 588963, 255792, 506910, 293696, 404718, 266234, 530182, 427361, 420237, 543184, 160719, 64091, 355898, 425583, 500265, 602730, 728533, 601475, 605051, 644842, 225400, 472583, 459100, 710064, 525679, 448856, 873145, 749423, 544204, 523828, 398103, 533056, 489856, 545789, 730023, 622808, 445137, 475073, 734591, 687145, 643848, 670483, 705076, 739754, 685899]
17011F85899J43336k04215J32264Q5951k80126L62470k74469L6415p4398K71281
17001H84408n36j08224q4287R2469j17451K57792l65384L92044J22624l34892
16991G38563P1787k78341P33708k63453j05848j79416J70411j45119n270J05408
16981H42430k57575J09950L4003J19552q2098K01591l8778M2336R4479j94649
16971H71241n6139Q1795j17569J77296j54855L00435J38135m70101J27778J62783
16961A060799k30594K67738Q2798j40505j19933J29901J93416k38064l59249N99743
16951A246050j07008j32628J33389j40237Q1089K35244k50764p0289l0055K57992
16941A222783j59019M638O006j11478M94033l03471P6756j39372K40556J4508
$$ y = [685899, 829235, 625020, 757284, 843235, 563109, 925579, 651110, 687525, 613127, 884408, 883872, 775648, 691361, 783830, 666379, 924171, 558787, 950831, 1073455, 738563, 810350, 532009, 1265717, 1002264, 896416, 717000, 887411, 742292, 737022, 842430, 584855, 694805, 728808, 848360, 766262, 967853, 929075, 971411, 1065890, 871241, 815102, 896897, 779328, 956624, 801769, 1102204, 1240339, 770238, 898016, 1060799, 830205, 1097943, 1180741, 1040236, 920303, 1050204, 1243620, 1005556, 646307, 1246050, 1139042, 1006414, 1139803, 999566, 1080655, 1315899, 1065135, 994846, 964791, 1222783, 1063764, 1068402, 1074408, 962930, 1456963, 1153492, 1230248, 1090876, 1331432, 1345940]
16931A345940j22795K0871L298M29689k94993k41934K08952J02873j55709J38263
16921A434455k31955Q0483N6220L67687n32721N44882l99528J79159J36686m20664
16911A214704L77661J28163o0449R2198j8549N5083k24307J05572K82138n3110
16901A899104l30548L41537K61820n05821K85587L1484K6824J36282k23423J22103
16891B044949O5195P4482J30605l36926r9118J02569J79674k87074K57410j13239
16881B018527L86353m27411M70964l66446K1353K05754j64356P415M62531k26073
16871B388611q789R5752L31777l72004J42019j62585M0652J14030R4265P5463
16861B739191M9701o0297L23460r3983J5355q3949K17768L0266j68295M61204
$$ y = [1345940, 1223145, 1244016, 1247314, 1677003, 1382010, 1140076, 1349028, 1451901, 1296192, 1434455, 1202500, 1282983, 1339203, 1706890, 1174169, 1719051, 1319523, 1498682, 1635368, 1214704, 1592365, 1720528, 1660079, 1752277, 1733728, 1788811, 1564504, 1670076, 1952214, 1899104, 1568556, 1910093, 2171913, 1666092, 1951679, 1983163, 2009987, 2146269, 1922846, 2044949, 2110144, 2184626, 2315231, 1978305, 1879187, 1981756, 2161430, 1874356, 2131766, 2018527, 2404880, 1977469, 2448433, 2081987, 2103340, 2309094, 2144738, 2152153, 2614684, 2388611, 2379822, 2475574, 2807351, 2435347, 2577366, 2414781, 2455433, 2569463, 2663728, 2739191, 2788892, 2728595, 3052055, 2958072, 2973427, 2889478, 3107246, 3137512, 2969217, 3430421]
16851C430421l100j79483j43651J04525L08363j0345j08941N2545o6451L61370
16841C745253j15009k64411N56123q945R7523P0981k30763M09858J26351m01171
16831C985790N15286k83348L62565l25810O26608j67841J48355k72666M59911
16822E048850j73418K96760q7985K93430K46138l22772J23081L30829K88538L19097
16812F362548J09710m31490L35257J29173Q0864Q2140M08492j06634K51714P5658
16802G297432J36613r4991O91940L22149k76252K96206M25052j46481L34489j652
16792H984505O47820R6941L48893Q7087K28673M40580M96277P4110P16146K9582
16782A2150614L07988L77353L39710K70583K00064P65086L51245M87749M59208
$$ y = [3430421, 3427321, 3247838, 3104187, 3208712, 3517075, 3506730, 3397789, 3450334, 3383883, 3745253, 3630244, 3365833, 3921956, 3913011, 4010534, 4081515, 3850752, 4260610, 4386961, 3985790, 4501076, 4217728, 4580293, 4254483, 4881091, 4713250, 4861605, 4588939, 5048850, 4875432, 5172192, 5084207, 5377637, 5623775, 5301003, 5424084, 5754913, 6043451, 6362548, 6472258, 6040768, 6376025, 6505198, 6586062, 6668202, 7076694, 6970060, 7221774, 7297432, 7434045, 7339054, 8030994, 8353143, 8076891, 8373097, 8798149, 8651668, 8986157, 8984505, 9632325, 9729266, 10078159, 10165246, 10393919, 10834499, 11330776, 11404886, 12121032, 12150614, 12458602, 12835955, 13175665, 13446248, 13646312, 14411398, 14762643, 15250392, 15709600]
16773A5709600P75351K0433Q80021M22191Q50327R5588J200571N71405O03870
16764B1129357J025779R35777M41138P56898J142405J300315J027914P97910J527342
16755C0084835J230140J615836J390395J595257J858472J349002K109627K078326
16747D3311890K124221K299942K464578K694797K966035K862324L208224L424313
16739F5356324M134712L701418M618532M567236M926899M956611N356266O218020
16731A03836018O184607O336655O328753P580774P087671O947258P130904O833375
16723A58266015O873476O076908N702853N031667L516924K602107J383908M18162
16715A89872020j065067k765209l265222m442908n622530n832440o761064p333430
$$ y = [15709600, 16484951, 16505384, 17385405, 17807596, 18657923, 18753511, 19954082, 20525487, 21129357, 22155136, 23090913, 23532051, 24288949, 25431354, 26731669, 27759583, 28557493, 30084835, 31314975, 32930811, 34321206, 35916463, 37774935, 39123937, 41233564, 43311890, 45436111, 47736053, 50200631, 52895428, 55861463, 58723787, 61932011, 65356324, 69491036, 73192454, 77810986, 82378222, 87305121, 92261732, 97617998, 103836018, 110020625, 116357280, 122686033, 130266807, 137354478, 144301736, 151432640, 158266015, 165139491, 171216399, 176919252, 181950919, 185467843, 188069950, 189453858, 189872020, 188806953, 186041744, 182776522, 178333614, 172711084, 166878644, 160117580, 152784150]
16707A52784150p261612o959326p513570o948960p138788o580002o621888n614679
16699I8145325n872096n338377n210487m796271m281085m182920l981360l747162
16691F0735567k984156k992223k843736k754002k622165k552924k088046k017190
16683C9881125j668112j960706j618032j902309j362478j394493r23211j484786
16675B7566998j222531j278681r25230p36735r28257j286932n63974j064166n53938
16666A9006554m33565r12953q15737j48641p76421n48021m73323o32847m00204
16657A3864842n98851n24899l06222l56448k03014m04702n89006K26766j045050
16648A0063416J52914m37035l69564J72298k78583l74011q38304M65714l50859
$$ y = [152784150, 145522538, 138563212, 131049642, 124100682, 116961894, 110381892, 103760004, 98145325, 92273229, 86934852, 81724365, 76928094, 72647009, 68464089, 64482729, 60735567, 57751411, 54759188, 51915452, 49161450, 46539285, 43986361, 41898315, 39881125, 38213013, 36252307, 34634275, 32731966, 31369488, 29974995, 29051784, 27566998, 26344467, 25065786, 24140556, 23403821, 22475564, 21188632, 20624658, 19560492, 19006554, 18572989, 17660036, 16844299, 16695658, 15919237, 15371216, 14897893, 14265046, 13864842, 13265991, 12741092, 12434870, 12078422, 11875408, 11470706, 10881700, 11108466, 10063416, 10216330, 9779295, 9409731, 9582029, 9303446, 8929435, 8091131, 8556845, 8205986]
16639H205986j19893j36973o62853J82273k60668m30373M8715j64238k16295q109
16629F437572m93993K89765m27431m9699n28576N58980j51625j22794k94931p0592
16619E146676J51688m29354j37886Q121j40090o54314L70345m9285M2129k20281
16609D087749n1370k09390J48627K40771n96751k47157K3764o4637o7339J19144
16599C383411j69026K2634j36562J43761N3384m04599l2113J97592l41466L03606
16589C020622k81238K38729P6205m657j51004o66778J71990L97037q7621k59806
16579B453479j25038J78352j92302j63105L23187l02211l5582J47895n36177K82900
16569B031398j79815M32152m06250k1689K27324p9413m69696J72834j78205o533
$$ y = [8205986, 8086093, 7949120, 7286267, 7468540, 7207872, 6777499, 6826214, 6661976, 6445681, 6437572, 5943579, 6233344, 5805913, 5756214, 5227638, 5786618, 5634993, 5512199, 5217268, 5146676, 5298364, 4869010, 4731124, 4739245, 4599155, 3944841, 4315186, 4265901, 4308030, 4087749, 4036379, 3826989, 3975616, 4216387, 3619636, 3372479, 3396243, 3331606, 3264267, 3383411, 3214385, 3237019, 3100457, 3244218, 3297602, 2893003, 2860890, 3058482, 2717016, 3020622, 2739384, 2978113, 3054318, 3049661, 2898657, 2231879, 2403869, 2800906, 2713285, 2453479, 2328441, 2506793, 2314491, 2151386, 2474573, 2172362, 2136780, 2284675, 1748498, 2031398, 1851583, 2283735, 1877485, 1855796, 2083120, 2003707, 1534011, 1706845, 1528640, 1522107]
16559A522107J49046j44052J69817o5914K2700n8814L12955j80461k41419j28909
16549A357056O3732J60216J55724m48138J87750K54603k43544K36143l27056l8632
16539A357854P2683K36285K4783n65110K76583j09734J93716k88442j34933L48023
16529A411708k74415q3575k56554L53514j32899J45434R6460L85688j21593m91122
16519A032646J86243k98420L21866K45102n86929J3315n066J88175k7217J5462
16509A085177j08645L87174n51132J86259M7502k19162J32163k18390o6066J61554
16499H36434N46436m71737j06159K68194l76602M82042m34028J38465J19764l93588
16489F09221M4508K36992j64292Q2089l55859K79001J10460k17315J10693K03765
$$ y = [1522107, 1671153, 1527101, 1696918, 1631004, 1653704, 1594890, 1907845, 1727384, 1485965, 1357056, 1420788, 1581004, 1736728, 1288590, 1476340, 1730943, 1487399, 1723542, 1396486, 1357854, 1430537, 1666822, 1691605, 1126495, 1403078, 1293344, 1487060, 1198618, 1063685, 1411708, 1137293, 1053718, 797164, 1150678, 1017779, 1163213, 1259673, 1645361, 1523768, 1032646, 1218889, 920469, 1242335, 1487437, 900508, 913823, 908757, 1096932, 1069715, 1085177, 976532, 1363706, 812574, 998833, 1046335, 827173, 959336, 740946, 674880, 836434, 1382870, 911133, 804974, 1073168, 696566, 1178608, 744580, 883045, 1002809, 609221, 653729, 890721, 726429, 808518, 452659, 731660, 842120, 624805, 735498, 939263]
16479I39263k11253o362J78461j96134j03490K04553r0250q7439M2186j84681
16469D84854q5970L69125L088k32213j43799J32981K38858C45145K28232J36824
16459G10201l29884n1366J74008K6103L25673k91218K50408l04550R9243O9141
16449F77759j39494J63098k1302l14833K62390l267j73411A85027J96904O761
16439C88692K95167B22485J96390j78253L00626j73174R2010o9398J13720D7203
16428C98889J12472K09100p1263k50009j04519K64862J17408A20087l7355M70857
16418E53589p5169e5287D06360A00760M06607j50493K34071m6561j24962E0302
16407A02663J75064I6793a07844F04815j41814K0050m0258j43429K01339j02729
$$ y = [939263, 728010, 721648, 900109, 703975, 600485, 805038, 714788, 627349, 669535, 484854, 398884, 768009, 771097, 538884, 395085, 528066, 766924, 345145, 573377, 710201, 380317, 328951, 502959, 529062, 854735, 563517, 813925, 509375, 608618, 677759, 538265, 701363, 680061, 365228, 627618, 624351, 450940, 185027, 381931, 388692, 683859, 222485, 418875, 240622, 541248, 368074, 460084, 390686, 504406, 47203, 398889, 511361, 720461, 649198, 399189, 294670, 559532, 676940, 120087, 82732, 553589, 478420, -55287, 406360, 100760, 507367, 356874, 590945, 544384, 419422, 50302, 102663, 277727, 96793, -107844, 604815, 463001, 483051, 442793, 299364, 500703, 397974]
16397C97974j85221l0802J03068J89848l8553O1333j14853o8027j03686M09824
16387F20905A23514K53254C4596d7638j2477B93523n5901p9248a48963A33883
16376A64018e247o2753g692E5277L70950j04248K81261j80124q8250L5719H394
16364D69425j52289J07762F0408L58951o3181A41667P1563L7801J90446j58395
16354B83082L82918B88681j16662k7095K56524A83413J33160n5893J6484A00230
16343B26442P2925O8633J33860k41813B3773Q6773J99160I8422R966J65124J99323
16332D72835n6281j55050j0466r2777J17158d0760B46852f0607A74453K51378
16322D25831j96790J11396J4559c6874B59445J48222c4187C01806A29400b09655
$$ y = [397974, 212753, 181951, 285019, 474867, 436314, 497647, 382794, 314767, 211081, 620905, 123514, 376768, 34596, -47638, -60115, 293523, 237622, 158374, -148963, 133883, 164018, -5247, -68000, -7692, 55277, 426227, 321979, 603240, 423116, 334866, 370585, 8394, 469425, 317136, 424898, 60408, 419359, 356178, 141667, 213230, 251031, 441477, 283082, 666000, 288681, 172019, 144924, 401448, 183413, 316573, 260680, 277164, 100230, 226442, 299367, 368000, 501860, 260047, 23773, 110546, 309706, 98422, 108388, 273512, 472835, 416554, 261504, 251038, 158261, 275419, -40760, 246852, -60607, 174453, 425831, 229041, 340437, 354996, -36874, 259445, 407667, -34187, 301806, 129400, -209655]
16311C37929H7956M17597A6125d3450A87540e9855A53221M14310A25430c71897
16300B85922k4923b13389B0573R7113J52956j16792K28855E1452a42272C61276
16289G7781L36483b20326J3475A49674C2696K06296N5274m1573a86006O0303j838
16278a27541O1323c1208E06933j42308E8860N4087J18269H8391h5522D02720o3058
16267C39662e2218a2173A37290d04874C1805c8420E5420k5565b15668P0027M5956
16256i9685B46941J6338C97R108K8864J77177n2222R5205a05885B56028q8481
16245A67547D3353B363K23789b31400e5394A30647p803J44499b31820A109b2615
16233C91978A45112D8811p4a24395A50783h0497B15363a89857b4767B8408L09486
$$ y = [337929, 87956, 505553, 16125, -43450, 187540, -59855, 153221, 567531, 125430, -371897, 285922, 260999, -213389, 20573, 117686, 270642, 153850, 382705, 51452, -142272, 361276, 77781, 414264, -220326, -206851, 149674, 32696, 238992, 294266, 252693, -186006, -125703, -127541, -66218, -31208, 506933, 364625, 58860, 112947, 231216, 88391, -85522, 402720, 339662, -52218, -12173, 137290, -404874, 31805, -38420, 55420, 29855, -215668, -145641, -99685, 246941, 263279, 397, 9505, 38369, 215546, 163324, 258529, -105885, 256028, 167547, 43353, 2363, 226152, -231400, -55394, 130647, 122844, 267343, -231820, 1109, -22615, 391978, 145112, 48811, 48737, -124395, 150783, -80497, 215363, -189857, -24767, 28408, 337894]
16222C37894B3987J87268b32412R1725B12801a22994A46797c5161B32951G2434
16211B31426A03822a16441I7874d9834m7354B41844D1351g8152j35805E2026N913
16200E7939K00901a36452B59968d9541r8483B96224D1726J17173O5563A9010L24339
16189C43349c98509a52656D5842a04393D4453N0782b7955F2529a25071O1612l36577
16178d00036J46563A03078J94586A13170a30381k9702C1444b95172g4654D13621
16167B5907J69834r0533f7450j76546c1060n0288D27718I7826N32200I6787D7425
16155d3840B09575R2025a9028k3531A28510l6351M8831o2460f5426j78397D1886
16143a25685J7941j64093D4431Q531j112a6735j69848I0698a40882B24948d0592
$$ y = [337894, 23987, 211255, -232412, -140687, 212801, -122994, 146797, -35161, 232951, 72434, 231426, 103822, -116441, 97874, -49834, -97188, 241844, 41351, -78152, -213957, 52026, 57939, 258840, -136452, 259968, -49541, -148024, 296224, 41726, 158899, 224462, 19010, 343349, -398509, -152656, 45842, -104393, 44453, 95235, -27955, 62529, -125071, -63459, -400036, -253473, 103078, 297664, 113170, -130381, -160083, 31444, -295172, -74654, 413621, 25907, 195741, 105208, -67450, -243996, -31060, -81348, 427718, 97826, 630026, 96787, 47425, -43840, 209575, 301600, -19028, -42559, 128510, 92159, 140990, 78530, -65426, -243823, 41886, -125685, -107744, -271837, 44431, 52962, 51850, -16735, -186583, 90698, -140882, 224948, -40592]
16131a54816A77244d389C29536j00691e8157j14991C06406A49296a06902A47925
16120c17407h2680A38794c7596j95734b9163l0612E9977c04805A79343i3545d3162
16108a22265K5529a4585k55348B14993J9200c9641B59212n978f3401K2656p0085
16097a10830F4290b25622B35421b35562C0763A272b53908n3648P8897e4106A57649
16085c67654B83659b4114H9061A0495R7244c53126a02880B70882e0021A52445
16074b0320A92323a46169d6422A23056a25752K8618j21686B1058d5732A94966
16063b89843G4894Q4935a44447l1776A83846b44650C46101A16437a21590j23863
16053b45453G8295a58780J2548e5485D51687D9744j0017b58935j26630d7380l60298
$$ y = [-154816, 177244, -4389, 329536, 228845, -58157, -173148, 306406, 149296, -106902, 147925, -317407, -82680, 138794, -37596, -233330, -29163, -59775, 59977, -304805, 179343, -93545, -43162, -122265, -96736, -14585, -269933, 214993, 234193, -39641, 259212, 253234, -63401, -40745, -110830, 64290, -225622, 235421, -235562, 30763, 1272, -253908, -307556, -228659, -54106, 157649, -367654, 283659, -24114, 89061, 10495, 107739, -353126, -102880, 270882, -50021, 152445, -20320, 192323, -146169, -46422, 123056, -125752, -97134, -218820, 21058, -45732, 194966, -289843, 74894, 159829, -144447, -176223, 183846, -244650, 346101, 116437, -121590, -245453, 78295, -158780, -146232, -55485, 451687, 49744, 39727, -258935, -385565, -47380, -407678]
16042d07678A2169a94533j852A63730g1248r8734j22623G1587N52074b65306M9111
16031b16195B15264A3106K44969j02481A5160a19705C46450a99795A35184n8821
16021G6363I108h6256j89102B36084a85126Q0688l8348a0745E056L37145B7046
16009h709H0550b06875C1195i1422A30198c19876N0103C9181h3708K0643l09113
15998c72178B44070b13850D48974a40026f2463A52284a32744N4086r8725b6556
15987B08923P1538K5664O5698A74124B6988e8804I1189K64649I4143j0899b19660
15975A52919c3126A39576f5512A19650K23300g830j77642b5122A40577a42635
15964a91828A18043J00627a50337I7654j2907k1958a63632A4554J82092a94720
$$ y = [-407678, 12169, -194533, -196385, 163730, -71248, -169982, -292605, 71587, 623661, -265306, -216195, 215264, 13106, 258075, 155594, 15160, -119705, 346450, -199795, 135184, 76363, 9108, -86256, -275358, 236084, -185126, -104438, -142786, -10745, 5056, 342201, 27046, -8709, 80550, -206875, 31195, -91422, 130198, -319876, -269773, 39181, -83708, -63065, -372178, 244070, -213850, 448974, -140026, -62463, 152284, -132744, -78658, -177383, -26556, 208923, 280461, 306125, 371823, 174124, 26988, -58804, 91189, 355838, 94143, 83244, -219660, 152919, -33126, 139576, -65512, 119650, 342950, -7830, -185472, -25122, 140577, -142635, -191828, 118043, 218670, -150337, 97654, 84747, 62789, -163632, 14554, 196646, -194720]
15953b3071C95566g7145C4133J43056c92126a01786C44890a55158A88673O4793
15943B53466D6888B3145c19356d1088b219k40608d5326A6467K2009a85604a2773
15931h386B84206c65682a08884j08964k47536A88838J33503b23734f3865j1437
15921g5302j06356j03986A69282m9985a27344j4635k38492A74593b12193B92899
15910b72970A47720a95994Q1982G997a78520b2929A5376K1879a05406n8696O4641
15899i9461J7816Q702A6720K27857B6384Q6995c04992J34961B1625J66075a60552
15887B65759d4423A93630C1916J01734b7656B86262q7652G7266J22263Q941g0154
15875b22360J10573K4592H1741k5102e4978i5j52709O6955F4630d3325A98230
$$ y = [-23071, 395566, -77145, 34133, 177189, -392126, -101786, 344890, -155158, 188673, 253466, 46888, 23145, -319356, -41088, -2219, -242827, -45326, 16467, 38476, -185604, -12773, -8386, 284206, -365682, -108884, -217848, -465384, 188838, 322341, -223734, -63865, -75302, -181658, -285644, 169282, 119297, -127344, -141979, -380471, 174593, -212193, 292899, -272970, 147720, -195994, -114012, 7997, -178520, -22929, 15376, 37255, -105406, -164102, -99461, -81645, -72943, 16720, 244577, 26384, 113379, -304992, -170031, 21625, 187700, -160552, 265759, -44423, 193630, 31916, 133650, -27656, 286262, 198610, 77266, 199529, 208470, -70154, -222360, -111787, -87195, 81741, 56639, -54978, -95, -152804, -85849, 64630, -43325, 198230]
15863a54917d6286A36418j2372a7438G6660L3142J42510g0618K5703o1431c1595
15851C46531G2702a51827E7191J86530l5169a8573q6961J5272k31562D9075J47421
15840A96496b06983D2997f9384E8205a23566C17181a38177j74811l8959c6925
15829a12626E08918b59837J01196B6004f1435A95081a320j02634j31914K3934
15819b11934c3741m651k78667B2809N0600g4982a4799A31402i8323d8760p866
15808e6626B63129b99005A00782c85266B64675j10446a06563l230B3251L0459
15798E3710a50012j2789b147k82964I8360b16143O9854b7797k12401d8203B29517
15786b3269B13823c497G0806J44323K2071f5457d891j9611j88389A03134j9071
$$ y = [-154917, -46286, 136418, 124046, -17438, 76660, 109802, 252312, -70618, -44915, -106346, -31595, 346531, 72702, -151827, 57191, 243721, 208552, -18573, -105534, -90262, -321824, 49075, 196496, -206983, 42997, -69384, 58205, -123566, 317181, -138177, -312988, -351947, -36925, -112626, 508918, -259837, -158641, 26004, -61435, 195081, -1320, -103954, -235868, -211934, -33741, -38392, -317059, 22809, 73409, -74982, -14799, 131402, -98323, -48760, -56626, 263129, -299005, 100782, -385266, 264675, 154229, -106563, -109793, 23251, 53710, -150012, -162801, -2147, -285111, 98360, -216143, -146289, -27797, -240198, -48203, 229517, -23269, 213823, -3497, 70806, 215129, 237200, -65457, -4891, -24502, -212891, 103134, 84063]
15775H4063j2518f3615o4661r338A56337a79828E2136a66999L5303C05855G4903
15763F151b10568A06155g6210C3271e420k37972C71442A58274F8313b32792A37864
15751g6664j21335O0724j88974a50394B77658f0342B49026D1939g6533A4242d856
15739A89456A9205a24058o3288f3992b5371l44005A86146A446a77645M8298G5336
15727b45576Q9555A4852c16046l1842A14572b01365b3188A54713B0780L2713h3289
15715b42630p866I0998a82372m306A9209a68019p8662a13946A02505l3314P3802
15704A42993b48210A73976c49225A1172d0139G4237D400b11944B2532N8498g4377
15692a47155J2423C07756j33763c9076g940F8178f4057c617j60222C0613b87134
$$ y = [84063, 71545, -63615, -128276, -137614, 156337, -179828, 52136, -166999, -131696, 305855, 74903, 6151, -210568, 106155, -76210, 33271, -5420, -243392, 371442, 158274, 68313, -232792, 137864, -76664, -197999, -137275, -326249, -150394, 277658, -60342, 249026, 41939, -76533, 14242, -4856, 189456, 19205, -124058, -187346, -63992, -25371, -369376, 186146, 1446, -177645, -129347, 75336, -245576, -156021, 14852, -316046, -347888, 114572, -201365, -23188, 154713, 20780, 53493, -83289, -242630, -250496, 90998, -182372, -186678, 19209, -168019, -246681, -113946, 102505, 69191, 142993, -248210, 173976, -349225, 11172, -40139, 74237, 4400, -211944, 22532, 81030, -74377, -147155, -134732, 307756, 173993, -39076, -7940, 68178, -64057, -3617, -163839, 30613, -287134]
15680A50719J5898F7761a79045h0120r616H794b00032A20733J13647K18144J9406
15669D71930I319K25995c851C53917C9073L435L55976H9866b8003B10360a59559
15657d81848N1517e1376B08272l2317G8114K49104b9708j14026c3745C26547A0986
15645a38147B42512A17506i644F9686a48732A18086P6634g1888k08452P2131A61664
15633h5256b811m3722F2063h8309k730B3802b59246A78650e3196D6081a73564
15621B27153j9217d9631k83899B47727e2047I0194e4236J6780j41635g5316b8645
15609E6018L4403a8786A81862f2610m0728j58670A47429P7609j4646j0751o3862
15598A35779k7847a54438G7691R0891m8460A264M5143A1250K15476b14764B52284
$$ y = [150719, 166617, 67761, -179045, -80120, -89736, 8794, -200032, 120733, 234380, 452524, 471930, 9319, 235314, -3851, 353917, 39073, 42508, 398484, 89866, -28003, 210360, -159559, -481848, -430331, -51376, 208272, 175955, 78114, 327218, -29708, -143734, -33745, 326547, 10986, -138147, 242512, 117506, -9644, 69686, -148732, 118086, 194720, -71888, -280340, -208209, 161664, -85256, -2811, -46533, 62063, -88309, -91039, 23802, -259246, 178650, -53196, 46081, -173564, 227153, 207936, -49631, -333530, 247727, -52047, 90194, -54236, -37456, -179091, -75316, -28645, 56018, 90421, -18786, 181862, -62610, -103338, -262008, 147429, 225038, 210392, 199641, 135779, 107932, -154438, 77691, 168582, 120122, 1264, 46407, 11250, 226726, -214764, 252284]
15586g4041A07484a52155e8443a1783A2337J89373m7304N1563B0306g9798B8111
15574G9980N7032d3045n0169c1138n3952B7153a16706M1156q1606B69750E1907
15562C8905b27724C74061j6547J19315a98265n027A65897a3876A14889a62369
15551A52683m5553f727H8769A8780J41602l296c0750A97636o7549h9910j60645
15540b50555B42981P5118b55021I8978b5147B06412a57916B72981c46681B55289
15529c06122J25388P2247k25135A62013K4264M7916G7012J06303m1750d21789
15518A9753e0186A5903c7146p2055p8056H6660a69115p8240A08403a88907J1564
15507a77343c4964B69503a007j13454j02588A36444A4080J83269f3123d79k94890
$$ y = [-74041, 107484, -152155, -58443, -11783, 12337, 201710, 154406, 205969, 20306, -79798, 28111, 79980, 137012, -43045, -93214, -31138, -85090, 27153, -116706, -75550, -157156, 269750, 51907, 38905, -227724, 374061, 357514, 476829, -198265, -203292, 165897, -13876, 114889, -162369, 152683, 107130, -6727, 88769, 18780, 160382, 157086, -30750, 197636, 130087, -89910, -250555, 242981, 318099, -255021, 98978, -25147, 206412, -157916, 272981, -346681, 255289, -306122, -180734, -108487, -333622, 162013, 186277, 234193, 77012, 183315, 141565, -421789, 19753, -50186, 15903, -37146, -109201, -187257, 86660, -169115, -247355, 108403, -188907, -177343, -34964, 269503, -1007, -114461, -217049, 136444, 14080, 197349, -63123, -479, -295369]
15496b95369a13885C02073c62015A10652e3521r1802A48780b38256h971m5578
15486e4549A91551H501J6998b59363A72956a23146C06211i3878p137k86127C23147
15474A6429K2056J19937b79632C491J64732E6168f2106h22A04922C0226I186b25868
15461E4819b3361B01722O785a28535B00133F1686f6073C10112g1940A31754l9431
15450I2323a46265M3591A04079a06196d6235A20143d27407F3976a57969A79399
15439A33094J1194b11477f9574r7994g2150A7754Q9639a33871G7365h10j01265
15428a02075j96254h5569A88465f5276D2314R6062d34191h2410A04543e9650I8464
15416E3676J0131d6498a8606n6790j02976o2910B24407c1309a4977k0575A42235
$$ y = [-295369, -113885, 302073, -362015, 110652, -53521, -145323, 148780, -238256, -8971, -54549, 191551, 8501, 25499, -259363, 172956, -123146, 306211, -93878, -101015, -387142, 323147, 16429, 38485, 158422, -279632, 3491, 168223, 56168, -62106, -822, 104922, 30226, 9186, -225868, 54819, -23361, 201722, 208507, -128535, 200133, 61686, -66073, 310112, -71940, 131754, 92323, -146265, -102674, 104079, -106196, -46235, 120143, -427407, 63976, -157969, 179399, 133094, 144288, -211477, -69574, -167568, -72150, 17754, 107393, -133871, 77365, -810, -102075, -298329, -85569, 188465, -65276, 42314, 138376, -434191, -82410, 104543, -59650, 98464, 53676, 63807, -46498, -18606, -75396, -178372, -241282, 224407, -31309, -14977, -35552, 142235]
15404I7471b2763A44742m4406m7793a62004k8304B230b24132A52507f6221b331
15392A95715b45408D2448c19556J17865m00620B93192J58606j29130j09083i392
15381b8607o3197j4313M2400k23594A56531J75646b30717l907A23844i234k69902
15370b79136A76661c84374J50539E7024Q7920l902d08473a17395l6151N2250H0627
15358b35141b2376B20115j07129K14515D836d5602a0468I7660a14179N4975m8106
15347a07310A82031F0816b1572A17768e404A51472J46593B4164O0476J12773n0852
15336A46561F7057a5716k6873A73165f5754j273r8027A04920l5881J07716q211
15325A68544p0166l1834a42484A00803a9754j59426k8299Q1487h845B3751a10474
$$ y = [97471, -22763, 144742, 100336, 52543, -162004, -190308, 2230, -224132, 152507, -66221, -2331, 195715, -245408, 42448, -319556, -201691, -602311, 293192, 451798, 322668, 213585, -9392, -28607, -91804, -106117, -63717, -287311, 156531, 332177, -230717, -234624, 123844, -9234, -279136, 176661, -384374, -233835, 57024, 144944, 141042, -408473, -117395, -153546, -101296, 80627, -235141, -22376, 220115, 112986, 327501, 4836, -45602, -10468, 97660, -114179, -59204, -107310, 182031, 60816, -21572, 117768, -5404, 151472, 298065, 24164, 84640, 197413, 146561, 67057, -15716, -42589, 173165, -65754, -67027, -165054, 104920, 69039, 176755, 168544, 98378, 66544, -142484, 100803, -19754, -179180, -207479, -125992, -8845, 23751, -110474]
15313D05964a9838r8596K5923A97234r3364r371i8997M6725j31585C8336a57241
15301c15157B23439F1745d2381A72747L7213b14101B41380a95622B36906a45161
15290B4376L19385d7821j5601F85978c2041A49181e8220E2632g4479A37621a54868
15278A38184d7827A40277L781C9223K03367p5500R8842B1517d3508A52119E1143
15266b16466A51510a97629f5167A18681k3570A2497J28074A7015K21685B6084
15255C28523a57051f6366K7722A28931i8122C14617M05525P20564Q3905m55433
15245A069178N87499F28447f8785C86833h0400G2441N2026B2958J23475i5661
15234E9814b05908F2957K3398a5565B15627E6144a52555B25518r1322J4137n5826
$$ y = [405964, -19838, -118434, -92511, 197234, 103870, 94499, -98997, -52272, -183857, 38336, -157241, -315157, 223439, 61745, -42381, 172747, 209960, -214101, 241380, -195622, 236906, -145161, 24376, 343761, -47821, -63422, 685978, -32041, 149181, -58220, 52632, -74479, 137621, -154868, 138184, -47827, 140277, 144058, 39223, 242590, 167090, 265932, 21517, -43508, 152119, 51143, -216466, 151510, -197629, -65167, 118681, 95111, 12497, 140571, 17015, 238700, 26084, 328523, -157051, -66366, -38644, 128931, -98122, 314617, 720142, 1440706, 1524611, 1069178, 1656677, 628447, -68785, 386833, -80400, 72441, 124467, 22958, 146433, -95661, 59814, -205908, 62957, 86355, -15565, 215627, 56144, -152555, 225518, 134196, 148333, 92507]
15223I2507h8924L8124F6298f6167B0282i1145A79480C1069d7211E06933A06795
15211A23759b30111m0507I1839a28393A01228b6642B83842K24985G9618J82497
15201B62115a58305I6995A9708J10390C9182J7070A2597J49706j2630H820J481
15190A0301K11701e7436F3131L04694A3093a28526E529c39442A55980e1309j49350
15179b00659C68531j42805l644R0412c0519p5248A89576E6309R3328p3285O121
15168H2473i8049L6091J2657A3902h4595G252K53247a07872B6098J14811a08372
15156A04895b0494m2798f795j26785A57320p5579m341b94276i140j5526A19419
15144c0737H2663B6850K41467a02300D6191K80912a54430B47173n7917L3013N028
$$ y = [92507, -88924, -50800, 66298, -66167, 20282, -91145, 179480, 31069, -47211, 506933, 106795, 123759, -230111, -270618, 91839, -128393, 101228, -26642, 283842, 508827, 79618, 262115, -158305, 96995, 19708, 130098, 39182, 56252, 12597, 162303, 149673, 8820, 10301, 222002, -57436, 63131, 367825, 13093, -128526, 5529, -339442, 155980, -51309, -200659, 368531, 225726, 222082, 312494, -30519, -105767, 189576, 56309, 149637, 76352, 82473, -98049, -61958, -49301, 13902, -84595, 7252, 260499, -107872, 26098, 140909, -108372, 104895, -20494, -63292, -6795, -133580, 157320, 81741, 77400, -294276, -9140, -24666, 119419, -30737, 82663, 26850, 268317, -102300, 46191, 327103, -154430, 247173, 189256, 222269, 227297]
15133B27297H0973J73163j00655Q298i7761G6351M39771A8746J93115i229B14391
15121A53611J15155J8312G6194p725O645L59350A98275E8934b60983E9693a2097
15109f6069E725P1002b70774D37007A01402d4256A62087g3362A35091J25343n3121
15098B07313H0645b89987B06646m358F3970c90198D07013C4956J37309l0878k1243
15087A20144J79707H9088K56571j22666R3737r5157a1328A46219a03652H9904
15076a67737l8483D01882a94658N2745E0792L60123A08251R8280C6349J54329
15066A90678I3413k0413a9340o374B57655A25635O0609f5246D00705r1121c03831
15054D41854A40020K76629A43183J62218j29871K26855J6218j31398l6372R4642
$$ y = [227297, 80973, 254136, 153481, 161779, -97761, 76351, 516122, 18746, 211861, -9229, 214391, 153611, 268766, 287078, 76194, 68469, 75114, 434464, 198275, 58934, -260983, 59693, -12097, -66069, 5725, 76727, -270774, 437007, 101402, -44256, 162087, -73362, 135091, 260434, 207313, 80645, -289987, 206646, 202288, 63970, -390198, 407013, 34956, 172265, 141387, 120144, 299851, 89088, 345659, 222993, 316730, 221573, -11328, 146219, -103652, 89904, -167737, -206220, 401882, -194658, -141913, 50792, 410915, 108251, 206531, 36349, 190678, 93413, 73000, -19340, -25714, 257655, 125635, 186244, -65246, 400705, 309584, -303831, 441854, 140020, 416649, 143183, 305401, 175530, 402385, 418603, 287205, 250833, 345475]
15044C45475P5689A04060M4164a9912B37392G5220B0881J05030J05609m5192M3620
15033B29948a35928C76894A52109b8450C71253G9062K14308N9703O0933j08812
15023C05194k8534c593A34068J19370L58313F5595J37365p1915A1110R1863e1119
15011G5365J24540D8424d973B17737D7447J98894A20299k0850R0806r269J95000
15000C75986f0029D62407k15929a7974C02716D9431M9908J19853n9400K20259
14990C80051j35329K5870o303H7819J04512J71955f0595b2950D53799I9993j5992
14979H4001J28950J88587G1136B0798J45706n9887P0357M22456F1867K35826q854
14968B88839K36256a19410C88753j27204m3401r876J99128a5108B2589J05419
$$ y = [345475, 421164, 104060, 148224, -19912, 237392, 75220, 20881, 125911, 231520, 186328, 229948, -135928, 376894, 152109, -28450, 371253, 79062, 293370, 353073, 414006, 305194, 276660, -3593, 134068, 253438, 611751, 65595, 202960, 131045, 11110, 102973, -51119, 75365, 199905, 48424, -4973, 217737, 47447, 246341, 120299, 99449, 190255, 180986, 375986, -60029, 462407, 246478, -17974, 302716, 49431, 99339, 219192, 159792, 380051, 244722, 270592, 264289, 87819, 192331, 364286, -60595, -22950, 453799, 99993, 84001, 212951, 401538, 71136, 20798, 166504, 106617, 176974, 599430, 61867, 297693, 288839, 525095, -119410, 388753, 261549, 218148, 208272, 407400, -15108, 22589, 128008]
14958A28008e8375A73522J99611A74737B8434J84888F9561K85097J30340F3478
14947A69166M3108E9100J2945j8629K11969n5836J19593A23700K81769A0890L59251
14936C70141K36713j40254j93060a77109f1409I8678N2753K11767G0440b5419
14925C97748J20979B48825R9693B0550K28643J58705j17551R4288j69030K9460
14915B45065L31314B53760Q8580j47122F9746R1991K34267J5688A85603K45453
14905D31056j13423N965P1880D8667K17236O9558K02128k53816J66382r9339A47766
14893B33088J34618P0988B03671K51110j54410K967P5081I2667J18803k5415M7213
14882B33268r7728L55699O2490L4198D0689K46088K87500A90365Q0241J67410
$$ y = [128008, -58375, 173522, 373133, 174737, 28434, 213322, 69561, 354658, 484998, 63478, 169166, 212274, 59100, 72045, 53416, 265385, 209549, 329142, 123700, 405469, 10890, 370141, 606854, 466600, 273540, -177109, -61409, 98678, 151431, 363198, 70440, -25419, 397748, 518727, 248825, 348518, 20550, 249193, 407898, 290347, 384635, 215605, 245065, 576379, 253760, 342340, 195218, 69746, 161737, 396004, 411692, 185603, 431056, 317633, 323598, 395478, 48667, 265903, 335461, 537589, 283773, 450155, 350816, 147766, 233088, 367706, 438694, 203671, 454781, 300371, 303338, 378419, 92667, 211470, 186055, 233268, 135540, 491239, 553729, 587927, 40689, 286777, 574277, 190365, 270606, 438016]
14872D38016R4112J53839k95606j74864F9238L40588O3666j89942G8284K78227
14862C56511L7767K6148r0224N3535n5179M1362N0887J08081K35657p7394k93662
14851C93489A36224K74492L28233C53453j70471p3917L18912A49825L55767A05468
14840B67228l4094l864j05857L25377j63509F0993O05219l3722j21730l2482K18418
14829F96696Q3491k39626q3655o19Q4308k2464j63927b6431B73546M0282m9888
14818B63940K88200O4520j54499P3090j29793M50171B22141L75694m0964Q0201
14808F37072j91411L2146k0959K6266n7057J90500j79359K14475k58807R0718
14798D83584m5379N5568j68132J44367M58404C70636J82064J37718j79281J56870
$$ y = [438016, 532128, 685967, 390361, 215497, 69238, 409826, 473492, 283550, 78284, 356511, 394278, 420426, 330202, 383737, 328558, 369920, 420807, 528888, 764545, 687151, 393489, 136224, 410716, 738949, 353453, 182982, 109065, 427977, 149825, 505592, 105468, 267228, 233134, 229270, 123413, 448790, 285281, 60993, 666212, 632490, 510760, 478278, 696696, 780187, 540561, 456906, 456287, 540595, 518131, 354204, -26431, 273546, 313828, 263940, 552140, 616660, 462161, 535251, 405458, 855629, 222141, 597835, 556871, 637072, 445661, 477807, 456848, 483114, 426057, 616557, 437198, 651673, 392866, 483584, 438205, 493773, 325641, 470008, 928412, 370636, 552700, 690418, 511137, 668007]
14788F68007B50239K87631J74035j68992J87443B54212L73768n1104B306J51067
14778A53373N77114k43352p3516M57272l55845L18551l68284k6833Q843M42517
14768H89840k44398j68762K97634k06643j93611J09887K39309j8884q7801J00545
14758G17116j77690j19041l2988K76170j66477A86410O58100M1411A76113P6366
14748B52479L78938j93807M81620k92328J53052K35096l45751o5098J6659J02632
14738G23492p1844p3381J83893k84325K23805j79788j32639N54311m27292J88079
14728G04311O2853J18709j86281q765M9792K73824l92163K23469k48902Q5239
14718F82086r5042N4120L23568k96867K1424J72780K5700l69991K32967J99034
$$ y = [668007, 250239, 537870, 711905, 542913, 730356, 254212, 627980, 576876, 2306, 153373, 730487, 487135, 413619, 870891, 515046, 833597, 465313, 438480, 447323, 889840, 645442, 476680, 774314, 567671, 374060, 483947, 723256, 704372, 616571, 717116, 539426, 420385, 387397, 663567, 497090, 186410, 844510, 885921, 176113, 252479, 631417, 437610, 919230, 626902, 779954, 1015050, 669299, 604201, 620860, 723492, 651648, 578267, 762160, 477835, 701640, 521852, 389213, 943524, 516232, 704311, 767164, 885873, 699592, 690827, 740619, 1014443, 622280, 845749, 596847, 682086, 587044, 641164, 964732, 667865, 689289, 862069, 887769, 517778, 750745, 949779]
14708I49779k89908m9313L19258l08818J68743j12135K01578l20519L86790j19189
14698H26266k7540k814j02062M31744l40849O0504J36200j17792J24048j26528
14688H61177j81276J21299J22735n7227l6493Q614j75476J2907K76341R747N3436
14677A015784K32733k27263K0127l14459K74706J92359j56035O9459k07249k5967
14667H74195l1400J99139l04244J17787L41032k3047l47294M08053r7989n5396
14657A080836k62697j69151L80243L45829m39841N9489Q2160J67584k00624P0587
14647A114415o8684P9890q1627O4901O9366m75453N06299N5218K829J06701k60992
14636A112863n0312K88824F19700O11280m34594M26510j79961O9428L33683m49965
$$ y = [949779, 659871, 610558, 929816, 620998, 789741, 677606, 879184, 558665, 945455, 826266, 798726, 795912, 693850, 1125594, 784745, 845249, 981449, 863657, 987705, 861177, 679901, 801200, 923935, 866708, 830215, 838829, 663353, 676260, 952601, 962348, 1015784, 1248517, 1021254, 1041381, 726922, 1001628, 1193987, 1037952, 1107411, 900162, 874195, 842795, 1041934, 737690, 855477, 1196509, 1173462, 826168, 1234221, 1136232, 1080836, 818139, 648988, 1029231, 1375060, 935219, 994708, 1076868, 1244452, 1043828, 1114415, 1045731, 1125621, 1043994, 1108895, 1178261, 702808, 1209107, 1264325, 1267154, 1373855, 1112863, 1062551, 1351375, 619700, 1230980, 796386, 1222896, 1042935, 1112363, 1446046, 996081]
14626I96081J96329J374L68584k74194K594l0476m8256N3337J50235Q1303m97046
14615I99865Q7966N98809p76771N36330J40396k35371L27583k95260L52333o20628
14605A115252J45492j96112M84139l08233o56L29452K23482n99481L66909K8368
14595A588612R1248k46841J07376k23028L36193r1961j42132K05133p1862J44464
14585A697202j42713L61336k41788J49139J28067m05600O7386K59307J99761j04348
14575A967749J83642n63155L74188J82864L8872j02594j41633J47756k00478K34625
14565B121836O0147o2762L8443j96462K59341J92181j15877J82246K81388K32429
14555B992910j53488N6380L43900O2548P38498Q99906R81253L527184Q792729
$$ y = [996081, 1192410, 1193784, 1562368, 1288174, 1290768, 1260292, 1212036, 1265373, 1415608, 1496911, 999865, 1087831, 1686640, 909869, 1446199, 1586595, 1351224, 1678807, 1383547, 1735880, 1115252, 1260744, 1064632, 1548771, 1240538, 1239882, 1569334, 1792816, 1193335, 1560244, 1588612, 1679860, 1433019, 1540395, 1317367, 1653560, 1561599, 1419467, 1624600, 1552738, 1697202, 1554489, 1915825, 1674037, 1823176, 1951243, 1545643, 1613029, 1872336, 2072097, 1967749, 2151391, 1588236, 1962424, 2145288, 2184160, 2081566, 1939933, 2087689, 1887211, 2121836, 2181983, 2119221, 2157664, 1961202, 2220543, 2412724, 2296847, 2479093, 2760481, 2992910, 2839422, 2895802, 3239702, 3302250, 4040748, 4940654, 5921907, 9449091, 18241820]
14546A8241820K3362778J0134165B1693360H513681D198219j587651o71911l37764
14538A600893N68627o62921N55565j98604m4352J29172n5964l9976J50579k3384
14528A979635m33146N18373K3098j46761K87612m7446n2468J47888k32830J06396
14518B150351J18257j03632m3320M11218K96831o32825L41457j62809r7674M81136
14508B758990k05627J87652o7008J43416J8053l59838N75863k09637K3299K42125
14498C107288k72580M8286p6711L68309j97279J32822Q9980k24746K27913J98658
14488C401940J1304k51272J52626J25714k49056M71775p5181R2360p1990L6184
14478C644404J00205n9910q4111J0654k49177L93155P6394j69325l16646N52404
$$ y = [18241820, 41604598, 51738763, 21693360, 8513681, 4198219, 2610568, 1938657, 1600893, 2169520, 1506599, 2062164, 1863560, 1819208, 1948380, 1892416, 1852440, 2003019, 1979635, 1546489, 2064862, 2087960, 1941199, 2228811, 2181365, 2128897, 2276785, 2043955, 2150351, 2268608, 2164976, 2121656, 2532874, 2829705, 2196880, 2538337, 2375528, 2277854, 2758990, 2553363, 2741015, 2674007, 2817423, 2835476, 2475638, 3051501, 2841864, 2865163, 3107288, 2834708, 2882994, 2806283, 3174592, 2977313, 3110135, 3200115, 2975369, 3203282, 3401940, 3413244, 3161972, 3314598, 3440312, 3191256, 3663031, 3587850, 3680210, 3608220, 3644404, 3744609, 3684699, 3600588, 3611242, 3362065, 3755220, 3831614, 3662289, 3345643, 3898047]
14468C898047L15906k81629k00731K36739K15248N9283l1479j84087M64445m01760
14458D089982M8362L08135O8089R768J88671p4155L05598j85667J93402M24388
14448E376573k74800k7943K15328l65227J67943k32643M60531K42541K33211j69653
14438E625861k24089M57077l23492K50457J61952j94399L79698P247K69450K1111
14428F430873J55026j53086K56166p1328K24278J94168j44687K50621K99650k98558
14418G143123L90830N00884m30125L89619j78033L00840j82496J68523j3548k2255
14408H067362J85844M58707K07461j85626L15938k81117Q20378m25021K14283
14399I378209M16250j17706M42738J72491p9459R6503K80124K27656K76537l2650
$$ y = [3898047, 4213953, 3932324, 3731593, 3968332, 4183580, 4242863, 4211384, 4027297, 4491742, 4089982, 4138344, 4446479, 4514568, 4524336, 4713007, 4638852, 4944450, 4758783, 4952185, 5376573, 5101773, 5073830, 5289158, 4923931, 5091874, 4859231, 5319762, 5562303, 5795514, 5625861, 5401772, 5858849, 5535357, 5785814, 5947766, 5753367, 6133065, 6140312, 6409762, 6430873, 6585899, 6432813, 6688979, 6617651, 6841929, 7036097, 6891410, 7142031, 7441681, 7143123, 7533953, 8034837, 7604712, 7994331, 7816298, 8117138, 7934642, 8103165, 8089617, 8067362, 8253206, 8711913, 8919374, 8733748, 9049686, 8768569, 9588947, 9163926, 9378209, 9794459, 9676753, 10119491, 10291982, 10212523, 10309026, 10589150, 10816806, 11093343, 11060693]
14389A1060693N18720K41585j09591J02374P25914j11918O9323L01262L95992
14380A3194354K55442K083M01519J68316L56734M99894j93137N57574M5150L23889
14370A5611818M89713M88530N13613J01134M92988L20537Q9606J53081P43340
14361A9004360M47224L14020N23615M19187N23909O67817O24650P4910N09720
14352B3109412Q95109L57134P36115N21776R09478M03330R06085O93045N38920
14343B9070404R12324P24025J091133Q26722N08996J129733Q67542J415974O48222
14334C7195075J248367J130362J123569J475326R69211J581412J462832R84588
14326D7170742K192647J320548J583915K061630J721749K130804J664038K209869
$$ y = [11060693, 11579413, 11820998, 11711407, 11813781, 12539695, 12427777, 12497100, 12798362, 13194354, 13449796, 13451879, 13853398, 14021714, 14378448, 14878342, 14685205, 15242779, 15287929, 15611818, 16101531, 16590061, 17103674, 17204808, 17697796, 18018333, 18107939, 18261020, 19004360, 19451584, 19765604, 20289219, 20708406, 21232315, 21900132, 22524782, 22599692, 23109412, 24004521, 24361655, 25097770, 25619546, 26529024, 26932354, 27838439, 28531484, 29070404, 29982728, 30706753, 31797886, 32624608, 33133604, 34263337, 35130879, 36546853, 37195075, 38443442, 39573804, 40697373, 42172699, 43141910, 44723322, 46186154, 47170742, 49363389, 50683937, 52267852, 54329482, 56051231, 58182035, 59846073, 62055942]
14318F2055942K406071K433106K389900L055526K662394L038623K886334L773206
14310H4701102L232759L981155M035137M082080M883310M423258N493581M930690
14302A19763072N789241O428834O665503O831021P562971P742260Q719570Q735161
14294A78237633R473452J0131322J1203691J1551079J1875138J2994547J3422445
14287B58889307J4666093J4813009J5697143J6122508J6984843J7011481J7184539
14280C71368923J7276796J6654971J6598050J4960050J3764923J2303277J0072476
14273D72999466P169231L263070n94653l48482l278374l741833n161400r001844
14265D61305181j0145219j2048762j3620919j4895801j7290951j7230882j7621565
$$ y = [62055942, 64462013, 66895119, 69285019, 72340545, 75002939, 78041562, 80927896, 84701102, 87933861, 91915016, 95950153, 100032233, 104915543, 109338801, 114832382, 119763072, 125552313, 131981147, 138646650, 145477671, 153040642, 160782902, 169502472, 178237633, 187711085, 197842407, 209046098, 220597177, 232472315, 245466862, 258889307, 273555400, 288368409, 304065552, 320188060, 337172903, 354184384, 371368923, 388645719, 405300690, 421898740, 436858790, 450623713, 462926990, 472999466, 480168697, 483431767, 482837114, 482488632, 479210258, 475468425, 470307025, 461305181, 451159962, 439111200, 425490281, 410594480, 393303529, 376072647, 358451082]
14258C58451082j7485478j7055940j6838073j5208890j4555800j4834828j4261590
14251B48210483j3123997j2352164j1428469j1507326j0115055r605977r230237
14244A70847258p949400q296735p617151p166521o563410o554749n393145m958413
14236A16347734n713740m688832m773667m446896m086240k984208m183800l304958
14228H2165393l205890l361649k768666k692744k923252k254493k221138k539426
14220F0198135j767654j912326k148082j725643k134284j661106j236133p52941
14212D6859966j782685j502012j742355j448150p70801K798j201000k003608j202112
14203C5210041r66304o93552p95305j09092j701311r08639r43683m40673p28190
$$ y = [358451082, 340965604, 323909664, 307071591, 291862701, 277306901, 262472073, 248210483, 235086486, 222734322, 211305853, 199798527, 189683472, 180077495, 170847258, 162897858, 154601123, 146983972, 139817451, 133254041, 126699292, 121306147, 116347734, 110633994, 105945162, 101171495, 96724599, 92638359, 89654151, 85470351, 82165393, 78959503, 75597854, 72829188, 70136444, 67213192, 64958699, 62737561, 60198135, 58430481, 56518155, 54370073, 52644430, 50510146, 48849040, 47612907, 46859966, 45077281, 43575269, 41832914, 40384764, 39613963, 39616761, 38415761, 36412153, 35210041, 34243737, 33550185, 32754880, 32645788, 30944477, 30035838, 29092155, 28651482, 27923292]
14194B7923292m90948n46861j218904l78635r93186l95547l0181p90012n00741
14185B2578277n54802m73537o76177l5548p55706o24119l57507m05349j62873
14176A8532659p65923N7518o07400j24581n67345j19050n28432k5805n13524l26196
14166A5011921k56936J1552o13329k70525J89420n13475m35140j03405k32805
14157A2787278J06660k83110l92963k7224m83252j02298k15157l53861N4622P1771
14147A1162466m21907l22663j16951j27164n6356m3677n84056L38741l80544k3484
14137I424405K93632o83758n34228K17183k59553K72475p85377K11574K40462
14128H396815N7110m79160k67132o9241m5739k48319k81545P8518k78594J8818
$$ y = [27923292, 27432344, 26885483, 25666579, 25287944, 24294758, 23899211, 23869030, 23079018, 22578277, 22023475, 21549938, 20873761, 20838213, 20082507, 19458388, 19100881, 18695532, 18532659, 17766736, 17824254, 17216854, 17092273, 16524928, 16405878, 15877446, 15851641, 15338117, 15011921, 14754985, 14766537, 14153208, 13882683, 14072103, 13558628, 13123488, 13020083, 12787278, 12893938, 12610828, 12217865, 12190641, 11707389, 11605091, 11389934, 11036073, 11090695, 11162466, 10740559, 10417896, 10300945, 10173781, 10117425, 10073748, 9489692, 9828433, 9447889, 9424405, 9718037, 9034279, 8500051, 8717234, 8457681, 8730156, 7944779, 8156353, 8396815, 8453925, 7974765, 7707633, 7638392, 7592653, 7344334, 7062789, 7141307, 6862713, 6881531]
14118F881531r6042L86369j92966P3121p0836k51923k6960l65526K18663j34271
14108F421160l92457J39328o1940Q57l63525j66838K54647r1661r5761l60693
14098E283117M3312m2668k16426K78002n59932N24029l32159M4402Q0557j30201
14088D972033k31822M93072m46686j99685J89760l74454M4249L9236J96595r8001
14078D584297l53299K96873q5561K15375m45838M0092R0202n76253P02511o12494
14068C855905J13413J14153K5654n04151L52418l20568K31995j21784J59902n6429
14058C850508Q1833j05635k97824K1230r827J46281k66188J40485l81037J00237
14048C280063O2440L9986m25293P4743J56782K13568k49153l09049R1434k58480
$$ y = [6881531, 6785489, 7171858, 6978892, 7052013, 6981177, 6729254, 6702294, 6336768, 6555431, 6421160, 6028703, 6168031, 6106091, 6106948, 5743423, 5576585, 5831232, 5739571, 5643810, 5283117, 5326429, 5283761, 5067335, 5345337, 4785405, 5309434, 4977275, 5021677, 5102234, 4972033, 4740211, 5233283, 4786597, 4586912, 4776672, 4402218, 4446467, 4485703, 4682298, 4584297, 4230998, 4527871, 4442310, 4657685, 4211847, 4251939, 4342141, 3765888, 4468399, 3855905, 3969318, 4083471, 4109125, 3604974, 3957392, 3636824, 3868819, 3747035, 3906937, 3850508, 3932341, 3826706, 3528882, 3550112, 3540285, 3686566, 3420378, 3560863, 3179826, 3280063, 3342503, 3382489, 2957196, 3031939, 3188721, 3402289, 3153136, 2844087, 2935521, 2677041]
14038B677041M66250j52725j42206j57497N4584j31870K03826j13545K64673K28308
14028C196839k96770l00992P6717k43988K10904n8812J74085l46394R6720R0703
14018B599012J4763m26650O43573o33805K73443k17915l4415J08548r3364J77274
14008B410464j30977J78088j47670k40928n9717K0161l1077Q5476j14881n7367
13998A911572j69280K09736J38534k16199J44889m02616Q5737J02367M23477K87402
13988B515619J964566O054580K0679956K4225386B5920174A2289664m480635k315413
13980E493616j142544k99429p47261Q9511j36654m78753o5066j52780M0404m1890
13970B559154m32571M75676n54634K19541j10253j65585K76963k40605P6996o9083
$$ y = [2677041, 3143291, 2990566, 2848360, 2690863, 2745447, 2613577, 2817403, 2703858, 2968531, 3196839, 2900069, 2599077, 2675794, 2431806, 2642710, 2583898, 2757983, 2411589, 2508309, 2599012, 2613775, 2187125, 2830698, 2196893, 2470336, 2252421, 2218006, 2326554, 2233190, 2410464, 2279487, 2457575, 2309905, 2068977, 2009260, 2029421, 1998344, 2083820, 1968939, 1911572, 1742292, 1952028, 2090562, 1874363, 2019252, 1616636, 1702373, 1804740, 2228217, 2515619, 4480185, 10534765, 31214721, 55440107, 25920174, 12289664, 7809029, 5493616, 4351072, 4051643, 3304382, 3393893, 3257239, 2778486, 2713420, 2560640, 2601044, 2559154, 2126583, 2602259, 2047625, 2267166, 2156913, 1991328, 2268291, 2027686, 2104682, 2035599]
13960B035599M0470J25177k49709l2682l014m53386N59782k22884r9007R0576
13950A790922j49408K69399j43308J54037j18914j98673J28255k81125J91991
13941A643176Q479k46999L17585K32735k13728j22130l3479K08472k40025O1510
13931A615596j19902j40472R7688J3216m931k13926L72063L03927n21559J31791
13921A533491j20739m3398k03678J95980L64575l76858L38206j30098j64350J90381
13911A583512m84538N44570n73959K14637K91971n14057O4897J77810L40698k50518
13901A395023j44077J26719l00599J73766m1156J13904k6420k20560N88536n31336
13891A133800p365K01842l7568m01226K76138r8143J99266j84964n1565K93087
$$ y = [2035599, 2076069, 2201246, 1951537, 1918855, 1915841, 1462455, 2022237, 1799353, 1700346, 1790922, 1641514, 1910913, 1767605, 1921642, 1802728, 1604055, 1732310, 1451185, 1643176, 1651655, 1404656, 1722241, 1954976, 1741248, 1619118, 1585639, 1794111, 1554086, 1615596, 1495694, 1355222, 1452910, 1466126, 1461195, 1247269, 1619332, 1923259, 1401700, 1533491, 1412752, 1369354, 1165676, 1361656, 1726231, 1349373, 1687579, 1557481, 1393131, 1583512, 1098974, 1643544, 1069585, 1284222, 1576193, 1062136, 1127033, 1304843, 1645541, 1395023, 1250946, 1377665, 1077066, 1250832, 1209676, 1323580, 1297160, 1076600, 1665136, 1133800, 1126435, 1328277, 1290709, 889483, 1165621, 1067478, 1266744, 1081780, 1030215, 1323302]
13881A323302l80340J65667K64959n72341L2908K6324L88252m8888j1615J19396
13871A307624r4857j94486L3376O9009p5400r7471L36298l87005J0572Q0169k13932
13860G73897L20659l8602J30103m9387k94427k3705P6169J04975R1582N888k37103
13849H60049P7634j45946J39823p209j38772K45833M1017l23549L73831k61147
13839H61564k63239l3428K63014j69396K23320K84184n5604l22884n5880J78407
13829I10058j31970k79391R6808K39698q4383l6072K47852k22274J9318K97137
13819A056781k59878k21010K90297J62807l70459J32475N7691K14880m07103j03923
13809E52558K93715k26074K04629k27973K41301j23671K203k8021K73627m28229
$$ y = [1323302, 942962, 1108629, 1373588, 801247, 834155, 860479, 1248731, 1199843, 1188228, 1307624, 1212767, 1018281, 1051657, 1120666, 1045266, 947795, 1284093, 897088, 907660, 987829, 773897, 1094556, 1055954, 1186057, 1136670, 842243, 818538, 894707, 999682, 1091264, 1097152, 860049, 937683, 791737, 931560, 924351, 785579, 1031412, 1072429, 748880, 1122711, 861564, 598325, 564897, 827911, 658515, 881835, 1166019, 1110415, 787531, 731651, 910058, 778088, 498697, 595505, 835203, 750820, 714748, 962600, 740326, 759644, 1056781, 796903, 575893, 866190, 1028997, 658538, 791013, 848704, 1063584, 656481, 552558, 846273, 620199, 824828, 596855, 838156, 714485, 716688, 688667, 962294, 534065]
13799E34065K50020l2720K48015q4511R6970m51768J71862k11630J91711l8078
13789F73936k7787l0785J68117k53590r6074R316K88361J75205j99327k43306
13779D64066j33038K38115P0897R6644k29389J37271J6772J23691k49807J51031
13769F86253L1646k44132j26857L52735L8562k23917K66115o9389q7249J68917
13759G92684n6641J24375j82842J95070B84734K22194j77975K14623j10703L68061
13749H00934k73754J87206j51135O3108j07177j24845J46871j94435K15992J55224
13739G17989j83257J28262k90214M5975K40672j46896j16896M34126l13847J39425
13729F55339K9399j68999J72044q0826B71143K80635j13097J4208J62034B88244
$$ y = [534065, 784085, 751365, 999380, 914869, 1011839, 560071, 731933, 520303, 712014, 673936, 646149, 615364, 783481, 529891, 433817, 443133, 731494, 906699, 707372, 464066, 331028, 569143, 640040, 736684, 507295, 644566, 661338, 785029, 535222, 686253, 717899, 473767, 346910, 699645, 738207, 514290, 780405, 711016, 623767, 792684, 736043, 860418, 677576, 872646, 284734, 506928, 328953, 543576, 432873, 800934, 527180, 714386, 563251, 626359, 519182, 394337, 541208, 346773, 562765, 717989, 534732, 662994, 372780, 418755, 659427, 512531, 395635, 829761, 515914, 655339, 684738, 515739, 687783, 606957, 271143, 551778, 438681, 452889, 614923, 288244]
13718E72316j32806L81735l08719B22730M14891j67786j33392K08361k13360L31016
13708F62460k91624L2867J80249K59684F3153L47602j22714r8813J83681J97942
13698E70851J15838B14528L2441J88930j53078L06178p5430q2834A66928N98989
13688G65917C74447j40563J87648Q8388K65421j63457j72023j35194R3098j33111
13678B64654K91665k62902K89020K70572B02599M12282j20272j37870j75778J98449
13668C79410k5708P0063A79700R9437K72004A45030O77549j53151B55911L0575
13658B86486J09067q4703p1993O2326O0717N4871N0678o2422j97970P9167K3018
13647C09242j52087L05336R3234B00536L13362k06615k0152L57043k15781J43082
$$ y = [572316, 439510, 821245, 512526, 222730, 637621, 469835, 336443, 544804, 331444, 662460, 370836, 403703, 583952, 843636, 63153, 410755, 288041, 189228, 372909, 570851, 686689, 214528, 246969, 435899, 282821, 588999, 513569, 430735, 166928, 765917, 374447, 233884, 421532, 509920, 775341, 611884, 439861, 304667, 397765, 264654, 556319, 293417, 582437, 853009, 202599, 614881, 494609, 356739, 180961, 379410, 353702, 423765, 179700, 279137, 551141, 145030, 822579, 669428, 255911, 286486, 395553, 310850, 238857, 301183, 361900, 416771, 467449, 405027, 207057, 286224, 309242, 157155, 462491, 555725, 200536, 513898, 307283, 287131, 644174, 428393, 571475]
13637E71475j43827j20561n6498K90175j90561K80441A61989N9614D4892M22413
13627D67305j07708J61719k31376E5870K29323Q5331j20992K659M03114k63815
13617C91490j32238K8434o1195q1796L51394q429j33699M34192l05928j88579
13607B93646J18333M1883K69199B82487r770o6099o7724L28785k07363K15552
13597D75868j48199o7181m5140K201L53293A76293L05834n0205k9237j48401n8130
13586A96154L3128J16044K09055N941k14623L0361J06883J686A72452J46433R7451
13575D16336I8989J91092J17329M9830J41342j95238A47995J67048l9351l900
13565B71792n0619l3223Q5283r8110n5682L44326j23944p7508J39517J18177B05026
$$ y = [571475, 427648, 307087, 250589, 540764, 350203, 630644, 161989, 221603, 44892, 467305, 359597, 521316, 289940, 55870, 285193, 370524, 249532, 252191, 655305, 391490, 259252, 287686, 226491, 144695, 496089, 487660, 353961, 788153, 482225, 293646, 411979, 453862, 723061, 282487, 272717, 206618, 138894, 467679, 260316, 475868, 327669, 260488, 215348, 217549, 570842, 176293, 482127, 431922, 402685, 254284, 196154, 229282, 345326, 554381, 560322, 345699, 376060, 482943, 484629, 172452, 318885, 416336, 98989, 290081, 407410, 457240, 598582, 403344, 147995, 315043, 275692, 271792, 221173, 187950, 273233, 175123, 119441, 463767, 339823, 262315, 401832, 520009, 205026]
13553D72276Q2312B25884r0526K74453J19284A74213J13788k5205k6109K20339
13543D57026i8645C23989J6731i8984C47355a7971p9830C94755L8275A74648J60349
13532C34997J06716K316A72840I132K25267a18304C41098L5297j17192M1536K62323
13521E63062B19548O5435p6818i2542A83617M9743D0795L74866I6673M37996b12951
13509I3918j2131K18383M5534A50947M2258J76628A01388J17942K38495A63652
13498C11377A46776o3318a96251C50371j17896J15002H3800a21357K9396D73993
13487B76901o3500B0067L2684O2884J48882r0606K18271k9597E1899K22412M5595
13476C19906j42262L71986E996J93608K60150j35180N8346f129D8597J41979c5079
$$ y = [472276, 554588, 225884, 135358, 409811, 529095, 174213, 288001, 262796, 236687, 457026, -98645, 323989, 340720, -98984, 347355, -17971, -97801, 394755, 433030, 174648, 334997, 441713, 444029, 172840, 9132, 234399, -118304, 341098, 376395, 259203, 300739, 563062, 219548, 284983, 208165, -92542, 183617, 233360, 40795, 415661, 96673, 534669, -212951, 93918, 81787, 300170, 345704, 150947, 193205, 369833, 101388, 219330, 457825, 163652, 311377, 146776, 83458, -196251, 350371, 232475, 347477, 83800, -121357, -91961, 473993, 276901, 213401, 20067, 52751, 115635, 264517, 173911, 392182, 362585, 51899, 274311, 319906, 177644, 549630, 5996, 199604, 459754, 324574, 382920, -6129, 48597, 190576, -35079]
13464f6502A67269J67969A45092c7259B58807A04593K75721j16712R9725K3895
13454C87222A11504p160J69244Q2340D7517K96227O4760A92659J71905A80150
13443E16068j79216j62930g5332A27874L4352L47764D773K98483A37856Q9769
13433B27625H738b6796B18846K6078A07409l4348M00769F6668L45735l1454j09445
13422B71504Q9712A80227O0389q0490a89266R1228p1821B24111B299M20041j42034
13411B80306A35502P5085K45032A20288L8071K79698C9184K80554K3322p8767
13401B64293c77728A46066C1167J9929P2889R4960g3542A94052K05389j81351
13391B18090o2594a19139H3815b65740B55642F3502A2654J29562O7393J15054
$$ y = [-66502, 167269, 335238, 145092, -37259, 258807, 104593, 380314, 263602, 363327, 387222, 111504, 104344, 273588, 355928, 47517, 343744, 408504, 192659, 364564, 180150, 516068, 336852, 173922, -75332, 127874, 162226, 509990, 4773, 303256, 137856, 227625, 8738, -26796, 218846, 244924, 107409, 73061, 473830, 66668, 412403, 380949, 271504, 361216, 180227, 240616, 160126, -189266, -98038, -169859, 224111, 2299, 422340, 280306, 135502, 210587, 455619, 120288, 158359, 438057, 39184, 319738, 343060, 264293, -377728, 146066, 31167, 51096, 123985, 218945, -73542, 194052, 399441, 218090, 155496, -119139, 83815, -265740, 255642, 63502, 12654, 142216, 209609, 324663]
13381C24663a07961l8957B24731R1161j18224J66342n6392B3850P4121P7706F4805
13369A7666K09789k8499K16189K0801j69572A9518L91236j2256J33469B33689
13358A70091G7275J42615f1567A99418A5295h7779K0498b3389B65135m4503r2542
13347A28090K95299j18483L8491j22422K34709A13723L92847j05296I3042M25555
13337E18597j01438K57600A57596K62453D8958K09491M1051d7857A65948a1406
13326B17915J24914a2615A40850E3903e6016B00409F8843c0575F6910N0453D1655
13314B71509K13257B1144L5280L6436L8986D1521O4618l8475J18112a43640b0236
13302a1773B18059A5639L5329q782P9128c3112A86502J38142a41184A20213n6865
$$ y = [324663, -107961, -146918, 224731, 315892, 197668, 364010, 307618, 23850, 97971, 175677, 64805, 17666, 227455, 198956, 415145, 435946, 266374, 19518, 410754, 398498, 531967, 233689, 170091, 77275, 219890, -61567, 199418, 15295, -87779, -67281, -23389, 265135, 220632, 128090, 423389, 304906, 343397, 220975, 455684, 113723, 506570, 401274, 93042, 518597, 417159, 674759, 157596, 420049, 48958, 258449, 299500, -47857, 165948, -11406, 217915, 342829, -12615, 140850, 53903, -56016, 200409, 68843, -30575, 66910, 117363, 41655, 271509, 484766, 21144, 56424, 92860, 131846, 41521, 106139, 67664, 185776, -143640, -20236, -11773, 218059, 15639, 50968, 42186, 121314, -33112, 186502, 324644, -141184, 120213, 63348]
13291F3348L37528a9261A4025J01428a6378G7918N812a947l3554C54989a08271
13279h6065D00866j5536i1739C19350B6445R3760L46694q5439P6441A4796K06812
13268B21608L6913a7424C82249I21g3538B69542K43723B17487a37073A76868J09587
13257B86455g1111I060M38224C2236J53155q4560P9891C2851F927f4959C38876
13245a34709c9491A1960c09805A01649f9867J9948A14382f7843B22531a44910
13234C8064K14840k4382A02870J40997O6080r2642b23320A11209e24917a4153
13223c2431E16833G6607k0056j6960J88783a00317H2387d8403n4672E2846K8396
13212H1242J47289K30798j36687j56715b40590f6948H9819b16410A01442e31288
$$ y = [63348, 400876, -19261, 14025, 115453, -16378, 77918, 83730, -1947, -35501, 354989, -108271, -86065, 400866, 385330, -91739, 319350, 26445, 120205, 466899, 381460, 457901, 14796, 221608, 258521, -17424, 382249, 921, -73538, 269542, 513265, 217487, -137073, 176868, 286455, -71111, 9060, 447284, 32236, 185391, 100831, 180722, 32851, 6927, -64959, 338876, -134709, -39491, 11960, -309805, 101649, -69867, -49919, 114382, -67843, 222531, -144910, 38064, 252904, 228522, 102870, 243867, 309947, 217305, -223320, 111209, -524917, -14153, -32431, 516833, 76607, 56551, 39591, 228374, -100317, 82387, -48403, -103075, 52846, 81242, 228531, 459329, 322642, 165927, -240590, -66948, 89819, -216410, 101442, -531288]
13201A89268C4918L02636q7124j02218b8398C58931g8879A49984J3132k9287a5962
13189H4941c46642h1008D94650A54840n5064K62758A00557f0972A88120C1162
13178B57518a49431j4252j77987h5471I2693b75618G1363J39574e7461B96947
13167C12586a05476J3832C79247A10633D9865c0068j0288j30077A0775P0497D0523
13155A22225N9138a9093A62430c0115B8499K35629b75478c8014j41932A90477
13144B43120a84253B73152C7550j0434J22965O8505o6872N63092i6928C8640L58017
13133C96657a03641A45178k1844D3874g887I5641r224D2499A6243K57985a98194
13121b55882A11724h0671K188A39865L1750b25682f5356K594i325C2441A430a18216
$$ y = [189268, 34918, 337554, 250430, 148212, -28398, 358931, -78879, 149984, 163116, 133829, -15962, 84941, -346642, -81008, 494650, 154840, 99776, 362534, 100557, -60972, 188120, 31162, 257518, -149431, -163683, -341670, -85471, 92693, -275618, 71363, 210937, -57461, 296947, 312586, -105476, -91644, 379247, 110633, 49865, -30068, -40356, -170433, 10775, 81272, 40523, 122225, 181363, -19093, 162430, -30115, 28499, 264128, -275478, -38014, -179946, 190477, 243120, -184253, 273152, 37550, 27116, 150081, 218586, 151714, 714806, -96928, 38640, 396657, -103641, 145178, 123334, 43874, -7887, 95641, 86417, 42499, 16243, 274228, -198194, -255882, 111724, -80671, -78483, 139865, 171615, -225682, -65356, -62762, -9325, 32441, 1430, -118216]
13108A3622K2465d8089B48405b3715G7205L05198F0201J77792A10693a30170B15759
13096B05048l1353a5356C02389B7909b2797B69451J4193b1978E0165b65420A72754
13084A75494d6456C53307a36379j17274A79566D204L46729A53954o7342b9413
13073H8161M7075j6631k8821K94197A34998L6553J94816j42452h3311C79221D4325
13061I207R3593b10044A7755O93026B02164N6798i220A82001N3782F4464O9893
13050A34357J5018C2059L08675a12057j15325A5625J45795b9598j49429B06143
13039a05508A96722a218B46946O6016j49495n429b59226i5910c4552r72k2924
13028e8448j52557i3184B59602K38922A98550J77103j4153b30819r8560e2798
$$ y = [13622, 36087, -48089, 248405, -23715, 77205, 382403, 60201, 237993, 110693, -130170, 215759, 205048, 173695, -15356, 302389, 27909, -22797, 269451, 283644, -21978, 50165, -265420, 172754, 175494, -46456, 353307, -136379, -253653, 179566, 4204, 350933, 153954, 86612, -29413, 88161, 135236, 118605, 89784, 383981, 134998, 171551, 366367, 223915, -83311, 379221, 44325, 9207, 102800, -210044, 17755, 710781, 202164, 258962, -9220, 182001, 235783, 64464, 134357, 149375, 32059, 340734, -112057, -227382, 15625, 161420, -29598, -179027, 206143, -105508, 196722, -1218, 246946, 312962, 163467, 158038, -259226, -95910, -34552, -35524, -58448, -211005, -93184, 259602, 498524, 198550, 375653, 361500, -230819, -329379, -52798]
13017b70054B89094J25491b3718A9890R8881E2443K69034G885J76321L3006a5804
13005B34963a89937B02571M5567A02779g4475A3468K9939b69043a08681l23050
12995d31731B98383M6848b72622G5279g6085A94589p6251J49884j02964b32520
12984B8904M4140a69042C60092J33134a33994A49041a14629A32746a4459A41412
12973a94009b216B75640b2904j14962B84818H9331k7122d01688C6414J8770K45099
12962C00283a39935B59683D6533K81923H0029d8974A43769D3616L9473J85427
12952B68516c32016a6624C14953a13964p0488N1241K9324a9760A20710c0079o7935
12941i8014j36080P3939D48191C4737b57551C50558F0940I791L40744D2502K17913
$$ y = [-270054, 289094, 414585, -23718, 19890, 118771, 52443, 321477, 7885, 184206, 217212, -15804, 234963, -189937, 202571, 248138, 102779, -74475, 13468, 43407, -269043, -108681, -431731, 298383, 345231, -272622, 75279, -76085, 194589, 118338, 268222, 165258, -232520, 28904, 73044, -169042, 360092, 493226, -133994, 149041, -114629, 132746, -14459, 141412, -194009, -2216, 275640, -22904, -137866, 284818, 89331, 62209, -401688, 36414, 55184, 300283, -139935, 259683, 46533, 328456, 80029, -48974, 143769, 43616, 83089, 268516, -332016, -16624, 314953, -113964, -184452, -133211, -103887, -19760, 120710, -30079, -98014, -234094, -160155, 448191, 34737, -257551, 350558, 60940, 9791, 350535, 42502, 260415]
12930B60415a77031r0302C2848e4494q7727b7008C2621i6632A75156d470j66270
12919a70740A45065m0306P6425P5123A3947a22723N9881A13909J07494J3951j9371
12908B15983a55329B65956d6971n3423H7500M3951F3180M37863d5599n0455d5030
12896a2123A99774c48863G8039d9586A92264F6442R8956F0868A3300K73624K9389
12885C16313r8136J00068a05601K0507A23029F0896k538J19540A5065b08333C38759
12873A80725k1248f2173j30687C3878b58701g0734B18665H1118a0494n036B08857
12861A49488B2098Q0210a24267j59870J40651f5760o7691C19822p3040D8716a67306
12849A44106a49941A19524K35798o8015A596K18803A05653i1718j29443A52177
$$ y = [260415, -177031, -267333, 32848, -54494, -142221, -27008, 32621, -96632, 175156, -4470, -170740, 145065, 104759, 181184, 256307, 13947, -122723, -62842, 113909, 221403, 235354, 215983, -155329, 265956, -46971, -100394, 87500, 131451, 63180, 501043, -45599, -96054, -45030, -12123, 199774, -348863, 78039, -49586, 192264, 66442, 165398, 60868, 13300, 286924, 316313, 218177, 318245, -105601, -85094, 123029, 60896, 58358, 177898, 15065, -208333, 338759, 180725, 159477, -62173, -192860, 33878, -258701, -70734, 218665, 81118, -10494, -15530, 208857, 149488, 22098, 102308, -124267, -284137, -143486, -65760, -133451, 319822, 246782, 48716, -167306, 144106, -149941, 119524, 355322, 287307, 1596, 220399, 105653, -91718, -221161, 152177]
12838B6084a26337B28475a29152A68326M6032l8545a80814p3574E1281c6070B09521
12826b72142D14831C6926J44404c03156D65695A37440J92169p9252o0419o8368
12816A21570o0585b39671g1787A85530q4622o771a41760j11890B455J46761p841
12805A41375a00182k6677j24197C6295N6221b09159R7349C63894e8747k22710
12795b81457G8088c80256h9969C1341J27633F5644c1081A25838M2213b8962j42448
12784a71410A51786C5362f6959B8051b31083a04582I854a52151C07514E6968J3964
12773G0932a97415f3972E1254P4656a04038K7385A46062M09300A74420A777h964
12761C24278b675l01760a08348L6473M096g483B1767F842a08387C43286d7941
$$ y = [26084, -126337, 228475, -129152, 168326, 214358, 175813, -180814, -254388, 51281, -36070, 209521, -272142, 414831, 36926, 181330, -303156, 465695, 137440, 329609, 250357, 189938, 121570, 60985, -239671, -71787, 185530, 100908, 94137, -141760, -253650, 2455, 149216, 141375, -100182, -126859, -251056, 36295, 92516, -209159, -111810, 363894, -58747, -281457, 78088, -380256, -89969, 31341, 158974, 65644, -31081, 125838, 168051, -28962, -171410, 151786, 35362, -66959, 28051, -231083, -104582, 9854, -152151, 307514, 56968, 70932, -197415, -63972, 51254, 125910, -104038, -76653, 146062, 555362, 174420, 1777, -8964, 324278, -2675, -304435, -108348, -71875, -67779, -7483, 21767, 6842, -108387, 343286, -47941]
12749d39035b6717A04447b34201A17683a18975D47293F0194O9665E9331R4238
12739A53569d2893A65647d1970A98444K69335f4291D40416d1447A16715B1074
12728a11729G9782b87109B64991a79351C401c00459P6170C194P8823K99113a88111
12716A79805C2539a53876j07409A53290J398N4237f2482D97073E683P232a26090
12704B77283F226L2650K26878o3656b51015j44895d7667A15783a24792F0945L29333
12693C90278F7290j0543R0274h1878J0342A24904a10853A09159p010D9368J15333
12682A64701J20924j27430J24150J44072a07709B84532A04127D9728b696B44926
12671A06097J41319b0064p3349C56278j28018a28442C63492a5685D31122A56346
$$ y = [-439035, -26717, 104447, -234201, 117683, -118975, 447293, 60194, 129859, 59331, 153569, -42893, 165647, -41970, 198444, 467779, -64291, 440416, -41447, 116715, 21074, -111729, 79782, -287109, 264991, -179351, 3401, -300459, -224289, 3194, 82017, 381130, -188111, 179805, 32539, -153876, -261285, 153290, 154688, 208925, -62482, 497073, 5683, 12915, -126090, 277283, 6226, 38876, 265754, 202098, -251015, -395910, -47667, 115783, -124792, 60945, 390278, 67290, 56747, 147021, -81878, -71536, 124904, -110853, 109159, 102149, 49368, 164701, 285625, 158195, 282345, 426417, -107709, 284532, 104127, 49728, -2696, 244926, 106097, 247416, -20064, -93413, 356278, 228260, -128442, 363492, -15685, 431122, 156346]
12660a32762B52208J17044A25270K25910A59695J21501A37614F7168k7450j5565
12650B4153P796P8063K64692a02465b2796A05357J35090b9497B67292l2650c6144
12638d4051j69759P7626B2816J13636P0649b90840H4342J35519O4757A33702a59214
12626B74792f9681E1655c31856B30793K0700b458B85346F4650b51161c0714k9940
12615f0654D8910c04584A432K65146a04631B03418m1482o7474J33805H0202c18113
12603B20725f4399a7794j59647L5344C0512J39959O2345a78194P7423F8262a15534
12591B66793j16260n8343K77525G0377f5715r0977p8375A5456J39446E2599A7021
12579I759g4379B5512a75528A70155c2794A28622c09199B73885A05991J93687
$$ y = [-132762, 252208, 369252, 125270, 351180, 159695, 281196, 137614, 67168, 39718, 24153, 31949, 110012, 374704, -102465, -22796, 105357, 240447, -29497, 267292, 234642, -36144, -44051, -213810, -136184, 22816, 136452, 207101, -290840, 84342, 219861, 284618, 133702, -159214, 274792, -69681, 51655, -331856, 230793, 251493, -2458, 285346, 64650, -251161, -30714, -60654, 48910, -304584, 1432, 266578, -104631, 203418, 161936, 94462, 228267, 80202, -318113, 220725, -64399, -17794, -177441, -142097, 30512, 170471, 232816, -178194, -100771, 68262, -115534, 266793, 150533, 92190, 369715, 70377, -65715, -156692, -235067, 15456, 154902, 52599, 17021, 9759, -74379, 25512, -175528, 170155, -32794, 128622, -309199, 273885, 105991, 299678]
12569B99678A6451J59648D749a72734b1733B7317J77663q2265J20171G2551d0602
12557h7867l3820l24079a74283B05151a71413g759j32446k1856A71035c57740
12546b24620H727L92765C4662J41741a8648D19735A35850b7602D4262R4129l7523
12535A00868J53198j21771a31697D55489a2592A40698J15991l0251G1428b79565
12524A36154a32130r0802a952A95306B067J11120a16771J8166p011I2454b75669
12512g4601m9427B17113b66307G7895M6912O540a17260A46997g3740a1706m93
12501a2199n3992G1491P661b08668C53036b32332a00205D7546K93210A42242b05602
12489C04297A16787K35586c2743j39583K5884B76407a22022E246M6646J55403
$$ y = [299678, 16451, 176099, 4749, -172734, -21733, 27317, 204980, 122715, 242886, 72551, -40602, -87867, -121687, -445766, -174283, 205151, -171413, -7759, -140205, -162061, 171035, -357740, -224620, 8727, 401492, 34662, 176403, -18648, 419735, 135850, -27602, 44262, 138391, 100868, 254066, 132295, -131697, 455489, -12592, 140698, 256689, 226438, 71428, -279565, 136154, -132130, -222932, -1952, 195306, 2067, 113187, -116771, -98605, -105616, 92454, -275669, -74601, -124028, 217113, -266307, 77895, 124807, 131347, -117260, 146997, -73740, -11706, -12199, -66191, 71491, 79152, -208668, 353036, -232332, -100205, 47546, 340756, 142242, -205602, 304297, 116787, 352373, -32743, -172326, -146442, 276407, -122022, 5246, 51892, 207295]
12479B07295B0666L7046N6170M2228F4136b07207I0991J07042b1444k9482A61559
12467C8040a08860b3724B38542c20908A45429E3076b34968M9589f1466l9978h958
12455C58454e4481A51146L17002a87807m8983i5550C20869i5064j51393f0071
12444D58615A0562K84701b53751C71953c1779H4515b93636J24551C06067a50344
12433g4578A03141h1910I2314A5273O993N6791d3782J5598m18273a89613E4563
12421b20006l9709J04028L5728G7483J61271I0802k5807j4123g3101r89E2047
12409A31618E7732J19614a98099G3791a03559D2062K2848Q1798h7264c8573k59908
12398b98481M4730A30672b92970C99528a23130A68214a8224k02573O4539A95177
$$ y = [207295, 20666, 57712, 113882, 156110, 64136, -207207, 90991, 198033, -21444, -50926, 161559, 38040, -108860, -23724, 238542, -320908, 145429, 53076, -234968, -185379, -61466, -101444, -8958, 358454, -54481, 151146, 468148, -187807, -236790, -95550, 320869, -95064, -246457, -60071, 458615, 10562, 295263, -253751, 371953, -31779, 84515, -293636, -169085, 306067, -150344, -74578, 103141, -81910, 92314, 15273, 22266, 79057, -43782, -28184, -446457, -189613, 54563, -220006, -259715, -155687, -119959, 77483, 238754, 90802, 64995, 50872, -73101, -74090, 52047, 131618, 57732, 177346, -198099, 73791, -103559, 42062, 64910, 146708, -87264, -38573, -298481, -253751, 130672, -292970, 399528, -123130, 168214, -18224, -220797, -156258, 195177]
12387d5482J1795J2629B20702A4062f7475B3886b140l70265B99195c41978A12019
12375B4126f8196A1082b04125A48103C7870K12354j04306e6550j07115C17147
12364i421p630B70623a43948B36526a09829l46374B41676A0009g968q9621B56319
12352I1893h0807B44474a44264J9758A12824a1312j11716J4184B13759o2086j6064
12341A35609J72387c20919D5708L22619K8638f6502j12587f4231D866K04065K0590
12330B29521F7206J08231l0929B5735b49488A07691J24193O5420a51170C09715
12319e1406F9498a67880A26991J58637a9413A23220b04537D9454i7555I7514J94269
12308B91783g1703E121J21609C9760R123b77682a8917A32917a61930b9312A18529
$$ y = [-45482, -33687, -21058, 220702, 14062, -67475, 23886, -2140, -372405, 299195, -341978, 112019, 24126, -68196, 11082, -204125, 148103, 37870, 250224, 145918, -56550, -163665, 317147, -9421, -17051, 270623, -143948, 236526, -109829, -456203, 241676, 10009, -7968, -97589, 256319, 91893, -80807, 244474, -144264, -124506, 112824, -11312, -123028, -108844, 213759, 151673, 135609, 307996, -320919, 45708, 368327, 396965, -66502, -179089, -64231, 4866, 208931, 229521, 67206, 175437, 144508, 25735, -249488, 107691, 231884, 297304, -151170, 309715, -51406, 69498, -167880, 126991, 285628, -19413, 123220, -204537, 49454, -97555, 97514, 291783, -71703, 5121, 126730, 39760, 48883, -277682, -18917, 132917, -161930, -29312, 118529]
12296B65872a95485R1276j07670G872J64250F6715a5291B57391f0607m2158I9422
12284G1342a39075g217o5847c5915F3526i3962G0858f5205D16022A09145M08179
12273E17324a10049B48757a42483A19103b0173k1968G9515c953k4312B6766a42596
12261A47471b6068k35722A58633a06285C75252a13019k15596a2273k4913B32681
12250I2414a28587B81724G0994l0203f659k08101H0956K36993c96668H6377N9438
12239A45815a50k3860k16066c74F2985Q1281j0230d9612j18474A79096E6365R1011
12227A47376L9253k6546B2796K47210C9218O6190K84791a11315J9755C27407Q4776
12216D12183g0465C7496J20439c02379A12301i0282B51461F5953B6167a0601A44480
$$ y = [265872, -195485, -104209, -211879, 7872, 172122, 66715, -15291, 257391, -60607, -102765, 99422, 71342, -139075, -7217, -73064, -35915, 63526, -93962, 70858, -65205, 416022, 109145, 517324, -110049, 248757, -142483, 119103, -20173, -42141, 79515, -3953, -28265, 26766, -142596, 147471, -26068, -261790, 158633, -106285, 375252, -113019, -328615, -12273, -37186, 232681, 92414, -128587, 281724, 70994, 40791, -6659, -214760, 80956, 317949, -396668, 86377, 145815, -150, -24010, -240076, -374, 62985, 144266, 134036, -49612, -168086, 179096, 56365, 147376, 186629, 160083, 22796, 270006, 39218, 105408, 390199, -111315, -91560, 327407, 412183, -70465, 37496, 157935, -302379, 112301, -90282, 251461, 65953, 26167, -10601, 144480]
12204B43682N1658A27617D2656J15430L09284A74649b4503B39765G8000O1464
12194A39464E2803b06B21075a00516F3614a67832N0176L3956A2514L57728A59502
12182D37869A61622b8974A68008J53806d40356C85403A42229K94052A03826J33720
12172B37546o050j7558n9699J61894D7357R8467G0513L88580d4470H3208c97672
12160C42262c6232j01686A43848f4119A22754a5077m9748j25500N3797e7009B19976
12148G2065B9826J98174j1846H5103L01734n8929e1750A24420J17260N3205F5308
12136A37409C4156Q0624a26617F7159q688Q6740D9139b03938L4932C85232d5366
12124G7828K27492a88475A43449a03520r2452D74172c20184a38410K0252n855
$$ y = [243682, 295340, 127617, 42656, 158086, 467370, 174649, -24503, 239765, 78000, 139464, 52803, -206, 221075, -100516, 63614, -167832, -117656, -83700, 12514, 370242, 159502, 437869, 161622, -28974, 168008, 321814, -440356, 385403, 142229, 436281, 103826, 237546, 231496, 213938, 154239, 316133, 47357, 145824, 70513, 459093, -44470, 83208, -397672, 342262, -36232, -137918, 143848, -64119, 122754, -15077, -64825, -190325, -136528, -57009, 219976, 72065, 29826, 228000, 216154, 85103, 386837, 327908, -51750, 124420, 241680, 294885, 65308, 137409, 34156, 114780, -126617, 67159, 58471, 145211, 49139, -203938, -169006, 385232, -45366, 77828, 305320, -188475, 143449, -103520, -195972, 474172, -320184, -138410, -118158, -124013]
12114a24013K6808C6926f1614I5893c60411a49961A44539j3596b11585D3073b23273
12102A42204a84686C32167b44984D9660J40769A9572Q7940R515b06496C37139
12091B20570a38702A9094J74921A673aA17876e0711m3199B8333d7873E54800J136346
12079A691146J212605A116838C49980j19454H2776P3159Q731n3717F392R7976
12069A04368c61989B50915b89483B92216A9609K70572E9970b10422K1207k2850
12059b12065B33563E8263J57901g7716K0078I1504b5150D7294q002c0310J5091
12048a5219C5091J31239m6055J8755f4711H4653R0928c06264C95422A79914i8449
12036a91229L844A57932a92853C34706a3155j81055b6233l55226d6637m3173l0511
$$ y = [-124013, -97205, 36926, -61614, 95893, -360411, -149961, 144539, 130943, -211585, 43073, -223273, 142204, -184686, 332167, -244984, 49660, 190429, 19572, 107512, 117027, -206496, 337139, 220570, -138702, 19094, 194015, 1673, -1, 117876, -50711, -93910, 28333, -47873, 554800, 1691146, 2903751, 1116838, 349980, 230526, 82776, 155935, 164666, 110949, 6392, 104368, -361989, 250915, -289483, 292216, 19609, 290181, 59970, -210422, -189215, -212065, 233563, 58263, 216164, -77716, -57638, 91504, -25150, 47294, 39292, -30310, -15219, 35091, 166330, 120275, 139030, -64711, 84653, 175581, -306264, 395422, 179914, -98449, -191229, -187385, 157932, -192853, 334706, -13155, -194210, -26233, -381459, -46637, -89810, -120321]
12025a20321D9759J32287d08154B3947a55926d9761j00274a1993H2726J06772
12015A89498e3219p5158j66381G6746b35930I4070c14589J29375A75656c28515
12004B6735c67373C2418b1222A04227b57986B73207j12001d34669J20046B87157
11993f7410k7024A1107a55041j37890O6721P6168O6904i894q0032I4595L9251
11982A33846C1449e6969j53138B72811c74754E9263M6542a39019A50561A679a04606
11970a44586j21508p5796B10109a55726A62393f3324f770F4577a39569A91841
11959c45163A85348J13279b23239a539A77759a30648A40790Q2421a32589D22777
11948H5508P972n182K99195b93048b2603B03563O5490a84868e7713B74734A08954
$$ y = [-120321, 49759, 182046, -408154, 23947, -155926, -49761, -150035, -11993, 82726, 189498, -53219, -128377, -294758, 76746, -235930, 94070, -314589, -185214, 175656, -328515, 26735, -367373, 32418, -21222, 104227, -257986, 273207, 161206, -434669, -314623, 287157, -67410, -94434, 11107, -155041, -292931, -226210, -150042, -83138, -9894, -89926, 94595, 133846, 31449, -56969, -210107, 272811, -374754, 59263, 105805, -139019, 150561, 1679, -104606, -144586, -266094, -341890, 210109, -155726, 162393, -63324, -6770, 64577, -139569, 191841, -345163, 185348, 298627, -223239, -1539, 177759, -130648, 140790, 223211, -132589, 422777, 85508, 93480, 88298, 387493, -293048, -22603, 203563, 269053, -184868, -57713, 274734, 108954]
11936d4088j44237A89771d8272B8886a32064j63010A49894k2246c4442a0717N26
11925a0191A29816a00232l12458a20880G3772J0385c09339A4143a11177A92849
11914A01051b2292I0749i6505b0623B4799b26147g0488j1692m2865E644b38018
11902F4783N6869A2004e8535k31640N4460O5613B35959e8826j23919B1182N5866
11891G7048b2200e753A81167d99945B21218a96019H5109J85500r2485m5549e9671
11879H5275k2645c1715k65989A11904j8666C1149a70233D0055J17224c30023h7343
11867a93457P6503A54331l0083a81442f5048n5830H6495b2596j85954k470J01107
11856a09913r2610e4802B93448A12465a25826A06886a18942n6450I320a43316
$$ y = [-44088, -188325, 189771, -48272, 28886, -132064, -295074, 149894, 127648, -34442, -10717, -10191, 129816, -100232, -412690, -120880, 73772, 84157, -309339, 14143, -111177, 192849, 101051, -22292, 90749, -96505, -20623, 24799, -226147, -70488, -82180, -125045, 5644, -238018, 64783, 121652, 12004, -58535, -290175, -235715, -170102, 235959, -58826, -182745, 21182, 77048, -22200, -5753, 181167, -499945, 221218, -196019, 85109, 270609, 178124, 132575, -59671, 85275, 62630, -31715, -297704, 111904, 93238, 31149, -170233, 40055, 157279, -330023, -87343, -193457, -116954, 154331, 124248, -181442, -65048, -120878, 86495, -22596, -208550, -211020, -109913, -202523, -54802, 293448, 112465, -125826, 106886, -118942, -175392, 9320, -143316]
11845e40832a03557d7979l28501H7337c2463B01107H9028J59264E9672b38658
11834A35836k2874a89659j6226b2836j3385j58493j65400O4768G9366f1836m0213
11823a02049Q892D5466c0715j73518f2448A28643K8285b46270B79097D3239K00974
11812B44213i3789l1929d2490J8287j43293j02063a01923E6372P5589b37398A69183
11800D7987g5962C04874d1548l42545a53068A3807M47408G237a97560L1963A38350
11788A82557a29877l5300a7870A29835J5355J19727e5729F9645J2777K56599D2549
11776H0699C9273J66942B7700l181b74407J21328G6295o238a71372G9286R7371
11765A76657c05563A58801p4557r985L9780c428p434B02483i9552A2041K11556
$$ y = [-540832, -103557, -47979, -376480, 87337, -32463, 201107, 89028, 248292, 59672, -238658, 135836, 112962, -189659, -205885, -22836, -36221, -194714, -360114, -295346, 79366, -61836, -102049, -93157, 45466, -30715, -204233, -62448, 128643, 156928, -246270, 279097, 43239, 244213, -93789, -125718, -42490, -24203, -167496, -269559, -101923, 56372, 131961, -237398, 169183, 47987, -75962, 304874, -41548, -384093, -153068, 13807, 461215, 7237, -197560, -165597, 138350, 182557, -129877, -165177, -17870, 129835, 145190, 264917, -55729, 69645, 82422, 339021, 42549, 80699, 39273, 206215, 27700, 24519, -274407, -153079, 76295, 70057, -171372, 79286, 176657, -305563, 158801, 84244, 74259, 114039, -3428, -10862, 202483, -99552, 12041, 223597]
11754B23597j08404K1d1768b0438A82206G8245b28893N1571f0521K1292B09417
11742B4611b24552B16656a09397k03402e0912j4445q9325c7913A39482O7859a27694
11730b71139g712j68652G9904c39125d6580D0257r354a34290I3758j3764J69779
11719B49773a48435o3327P8797B14183J40199e2752P945a4843B05967l5332a33419
11707D1924a39574C01773F9547Q3479d3497a8942q8231F2206K73484a62273O7063
11696i5210F3515a59221k93477A6578h5746D624O0688b45320A39853A1704J01422
11685A13126i5530E4871P7214l7666c70617P8157B43791C3678a20364A05083m2180
11674F2903N464J57924i5354B73539a12541E9496N4355E4428b89129G3335Q5913
$$ y = [223597, 115193, 115214, -41768, -20438, 182206, 78245, -228893, -177322, -60521, -39229, 209417, 24611, -224552, 216656, -109397, -312799, -50912, -65357, -154682, -37913, 139482, 207341, -127694, -271139, -7712, -176364, 79904, -339125, -46580, 40257, 30903, -134290, 93758, 79994, 249773, -148435, -211762, -132965, 214183, 354382, -52752, -44807, -14843, 205967, 170635, -133419, 41924, -139574, 301773, 69547, 153026, -43497, -18942, -107173, 62206, 335690, -162273, -95210, 63515, -159221, -452698, 16578, -85746, 4624, 65312, -245320, 139853, 11704, 113126, -95530, 54871, 132085, 94419, -370617, -292460, 243791, 33678, -120364, 105083, 62903, 68367, 226291, -95354, 273539, -112541, 59496, 113851, 54428, -289129, 73335, 159248]
11663A59248J32102J34839H5833J34110a75518p3383j4994a20670B12536J63069
11653C75605h305j77838B45595k6919Q7613A45018F0396J40371E9229J27795a80028
11641c24177a21196C8421K50780a19633j473H9179b19236A35652n4610a34191
11630B1679R3581b05264A97184b62929B4954a88789e6542m9970m3836a4315j40098
11619a54413C9676g7725j31632H9993h6329j31832G7103N6442a27120n7040Q5772
11608i8388j2013M415B80679f191B97778b28973b7279D6318K83650c7858G8222
11596d580m6433C4418J47198a04821J9687J9651D99967c45150B0752J98009E5500
11584C1239O8134L8173n3930b22763D15795A73128L1707c1059B60459J10218b00544
$$ y = [159248, 291350, 426189, 85833, 219943, -175518, -248901, -263895, -120670, 212536, 375605, -8305, -186143, 245595, 218676, 306289, 145018, 60396, 200767, 59229, 187024, -180028, -324177, -121196, 38421, 289201, -119633, -121106, 89179, -219236, 135652, 81042, -134191, 21679, 115260, -205264, 197184, -262929, 24954, -188789, -56542, -106512, -150348, -14315, -154413, 39676, -77725, -209357, 89993, -86329, -218161, 77103, 133545, -127120, -184160, -98388, -110401, -105986, 280679, -6191, 297778, -228973, -27279, 46318, 329968, -37858, 78222, -4580, -51013, 34418, 181616, -104821, -85134, -65483, 499967, -345150, 20752, 218761, 55500, 31239, 99373, 137546, 83616, -222763, 415795, 173128, 204835, -31059, 260459, 370677, -200544]
11572A91561o5652a05084B56580a35019c7324E9164O3235J24827c4832B47402
11561A9840L19017n6374l3953c23237J18343B59850e0158a1528A48026p3179b80501
11549B43197H1976K6667a27968a6264A30733k1826j6461N0916j5284L4993l3449
11538A29622d7758m7436Q986j31485k702A85570f9881j20112O7002A95016d148
11526F2457A7706L09282A12957R3695a15855A45012J16592a75944h2853j31647
11516b14500C96349G6207h293I5775L73693F0596J41130A0777L36736I3112b18370
11504A17921J03216Q5483j40551o1777B3706b82455B47413h2050B19863a01600
11493D21215j05489G0488j1017c5444A02586K86885A94525i748l18519E8607k4582
$$ y = [191561, 125909, -105084, 256580, -135019, -37324, 59164, 122399, 247226, -34832, 247402, 19840, 338857, 282483, 248530, -323237, -204894, 259850, -50158, -11528, 148026, 74847, -280501, 243197, 81976, 108643, -127968, -16264, 130733, 108907, 92446, 143362, 128078, 163071, 129622, -47758, -95194, -86208, -217693, -220395, 185570, -69881, -189993, -122991, 195016, -4148, 62457, 17706, 326988, 112957, 206652, -115855, 145012, 261604, -175944, -82853, -214500, 396349, 76207, -8293, 95775, 469468, 60596, 201726, 10777, 347513, 93112, -218370, 117921, 221137, 306620, 166069, 104292, 23706, -282455, 247413, -82050, 219863, -101600, 421215, 315726, 70488, 59471, -35444, 102586, 389471, 194525, -9748, -328267, 58607, 34025]
11482C4025g7253C0321J19551h738m3658q5680D70325j42454e8055A44184c6496
11470C48464k0779e9134B78233j16793O4555b81659A56825J98003F0375b30A3890
11458h1476D1251N5511k0818d7213j36642d9102o8618G3521a88966R4452i335
11446B13421C8557K64947b78852C16037q9728G1544J85705I1043K30858a6421
11435b39506C65933b16463h348d104q9627K9003B31125b69963B44536f1585E6427
11423B61392c37792a0942p3937p5266P1518n1397k08515d1790j24961B88949g5452
11411A36616F061M3856P8069k9184a19140q282A51302a76502l5585C7185K5056
11400F2241O1734R117f9010B70449J7620j23250c73365C6241P4183a13944B7835
$$ y = [34025, -77253, 30321, 149872, -8738, -52396, -138076, 470325, 327871, -58055, 144184, -36496, 348464, 327685, -59134, 278233, 161440, 225995, -281659, 156825, 354828, 60375, -230, 13890, -81476, 41251, 96762, 75944, -47213, -183855, -49102, -117720, 73521, -188966, -94514, -9335, 213421, 38557, 303504, -278852, 316037, 226309, 71544, 257249, 91043, 321901, -16421, -239506, 365933, -216463, -8348, -4104, -93731, -64728, 231125, -269963, 244536, -61585, 56427, 261392, -337792, -10942, -84879, -160145, -88627, -140024, -348539, -41790, -166751, 288949, -75452, 136616, 6061, 49917, 127986, 98802, -119140, -127422, 151302, -176502, -212087, 37185, 62241, 123975, 133092, -69010, 270449, 288069, 164819, -373365, 36241, 110424, -113944, 27835]
11388e4172E9780c14760a5350j90622B66758e2064A74604J72140e5150n984q3669
11377a44803A2012J32393b67403A25849l5927b9686J0686k0697D6213h9175l7037
11366a26212m1473a9831A51824a57325C3324L99942A72935a65430b6609o670k68052
11355c01331a6505d372p927A73275f0216A88771a1928B75667g9029A34860o5887
11344F8973a81578h8568c4617B12892g3031E8723a20942A74008j754k2358a13822
11332A24086M9827a55606m50291g8201a5541A15980j8181f0256I7552h1121A68082
11320e0092J6384k4005A23538a15516r0189D9137c35486a9754G3267b18919B81232
11308B53139b00385g1985k00599Q4156g9154N658H0046C1737b11998O9384q179
$$ y = [-54172, 59780, -314760, -15350, -205972, 266758, -52064, 174604, 346744, -55150, -61134, -144803, 12012, 144405, -267403, 125849, 89922, -29686, -19000, -39697, 46213, -89175, -126212, -167685, -19831, 151824, -157325, 33324, 433266, 172935, -165430, -26609, -33279, -301331, -16505, -4372, -12299, 173275, -60216, 188771, -11928, 275667, -79029, 134860, 68973, -181578, -88568, -34617, 212892, -73031, 58723, -120942, 174008, 172254, 149896, -113822, 124086, 173913, -155606, -605897, -78201, -15541, 115980, 97799, -60256, 97552, -81121, 168082, -50092, -33708, -57713, 123538, -115516, -205705, 49137, -335486, -19754, 73267, -218919, 281232, 253139, -200385, -71985, -272584, -188428, -79154, -73496, 80046, 31737, -211998, -142614, -150793]
11297a50793I1831a81631A0209b09800A3314K32983h4825l7558b3023j27629B27240
11285b4772d600H8015Q4652d5874C58564c22619A17476D5262K6320O8567e1722
11273D6569B0425b04021g6038j10757l3891a5352k494j27244N7314E2617j9795
11262C2822a33617A30789O7619b00075C9384a82868L0825D541J09202g234B523
11250a8450G6884M521h7606K2590j62118a01137j86036D06457A13944b36852B12821
11238c55224E3629a8687j29294C70522b21733A47465b75208N9478m5862O4857
11228a96735A92014B1238m60a42169k8813J7183f3777k98633A14993a12768E1102
11216d8823j30107m0506j82456a24914j9424j0228C9783c30064O9141l31474a78548
$$ y = [-150793, 91831, -181631, 10209, -209800, 13314, 246297, -84825, -122383, -23023, -150652, 227240, -24772, -4600, 88015, 172667, -45874, 358564, -322619, 117476, 45262, 71582, 140149, -51722, 46569, 20425, -204021, -76038, -186795, -220686, -15352, -17846, -145090, -87776, 52617, 32822, -133617, 130789, 198408, -200075, 39384, -182868, -152043, 4541, 113743, -7234, 2523, -18450, 76884, 81405, -87606, -65016, -227134, -101137, -287173, 406457, 113944, -236852, 212821, -355224, 53629, -18687, -147981, 370522, -221733, 147465, -275208, -215730, -261592, -196735, 192014, 21238, 20778, -142169, -170982, -153799, -63777, -362410, 114993, -112768, 51102, -48823, -178930, -219436, -401892, -124914, -144338, -154566, 39783, -330064, -260923, -592397, -178548]
11204c2246k04133l243a05492D89892b76529B61708c02750h9160p5909m827C95511
11192a537B74027C095c20451A43138a45217A928b23230j08176D08073a85691C1078
11180C0207K24371b39356d6887m59351B91389C5572K08683b47915a07508j08354
11170b15862K9862k78514I3958b24348F5810l2176b56985g4142A0849O902b09474
11158H9574J41093q8520a73292A38224c22997o249D9432O4587C2241b31614B5063
11146C61091a53463c5483k32312d3681l84720A31364c11455f702B05001K4213
11136B29214B3071a32337b5621o2405B70780f8470j49883N4782l6486B36010I7910
11124A17276D7489b9918k6743G5447b81900C9519e0899A64862b54337a10755A94119
$$ y = [-32246, -236379, -239622, -105492, 489892, -276529, 261708, -302750, -89160, -165069, -169896, 395511, -1537, 274027, 3095, -320451, 143138, -145217, 1928, -223230, -331406, 408073, -185691, 31078, 30207, 254578, -239356, -46887, -506238, 291389, 35572, 244255, -247915, -107508, -215862, -186000, -464514, 93958, -224348, 65810, 33634, -256985, -74142, 10849, 17751, -209474, 89574, 230667, 142147, -173292, 138224, -322997, -329246, 49432, 114019, 32241, -231614, 25063, 361091, -153463, -35483, -267795, -43681, -428401, 131364, -311455, -6702, 205001, 229214, 23071, -132337, -25621, -88026, 270780, -68470, -218353, -163571, -200057, 236010, 97910, 117276, 47489, -29918, -56661, 75447, -281900, 39519, -50899, 164862, -254337, -110755, 194119]
11112b27191B43515M8887k80J14228j81375f0045A24015J46342D633M85139a05354
11100c41130i404E22752k12137I6565i2912E4814L02659n4085o9802d23296f8147
11088H8787J18259D5877b08388F4570p733M19929k34471N1280p199d2987k5754
11077f8741A09668c4974A81390E5815J53133L03483k18774G4369J0904K37907
11067C23180j50098F845N86754j43523A92101J67126k4980K47717j61275P2144
11057D92833J21756k71500J98098k25741J79661r9174K90713l04062M96142m02774
11047D75952K77962l9202n1592j44416J35057B35883M79400J9047l40235q0990
11037C13105L68134M5157M61057n46234J70246p9028l44337J26666J78509j33128
$$ y = [-227191, 243515, 292402, 292122, 406350, 224975, -60045, 124015, 270357, 4633, 489772, -105354, -341130, -9404, 522752, 310615, 96565, -92912, 54814, 357473, 303388, 233586, -423296, -68147, 88787, 207046, 45877, -208388, 64570, 56837, 476766, 242295, 293575, 286376, -42987, -68741, 109668, -34974, 181390, 55815, 208948, 512431, 293657, 74369, 85273, 323180, 173082, 6845, 593599, 450076, 192101, 359227, 334247, 581964, 420689, 492833, 614589, 343089, 541187, 315446, 495107, 395933, 686646, 382584, 878726, 475952, 753914, 714712, 663120, 518704, 653761, 235883, 715283, 734330, 394095, 313105, 681239, 726396, 1187453, 641219, 811465, 732437, 388100, 514766, 693275, 560147]
11027E60147J64315C49133J01495k445J57255L30640C54741K28875j00636R5858
11017E78838J9267j88690l9965J80989R235B76092N1861J86840j43939N8873K88426
11006G18153k92959q5467n78J42027M09252j79852r1517L8328J01177r1058k21275
10995D46231Q9768J6695K01502j73283p6540m7054N527M95725l30685J35181m1099
10984G21968k69662N44909n4288j54685L47392J45701j54119P796L86651J28920
10974A650583N64228K81994m08605K23556l2159K28303k32842j92995l68185l4413
10964A679465k50286j50117N447N9251k77346L53205J83961M270l0808l94310
10954A182732M39017k93812P9279n02805k33646l3421R7835l47370K15997j05035
$$ y = [560147, 724462, 349133, 450628, 448183, 605438, 936078, 354741, 583616, 482980, 578838, 598105, 409415, 369450, 550439, 559674, 276092, 327953, 514793, 370854, 429727, 718153, 425194, 339727, 339149, 481176, 890428, 710576, 619059, 657387, 758564, 667506, 446231, 535999, 552694, 754196, 580913, 504373, 457319, 462846, 958571, 627886, 763067, 721968, 452306, 997215, 942927, 788242, 1135634, 1281335, 1127216, 1135012, 1521663, 1650583, 2214811, 2496805, 2088200, 2311756, 2279597, 2507900, 2275058, 2082063, 1713878, 1679465, 1429179, 1279062, 1284509, 1343760, 1066414, 1419619, 1603580, 1607850, 1577042, 1182732, 1621749, 1327937, 1407216, 904411, 670765, 637344, 735179, 387809, 603806, 498771]
10944D98771B27731Q3914j34180m1788n6904K56947c72190B96765M5929A11065
10933F0456h3606m6945A18575J60410i4634B1036N1165a20196G0472K53916k524
10922C21864f9592J8036j8034C27165A0377K15218a76816A67725a75983B41288
10911A52378D5823K07978f3933k72145a49604f0788E2704M5833N5017K56366H9432
10899a94655a0197n36239A89025F9215B6585d8350n7348d3561C7898G76J46320
10888A47096d9839A9018O6012g7626B44013D1821g31l57711E3098p475j4857b88883
10875B46854N2516C9636b19599N8764G5458h781k68315B24375b8790B80246a49431
10863B5550b28316j23671J49514F9551a4591k81755e3377j26594k2409H9070a65066
$$ y = [498771, 227731, 311645, 177465, 135677, 78773, 335720, -372190, 296765, 342694, 111065, 60456, -83606, -130551, 118575, 278985, -94634, 21036, 72201, -120196, 70472, 324388, 321864, -69592, -51556, -69590, 327165, 10377, 225595, -176816, 167725, -175983, 241288, 152378, 45823, 253801, -63933, -336078, -149604, -60788, 52704, 98537, 153554, 409920, 89432, -194655, -10197, -546436, 189025, 69215, 26585, -48350, -105698, -43561, 37898, 776, 147096, -49839, 19018, 85030, -77626, 244013, 41821, -731, -358442, 53098, 45623, 30766, -288883, 246854, 299370, 39636, -219599, -160835, 75458, -8781, -277096, 224375, -28790, 280246, -149431, 25550, -228316, -351987, -202473, 69551, -14591, -296346, -53377, -179971, -202380, 89070, -165066]
10851c54045a9161m4261D9401b1276k8542q1124d6491k4207l39426M8561B17187
10839D62063f8218A14052j4464L7902K2123e2874m34511a87136d0319D4098g6116
10827A48448a02817K4679C6093b32944p9656B05722b5131d312r9421n8265c8073
10815i2311K4366j7982c6525A1028K7330a23195k2698C06454a44083L9396B70531
10803c26492C41585A6630Q2302e0908j82233c7358l02215A37680a29421A09582
10792e510j31782k3167d5425j89457D274b62018P5951m6092D2955b29370A02233
10780b27159a516A2473g6449F879a45353J8111d6989k30716D3247O6251J45920
10769B55418o0228J30690c3724j4893B38941d3098A8887a6305r8116b6551l0817
$$ y = [-354045, -19161, -63422, 49401, -21276, -49818, -130942, -46491, -70698, -410124, -361563, 217187, 462063, -68218, 114052, 99588, 137490, 159613, -52874, -487385, -187136, -40319, 44098, -76116, 148448, -102817, -78138, 36093, -232944, -312600, 205722, -25131, -4312, -103733, -161998, -38073, -92311, -67945, -85927, -36525, 11028, 38358, -123195, -145893, 306454, -144083, -104687, 270531, -326492, 341585, 16630, 98932, -50908, -233141, -37358, -339573, 137680, -129421, 109582, -5510, -137292, -160459, -45425, -234882, 4274, -262018, -186067, -232159, 42955, -229370, 102233, -227159, -1516, 12473, -76449, 6879, -145353, -127242, -46989, -277705, 43247, 109498, 255418, 195190, 325880, -33724, -48617, 238941, -43098, 18887, -16305, -114421, -26551, -57368]
10758e7368k66877h9210F9124K0594C657L42105d24363F0483b63790o708J12674
10747a57824O6429A45887a1303k29383D4283a81723m4499p787a15464p0588a440
10735e5819B11653b56788O9579A88596a25864F3669B9904b90976G8895b11008
10724g9735A40853b6227A83104A3477L6236b25573l0429F4712d03093A10054J78075
10713B88129F0875a01718D2646a07927a5281j17713M4977q695h901k08967L3396
10702a84472R0825o3999p2032h3594r4802C02925j05753g5697p4205c3797A57074
10690C29456a11277A78902b93725A75707J12184A14276J27367O8185G2980c55811
10679D15511a20790M6385j69562a3621L153C7515K2300a76581o3207A3947E96
$$ y = [-57368, -324245, -89210, 69124, 89718, 3657, 345762, -424363, 60483, -263790, -270498, -157824, -91395, 145887, -11303, -240686, 44283, -181723, -226222, -234009, -115464, -186052, -1440, -55819, 211653, -256788, -187209, 188596, -125864, 63669, 29904, -290976, 78895, -211008, -79735, 140853, -26227, 183104, 13477, 49713, -225573, -256002, 64712, -403093, 110054, 288129, 60875, -101718, 42646, -107927, -15281, -132994, -88017, -96712, -8901, -217868, -184472, -93647, -157646, -229678, -83594, -178396, 302925, 197172, -75697, -149902, -33797, 157074, 329456, -111277, 178902, -293725, 175707, 287891, 114276, 241643, 309828, 72980, -355811, 415511, -120790, -74405, -243967, -13621, -10468, 37515, 59815, -176581, -239788, 13947, 596]
10667f8240q0036m4999e443o6452J9678D54814a53159n7743N4745m2876j09935
10656c08968A57148c18606G0411M804a86146B23689i7093c9197a8913B456J31175
10645A33631J1974a66134A14026Q9690c48722I6332j5087b16700G65b17116C0545
10633D9608b68041D9724a12286B03219h9693A92696b15960k8069H7653a89742
10622a61582O7647L5494j32288a4170k4865k03605f7805n5757A47375c372m2431
10611d5803q7969k7594N0934o5917j29424a47891j0688l8373j20563i8825Q696
10600i0129A42165d13874G4979a80933j2604e2828A86656M109m570b51239A67997
10588g6349j08757D5231c9841k34490A68772G25O0155c0624N955F3914b76328
$$ y = [-68240, -148276, -193275, -5443, -71895, -52217, 454814, -153159, -210902, -156157, -199033, -308968, 157148, -318606, 70411, 75215, -186146, 223689, -97093, -39197, -18913, 2456, 133631, 145605, -166134, 114026, 203716, -348722, 96332, 81245, -216700, 765, -217116, 30545, 49608, -268041, 49724, -112286, 203219, -89693, 192696, -215960, -244029, 87653, -189742, -161582, -93935, -58441, -190729, -14170, -39035, -242640, -67805, -123562, 147375, -3372, -45803, -133772, -161366, -110432, -176349, -305773, -147891, -158579, -196952, -317515, -98825, -90129, 142165, -413874, 74979, -180933, -193537, -52828, 186656, 190765, 186195, -251239, 167997, -76349, -185106, 45231, -39841, -274331, 168772, 725, 60880, -30624, -24669, 63914, -276328]
10576A40164P8747c15547J43701B29582d7305j20456r0151C56867b80292c2141
10565I2027P5519e687A3973M32517a84633A08530D3241b26748b2907A41814o2194
10554G9620a7364G0051b92909B69986h962j55037j51329C31284b31448N2827E8361
10542c18305e0905B46O0257A142b4877B44728A02741d70641D1261h8227B08447
10530d37343G2464i5995B23868b77840N7856B09881r8606K34636d26900J31880
10520b95020B14679b03937r3894A57714h6985q957A05256J91996c1170C5552L3865
10509F9417j3035b07321A83942b25705f9475o370H0133c07460g8110A6885L6366
10498E3251J27576f2884o796A97031c902l0515f443A63375k7350K342a64773A07237
$$ y = [140164, 218911, -315547, -171846, 229582, -47305, -167761, -257912, 356867, -280292, -32141, 92027, 167546, -5687, 13973, 446490, -184633, 108530, 43241, -226748, -22907, 141814, 79620, -17364, 70051, -292909, 269986, -8962, -163999, -315328, 331284, -231448, -178621, 58361, -318305, -50905, 246, 60503, 1142, -24877, 244728, 102741, -470641, 41261, -88227, 208447, -437343, 72464, -95995, 223868, -277840, -219984, 209881, 111275, 345911, -426900, -295020, 214679, -203937, -297831, 157714, -86985, -95942, 105256, 297252, -31170, 35552, 69417, 56382, -207321, 183942, -225705, -69475, -75845, 80133, -307460, -78110, 16885, 53251, 180827, -62884, -69680, 197031, -3902, -34417, -6443, 163375, 136025, 138367, -164773, 107237]
10485c78427b5630j10211B05734O8103l0724K57229A70222L46703j24453C3106
10474a94628B35221j02682d1581E0535a35180k03902B52130p9837o8737J25157
10464B28713b98869q1027a57780k33909J81927j6266P6393E4589N98343C0729
10453A6153a11943j58824C18730G9971c50716a00918j11418C8243K22304n7797
10443B02750a13347I2721h2953k22623l6336J39265o1361I9236d05556a43988
10432c39136A23667a44259N3905k71955B9073b39406C2071e492j92945B03569
10421b51986C47131b33216A62734e2140A7129a25031A042N4266a15747J4007k88837
10410c90577B39509R3905b44743A69084j4875h5186A60910d7358j61890A26482
$$ y = [-378427, -25630, -135841, 205734, 273837, 243113, 500342, 170222, 516925, 392472, 33106, -194628, 235221, 132539, -41581, 50535, -135180, -339082, 252130, 172293, 103556, 228713, -298869, -379896, -157780, -391689, -209762, -226028, -149635, 54589, 652932, 30729, 16153, -111943, -270767, 318730, 79971, -350716, -100918, -212336, 38243, 260547, 202750, -113347, 92721, -82953, -305576, -341912, -202647, -264008, 99236, -405556, -143988, -339136, 123667, -144259, -90354, -362309, 29073, -239406, 32071, -5492, -198437, 203569, -251986, 347131, -233216, 162734, -52140, 17129, -125031, 1042, 55308, -115747, -101740, -390577, 239509, 333414, -244743, 169084, 154209, -85186, 160910, -47358, -209248, 126482]
10399C38372C8247e5743I5236L6834f7453A871a45686L2310R226d2094Q793D66285
10386A10445f6614F6501l3223R7148m7766J09416J01003E4400j3867J0053K87713
10375C38299l8989j09233K49985N326D7533I404M2711R6530L25824R110r3548
10364C90031m2502r4321f030C21055J87455E9639K57903D3507J36559J26286l4125
10353B72227o3585g4852F58912O015j81530j78466j00503P7657o3773K07917A92368
10341B82788p149A30097P5326J49421A13060M0418j7345a84508B11722J0719c9023
10329A14747J8620a1459A23123R1384A02737J12710A05004n1576J1399k7322a86709
10317A47433l90J16028R2025O4297j11133E5994K3085L0299c58272A49591b4650
$$ y = [338372, 38247, -55743, 95236, 132070, -67453, 1871, -145686, -113376, -104150, -42094, -33301, 466285, 110445, -66614, 66501, 33278, 130426, 82660, 192076, 293079, 54400, 40533, 50586, 338299, 299310, 190077, 440062, 445388, 47533, 9404, 52115, 148645, 474469, 483579, 390031, 347529, 253208, -6030, 321055, 508510, 59639, 317542, 43507, 180066, 306352, 272227, 208642, -74852, 658912, 664927, 483397, 304931, 204428, 282085, 218312, 426229, 192368, 282788, 275639, 130097, 205423, 354844, 113060, 153478, 136133, -184508, 211722, 222441, -39023, 114747, 133367, -11459, 123123, 214507, 102737, 215447, 105004, 53428, 64827, 37505, -186709, 147433, 147043, 263071, 355096, 419393, 308260, 55994, 79079, 109378, -358272, 149591, -24650]
10305H4289g4059k45567J59093A36593L4650H494a18715C494g1303m896G2535
10293i5098K7198A26725f1655K7418j20330A19832J07306a18688j32154a6982
10282b12392J9302d1121d7A02158c55020J70913A12893a78332Q8996A4686K37444
10271B52130a7192p1367G1014a38671p3175F9644L4210c34661h182p6667b0419
10259B36721A9434b54768A14708Q6202F4788c2160C0492d0649m27626d5986B49254
10247A38449e1087A50036b03335d4014E2664M5012J83688a93222g8114L6438m408
10236d6084k60022i4006B03145b29442g2966j34415r837O0189g7451C14766b0577
10224b47373L2632Q666o2973A33975b21153K6389A35402L9461G9903d2451j48167
$$ y = [84289, -74059, -319626, -160533, 136593, 171243, 8494, -118715, 3494, -71303, -76199, 72535, -95098, -67900, 126725, -61655, -34237, -154567, 119832, 227138, -118688, -250842, -16982, -212392, -193090, -41121, -47, 102158, -355020, -184107, 112893, -178332, -89336, 14686, 252130, -17192, -88559, 71014, -138671, -211846, 69644, 103854, -334661, -8182, -84849, -20419, 236721, 19434, -254768, 114708, 200910, 64788, -32160, 30492, -40649, -468275, -45986, 249254, 138449, -51087, 150036, -203335, -44014, 52664, 97676, 281364, -193222, -78114, -41676, -46084, -306106, -94006, 203145, -229442, -72966, -207381, -217218, -157029, -77451, 314766, -20577, -247373, -214741, -206075, -269048, 133975, -221153, -194764, 135402, 174863, 79903, -42451, -190618]
10213a90618B75543b48635H4017M9565c11669D66872f9073j72209a8947j25258
10203a44205I2249e50034a02261l5185A9423a63185o9419e3742J9049j16925h087
10191d5397B55874b98896O4684m1506a08844B12139b54186H0940a9946B08468
10180B2730q544a42478j22203B13736a32656K4674M9484l77401a3511A53265K6359
10169A79624a25622A87380G6970a05403N2520k18485C7236a92900a4988L145B84499
10157a07995m3440J3647A9271Q7780b26725c1501k7203D6251M38303H4933Q2430
10146A67363a58743J3006J7247B53875a81692E224L2869Q7113P9542c00417J00967
10135a99450J372N9601A956a88374B11504c22189P4121A13108e1355a6313F518
$$ y = [-190618, 275543, -248635, 84017, 133582, -311669, 466872, -69073, -241282, -18947, -144205, 92249, -550034, -102261, -137446, 19423, -163185, -232604, -53742, -34693, -151618, -8087, -45397, 255874, -298896, -234212, -275718, -108844, 212139, -254186, 80940, -19946, 208468, 22730, 14186, -142478, -264681, 213736, -132656, -107982, -58498, -435899, -13511, 153265, 179624, -125622, 187380, 76970, -105403, -52883, -271368, 37236, -192900, -14988, -11843, 284499, -107995, -151435, -137788, 19271, 107051, -226725, -31501, -58704, 46251, 484554, 84933, 167363, -158743, -145737, -128490, 253875, -181692, 5224, 38093, 125206, 204748, -300417, -199450, -198078, -138477, 1956, -188374, 211504, -322189, -248068, 113108, -51355, -16313, 6518]
10123a72220C16510f7008m04408C3013b03350I1974b35576A07125d12129A05678
10112f8181l9325b1647A2351a56786B53146G0487a13918D00451B7253a03011m1399
10101a44410d0674j21942e4472l7660c1485k07697B44412b12502A19279C7414
10090B651d640I7397b44557h9956d0585k7205m0230I0252f3210C7689a9166G5883
10077a08664F386K4906b9727p1036d7594j45890D7947g9314m962c8762k10500
10066b49262f3157A14391b29293F2180g359n4991I5089c37625D3354e8229G4449
10054i4471H1762g7442j68926Q6976k1435B82805a36965j80714B92952r0106a10000
10042d5241l81245B84842b07532m409h2421j66072f1966j63970P9098o8283j99681
$$ y = [-172220, 316510, -67008, -471416, 33013, -203350, 91974, -235576, 107125, -412129, 105678, -68181, -107506, -21647, 12351, -156786, 253146, 70487, -113918, 400451, 27253, -103011, -144410, -40674, -162616, -54472, -92132, -31485, -239182, 244412, -212502, 119279, 37414, 2651, -4640, 97397, -244557, -89956, -40585, -67790, -108020, 90252, -63210, 37689, -19166, 75883, -108664, 6386, 31292, -29727, -100763, -47594, -193484, 47947, -79314, -84276, -38762, -249262, -63157, 114391, -229293, 62180, -7359, -62350, 95089, -337625, 43354, -58229, 74449, -94471, 81762, -77442, -246368, -159392, -180827, 282805, -136965, -317679, 292952, 202846, -110000, -45241, -426486, 284842, -207532, -211941, -82421, -248493, -61966, -225936, -146838, -215121, -414802]
10031d14802I610f9237I9585a8687k27517R8512O7242e957j1874m65447A63852
10019e4503A82252a47894b8686n8481c3636j19050B67694k0122M1849D3461j1620
10008C1841b99937A83211C2068J01509o970a46789p0047Q3622k63336A13319j7555
9997I5764a86147j74434a14709j3649A2600c60969f8627m06273J99930r9187A1342
9985b62846J28340G8989M86o97J14880e6410O361k08300G839c24947C0488a43560
9972i52q455C19569b89935g7832E9769G796M804b8437m3448q3850L0624j76243
9960c01354A99326G0204k7969c59225H2987d21794G4130c66572C15917C206c2563
9948F7447K17921b72577a4727D719b40207i6973B1210K6825J79797a09497A53918
$$ y = [-414802, 9610, -69237, 99585, -18687, -246204, -147692, -80450, -5957, -17831, -483278, 163852, -54503, 182252, -147894, -28686, -87167, -33636, -152686, 267694, 247572, 289421, 43461, 31841, -299937, 183211, 32068, 133577, 126607, -146789, -216836, -133214, -396550, 113319, 95764, -186147, -360581, -114709, -128358, 12600, -360969, -68627, -474900, -274970, -374157, 11342, -262846, -134506, 78989, 79475, 78778, 193658, -56410, -50049, -258349, 7839, -324947, 30488, -143560, -952, -9407, 319569, -289935, -77832, 59769, 7796, 12600, -28437, -71885, -155735, -125111, -301354, 199326, 70204, 42235, -359225, 82987, -421794, 74130, -366572, 315917, 3206, -32563, 67447, 285368, -272577, -14727, 4719, -240207, -96973, 21210, 48035, 227832, -109497, 153918]
9936b99223i332A40988f2553B39758f5247A68291j0898c14868A07139a18365m29
9925a18794Q618B19894a16447A83344F5244J2959F328a18893I6370a67418a7449
9913A16943n4899b02592G4829a58382r9880C941c7166D6517j3185c24671B04278
9901d2903j77293f5825j05148k9282i8542C3963b56989K7678l7267D51946B2184
9889a56756j03398e9787D2792c8975j47271B15476b03975K4304g3635A75627G9539
9877h4311k08971J30593M987d1555n6685B29287D3561h1347E7759i8384B14793
9865i7953q3111l7918N3197a8238l06663B66194A15004a6854A9346a28038k50
9854a28288B43589b39415B24478J380A4482i4844j58659J443D2598j9800K0395
$$ y = [-299223, -9332, 140988, -62553, 239758, -65247, 168291, 157393, -314868, 107139, -118365, -118794, -110176, 219894, -116447, 183344, 65244, 78203, 6328, -118893, 96370, -167418, -17449, 116943, 62044, -202592, 74829, -158382, -258262, 3941, -37166, 46517, 33332, -324671, 204278, -42903, -220196, -65825, -170973, -200255, -98542, 33963, -256989, -229311, -266578, 451946, 22184, -156756, -260154, -59787, 42792, -38975, -186246, 215476, -203975, -179671, -73635, 175627, 79539, -84311, -293282, -162689, -157702, -41555, -98240, 229287, 43561, -81347, 57759, -98384, 214793, -97953, -181064, -218982, -165785, -18238, -324901, 266194, 115004, -16854, 19346, -128038, -128288, 243589, -239415, 224478, 225858, 14482, -94844, -253503, -252060, 42598, 22798, 43193]
9843D3193a02220A3817Q3726h3671m11518c940F30b71670A2147a971C1050b55894
9830b57m21434A39966a97997B88690a81953b5911k20226q9367A2257g0931j85547
9819b56478p3416A66301C3121a88960q1438j2153A09893L0116o6497d2805p8442
9808a21247C8945a31863r2506G0420a33570p9961R4292k5498B63196b61721k5656
9797b87377a3009k5436I085K5335J40352n4597a12830I4J31228e8506j4832B70478
9784G8898b6541j72904K8822m6952h9169k48929a56367A12337b85849A46050a57710
9772b61677a04505b2228A05341M2103a36663J9695j11094f4155B15188a19978
9761B04660a35389K1017H8549b98203B4538b77389J27664M3727K6383A15194B5945
$$ y = [43193, -102220, 13817, 97543, -83671, -495189, -3940, 630, -271670, 12147, -1971, 31050, -255894, -257, -421691, 139966, -197997, 288690, -181953, -25911, -246137, -335504, 12257, -70931, -256478, -329894, 166301, 33121, -188960, -270398, -282551, 109893, 140009, 73512, -42805, -121247, 38945, -131863, -224369, 70420, -133570, -213531, -119239, -144737, 263196, -261721, -287377, -13009, -38445, 9085, 34420, 174772, 120175, -112830, 94, 131322, -58506, -73338, 270478, 78898, -26541, -199445, -170623, -217575, -89169, -338098, -156367, 112337, -285849, 146050, -157710, -261677, -104505, -22228, 105341, 147444, -136663, -116968, -228062, -64155, 215188, -119978, 204660, -135389, -114372, 88549, -298203, 24538, -277389, -149725, -105998, -79615, 115194, 25945]
9749c7903j63837A54192a81458b4626j04540n7448M0683j45061f7631b9296A59802
9737b33015A62396q0097b24540F4608a37587L3406C37434j53951d78757B61878
9726a55569b7015A0193e6661k5597M1066I6967b3160A04986L01744a14834B1693
9714b55535B34589c08721A95826c89666J74267a7040j39548P2826k69326a37127
9703b27987H7598i1376l16702Q3004a23027M316L4380G8485a89504A00490C7144
9691A59914D9404a68106d915A00839l4405b93628J37969F7020c94436i8041k71977
9680c70018g3372k876l20345H3973g9118A84169a29848k3707J4367N4714m8837
9669a33311A66128b27190f8049G8965N4696a6698j04085k32844H9450c30355B20061
$$ y = [-37903, -201740, 154192, -181458, -24626, -129166, -186614, -145931, -290992, -67631, -29296, 159802, -233015, 162396, 82299, -224540, 64608, -137587, -104181, 337434, 183483, -478757, 261878, -155569, -27015, 10193, -56661, -82258, -41192, 96967, -23160, 104986, 406730, -114834, 21693, -255535, 234589, -308721, 195826, -389666, -215399, -17040, -156588, -83762, -353088, -137127, -227987, 87598, -91376, -408078, -325074, -123027, -118711, -84331, 78485, -189504, 100490, 37144, 159914, 49404, -168106, -4915, 100839, 66434, -293628, -155659, 67020, -394436, -98041, -370018, -73372, -76248, -396593, 83973, -79118, 184169, -129848, -153555, -139188, -84474, -133311, 166128, -227190, -68049, 78965, 133661, -16698, -120783, -353627, 89450, -330355, 220061]
9657C5228c02707G6504J52992b90605Q1855l0052D351J09716a16729A1266J6282
9646B7548R3995L4327e86538a2656k8187C10817G0989B5485J08537a67697j12448
9635b80145F0518a24974k27142a7923j81212i6868E0967A1675a67006K7595K5783
9624a13628j86801C725K6515b39653k4089b2921A37603R8986a91131F823l98N97
9612G022b89941H14g3224A87532a52475L2871a6820j62523I2543a27414E04532
9600a03411D16956b36078a2461j6972j79589A90820c83013r2614D32621c67123
9589d0713r7950d2882n4421j22443J06413c8647j12944C0369b51449Q940A17166
9577a17999p012c9900j01110D6646a38832j7224j14943g3190B17290q1660b4552
$$ y = [35228, -302707, 76504, 229496, -290605, -208750, -238802, 4351, 114067, -116729, 11266, 27548, 121543, 155870, -586538, -12656, -40843, 310817, 70989, 25485, 134022, -167697, -280145, 60518, -124974, -352116, -17923, -199135, -96868, 50967, 11675, -167006, -139411, -113628, -300429, 3725, 30240, -239653, -263742, -22921, 137603, 236589, -191131, 6823, 6425, 7022, -289941, 814, -73224, 187532, -152475, -119604, -16820, -179343, 92543, -127414, 504532, -103411, 416956, -236078, -12461, -29433, -209022, 190820, -383013, -475627, 432621, -367123, -40713, -138663, -42882, -97303, -219746, -113333, -38647, -151591, 30369, -251449, -242509, 117166, -117999, -125011, -39900, -141010, 46646, -138832, -156056, -270999, -73190, 217290, 135630, -24552]
9565a55935J7003L9638L6559k01304Q4104m10618b2107D9079e7720G9775e5136
9553b87487J03220B7562b29062B01960b70184e1971A53052j2741A1870c6119D2305
9541b12053E0226b41383D27242B3287p916i3859r4934C43402c26508r0428d83
9529h9745E1981a14060L531k21815J40958C573a70833J0170j46786A10827a22314
9517a1471l3210J9882A58384d7411k35827J0202A08061c05578a17576C26530c95047
9505b5988j39997E9550b09306K3830K4439P5967A5868a64552G252R3131b20150
9493a21641a6117n5210C1556b9310r877q4296G4555a7163A53656p2837b25246
9481b12322K2915d1789H5275b37570G5740J25551f735k3912m0054L1995r4511
$$ y = [-155935, -138932, -99294, -62735, -264039, -179935, -590553, -22107, 49079, -57720, 79775, -55136, -287487, -184267, 27562, -229062, 201960, -270184, -51971, 153052, 140311, 11870, -36119, 42305, -212053, 50226, -241383, 427242, 23287, 15371, -93859, -188793, 343402, -326508, -416936, -483, -89745, 51981, -114060, -110529, -332344, -191386, 3573, -170833, -160663, -307449, 110827, -122314, -11471, -44681, -24799, 158384, -47411, -283238, -273036, 108061, -305578, -117576, 326530, -395047, -25988, -165985, 59550, -209306, -185476, -161037, -85070, 15868, -164552, 7252, 100383, -220150, -121641, -16117, -71327, 31556, -29310, -39187, -123483, 74555, -17163, 153656, 80819, -225246, -212322, -189407, -41789, 85275, -237570, 75740, 201291, -6735, -30647, -70701, -38706, -133217]
9470a33217G8883n449J26420b87692N3120g8131k69366G8363J435a7035B26473
9458a68901d7657F7451a836j3795C132c69798A51886b54798e3054H3487c6416
9446D3107Q8921h0229B12999j2975i8180F7380e305k60561f9542k83465M9447
9435c03560J06163i5040q966l4413A15516b20458A14289h1899E4942B187Q280
9424A0467b3183j07297e7731A70941b79605c046n1692A77237k0490a61548B78001
9412e8975k18670B72623E5212g126n15759I9085a17499A59878m6451a28406A10605
9400a60455M2278a5734j57537B25970C8224O2864b38953B4424a71310b8517j38686
9389a67203B10118b1159k63010c0436j59539M5543L8756E3886e3591A24116l7979
$$ y = [-133217, 78883, 73434, 199854, -287692, -234572, -78131, -347497, 78363, 79798, -17035, 226473, -168901, -47657, 67451, -1836, -15631, 3132, -369798, 151886, -254798, -53054, 83487, -36416, 43107, 132028, -80229, 212999, 200024, -98180, 67380, -5305, -265866, -69542, -353007, -303560, -197397, -95040, -104006, -138419, 115516, -220458, 114289, -81899, 54942, 2187, 10467, -23183, -130480, -57731, 170941, -279605, -3046, -54738, 177237, 156747, -161548, 278001, -58975, -277645, 272623, 55212, -7126, -522885, 99085, -117499, 159878, 113427, -128406, 110605, -160455, -118177, -15734, -173271, 225970, 38224, 101088, -238953, 24424, -171310, -28517, -167203, 210118, -21159, -284169, -30436, -189975, -144432, -105676, 53886, -53591, 124116, 86137]
9378H6137J87832h5469J4291j334E5462d455j54366k54333A48825d17943b3212
9366b55580k8878A26071O5232a10594l37893b2673C60518A20100b30029F6756
9355c35493A24171b56364A35300K11916c6546A11293F630b45709r835Q1231j44644
9344c18957D7687a83090j64195B14102r7595J38207o2191B8045Q5810c51928a71711
9332A0433K51862C1169M0651J9910a54560G133a50546G7945Q0470d15666B62861
9320c78197B62705j02210C5348K56220e36374B03993o1440n5877f8628I5493c0749
9308B1628a37616A56350D0325M3533c2597A02564a58607k9164A60754L6405a57878
9296b05865h5939C74408b4928Q995k30010A06919C1096J39684a80523P5606k1234
$$ y = [86137, 273969, -85469, -71178, -72512, 55462, -4455, -158821, -413154, 148825, -417943, -23212, -255580, -284458, 126071, 191303, -110594, -448487, -22673, 360518, 120100, -230029, 66756, -335493, 124171, -256364, 135300, 347216, -36546, 111293, 6630, -245709, -255544, -174313, -318957, 47687, -183090, -347285, 214102, 116507, 254714, 192523, 28045, 113855, -351928, -171711, 10433, 262295, 31169, 71820, 91730, -154560, 7133, -150546, 77945, 158415, -415666, 262861, -378197, 262705, 160495, 35348, 291568, -536374, 203993, 142553, 86676, -68628, 95493, -30749, 21628, -137616, 156350, 40325, 83858, -32597, 102564, -158607, -187771, 160754, 197159, -157878, -205865, -85939, 374408, -24928, -15933, -245943, 106919, 31096, 170780, -180523, -104917, -126151]
9285a26151N4553r1578r7117a19882G2104b91604Q5137j11005A48178g4323j32570
9274b06893H569e5383G4211a96010b8768j10296A7252b23029R5427B42849f6259
9262b25582g8853b3980j81292A81515p7898c21226a56306B23801A6387J26982
9252A43369n6049b80899k1249A85199J56872B7079a81712p332H1212a90153A08351
9240i1288A4323M4543a52896E3158a97127Q9942j20207A96206c6766A67735F1713
9228F4938A2634Q9698a02830A89627Q8242j37720K7117O1615A14353d3141q3092
9217a26233A95264J10663e153j28660c5579q6711k2608L7634M0609r2968d0706
9205G9845e0018L415p1291A05749b11388A02946O769f6363j1930j49819P63j5483
$$ y = [-126151, -71598, -163176, -260293, -119882, 72104, -291604, -206467, -317472, 148178, -74323, -206893, 8569, -55383, 74211, -196010, -28768, -139064, 17252, -223029, -127602, 242849, -66259, -225582, -78853, -23980, -205272, 181515, 103617, -321226, -156306, 223801, 16387, 143369, 87320, -280899, -302148, 185199, 342071, 27079, -181712, -189044, 81212, -190153, 108351, -91288, 14323, 58866, -152896, 53158, -197127, -107185, -227392, 196206, -36766, 167735, 61713, 64938, 12634, 102332, -102830, 189627, 277869, 140149, 167266, 228881, 114353, -43141, -126233, 195264, 305927, -5153, -133813, -35579, -122290, -144898, -107264, -66655, -159623, -40706, 79845, -50018, -46603, -117894, 105749, -211388, 102946, 109715, -66363, -78293, -228112, -227349, -242832]
9193b42832C908Q0693b03017R0609k10009a49712r0026R4317K9561K7297B28058
9181b56129N1670A14967a97985D6289b62757j31638J89049O9262A66085B30a94514
9169a64707E2944e8880q429E9336d1142C49244o8350A3498K76696b00842m37705
9158f38547a07660p1697B71398b59649D15257b67229a00102M9025k6161m12986
9148d90224a16654M359m4470L690A61099b4045j41324g5582h680j16113a3234
9136B95540c9101B3323a14013B17990C2849h3446B67114j17866N9790e5265o3807
9125a19072p9516E3388d5635A1985a40866j47146C23078J8477d324j57322A35570
9113h5236p8636F9602P9242a47170d1469j20598r7507F3855N6940o137b77913
$$ y = [-242832, 3908, 84601, -203017, -112408, -322417, -149712, -239738, -145421, -115860, -88563, 228058, -256129, -204459, 114967, -197985, 46289, -262757, -394395, -205346, -136084, 166085, 230, -194514, -164707, 52944, -58880, -67309, 59336, -41142, 349244, 280894, 13498, 290194, -200842, -638547, -107660, -179357, 271398, -259649, 415257, -267229, -100102, -51077, -77238, -490224, -116654, -112295, -156765, -153075, 161099, -24045, -165369, -75582, -8680, -124793, -13234, 295540, -39101, 23323, -114013, 217990, 32849, -83446, 267114, 149248, 209038, -55265, -119072, -198588, 53388, -45635, 11985, -140866, -288012, 323078, 341555, -4324, -161646, 135570, -85236, -163872, 69602, 148844, -147170, -41469, -162067, -259574, 63855, 120795, 114658, -277913]
9101e8557A26876f6870F3039a71536K2248l1048A68649l6780b00337E2597f4883
9089B30436A03765a34369C43892a49166j93420R4132i8840M3785q0909j7864K8919
9078a24909B43250a7171A0523b25709L637B61715b07032K984G8284d2565j07654
9067a50219e6926F965J12686C0079f0264B00605b1519B5546c11739g9291L3976
9056d5315j04729M5751k74933r047g4195A18656c51665m1199a83574A38827N1807
9045A90634B5945K1553c75155a31316m9446B47687F1642R0521C1680c0839n7183
9034h8022k3793q9212c2746j45088c393B48940g62E1057c857j04510j90533b6252
9021B2193a50380k59257A98325C8365a63048B0069Q3194b11144g7622I7726K0502
$$ y = [-58557, 126876, -66870, 63039, -171536, -149288, -180336, 168649, 131869, -200337, 52597, -64883, 230436, 103765, -134369, 343892, -149166, -342586, -248454, -98840, -55055, -135964, -153828, -124909, 243250, -17171, 10523, -225709, -222072, 261715, -207032, -204048, 78284, -42565, -150219, -56926, 6965, 119651, 30079, -60264, 200605, -21519, 25546, -311739, -79291, -45315, -150044, -104293, -379226, -388273, -74195, 118656, -351665, -392864, -183574, 138827, 190634, 25945, 47498, -375155, -131316, -180762, 247687, 61642, 152163, 31680, -30839, -88022, -111815, -201027, -32746, -177834, -3393, 248940, -762, 51057, -3857, -108367, -298900, -26252, 22193, -150380, -409637, 198325, 38365, -163048, 20069, 103263, -211144, -77622, 97726, 118228]
9010A18228h9789j23852B31780A04504i602A59427b27736N5743d552B2544a90678
8998H717g8989j4922A43302o8976a96247n3682A67397k7922g8891E1544A7439
8986A66040b16373C41369e0803C32543b10728A10077a38747a850A73033b93411
8975a02477m7167F5868M0294b8866B24191a9040j58309M934M724O484L8506D7771
8962a55039L6258B28201H8344c9257A04934R8276b36378q4529a20808b6693r6728
8951a23421A08033f7000B77744b11302H0301A9761J92333a56795j53865d0299
8940B26961d51j02249B8395R6802b91392a8515D48487H33h5009k89901h8111A02091
8927e6698j5947j51185g4701r9961I11627K981614O889950B241962F44618A80342
$$ y = [118228, -89789, -213641, 231780, 104504, -9602, 159427, -227736, -171993, -4552, 22544, -190678, 8717, -78989, -93911, 143302, 74326, -196247, -249929, 167397, 139475, -78891, 51544, 17439, 166040, -216373, 341369, -50803, 332543, -210728, 110077, -138747, -1850, 173033, -293411, -102477, -149644, 65868, 106162, -28866, 224191, -19040, -177349, -172415, -167691, -161207, -122701, 47771, -155039, -118781, 228201, 88344, -39257, 104934, 203210, -236378, -320907, -120808, -26693, -123421, 108033, -67000, 277744, -211302, 80301, 19761, 212094, -156795, -310660, -40299, 226961, -451, -102700, 28395, 125197, -291392, -18515, 448487, 833, -85009, -374910, -88111, 102091, -56698, -72645, -223830, -74701, -174662, 911627, 3893241, 10783191, 2241962, 644618, 180342]
8916B91327M3841K0662b9326F4194L07520F8527J03694f4248a252p1293l9467
8905a12012e739q4336q1961e8789k40053g5977l14481A95213K5117b04559i0307
8893A7612c10659N8589i2785I3844B2876a40369k28535A61945n4744A8697a84436
8881A12482K6963o4527b13107H839d61901b2143j60177a9835A9959R2556h1787
8869c91773A11067C4858a19299B14758a06431J0573D8152d9900C82408b3715P748
8858a5967n756r7998K5799k61475H0394a49308M3495N2555J174k44672C4709J53461
$$ y = [291327, 335168, 355830, -29326, 64194, 371714, 68527, 172221, -64248, -1252, -72545, -112012, -5739, -90075, -172036, -58789, -298842, -75977, -390458, 195213, 220330, -204559, -90307, 17612, -310659, -252070, -92785, 93844, 22876, -140369, -368904, 161945, 107201, 18697, -184436, 112482, 139445, 74918, -213107, 8839, -461901, -22143, -182320, -19835, 19959, 112515, -81787, -391773, 111067, 34858, -119299, 214758, -106431, -95858, 48152, -49900, 382408, -23715, -15967, -21723, -119721, -93922, -355397, 80394, -149308, -105813, -53258, -52084, -296756, 34709, 188170]
$$ [...]
##END NTUPLES=NMR SPECTRUM
##END=
