
##TITLE=AC1356_CPIAH12175_6945563_JRe93f0Dzk
##JCAMPDX= 6.0         $$ Bruker NMR JCAMP-DX V2.0
##DATA TYPE= NMR SPECTRUM
##DATA CLASS= NTUPLES
##ORIGIN= BRUKER
##OWNER= Administrator
$$ 1.72 TOPSPIN		Version 2.1
$$ 2012-12-11 22:22:10.418 -0500  Administrator@X
$$ Compression mode = diff/dup
##.OBSERVE FREQUENCY= 400.02188249412
##.OBSERVE NUCLEUS= ^1H
##.ACQUISITION MODE= SIMULTANEOUS (DQD)
##.ACQUISITION SCHEME= undefined
##.AVERAGES= 64
##.DIGITISER RES= 22
##SPECTROMETER/DATA SYSTEM= spect
##.PULSE SEQUENCE= noesygpps1d.comp
##.SOLVENT NAME= COFFEE_meoh
##.SHIFT REFERENCE= INTERNAL, COFFEE_meoh, 1, 14.96104
##AUDIT TRAIL= $$ (NUMBER, WHEN, WHO, WHERE, PROCESS, VERSION, WHAT)
$$ ##TITLE= Audit trail, TOPSPIN		Version 2.1
$$ ##JCAMPDX= 5.01
$$ ##ORIGIN= Bruker BioSpin GmbH
$$ ##OWNER= Administrator
$$ $$ E:\/data/COFFEE/nmr/AC1356_CPIAH12175_6945563_JRe93f0Dzk/22/pdata/1/auditp.txt
$$ ##AUDIT TRAIL=  $$ (NUMBER, WHEN, WHO, WHERE, PROCESS, VERSION, WHAT)
(   1,<2012-12-11 22:22:04.215 -0500>,<Administrator>,<X>,<go>,<TOPSPIN 2.1>,
      <created by zg
	started at 2012-12-11 22:10:34.120 -0500,
	POWCHK enabled, PULCHK disabled,
       configuration hash MD5:
       86 BA 57 50 F2 9D 5C 9B 26 00 A9 28 5F 66 2E 89
       data hash MD5: 64K
       EF 8A 95 CF D2 F6 18 2D 19 7D 79 5A E8 D6 A6 97>)
(   2,<2012-12-11 22:22:07.403 -0500>,<Administrator>,<X>,<proc1d>,<TOPSPIN 2.1>,
      <Start of raw data processing
       efp LB = 0.3 FT_mod = 6 PKNL = 1 PHC0 = 0 PHC1 = 0 SI = 128K 
       data hash MD5: 128K
       5F 08 70 5D 67 4D 87 B5 EB 3D 8C 34 E4 E0 C7 38>)
(   3,<2012-12-11 22:22:08.543 -0500>,<Administrator>,<X>,<proc1d>,<TOPSPIN 2.1>,
      <pk PHC0 = -79.88708 PHC1 = 0 
       data hash MD5: 128K
       8C BD 7C ED C8 91 16 6E 1A AB FE 5C 3A 5E 1E 97>)
(   4,<2012-12-11 22:22:09.325 -0500>,<Administrator>,<X>,<proc1d>,<TOPSPIN 2.1>,
      <abs ABSG = 1 
       data hash MD5: 128K
       66 0C 19 61 9E F8 25 67 7B E1 7D 23 F9 C3 E4 70>)
(   5,<2012-12-11 22:22:09.528 -0500>,<Administrator>,<X>,<proc1d>,<TOPSPIN 2.1>,
      <abs ABSG = 2 
       data hash MD5: 128K
       49 BD 5B AC B5 D4 9F 4C BD 64 F4 A6 29 D5 6D E3>)
(   6,<2012-12-11 22:22:09.715 -0500>,<Administrator>,<X>,<proc1d>,<TOPSPIN 2.1>,
      <abs ABSG = 3 
       data hash MD5: 128K
       BD 18 D2 FE 92 F2 F4 D4 8A 50 EF 2B 2A 31 5A F2>)
(   7,<2012-12-11 22:22:09.887 -0500>,<Administrator>,<X>,<proc1d>,<TOPSPIN 2.1>,
      <abs ABSG = 4 
       data hash MD5: 128K
       DB 32 C4 52 F2 E8 03 1F 49 F4 DE 05 F7 A2 A7 9E>)
(   8,<2012-12-11 22:22:10.075 -0500>,<Administrator>,<X>,<proc1d>,<TOPSPIN 2.1>,
      <abs ABSG = 5 
       data hash MD5: 128K
       59 F7 A9 7B A6 F3 26 B8 9B 18 FC 63 C4 01 C4 CC>)
$$ ##END=
$$ 
$$ $$ hash MD5
$$ $$ 66 09 96 6E B6 E4 68 DA 02 8E 44 52 F1 35 58 BE
##$RELAX= 
##$RELAX= 
##$RELAX= 
##$RELAX= 
##$RELAX= 
##$RELAX= 
##$RELAX= 
##$RELAX= 
##$RELAX= 
$$ Bruker specific parameters
$$ --------------------------
##$DU= <E:\>
##$EXPNO= 22
$$ [...]
##$TP07= 0
##$TPNAME0= <>
##$TPNAME1= <>
##$TPNAME2= <>
##$TPNAME3= <>
##$TPNAME4= <>
##$TPNAME5= <>
##$TPNAME6= <>
##$TPNAME7= <>
##$TPOAL= (0..7)
0.5 0.5 0.5 0.5 0.5 0.5 0.5 0.5
##$TPOFFS= (0..7)
0 0 0 0 0 0 0 0
##$TUNHIN= 0
##$TUNHOUT= 0
##$TUNXOUT= 0
##$USERA1= <user>
##$USERA2= <user>
##$USERA3= <user>
##$USERA4= <user>
##$USERA5= <user>
##$V9= 5
##$VALIST= <valist>
##$VCLIST= <CCCCCCCCCCCCCCC>
##$VD= 0
##$VDLIST= <DDDDDDDDDDDDDDD>
##$VPLIST= <PPPPPPPPPPPPPPP>
##$VTLIST= <TTTTTTTTTTTTTTT>
##$WBST= 2048
##$WBSW= 25
##$XGAIN= (0..3)
0 0 0 0
##$XL= 0
##$YL= 0
##$YMAX_a= 5404485
##$YMIN_a= -11778203
##$ZGOPTNS= <>
##$ZL1= 120
##$ZL2= 120
##$ZL3= 120
##$ZL4= 120
##$ABSF1= 14.96104
##$ABSF2= -5.597142
##$ABSG= 5
##$ABSL= 3
##$ALPHA= 0
##$AQORDER= 0
##$ASSFAC= 0
##$ASSFACI= 0
##$ASSFACX= 0
##$ASSWID= 0
##$AUNMP= <proc_prof1d_extract.lims>
##$AXLEFT= 0
##$AXNAME= <>
##$AXNUC= <1H>
##$AXRIGHT= 0
##$AXTYPE= 0
##$AXUNIT= <>
##$AZFE= 0.1
##$AZFW= 0.1
##$BCFW= 0
##$BC_mod= 0
##$BYTORDP= 0
##$COROFFS= 0
##$CY= 15
##$DATMOD= 1
##$DC= 0
##$DFILT= <>
##$DTYPP= 0
##$F1P= 0
##$F2P= 0
##$FCOR= 0.5
##$FTSIZE= 131072
##$FT_mod= 6
##$GAMMA= 0
##$GB= 0
##$INTBC= 1
##$INTSCL= 1
##$ISEN= 128
##$LB= 0.3
##$LEV0= 0
##$LPBIN= 0
##$MAXI= 10000
##$MC2= 0
##$MEAN= 0
##$ME_mod= 0
##$MI= 0
##$NCOEF= 0
##$NC_proc= -2
##$NLEV= 6
##$NOISF1= 0
##$NOISF2= 0
##$NSP= 0
##$NTH_PI= 0
##$NZP= 0
##$OFFSET= 14.96104
##$PC= 1
##$PHC0= -79.88708
##$PHC1= 0
##$PH_mod= 1
##$PKNL= yes
##$PPARMOD= 0
##$PPDIAG= 0
##$PPIPTYP= 0
##$PPMPNUM= 2147483647
##$PPRESOL= 1
##$PSCAL= 4
##$PSIGN= 0
##$PYNMP= <proc.py>
##$REVERSE= no
##$SF= 400.020009622029
##$SI= 131072
##$SIGF1= 0
##$SIGF2= 0
##$SINO= 400
##$SIOLD= 131072
##$SPECTYP= <>
##$SREGLST= <1H.CDCl3>
##$SSB= 0
##$STSI= 131072
##$STSR= 0
##$SW_p= 8223.68421052631
##$SYMM= 0
##$S_DEV= 0
##$TDeff= 65536
##$TDoff= 0
##$TI= <>
##$TILT= no
##$TM1= 0
##$TM2= 0
##$TOPLEV= 0
##$USERP1= <user>
##$USERP2= <user>
##$USERP3= <user>
##$USERP4= <user>
##$USERP5= <user>
##$WDW= 1
##$XDIM= 131072
##$YMAX_p= 488947278
##$YMIN_p= -12942
##$CURPLOT= <Network HP LaserJet P1505>
##$CURPRIN= <$Network HP LaserJet P1505>
##$DFORMAT= <normdp>
##$LAYOUT= <+/1D_H.xwp>
##$LFORMAT= <normlp>
##$PFORMAT= <normpl>
##$SURQMSG= 1
$$ End of Bruker specific parameters
$$ ---------------------------------
##NTUPLES= NMR SPECTRUM
##VAR_NAME=  FREQUENCY,     SPECTRUM/REAL,   SPECTRUM/IMAG
##SYMBOL=    X,             R,               I
##VAR_TYPE=  INDEPENDENT,   DEPENDENT,       DEPENDENT
##VAR_FORM=  AFFN,          ASDF,            ASDF
##VAR_DIM=   131072,        131072,          131072
##UNITS=     HZ,            ARBITRARY UNITS, ARBITRARY UNITS
##FACTOR=    0.0627417313425164, 1,          1
##FIRST=     8223.62146879497, -2067,        -52802
##LAST=      0,             -829,            -53191
##MIN=       0,             -12942,          0
##MAX=       8223.62146879497, 488947278,    0
$$ Real data points
##PAGE= N=1
##DATA TABLE= (X++(R..R)), XYDATA
$$ [...]
61683D16720j774k363k735k682k008j175j133j911k297j682j101j472j962j397
61669C91028l16j82j194k220k469j996j020J77J063J455J852K440K553J905J422
61654C94498J770K081J369K74J3M34N94N61J098K001K345K091K045K448K822K992
61638D19436L121K957K155J075L12k50r86j639j847j974k506l160l591m183n100
61623D03820n354m146k417j675j917k046j763j534j269n64Q2j89j105j688j833
61608C76402k183k742k981k997l218l297k667j853j858k561l055l224l554l742
61594C36470l081j954j421j486j295q58r97j658j913j588j390j361q13P4K11n29
61578C16411r16k90M30K23n92j032p06J0M65J66p14j321j097m94j63O8N54Q17
$$ y = [416720, 414946, 412583, 409848, 407166, 405158, 403983, 402850, 400939, 398642, 396960, 395859, 394387, 392425, 391028, 390712, 390530, 389336, 387116, 384647, 382651, 381631, 381808, 382871, 384326, 386178, 388618, 391171, 393076, 394498, 396268, 398349, 399718, 399992, 400005, 400439, 401033, 401594, 402692, 404693, 407038, 409129, 411174, 413622, 416444, 419436, 422557, 425514, 427669, 428744, 429056, 428806, 427820, 426181, 424334, 422360, 419854, 416694, 413103, 408920, 403820, 398466, 394320, 391903, 390228, 388311, 386265, 384502, 382968, 381699, 381135, 381217, 381028, 379923, 378235, 376402, 374219, 371477, 368496, 365499, 362281, 358984, 356317, 354464, 352606, 350045, 346990, 343766, 340212, 336470, 333389, 331435, 330014, 328528, 327233, 326375, 325378, 323720, 321807, 320219, 318829, 317468, 316655, 316729, 316940, 316411, 315495, 315205, 315635, 315858, 315266, 314234, 313528, 313538, 314003, 314169, 313455, 312134, 311037, 310543, 310380, 310448, 311002, 311819]
61560C11819K60n39n05L26J022J286J599K135K595K867K857K115O39n21o04l35
61544C27016n84p51K8J014J067Q28J647K951L078K239K218L213L479K392J312
61529C51147R67M04p60j282m99M05L85K4P7J07l09n15p5K06l97j236j355r10o77
61510C45707r61j625k420k728j916l93N29K91l54p03r31j241j278q64l35J82Q39
61493C31799J270R10K95O32J773K149J211M36J099K413K826K043R08J60J13P72
61477C50809J611J879J569J330J261Q13O9q4N58J124J150J209J544J390L82o22
61461C65992q57p07p31o51j49L27L25J67K82N21O64R02J311J582J682J956K322
61444C74938K303K040K222K804K963K635K733L452L765L144K417K266K232J896
$$ y = [311819, 312079, 311540, 311035, 311361, 312383, 313669, 315268, 317403, 319998, 322865, 325722, 327837, 328476, 327955, 327351, 327016, 326432, 325681, 325709, 326723, 327790, 328618, 330265, 333216, 336294, 338533, 340751, 343964, 347443, 349835, 351147, 352114, 352518, 351758, 350476, 349977, 350382, 350767, 350791, 350868, 350975, 350666, 350151, 350076, 350282, 349885, 348649, 347294, 346384, 345707, 344746, 343121, 340701, 337973, 336057, 335664, 336193, 336484, 336130, 335427, 334496, 333255, 331977, 331113, 330778, 330960, 331799, 333069, 333979, 334274, 334906, 336679, 338828, 340039, 340475, 341574, 343987, 346813, 348856, 349764, 349924, 350037, 350809, 352420, 354299, 355868, 357198, 358459, 359272, 359341, 359257, 359815, 360939, 362089, 363298, 364842, 366232, 366614, 365992, 365135, 364428, 363697, 363046, 362897, 363224, 363549, 363716, 363998, 364519, 365183, 366085, 367396, 368978, 370660, 372616, 374938, 377241, 379281, 381503, 384307, 387270, 389905, 392638, 396090, 399855, 402999, 405416, 407682, 409914, 411810]
61430D11810J714J870J671R26O04J171J568R38K31P98K386L665M028L729K975
61415D40084J935J076N57j21j237k240k678k859k970k501j435r51j863l202l489
61400D18106k819k495l045l733l772l145k289j674j547j725j764j548j324j138
61386C86088q25o13q89j247q07L26R50N86J93N91J291J531J407J306J176J079
61370C92143J509K479L153L050K684K470K059J379J227J943K618K492K186K617
61356D24009L613M505N294O294P379Q343R298J0036R838Q610P294O409N231L238
61342E19391J293M92O47Q96R49Q52M01l25o61m54o30j835l368m249m466m401l996
61325E00536l314k963l068k827j847q06KJ360L395M686M448M110N140O633O924
$$ y = [411810, 413524, 415394, 417065, 417991, 418595, 419766, 421334, 422272, 422503, 423301, 425687, 429352, 433380, 437109, 440084, 442019, 443095, 443652, 443531, 442294, 440054, 437376, 434517, 431547, 429046, 427611, 426660, 424797, 421595, 418106, 415287, 412792, 409747, 406014, 402242, 399097, 396808, 395134, 393587, 391862, 390098, 388550, 387226, 386088, 385263, 384650, 383761, 382514, 381707, 382033, 382983, 383569, 383762, 384353, 385644, 387175, 388582, 389888, 391064, 392143, 393652, 396131, 399284, 402334, 405018, 407488, 409547, 410926, 412153, 414096, 416714, 419206, 421392, 424009, 427622, 432127, 437421, 443715, 451094, 459437, 468735, 478771, 488609, 497219, 504513, 510922, 516153, 519391, 520684, 521176, 521823, 522719, 523668, 524520, 524921, 524596, 523935, 523481, 522851, 521016, 517648, 513399, 508933, 504532, 500536, 497222, 494259, 491191, 488364, 486517, 485711, 485713, 487073, 490468, 495154, 499602, 503712, 508852, 515485, 522409]
61310E22409O498P175R163J1043J2248J3581J5230J6203J5831J4479J2527R904
61298F66291O786L709Q97j710l892n446o774q343r821j0537j0535j0359j0210
61285F00056j0083j0233j0658j0681r820q560p423n986l773j431J34J123K246
61272E24911L277L450K827K175J784J502J489J952K514K893L712N637Q091R876
61258E76090J0616J0689J0204R083P690O367M867L062J558O69l75k113l589l721
61244F31097l129l120l586l421k578k016j930j548n93L52Q77J016P12J17J3R30
61228F13193K194K983L679M977O332O744O547O879P771Q285Q244Q279Q453Q324
61214G02884Q147Q502Q921Q298O554M648L220K467K861M383N563M990L540L435
$$ y = [522409, 528907, 536082, 545245, 556288, 568536, 582117, 597347, 613550, 629381, 643860, 656387, 666291, 673077, 676786, 677683, 675973, 672081, 666635, 659861, 651518, 641697, 631160, 620625, 610266, 600056, 589973, 579740, 569082, 558401, 548581, 540021, 532598, 526612, 522839, 521408, 521542, 522665, 524911, 528188, 531638, 534465, 536640, 538424, 539926, 541415, 543367, 545881, 548774, 552486, 558123, 566214, 576090, 586706, 597395, 607599, 616682, 624372, 630739, 635606, 638668, 640226, 640895, 640520, 638407, 634818, 631097, 627968, 624848, 621262, 617841, 615263, 613247, 611317, 609769, 609176, 609528, 610405, 611421, 612133, 612250, 612263, 613193, 615387, 618370, 622049, 627026, 633358, 640102, 646649, 653528, 661299, 669584, 677828, 686107, 694560, 702884, 711031, 719533, 728454, 736752, 743306, 747954, 751174, 753641, 756502, 760885, 766448, 771438, 774978, 778413]
61200G78413N310P936J0519J3287J5943J7609J8523J9865K1473K1587J9290J5683
61188I65438J2174R116O543M685L293J734J45p85j290k370m005n102n403n835
61174I78338o665p010o611o442o959p296o886o334o114n778n153m910n237n239
61160H91704m337l006j556M97L176N596P458R709J2923J6307J9157K1903K4810
61147A004341K6875K7113K5934K4263K2257J9857J7792J6946J7367J8541K0065
61136A241351K1469K2171K2208K2204K2202K1408J9593J7635J6077J4276J1697
61125A452291Q992O936N300L635K206J302M88m76q50p2J066J348P29Kn25j132
61109A481240j826k322k638l087l873n076o729q610j0479j2693j5926k0024k3897
$$ y = [778413, 783723, 791659, 802178, 815465, 831408, 849017, 867540, 887405, 908878, 930465, 949755, 965438, 977612, 986728, 993271, 997956, 1001249, 1002983, 1003128, 1002343, 1001053, 998683, 994678, 989576, 984173, 978338, 971673, 964663, 958052, 951610, 944651, 937355, 930469, 924135, 918021, 912243, 907090, 902180, 896943, 891704, 887367, 884361, 882805, 883302, 886478, 892074, 899532, 909241, 922164, 938471, 957628, 979531, 1004341, 1031216, 1058329, 1084263, 1108526, 1130783, 1150640, 1168432, 1185378, 1202745, 1221286, 1241351, 1262820, 1284991, 1307199, 1329403, 1351605, 1373013, 1392606, 1410241, 1426318, 1440594, 1452291, 1461283, 1468219, 1473519, 1477154, 1479360, 1480662, 1481150, 1480674, 1479824, 1479752, 1480818, 1482166, 1482895, 1482897, 1482372, 1481240, 1479414, 1477092, 1474454, 1471367, 1467494, 1462418, 1455689, 1447079, 1436600, 1423907, 1407981, 1387957, 1364060]
61096A364060k6850k9129l0896l1745l1782l2046l3005l3654l2946l1307k9826
61085A020874k8614k6982k4735k2387k0393j8850j7648j6459j4931j3222j1895
61074H04758j1095j0440r807r403q941p799o181m999m345l443k304j926k286j967
61060G19822n76L53J7K8J860M336N533N762O579P981Q817R268J0579J2770J4625
61045H07754J5780J6931J8164J8872J9229K0035K1184K1867K2144K2777K3691
61034A028428K4222K4614K5583K6722K7216K7758K9756L2801L5162L6536L7891
61023A356689L8763L7630L5314L4998L8213M3679N0808O0863P3329Q4704R3002
61012A947992J00281J08766J18257J30113J49697J81064K22993K74583L40448
$$ y = [1364060, 1337210, 1308081, 1277185, 1245440, 1213658, 1181612, 1148607, 1114953, 1082007, 1050700, 1020874, 992260, 965278, 940543, 918156, 897763, 878913, 861265, 844806, 829875, 816653, 804758, 793663, 783223, 773416, 764013, 755072, 747273, 741092, 736093, 731748, 728305, 726001, 724075, 721789, 719822, 719246, 719599, 719616, 719644, 721504, 725840, 731373, 737135, 743714, 751695, 760512, 769780, 780359, 793129, 807754, 823534, 840465, 858629, 877501, 896730, 916765, 937949, 959816, 981960, 1004737, 1028428, 1052650, 1077264, 1102847, 1129569, 1156785, 1184543, 1214299, 1247100, 1282262, 1318798, 1356689, 1395452, 1433082, 1468396, 1503394, 1541607, 1585286, 1636094, 1696957, 1770286, 1854990, 1947992, 2048273, 2157039, 2275296, 2405409, 2555106, 2736170, 2959163, 3233746, 3574194]
61003C574194M24726N25028O40684P82687R65168J193250J475926J840331K286120
60994A3708114K694179K817108K439048J588139N69788k43676o57043o90570m36261
60985B1788826L4403N96955R91548R26525L10237o43651j566056k184438k440636
60976A7813713k421529k237572j969872j677171j401714j162092r57636p84700
60968E201427o42860n28616m34101l54527k90660k42541k06061j77138j54637
60959B170286j37497j22916j09105r6689q5952p5491o4791n5221m7289l9698l2416
60948A303221k7892k7491k9195l0463l1183l2093l2487l1493k9887k8807k7998
60937I74232k6884k5899k5317k4271k2378k0791k0289j9812j8377j6826j6091
$$ y = [3574194, 3998920, 4523948, 5164632, 5947319, 6912487, 8105737, 9581663, 11421994, 13708114, 16402293, 19219401, 21658449, 23246588, 23816376, 23572700, 22915657, 22225087, 21788826, 21823229, 22420184, 23411732, 24338257, 24648494, 24004843, 22438787, 20254349, 17813713, 15392184, 13154612, 11184740, 9507569, 8105855, 6943763, 5986127, 5201427, 4558567, 4029951, 3595850, 3241323, 2950663, 2708122, 2502061, 2324923, 2170286, 2032789, 1909873, 1800768, 1704079, 1618127, 1542636, 1477845, 1422624, 1375335, 1335637, 1303221, 1275329, 1247838, 1218643, 1188180, 1156997, 1124904, 1092417, 1060924, 1031037, 1002230, 974232, 947348, 921449, 896132, 871861, 849483, 828692, 808403, 788591, 770214, 753388, 737297]
60926G37297j5378j3828j2346j1953j1791j0753r644r707j0261r966r181q960
60914F03529q779p548n877n035m604l431k104j997k537k009o17k40j250k058j858
60899E53585j536j686j788j685k003k876l789m697n711n980m623k586j636j743
60885E11246j401m39j82q85j209o11j30l45n30l33m46j028j271r75r30j262j030
60868D98239J4Q95J076J167J530J702J646K090L174M134M651N072N120L900J532
60853E35942p78k391l535l914k865j073k25o61j200j559k820n079o795p202p403
60838D88442q260r110r421r792j0390j0226q981p788p218o250m312k626k313k635
60824C89120k388j577o81L38J205R70l19j003m5J355J600Q56K03j24m15m34J11
$$ y = [737297, 721919, 708091, 695745, 683792, 672001, 661248, 651604, 641897, 631636, 621670, 612489, 603529, 594750, 587202, 581325, 576290, 571686, 568255, 566151, 564154, 561617, 559608, 558991, 558751, 557501, 555443, 553585, 552049, 550363, 548575, 546890, 544887, 542011, 538222, 533525, 527814, 521834, 517211, 514625, 512989, 511246, 509845, 509406, 509224, 508339, 507130, 506519, 506389, 506044, 505514, 505181, 504735, 503707, 502436, 501461, 500531, 499269, 498239, 498253, 499148, 500224, 501391, 502921, 504623, 506269, 508359, 511533, 515667, 520318, 525390, 530510, 534410, 535942, 535164, 532773, 529238, 525324, 522459, 521386, 521161, 520500, 519300, 517741, 514921, 509842, 503047, 495845, 488442, 480182, 471072, 461651, 451859, 441469, 431243, 422262, 414474, 407256, 401006, 396694, 394068, 391755, 389120, 386732, 385155, 384474, 384812, 386017, 386987, 386668, 385665, 385620, 386975, 388575, 389431, 389634, 389510, 389095, 388661, 388772]
60807C88772P85J123J273J329J022P25J415K932L574K398N82l77n51p12r68j337
60791D01985k366l955m691l636j815q78j122j771k295k554k516k604l372m289
60777C64121l983k300p97n61r13j013j170j666j866j440j105j128o52N61J318
60762C47406J000O75J054J133K73j40J112K837L177K332J719J583J264Q81J016
60747C67322J468J846K594L991N044M735L522K331J102m02j411j301q75j125j639
60732C87202j591j221r83l97P80J430P17k94k85J73j62r35r80m51k97m28k15p8
60714C81985q41k108k863l103l350l361k766k221k433k852k766k656l020l056
60700C44589k149j407j856k381j524j52o5r60j186o38m57n51N0R08P51K7L30J558
$$ y = [388772, 389557, 390680, 391953, 393282, 394304, 395029, 396444, 399376, 402950, 405348, 405930, 405553, 405002, 404290, 403322, 401985, 399619, 395664, 390973, 387337, 385522, 384644, 383522, 381751, 379456, 376902, 374386, 371782, 368410, 364121, 360138, 357838, 357041, 356480, 355567, 354554, 353384, 351718, 349852, 348412, 347307, 346179, 345527, 346088, 347406, 348406, 349081, 350135, 351268, 351541, 351401, 352513, 355350, 358527, 360859, 362578, 364161, 365425, 366306, 367322, 368790, 370636, 373230, 377221, 382265, 387000, 390522, 392853, 393955, 393553, 392142, 390841, 389966, 388841, 387202, 385611, 384390, 383407, 383010, 383790, 385220, 385937, 385643, 385358, 385531, 385369, 384434, 383454, 383003, 382706, 382278, 382063, 381985, 381144, 379036, 376173, 373070, 369720, 366359, 363593, 361372, 358939, 356087, 353321, 350665, 347645, 344589, 342440, 341033, 339177, 336796, 335272, 335120, 335055, 334095, 332909, 332271, 331814, 331263, 331313, 332221, 332972, 332999, 333329, 334887]
60682C34887K041J455J246K062L017L632M316M809M254L063K688L230L245K105
60668C76050P04m25j778l299l994l556k788k111j156r4K94R6K22P47Q65O73J204
60651C61654K462L170K874K599K989L399L344L218K987J696q82l420m602m552
60637C76936m136l784l532l381l148k640k133k002j907j139K25J384J858J697
60623C54298R20k52r73n89L16P82Q64J135J361R73L70L03M13j29r26q44N6P08
60605C58786Q57J063J199N92m03o83j55L59P77J664K585K385J147K51L04O19P81
60588C72128J095J468J414J269J816K727K875K159J430Q55Q5l08N48J924K263
60573C93748J779K084L271L810L566M332O691Q822R381R411J0192J1222J1506
$$ y = [334887, 336928, 338383, 339629, 341691, 344708, 348340, 352656, 357465, 361719, 364782, 367470, 370700, 373945, 376050, 376754, 376329, 374551, 371252, 367258, 363702, 360914, 358803, 357647, 357553, 357847, 357943, 358165, 358912, 359777, 360450, 361654, 364116, 367286, 370160, 372759, 375748, 379147, 382491, 385709, 388696, 390392, 389510, 386090, 381488, 376936, 372800, 369016, 365484, 362103, 358955, 356315, 354182, 352180, 350273, 349134, 349359, 350743, 352601, 354298, 355218, 354966, 353993, 353404, 353720, 354502, 355366, 356501, 357862, 358835, 359205, 359508, 359921, 359792, 358866, 358022, 358078, 358786, 359643, 360706, 361905, 362497, 362094, 361411, 361256, 361615, 362392, 364056, 366641, 369026, 370173, 370424, 370728, 371347, 372128, 373223, 374691, 376105, 377374, 379190, 381917, 384792, 386951, 388381, 389236, 389321, 389013, 389561, 391485, 393748, 395527, 397611, 400882, 404692, 408258, 412590, 419281, 428103, 437484, 446895, 457087, 468309, 479815]
60560D79815J1088J0073P742L958J22k438l956n132n791n598m991m353l227j295
60546D76017O96J854K334K855L701M721N784O808P852R331J1611J4428J7389K0623
60532E86004K4013K6242K5942K3468K0195J6359J1225N150l56m697q535j1945
60520G13065j3998j4496j4430j4312j3634j2309j1026r876q163n957m247l253
60508E87364k086m28J098K459M468P206R796J2118J5153J9357K4241K9633L5603
60495G45982M1087M4623M6612M8710N0700N0308M6669M1650L6943L2074K6168
60484A211526J9455J1911K514q855k0591l1448m1667n0963n7474n9994n9543n7453
60472H57418n3639m8060m2135l7212l2963k8639k4612k1462j8827j6314j4347
$$ y = [479815, 490903, 500976, 508718, 512676, 512798, 510360, 506404, 501272, 495481, 489883, 484892, 480539, 477312, 476017, 476713, 478567, 480901, 483756, 487457, 492178, 497962, 504770, 512622, 521953, 533564, 547992, 565381, 586004, 610017, 636259, 662201, 685669, 705864, 722223, 733448, 738598, 738242, 733545, 725010, 713065, 699067, 684571, 670141, 655829, 642195, 629886, 618860, 608984, 600821, 594864, 590617, 587364, 585278, 584850, 585948, 588407, 592875, 600081, 609877, 621995, 637148, 656505, 680746, 710379, 745982, 787069, 831692, 878304, 927014, 977714, 1028022, 1074691, 1116341, 1153284, 1185358, 1211526, 1230981, 1242892, 1245406, 1236551, 1215960, 1184512, 1142845, 1091882, 1034408, 974414, 914871, 857418, 803779, 755719, 713584, 676372, 643409, 614770, 590158, 568696, 549869, 533555, 519208]
60461E19208j3060j1648r767q240p519o851n816n220n477n721n417n254n453m949
60447D18816l338k009k018k469k262j934k319k875k730k101j389k08J491K601
60433C97256K355J346R0j809l997m717l295j603j409j792r56Q34J984K134K099
60418C88520K159K091K096K318K195J551J341K111K798K439J913K461L477L398
60404D20868K065O69ol1M58J233J771J890K052K374K247J536J024J023Q12J90
60388D40175J02R37J674J690J771K420K819K587K700L488L608K466J663K351L161
60373D73612K606J735K142L024K665J477J170J854K295K238K279K146J200L1k71
60358E00203J26N38J379L262N290O194O370O875P244O301M539L516L269K416N71
$$ y = [519208, 506148, 494500, 484733, 476493, 468974, 462123, 456307, 451087, 445610, 439889, 434472, 429218, 423765, 418816, 415478, 413469, 411451, 408982, 406720, 404786, 402467, 399592, 396862, 394761, 393372, 393164, 394655, 397256, 399611, 400957, 401047, 399238, 395241, 390524, 387229, 385626, 384217, 382425, 381469, 382303, 384287, 386421, 388520, 390679, 392770, 394866, 397184, 399379, 400930, 402271, 404382, 407180, 409619, 411532, 413993, 417470, 420868, 422933, 423602, 423596, 423565, 424023, 425256, 427027, 428917, 430969, 433343, 435590, 437126, 438150, 439173, 439985, 440175, 440277, 441214, 442888, 444578, 446349, 448769, 451588, 454175, 456875, 460363, 463971, 466437, 468100, 470451, 473612, 476218, 477953, 480095, 483119, 485784, 487261, 488431, 490285, 492580, 494818, 497097, 499243, 500443, 500474, 500203, 500329, 500867, 502246, 505508, 510798, 516992, 523362, 530237, 537481, 543782, 548321, 551837, 555106, 557522, 558093]
60343E58093j164k123k731l337l715l706l301k397j372j188j985k423j619o73
60329E26359r01j727j918j842k644m005m596m143l370k449j168l3M17Q59K172
60314E01011L849M833N316O144P132P518P379P137O388M825L592M120O178Q477
60300E83899J0311J1321J0713Q340N478K835r38o794j2617j5316j4709j3039j1432
60287E58052r305o739m798l626k392j217j152k258l451m145m528m476l821l307
60273E02837l745m582m808m588m569m353l340k222j840j548n64R5p59j971j634
60258D62409k16L43J0L30J353J706J412J802K699K510J275Q53J748K320J641P28
60242D82923M48L49Q8n2l86j544k740k396p87J36j76j94Q59J839J975K150K971
$$ y = [558093, 556929, 554806, 552075, 548738, 545023, 541317, 538016, 535619, 534247, 533059, 531074, 528651, 527032, 526359, 525458, 523731, 521813, 519971, 517327, 513322, 508726, 504583, 501213, 498764, 497596, 497563, 497980, 498839, 501011, 504860, 509693, 515009, 521153, 528285, 535803, 543182, 550319, 556707, 561532, 565124, 569244, 575422, 583899, 594210, 605531, 616244, 624584, 630062, 632897, 631959, 625165, 612548, 597232, 582523, 569484, 558052, 548747, 542008, 537210, 533584, 531192, 529975, 528823, 526565, 523114, 518969, 514441, 509965, 506144, 502837, 499092, 494510, 489702, 485114, 480545, 476192, 472852, 470630, 468790, 467242, 466678, 466773, 466014, 464043, 462409, 462193, 462536, 462546, 462876, 464229, 465935, 467347, 469149, 471848, 474358, 475633, 476486, 478234, 480554, 482195, 482923, 483371, 483720, 483808, 483756, 483370, 481826, 479086, 476690, 475903, 476039, 475863, 475669, 476528, 478367, 480342, 482492, 485463]
60225D85463L591L358K988L208L699M144M944O149O942O865O478O444O894P819
60211E58986R001R593Q956P825P432P768P888P590P283O755N645M739M951N469
60197F59881M801L222K176J631K31k099m027n154o279p327p288o335n780n847
60183F21806n596n116n471o440o635n981n636n361l700j139k54j850l554l299
60169E61774j880r08n15k48l77j024j526j575j601j539p97K17L85PN78K041K550
60152E55562J542O98J018J292N98N5P96K083K839L348M137M764M904N293O457
60137E95386P823Q955J0276J1768J2458J2062J1631J1739J1440R921P744N666
60125G16869L586J461j27r91j630j957j251J32O38k09j057r72p57j244j910k081
$$ y = [485463, 489054, 492412, 495400, 498608, 502307, 506451, 511395, 517544, 524486, 531351, 537829, 544273, 551167, 558986, 567987, 577580, 586536, 594361, 601793, 609561, 617449, 625039, 632322, 639077, 644722, 649461, 654412, 659881, 664682, 667904, 670080, 671711, 671942, 669843, 665816, 660662, 654383, 647056, 639768, 633433, 627653, 621806, 616210, 611094, 605623, 599183, 592548, 586567, 580931, 575570, 571870, 570731, 570477, 568627, 565073, 561774, 559894, 558986, 558471, 558223, 557846, 556822, 555296, 553721, 552120, 550581, 549784, 550001, 550386, 550393, 550971, 553012, 555562, 557104, 557802, 558820, 560112, 560710, 560765, 561561, 563644, 566483, 569831, 573968, 578732, 583636, 588929, 595386, 603209, 612164, 622440, 634208, 646666, 658728, 670359, 682098, 693538, 703459, 711203, 716869, 720455, 721916, 721789, 720798, 719168, 717211, 715960, 716092, 716730, 716521, 715464, 714492, 713735, 712491, 710581, 708500]
60109G08500k098k419k828l243m015m925n279n317o063p383p862p041o047n491
60095F38489m650l229k125j719j227l11L78P75J648K761K833J899J602K449L007
60080F42580K629K629L727M579M092L060K169M18k961o743r347j0701j1322j1118
60066F13691j0287r836j0041r770q385o782n781n089m583m752n108m124j789j03
60052E27261p8l03M63J454J901K610M051N032M872M904O198P620P821P324P046
60037E88176O544N350M299L875K934P32j397k092k067k661l881n389p624j0326
60023E76473j1754j1187j0447j1142j2059j1333r481q180p461o352n093m577m492
60010D62915l950l073k379j554l62K98k18r25p58k21j32L0R31J810J711J195J262
$$ y = [708500, 706402, 703983, 701155, 697912, 693897, 688972, 683693, 678376, 672313, 664930, 657068, 650027, 643980, 638489, 633839, 630610, 628485, 626766, 625539, 625228, 625606, 626381, 628029, 630790, 633623, 635522, 637124, 639573, 642580, 645209, 647838, 651565, 656144, 660236, 663296, 665465, 665883, 662922, 656179, 646832, 636131, 624809, 613691, 603404, 593568, 583527, 573757, 565372, 558590, 552809, 547720, 543137, 538385, 533277, 529153, 527364, 527261, 527183, 526880, 527343, 528797, 530698, 533308, 537359, 542391, 547263, 552167, 558365, 565985, 573806, 581130, 588176, 594720, 600070, 604369, 608244, 611178, 611910, 610513, 608421, 606354, 603693, 599812, 594423, 586799, 576473, 564719, 553532, 543085, 531943, 519884, 508551, 499070, 490890, 483429, 477077, 471984, 467407, 462915, 458965, 455892, 453513, 451959, 451597, 451895, 451677, 450752, 449994, 449773, 449641, 449671, 450602, 452412, 454123, 455318, 456580]
59993D56580J799K362L279M558N085M366L687M103M704M305L382K758J948M10
59979E03326j052j724k315l345l819l038k088j911j645o13P3k73j08J779L904
59964D87151M585M852O300P952Q098P644Q572J0292J0456Q522N765K655j012m183
59950E67649n479n474n653n819m963l828l932m700m321k952k461l161l488k740
59936E08678j801j060J35J902L607N189O970Q326Q170O541M201J292k090m721
59922E45339n486n147n167n480n110m124l104j594R64L600N114O110P729R346
59908E42990R714R400R689R949Q639O202M405L339J699l65j380j345j885l513
59894E97538m999n456n056l832j824j44J30j12Q00K596L679L940M664N924O481
$$ y = [456580, 458379, 460741, 464020, 468578, 473663, 478029, 481716, 485819, 490523, 494828, 498210, 500968, 502916, 503326, 502274, 500550, 498235, 494890, 491071, 488033, 485945, 484034, 482389, 481776, 481849, 481576, 481468, 483247, 487151, 491736, 496588, 502888, 510840, 518938, 526582, 535154, 545446, 555902, 564424, 570189, 572844, 571832, 567649, 562170, 556696, 551043, 545224, 540261, 536433, 532501, 527801, 523480, 520528, 518067, 514906, 511418, 508678, 506877, 505817, 505952, 507854, 511461, 516650, 523620, 531946, 540116, 546657, 550858, 552150, 550060, 545339, 539853, 534706, 529539, 524059, 518949, 514825, 511721, 510127, 511091, 514691, 519805, 525915, 533644, 542990, 552704, 562104, 571793, 581742, 590381, 596583, 600988, 604327, 606026, 605661, 604281, 602936, 601051, 597538, 592539, 587083, 582027, 578195, 576371, 576227, 576357, 576245, 577045, 579641, 583320, 587260, 591924, 597848, 604329]
59879F04329O255O505P456P889P314O594O227N735M869L809K333L79r93q07R0
59864F67984J98l85p20j187k771m832n910o150o648p004n977m106l135l133k658
59849F13566j417j95J562N181R736J2286J1499Q666N086R82k708m164k912k51
59835F56917K912O584R838J0834R197O508M113K163P51q6j450m533q305j0470
59821F84973j0620j0340j0237r380p730o545n969m760k909k127l067m327m874
59808F02088n235n676n349m086l088k938k730j917j359j796k679l227l341l141
59794E55526k705k421k467k161j068j50l22o47J60J243R51j54j17J051J633J431
59778E49783J820K681K389J074Q55K298L464L150K415K221K099J890K334L225
$$ y = [604329, 610584, 617089, 624545, 632434, 639748, 646342, 652569, 658304, 663173, 666982, 669315, 669694, 668701, 667894, 667984, 668182, 667797, 667077, 665890, 663119, 658287, 652377, 646227, 639579, 632575, 626598, 622492, 619357, 616224, 613566, 612149, 611954, 613516, 618697, 628433, 640719, 652218, 660884, 665970, 666952, 664244, 660080, 657168, 656917, 659829, 666413, 676251, 687085, 696282, 702790, 706903, 709066, 709817, 709731, 708281, 703748, 695443, 684973, 674353, 664013, 653776, 644396, 636666, 630121, 624152, 619392, 616483, 614356, 611289, 606962, 602088, 596853, 591177, 585828, 581742, 578654, 575716, 572986, 571069, 569710, 567914, 565235, 562008, 558667, 555526, 552821, 550400, 547933, 545772, 544704, 544554, 544232, 543585, 543745, 544988, 545939, 545785, 545668, 546719, 548352, 549783, 551603, 554284, 556673, 557747, 558602, 560900, 564364, 567514, 569929, 572150, 574249, 576139, 578473, 581698]
59764E81698L290K543K466L392M031M041M584N821O469O360O920Q419R413R582
59750F59029J0421J2286J3498J3257J2829J2876J2300J0827J0024J0427J0243
59739G88017Q245N630L607J503j315l844n163n821o259n878m745m136m342m039
59725G61460k901k492l451m142l445k622k962l785m223m774n593n366l576j915
59711G10213j839k446k356j816j496r59O9N84Pn50p5Q34J398J966K694K776K217
59694G11221K526M232N466M455J917l89j817k348j631L6J311J586J724K073J573
59679G31935j20j537j755j908l073m446n018n243n582n266l979l069l492m147
59665F83300l698k544j648r61l46l90j023r40L34J433J403J166J575J895J546
$$ y = [581698, 584988, 587531, 589997, 593389, 597420, 601461, 606045, 611866, 618335, 624695, 631615, 640034, 649447, 659029, 669450, 681736, 695234, 708491, 721320, 734196, 746496, 757323, 767347, 777774, 788017, 796262, 801892, 805499, 807002, 805687, 801843, 796680, 790859, 784600, 778722, 773977, 769841, 765499, 761460, 758559, 756067, 752616, 748474, 745029, 742407, 739445, 735660, 731437, 726663, 721070, 715704, 712128, 710213, 708374, 705928, 703572, 701756, 700260, 699301, 699370, 699954, 699961, 699411, 699336, 700170, 701568, 703534, 706228, 709004, 711221, 713747, 717979, 723445, 727900, 729817, 729428, 727611, 725263, 723632, 723668, 724979, 726565, 728289, 730362, 731935, 731815, 730278, 728523, 726615, 723542, 719096, 714078, 708835, 703253, 697987, 694008, 690939, 687447, 683300, 679602, 677058, 675410, 674449, 674103, 673713, 672690, 671750, 672084, 673517, 674920, 676086, 677661, 679556, 681102]
59650F81102J392J929K054J041j99j199l138o393r048r637r319r518r461q076
59636F21530o362n660n247l886k291j841k205k266k231k874l859m623n597o923
59622E65665p319o018m438m163m648m683m600n157n606m935l747l017k276q12
59608E04246O08J144J616K894L897L281J894J444J786J649J074J075J615J884
59594E30107J873K056K192J992K028K505K244M51j567k068j260m66n4K29K2q65
59578E39419j505j240r63j534k153j787j017q74j088j027j096j600j587m46O54
59563E22156N81K1o4k30j039j473p62j16o11j018NJ263R60j66k83M45P63J097
59545E21529K551M217M469M140N448Q387J1272J4481K0157K7471L1242K6791J4838
$$ y = [681102, 682494, 684423, 686477, 687518, 687319, 686120, 682982, 676589, 667541, 657904, 648585, 639067, 629606, 621530, 615168, 609508, 604261, 600375, 598084, 596243, 594038, 591772, 589541, 586667, 582808, 578185, 572588, 565665, 558346, 552328, 547890, 543727, 539079, 534396, 529796, 524639, 519033, 514098, 510351, 507334, 505058, 504246, 504854, 505998, 507614, 510508, 514405, 517686, 519580, 521024, 522810, 524459, 525533, 526608, 528223, 530107, 531980, 534036, 536228, 538220, 540248, 542753, 544997, 545448, 543881, 541813, 540553, 540087, 540033, 540262, 540284, 539419, 537914, 536674, 535711, 534177, 532024, 530237, 529220, 528346, 527258, 526231, 525135, 523535, 521948, 521502, 522156, 522737, 522758, 522694, 522464, 521425, 519952, 519190, 519074, 518463, 517445, 517450, 518713, 519673, 519507, 519224, 519669, 520432, 521529, 524080, 528297, 532766, 536906, 542354, 550741, 562013, 576494, 596651, 624122, 655364, 682155, 696993]
59532F96993P05j0134j5303j5725j3690j0668o913k750R21L719O052P675P460
59519F48342N399L193J777k7l168o451q431r491j0387j0507r407q405q648r040
59505E74749q079o350n266m707l895l191l025k441p73O49N00j93J65J071J219
59490E40433J030J535K077J509N40N30J076J047P94J185J682J586J805L151M352
59475E64332M170L884N083O531O093M322L244K895K026R76P99P14m42j371j84
59460F03072K025K813K624L811O265P650P574P815Q693Q731P943P942Q628Q052
59446F93638N884L831K380J84k892n145n907o277o599n920m387l422l100j970
59432F60298L0J137P68M42J151K272L616O010R125J1104J1390J1788J3832J6911
$$ y = [696993, 697698, 687564, 672261, 656536, 642846, 632178, 625265, 622515, 623436, 627155, 633207, 640882, 648342, 653741, 656934, 658711, 658684, 655516, 649065, 640634, 631143, 620756, 610249, 600842, 592437, 583789, 574749, 566670, 560320, 555054, 550347, 546452, 543261, 540236, 537795, 537022, 537671, 538171, 537978, 538143, 539214, 540433, 541463, 542998, 545075, 546584, 547124, 547654, 548730, 549777, 550571, 551756, 553438, 555024, 556829, 559980, 564332, 568502, 572386, 577469, 584000, 590093, 594415, 597659, 600554, 602580, 603556, 604355, 605069, 604627, 603256, 603072, 605097, 607910, 610534, 614345, 620610, 628260, 635834, 643649, 652342, 661073, 669016, 676958, 685586, 693638, 699522, 703353, 705733, 705917, 703025, 697880, 691973, 685696, 679097, 673177, 668790, 665368, 662268, 660298, 660328, 661465, 662233, 662675, 663826, 666098, 669714, 675724, 684849, 695953, 707343, 719131, 732963, 749874]
59418G49874J9746K2003K3652K4498K5301K8018L3576L9633M1078L3283J6165
59407A056827m234j9432k5189k4001k0601j6822j1812m785M289J4270K0736J7254
59395I86500K465j5967k8329l2420l2753l2246k9718k4778j9844j6409j3431j0344
59383G32726q196p006n311l101k058k243j627L37J744J556J025J069R68N25P96
59368G11204J859K361K025K193L250L902L690L767M620N251N262N490O136O392
59354G67402O324P041Q669J0224J1542J3215J4706J4909J4463J5028J6376J6766
59342I16665J5922J4961J3571J0284N547J445j714n513j0074j3752j6323j9176
59330I11843k1934k2341k0177j8092j7651j7551j6551j5240j4118j2700j1230
$$ y = [749874, 769620, 791623, 815275, 839773, 865074, 893092, 926668, 966301, 1007379, 1040662, 1056827, 1052593, 1033161, 1007972, 983971, 963370, 946548, 934736, 929951, 934240, 948510, 969246, 986500, 988965, 972998, 944669, 912249, 879496, 847250, 817532, 792754, 772910, 756501, 743070, 732726, 724530, 717524, 712213, 709112, 707054, 704811, 703184, 703521, 705265, 706821, 707846, 708915, 709883, 710408, 711204, 713063, 715424, 717449, 719642, 722892, 726794, 730484, 734251, 738871, 744122, 749384, 754874, 761010, 767402, 773726, 780767, 789436, 799660, 811202, 824417, 839123, 854032, 868495, 883523, 899899, 916665, 932587, 947548, 961119, 971403, 976950, 978395, 976681, 971168, 961094, 947342, 931019, 911843, 889909, 867568, 847391, 829299, 811648, 794097, 777546, 762306, 748188, 735488, 724258]
59319G24258j0577r995p841m884l774m791n453m837m740n741n783l975k252j770
59305F47845q99J513L982N238O412Q704J1432J4050J7424K1250K2417J8035Q673
59292G86076k460j2007j7624j8805j7488j6009j4275j0853o567l941l084j487
59280F61476J605M128N275O914R756J1730J1833J2219J4564J7265J8277J8063
59268G93105J7890J7510J6382J5053J3800J1768Q685N560K848l3k800m353n080
59255H90335o495q256q556p838q624j0964j1847j0126q370q344q482p469o652
59242G78312o871o321l826j226l58m08k14l87j327j840j517j796l106l808l487
59227G41820m095o271p725p180o567p379q125p503o833p078o654m636k971l111
$$ y = [724258, 713681, 703686, 695845, 690961, 687187, 682396, 676943, 672106, 667366, 661625, 655842, 651867, 649615, 647845, 646946, 648459, 652441, 657679, 664091, 672795, 684227, 698277, 715701, 736951, 759368, 777403, 786076, 783616, 771609, 753985, 735180, 717692, 701683, 687408, 676555, 669988, 666047, 662963, 661476, 663081, 667209, 672484, 679398, 689154, 700884, 712717, 724936, 739500, 756765, 775042, 793105, 810995, 828505, 844887, 859940, 873740, 885508, 894193, 899753, 902601, 902568, 899768, 895415, 890335, 883840, 875584, 867028, 859190, 850566, 839602, 827755, 817629, 809259, 800915, 792433, 784964, 778312, 771441, 765120, 761294, 760068, 759710, 759302, 759088, 758701, 757374, 755534, 754017, 752221, 749115, 745307, 741820, 737725, 731454, 723729, 716549, 709982, 702603, 694478, 686975, 680142, 673064, 666410, 661774, 658803, 655692]
59213F55692l434k453j547k038k547j880j583k937m282m086l777m763n496m463
59199F10406l377m195n533n192m001l883m267l550k246j686j287M5J438J625J354
59184E75651J840K476K417K536L625M549M337M045M446M168K370Q40J012J362
59170F15674L12p05J68J847K402K383L176M027L527K295J527O59j066k624l190
59155F30412m066o241q123q199p703q136q384p073n478n325n663m849l617l440
59141E44115l757l526l519m509n185m462l673l880l479j200J024J173O92J777
59127E11591L472L822L604M474N478M949M015M688O180O542O357P376Q992R396
59113E90936Q905R039R588R500R190R288Q698O661M858M743M793L207J209N87
$$ y = [655692, 652258, 649805, 648258, 646220, 643673, 641793, 640210, 637273, 632991, 628905, 625128, 620365, 614869, 610406, 607029, 602834, 597301, 592109, 588108, 584225, 579958, 576408, 574162, 572476, 571189, 571234, 572672, 574297, 575651, 577491, 579967, 582384, 584920, 588545, 593094, 597431, 601476, 605922, 610090, 612460, 613300, 614312, 615674, 615986, 615281, 615449, 617296, 619698, 622081, 625257, 629284, 632811, 635106, 636633, 637292, 636226, 633602, 630412, 626346, 620105, 611982, 603783, 596080, 587944, 579560, 572487, 567009, 561684, 556021, 551172, 547555, 544115, 540358, 536832, 533313, 528804, 523619, 519157, 515484, 511604, 508125, 506925, 507949, 509122, 509814, 511591, 515063, 518885, 522489, 526963, 532441, 537390, 541405, 546093, 552273, 558815, 565172, 572548, 581540, 590936, 599841, 608880, 618468, 627968, 637158, 646446, 655144, 661805, 666663, 671406, 676199, 679406, 680615, 681202]
59099F81202K14j712m050m760m580n252o005n216l736l181k747j083O20P36L87
59084F40837J062J259r02l846n062n357o693q002p185n353m924n255m381l246
59070E82952l907n201m569k717k155k579k001j035j565k572j731L2K7j321j466
59055E50192m68k59m59N88J705N21j767j959l20K45l87J47J608J388m03r26L37
59038E49783J096P86J138K207K182J300J705L361M234M474O236R275J1054J1393
59024F10224J2913J6405J9683K1362K2038K1537J8689J4107R725N584L77n112
59012G67532q749j0754j3014j5120j4959j2835j1082r911p559m229j904n57J436
58999F58295L559L863L002L377M643M387K858K571L468L079J412R77J797J133
$$ y = [681202, 681416, 679704, 675654, 670894, 666314, 661062, 655057, 649841, 646105, 642924, 640177, 639094, 639714, 640450, 640837, 641899, 643158, 642256, 638410, 633348, 627991, 621298, 613296, 606111, 600758, 595834, 590579, 586198, 582952, 579045, 573844, 569275, 566558, 564403, 561824, 559823, 558788, 557223, 554651, 552920, 552952, 552979, 551658, 550192, 549724, 549465, 549006, 549594, 551299, 551820, 550053, 548094, 547774, 548019, 547632, 547779, 549387, 550775, 550372, 549446, 549783, 550879, 551665, 552803, 555010, 557192, 558492, 560197, 563558, 567792, 572266, 578502, 587777, 598831, 610224, 623137, 639542, 659225, 680587, 702625, 724162, 742851, 756958, 766683, 772267, 772644, 767532, 758783, 748029, 735015, 719895, 704936, 692101, 681019, 671108, 663549, 659320, 657416, 656859, 658295, 661854, 665717, 668719, 672096, 676739, 681126, 683984, 686555, 690023, 693102, 694514, 695491, 697288, 698421]
58985F98421j432l119k735k028j706l47K151L996M947O531Q609R487R528J0717
58971G43020J2661J3134J2409J2835J4149J3728J1529J0239J0365R714P962P082
58959H78827P007N510K684P95o02m413j0316j4319j4878j4670j5464j5982j5766
58946G88413j6366j7545j6906j4396j2737j2423j0887p548n002m096k566K83K218
58933F70442K596L650N837O609N230M308M980M930K775K97j227k789m511m792
58919F98335l835l939n255n339l811l115l790l568k038j456j940p83K322M334
58905F66122M473N706R179J2143J3048J3750J5012J4837J3002J2251J3172J2934
58893H05629J0952J0614J3310J5924J6560J7597K0488K2585K1909K0416J9654
$$ y = [698421, 696989, 693870, 691135, 689107, 687401, 687054, 689205, 693201, 698148, 704679, 713288, 722775, 732303, 743020, 755681, 768815, 781224, 794059, 808208, 821936, 833465, 843704, 854069, 863783, 871745, 878827, 885834, 891344, 894028, 894823, 894221, 889808, 879492, 865173, 850295, 835625, 820161, 804179, 788413, 772047, 754502, 737596, 723200, 710463, 698040, 687153, 679605, 674603, 670507, 667941, 668224, 670442, 673038, 676688, 682525, 689134, 694364, 698672, 703652, 708582, 711357, 711654, 710427, 707638, 703127, 698335, 694500, 690561, 685306, 679967, 676156, 673041, 669251, 665683, 663645, 662189, 660249, 659466, 661788, 666122, 670595, 676301, 685480, 697623, 710671, 724421, 739433, 754270, 767272, 779523, 792695, 805629, 816581, 827195, 840505, 856429, 872989, 890586, 911074, 933659, 955568, 975984, 995638]
58882I95638J7755J3503R145O370L588l12l580n351p653j1359j4218j4944j5118
58869I73464j5099j2708q062m934n009n443m354l814m980n420m104l959o476q656
58855H80446q387q005r290r782p559n064m577m316k625j704l556o291q013j0314
58841G90963j4360j7455j7219j5577j5114j5025j3906j2906j2919j2233r900p886
58829F26463p075n129j101J940J833Q11J181J862K016L541O775Q328O637N119
58815F53201O320P508N840L319K595K210K12j611j324q08k117l557l263k921m211
58800F61393n274m479l859n200o530o087n778p131p946o607n451o131o126l671
58786E81123j573k000k142N59L476L617K961M213N587M675L429M332N539M532
$$ y = [995638, 1013393, 1026896, 1036041, 1042411, 1045999, 1045687, 1042107, 1036756, 1029103, 1017744, 1003526, 988582, 973464, 958365, 945657, 937595, 932661, 927652, 922209, 917855, 914041, 909061, 903641, 899537, 895578, 889102, 880446, 872059, 864054, 854764, 844982, 837423, 832359, 827782, 823466, 820841, 819137, 815581, 809290, 801277, 790963, 776603, 759148, 741929, 726352, 711238, 696213, 682307, 669401, 656482, 644249, 634349, 626463, 619388, 614259, 613158, 615098, 616931, 617742, 618923, 620785, 622801, 626342, 633117, 641445, 648082, 653201, 659521, 667029, 672869, 676188, 678783, 680993, 681205, 679594, 678270, 677462, 675345, 671788, 668525, 665604, 661393, 656119, 651640, 647781, 642581, 636051, 629964, 624186, 617055, 609109, 602502, 597051, 590920, 584794, 581123, 579550, 577550, 575408, 575967, 579443, 583060, 586021, 590234, 595821, 600496, 603925, 608257, 613796, 618328]
58772F18328K770K125P19l041o388o872o862q671r632p104l913l415l479r57K110
58757E65718K583K462M882P640O864L804K055J192j019l241l199k554l569m174
58743E79444j879Q20O45l27J353L896L782K473L345N098M675L701N446Q182Q080
58728F28734O199O141P272O574M869M804N147L374J542L171O585P777P509R100
58714G08798J1472J1054Q657P795Q023O306L260J638M65l037p467r515j0285j3099
58700G24065j6896j8228j7904j9165k1066k0294j7805j7037j7131j4633j0413
58689E33493q168p538n365k499k558n033o194n795o450p510o101l184k172k587
58675D62339j305J094J537P59J936M311M654L862N543R231J1437J2326J4767J7853
$$ y = [618328, 621098, 623223, 623942, 620901, 614513, 607641, 600779, 592108, 582476, 575372, 571459, 568044, 564565, 563608, 565718, 568301, 570763, 575645, 583285, 590149, 593953, 596008, 597200, 596181, 592940, 589741, 587187, 583618, 579444, 577565, 578385, 579030, 578703, 580056, 583952, 587734, 590207, 593552, 598650, 603325, 607026, 612472, 620654, 628734, 634933, 641074, 648346, 654920, 659789, 664593, 669740, 673114, 674656, 677827, 684412, 692189, 699698, 708798, 720270, 731324, 739981, 747776, 755799, 762105, 765365, 767003, 767468, 764431, 756964, 747449, 737164, 724065, 707169, 688941, 671037, 651872, 630806, 610512, 592707, 575670, 558539, 543906, 533493, 525325, 517787, 512422, 509923, 507365, 502332, 496138, 490343, 483893, 476383, 470282, 467098, 464926, 462339, 461034, 462128, 463665, 464424, 466360, 470671, 475325, 479187, 484730, 493961, 505398, 517724, 532491, 550344]
58661E50344J7910J4909J1595P592R87n747q372q133r550j2260j2162r411p982
58648E29720q167o837m305l705m328k791n7k2j913j479R98J435k0N59K828K440
58632E04356p02k237j465k102m662n574m263l850m498l235n94k41j753j042J935
58617D70073L074K022K753N928P878P653P888Q481O540K984J977L511L630K045
58603E36437K208L852L151M25j11J463P20k634m136k965k899m352l550m37P67
58588E27939j57J307N810Q789Q944R962J2569J2961J0632R757J1207J0930P917
58575F38567O037O461N864L793M109P514J0181J1280J4317J9694K3555K5366K8906
58562H05644L4425L7629L7608L7814L8076L3951K5333J7363J1418L705n777j1665
$$ y = [550344, 568254, 583163, 594758, 602350, 603337, 597590, 589218, 581085, 571535, 559275, 547113, 537702, 529720, 521553, 514716, 510411, 506706, 502378, 499587, 499530, 499508, 497595, 496116, 497114, 498549, 498529, 499088, 501916, 504356, 503654, 501417, 499952, 497850, 493188, 487614, 483351, 479501, 475003, 471768, 471174, 470933, 469180, 468138, 470073, 473147, 475169, 477922, 483850, 491728, 499381, 507269, 515750, 522290, 525274, 527251, 530762, 534392, 536437, 538645, 542497, 545648, 546073, 545962, 547425, 548145, 545511, 541375, 538410, 535511, 531159, 527609, 527172, 527939, 527782, 529089, 534899, 543688, 552632, 562594, 575163, 588124, 598756, 608513, 619720, 630650, 638567, 644604, 651065, 656929, 660722, 664831, 672345, 682526, 693806, 708123, 727817, 751372, 776738, 805644, 840069, 877698, 915306, 953120, 991196, 1025147, 1050480, 1067843, 1079261, 1082966, 1077189, 1065524]
58550A065524j2405j2428j3361j1711p161m372m619m239l213o248j3384j8695
58538I53688k0546k3743k9233l1280k7813k4058k2817k0397j5438j2424j2916
58527G13023j2390r200p752r390r275n822m012n690n889k557o53k514l465j162
58513F33252j43k654m119k204j360l788m871k269o69k621l534o92J450j04j523
58498F04151k22K58j757j826J887M201K253Q02L262N810N416N384P925R546Q652
58483F55742R437J3565J6497J6436J8096K3042K5555K2932K0337K0410J7781R457
58471H69287R76l565q088j5186j9821j8660j6520j7126j6466j1537o669m923k237
58458G29465L729Q095Q297R698J5390J9806J8923J7221J7934J6103Q290k18m963
$$ y = [1065524, 1053119, 1040691, 1027330, 1015619, 1008458, 1004086, 999467, 995228, 992015, 985767, 972383, 953688, 933142, 909399, 880166, 848886, 821073, 797015, 774198, 753801, 738363, 725939, 713023, 700633, 691433, 683681, 674291, 665016, 659194, 655182, 649492, 643603, 641046, 640393, 637879, 634414, 633252, 633109, 630455, 626336, 624132, 622772, 618984, 614113, 611844, 611175, 608554, 605020, 604328, 605778, 605674, 604151, 603929, 604187, 602430, 600604, 602491, 606692, 608945, 609747, 613009, 618819, 624235, 629619, 637544, 647090, 655742, 665179, 678744, 695241, 711677, 729773, 752815, 778370, 801302, 821639, 842049, 859830, 869287, 870263, 866698, 858610, 843424, 823603, 804943, 788423, 771297, 754831, 743294, 736625, 731702, 729465, 733194, 741289, 749586, 759284, 774674, 794480, 813403, 830624, 848558, 864661, 872951, 872733, 867770]
58445H67770r531j6375k0230j7937j5225j6315j6407j1755p473p692p777l979
58433G17074j029k362k723J551M900L267K256O330J0115Q961P892J1168J3260
58420G80660R231M024K373j80p017j1817r926p809j1175j4197j0888o691p947
58407G08641j0033p049l437m749o495l354k8j730l396M86M726L346J075L674O484
58392F88161M017J251L743O267L125r2K908O732M785K197N640J0103Q743O174
58378G53754Q888J2069R172N120O550Q565M698N01L265P781O301L277O081J0451
58364H46473R487P642J1390J5431J2815R140J1845J5175J0924M414M168N538N27
58351I64969n733m586m96j789m268m88M211J759k121J565P623O975M636R596J6406
$$ y = [867770, 858239, 841864, 821634, 803697, 788472, 772157, 755750, 743995, 736522, 728830, 721053, 717074, 716045, 713683, 710960, 712511, 717411, 720678, 722934, 729264, 739379, 748340, 756232, 767400, 780660, 789891, 793915, 796288, 796108, 789091, 777274, 767348, 759539, 748364, 734167, 723279, 716588, 708641, 698608, 691559, 688122, 683373, 676878, 673524, 673496, 671766, 668370, 668856, 673582, 676928, 678003, 681677, 688161, 692178, 693429, 697172, 703439, 706564, 706472, 709380, 716112, 720897, 723094, 728734, 738837, 747580, 753754, 762642, 774711, 783883, 789003, 795553, 804118, 808816, 809317, 812582, 820363, 826664, 829941, 836022, 846473, 855960, 863602, 874992, 890423, 903238, 912378, 924223, 939398, 950322, 954736, 958904, 964442, 964969, 959236, 954650, 954154, 952365, 948097, 947609, 951820, 953579, 951458, 953023, 960646, 967621, 972257, 981853, 998259]
58336I98259J5214J0778J3096J8247J7105J3882J7075K1181J6617Q777P947R611
58324A167789M234k893j697K439r65o474l075L938K926j633J644Q554Q084M473
58310A187344Q194J4141J1486O033R638J6768J5134J0024J3844K1052J8523J1441
58298A343622J3333J9603J7048J0472J3261K0524J8602J2272J5088K1870J8838
58287A524533J1797J5455K4023K1978J4624J7701K6028K3804J6702K1343L2032
58276A750020L1107K3576K7335L7571L6022K7316L0239M0746M0318L3377L8867
58265B116494N1966N2616M4976M9306O1536O1037N1717N4365O4739O1381M8622
58254B718755M8839N8396N5431M4781M9613O4876O6078N7841O5211Q3220Q5509
$$ y = [998259, 1013473, 1024251, 1037347, 1055594, 1072699, 1086581, 1103656, 1124837, 1141454, 1150231, 1158178, 1167789, 1172023, 1169130, 1167433, 1169872, 1168907, 1162433, 1159358, 1163296, 1166222, 1164589, 1166233, 1174787, 1182871, 1187344, 1195538, 1209679, 1221165, 1227198, 1236836, 1253604, 1268738, 1278762, 1292606, 1313658, 1332181, 1343622, 1356955, 1376558, 1393606, 1404078, 1417339, 1437863, 1456465, 1468737, 1483825, 1505695, 1524533, 1536330, 1551785, 1575808, 1597786, 1612410, 1630111, 1656139, 1679943, 1696645, 1717988, 1750020, 1781127, 1804703, 1832038, 1869609, 1905631, 1932947, 1963186, 2003932, 2044250, 2077627, 2116494, 2168460, 2221076, 2266052, 2315358, 2376894, 2437931, 2489648, 2544013, 2608752, 2670133, 2718755, 2767594, 2825990, 2881421, 2926202, 2975815, 3040691, 3106769, 3164610, 3229821, 3313041, 3398550]
58243C398550P6765Q4298J03574J06442R7726J07115J30037J35230J26432J35878
58233D502047J60573J68005J61407J73999K01788K10211K04491K22393K59599
58224F264513K76353K75995K99390L43318L66110L72868M09111M70719N10685
58215I589062N34473N92543O78838P39629P83305Q71271R99132J105580J200907
58206A7094740J358340J575261J782943J997919K310537K719423L149560L643893
58198C5632616M348327N298849O439478P859690R760606J2172989J5011037J8427740
58190A14951332K2766363K8182001L4804996M3105335N2813914O0686631O0537508
58183D17848080M7590889K3508309l765824k5766364l8920436m4684979m5976875
$$ y = [3398550, 3475315, 3559613, 3663187, 3769629, 3867355, 3974470, 4104507, 4239737, 4366169, 4502047, 4662620, 4830625, 4992032, 5166031, 5367819, 5578030, 5782521, 6004914, 6264513, 6540866, 6816861, 7116251, 7459569, 7825679, 8198547, 8607658, 9078377, 9589062, 10123535, 10716078, 11394916, 12134545, 12917850, 13789121, 14788253, 15893833, 17094740, 18453080, 20028341, 21811284, 23809203, 26119740, 28839163, 31988723, 35632616, 39980943, 45279792, 51719270, 59578960, 69339566, 81512555, 96523592, 114951332, 137717695, 165899696, 200704692, 243810027, 296623941, 357310572, 417848080, 465438969, 488947278, 485181454, 459415090, 420494654, 375809675, 329832800]
58176C29832800m4607070m1389361l7023038l2195315k7357576k2821166j8865277
58169A05573997j5590056j2873817j0597776q760149p326728o160757n171002
58162C9093712m375672l766130l249108k771972k375217k075778j815660j564719
58154A7099456j363136j224284j097441r61011q56577p98157p38320o55171n87153
58145H818206n51773n11206m47863l96899l74687l47494k99370k62723k54400
58136E371791k45918k22599k10132k17915k15760j91203j73010j74688j69778
58127C550788j45718j28488j30995j28658j08966r5623j00900j01763q5669p4312
58117B449696p9912q1903o8670n9968o6578o8728n5611m6745n3392n7012m6314
$$ y = [329832800, 285225730, 243836369, 206813331, 174618016, 147260440, 124439274, 105573997, 89983941, 77110124, 66512348, 57752199, 50425471, 44264714, 39093712, 34718040, 30951910, 27702802, 24930830, 22555613, 20479835, 18664175, 17099456, 15736320, 14512036, 13414595, 12453584, 11597007, 10798850, 10060530, 9405359, 8818206, 8266433, 7755227, 7307364, 6910465, 6535778, 6188284, 5888914, 5626191, 5371791, 5125873, 4903274, 4693142, 4475227, 4259467, 4068264, 3895254, 3720566, 3550788, 3405070, 3276582, 3145587, 3016929, 2907963, 2812340, 2711440, 2609677, 2524008, 2449696, 2369784, 2287881, 2219211, 2159243, 2092665, 2023937, 1968326, 1921581, 1868189, 1811177, 1764863]
58106A764863l8706m4994m8590l9446l3807m1056m4760l5590l0000l7509m1710
58095A328695l2377k4940k9595l1835k2212j5433k1273k5431j7695j1192j5583
58084A081129j8502j1474p593j5548k1998j7386j3965k0795k5706j9557j4176
58073H94429j8858k2449j6090j0809j5341j8823j2582p340j1909j5924j0542n622
58061G28140r659j2780o367j35l310p671n201m014j0831j5969j1479o586r703
58048F24435j2594p597l153o937j0517o072j779n492r437o106l291q247j2682
58035E30531q515l248m890o798k210J171m017r968q461o130j0387j4261j0084
58022D42733m713o285q998n599k022n067q228m346K1k794o715l925J52j938n117
$$ y = [1764863, 1726157, 1681163, 1632573, 1593127, 1559320, 1518264, 1473504, 1437914, 1407914, 1370405, 1328695, 1296318, 1271378, 1241783, 1209948, 1187736, 1172303, 1151030, 1125599, 1107904, 1096712, 1081129, 1062627, 1051153, 1043560, 1028012, 1006014, 988628, 974663, 953868, 928162, 908605, 894429, 875571, 853122, 837032, 826223, 810882, 792059, 779477, 772137, 760228, 744304, 733762, 728140, 718481, 705701, 699334, 699199, 695889, 688218, 683017, 679003, 668172, 652203, 640724, 634138, 624435, 611841, 604244, 601091, 594154, 583637, 577565, 575786, 570294, 560857, 554751, 551460, 543213, 530531, 522016, 518768, 513878, 507080, 504870, 506041, 502024, 492056, 483595, 477465, 467078, 452817, 442733, 438020, 431735, 422737, 417138, 415116, 410049, 401821, 397475, 397496, 394702, 387987, 384062, 384214, 382276, 377159]
58007C77159k429J026j275l942o34K709o98m784k068K021m1l356p74K868O13k509
57991C63886Q75O375O959O600J1141J5029J1111M630L764M899Q59m709m854k915
57977D23650n202q078n557j921l629o470l808J94j330m361j794K598J357k575
57963C83074k234j71k415n501k844K101K046p08J57J980j397o803p117m289m650
57948C51229o487m474j254k386m795k269K431K881J351L950Q357Q368O057P467
57934C70426J0766J0329Q232R851J2452R815M167J854J326l014q995j0379q710
57921D08120j0014j3185j2886j0476j0963j2554j0217o198o116q024o215k307
57909B98965j742k884n67L099K605J22J446M294K139l347n184l601m271o634n497
$$ y = [377159, 374730, 375756, 374481, 370539, 369905, 372614, 371916, 367132, 365064, 367085, 367044, 363688, 362914, 365782, 366395, 363886, 364761, 371136, 378095, 384695, 395836, 410865, 421976, 426606, 430370, 435269, 436128, 431419, 426565, 423650, 418448, 410370, 404813, 402892, 399263, 392793, 388985, 389179, 387849, 383488, 381694, 384292, 385649, 383074, 380840, 380669, 378254, 372753, 369909, 372010, 374056, 373348, 373505, 375485, 374088, 367285, 360168, 355879, 351229, 344742, 340268, 339014, 336628, 331833, 329564, 331995, 334876, 336227, 340177, 348534, 356902, 362959, 370426, 381192, 391521, 399753, 409604, 422056, 431871, 436038, 437892, 439218, 436204, 427209, 416830, 408120, 398106, 384921, 372035, 361559, 350596, 338042, 327825, 321627, 315511, 307487, 301272, 298965, 297223, 294339, 293772, 296871, 299476, 299598, 301044, 305338, 307477, 304130, 298946, 295345, 291074, 284440, 278943]
57894B78943k015j799l986l116M1L01j337K38L603L069k56m11K154J941o68o32
57878B76070J216l54m283m736k069j791l753k942Q9J56k083j172K433L178J275
57863B61234K245O049P199N445N990R081R623P368P337R814R807O966O273Q274
57849C62705Q215N495M610N924M807Q05j290l74m38k420l155k878n119q789q890
57834C59208n547l876m702l986j567j556l732l450o25mj952j866P22J325m59r2
57818C27841K823L513J226P36L315M684L308K376K333k38m929o974n763n798p980
57803C20473q103n315l843m750m115j028N72m40o03P95L28k236k944j291j209
57788B86291l298l774k168k089l445k123J479K239j99m12K775M217K235J505L714
$$ y = [278943, 276928, 275129, 271143, 268027, 268068, 268369, 267032, 267270, 270873, 273942, 273686, 273275, 275429, 277370, 276702, 276070, 277286, 276932, 272649, 267913, 265844, 264053, 260300, 257358, 257447, 257603, 255520, 254348, 256781, 259959, 261234, 263479, 269528, 276727, 282172, 288162, 297243, 306866, 314234, 321571, 331385, 341192, 348158, 354431, 362705, 370920, 376415, 381025, 386949, 391756, 392561, 391271, 390897, 390459, 388039, 384884, 382006, 376887, 368098, 359208, 353661, 349785, 345083, 341097, 339530, 337974, 334242, 330792, 330167, 330163, 328211, 326345, 327067, 328392, 327933, 327841, 330664, 334177, 335403, 336139, 339454, 344138, 347446, 349822, 352155, 351917, 346988, 340014, 334251, 328453, 320473, 312370, 307055, 303212, 298462, 294347, 293319, 293891, 293451, 292848, 293643, 293971, 291735, 288791, 287500, 286291, 282993, 279219, 277051, 274962, 271517, 269394, 270873, 273112, 272913, 272501, 275276, 279493, 281728, 283233, 286947]
57773B86947M289J312q50Q2L84k051l982l790m496o875p095m260k846m630n592
57758B46547l727k451l260k601O98K459R27J90K441M099L145L027N575P033N086
57743B69188L042L299L195J070n5J391K129M13m62J392K774J655R04K257K837
57728B95029J168M42K313L568K407J798L249L643J724J168L558M899K970J539
57714C29475L215M597K838O73N17k67l564o074n347m401n766o592m421k155k513
57699C00215k948r19J101O01j36J063J615q61l787m542n201p735r397p630m941
57684B56498m174l510q10J705J761J614L721O161O877Q069J1905J6285J9373K3805
57670C49280L1806M0611M7610N5483O6707P6580P6870O3771L8784N967k7433n2016
$$ y = [286947, 291236, 292548, 291698, 291780, 292164, 290113, 286131, 282341, 277845, 270970, 263875, 259615, 256769, 252139, 246547, 242820, 240369, 237109, 234508, 235206, 237665, 238592, 238782, 241223, 245322, 248467, 251494, 257069, 264102, 269188, 272230, 275529, 278724, 279794, 279739, 281130, 283259, 283672, 283210, 284602, 287376, 289031, 289935, 292192, 295029, 296197, 296639, 298952, 302520, 304927, 306725, 309974, 313617, 315341, 316509, 320067, 324966, 327936, 329475, 332690, 337287, 340125, 340798, 341315, 341048, 337484, 331410, 326063, 321662, 315896, 309304, 304883, 302728, 300215, 297267, 296348, 297449, 298050, 297914, 298977, 300592, 299731, 295944, 291402, 286201, 278466, 269069, 261439, 256498, 252324, 248814, 248004, 249709, 251470, 253084, 256805, 262966, 269843, 277912, 289817, 306102, 325475, 349280, 381086, 421697, 469307, 524790, 591497, 668077, 744947, 808718, 847502, 853469, 826036, 774020]
57658G74020o3338o5473o4102n9876n2019m3391l7117l2067k6331k1480j9003
57647B89823j6546j2155q422p957q540p241n485n536n815m282k769l336l941k278
57633A95520k92l92q95K86J149n88k822k823k062k776l446k279j417k938m372
57618A69853l049j271k196m104l719j905j130o80P80J312p05k466j131J061R45
57603A51595J11J354K995K081n7o95r71k943m695l748k128k720l769k519q83j833
57587A31175l334j966M52M4k093k271j085j653l239k909j528j978l307k637j110
57572A02561j827l625k942m51J58j277j832j260j654k509j660r4m52j858j475
57557G9803L6j36j452j169K26Q5j055m49J568K407K182K855L637K414M73O78K177
$$ y = [774020, 710682, 645209, 581107, 521231, 469212, 425821, 388704, 356637, 330306, 308826, 289823, 273277, 261122, 252700, 244743, 236203, 228962, 223477, 217941, 212126, 207844, 205075, 201739, 197798, 195520, 195228, 194836, 193941, 194227, 195376, 194788, 191966, 189143, 187081, 184305, 180859, 178580, 177163, 174225, 169853, 166804, 165533, 163337, 159233, 155514, 153609, 152479, 151799, 152579, 153891, 153186, 150720, 149589, 150650, 151595, 151706, 153060, 156055, 158136, 158079, 157384, 156413, 153470, 148775, 145027, 142899, 140179, 136410, 133891, 133008, 131175, 127841, 125875, 126327, 126371, 124278, 122007, 120922, 119269, 116030, 113121, 111593, 109615, 106308, 103671, 102561, 100734, 97109, 94167, 93716, 93874, 92597, 90765, 89505, 87851, 85342, 83682, 83588, 83136, 81278, 79803, 79839, 79703, 78251, 77082, 77308, 77393, 76338, 75889, 77457, 79864, 82046, 84901, 88538, 90952, 91425, 92103, 94280]
57540I4280K185J574L194N908N980L489J792J452K06j696j714l8P98P91J947L626
57524A23774L491K245K352K979J541p71n68J455J517n83j480n06k27j044r01k10
57508A33064j444l850m145k478k230l783m014k329j674l052m171m134m480n154
57494H6126m340k656k665l985l663j524k97m06L05J623J007j223j995j062j223
57479F4022k676k537n49J33j322k134j233p91j503j379k20l67j983k356r12k13
57463D3980j096j509j019j651l333l391j531n94j353j415j86k5j342j536m9L90
57447B4340j104j983j111m64o67L55K740L555J899N95J170J614P84M33J236J195
57431C4587k37p79L19Q36R4M14K372L078J137r14j089p52j104j001j19k60j625
$$ y = [94280, 96465, 98039, 101233, 107141, 113121, 116610, 118402, 119854, 120060, 118364, 116650, 116612, 117410, 118201, 120148, 123774, 127265, 129510, 131862, 134841, 136382, 135611, 135043, 136498, 138015, 137432, 135952, 135446, 135219, 134175, 133274, 133064, 131620, 127770, 123625, 121147, 118917, 115134, 111120, 108791, 107117, 104065, 99894, 95760, 91280, 86126, 81786, 79130, 76465, 72480, 68817, 67293, 66996, 66590, 66895, 68518, 69525, 68302, 66307, 65245, 64022, 61346, 58809, 58260, 58393, 57071, 54937, 53704, 52913, 51410, 50031, 49811, 49444, 47461, 45105, 44193, 43980, 42884, 41375, 40356, 38705, 35372, 31981, 30450, 29856, 28503, 27088, 26902, 26877, 25535, 23999, 23950, 24340, 23236, 21253, 20142, 19678, 19011, 19366, 22106, 25661, 27560, 28155, 29325, 30939, 31723, 32156, 33392, 34587, 34350, 33571, 33890, 34726, 34820, 35234, 37606, 40684, 41821, 40907, 39818, 39066, 37962, 36961, 36842, 36582, 34957]
57414C4957j805j68P30j21k64J551L011K527J837K167J838j17j768j871k006l037
57398C7461l167j552k76o11q32K51J082N54m2M3m37j544j213Q51J992J052K36
57381C3848Q75J156l1q69j23P75Q91J335K036R86j604k571j035r2j382k428j573
57364C0194r87k141k793j354n0o53j125L15J611O76q14o59J08j37l74N72J298
57347B3687N62j75L28N45p40j830j190j92k65l52L82M78p32j284k96m0j714k733
57329A4439j186N16k85k083k233j364j393j883j613j321b31j872n94L84j64o70
57313c147J84Q66Rq62k84M30M3j00R54e14J14o70b65B326K484J754K238K773J809
57294A3384O84J023J621J090P76J992L141K753K507M066N794N810N402O129O490
$$ y = [34957, 33152, 32984, 33714, 33593, 33329, 34880, 37891, 40418, 42255, 44422, 46260, 46143, 44375, 42504, 40498, 37461, 34294, 32742, 32466, 31855, 31023, 31274, 32356, 32910, 32868, 32911, 32474, 30930, 29717, 30568, 32560, 33612, 33848, 34723, 35879, 35848, 34979, 34856, 35631, 36522, 37857, 39893, 40879, 39275, 36704, 35669, 35577, 34195, 31767, 30194, 29207, 27066, 24273, 22919, 22869, 22216, 21091, 21406, 23017, 23693, 22879, 22220, 22328, 22191, 21817, 22389, 23687, 24249, 24074, 24402, 24947, 24207, 22377, 21187, 20995, 20730, 20378, 20760, 21238, 20506, 19222, 18926, 18886, 17172, 14439, 13253, 13769, 13484, 11401, 9168, 7804, 6411, 4528, 2915, 1594, -231, -2103, -2697, -2313, -2477, -3147, -2963, -2097, -2088, -2950, -3234, -2804, -2761, -2861, -1907, -514, -400, -1070, -265, 2326, 4810, 6564, 8802, 11575, 13384, 14068, 15091, 16712, 17802, 18578, 20570, 23711, 26464, 28971, 33037, 38831, 44641, 50043, 56172, 62662]
57279F2662M919L154L206L775L075K335K932L047Q49j812k600k715m113n611n563
57264F7540n471o929p944o472m704n457p045o303m172l500l677k353m10k83j046
57249A774q1J884K080P39K78O75R9j035r22j79n82j245j66J568J455K30N63K041
57231I176J891mj113p52n68q99n54J38l08j383j208O5N99J03k46l37p50q05J26
57212C171O30m61j348J2K042J931L66J37J383K035J869K242K800K115Q86R25J813
57195B2548J901J602K327L263K688J397J420K427K689K316K238J550n98k152r96
57180D4620J010Q37n75k13J579K134J559K104L416L124J536J256K608L672M233
57165G2900N520O708N976M404M534N752N357L574L028L873L926L162L500M567
$$ y = [62662, 67581, 70735, 73941, 77716, 80791, 83126, 86058, 89105, 89954, 88142, 85542, 82827, 78714, 73103, 67540, 62069, 55140, 47196, 40724, 36020, 30563, 23518, 17215, 13043, 9543, 5866, 3513, 3103, 2820, 1774, 1693, 3577, 5657, 6396, 6674, 7349, 7448, 6413, 5491, 5312, 4730, 3485, 3319, 4887, 6342, 6572, 7135, 9176, 11067, 11063, 9950, 9198, 8630, 7731, 7177, 7315, 7007, 5624, 4416, 4481, 5080, 5183, 4937, 4600, 3850, 3045, 3171, 3801, 3340, 1992, 2004, 4046, 5977, 6343, 6480, 7863, 9898, 11767, 14009, 16809, 18924, 19810, 20735, 22548, 24449, 26051, 28378, 31641, 34329, 35726, 37146, 39573, 42262, 44578, 46816, 48366, 47768, 45616, 44620, 45630, 46467, 45892, 45679, 47258, 49392, 50951, 53055, 56471, 59595, 61131, 62387, 64995, 68667, 72900, 78420, 85128, 91104, 95508, 100042, 105794, 111151, 114725, 117753, 121626, 125552, 128714, 132214, 136781]
57151A36781M205K868L008M363M451L449L931N811O341N204N017O482P575P809
57137B07295Q838J0497J0647R348Q946R759R929R677J1290J4649J7131J8313K0379
57124C66698K3625K6031K7565L0337L4133L6466L7441L9737M3327M5232M5190
57113G55782M6304M9029M9845M7555M5932M8422N5191O7297Q8517J19872J56452
57102A530198J92930K29568K71103L23308L92854M87084O11321P68631R63280
57093E770277J200560J480879J796767K137065K489997K839500L162855L437061
57085B4314961L646743L782933L836827L801674L683081L499696L260177K932361
57077E2758453K443973J733482Q13909k13864j215110k089025k790498l307922
$$ y = [136781, 140986, 143854, 146862, 151225, 155676, 159125, 163056, 168867, 175208, 180412, 185429, 191911, 199486, 207295, 216133, 226630, 237277, 246625, 255571, 265330, 275259, 284936, 296226, 310875, 328006, 346319, 366698, 390323, 416354, 443919, 474256, 508389, 544855, 582296, 622033, 665360, 710592, 755782, 802086, 851115, 900960, 948515, 994447, 1042869, 1098060, 1165357, 1253874, 1373746, 1530198, 1723128, 1952696, 2223799, 2547107, 2939961, 3427045, 4038366, 4806997, 5770277, 6970837, 8451716, 10248483, 12385548, 14875545, 17715045, 20877900, 24314961, 27961704, 31744637, 35581464, 39383138, 43066219, 46565915, 49826092, 52758453, 55202426, 56935908, 57749817, 57535953, 56320843, 54231818, 51441320, 48133398]
57069D8133398l641649l803122l816463l710189l510924l246415k946381k635438
57061B0822817k329161k038810j774375j540885j337429j162559j016205q95071
57053H728322p92099p03044o28229n65701n08600m52367l99185l52148l10105
57044D016844k71580k38543k12466j90856j71235j54458j40959j28025j14191
57035B394531j02105r3557q5721p5879o5734n7268m8340l6451k2915q837R073
57024A806797L2661N4031N8809L8639j499m7046q2962j01488j04752j00225r3118
57013A459847q4130p3666o4009n6209m8785m1422l6288l3905l1524k7739k4862
57002I37308k4391k4071k2092k0301k0361k0448j8857j7316j7418j7169j4499
$$ y = [48133398, 44491749, 40688627, 36872164, 33161975, 29651051, 26404636, 23458255, 20822817, 18493656, 16454846, 14680471, 13139586, 11802157, 10639598, 9623393, 8728322, 7936223, 7233179, 6604950, 6039249, 5530649, 5078282, 4679097, 4326949, 4016844, 3745264, 3506721, 3294255, 3103399, 2932164, 2777706, 2636747, 2508722, 2394531, 2292426, 2198869, 2113148, 2037269, 1971535, 1914267, 1865927, 1829476, 1806561, 1797724, 1806797, 1839458, 1893489, 1952298, 1990937, 1989438, 1942392, 1859430, 1757942, 1653190, 1552965, 1459847, 1375717, 1302051, 1238042, 1181833, 1133048, 1091626, 1055338, 1021433, 989909, 962170, 937308, 912917, 888846, 866754, 846453, 826092, 805644, 786787, 769471, 752053, 734884, 720385]
56991G20385j1069r162p678m696j275P86K570O104J0880J4923J7077J5946R467
56978G64258j608j2462j9173k2432k4177k3881k0998j7683j5757j3848j0648p945
56966E73646p236o367l091R46L398N591R921J5478K0198K4865L0738L4877L2186
56953G35150K1333N707j0283k3267l0954l3294l2658l0907k7684k2971j8713j5898
56941E15561j2797q402m679k947r93L381Q891J3698J8912K6173L4430M1743M7010
56928F79981M7185L6958J5536r292k8112l8564m3610m4691m1494l5978l1308k7754
56916D78857k3658j9333j6364j4405j2156j0123r289q660p148o017o458o810n346
56903C33090l572l467l755k379m41k6k87P49K557L902N936R919J4060J6414J8681
$$ y = [720385, 709316, 700154, 692476, 687780, 686505, 687291, 689861, 695965, 706845, 721768, 738845, 754791, 764258, 762650, 750188, 731015, 708583, 684406, 660525, 639527, 621844, 606087, 592239, 581591, 573646, 566410, 560043, 556952, 557898, 561296, 566887, 576808, 592286, 612484, 637349, 668087, 702964, 735150, 756483, 762190, 751907, 728640, 697686, 664392, 631734, 600827, 573143, 550172, 531459, 515561, 502764, 494362, 489683, 486736, 485743, 489124, 498015, 511713, 530625, 556798, 591228, 632971, 679981, 727166, 764124, 779660, 770368, 742256, 703692, 660082, 615391, 573897, 537919, 506611, 478857, 455199, 435866, 419502, 405097, 392941, 382818, 373529, 364869, 357721, 351704, 345246, 338436, 333090, 329518, 326051, 322296, 319917, 319476, 319450, 319163, 319912, 322469, 326371, 332307, 342226, 356286, 372700, 391381]
56888C91381K3317K9220L4118L8664M3634M5350L8970K5198R459m305j5082k1840
56876F38084k3801k2780k1345j9386j5729j1464q190m676Q46O865J1025J4684
56864E44133K0931K9600L8439M7988O0904P6784R0529R4999Q3584N3622J1394
56853A152907k8855n5458o7697p1242o9050o1302n0592m0730l1871k2150j2485
56842F41475m834K544J2759K4906L6209M7740O2666Q0842J00647J23375J47955
56831A276284J62324J48994J02129L4421l3727q7222j19525j30921j27242j16268
56821A109247j02504q6891p0836n6758m4779l2982k1160j0752j255R568K1933
56810G12831L4224M6840O2428Q1841J01895J15653J13174Q6000L6387j9751o4330
$$ y = [391381, 414698, 443918, 478036, 516700, 560334, 605684, 644654, 669852, 679311, 675006, 659924, 638084, 614283, 591503, 570158, 550772, 535043, 523579, 515389, 510713, 511559, 518424, 529449, 544133, 565064, 594664, 633103, 681091, 741995, 818779, 909308, 1004307, 1087891, 1141513, 1152907, 1124052, 1068594, 1000897, 929655, 860605, 799303, 748711, 707981, 676110, 653960, 641475, 636641, 639185, 651944, 676850, 713059, 760799, 823465, 904307, 1004954, 1128329, 1276284, 1438608, 1587602, 1689731, 1724152, 1690425, 1603203, 1483678, 1352757, 1225515, 1109247, 1006743, 919852, 849016, 792258, 747479, 714497, 693337, 682585, 681330, 690898, 712831, 747055, 793895, 856323, 938164, 1040059, 1155712, 1268886, 1354886, 1391273, 1371522, 1307192]
56799A307192r0709j02700j04202r6613q3953p2143o2451n1877m0165l0518k3417
56788E48444j5908p368j43N909J3595K2889L1135L8987M9502O0141O2050M9518
56776H58751K5503l072l0187n0268n9309n9052n5563n2048m7160m0679l5313l1783
56764D19820k7560k2105j8236j6792j4983j1650r205q718p969n999m921n512n628
56751B60542m468l939m394l711j900j736l471l820j785m37j310k073j494j639
56737B24365l127l259j094M34k87r04P3M92r68k071j230k67o19q71k34l74j642
56720B08417j570P09K491K055J186J277R95k18m80P62J337N69P16K361K804R33
56704B24344o85n90q42k537l435k366j611k441k702j204k34j186j933r93j96o75
$$ y = [1307192, 1216483, 1113783, 1009581, 912968, 829015, 756872, 694421, 642544, 602379, 571861, 548444, 532536, 525168, 525025, 530934, 544529, 567418, 598553, 637540, 687042, 747183, 809233, 858751, 884254, 881182, 850995, 800727, 741418, 682366, 626803, 574755, 527595, 486916, 451603, 419820, 392260, 370155, 351919, 335127, 320144, 308494, 299289, 290571, 282602, 276603, 271682, 266170, 260542, 256074, 252135, 247741, 244030, 242130, 240394, 236923, 233103, 231318, 230881, 229571, 227498, 226004, 224365, 221238, 217979, 216885, 217319, 217032, 216128, 216201, 216693, 215725, 213654, 212424, 212157, 211538, 210667, 210433, 210059, 208417, 206847, 207556, 210047, 212102, 213288, 214565, 215560, 215342, 214862, 215624, 216961, 217530, 218246, 220607, 223411, 224344, 223659, 223069, 222227, 219690, 216255, 213889, 212278, 209837, 207135, 205931, 205697, 204511, 202578, 201585, 201389, 200714]
56688B00714m34J625L308L277L430M775N107L331J918K472K956J860R50J307R62
56673B37558r09j692p0J178m6j670j650j465k466k832j252J85j89o69J35N03o54
56656B23995j115O59K572K717K490L199L402K197J451K224K805K544L351N201
56642B57692M848J602n36O20J773J76j764j497r57k278l450k418j132j572j894
56627B49213n07K78j266k460j030M14r00k794k167l82j09m26N29J374L87p51j38
56610B39265N75n20j877j763j648k722k820o92P53n50j716l5J993J331m2Q36K318
56593B32686J627L13J002K095R10j024q49L68J22p18l33j04j620k626p64J660
56577B32745J457J38P77K328K066Q82J135J895J169K57J180K430J917J339K993
$$ y = [200714, 200280, 201905, 205213, 208490, 211920, 216695, 221802, 225133, 227051, 229523, 232479, 234339, 235289, 236596, 237558, 236649, 234957, 234887, 236065, 236019, 234349, 232699, 231234, 228768, 225936, 224684, 224869, 224680, 224011, 224146, 224649, 223995, 222880, 223539, 226111, 228828, 231318, 234517, 237919, 240116, 241567, 243791, 246596, 249140, 252491, 257692, 262540, 264142, 263606, 264226, 265999, 266175, 264411, 262914, 261957, 259679, 256229, 253811, 252679, 251107, 249213, 248706, 248984, 247718, 245258, 244228, 244642, 243742, 240948, 238781, 238399, 238290, 237864, 238393, 239767, 240154, 239403, 239265, 239840, 239320, 237443, 235680, 234032, 231310, 228490, 227798, 228551, 228001, 226285, 226250, 228243, 229574, 229532, 230368, 232686, 234313, 234626, 235628, 237723, 238633, 237609, 236760, 237128, 237250, 236532, 236199, 236095, 234475, 231849, 231085, 232745, 234202, 234340, 235117, 237445, 239511, 240393, 241528, 243423, 244592, 244849, 246029, 248459, 250376, 251715, 254708]
56562B54708N156N362N225P170R387Q911O777N291L333o19m008m013k748l430
56548B96502m526l146j004j271k449j320P51L71j556j868j058j489k178j041J41
56533B74859j222l100k275n47j491l655l248j172q87j536J83L187L714K246K184
56518B67240L109J779j280k549j800j687k166j206J30q44k982k980j309r54j609
56503B50892p83P58L61j055o05R38O81p45o57K10n80j792p05J170N77j171n08
56486B46986J598J558k3Q8J114n2k168j595N91M05j460r94J343J445o18r23P67
56469B48062R75m17j24J725J664l64j008q0n02k015j579K79J76j343n34K350L348
56452B50613K066J814K735J710r29j551j74l83k230k158r7K50j474j743o0M21
$$ y = [254708, 259864, 265226, 270451, 277621, 287008, 295919, 302696, 307987, 311320, 310701, 306693, 302680, 299932, 296502, 291976, 288830, 287826, 286555, 284106, 282786, 283537, 283908, 282352, 280484, 279426, 277937, 275759, 274718, 274859, 273637, 270537, 268262, 267715, 266224, 262569, 259321, 258149, 257262, 255726, 255909, 259096, 262810, 265056, 267240, 270349, 272128, 270848, 268299, 266499, 264812, 262646, 261440, 261570, 260726, 257744, 254764, 253455, 252501, 250892, 250109, 250867, 251228, 250173, 249568, 250506, 251187, 250442, 249785, 249995, 249415, 247623, 246918, 248088, 248665, 247494, 246986, 248584, 250142, 250119, 250207, 251321, 251269, 249101, 247506, 248097, 248502, 247042, 246048, 247391, 248836, 248218, 247295, 248062, 249037, 248620, 248496, 250221, 251885, 251521, 250513, 250433, 249931, 247916, 246337, 246616, 246792, 245449, 244915, 247265, 250613, 252679, 254493, 257228, 258938, 258009, 256458, 256284, 255901, 253671, 251513, 251416, 251666, 250192, 248449, 248389, 248810]
56436B48810n34J27K183K108o0n48J030J174n27p73O66N22j143o30K222L427K070
56419B60124J440K294J793j98m99J081J361J99O31K371K024k6kJ805J319j322
56403B74395j636Q27J640k06q60O64R78m46k02J868J979k7m6K290K645J62j110
56386B82915j13k72j974j571Q59Q92j681j904J176K715J182P60K781L245J126
56371B90136O61K891L367Q66J8K456L633J429j93Q00Q85j436k312o3J564O74L51
56354C05727J684J358j081j325J512K702O13m09J282J477j305k453Q7K078J332
56339C13279J541M250N299L038J855L763M675K757K163M561N335K432N54K303
56325C57805L517J782J109L574M642J741p00L91J358m40j521K28J016j047j617
$$ y = [248810, 248276, 248403, 250586, 252694, 252634, 252086, 253116, 254290, 253763, 252990, 253656, 254178, 253035, 252405, 254627, 258054, 260124, 261564, 263858, 265651, 265453, 264954, 266035, 267396, 267595, 268226, 270597, 272621, 272595, 272593, 274398, 275717, 274395, 272759, 273586, 275226, 275020, 274160, 274824, 275802, 275356, 275154, 277022, 279001, 278974, 278928, 281218, 283863, 284025, 282915, 282802, 282530, 280556, 278985, 279844, 280736, 279055, 277151, 278327, 281042, 282224, 282984, 285765, 289010, 290136, 290797, 293688, 297055, 297921, 297939, 300395, 304028, 305457, 305264, 306064, 306949, 305513, 303201, 303138, 304702, 305376, 305727, 307411, 308769, 307688, 306363, 307875, 310577, 311190, 310781, 312063, 313540, 312235, 309782, 309869, 311947, 313279, 314820, 319070, 324369, 327407, 329262, 333025, 337700, 340457, 342620, 347181, 352516, 354948, 355502, 357805, 361322, 363104, 364213, 367787, 372429, 374170, 373470, 373861, 375219, 374779, 373258, 373486, 374502, 373455, 371838]
56310C71838J546L932K818K292M820O135L679J934L907N576M190L739O590Q024
56296D31020N008K260L567N155L641K537M673O213M450L599O563Q847P067N551
56282E00151Q004J0440R088P457Q939J0097Q095P121J0509J3994J3589J2696J4812
56269F34992J6669J5334J4505J7167J9638J9419K0907K6761L1939L3167L5668
56258H86166M3289N0827N3919N7754O7581P9124Q7064R4901J07491J21525J32360
56247A782001J42742J56009J68021J74438J78666J84005J85543J78513J66964
56238C316902J55296J39070J13440Q3129N4488K5239q328m1367o7611q9452j11285
56227C569521j29734j40274j46624j53778j58484j56221j50882j47793j44037
$$ y = [371838, 373384, 377316, 380134, 382426, 387246, 393381, 397060, 398994, 402901, 408477, 412667, 416406, 422996, 431020, 436028, 438288, 441855, 447010, 450651, 453188, 457861, 464074, 468524, 472123, 478686, 487533, 494600, 500151, 508155, 518595, 527683, 535140, 544079, 554176, 562271, 569392, 579901, 593895, 607484, 620180, 634992, 651661, 666995, 681500, 698667, 718305, 737724, 758631, 785392, 817331, 850498, 886166, 929455, 980282, 1034201, 1091955, 1159536, 1238660, 1325724, 1420625, 1528116, 1649641, 1782001, 1924743, 2080752, 2248773, 2423211, 2601877, 2785882, 2971425, 3149938, 3316902, 3472198, 3611268, 3724708, 3807837, 3862325, 3887564, 3879236, 3837869, 3770258, 3680806, 3569521, 3439787, 3299513, 3152889, 2999111, 2840627, 2684406, 2533524, 2385731, 2241694]
56218B241694j35363j25678j19824j14001j03382r2177q6081q1732p3910o5999
56208A243547o2871o0552n3599m5846m3033m1757l6528l0721k9606k9460k4822
56197G84752j9476j9048j9734j5802j1194j1907j3933j0798o123o498q635o133
56185F35471k274l471o435m647j265k807o112m472o84j199l305r21K908K115k1
56170F02881K473N756L457j33K324O935N829K143L573P360O284L455O207J1086
56156F69630J0117O383Q220J3203J3195J0197J1942J6624J7258J6367K1122K8782
56144H43040L2161L4596M4131N7978O8212P7505R3188J10805J19754J20292J18912
56133A720574J12521R4503P1539N6987N1627M7517M5575N1417N8558N4513M0348
$$ y = [2241694, 2106331, 1980653, 1860829, 1746828, 1643446, 1551269, 1465188, 1383456, 1309546, 1243547, 1180676, 1120124, 1066525, 1020679, 977646, 935889, 899361, 868640, 839034, 809574, 784752, 765276, 746228, 726494, 710692, 699498, 687591, 673658, 662860, 656737, 650239, 641604, 635471, 633197, 629726, 623291, 618644, 617379, 614572, 608460, 603988, 603304, 602105, 598800, 597879, 600787, 602902, 602881, 605354, 611110, 614567, 614434, 616758, 623693, 629522, 631665, 635238, 642598, 648882, 652337, 658544, 669630, 679747, 686130, 694350, 707553, 720748, 730945, 742887, 759511, 776769, 793136, 814258, 843040, 875201, 909797, 953928, 1011906, 1080118, 1157623, 1250811, 1361616, 1481370, 1601662, 1720574, 1833095, 1927598, 1999137, 2056124, 2107751, 2155268, 2200843, 2252260, 2310818, 2365331, 2405679]
56122B405679K6753J4747j914j9460k8050k9981l6224m7957n8729p0446q9045
56111B065373j08255j16211j14474j12664j09205r6324p9021o8911o3642n2577
56101A144089l8359l2039l1261k4699j4294j1230j3568r975k308j964o890n058
56089I52444J985K170l241k108M650N183N05K375R418R423L674M720J1578J1647
56075A014423N720O266J2397J1857O230Q439J6581J6657J0051J1404K0157K1612
56063A161794J5545J5819K2031K0117J1116J0378J7778J7839J0052R432J6310
56052A328211J5705P648P474J4954J4347O347P910J8798K1054J3608J4076K3846
56040A493978K5533J7812J8104K7477K8145J9403K0030L1159L3399K4968K5203
$$ y = [2405679, 2432432, 2447179, 2445265, 2425805, 2397755, 2367774, 2331550, 2283593, 2224864, 2154418, 2065373, 1957118, 1840907, 1726433, 1613769, 1504564, 1408240, 1329219, 1260308, 1196666, 1144089, 1105730, 1073691, 1042430, 1017731, 1003437, 992207, 978639, 968664, 966356, 964392, 957502, 952444, 954429, 956599, 953358, 951250, 955900, 961083, 961588, 963963, 973381, 982804, 986478, 991198, 1002776, 1014423, 1020143, 1026409, 1038806, 1050663, 1056893, 1065332, 1081913, 1098570, 1108621, 1120025, 1140182, 1161794, 1177339, 1193158, 1215189, 1235306, 1246422, 1256800, 1274578, 1292417, 1302469, 1311901, 1328211, 1343916, 1351564, 1359038, 1373992, 1388339, 1394686, 1402596, 1421394, 1442448, 1456056, 1470132, 1493978, 1519511, 1537323, 1555427, 1582904, 1611049, 1630452, 1650482, 1681641, 1715040, 1740008, 1765211]
56029A765211L5856L7362K8366K9437M2105M4701L4822L4493M6583M8731L7876
56018B185543L7254N0866N5372M6152M6247N9968O3768N3477N3523O8493P3591
56007B794254O4336O6334Q3993R0527Q1121Q3643J03515J12158J03766J07504
55997C691151J28847J36921J25665J27391J49130J57935J46922J50948J77878
55988D992788J91895J85217J95799K32138K54147K52100K67556L10867L38819
55979G221326L41325L65386M23386M66899M83335N24261O03439O66932P01986
55970A1798275P69069Q85091R88820J066831J191079J382723J572044J748261
55962B1402193K004082K371599K775272L217747L835155M691166N718360O953294
$$ y = [1765211, 1801067, 1838429, 1866795, 1896232, 1938337, 1983038, 2017860, 2052353, 2098936, 2147667, 2185543, 2222797, 2273663, 2329035, 2375187, 2421434, 2481402, 2545170, 2598647, 2652170, 2720663, 2794254, 2858590, 2924924, 3008917, 3099444, 3180565, 3264208, 3367723, 3479881, 3583647, 3691151, 3819998, 3956919, 4082584, 4209975, 4359105, 4517040, 4663962, 4814910, 4992788, 5184683, 5369900, 5565699, 5797837, 6051984, 6304084, 6571640, 6882507, 7221326, 7562651, 7928037, 8351423, 8818322, 9301657, 9825918, 10429357, 11096289, 11798275, 12567344, 13452435, 14441255, 15508086, 16699165, 18081888, 19653932, 21402193, 23406275, 25777874, 28553146, 31770893, 35606048, 40297214, 46015574, 52968868]
55954E2968868Q595561J0726628J3246343J6221436J9974544K4701459L0468309
55947A76903148L7702425M6623615N5094486N7680470M8810755K7975842J289877
55940D52080618k2718702l8713267m6251970m7511005m4788367l9870926l4212071
55933A78014310k8762382k3848754j9537244j5943169j3096745j0816435q919453
55926E7090128p386829o209873n261065m434159l754135l244093k821856k419344
55918B1558774k075827j826831j615928j394712j203092j076140r68890q42401
55910A0554953p33471o73891o24776n52163m88713m62439m38587l87693l41296
55901E851924l27074l14779k77248k42403k35756k30706k02820j77155j76322
$$ y = [52968868, 61564429, 72291057, 85537400, 101758836, 121733380, 146434839, 176903148, 214605573, 261229188, 316323674, 374004144, 422814899, 450790741, 452080618, 429361916, 390648649, 344396679, 296885674, 252097307, 212226381, 178014310, 149251928, 125403174, 105865930, 89922761, 76826016, 66009581, 57090128, 49703299, 43493426, 38232361, 33798202, 30044067, 26799974, 23978118, 21558774, 19482947, 17656116, 16040188, 14645476, 13442384, 12366244, 11397354, 10554953, 9821482, 9147591, 8522815, 7970652, 7481939, 7019500, 6580913, 6193220, 5851924, 5524850, 5210071, 4932823, 4690420, 4454664, 4223958, 4021138, 3843983, 3667661]
55892C667661j75407j52148j30532j32320j34391j15158r6139r7783r9293q0988
55882B453502o2945o4261o6231n2485m4240n9210p5130p0164o1580o9129p6912
55871A751215o6879n4977n9096o4221n3282m0875m3425m6608l4647k2392k6596
55860A238217l3896k8196k2022l0133l8939l2450k2894k5961l0558k2262j2733
55849I38173j6941k4181j9925j4178k0524k8528k4194j7110k0749k5984k0216
55838G05643j2927j6626k1612j5109o744r877j5810j1299m213p150j2577q360
55826E63339j691m062q301l717J701l079r852p008k281p228j4026j0384l206m888
55812D85317r779o504n74k687p028k862M235L690O68M949J0794Q331L565O851
$$ y = [3667661, 3492254, 3340106, 3209574, 3077254, 2942863, 2827705, 2731566, 2633783, 2534490, 2453502, 2390557, 2326296, 2260065, 2207580, 2163340, 2104130, 2029000, 1958836, 1897256, 1828127, 1751215, 1684336, 1629359, 1570263, 1506042, 1452760, 1411885, 1368460, 1321852, 1287205, 1264813, 1238217, 1204321, 1176125, 1154103, 1123970, 1085031, 1052581, 1029687, 1003726, 973168, 950906, 938173, 921232, 897051, 877126, 862948, 842424, 813896, 789702, 772592, 751843, 725859, 705643, 692716, 676090, 654478, 639369, 632625, 622748, 606938, 595639, 591426, 584276, 571699, 563339, 561648, 557586, 549285, 545568, 547269, 544190, 534338, 527330, 525049, 517821, 503795, 493411, 490205, 485317, 475538, 469034, 468460, 465773, 458745, 455883, 460118, 463808, 464476, 469425, 480219, 488550, 492115, 498966]
55798D98966J2446R503K677J986K873l958j3031j3929j0889j3532j7660j4044
55786D41408o998n794o784k269K184k390j0207j0501o657p736r860m149N176Q750
55772C84173J0184J8354K8802L0222K2675J3210J180j5693k8715k8937k3267k3491
55760C88697k6707k3159j5602j3471j4817j1426n655n288p622n100p56j877m514
55747B52703n57N823N203M00O78M229K935r64M65M554K853k481l111q09l232p937
55731B60752o671j562j169m220k991P86q02o105o899m035m827p898n833k27R73
55716B09272j382J68M875N746L942O560J2128J2599P951N015L876o64o278n908
55702B57900j585j645n838o799m532n631r582r601o028n450p602o271k148j637
$$ y = [498966, 511412, 520915, 523592, 525578, 528451, 524493, 511462, 497533, 486644, 473112, 455452, 441408, 434410, 428616, 421832, 419563, 421747, 419357, 409150, 398649, 391992, 384256, 374396, 370247, 375423, 384173, 394357, 412711, 441513, 471735, 494410, 507620, 508800, 493107, 464392, 435455, 412188, 388697, 361990, 338831, 323229, 309758, 294941, 283515, 277860, 272572, 264950, 259850, 259094, 257217, 252703, 252146, 257969, 263172, 263572, 264250, 268479, 271414, 270450, 270915, 275469, 278322, 275841, 272730, 271921, 268689, 260752, 254081, 252519, 251350, 247130, 244139, 244925, 244123, 238018, 231119, 227084, 222257, 214359, 208526, 208299, 209272, 207890, 208058, 212933, 218679, 222621, 229181, 241309, 253908, 261859, 266874, 270750, 270086, 263808, 257900, 256315, 254670, 248832, 242033, 237501, 231870, 222288, 212687, 206659, 201209, 193607, 187336, 185188, 183551]
55688A83551l956k537J794K094j125o85L594M950K872L485O991P394M557M233
55674B17212O187M454o45k736j459k492n745n392j604m62k324j806Q79L23k599
55659B01791j503L236M792K489K362N013M815J592J300M323M611J215n63j35k309
55644B33029o487o618k864k010n191o453m512m696p893q700o079n008o185m832
55630A55501j015l19k891k695Q66J619j537k521K22R45k124l501j070K89j510
55615A40259k292o20o13l116l547r39Kj870k062L66Q18j612k189J40Q34j033j052
55598A21474J183P39k683l288N5J499q44j667J048K259j95j518O91K205P99J50
55582A21907J738J666r83j359K148M616L712L616O506Q506P697P866J0765J2605
$$ y = [183551, 179595, 177058, 178852, 180946, 179821, 179136, 182730, 187680, 190552, 194037, 201028, 208422, 212979, 217212, 223399, 227853, 227208, 224472, 223013, 220521, 214776, 209384, 207780, 207318, 204994, 203188, 204067, 204390, 201791, 200288, 203524, 208316, 210805, 213167, 218180, 222995, 224587, 225887, 230210, 234821, 236036, 235473, 235338, 233029, 226542, 219924, 217060, 215050, 209859, 203406, 198894, 194198, 186305, 177605, 171526, 166518, 160333, 155501, 154486, 154167, 151276, 148581, 149447, 151066, 149529, 147008, 147230, 148175, 146051, 142550, 141480, 141769, 140259, 137967, 137347, 136734, 133618, 130071, 129132, 129134, 127264, 125202, 125568, 126386, 124774, 122585, 122725, 123559, 122526, 121474, 122657, 123396, 120713, 117425, 117480, 118979, 118135, 116468, 117516, 119775, 119580, 118062, 118753, 120958, 121757, 121907, 123645, 125311, 124328, 122969, 125117, 129733, 133445, 137061, 143567, 152073, 159770, 167636, 178401, 191006]
55568A91006J1575J0938J1494R120L005j760k955m507q043r527p610o833r007
55555A86896r750p134n517p023p584n235m018n629n513j650J027n46k232p57O87
55540A26022m00q01J517K782O68r63N98J815nj448K61J846L50j445q21k49j976
55523A27751l461k683k191l526l577p20J412M72l35J389K706J374K97J671K637
55508A23216J020m51J98L65j323j591R48K113n46l094k322j284k970m561l071
55493A06647r41j015j387q5M80j450k790j150P05K91QJ742K500R3k169j277K66
55476A00468l43r92N76K013J125L39J685K445M61j338m05N94q77k232r85K82r18
55459A01898j982m11J074k35j713m83J083K28p87O04J949N94r27J86J417j29j852
$$ y = [191006, 202581, 213519, 225013, 234133, 237138, 235378, 232423, 227916, 219873, 210346, 202736, 195903, 186896, 177146, 170012, 164495, 157472, 149888, 144653, 140635, 135006, 129493, 127843, 128870, 128324, 126092, 125335, 126022, 125622, 124821, 126338, 129120, 129788, 128825, 129423, 131238, 131233, 129785, 130046, 131892, 132242, 130797, 129976, 129727, 127751, 124290, 121607, 119416, 115890, 112313, 111593, 113005, 113477, 113142, 114531, 117237, 118611, 118908, 120579, 123216, 124236, 123785, 123983, 124348, 123025, 121434, 122382, 124495, 123949, 120855, 118533, 117249, 114279, 109718, 106647, 105706, 104691, 103304, 103219, 103699, 102249, 99459, 98309, 99014, 99305, 99313, 101055, 103555, 103648, 101479, 100202, 100468, 100125, 99133, 99709, 101722, 102847, 103186, 104871, 107316, 107777, 106439, 106034, 106628, 105751, 103519, 102534, 102816, 101898, 99916, 99505, 100579, 100344, 98631, 98148, 99231, 99459, 98672, 99276, 101225, 101819, 100892, 101078, 102495, 102366, 100514]
55442A00514n33J344J14k252j908KJ38p99k55R20P21L11J186J406n30j728K42
55425I8893K377J227r87n77J121R23q5P56K178J711Q01J874L289K465R29J190
55409A18085J643j51k267j744j15l94j517r64k0j103k683k077o07q94j758q26
55393A02608N81J83m78R46K641J848K30P75K153J435j90J86J574J148m09p70q12
55376A13649k474m136l239j269j082j691o99N79m03k162j707j6J38m57M70J540
55360I7041J10k288k301o63m03j047J7K071K324J113P99J033M6j002N1J706J025
55343I9632j039j424m01l71r24n5J273P20p42m73R71J299J053K083L220K328Q05
55326A07955J196K167R25j293j329Qm32k212k344r47o14j290r39n7n40j298p7
$$ y = [100514, 99981, 101325, 101439, 99187, 97279, 97281, 97419, 96620, 96365, 97285, 98006, 98317, 99503, 100909, 100379, 98651, 98893, 101270, 102497, 101510, 100933, 102054, 102977, 102892, 103648, 105826, 107537, 108338, 110212, 113501, 115966, 116895, 118085, 119728, 119577, 117310, 115566, 115451, 115057, 113540, 112576, 112556, 111453, 108770, 106693, 106086, 105192, 103434, 102608, 103189, 103372, 102894, 103840, 106481, 108329, 108559, 109334, 111487, 112922, 112732, 112918, 114492, 115640, 115231, 114461, 113649, 111175, 107039, 103800, 102531, 101449, 99758, 99059, 99638, 99235, 97073, 95366, 95350, 95488, 95031, 95501, 97041, 97151, 94863, 92562, 91899, 91496, 90449, 90466, 92537, 94861, 95974, 96773, 97806, 97852, 96850, 96901, 98607, 99632, 98593, 97169, 96768, 96397, 95473, 95418, 96691, 97411, 96669, 96196, 97167, 98466, 99519, 101602, 104822, 107150, 107955, 109151, 111318, 112243, 110950, 109621, 109629, 109197, 106985, 104641, 103694, 103080, 101790, 100851, 100794, 100254, 98956, 98879]
55309I8879J739J197p32q84K97k8j409j097M41M23p86n32P43L58j177r66P72J234
55291I8472M40Q00K004J567o1j90Q51L76j297j320K27N17p40j207p08j059j668
55274I7004l92J647J269j071j981j077r95j850j072J263K283J589J545K300J615
55259A02077k47o04N76O70m14j52J399J471j19o56K18R2j134r36O60Q25o21p50
55241A02355Q33J143m86j093M00J333L32o02l36n03j747k264j395p58q11j64R88
55224I7225P29o48o45Q70J319J66k38P95J167J86l93j47o50j728j337K86N99n15
55206I7041m52J121J619N42L91J700J866R4j076m81p0o82m84R79J562O91N24J530
55188A06415J267r19k242j221K4j05k24O22R12j98j104p80l47l47K30J186Q95
$$ y = [98879, 100618, 101815, 101083, 100199, 100496, 100468, 99059, 97962, 98403, 98826, 98040, 97508, 98251, 98609, 97432, 96466, 97238, 98472, 98912, 99712, 101716, 103283, 103222, 103032, 103883, 104259, 102962, 101642, 101869, 102386, 101646, 100439, 99731, 98672, 97004, 96612, 98259, 99528, 98457, 96476, 95399, 94404, 92554, 91482, 92745, 95028, 96617, 98162, 100462, 102077, 101830, 101226, 101802, 102472, 102058, 101906, 103305, 104776, 104657, 104001, 104219, 104311, 103177, 102241, 102901, 103726, 103105, 102355, 103188, 104331, 103845, 102752, 103152, 104485, 104817, 104215, 103879, 103376, 101629, 99365, 97970, 97212, 96401, 96237, 97225, 97954, 97306, 96661, 97531, 98850, 99016, 98778, 99573, 100740, 100926, 100533, 100386, 99736, 98008, 96671, 96957, 97556, 97041, 96589, 97710, 99329, 99871, 100262, 101962, 103828, 103922, 102846, 102365, 102295, 101613, 101129, 102108, 103670, 104361, 104885, 106415, 107682, 106763, 104521, 103300, 103324, 103219, 102995, 103617, 104529, 104331, 103227, 102447, 102100, 101753, 101983, 103169, 104064]
55171A04064l04j97J068Q04j303k263r36J71l40n45P43J699J169P17J292J454
55155A07293N60J70P89P59k40l42O30L18j706k649j296j9l10l17J212K395J761
55138A09008O90L21m62k010k383q89K57k22m95P88K020J702Q39M47k30j298j213
55121A06870J43N50p96j787j124k29j9O44J820J496n03j345J99J599R59o1J89
55104A08605N01k42p01J11P57L56M12J646K218J120J86O40R06r1p38K8N43l16
55086A15941q57J91J276J072Q50J608J833M44r54q99l78l72oR69R36m75j146k18
55068A19815K11q85j286M19K104J829R70J159J241k4j242r79k73k65q1P57P43
55051A24213o09j285l22L35m82j045m38o47k542l506j843J46L71N24K270L503
$$ y = [104064, 103760, 103563, 104631, 105435, 104132, 101869, 100933, 101104, 100764, 100219, 100962, 102661, 103830, 104547, 105839, 107293, 107853, 108023, 108812, 109571, 109331, 108989, 109619, 109937, 108231, 105582, 104286, 104267, 103957, 103640, 104852, 107247, 109008, 109698, 110019, 109557, 107547, 105164, 104275, 104532, 104310, 103815, 104603, 106623, 108325, 109164, 109611, 109381, 108083, 106870, 107013, 107563, 106767, 104980, 103856, 103627, 103608, 104252, 106072, 107568, 107065, 105720, 105919, 107518, 108477, 108416, 108605, 109106, 108864, 108163, 108274, 109031, 109387, 109799, 111445, 113663, 114783, 114969, 115609, 116515, 116424, 115686, 115714, 116257, 115941, 115084, 115275, 116551, 117623, 118473, 120081, 121914, 122358, 121404, 120505, 120127, 119755, 119749, 120718, 121654, 121179, 120033, 119815, 120026, 119141, 117855, 118274, 120378, 122207, 123177, 124336, 125577, 125553, 124311, 123332, 123059, 122794, 122713, 123470, 124213, 123604, 122319, 121997, 122332, 121850, 120805, 120367, 119720, 117178, 113672, 111829, 111975, 112346, 112870, 115140, 118643]
55035A18643J980n11j218p33q20q10L68J235L38p36k43L74o77j940j299K14N13
55018A14678J00L58N59k86q26K07J251O17m13j89J43p82j397l1J648J439N49J161
55000A18786K354K098J149J330J898J202J67N38J417R50j88l49j96j165k290j883
54984A25818o95l09r4J058J923J005l38j74N38K5p74j22R17M52n05J12J511J598
54966A31946Q85J152J719P36j060j513p62m62m52L90J246P00l13j54K86o74j985
54949A31685j615l74m57j428j301m04m67j012l28R17P27m58n83K69M42K13J169
54932A26995K824L253K514K141K069J261O04J795M113N449N807O583P379O821
54918A79608N595N208M724K203j439l626m343n562p224p503o493n963n803m349
$$ y = [118643, 120623, 120112, 118894, 118161, 117341, 116531, 116899, 118134, 118472, 117736, 117493, 117867, 117190, 115250, 113951, 114165, 114678, 114778, 115136, 115695, 115409, 114583, 114790, 116041, 116658, 116245, 116056, 116199, 115417, 114020, 113989, 115637, 117076, 117625, 118786, 121140, 123238, 124387, 125717, 127615, 128817, 128984, 129522, 130939, 131889, 131701, 131352, 131156, 129991, 127701, 125818, 125123, 124814, 124720, 125778, 127701, 128706, 128368, 128194, 128732, 128757, 127983, 127861, 128778, 129230, 128725, 128837, 130348, 131946, 132831, 133983, 135702, 136438, 135378, 133865, 133103, 132641, 132189, 132579, 133825, 134525, 134212, 134058, 134344, 133670, 131685, 130070, 129696, 129239, 127811, 126510, 126106, 125639, 124627, 124299, 125216, 125943, 125485, 124902, 125171, 125613, 125826, 126995, 129819, 133072, 135586, 137727, 139796, 141057, 141661, 143456, 147569, 153018, 158825, 165408, 172787, 179608, 185203, 190411, 195135, 197338, 195899, 192273, 187930, 182368, 175144, 167641, 161148, 155185, 149382, 145033]
54904A45033j884m12k37o8m4j229k654k326q39m68j091o25Q55J186J77j12P90
54887A36052J184O88Q84K174L159L457M155N334N953O211P155Q145P526N574L896
54872B01547K352k93l245m509m485n281o769o874n610n114n626n032k761o53L05
54857A47952Q58R55k67j778j454J67L67j240k149j392q82j668k325j996j781k183
54841A31184k162j522j384j641q53P91J380P36Q20K044K383J006l10l84l06q70
54825A30912j123o13l87p58o16J50R1j022j434l24Q97J106Q90O75j20j272j448
54808A25604m80K46L00P94J884K153J168K66J28j23p85q91k89j45p28r16l49J02
54790A27939L44J173K105J634K5p40j22M08L06O32J392J175J13K64K123L529L112
$$ y = [145033, 143149, 142737, 142500, 142432, 142388, 141159, 138505, 136179, 135340, 134872, 133781, 133156, 134011, 135197, 135374, 135262, 136052, 137236, 137924, 138808, 140982, 144141, 147598, 151753, 157087, 163040, 169251, 176406, 184551, 192077, 197651, 201547, 203899, 203606, 200361, 195852, 191367, 186086, 179317, 172443, 166833, 161719, 156093, 151061, 148300, 147647, 147952, 148810, 149765, 149498, 147720, 146266, 146433, 146800, 145560, 143411, 142019, 141137, 139469, 137144, 135148, 133367, 131184, 129022, 127500, 126116, 124475, 123622, 124413, 125793, 126529, 127349, 129393, 131776, 132782, 132472, 132088, 131782, 130912, 129789, 129176, 128789, 128031, 127415, 127565, 127656, 126634, 125200, 124876, 125773, 126879, 127769, 128444, 128324, 127052, 125604, 125124, 125370, 125670, 126464, 128348, 130501, 131669, 131935, 132063, 131940, 131155, 130264, 129975, 129830, 129102, 128186, 127837, 127939, 128283, 129456, 131561, 133195, 133220, 132480, 132358, 132766, 133072, 133704, 135096, 136271, 136384, 136648, 138771, 142300, 145412]
54773A45412K193K221K800L290M071N170N789N933O436O899N914L796K508K367
54759B04799J508p82k880l790m536n721o342n974n674n741n039l414k349k378
54745A51687k234j369q53j017p22K59O45J51N4O04N52j71o2R68J193L98M82J910
54727A52475K787K566L282N701P512P055N749N029L889J458q29j773k534m177
54713A88190n475n244m608m876n209m436l243k679k287j513j113j594j947j463
54699A42503r86j010n88N62R55j21j169j087r91j857k554k024j309j503j679p27
54683A26415N01P71M72L83P6p51j039j39P67N42j56m07n38p65k14J229J910Q93
54665A29950l67l99N4j86n69j96L02J18m1O47J416J241N69K55J02j70N8J006J570
$$ y = [145412, 147605, 149826, 152626, 155916, 159987, 165157, 170946, 176879, 183315, 190214, 196128, 199924, 202432, 204799, 206307, 205525, 202645, 198855, 194319, 188598, 182256, 176282, 170608, 164867, 159828, 156414, 154065, 151687, 149453, 148084, 147231, 146214, 145492, 145751, 146396, 146547, 146601, 147205, 147757, 147586, 147524, 148492, 149685, 150083, 150565, 152475, 155262, 157828, 161110, 166811, 174323, 181378, 187127, 192156, 196045, 197503, 196674, 194901, 192367, 188190, 182715, 177471, 172863, 167987, 162778, 158342, 155099, 152420, 150133, 148620, 147507, 145913, 143966, 142503, 141517, 140507, 139919, 140481, 141436, 141315, 140146, 139059, 138068, 136211, 133657, 131633, 130324, 128821, 127142, 126415, 126916, 127687, 128159, 128542, 128618, 127867, 126828, 126689, 127456, 127998, 127842, 127435, 126897, 126132, 125918, 127147, 129057, 129950, 129583, 129184, 129238, 129052, 128483, 128287, 128589, 128707, 128666, 129313, 130729, 131970, 132539, 132794, 132896, 132726, 132784, 133790, 135360]
54646A35360J022K41J66M08M11M16L39n25j763j718j48J043P39J32J70j39j431
54629A34723k266j453o6M43L55L40O1n34m81K44J42j046j363J14J500J268O55
54612A32636J001J224J45j033r40n71j208j837j115j3J4l10L44J222R39J32K31
54595A30861R01R56N53M21K09m25m82O92J778J506P37O81P12m1o88l12L9p34j559
54576A35805j162m83p94j148k66P30J50j125j108l8M22K21N15J235J485J525K016
54559A37980K283J486N00M29N54j50p48L6J244J222N25O93J350J076J42j61M1
54542A48502o8Q9J285K243J302n98j239n94l54q28j002r65j594k327j847n13K58
54525A41750L55N13L04r55k141j779o81n21o72O12K611K878J214j76l55m12o30
$$ y = [135360, 136382, 136623, 136789, 137197, 137608, 138024, 138363, 137838, 136075, 134357, 134209, 135252, 135991, 136123, 136293, 136154, 134723, 132457, 131004, 130938, 131381, 131736, 132076, 132137, 131603, 131122, 131366, 131508, 130462, 129099, 129213, 130713, 131981, 132636, 133637, 134861, 135006, 133973, 133033, 132462, 131254, 129417, 128302, 128289, 128303, 127993, 128337, 129559, 130498, 130630, 130861, 131762, 132718, 133271, 133692, 133901, 133476, 132994, 133686, 135464, 136970, 137707, 138388, 139100, 139059, 138371, 138059, 138098, 137364, 135805, 134643, 134160, 133366, 132218, 131952, 132682, 132832, 131707, 130599, 130561, 130983, 131204, 131719, 132954, 134439, 135964, 137980, 140263, 141749, 142249, 142678, 143232, 143082, 142334, 142370, 143614, 144836, 145361, 146054, 147404, 148480, 148622, 148461, 148502, 148434, 148523, 149808, 152051, 153353, 152755, 151516, 150922, 150568, 149740, 148738, 147773, 146179, 143852, 142005, 141492, 141750, 142105, 142618, 142922, 141967, 139826, 138047, 137366, 136845, 136173, 136785, 139396, 142274, 143488, 143312, 142957, 142545, 141915]
54508A41915J05J643K142R20n54j099j119j074o43J32N78N89O45O67K88k1L51
54491A45465P92M19j53K06J035J088N73M96M99m36j643j515k45N16M07M82Q72
54474A48858O87J69M75J401J568R85J144K382L276K968K094J213J79p39q62m26
54458A65372l43o36o54n78j086j757j526n29J65L19L81P6j005j986j737q44o67
54441A52965r55m94M46N32k10n94n32q68j331q92Q4L26l8J09N69K77k79M15K033
54422A51563K696K033J532J778J765J125O55M47k50j137j052j27M22N60J187J766
54406A64963Q15j188k031j168k85j77K42J277J503L47p37n88J88Q04J358J652
54390A66975R61l96j101r22r19j232p73N04J136N84J05N77J300J603J837K252
$$ y = [141915, 142020, 143663, 145805, 146725, 146171, 145072, 143953, 142879, 142236, 142368, 142946, 143535, 144180, 144847, 145135, 145114, 145465, 146257, 146676, 146523, 146729, 147764, 148852, 149425, 149921, 150420, 149984, 148341, 146826, 146581, 147097, 147504, 147986, 148858, 149545, 149714, 150189, 151590, 153158, 154143, 155287, 157669, 160945, 163913, 166007, 167220, 167399, 166660, 165798, 165372, 165029, 164393, 163739, 163161, 162075, 160318, 158792, 158263, 158428, 158747, 159128, 159204, 158199, 156213, 154476, 153632, 152965, 152010, 151516, 151962, 152494, 152284, 151690, 151158, 150290, 148959, 148067, 148151, 148477, 148439, 148548, 149117, 149394, 149115, 149530, 151563, 154259, 156292, 157824, 159602, 161367, 162492, 163147, 163594, 163344, 162207, 161155, 161028, 161450, 162010, 163197, 164963, 165778, 164590, 162559, 161391, 161106, 160929, 161171, 162448, 163951, 164298, 163561, 162973, 163161, 163965, 165323, 166975, 167936, 167540, 166439, 165517, 164598, 163366, 162593, 163097, 164233, 164817, 164922, 165499, 166799, 168402, 170239, 172491]
54374A72491K551K942L933M930M747L661L026K807J664m16j855k092k174k484
54360A93731k203j394j209j597j237j70p3j295k179j961j797k185k004j054r19
54345A72454k108k839j979q73p77q43j00N59J16o75p39m71n67n26K79J306J795
54328A64012J866J695R38k21p79m96l44p47q82l61L0m6J20N23N6j310j893r14
54310A61247J29j21q99r70o03n12l98J39N47M35M44Q95R07r0j167j283o83%P96
54291A58813J649J862J218N58M62N02L74N11R54J050P56Q30J182P17o32j480j219
54274A68107q93j046o70O76J619J104Q0j73N0n3k26J30P92J331J819K131J798
54257A76576J173J357K307K577J645Q28J019J308P74o0o00j357k627l541l497
$$ y = [172491, 175042, 177984, 181917, 186847, 191594, 195255, 198281, 201088, 202752, 202336, 200481, 198389, 196215, 193731, 191528, 190134, 188925, 187328, 186091, 185921, 185848, 184553, 182374, 180413, 178616, 176431, 174427, 173373, 172454, 170346, 167507, 165528, 164655, 163878, 163035, 162935, 163494, 163610, 162935, 162196, 161725, 161158, 160632, 160911, 162217, 164012, 165878, 167573, 168511, 168290, 167511, 167015, 166671, 165924, 165042, 164681, 164711, 164665, 164785, 165308, 165364, 164054, 162161, 161247, 161376, 161255, 160356, 159386, 158783, 158271, 157873, 158012, 158559, 158994, 159438, 160333, 161240, 161150, 159983, 158700, 158017, 158017, 158813, 160462, 162324, 163542, 164100, 164562, 165064, 165438, 165949, 166903, 167953, 168709, 169539, 170721, 171438, 170806, 169326, 168107, 167214, 166168, 165498, 166174, 167793, 168897, 168977, 168804, 168854, 168801, 168575, 168705, 169497, 170828, 172647, 174778, 176576, 177749, 179106, 181413, 183990, 185635, 186463, 187482, 188790, 189564, 189504, 188904, 187547, 184920, 181379, 177882]
54242A77882l076k627j535J45J044N77M7N42J327J426J143R11K75q03j242o53
54226A75383j75m47m74K72N50m59j465j170l20j11j86J15Q0r45j898j564o03k96
54208A66287m81l30n0j50j95K15L29l27o25L97J703J801J071P45P01R5o61n37
54190A69988J02m1j022j622j251o21m88p23o30L48J911K814K128P15K56Q31R54
54173A73649K29k0O72Q74k43j422j525j274j405j157q2N22k89j322j309r95j417
54156A63486j765r97K9R9j33M73J282J099M31L73M94qj71J321L501M272L554L043
54138A80383L291L278K608K079K068K023J518N93p22k074k564j922j209j198j067
54123A87085J34J729K606L074L983M997N253M791L858J912j089l552m162l826
$$ y = [177882, 174806, 172179, 170644, 170789, 171833, 172410, 172457, 172999, 174326, 175752, 176895, 177806, 178081, 177278, 176036, 175383, 175208, 174761, 174287, 174559, 175109, 174650, 173185, 172015, 171695, 171584, 171398, 171513, 171593, 170648, 168750, 167186, 166583, 166287, 165806, 165476, 165426, 165276, 165081, 165296, 165625, 165298, 164673, 165070, 166773, 168574, 169645, 170390, 171091, 171186, 170525, 169988, 170090, 170049, 169027, 167405, 166154, 165533, 165045, 164322, 163692, 164040, 165951, 168765, 170893, 171608, 171864, 172695, 173649, 173878, 173858, 174530, 175404, 175161, 173739, 172214, 170940, 169535, 168378, 168296, 168818, 168529, 167207, 165898, 164903, 163486, 161721, 160724, 160753, 160852, 160719, 161192, 162474, 163573, 164004, 164377, 164871, 164863, 164692, 166013, 169514, 173786, 177340, 180383, 183674, 186952, 189560, 191639, 193707, 195730, 197248, 197841, 197119, 195045, 192481, 190559, 189350, 188152, 187085, 187219, 188948, 191554, 194628, 198611, 203608, 208861, 213652, 217510, 219422, 218333, 214781, 210619, 206793]
54109B06793l961m043k859j076l93q47j193j232j711k395k332j565q51j69P19
54094A82885R96m9j270j112j35j7o79o51J54L56l17o14J0P07R49J094J152O47
54076A84106j05j17P11J467J676J640J498J125P59O56M32j67m71L9N93L30j91
54059A93981r2J50k40n98Q0J083J027L04L83J233J511J022Q96J492K052K345K823
54042B09452L263L020K550K977M238N240N667O030O257N886N413N699O291O019
54028B78002N020M415M286L765K871K420K271J595O93O66J314J225J4j327k312
54013C04918l393m450m689m277m380n289o003n898n381m804m086l456l253l077
53999B42482k403j765j950k396j942q55m24p95r26m85j8O15K041L744M503M556
$$ y = [206793, 202832, 198789, 195930, 194854, 194461, 193614, 192421, 191189, 189478, 187083, 184751, 183186, 182335, 182166, 182885, 183881, 183832, 182562, 181450, 181315, 181298, 180619, 179968, 180122, 180478, 180161, 179547, 179557, 180264, 181213, 182307, 183459, 184106, 184001, 183884, 184595, 186062, 187738, 189378, 190876, 192001, 192760, 193416, 193848, 193681, 193210, 193249, 193842, 194172, 193981, 193889, 194039, 193799, 193201, 193281, 194364, 195391, 195695, 196078, 197311, 198822, 199844, 200740, 202232, 204284, 206629, 209452, 212715, 215735, 218285, 221262, 225500, 230740, 236407, 242437, 248694, 254580, 259993, 265692, 271983, 278002, 283022, 287437, 291723, 295488, 298359, 300779, 303050, 304645, 305338, 306004, 307318, 308543, 308557, 307230, 304918, 301525, 297075, 292386, 288109, 283729, 278440, 272437, 266539, 261158, 256354, 252268, 248812, 245559, 242482, 240079, 238314, 236364, 233968, 232026, 231171, 230747, 229952, 229026, 228541, 228523, 229138, 231179, 234923, 239426, 243982]
53983B43982N470P501Q754P384L471j467n618p630p522o774o549o280n102l684
53969B25936l109k810j651k64j11q16o89L73R29O68P26J330J446R13P29J030R35
53952B25565M88O68J313J231N25O37J811K705K778K910L366L284K597K342K697
53937B54917K755K504K886L660L462K349J987K766L134K398J830K285K956L312
53923B93201L990M974N012L864L045L478M318M955O029P621Q548Q431Q407Q801
53909C74674Q233O171M191L399K720J129l95q17j019k136l435l623l037k845l167
53894C80043l426l676m244m854n191n608o394p142p506p679p579o765n575n049
53880B99355n183m798l620k919l340l803l406k812k725k652k217k247l212m026
$$ y = [243982, 249452, 256953, 265707, 273091, 276562, 275095, 269477, 261847, 254325, 247551, 241002, 234722, 229620, 225936, 222827, 220017, 218366, 218102, 217991, 217175, 216486, 216859, 217788, 218456, 219182, 220512, 221958, 222871, 223600, 224630, 225565, 226053, 226721, 228034, 229265, 229790, 230427, 232238, 234943, 237721, 240631, 243997, 247281, 249878, 252220, 254917, 257672, 260176, 263062, 266722, 270184, 272533, 274520, 277286, 280420, 282818, 284648, 286933, 289889, 293201, 297191, 302165, 307177, 311041, 314086, 317564, 321882, 326837, 332866, 340487, 349035, 357466, 365873, 374674, 382907, 389078, 393269, 396668, 399388, 400517, 400122, 399305, 398286, 396150, 392715, 389092, 386055, 383210, 380043, 376617, 372941, 368697, 363843, 358652, 353044, 346650, 339508, 332002, 324323, 316744, 309979, 304404, 299355, 294172, 289374, 285754, 282835, 279495, 275692, 272286, 269474, 266749, 264097, 261880, 259633, 256421, 252395]
53866B52395l562k327j454j197j317j832k486k573k132k127k741k806j742o28
53852B23471m83q38r64j085j407j289m46L04L54J79O1n54j591j727l84J087J349
53835B16037Q77P27Q23O31L27J96l9m44n15l44p04j338q31R49K068J336M8k69
53817B19535n9j70M2J265K458K444J955K269K965K951K604K985L801M053L974
53802B53072M513N463N808N440N098M976M738M510M603M760M650M582M693M270
53788C21176K930J634J364J570J117o7j406k854m419n360n168m633m666m873m472
53773B91873l840l785m071l941l511l308l143k673k444k994l589l151j945j141
53759B48337j162j620k321l098l223k212p85kJ12R4j46r56j870k158j909j660
$$ y = [252395, 248833, 246506, 245052, 243855, 242538, 240706, 238220, 235647, 233515, 231388, 228647, 225841, 224099, 223471, 222988, 222150, 221186, 220101, 218694, 217405, 216959, 217263, 217617, 217796, 217857, 217303, 215712, 213985, 213601, 214688, 216037, 216914, 217641, 218464, 219095, 219422, 219618, 219579, 219135, 218620, 218276, 217572, 216234, 215403, 216352, 218420, 219756, 219804, 219535, 219476, 219306, 219348, 220613, 223071, 225515, 227470, 229739, 232704, 235655, 238259, 241244, 245045, 249098, 253072, 257585, 263048, 268856, 274296, 279394, 284370, 289108, 293618, 298221, 302981, 307631, 312213, 316906, 321176, 324106, 325740, 327104, 328674, 329791, 329724, 328318, 325464, 321045, 315685, 310517, 305884, 301218, 296345, 291873, 288033, 284248, 280177, 276236, 272725, 269417, 266274, 263601, 261157, 258163, 254574, 251423, 249478, 248337, 247175, 245555, 243234, 240136, 236913, 234701, 233916, 233914, 234026, 234120, 233974, 233018, 231148, 228990, 227081, 225421]
53743B25421j349o53J93P55J101J350J179N70K87P74J351J347J160J269J128K08
53727B36091p46p02J46R54J603K379K917K649J858J318J269J504J830J902J414
53712B56386R43J543K852L047J506jJ22J082J454J667K893M688N619N470N126
53697B94397M842M202L269K409J555P30N39J029J077J34o50l32M3p00j655j341
53681C09548l25k04q66r15k21J56J23M76J027P81j54p02p23r71j396j226o41n77
53663C03190r75q95k69M9o1R5N29N35J72K16O19N34j11m10L3O51R82J073R33O51
53643C07541Q10J656K300J940J381J928L295M120M093L957L752K841J515Q18Q38
53628C42785P13L02K65N91N84L53P25J585J829J220Q17J315K186K667K615K208
$$ y = [225421, 224072, 223419, 223612, 224367, 225468, 226818, 227997, 228567, 228854, 229628, 230979, 232326, 233486, 234755, 235883, 236091, 235345, 234643, 234789, 235743, 237346, 239725, 242642, 245291, 247149, 248467, 249736, 251240, 253070, 254972, 256386, 257329, 258872, 261724, 264771, 266277, 266276, 266398, 267480, 268934, 270601, 273494, 278182, 283801, 289271, 294397, 299239, 303441, 306710, 309119, 310674, 311404, 311943, 312972, 314049, 314183, 313533, 313201, 313244, 312544, 310889, 309548, 309223, 309019, 308153, 307238, 307017, 307173, 307296, 307772, 308799, 309580, 309426, 308724, 308001, 307030, 305634, 304408, 303767, 303190, 302215, 301320, 301051, 301100, 301039, 301134, 301663, 302198, 302370, 302586, 303205, 303739, 303628, 303218, 303251, 303902, 304884, 305957, 306890, 307541, 308351, 310007, 312307, 314247, 315628, 317556, 320851, 324971, 329064, 333021, 336773, 339614, 341129, 341947, 342785, 343498, 343800, 344065, 344656, 345240, 345593, 346318, 347903, 349732, 350952, 351769, 353084, 355270, 357937, 360552, 362760]
53612C62760J761J801K443K965K821K620L032L535L408L178L588L938L203K060
53598D03113J821K002J141l98q15N5M31m13j134p76j61j76n04p36j104j562j595
53581C99189j404j898l021l618l233k667k419k081j557j419j640j515j087j180
53567C70450j803k022j678j564j676j063K34Q71M25P3N03Q90O62M86O67L84n53
53550C65286q59J68J307J367J016J380K015J794Q47K79O09J524K689L773M261
53535C87456M057L806L973M209M161M217M835N853P009Q403R897J0828J0966J1028
53521D80698J1621J2340J2524J2253J2002J1903J1965J2544J3960J5955J7900
53510F25665J9339K0158K0656K1455K2778K3952K4130K3479K2780K2056K0586
$$ y = [362760, 364521, 366322, 368765, 371730, 374551, 377171, 380203, 383738, 387146, 390324, 393912, 397850, 401053, 403113, 404934, 406936, 408077, 407679, 406864, 406919, 407350, 406937, 405803, 405027, 404866, 404690, 404186, 403450, 402346, 400784, 399189, 397785, 395887, 392866, 389248, 386015, 383348, 380929, 378848, 377291, 375872, 374232, 372717, 371630, 370450, 368647, 366625, 364947, 363383, 361707, 360644, 360878, 361749, 362174, 362247, 362750, 363640, 364302, 364788, 365455, 365839, 365286, 364427, 364595, 365902, 367269, 368285, 369665, 371680, 373474, 374321, 374600, 375209, 376733, 379422, 383195, 387456, 391513, 395319, 399292, 403501, 407662, 411879, 416714, 422567, 429576, 437979, 447876, 458704, 469670, 480698, 492319, 504659, 517183, 529436, 541438, 553341, 565306, 577850, 591810, 607765, 625665, 645004, 665162, 685818, 707273, 730051, 754003, 778133, 801612, 824392, 846448, 867034]
53499H67034J8329J6265J5140J4808J4971J5510J5942J5636J4902J4785J5479
53488A038801J5996J5759J5462J5815J6442J6607J6243J5702J5181J4840J4866
53477A211714J5062J4899J4223J3312J2178J0479Q210N687K921j54k907m541n406
53464A295677o732q895j1052j2615j3812j4598j4261j2737j1265j1118j2386j4357
53452A151849j6328j7787j8529j8844j8974j8464j6907j5140j4529j5053j5349
53441I65945j4741j3875j3129j1806r460o793m621k968j654q11l41K37J014J575
53427H88572J928K598L663M590N250O115P319Q573J0028J2095J4370J5979J7061
53414I98141J8583K0471K1455K1096K0556K0933K2068K3446K4853K5818K5796
$$ y = [867034, 885363, 901628, 916768, 931576, 946547, 962057, 977999, 993635, 1008537, 1023322, 1038801, 1054797, 1070556, 1086018, 1101833, 1118275, 1134882, 1151125, 1166827, 1182008, 1196848, 1211714, 1226776, 1241675, 1255898, 1269210, 1281388, 1291867, 1300077, 1305764, 1308685, 1308531, 1305624, 1301083, 1295677, 1288945, 1280050, 1268998, 1256383, 1242571, 1227973, 1213712, 1200975, 1189710, 1178592, 1166206, 1151849, 1135521, 1117734, 1099205, 1080361, 1061387, 1042923, 1026016, 1010876, 996347, 981294, 965945, 951204, 937329, 924200, 912394, 902934, 896141, 891520, 888552, 886898, 886087, 885746, 885983, 886997, 888572, 890500, 893098, 896761, 901351, 906601, 912716, 920035, 928608, 938636, 950731, 965101, 981080, 998141, 1016724, 1037195, 1058650, 1079746, 1100302, 1121235, 1143303, 1166749, 1191602, 1217420, 1243216]
53403A243216K5454K6364K8938L1964L4574L7173L9929M2062M3301M4532M6143
53392A643650M7214M7276M7364M8300M9256M9156M8327M7584M6795M5510M4042
53381B164474M2857M1581L9610L7048L4247L1113K7501K3598J9370J4519R404
53370B485322N018J555j996o350j1194j6424k2600k9500l5527l9579m2309m4692
53358B241724m6556m7503m8056m8761m9149m8622m7449m5954m3755m0795l8097
53347A737027l6479l5409l4168l3180l3162l3811l4357l4602l4425l3112l0297
53336A364025k6872k3975k1703j9681j8019j6803j5347j3017j0242p916o432n968
53324A178050o883q972j1081j2278j2766j2999j2729j1691j0364r289q372p570
$$ y = [1243216, 1268670, 1295034, 1323972, 1355936, 1390510, 1427683, 1467612, 1509674, 1552975, 1597507, 1643650, 1690864, 1738140, 1785504, 1833804, 1883060, 1932216, 1980543, 2028127, 2074922, 2120432, 2164474, 2207331, 2248912, 2288522, 2325570, 2359817, 2390930, 2418431, 2442029, 2461399, 2475918, 2485322, 2490340, 2491895, 2489899, 2483549, 2472355, 2455931, 2433331, 2403831, 2368304, 2328725, 2286416, 2241724, 2195168, 2147665, 2099609, 2050848, 2001699, 1953077, 1905628, 1859674, 1815919, 1775124, 1737027, 1700548, 1665139, 1630971, 1597791, 1564629, 1530818, 1496461, 1461859, 1427434, 1394322, 1364025, 1337153, 1313178, 1291475, 1271794, 1253775, 1236972, 1221625, 1208608, 1198366, 1190450, 1184018, 1178050, 1171167, 1162195, 1151114, 1138836, 1126070, 1113071, 1100342, 1088651, 1078287, 1068998, 1060626, 1053056]
53312A053056p264p288o574m612k324p23L55J379K128K475L083M346N616O472
53298A050125P710R956J2323J3676J4363J5509J7273J8965K0286K1405K2311K2977
53286A246879K3598K4003K3500K1984K0309J8991J7465J5354J3206J1229Q540
53275A445058M753J065j430l361n835q622j0856j2634j4562j6522j8144j9705
53263A339205k1509k3062k3923k4501k5137k5414k5275k5638k6810k7526k6736
53252A063674k5176k3943k2875k1651k1067k1559k1805k0639j9167j9090j9954
53241H26748k0063j9246j8582j8122j6968j5226j3932j3295j2716j2162j1910
53230F54526j1356r738p638o201n369m461l929m721o352p457p928q759r977j0598
$$ y = [1053056, 1045792, 1038504, 1031930, 1027318, 1024994, 1024271, 1024626, 1026005, 1028133, 1030608, 1033691, 1038037, 1043653, 1050125, 1057835, 1067791, 1080114, 1093790, 1108153, 1123662, 1140935, 1159900, 1180186, 1201591, 1223902, 1246879, 1270477, 1294480, 1317980, 1339964, 1360273, 1379264, 1396729, 1412083, 1425289, 1436518, 1445058, 1449811, 1450876, 1449446, 1446085, 1440250, 1431628, 1420772, 1408138, 1393576, 1377054, 1358910, 1339205, 1317696, 1294634, 1270711, 1246210, 1221073, 1195659, 1170384, 1144746, 1117936, 1090410, 1063674, 1038498, 1014555, 991680, 970029, 948962, 927403, 905598, 884959, 865792, 846702, 826748, 806685, 787439, 768857, 750735, 733767, 718541, 704609, 691314, 678598, 666436, 654526, 643170, 633432, 625794, 619593, 614224, 609763, 605834, 601113, 594761, 587304, 579376, 570617, 560640, 550042]
53216E50042j0492j0580j1187j1724j1964j2148j1978j0900r271p944o971n966
53204D28917n330n654o315o263n737n747o301o729p188q056q423p217n449n153
53190C39355o317o956o263n455n299n048m270l753l863l733k810j740j210j093
53176B81545j138j331j364j013j004k060l230k842j218n03j527k696k517j456
53162B57646n80j5L77K44m25q45n99k55l23n24n77o81q71q93r35j445k021j719
53144B45559o59m9l69p75o14k36Q1O58J419J654J276J075J338J354P76K87M31
53127B53206R17J461K146K637K269J362J106J736K097J575J071J449K238K613
53113B77883K502K053J077k44j167j460j698k066k011j558j589k213k268j281
$$ y = [550042, 539550, 528970, 517783, 506059, 494095, 481947, 469969, 459069, 449798, 441854, 434883, 428917, 423587, 417933, 411618, 405355, 399618, 393871, 387570, 380841, 373653, 365597, 357174, 349957, 344508, 339355, 333038, 326082, 319819, 314364, 309065, 304017, 299747, 295994, 292131, 288398, 285588, 283848, 282638, 281545, 280407, 279076, 277712, 276699, 275695, 273635, 270405, 267563, 266345, 265842, 264315, 261619, 259102, 257646, 257066, 257051, 257428, 257672, 257247, 256402, 255803, 255548, 255225, 254701, 254124, 253443, 252572, 251679, 250744, 249299, 247278, 245559, 244900, 244851, 244482, 243707, 243093, 242857, 242938, 243596, 245015, 246669, 247945, 249020, 250358, 251712, 252488, 252775, 253206, 254123, 255584, 257730, 260367, 262636, 263998, 265104, 266840, 268937, 270512, 271583, 273032, 275270, 277883, 280385, 282438, 283515, 283271, 282104, 280644, 278946, 276880, 274869, 273311, 271722, 269509, 267241, 265960]
53099B65960m89q67j510j263p26j134k121k202j068J06M29J54j90n23q60j049
53083B52647j059j060j133j144q71j70Q00J391R51l47j486j653r90k16J05j69
53067B45596p86j193r88m09m6j07l60o69j056j299j089n14R7P24J415J774J415
53050B42505P71O30J008J247J081P26J71o26j052m62N46O81j81q47o08m8K01K86
53032B46029M13L84K16L29O40M95k58r14r58o40k60K88R37J253J069P00L35q1
53014B49977l91m07m33q03j022m33N13P84M57N18J052J041K29l72j20L69M79M42
52996B51880M92L42n0k13n7m9j83J41R35J459J431J318J190O33p7k2P94J291J054
52977B62309Q12Q48M78l77o71J18J168J742K054K182J653P75P68J837K599K241
$$ y = [265960, 265471, 264604, 263094, 261831, 261105, 259971, 257850, 255648, 254580, 254686, 255115, 255269, 255079, 254556, 253696, 252647, 251588, 250528, 249395, 248251, 247380, 247210, 248010, 249401, 250352, 250005, 248519, 246866, 245876, 245660, 245765, 245596, 244810, 243617, 242629, 242220, 242174, 242067, 241707, 241038, 239982, 238683, 237594, 237080, 237177, 237901, 239316, 241090, 242505, 243276, 243906, 244914, 246161, 247242, 247968, 248139, 247513, 246461, 245999, 246545, 247226, 247045, 246198, 245590, 245542, 245743, 246029, 246442, 246826, 247042, 247371, 248011, 248506, 248248, 247334, 246376, 245736, 245476, 245764, 246701, 247954, 249023, 249723, 250058, 249977, 249586, 249179, 248746, 247943, 246921, 246488, 247001, 247785, 248242, 248760, 249812, 250853, 251082, 250710, 250590, 250959, 251438, 251880, 252372, 252714, 252664, 252451, 252394, 252345, 252162, 252303, 253238, 254697, 256128, 257446, 258636, 259269, 259192, 259170, 259964, 261255, 262309, 263121, 263969, 264447, 264070, 263399, 263517, 264685, 266427, 268481, 270663, 272316, 273091, 273859, 275696, 278295, 280536]
52961B80536J621J420Q59n80j771j654j004j086j691j911j753j679j432p29k26
52946B68920n09q90m74L18L91l44j115j440j273n77L40P19L63N4K50K82l65r94
52928B63656q54l93k93l07m2K2m48n79M58J870K262J581P97L22j7k9N07R40M65
52909B69918o17j382j601j595j335p53m69j033j839j814q80K25J168K033K540
52894B62566K313J719J452J543J485J087M63l81j242j532j119p97j069j170k40
52879B65078J133J651J084K63k64m86k25P25J949K803L250L508L322K438J406
52864B87635Q83N76k05j229j700j633j824k483k903k621k042j775j936k229k297
52849B64217k025j703j727k057k256k205k141j970j322n25m90j229j618j115n79
$$ y = [280536, 282157, 283577, 284436, 283856, 282085, 280431, 279427, 278341, 276650, 274739, 272986, 271307, 269875, 269146, 268920, 268411, 267521, 267047, 267365, 267756, 267412, 266297, 264857, 263584, 263007, 263347, 264066, 264429, 264483, 264733, 265015, 264650, 263656, 262802, 262409, 262116, 261809, 261767, 261789, 261341, 260762, 261220, 263090, 265352, 266933, 267730, 268052, 268035, 268006, 268513, 269453, 269918, 269301, 267919, 266318, 264723, 263388, 262635, 262166, 261133, 259294, 257480, 256600, 256825, 257993, 260026, 262566, 264879, 266598, 268050, 269593, 271078, 272165, 272628, 272247, 271005, 269473, 268354, 267557, 266488, 265318, 265078, 266211, 267862, 268946, 269209, 268945, 268459, 268234, 268959, 270908, 273711, 276961, 280469, 283791, 286229, 287635, 288518, 289094, 288889, 287660, 285960, 284327, 282503, 280020, 277117, 274496, 272454, 270679, 268743, 266514, 264217, 262192, 260489, 258762, 256705, 254449, 252244, 250103, 248133, 246811, 246286, 245796, 244567, 242949, 241834, 241255]
52834B41255o32m85N64J703J879J491J461J530Q89j78p50p92q98r38m17K42J49
52817B46073n39p75k16N11R80J378J840K266K676K918K372P57j129k294k757l086
52801B50975l249k905k334k038j812j174l58J1j64o91j612k628k706j341L98J186
52785B29558J127J085J072O89L72P76J399J274N90J53j92j055j836j301L11J407
52769B35429J231M60k42p56p45J00R69O74m59q66k9J037J601J961K192J752P63
52752B45072K67O20R49O87M72R41J691K006J774J260P72P41J290J648R45l60q92
52735B59883k57N77R01R73R80N86l7m6P12J244Q89J67l72j011j923k351j587j16
52717B59212R43J035L58o50j495j772j555j300j154q02j38M79Q13J017J129Q64
$$ y = [241255, 240623, 240138, 240702, 242405, 244284, 245775, 247236, 248766, 249655, 249477, 248727, 247935, 247037, 246099, 245682, 245924, 246073, 245534, 244759, 244543, 245054, 246034, 247412, 249252, 251518, 254194, 257112, 259484, 260241, 259112, 256818, 254061, 250975, 247726, 244821, 242487, 240449, 238637, 237463, 237105, 237116, 236952, 236261, 234649, 232021, 229315, 227974, 228372, 229558, 230685, 231770, 232842, 233531, 233903, 234679, 236078, 237352, 237942, 238095, 237903, 236848, 235012, 233711, 234022, 235429, 236660, 237120, 236878, 236122, 235377, 235477, 236446, 237120, 236661, 235795, 235766, 236803, 238404, 240365, 242557, 244309, 245072, 245339, 245959, 246908, 247595, 248067, 249008, 250699, 252705, 254479, 255739, 256511, 257252, 258542, 260190, 261135, 260775, 259883, 259626, 260203, 261104, 262077, 263057, 263643, 263606, 263560, 264272, 265516, 266405, 266572, 266200, 265189, 263266, 260915, 259328, 259212, 260155, 261190, 261548, 260898, 259403, 257631, 256076, 254776, 253622, 252820, 252682, 253161, 253974, 254991, 256120, 256984]
52701B56984J46o14r93r58p58o86q93j102p15L39J259J386J090J021J006O16K47
52684B57375N02R29N94l13p71o38o70r26o25K42O56L29K70J076J879J738R82M38
52666B63067J97j20m40l30L48J301K005J999J392J028J594K669L328L449L538
52651B85025L490K576P16j319k960m036m082k693p19K43j34o43n58n84j307k007
52635B71008j791q86l9M84P85R72J430K574L892M102K819J141R4n40j279j852
52619B82914j870j699j755j650r27q5K3n54j023r65o27k76J48P58J520K204K439
52602B78575K041J396J162J483J828J652Q39m52j845k696k579j872j287q72j30
52587B77243R17J642J793J716J533R62J60j68K33P77R11P01L87J10J12M60N57
$$ y = [256984, 257130, 256516, 255523, 254565, 253807, 253121, 252228, 251126, 250411, 250750, 252009, 253395, 254485, 255506, 256512, 257128, 257375, 257877, 258806, 259400, 259087, 258316, 257678, 257008, 256082, 255457, 255699, 256355, 256684, 256954, 258030, 259909, 261647, 262629, 263067, 263264, 263144, 262704, 262374, 262722, 264023, 266028, 268027, 269419, 270447, 272041, 274710, 278038, 281487, 285025, 288515, 291091, 291807, 290488, 287528, 283492, 279410, 276717, 275998, 276241, 276107, 275464, 274906, 274322, 273015, 271008, 269217, 268331, 268292, 268776, 269561, 270533, 271963, 274537, 278429, 282531, 285350, 286491, 286585, 286045, 284766, 282914, 281044, 279345, 277590, 275940, 275013, 274928, 274951, 274397, 273374, 272409, 271782, 271506, 271654, 272412, 273932, 276136, 278575, 280616, 282012, 283174, 284657, 286485, 288137, 288976, 288524, 286679, 283983, 281404, 279532, 278245, 277373, 277243, 278160, 279802, 281595, 283311, 284844, 285806, 285966, 285798, 286031, 286808, 287719, 288420, 288807, 288917, 289029, 289489, 290046]
52570B90046k14j251j306l80J17n30j252q42L92J277J283O35l83j482k219k344
52554B81547k015j375m96K17J88m03o59j84M12N79N38N99N10K4n15o85n60m46
52536B77276m24m56m79k72L38J051J421J482J515J405J027R20J529K060J397o
52520B89784o16k08q5o81p22N09J844K161K121K849M033M676M735M742M497L390
52504C23029J551k76j720k823l561l968m327m610m268l137j997j641j878k027
52490B88347j839j434q73k92R5M76J295K202K025L47j613k317j520p5J169J766
52474B87759J647J252J167J251Q31K7k4J207K763L486L395L153L023K970L029
52459C16936K936K132O42p78j818k980m347n044m619l852l440k929j802o65k93
$$ y = [290046, 289832, 288581, 287275, 286895, 287012, 286482, 285230, 284388, 284780, 286057, 287340, 287975, 287592, 286110, 283891, 281547, 279532, 278157, 277661, 277878, 278066, 277663, 277004, 276820, 277232, 277811, 278349, 278948, 279458, 279482, 278967, 278282, 277722, 277276, 276852, 276396, 275917, 275645, 275983, 277034, 278455, 279937, 281452, 282857, 283884, 284804, 286333, 288393, 289790, 289784, 289168, 288960, 288875, 288194, 287472, 287981, 289825, 291986, 294107, 296956, 300989, 305665, 310400, 315142, 319639, 323029, 324580, 324304, 322584, 319761, 316200, 312232, 307905, 303295, 299027, 295890, 293893, 292252, 290374, 288347, 286508, 285074, 284201, 283909, 284004, 284480, 285775, 287977, 290002, 290349, 288736, 286419, 284899, 284824, 285993, 287759, 289406, 290658, 291825, 293076, 293907, 293934, 293910, 295117, 297880, 301366, 304761, 307914, 310937, 313907, 316936, 319872, 322004, 322646, 321868, 320050, 317070, 312723, 307679, 303060, 299208, 295768, 292839, 291037, 290372, 290079]
52444B90079m05l87m22r00j401j272o65j11L20O88O82K51k4R5j0n92q02r3N86
52425B85617J74p77r54j43R06J797K393K180R92j16pR35J533J650K026K726L216
52408C04148L711N139P628J0223J2055J2767J1903Q942M239r18n305q348r898
52395C56286j0129r529q395o581m211k231j501j711j902j738j533j402j180q61
52381C03382m15M66J746K623K475J867J891K800M008M952N306M791L635K744K666
52366C44937K812K429J749J351R89J39q43j194j051j145j508j498r26j55O83J679
52350C48448K421K282J367N09L50Q97J748K277J989J244J093J879K703K870K986
52335C75063L724M508M508M200M607N622O380O780P358Q076Q617R433J1171J3292
$$ y = [290079, 289674, 289287, 288865, 287965, 286564, 285292, 284627, 284516, 284836, 285524, 286206, 286457, 286433, 286528, 286518, 285926, 285124, 285031, 285617, 285791, 285014, 284060, 283917, 284823, 286620, 289013, 291193, 292185, 292069, 292062, 292997, 294530, 296180, 298206, 300932, 304148, 307859, 312998, 320626, 330849, 342904, 355671, 367574, 376516, 380755, 379837, 374532, 366184, 356286, 346157, 336628, 328233, 321652, 317441, 315210, 313709, 311998, 310096, 308358, 306825, 305423, 304243, 303382, 302967, 303433, 305179, 307802, 310277, 312144, 314035, 316835, 320843, 325795, 331101, 335892, 339527, 342271, 344937, 347749, 350178, 351927, 353278, 354267, 354406, 353563, 352369, 351318, 350173, 348665, 347167, 346241, 346086, 346769, 348448, 350869, 353151, 354518, 355027, 355377, 356274, 358022, 360299, 362288, 363532, 364625, 366504, 369207, 372077, 375063, 378787, 383295, 387803, 392003, 396610, 402232, 408612, 415392, 422750, 430826, 439443, 448876, 460047, 473339]
52321D73339J4564J4714J4404J3887J3055J2439J2711J3359J3297J2798J3245
52310F21812J4966J6743J7687J8209J8760J8990J8624J8179J8182J8427J8349
52299H18928J7614J6285J4871J4047J3635J2291R093N022J834j63j907l621m597
52286I13332m871n389o293o559n806n097n335o019o164n556m498l196j929j051
52272H45569m23N01J765K718K979K892K892L099L658M750O108P275Q383R973J1985
52257I14124J3756J5045J6287J7627J8604J8776J8022J6246J3598J0863Q716O711
52245A088375M009R06j464k873m235o020p752r187j0706j2274j3259j3602j3973
52232I97945j4415j4193j3372j3162j4011j4705j4197j3209j3002j3443j3423
$$ y = [473339, 487903, 502617, 517021, 530908, 543963, 556402, 569113, 582472, 595769, 608567, 621812, 636778, 653521, 671208, 689417, 708177, 727167, 745791, 763970, 782152, 800579, 818928, 836542, 852827, 867698, 881745, 895380, 907671, 916764, 921786, 923620, 923457, 921550, 917929, 913332, 908461, 903072, 896779, 890220, 884414, 879317, 873982, 867963, 861799, 856243, 851745, 848549, 846620, 845569, 845146, 845647, 847412, 850130, 853109, 856001, 858893, 861992, 865650, 870400, 876508, 883783, 892166, 902139, 914124, 927880, 942925, 959212, 976839, 995443, 1014219, 1032241, 1048487, 1062085, 1072948, 1081664, 1088375, 1092384, 1093290, 1091826, 1088953, 1084718, 1078698, 1070946, 1061759, 1051053, 1038779, 1025520, 1011918, 997945, 983530, 969337, 955965, 942803, 928792, 914087, 899890, 886681, 873679, 860236, 846813]
52221H46813j2461j0964r285p518n916m786m064l426k645j578j72J225J958J752
52207G88933J012K35m15q64r20n55J00J080K522M147N371O041O476O791O789O556
52191H33299O454O360N657M160K400Q04q10k709m788o812q557r566r437q471p499
52176H00485o905o339n462m444l647l265l282l316k711j274K83J231J824K656
52162G65834L524L890M040M568N003M277K562J221Q67P54L52R4L02O21R43J741
52146H00593K975L807L865L658L361K339M48j346k244k510k455j652R8K026L402
52131H16365M497N870P489R180J1134J3312J5148J6489J8074K0460K3114K5169
52119I86301K6339K6566K5688K4080K2807K2416K2199K1334J9989J8662J7209
$$ y = [846813, 834352, 823388, 814103, 806585, 800669, 795883, 791819, 788393, 785748, 784170, 783998, 785223, 787181, 788933, 789945, 790180, 789765, 788901, 787981, 787426, 787526, 788606, 791128, 795275, 800646, 806687, 813163, 819954, 826743, 833299, 839753, 846113, 851770, 855930, 858330, 859134, 858324, 855615, 850827, 844015, 835458, 825892, 816455, 807984, 800485, 793580, 787241, 781779, 777335, 773688, 770423, 767141, 763825, 761114, 759840, 760123, 761354, 763178, 765834, 769358, 773248, 777288, 781856, 786859, 791136, 793698, 794919, 795786, 796540, 796892, 796986, 797288, 797909, 798852, 800593, 803568, 807375, 811240, 814898, 818259, 820598, 821046, 819700, 817456, 814946, 812491, 810839, 810937, 812963, 816365, 820862, 826732, 834221, 843401, 854535, 867847, 882995, 899484, 917558, 938018, 961132, 986301, 1012640, 1039206, 1064894, 1088974, 1111781, 1134197, 1156396, 1177730, 1197719, 1216381, 1233590]
52108A233590J5342J3479J2250J1706J1630J2050J2734J2769J1487R361P264N233
52096A368895K661o64m387q182j1857j5085j7499j8915j9266j8653j7680j7166
52084A222202j7219j7096j6249j5002j3864j2805j1609j0395r347q388p458o606
52072A076164n564l850j548O20K307L924N758P471Q877J0340J2028J3443J4294
52059A144264J5098J6378J7906J9164J9879J9661J7933J4840J1503Q749O166L017
52047A314558n24l653n892p243p920q470r619j1377j2802j3122j2628j2085j1766
52034A197457j1582j1570j1799j2221j3018j4494j6356j7701j8114j8100j8110
52023A034392j7870j7085j6069j5186j4303j3247j2165j1065r664q051o780o056
$$ y = [1233590, 1248932, 1262411, 1274661, 1286367, 1297997, 1310047, 1322781, 1335550, 1347037, 1356398, 1363662, 1368895, 1371556, 1370892, 1366505, 1358323, 1346466, 1331381, 1313882, 1294967, 1275701, 1257048, 1239368, 1222202, 1204983, 1187887, 1171638, 1156636, 1142772, 1129967, 1118358, 1107963, 1098616, 1090228, 1082770, 1076164, 1070600, 1066750, 1065202, 1065822, 1068129, 1072053, 1077811, 1085282, 1094159, 1104499, 1116527, 1129970, 1144264, 1159362, 1175740, 1193646, 1212810, 1232689, 1252350, 1270283, 1285123, 1296626, 1305375, 1311541, 1314558, 1314034, 1310381, 1304489, 1297246, 1289326, 1280856, 1271237, 1259860, 1247058, 1233936, 1221308, 1209223, 1197457, 1185875, 1174305, 1162506, 1150285, 1137267, 1122773, 1106417, 1088716, 1070602, 1052502, 1034392, 1016522, 999437, 983368, 968182, 953879, 940632, 928467, 917402, 907738, 899687, 892907, 886851]
52011H86851n512n085n193n892o804q090j0262j2773j4110j3797j2928j2152j0655
51998G63598q001n394l927k986j758j055k074m350o535q438j0687j2979j4233
51985F81181j4193j3555j2787j2055j1910j2792j4058j4598j4224j3487j2414
51974E35108j0515p823m968k332J29K461M764P231R529J0693J0348R433Q906Q482
51960E81446P462O004M593L106J581J102K617N515Q746J2602J7985K4355K9772
51947G06886L2423L0895K3896J1907j347j1162j5922j7384j7226j5371j1902q287
51935G07406n722l831k060j057j649l526n836q333j1036j3501j5290j6602j7708
51922F01255j8205j7605j6301j5243j4757j4188j2763j0493q142o415n315m318
$$ y = [886851, 881339, 876254, 871061, 865169, 858365, 850275, 840013, 827240, 813130, 799333, 786405, 774253, 763598, 755597, 750203, 746276, 743290, 741532, 740477, 738403, 734053, 727518, 719080, 708393, 695414, 681181, 666988, 653433, 640646, 628591, 616681, 603889, 589831, 575233, 561009, 547522, 535108, 524593, 516770, 511802, 509470, 509599, 512060, 516824, 524055, 533584, 544277, 554625, 564058, 572964, 581446, 588908, 594912, 599505, 602611, 604192, 605294, 607911, 613426, 622172, 634774, 652759, 677114, 706886, 739309, 770204, 794100, 806007, 804660, 793498, 777576, 760192, 742966, 727595, 715693, 707406, 701684, 697853, 695793, 694736, 693087, 689561, 683725, 675392, 664356, 650855, 635565, 618963, 601255, 583050, 565445, 549144, 533901, 519144, 504956, 492193, 481700, 473558, 467143, 461828, 457510]
51910D57510l019j368O39K882M730N441N292N520O560P115N747K704o97l801o685
51895D88570r074j0502j1240j1859j1958j0613q062n764m463l277j069J989M678
51882D07356N998N988N621N997P301Q675R330R354R059Q218O626M749K970Q26
51868D98068j955m303n032m689m709n079m426k412m00O59J400K667M167N184N461
51853D84601M884L208P37j678l771o135q893j0957j1289j0174q709p600o973o674
51839D10577o258n226l730k533j892j133L24K078L345L815L548K588J295M32L40
51824D07570M24l6q82j467j650j760j853j623j041m93j59K67J037J802J900J103
51808D03139j59j309k102k446k107r73M57J420J787K104K635K899K450J551P67
$$ y = [457510, 454491, 453123, 453762, 456644, 461374, 466815, 472107, 477627, 484187, 491302, 497049, 499753, 499056, 495255, 488570, 479496, 468994, 457754, 445895, 433937, 423324, 415262, 409498, 405035, 401758, 400689, 402678, 407356, 413354, 419342, 424963, 430960, 438261, 446936, 456266, 465620, 474679, 482897, 489523, 494272, 497242, 498068, 496113, 491810, 486778, 482089, 477380, 472301, 467875, 465463, 465063, 465722, 467122, 469789, 473956, 479140, 484601, 489485, 492693, 493430, 491752, 487981, 481846, 472953, 461996, 450707, 440533, 431824, 424224, 417251, 410577, 404319, 399093, 395363, 392830, 390938, 389805, 390129, 392207, 395552, 399367, 402915, 405503, 406798, 407230, 407570, 407994, 407958, 407076, 405609, 403959, 402199, 400346, 398723, 397682, 397189, 397030, 397297, 398334, 400136, 402036, 403139, 402980, 401671, 399569, 397123, 395016, 394043, 394500, 395920, 397707, 399811, 402446, 405345, 407795, 409346, 410113]
51793D10113L01P1J0q3m35p81n61M1l3j256k689l202k836k247j631r69n70m00
51775C92843M21K317M249N178N796P417R615J0694J0210R317Q586P199M644J719
51761D80205p62k972n172o875p582p630p717q086q474q404p501o021m982n000
51747C93027n203m248k265o67j09J70Q29J554K039K619L447M113M503N120N944
51732D10873N989M610K467O61l56n36L10K140M331O167P107O421L524q01m361
51717D48546n565m915l887l014j858l96N72L66q50k262k961k370n07J983M120
51702D27002M956L927J323j668l748m501m324l531j985K95K641M032L860K423
51688D30702P91r8l59q52j820k495k385k092k168k075j289n93j030k129k581k282
$$ y = [410113, 410414, 410485, 410495, 410412, 409977, 409196, 408635, 408676, 408643, 407387, 404698, 401496, 398660, 396413, 394782, 393813, 393243, 392843, 393264, 395581, 399830, 405008, 410804, 418221, 427836, 438530, 448740, 458057, 466643, 473842, 478486, 480205, 479443, 476471, 471299, 464424, 456842, 449212, 441495, 433409, 424935, 416531, 409030, 403009, 398027, 393027, 387824, 383576, 381311, 380644, 380535, 380705, 381534, 383088, 385127, 387746, 391193, 395306, 399809, 404929, 410873, 416862, 421472, 423939, 424600, 424244, 423708, 424018, 426158, 430489, 436656, 443763, 450184, 453708, 452907, 448546, 442981, 438066, 434179, 431165, 429307, 428911, 429483, 429849, 428999, 426737, 423776, 421406, 420899, 422882, 427002, 431958, 435885, 437208, 435540, 431792, 427291, 422967, 419436, 417451, 417746, 420387, 424419, 428279, 430702, 431493, 431395, 431036, 430184, 428364, 425869, 423484, 421392, 419224, 417149, 415860, 415267, 414237, 412108, 409527, 407245]
51672D07245k126k097j221N88K322L747N827Q800J1331J2171J1370R315N936J669
51658D74877j996l877m224l757k444P9L656P833J2168J5646J6502J3467O911j518
51644E33323r838j6131j9066j8827j7099j5501j4348j3043j1152q798o462m712
51632C78346l663k762j614p78q38j048j47J501K052P87q68j471j341j501k036
51617C64619k401k452k298j862j301j179j620j950j679j132o97k87P0O6N4J056
51601C47007L251N425O643P527R198J1809J4781J7456J8692J6908J1664M600k017
51588D72944p089j0363j1374r919o996m122j925j13J602L316N199P247Q974R900
51574D57281J0041R652R088R160J0734J3337J4988J4124J1192P957O011O366R395
$$ y = [407245, 405119, 403022, 401801, 402389, 404711, 408458, 414285, 423085, 434416, 446587, 457957, 467272, 473208, 474877, 472881, 469004, 464780, 461023, 458579, 458658, 462314, 470147, 482315, 497961, 514463, 527930, 534841, 533323, 523485, 507354, 488288, 469461, 452362, 436861, 422513, 409470, 398318, 389520, 383058, 378346, 374683, 371921, 370307, 369529, 368691, 367643, 367496, 368997, 371049, 371836, 370968, 369497, 368156, 366655, 364619, 362218, 359766, 357468, 355606, 354305, 353126, 351506, 349556, 347877, 346745, 346048, 345761, 345831, 345897, 345951, 347007, 350258, 355683, 362326, 369853, 379051, 390860, 405641, 423097, 441789, 458697, 470361, 474961, 472944, 465855, 455492, 444118, 434199, 427203, 423081, 421156, 421043, 422645, 425961, 431160, 438407, 447381, 457281, 467322, 476974, 486062, 495222, 505956, 519293, 534281, 548405, 559597, 567554, 573565, 579931, 589326]
51561E89326J4382J9909K5453L1700L8539M3841M5252M2555L7329L1066K4631
51550I43983J8603J2887O392j753j1004k0197k8856l6679m2457m4934m4461m2561
51538G08963l9938l6106l1013k5881k2106j9950j8567j6940j4710j2369j0575
51527D60808r235p681n843m568m396m690m517l766k906k206j759j653j639j159
51513D04790k28L97L68K79N14M00p08k250l116k951k117r27M23J639K535K995
51497D02043K570R45j044j981j787j747k268k148q42L38L09j36j30n07k109l708
51481C87798l623k363j720k046k360k433k762l019k483j686j763k459k523j874
51467C54684j549j672j374o53m89r38q45K19J333J841K209K877L583M184N032
$$ y = [589326, 603708, 623617, 649070, 680770, 719309, 763150, 808402, 850957, 888286, 919352, 943983, 962586, 975473, 981865, 980112, 969108, 948911, 920055, 883376, 840919, 795985, 751524, 708963, 669025, 632919, 601906, 576025, 553919, 533969, 515402, 498462, 483752, 471383, 460808, 451573, 443892, 438049, 433481, 429085, 424395, 419878, 416112, 413206, 411000, 409241, 407588, 405949, 404790, 404562, 404959, 405327, 405606, 406120, 406520, 405812, 403562, 400446, 397495, 395378, 394451, 394874, 396513, 399048, 402043, 404613, 405558, 404514, 402533, 400746, 398999, 396731, 394583, 393741, 394079, 394388, 394252, 394122, 393615, 391506, 387798, 384175, 381812, 380092, 378046, 375686, 373253, 370491, 367472, 364989, 363303, 361540, 359081, 356558, 354684, 353135, 351463, 350089, 349436, 348947, 348009, 347164, 347383, 348716, 350557, 352766, 355643, 359226, 363410, 368442]
51452C68442O164P114P733Q250Q526Q183P479P103P233P702Q627R718R473O640
51438D78387K312j019k386k798k988k653k148k898n444q554j0898j2218j2422
51425D14273j1083q604o467n468m839l719k407j384l39J029K212K770L040L276
51411C82290K994J990J161J406K296K732K388J856J718K098K824L578M130M613
51397D18074N101N065L958K466K123L320M686N017M834N348O714Q214R640J1587
51383D96147J4569J8548K3180K7981L2435L6450M0701M6034N2192N7152N7897
51372I03286N2448M1583K8512J6408O297k601j1115j9385k7285l4507m0221m3593
51360H69827m4753m4562m3467m1327l8287l4946l1547k7876k4065k0694j7970
$$ y = [368442, 374606, 381720, 389453, 397703, 406229, 414412, 421891, 428994, 436227, 443929, 452556, 462274, 471747, 478387, 480699, 479680, 477294, 474496, 471508, 468855, 466707, 463809, 458365, 449811, 438913, 426695, 414273, 403190, 394586, 388119, 382651, 377812, 374093, 371686, 370302, 369963, 370992, 373204, 375974, 379014, 382290, 385284, 387274, 388435, 389841, 392137, 394869, 397257, 399113, 400831, 402929, 405753, 409331, 413461, 418074, 423175, 428240, 432198, 434664, 436787, 440107, 444793, 449810, 454644, 459992, 466706, 474920, 484560, 496147, 510716, 529264, 552444, 580425, 612860, 649310, 690011, 736045, 788237, 845389, 903286, 955734, 997317, 1025829, 1042237, 1048534, 1045933, 1034818, 1015433, 988148, 953641, 913420, 869827, 825074, 780512, 737045, 695718, 657431, 622485, 590938, 563062, 538997, 518303, 500333]
51349E00333j5618j3683j2548j2016j1278j0082r045q549q126p314o326n482m644
51336C75622l664k784k174j587q92m44o26j311j939j914r50N21J397R94l2l89
51320C59828K24R79J263J386J837K627L505M236M558M424M157L862K914Q86j404
51305C95282k697k957l087l227k645j408o93j058j634j547j074q03o41l01Lp2
51289C71441m82j034j545j554o22R05K136K888L879N443O852P187O230M300J977
51274D08001J02p53r77j321j687j371l68O61J656L037M293M215K816J520R72K37
51258D21033j238k401k260j409q67o00k59l33j371k845l850m318m633m729m411
51243C85509l966l634l082k097j249j105j393j590j653j657j379q90p15q14k41
$$ y = [500333, 484715, 471032, 458484, 446468, 435190, 425108, 416063, 407514, 399388, 392074, 385748, 380266, 375622, 371958, 369174, 367000, 365413, 364521, 364077, 363451, 362140, 360201, 358287, 357337, 357858, 359255, 360249, 360217, 359828, 360052, 361031, 362294, 363680, 365517, 368144, 371649, 375885, 380443, 384867, 389024, 392886, 395800, 396686, 395282, 392585, 389628, 386541, 383314, 380669, 379261, 378568, 377510, 375876, 374329, 373255, 372452, 371811, 371510, 371513, 371441, 370959, 369925, 368380, 366826, 366204, 367109, 369245, 372133, 376012, 381455, 388307, 395494, 401724, 406024, 408001, 408103, 407350, 406373, 405052, 403365, 401994, 401626, 402287, 403943, 406980, 411273, 415488, 418304, 419824, 420796, 421033, 419795, 417394, 415134, 413725, 412858, 412258, 411999, 411666, 410295, 407450, 403600, 399282, 394649, 389920, 385509, 381543, 377909, 374827, 372730, 371481, 370376, 368983, 367393, 365740, 364083, 362704, 361814, 361099, 360285, 360044]
51228C60044J359K832K983K152J458J251J250J536K246K854K740K162J751J486
51214C88104J088R42J613K694L080K357J214N36O31J239J892K255K396K483K269
51199D14793J435M78L79J167J663J062j37j199k158l109l592l370l002k894k668
51184C98848k147j948k259k138j018R5O2o36q81p52j015j450j184k87L64N17O22
51167C84793P61P72J176K695M859O286O358N671M866M000L061K203J382M36n29
51152D28790j406k512l944m923m606l309k121j573j521j928k730l260k863j910
51138C90184j224o95M00J797K254J220m26j569j866j439m74P09J781K776L717
51123C97145M045L214J792J050J358J824J687J204R56J041J274J575J827J790
$$ y = [360044, 361403, 364235, 367218, 369370, 370828, 372079, 373329, 374865, 377111, 379965, 382705, 384867, 386618, 388104, 389192, 390134, 391747, 394441, 397521, 399878, 401092, 401628, 402259, 403498, 405390, 407645, 410041, 412524, 414793, 416228, 416706, 417085, 418252, 419915, 420977, 420840, 419641, 417483, 414374, 410782, 407412, 404410, 401516, 398848, 396701, 394753, 392494, 390356, 389338, 389433, 389495, 388859, 387978, 387226, 386211, 384761, 383577, 383290, 383654, 384171, 384793, 385554, 386326, 387502, 390197, 395056, 401342, 407700, 413371, 418237, 422237, 425298, 427501, 428883, 429319, 428790, 427384, 424872, 420928, 416005, 411399, 408090, 405969, 404396, 402875, 400947, 398217, 394957, 392094, 390184, 388960, 388265, 388665, 390462, 392716, 393936, 393510, 391941, 390075, 388636, 388162, 388871, 390652, 393428, 397145, 401190, 404404, 406196, 407246, 408604, 410428, 412115, 413319, 414275, 415316, 416590, 418165, 419992, 421782]
51109D21782J449J115J099J473K067K461K237J601J411K077K853K828K140J424
51095D48017O33o10j718j584k87P85P91L88M96R67J068O10J50L03J132J944J813
51078D54898O37m36k32R98K021K344K621L365M238M929N858P468R494J1364J2958
51063E22525J4499J6100J7756J9553K1487K3045K3037K0012J3284M026m848j0481
51051F79995j1859r772n601q69K518L106J381m26o82q0n67l050o698r911j1307
51036F26178r933n608K97M846N219J012n295j0390j2581j2122r765n976j528K235
51022E66589M462N579O478P343P730P422O680N912N444N207M445K344o62k920
51008F32053l476l258l656m596m989m434l482k517j530p72n72n37K6R47J366J144
$$ y = [421782, 423231, 424346, 425445, 426918, 428985, 431446, 433683, 435284, 436695, 438772, 441625, 444453, 446593, 448017, 448650, 448040, 446322, 444738, 444451, 445236, 446027, 446415, 446911, 447878, 448946, 449556, 449706, 450009, 451141, 453085, 454898, 455535, 455099, 454867, 455865, 457886, 460230, 462851, 466216, 470454, 475383, 481241, 488709, 498203, 509567, 522525, 537024, 553124, 570880, 590433, 611920, 634965, 658002, 678014, 691298, 695324, 690476, 679995, 668136, 658364, 652763, 651894, 654412, 657518, 658899, 658473, 657791, 657711, 657144, 654094, 647396, 637485, 626178, 616245, 610637, 610934, 615780, 620999, 622011, 616716, 606326, 593745, 581623, 571858, 565882, 564354, 566589, 571051, 576630, 583108, 590451, 598181, 605603, 612283, 618195, 623639, 628846, 633291, 635635, 634973, 632053, 628577, 625319, 621663, 617067, 612078, 607644, 604162, 601645, 600115, 599343, 598771, 598234, 598260, 599207, 600573, 601717]
50992F01717J190K129L499M586N406O535Q360J0708J3042J4981J6731J8702K0518
50979G28104K0938J9272J6375J3688J1911J1275J2404J5738K0490K5406L0309
50968I25910L5786M1542M6395N0002N3383N7394O1706O5540O8453P0069O9965
50957A546145O8142O4953O0230N3416M4865L6111K8245K0767J2685M228l275q985
50945A927527j3273j6750j9070j9314j7686j6290j7396k0936k4604k6708k7793
50934A707707k8791k8956k7148k4320k2893k3785k5713k7480k9323l1650l3886
50923A403762l5307l5979l6224l6049l5580l5250l5012l4157l2335l0057k7786
50912A030026k5294k2373j9465j7105j5317j3990j3301j3297j3505j3322j2497
$$ y = [601717, 602907, 605036, 608535, 613121, 618527, 625062, 633422, 644130, 657172, 672153, 688884, 707586, 728104, 749042, 768314, 784689, 798377, 810288, 821563, 833967, 849705, 870195, 895601, 925910, 961696, 1003238, 1049633, 1099635, 1153018, 1210412, 1272118, 1337658, 1406111, 1476180, 1546145, 1614287, 1679240, 1739470, 1792886, 1837751, 1873862, 1902107, 1922874, 1935559, 1939787, 1936512, 1927527, 1914254, 1897504, 1878434, 1859120, 1841434, 1825144, 1807748, 1786812, 1762208, 1735500, 1707707, 1678916, 1649960, 1622812, 1598492, 1575599, 1551814, 1526101, 1498621, 1469298, 1437648, 1403762, 1368455, 1332476, 1296252, 1260203, 1224623, 1189373, 1154361, 1120204, 1087869, 1057812, 1030026, 1004732, 982359, 962894, 945789, 930472, 916482, 903181, 889884, 876379, 863057, 850560]
50901H50560j1056r225p438n991m656l188j975j466j244o34p5n60j712j882n59
50886G98899Q34J177J276K277L726M507M761N503O813P793Q119Q525R648J1294
50872H75152J2877J3992J4449J4328J4027J3989J4330J5012J6109J7697J9688
50861A041650K2113K5286K9454L4439L9951M6036N2983O0907O9630P8700Q7549
50850A588698R5961J04408J13450J22770J31289J38495J44924J51044J56179J58938
50840B906156J58132J52912J42536J26752J06302Q2648N7284L1483O310j7456
50830C753059l9218n8189p3393q4245r0771r3014r0702q3933p3921o2547n1257
50819B951869m0744l1660k5241k2897k5095l0798l8258m6387n4993o3750p1692
$$ y = [850560, 839504, 830279, 822841, 816850, 812194, 809006, 807031, 805565, 804321, 803687, 803612, 803052, 801340, 799458, 798899, 799733, 800910, 802186, 804463, 808189, 812696, 817457, 822960, 829773, 837566, 845685, 854210, 863858, 875152, 888029, 902021, 916470, 930798, 944825, 958814, 973144, 988156, 1004265, 1021962, 1041650, 1063763, 1089049, 1118503, 1152942, 1192893, 1238929, 1291912, 1352819, 1422449, 1501149, 1588698, 1684659, 1789067, 1902517, 2025287, 2156576, 2295071, 2439995, 2591039, 2747218, 2906156, 3064288, 3217200, 3359736, 3486488, 3592790, 3675438, 3732722, 3764205, 3770515, 3753059, 3713841, 3655652, 3582259, 3498014, 3407243, 3314229, 3223527, 3139594, 3065673, 3003126, 2951869, 2911125, 2879465, 2854224, 2831327, 2806232, 2775434, 2737176, 2690789, 2635796, 2572046, 2500354]
50808B500354p8211q3858q9296r3886r6255r5936r3414q8846q2005p3554o5129
50797A559964n7731n1060m4663l8697l3159k7499k1568j6028j1208o533j778J951
50785A251991L444L035K203J903J989J893J284K57o52r47r18j462k929m701o225
50770A250165p725r457j1048j2211j3412j5135j6968j8108j8404j8211j7718j6916
50758A074852j5911j4562j2287q861n091k045J15K010M064O226Q353J0344J2046
50745A059253J3514J5149J7262J9843K3010K7078L1778L6086L9533M3189M8518
50734A374213N5544O2898O9293P4299P7888Q0152Q1367Q1737Q1103P9330P6781
50723B194605P3832P0115O4816N7400M7444L4185J7196k443k2410m0661n6048
$$ y = [2500354, 2422143, 2338285, 2248989, 2155103, 2058848, 1962912, 1869498, 1780652, 1698647, 1625093, 1559964, 1502233, 1451173, 1406510, 1367813, 1334654, 1307155, 1285587, 1269559, 1258351, 1251818, 1250040, 1251991, 1255435, 1258470, 1260673, 1262576, 1264565, 1266458, 1267742, 1267999, 1267347, 1266400, 1265482, 1264020, 1261091, 1256390, 1250165, 1242440, 1232983, 1221935, 1209724, 1196312, 1181177, 1164209, 1146101, 1127697, 1109486, 1091768, 1074852, 1058941, 1044379, 1032092, 1023231, 1018140, 1016095, 1016210, 1018220, 1022284, 1028510, 1036863, 1047207, 1059253, 1072767, 1087916, 1105178, 1125021, 1148031, 1175109, 1206887, 1242973, 1282506, 1325695, 1374213, 1429757, 1492655, 1561948, 1636247, 1714135, 1794287, 1875654, 1957391, 2038494, 2117824, 2194605, 2268437, 2338552, 2403368, 2460768, 2508212, 2542397, 2559593, 2557150, 2534740, 2494079, 2438031]
50712B438031o7594p4244p5777p3227o7911o0550n1717m2610l4505k7564k0904
50701A841428j4145q434n520o073r330j4296k0660k8288l6378m3760m9707n3923
50689A550914n6024n5751n3573n0323m6209m0937l4819k8841k3431j8041j2343
50678A130622o887k109K509P487J2364J6450J9986K3583K6937K9070K9679K9319
50666A319010K8306K6358K3505K0520J8155J6456J5155J4353J4365J5139J6174
50655A527496J7007J7508J7645J7200J6055J4698J4069J4599J5793J7129J9045
50644A708244K2343K6706L0714L3465L5559L8055M1091M3963M6072M7082M6462
50633B119756M3663L9052L4215L0860K9387K9029K9655L2456L7390M0009L3062
$$ y = [2438031, 2370437, 2296193, 2220416, 2147189, 2079278, 2018728, 1967011, 1924401, 1889896, 1862332, 1841428, 1827283, 1818849, 1813329, 1807256, 1797926, 1783630, 1762970, 1734682, 1698304, 1654544, 1604837, 1550914, 1494890, 1439139, 1385566, 1335243, 1289034, 1248097, 1213278, 1184437, 1161006, 1142965, 1130622, 1123735, 1121626, 1124135, 1131622, 1143986, 1160436, 1180422, 1204005, 1230942, 1260012, 1289691, 1319010, 1347316, 1373674, 1397179, 1417699, 1435854, 1452310, 1467465, 1481818, 1496183, 1511322, 1527496, 1544503, 1562011, 1579656, 1596856, 1612911, 1627609, 1641678, 1656277, 1672070, 1689199, 1708244, 1730587, 1757293, 1788007, 1821472, 1857031, 1895086, 1936177, 1980140, 2026212, 2073294, 2119756, 2163419, 2202471, 2236686, 2267546, 2296933, 2325962, 2355617, 2388073, 2425463, 2465472, 2498534]
50622B498534J3232j4248l9168n4285n8891n5896m8201l8200k8178j9332j1300
50611B144067l579L412R125J3545J6217J5832J1795N194k721j2086k3401l5792
50599B141608m7415n7076o4497o9707p3061p5296p6553p5884p2597o7493o1915
50588A400114n6258n0488m5339m1675l8975l5741l1320k6369k1630j7286j3442
50577A021591j0349q021o154m429k442K74L696P073R782J1974J3986J5681J6957
50564A069619J8188J9496K0273K0193K0031K0614K1679K2683K3997K6214K8838
50553A311825L0804L1730L1648L0214K7440K4505K2448K0646J8067J5515J4890
50542A579732J6501J8903K1332K4538K9018L4218L9805M6151N2942N8934O3768
$$ y = [2498534, 2511766, 2497518, 2458350, 2404065, 2345174, 2289278, 2241077, 2202877, 2174699, 2155367, 2144067, 2140488, 2143900, 2153025, 2166570, 2182787, 2198619, 2210414, 2215608, 2212887, 2200801, 2177400, 2141608, 2094193, 2037117, 1972620, 1902913, 1829852, 1754556, 1678003, 1602119, 1529522, 1462029, 1400114, 1343856, 1293368, 1248029, 1206354, 1167379, 1131638, 1100318, 1073949, 1052319, 1035033, 1021591, 1011242, 1003221, 997067, 992638, 990196, 990470, 994166, 1001239, 1011021, 1022995, 1036981, 1052662, 1069619, 1087807, 1107303, 1127576, 1147769, 1167800, 1188414, 1210093, 1232776, 1256773, 1282987, 1311825, 1342629, 1374359, 1406007, 1436221, 1463661, 1488166, 1510614, 1531260, 1549327, 1564842, 1579732, 1596233, 1615136, 1636468, 1661006, 1690024, 1724242, 1764047, 1810198, 1863140, 1922074, 1985842]
50531A985842O8819P5338Q2914R0445R7619J04564J10847J15738J18921J20297
50521B971344J19584J16608J11483J03998R3398P9281O2340M3793K4446M633j5305
50510C715603l4939n3785p1193q6394r8774j07752j12456j12024j06405r6430
50500B835451q3121o7360n0171l2647j5385J451J7413L1627M3447N2622N8616
50489B791943O0245N6248M5944K9406P646j7202m2417o5810q6275j03391j16846
50478B559491j26217j30895j30425j25345j17511j08984j00645r2223q3407p4319
50468A469520o5219n6492m8830m2701l7753l3244k8864k4484j9595j3919q282
50457A090137l719M0M002P974J0628J1667J2539J4393J6543J7761J8042J8376
$$ y = [1985842, 2054661, 2129999, 2212913, 2303358, 2400977, 2505541, 2616388, 2732126, 2851047, 2971344, 3090928, 3207536, 3319019, 3423017, 3516415, 3595696, 3658036, 3701829, 3726275, 3730908, 3715603, 3680664, 3626879, 3555686, 3469292, 3370518, 3262766, 3150310, 3038286, 2931881, 2835451, 2752330, 2684970, 2634799, 2602152, 2586767, 2588218, 2605631, 2637258, 2680705, 2733327, 2791943, 2852188, 2908436, 2954380, 2983786, 2991432, 2974230, 2931813, 2866003, 2779728, 2676337, 2559491, 2433274, 2302379, 2171954, 2046609, 1929098, 1820114, 1719469, 1627246, 1543839, 1469520, 1404301, 1347809, 1298979, 1256278, 1218525, 1185281, 1156417, 1131933, 1112338, 1098419, 1090137, 1086418, 1086458, 1090460, 1098434, 1109062, 1120729, 1133268, 1147661, 1164204, 1181965, 1200007, 1218383]
50445A218383J9442K1375K4257K7883L1163L2209K9285K1895J1511J209o187r969
50433A422456j1348j1574j0953r559p882o358n000l807k888j964m15J892M457
50420A357057P027R976J3578J7636K2108K7311L3157L8920M4154M9130N4017N8292
50408A732363O1416O3375O4076O3029O0159N6357N2545M8633M3888L7786L0044
50397B313671K0360Q779m071j7588l1597m5610n8180o7725p3913p7545p9207p8435
50385A808939p4373o6935n7275m7070l7275k7690j7832p896J618J0770J9732K7535
50373A532248L2347L3331L1321K7275K1035J2257J777q648j7468k3551k6121k5738
50361A590065k5094k7678l4966m5117n4479o0258o2020o1095n8896n5824n1662
$$ y = [1218383, 1237825, 1259200, 1283457, 1311340, 1342503, 1374712, 1403997, 1425892, 1437403, 1438612, 1432425, 1422456, 1411108, 1399534, 1388581, 1379022, 1371140, 1364782, 1359782, 1355975, 1353087, 1351123, 1350708, 1352600, 1357057, 1364084, 1374060, 1387638, 1405274, 1427382, 1454693, 1487850, 1526770, 1570924, 1620054, 1674071, 1732363, 1793779, 1857154, 1921230, 1984259, 2044418, 2100775, 2153320, 2201953, 2245841, 2283627, 2313671, 2334031, 2342810, 2338739, 2321151, 2289554, 2243944, 2185764, 2118039, 2044126, 1966581, 1887374, 1808939, 1734566, 1667631, 1610356, 1563286, 1526011, 1498321, 1480489, 1472593, 1474211, 1484981, 1504713, 1532248, 1564595, 1597926, 1629247, 1656522, 1677557, 1689814, 1691591, 1682943, 1665475, 1641924, 1615803, 1590065, 1564971, 1537293, 1502327, 1457210, 1402731, 1342473, 1280453, 1219358, 1160462, 1104638, 1052976]
50350A052976m6548m1027l5368k9511k3845j9286j6235j4024j1718r050o307l816
50338G96241j912q57l90K11J207K035K283K484L302M369M712M230L907M522N770
50323H32114O893P702Q541R493J0099R992R405Q681P589N630L088J079K74J84
50309I20764J22K95J230K724M200N745P696R571J0525J0829J1662J3353J5002
50296A013718J6046J6794J6800J4081P168k692j2356j9410k3338k4711k4307k2880
50284I54913k0977j8707j5981j2891r650o420l400q42J234L099M923O670Q499
50271H90470J0797J3539J6014J7449J7667J6951J5710J4399J3370J2541J1636
50260A050543J0832J0764J1670J2984J3908J3865J2285Q647L178k934q360j2394
$$ y = [1052976, 1006428, 965401, 930033, 900522, 876677, 857391, 841156, 827132, 815414, 806364, 800057, 796241, 794329, 793472, 793082, 793293, 794500, 796535, 798818, 801302, 804604, 808973, 813685, 817915, 821822, 826344, 832114, 839007, 846709, 855250, 864743, 874842, 884834, 894239, 902920, 910509, 916139, 919227, 920306, 920580, 920764, 920886, 921181, 922411, 925135, 929335, 935080, 942776, 952347, 962872, 973701, 985363, 998716, 1013718, 1029764, 1046558, 1063358, 1077439, 1084607, 1081915, 1069559, 1050149, 1026811, 1002100, 977793, 954913, 933936, 915229, 899248, 886357, 876707, 870287, 866887, 866045, 867279, 870378, 875301, 881971, 890470, 901267, 914806, 930820, 948269, 965936, 982887, 998597, 1012996, 1026366, 1038907, 1050543, 1061375, 1072139, 1083809, 1096793, 1110701, 1124566, 1136851, 1145498, 1148676, 1145742, 1137382, 1124988]
50248A124988j4796j5446j4433j2045q405l478K279P486J0177Q505J645r084k0181
50235A057212k8075l1635l2079l0734k7923k4078k0424j7775j5707j3598j1719
50224H03465j0531r725q748p769p282p264p348p452p626p619p164o396n608m891
50210F98042m331m060l837l098j790o20j75l45q39j625k532l163l512l963m399
50195F59753m227l564l356l791l823k885j953j942k186j655p43n30r95j296j272
50180F25535j378j485j116o60r73j872k160j302j1R20J473J919K310K688L222
50165F27110L974M938O186P543Q412Q488Q442R253J1100J3546J6539K0395K4959
50152G70885K9548L3627L6703L7798L5989L1746K6996K3495K1615K0733K0268
$$ y = [1124988, 1110192, 1094746, 1080313, 1068268, 1059863, 1056385, 1058664, 1066150, 1076327, 1084832, 1086477, 1077393, 1057212, 1029137, 997502, 965423, 934689, 906766, 882688, 862264, 844489, 828782, 815184, 803465, 792934, 783209, 774461, 766692, 759410, 752146, 744798, 737346, 729720, 722101, 714937, 708541, 702933, 698042, 693711, 689651, 685814, 682716, 680926, 680306, 680131, 679786, 678947, 677322, 674790, 671627, 668115, 664152, 659753, 655526, 651962, 648606, 644815, 640992, 638107, 636154, 634212, 632026, 630371, 629628, 629098, 628103, 626807, 625535, 624157, 622672, 621556, 620896, 619923, 618051, 615891, 614589, 614578, 615498, 616971, 618890, 621200, 623888, 627110, 631084, 636022, 642208, 649751, 658163, 666651, 675093, 684346, 695446, 708992, 725531, 745926, 770885, 800433, 834060, 870763, 908561, 944550, 976296, 1003292, 1026787, 1048402, 1069135, 1089403]
50141A089403K0090K0328K0868K0828J8691J3490N886k360r950j6672k2692k7797
50129A130113l1592l3962l5073l5055l3734l0768k6260k1250j7180j4663j3178
50118H37398j2289j2459j4088j6223j7152j6151j3944j1575r478p694o185m769
50106F95391l212j710r47j350k413l019k504j387q46j414k416k941l026l286l601
50091F61319l035j244Q56K186K581K399J792R22L75O27J459K290K827L119L340
50076F81813L786M597N292N168M351L682L422K966K226K131L066L877L392K105
50062G31874J268J079Q18L09n4l02q45j569j920j828j745j859j845j367l04J184
50046G22894K509L058L199M148O282Q406R486J0239J1925J4413J6677J8643K1085
$$ y = [1089403, 1109493, 1129821, 1150689, 1171517, 1190208, 1203698, 1209584, 1207224, 1197274, 1180602, 1157910, 1130113, 1098521, 1064559, 1029486, 994431, 960697, 929929, 903669, 882419, 865239, 850576, 837398, 825109, 812650, 798562, 782339, 765187, 749036, 735092, 723517, 714039, 706345, 700160, 695391, 692179, 690469, 689522, 688172, 685759, 682740, 680236, 678849, 678003, 676589, 674173, 671232, 668206, 664920, 661319, 658284, 657040, 657896, 660082, 662663, 665062, 666854, 667776, 668151, 668778, 670237, 672527, 675354, 678473, 681813, 685599, 690196, 695488, 700656, 705007, 708689, 712111, 715077, 717303, 719434, 722500, 726377, 729769, 731874, 733142, 734221, 735039, 735348, 735294, 734992, 734147, 732578, 730658, 728830, 727085, 725226, 723381, 722014, 721710, 722894, 725403, 728461, 731660, 735808, 742090, 750496, 759982, 770221, 782146, 796559, 813236, 831879, 852964]
50033H52964K4030K6614K8385K9499K9700K8368K5685K2621J9634J6395J2948
50022A116843J0171Q753Q383Q085O765L463k170r456j7184k4414l0386l4122l5070
50009A009661l4002l2449l1175k9824k7839k4986k1123j6284j1095o498k990n13
49997G70883J053J827K055J901J371P22M17K14r37l461o402q839j1095j3574j5374
49982G20761j5418j4249j3213j2453j1214r665q735q306p282n462l857k947k088
49969F05872r53k40n52j587k700l380l123j786n3J261K361L978O075Q095J0106
49954F23374J2394J4177J4245J2775J1006R297P050M590L232L227L315K704J856
49941G23242Q45j227m352o828p369o836o873p933r451j0912j1856j1704j0513
$$ y = [852964, 876994, 903608, 931993, 961492, 991192, 1019560, 1045245, 1067866, 1087500, 1103895, 1116843, 1127014, 1135767, 1144150, 1152235, 1159000, 1162463, 1160293, 1150837, 1133653, 1109239, 1078853, 1044731, 1009661, 975659, 943210, 912035, 882211, 854372, 829386, 808263, 791979, 780884, 774386, 771396, 770883, 771936, 773763, 775818, 777719, 779090, 779812, 780229, 780443, 779506, 776045, 769643, 760804, 749709, 736135, 720761, 705343, 691094, 677881, 665428, 654214, 644549, 635814, 627508, 620226, 614764, 610907, 607960, 605872, 604919, 604679, 604127, 602540, 599840, 596460, 593337, 591551, 591498, 592759, 595120, 599098, 605173, 613268, 623374, 635768, 649945, 664190, 676965, 687971, 697268, 704318, 708908, 712140, 715367, 718682, 721386, 723242, 724087, 722860, 718508, 711680, 704311, 697475, 690602, 682669, 673218, 662306, 650450, 638746, 628233]
49928F28233r180q302p490o332n147m250l409k472j702r42N19K687M392M743M201
49913E95549L670L345L104L207L931N185O917R166J1394J2669J2874J2811J2701
49900F96523J1778R892Q279P820P626O325L876J144j616m731p999j0544j1719
49887G16654j1665j1118j0865j0992j0625r112p281o613p160p485o879o154n839
49874F04866n210l840k652k369k226j420o23o71p92L92K700M692N752O560P752
49859F12911R305J1071J2998J4720J5634J5315J3589J0618P318N004M105L766
$$ y = [628233, 619053, 610751, 603261, 596929, 591782, 587532, 584123, 581651, 579949, 579007, 579526, 582213, 586605, 591348, 595549, 599219, 602564, 605668, 608875, 612806, 617991, 624908, 634074, 645468, 658137, 671011, 683822, 696523, 708301, 718193, 726472, 734292, 741918, 748243, 752119, 753263, 751647, 746916, 738917, 728373, 716654, 704989, 693871, 683006, 672014, 661389, 652277, 644996, 638383, 631223, 623738, 616859, 610705, 604866, 599656, 595816, 593164, 590795, 588569, 587149, 586526, 585855, 585063, 585455, 588155, 592847, 598599, 605159, 612911, 622216, 633287, 646285, 661005, 676639, 691954, 705543, 716161, 723479, 728483, 732588, 736354]
$$ [...]
##END NTUPLES=NMR SPECTRUM
##END=
