
##TITLE=AC1356_CPIAH12175_6648174_laQqRkL1nq
##JCAMPDX= 6.0         $$ Bruker NMR JCAMP-DX V2.0
##DATA TYPE= NMR SPECTRUM
##DATA CLASS= NTUPLES
##ORIGIN= BRUKER
##OWNER= Administrator
$$ 1.72 TOPSPIN		Version 2.1
$$ 2012-08-10 21:49:30.687 -0500  Administrator@TOPSPIN
$$ Compression mode = diff/dup
##.OBSERVE FREQUENCY= 400.02188249412
##.OBSERVE NUCLEUS= ^1H
##.ACQUISITION MODE= SIMULTANEOUS (DQD)
##.ACQUISITION SCHEME= undefined
##.AVERAGES= 8
##.DIGITISER RES= 22
##SPECTROMETER/DATA SYSTEM= spect
##.PULSE SEQUENCE= zg30
##.SOLVENT NAME= COFFEE_meoh
##.SHIFT REFERENCE= INTERNAL, COFFEE_meoh, 1, 14.98509
##AUDIT TRAIL= $$ (NUMBER, WHEN, WHO, WHERE, PROCESS, VERSION, WHAT)
$$ ##TITLE= Audit trail, TOPSPIN		Version 2.1
$$ ##JCAMPDX= 5.01
$$ ##ORIGIN= Bruker BioSpin GmbH
$$ ##OWNER= Administrator
$$ $$ C:\Bruker\TOPSPIN/data/COFFEE/nmr/AC1356_CPIAH12175_6648174_laQqRkL1nq/10/pdata/1/auditp.txt
$$ ##AUDIT TRAIL=  $$ (NUMBER, WHEN, WHO, WHERE, PROCESS, VERSION, WHAT)
(   1,<2012-08-10 21:49:22.875 -0500>,<Administrator>,<TOPSPIN>,<go>,<TOPSPIN 2.1>,
      <created by zg
	started at 2012-08-10 21:48:16.359 -0500,
	POWCHK enabled, PULCHK disabled,
       configuration hash MD5:
       6B 1B 68 BB D9 2E 58 E2 7F 35 AD 54 07 DF 0E 41
       data hash MD5: 64K
       E2 96 74 FB 3E 20 D3 81 CC 07 FA E5 0A F7 8D 52>)
(   2,<2012-08-10 21:49:26.218 -0500>,<Administrator>,<TOPSPIN>,<proc1d>,<TOPSPIN 2.1>,
      <Start of raw data processing
       efp LB = 0 FT_mod = 6 PKNL = 1 PHC0 = 0 PHC1 = 0 SI = 32K 
       data hash MD5: 32K
       96 50 0C B4 66 F3 3C 2F 71 37 E2 DB 78 F4 27 16>)
(   3,<2012-08-10 21:49:26.546 -0500>,<Administrator>,<TOPSPIN>,<proc1d>,<TOPSPIN 2.1>,
      <pk PHC0 = 181.1481 PHC1 = 0 
       data hash MD5: 32K
       9F 70 A6 B1 9D 86 FE A9 29 D7 3B 2B F3 9D 6D CD>)
(   4,<2012-08-10 21:49:26.703 -0500>,<Administrator>,<TOPSPIN>,<proc1d>,<TOPSPIN 2.1>,
      <abs ABSG = 1 
       data hash MD5: 32K
       23 10 47 1C CD E0 38 7B 0C E7 06 6B 54 4A 97 AA>)
(   5,<2012-08-10 21:49:26.843 -0500>,<Administrator>,<TOPSPIN>,<proc1d>,<TOPSPIN 2.1>,
      <abs ABSG = 2 
       data hash MD5: 32K
       86 4E 85 51 A3 C3 9A 87 53 9C BC D3 B7 68 85 43>)
(   6,<2012-08-10 21:49:26.875 -0500>,<Administrator>,<TOPSPIN>,<proc1d>,<TOPSPIN 2.1>,
      <abs ABSG = 3 
       data hash MD5: 32K
       FB 1A 6B E4 88 6A BA A9 C5 FB 0B 95 DA 33 51 EB>)
(   7,<2012-08-10 21:49:26.906 -0500>,<Administrator>,<TOPSPIN>,<proc1d>,<TOPSPIN 2.1>,
      <abs ABSG = 4 
       data hash MD5: 32K
       FD 1C D4 C0 90 A8 AB A2 2F 2A A1 99 A2 9D 96 70>)
(   8,<2012-08-10 21:49:26.937 -0500>,<Administrator>,<TOPSPIN>,<proc1d>,<TOPSPIN 2.1>,
      <abs ABSG = 5 
       data hash MD5: 32K
       E3 EF B9 AE 76 D1 77 00 E0 CD 3F 6B E1 26 12 CE>)
$$ ##END=
$$ 
$$ $$ hash MD5
$$ $$ 8C D8 E2 15 B1 06 9B FA B3 16 BD EB 04 EC A7 5F
##$RELAX= 
##$RELAX= 
##$RELAX= 
##$RELAX= 
##$RELAX= 
##$RELAX= 
##$RELAX= 
$$ Bruker specific parameters
$$ --------------------------
$$ [...]
##$TP= (0..7)
150 150 150 150 150 150 150 150
##$TP07= 0
##$TPNAME0= <>
##$TPNAME1= <>
##$TPNAME2= <>
##$TPNAME3= <>
##$TPNAME4= <>
##$TPNAME5= <>
##$TPNAME6= <>
##$TPNAME7= <>
##$TPOAL= (0..7)
0.5 0.5 0.5 0.5 0.5 0.5 0.5 0.5
##$TPOFFS= (0..7)
0 0 0 0 0 0 0 0
##$TUNHIN= 0
##$TUNHOUT= 0
##$TUNXOUT= 0
##$USERA1= <user>
##$USERA2= <user>
##$USERA3= <user>
##$USERA4= <user>
##$USERA5= <user>
##$V9= 5
##$VALIST= <valist>
##$VCLIST= <CCCCCCCCCCCCCCC>
##$VD= 0
##$VDLIST= <DDDDDDDDDDDDDDD>
##$VPLIST= <PPPPPPPPPPPPPPP>
##$VTLIST= <TTTTTTTTTTTTTTT>
##$WBST= 1024
##$WBSW= 4
##$XGAIN= (0..3)
0 0 0 0
##$XL= 0
##$YL= 0
##$YMAX_a= 455428
##$YMIN_a= -594350
##$ZGOPTNS= <>
##$ZL1= 120
##$ZL2= 120
##$ZL3= 120
##$ZL4= 120
##$ABSF1= 14.98509
##$ABSF2= -5.573092
##$ABSG= 5
##$ABSL= 3
##$ALPHA= 0
##$AQORDER= 0
##$ASSFAC= 0
##$ASSFACI= 0
##$ASSFACX= 0
##$ASSWID= 0
##$AUNMP= <proc_prof1d_extract_pilot.lims>
##$AXLEFT= 0
##$AXNAME= <>
##$AXNUC= <1H>
##$AXRIGHT= 0
##$AXTYPE= 0
##$AXUNIT= <>
##$AZFE= 0.1
##$AZFW= 0.1
##$BCFW= 0
##$BC_mod= 0
##$BYTORDP= 0
##$COROFFS= 0
##$CY= 15
##$DATMOD= 1
##$DC= 0
##$DFILT= <>
##$DTYPP= 0
##$F1P= 0
##$F2P= 0
##$FCOR= 0.5
##$FTSIZE= 32768
##$FT_mod= 6
##$GAMMA= 0
##$GB= 0
##$INTBC= 1
##$INTSCL= 1
##$ISEN= 128
##$LB= 0
##$LEV0= 0
##$LPBIN= 0
##$MAXI= 10000
##$MC2= 0
##$MEAN= 0
##$ME_mod= 0
##$MI= 0
##$NCOEF= 0
##$NC_proc= -8
##$NLEV= 6
##$NOISF1= 0
##$NOISF2= 0
##$NSP= 0
##$NTH_PI= 0
##$NZP= 0
##$OFFSET= 14.98509
##$PC= 1
##$PHC0= 181.1481
##$PHC1= 0
##$PH_mod= 1
##$PKNL= yes
##$PPARMOD= 0
##$PPDIAG= 0
##$PPIPTYP= 0
##$PPMPNUM= 2147483647
##$PPRESOL= 1
##$PSCAL= 4
##$PSIGN= 0
##$PYNMP= <proc.py>
##$REVERSE= no
##$SF= 400.02
##$SI= 32768
##$SIGF1= 0
##$SIGF2= 0
##$SINO= 400
##$SIOLD= 32768
##$SPECTYP= <>
##$SREGLST= <1H.CDCl3>
##$SSB= 0
##$STSI= 32768
##$STSR= 0
##$SW_p= 8223.68421052631
##$SYMM= 0
##$S_DEV= 0
##$TDeff= 65536
##$TDoff= 0
##$TI= <>
##$TILT= no
##$TM1= 0
##$TM2= 0
##$TOPLEV= 0
##$USERP1= <user>
##$USERP2= <user>
##$USERP3= <user>
##$USERP4= <user>
##$USERP5= <user>
##$WDW= 1
##$XDIM= 32768
##$YMAX_p= 458946334
##$YMIN_p= -745556
##$CURPLOT= <Network HP LaserJet P1505>
##$CURPRIN= <$Network HP LaserJet P1505>
##$DFORMAT= <normdp>
##$LAYOUT= <+/1D_H.xwp>
##$LFORMAT= <normlp>
##$PFORMAT= <normpl>
##$SURQMSG= 1
$$ End of Bruker specific parameters
$$ ---------------------------------
##NTUPLES= NMR SPECTRUM
##VAR_NAME=  FREQUENCY,     SPECTRUM/REAL,   SPECTRUM/IMAG
##SYMBOL=    X,             R,               I
##VAR_TYPE=  INDEPENDENT,   DEPENDENT,       DEPENDENT
##VAR_FORM=  AFFN,          ASDF,            ASDF
##VAR_DIM=   32768,         32768,           32768
##UNITS=     HZ,            ARBITRARY UNITS, ARBITRARY UNITS
##FACTOR=    0.250966925370066, 1,           1
##FIRST=     8223.43324360094, -6150,        -71647
##LAST=      0,             -10333,          -25453
##MIN=       0,             -745556,         0
##MAX=       8223.43324360094, 458946334,    0
$$ Real data points
##PAGE= N=1
##DATA TABLE= (X++(R..R)), XYDATA
$$ [...]
19497c23337a47119B03776a08333l22219i6022j26634j45054f1965c0969l4379
$$ -323337 -147119 203776 -108333 -430552 -96022 -222656 -367710 -61965 -30969 -65348
19487f5348m2115L4206J738p1651j9417E0615A860b53011M5057i6084A8233a78506
$$ -65348 -107463 -73257 -71519 -143170 -162587 50615 1860 -253011 -207954 -96084 18233 -178506
19474f1297F1672d8289M92j91378j46586j84462C60624b54680J12475j2505c2676
$$ -61297 61672 -48289 -47797 -239175 -385761 -570223 360624 -254680 -142205 -154710 -32676
19462a39676B6421c7658j41644A18590j4334e2985m27331a56607F898d6512A71937
$$ -139676 26421 -37658 -179302 118590 104256 -52985 -480316 -156607 6898 -46512 171937
19450a48218O6397J0336p7660M0555A90601g4089a5685A35430A6836K21736C3074
$$ -148218 -81821 -71485 -149145 -108590 190601 -74089 -15685 135430 16836 238572 33074
19438c15455I4037D3753i2770j03349f4186n9036l77583D29015b2670A27787a33402
$$ -315455 94037 43753 -92770 -196119 -64186 -123222 -500805 429015 -22670 127787 -133402
19426e3541j89860C64665b30404d5616k92830B13801K17002c640E5667J435a00086
$$ -53541 -243401 364665 -230404 -45616 -338446 213801 430803 -3640 55667 57102 -100086
19414d25349a61531j42315b0079j56213A51393a96615r0672a03609a3808j73892
$$ -425349 -161531 -303846 -20079 -176292 151393 -196615 -287287 -103609 -13808 -187700
19404a87700A36188E6127f7470G1921k1323b78153D9744J54929b23232A47931
$$ -187700 136188 56127 -67470 71921 50598 -278153 49744 204673 -223232 147931
19393D410c90764A11635K21030a65901A2687b61493E1438g7405j02816c9739A20818
$$ 4410 -390764 111635 332665 -165901 12687 -261493 51438 -77405 -180221 -39739 120818
19381i5748L2833k95058a60637m6485Q4618p5166B14737c8244j41905M7085k4644
$$ -95748 -62915 -357973 -160637 -207122 -122504 -197670 214737 -38244 -180149 -133064 -157708
19370a57708E7346a87359P3286B7006a31216n462A20340J82260h7860k70219I9319
$$ -157708 57346 -187359 -114073 27006 -131216 -136678 120340 302600 -87860 -358079 99319
19358b48796n7464B504J28028N6693c66466A2749J50017m9646A5713a39744r3736
$$ -248796 -306260 2504 130532 187225 -366466 12749 162766 113120 15713 -139744 -233480
19347b33480q541H8980E394c25378H0025a82992P5256N246q8596G1947m786a32942
$$ -233480 -242021 88980 5394 -325378 80025 -182992 -107736 -102490 -191086 71947 67161 -132942
19334a36312j43534b583A41095a42077H5779J89713r6274k5072a02294l8833E1297
$$ -136312 -279846 -2583 141095 -142077 85779 275492 179218 154146 -102294 -141127 51297
19322A6771E829J05005c07365m56H8627C5957j4463L19695A28925C5919c3153
$$ 16771 5829 110834 -307365 -307821 88627 35957 21494 341189 128925 35919 -33153
19310a21794p9086Q2668j15017C5147L00356A05574a40093L1369B93056a6197
$$ -121794 -200880 -118212 -233229 35147 335503 105574 -140093 -108724 293056 -16197
19299c73452a46811d6913f791l10042J56102K8624F8214a00648A7620L408M48305
$$ -373452 -146811 -46913 -6791 -316833 -160731 -132107 68214 -100648 17620 21028 469333
19288D69333a12204n3711m8358A07884b40810A6325b63648E6924g6887k70268
$$ 469333 -112204 -165915 -214273 107884 -240810 16325 -263648 56924 -76887 -347155
19278c47155a70723O2519j39292j19232J50929k77383F4039a60145d0139n6472
$$ -347155 -170723 -108204 -247496 -366728 -215799 -493182 64039 -160145 -40139 -96611
19268i6611p358b7965p8549n7209m3938p2702D7352b94104a33443J6644A47393
$$ -96611 -103969 -27965 -106514 -163723 -207661 -280363 47352 -294104 -133443 -116799 147393
19256a03056B8897c29031C0067J53406b75155A3891f0969o3186A23771k7332m80
$$ -103056 28897 -329031 30067 183473 -275155 13891 -60969 -124155 123771 96439 95959
19245I5959h0778j20270J48A04982b49005N7790J5724j22449A923R6265a66013
$$ 95959 -80778 -201048 -200900 104982 -249005 -191215 -175491 -297940 1923 98188 -166013
19233a1053F2531J52170b05180L7993A14311a20292j50963A40195a97320j3794
$$ -11053 62531 214701 -205180 -167187 114311 -120292 -271255 140195 -197320 -211114
19223b11114e3514O615k30550O6635J7490R3217A13218a81083D0681a91217C4952
$$ -211114 -53514 -46899 -277449 -210814 -193324 -100107 113218 -181083 40681 -191217 34952
19211a22704k11884O6026A95217r7272g6959j30582g8769k23294J14730j00200
$$ -122704 -334588 -268562 195217 97945 -76959 -207541 -78769 -302063 -187333 -287533
19201b87533A12242d79970g1173A3020J0445k059c72234K3674i5819A23193b56037
$$ -287533 112242 -479970 -71173 13020 23465 21406 -372234 -348560 -95819 123193 -256037
19189i9494A04948Q4082A655d24733J22122J45581j20124a30605J9356a3554A31606
$$ -99494 104948 189030 1655 -424733 -302611 -157030 -277154 -130605 -111249 -13554 131606
19177a07870B23476h824j49869c2457j95086N3949M5423B3675g1673m8653k6573
$$ -107870 223476 -8824 -158693 -32457 -227543 -173594 -128171 23675 -71673 -120326 -146899
19166a46899D3346a40541E7027b44313E8269a5827r3104M6268J000C1297b02360
$$ -146899 43346 -140541 57027 -244313 58269 -15827 -108931 -62663 -61663 31297 -202360
19154d9764A16366N3572o4114n2284a21792m1660k16415J66505c8143B19891L5452
$$ -49764 116366 169938 105824 53540 -121792 -163452 -379867 -213362 -38143 219891 255343
19143B55343a59173L9308k0132K3323j58658b4525p3197M4006B37095a58104r0110
$$ 255343 -159173 -119865 -139997 -116674 -275332 -24525 -97722 -53716 237095 -158104 -248214
19132b48214f4179o2898n610D2360a2515A26066b44862O9372D7724b47459J2058
$$ -248214 -64179 -127077 -132687 42360 -12515 126066 -244862 -175490 47724 -247459 -235401
19121b35401C57042H8096l8792a93577C184M35230p3398c18172A49310k0748a28889
$$ -235401 357042 88096 49304 -193577 3184 438414 365016 -318172 149310 128562 -128889
19109a69051D9606c29888f2634A59230J9676F5647d10153R616H19a27380m4921
$$ -169051 49606 -329888 -62634 159230 178906 65647 -410153 -400537 819 -127380 -172301
19098a72301B08950b95900e2524j77677h5050A66917c2326o8629k0113J160j28387
$$ -172301 208950 -295900 -52524 -230201 -85050 166917 -32326 -100955 -121068 -119908 -248295
19087b48295B9055b89488a14880d411A28185n3461a61293k40406B60768d0938
$$ -248295 29055 -289488 -114880 -4411 128185 74724 -161293 -401699 260768 -40938
19076b03884B06361a29415A70591b36347o9322A44174h2763F9153i8673o4786
$$ -203884 206361 -129415 170591 -236347 -305669 144174 -82763 69153 -98673 -163459
19066a63459C56312g2531B76007D9315L496g4074o8220K7462A3481A392Q9430
$$ -163459 356312 -72531 276007 49315 52811 -74074 -142294 -114832 13481 1392 90822
19055I0822k0475K04722E4659b42060J08349b0362I9901c14677R7029A43753g8501
$$ 90822 70347 275069 54659 -242060 -133711 -20362 99901 -314677 -217648 143753 -78501
19043b32453J962g5183q8067j35559F8063b12917A27267K850n0801J61849a8502
$$ -232453 -230491 -75183 -163250 -298809 68063 -212917 127267 130117 79316 241165 -18502
19031e4981I1971b60059C02264d8026A40897b16816A36528J53718A28749k1314
$$ -54981 91971 -260059 302264 -48026 140897 -216816 136528 290246 128749 107435
19021A07435i3870A33533M7188b9973B02921G739a19081f424j41623j90723k9304
$$ 107435 -93870 133533 180721 -29973 202921 7739 -119081 -6424 -148047 -338770 -368074
19010c68074a3516C4418J20875a86654N3048p6159A4365c36376a44634F0855k8575
$$ -368074 -13516 34418 155293 -186654 -133606 -209765 14365 -336376 -144634 60855 32280
18999C2280b28309A93532a54947E6539a29916k146A19277H446b86420J39647p4866
$$ 32280 -228309 193532 -154947 56539 -129916 -132062 119277 8446 -286420 -146773 -221639
18988b21639c3983C961a22415A41356c6167k3407A83509p0650b3276l71106J90112
$$ -221639 -33983 3961 -122415 141356 -36167 -59574 183509 112859 -23276 -394382 -204270
18977b04270Q8114j31870A92701a33910i580k06802E23319B20066N01504q4670
$$ -204270 -116156 -248026 192701 -133910 -9580 -216382 523319 220066 721570 636900
18967F36900B31430N2008d3088N370C40729A44158b4892C9271J14466e407k31998
$$ 636900 231430 283438 -43088 -37718 340729 144158 -24892 39271 153737 -5407 -237405
18956b37405B71937B324a99878j88660I3837l0092K59335j27833Q4931b80728
$$ -237405 271937 2324 -199878 -388538 93837 63745 323080 195247 280178 -280728
18945A68946c45442A93533a16326A34313a79292b5695B27725b4580C9675b05496
$$ 168946 -345442 193533 -116326 134313 -179292 -25695 227725 -24580 39675 -205496
18934c0697A47754c7485j28580k71081E8050j4962i0973g839I1435e6033p7122
$$ -30697 147754 -37485 -166065 -437146 58050 43088 -90973 -7839 91435 -56033 -133155
18923a33155j22960j58863D4936j5654i1073o0005O70j18227H1643J6844J6711
$$ -133155 -256115 -414978 44936 29282 -91073 -151078 -150408 -268635 81643 98487 115198
18912A15198a75135N5850j8455c1196A67351J55853K71227k90182A17411h2588
$$ 115198 -175135 -119285 -137740 -31196 167351 323204 594431 304249 117411 -82588
18901c66725a24339o5872F4436M0763h6281B9988c06015B65943C7902n967J6073
$$ -366725 -124339 -190211 64436 105199 -86281 29988 -306015 265943 37902 31935 48008
18890D8008L3153c65786A69125d790j92613A1215g6354k42513d4184A83682c27253
$$ 48008 81161 -365786 169125 -4790 -197403 11215 -76354 -318867 -44184 183682 -327253
18878A95889a44178H7218c670k66722B8128J14241h0573m6633K4235J8775J8863
$$ 195889 -144178 87218 -3670 -270392 28128 142369 -80573 -127206 -102971 -84196 -65333
18867f5333j21250Q2425c1794m33170a06479D37170a85079L1062A03354h3445
$$ -65333 -186583 -104158 -31794 -464964 -106479 437170 -185079 -154017 103354 -83445
18856a06208L9843n1501k6816a4014o9981j74398B19396i6947A7610f6032k7302
$$ -106208 -66365 -117866 -144682 -14014 -83995 -258393 219396 -96947 17610 -66032 -93334
18845i3334j04346A1697d01405a30909f19k42913B07802N5343a67109L9733e8903
$$ -93334 -197680 11697 -401405 -130909 -619 -243532 207802 263145 -167109 -127376 -58903
18833A01837O5999e2003k07061B31859i6509a1845A2711c637n62345J73426J15034
$$ 101837 167836 -52003 -259064 231859 -96509 -11845 12711 -3637 -565982 -392556 -277522
18822b77522N6928A53596Q2927f4955l75079J89869c701k5590l2602I2486e5981
$$ -277522 -220594 153596 236523 -64955 -440034 -250165 -3701 -29291 -61893 92486 -55981
18810C36136b2396j1917B06854J28273A12975J80922C8114J17852a31790r502
$$ 336136 -22396 -34313 206854 335127 112975 293897 38114 155966 -131790 -141292
18800a41292A32822a0480D90631b33109P1652q054k2551A16178K4716E8287K65143
$$ -141292 132822 -10480 490631 -233109 -161457 -169511 -192062 116178 140894 58287 323430
18789C23430B6635K87284p3373b82162A83618a85540G4925b47168B96940D3396
$$ 323430 26635 313919 240546 -282162 183618 -185540 74925 -247168 296940 43396
18778f0749I7306K59505e4237J1764j28134P2551k66762a6083E5592d9801B37118
$$ -60749 97306 356811 -54237 -42473 -170607 -98056 -364818 -16083 55592 -49801 237118
18766a0054E5217N194c6239k82367a05459K9986l08299i1488k48488a68299E15
$$ -10054 55217 60411 -36239 -318606 -105459 -75473 -383772 -91488 -339976 -168299 515
18754C0630L98898d9869J2453l15794J20608A8992J9283L29348d0896j87397C60722
$$ 30630 429528 -49869 -37416 -353210 -232602 18992 38275 367623 -40896 -228293 360722
18742F0888J2392B3572b2192q198l00503B04299a24461e3455C88659a22908J1774
$$ 60888 73280 23572 -22192 -30390 -330893 204299 -124461 -53455 388659 -122908 -111134
18731a11134N1933a8225r7514o9573d434l23558P9558J08204B25294n9219a3362
$$ -111134 -59201 -18225 -115739 -185312 -4434 -327992 -248434 -140230 225294 166075 -13362
18719a82935K4724N3359C01525A08506q143a96535f3911j02805A25737j8785a09020
$$ -182935 -158211 -104852 301525 108506 100363 -196535 -63911 -166716 125737 106952 -109020
18707F794d9994j87228N2017A14745A3032a86978M17b8374k85614f4318B03420
$$ 6794 -49994 -237222 -185205 114745 13032 -186978 -186561 -28374 -313988 -64318 203420
18695G1164O1923o2273a9476n5335j78246j85893A53436h6839H4591a62234a0045
$$ 71164 133087 70814 -19476 -74811 -253057 -438950 153436 -86839 84591 -162234 -10045
18683a877j2174D5303G525O1567a87495A28571Q9835B6644O3969N4223g1427j36431
$$ -1877 -14051 45303 7525 69092 -187495 128571 218406 26644 90613 144836 -71427 -207858
18671b07858A25573N815K42747b68783O714A51502a06608F2918h9611B24475d3730
$$ -207858 125573 131388 374135 -268783 -262069 151502 -106608 62918 -89611 224475 -43730
18659A50012f5042c1213l796B93419H8221e21941Q9723A59447G9281a46232H2514
$$ 150012 -65042 -31213 -35009 293419 88221 -521941 -432218 159447 79281 -146232 82514
18647b3405j5243j33230E233e3641j07891d8525A56890a79897D851b07850j34186
$$ -23405 -38648 -171878 5233 -53641 -161532 -48525 156890 -179897 4851 -207850 -342036
18636c42036d4452k1832j81493j03119A85427b7797H7425j5418d48648J85980
$$ -342036 -44452 -66284 -247777 -350896 185427 -27797 87425 72007 -448648 -262668
18626b62668E9445d62454a80668j48921a08949b785l09084J39035D9791f6297
$$ -262668 59445 -462454 -180668 -329589 -108949 -2785 -311869 -172834 49791 -66297
18615C15806a00336r4504L3059e0127K0687j64406B0313a77939B27768G4254a14239
$$ 315806 -100336 -194840 -161781 -50127 -29440 -193846 20313 -177939 227768 74254 -114239
18603a12848E156J36838a15979k6439m660f9037j62065h1188K2173G5043l2116
$$ -112848 5156 141994 -115979 -142418 -147078 -69037 -231102 -81188 -59015 75043 42927
18592D2927a44881j92075J63761B97216d66600G6470d5298A3920f2003R276E9239
$$ 42927 -144881 -336956 -173195 297216 -466600 76470 -45298 13920 -62003 -52727 59239
18580b6807H2230a70556A67865R4557a14540B33663a97290i3308B3557a87676
$$ -26807 82230 -170556 167865 262422 -114540 233663 -197290 -93308 23557 -187676
18569A03910a3002D1635M0039b9190o2624A14851c5021H6415J53601M7824o3907
$$ 103910 -13002 41635 81674 -29190 -91814 114851 -35021 86415 240016 287840 223933
18558B23933a43715B16492c7066p2105A03064a27269k69018F856J89111E6704
$$ 223933 -143715 216492 -37066 -109171 103064 -127269 -396287 6856 195967 56704
18547a98733A1740K74852a53836a9673G0445k2290b04724C2400J23517b16506
$$ -198733 11740 286592 -153836 -19673 70445 48155 -204724 32400 155917 -216506
18536A912a81120d7347a1420A88955b0828k05896N3818h4694n8414k61887d9338
$$ 1912 -181120 -47347 -11420 188955 -20828 -226724 -172906 -84694 -143108 -404995 -49338
18524a36574A80862D9449k1055a98792Q9596A09146G364e8200C00119c36070J44311
$$ -136574 180862 49449 28394 -198792 -109196 109146 7364 -58200 300119 -336070 -191759
18513a91759A72528c37558A71322c53927C4836a18635D24522f7933j08991G233
$$ -191759 172528 -337558 171322 -353927 34836 -118635 424522 -67933 -176924 7233
18502a04021p4928e1463k78870a50086D10969h5309j91409P5484J478l1356A80598
$$ -104021 -178949 -51463 -330333 -150086 410969 -85309 -276718 -201234 -199756 -231112 180598
18490E2294a25957K5001K4466a6580D2814k041h0604a3804m07930A00917a02703
$$ 52294 -125957 -100956 -76490 -16580 42814 40773 -80604 -13804 -421734 100917 -102703
18478a33888c2856j82703A0143c70945J58146a0477k21155J05147H4753n059e9622
$$ -133888 -32856 -215559 10143 -370945 -212799 -10477 -231632 -126485 84753 79694 -59622
18466B67560a47270A1545a48011h764C7269e3501A18639I15e3943A47005R3637
$$ 267560 -147270 11545 -148011 -8764 37269 -53501 118639 915 -53943 147005 240642
18455B40642H7570m586a60546A86859E9811P4609b44724F8688a72506j35874A20101
$$ 240642 87570 82984 -160546 186859 59811 134420 -244724 68688 -172506 -308380 120101
18443c01607A15235c42358a26417B8490e9724E8879b30223C12401j12757r5762
$$ -301607 115235 -342358 -126417 28490 -59724 58879 -230223 312401 199644 103882
18433A03882i6326I5328K34640A40730d6610n3347A875a93453o2871B66325B0466
$$ 103882 -96326 95328 329968 140730 -46610 -99957 1875 -193453 -256324 266325 20466
18421a47214H1886J13996B2540a87043j49146J21957f6766q5319J8480D0167J5979
$$ -147214 81886 195882 22540 -187043 -336189 -214232 -66766 -152085 -133605 40167 56146
18410E6146i5335p0961A20994a26046A11020e0779B37670b10692F9900k9782a55660
$$ 56146 -95335 -166296 120994 -126046 111020 -50779 237670 -210692 69900 40118 -155660
18398A83300a58035G1709O2124a37055F7604a68415B33534g4185C47646b62910
$$ 183300 -158035 71709 133833 -137055 67604 -168415 233534 -74185 347646 -262910
18387b94403A7505b23259k69303c0931B23454a61584A18053L6509n9636b11558
$$ -294403 17505 -223259 -492562 -30931 223454 -161584 118053 154562 94926 -211558
18376c39142A2773a52094A9225d7467B25906f1176j13124I7325J91687g8294A32427
$$ -339142 12773 -152094 19225 -47467 225906 -61176 -174300 97325 289012 -78294 132427
18364H0026a51262j9163A62231J04939a07868L4519A56862E8062O1839b8789B72562
$$ 80026 -151262 -170425 162231 267170 -107868 -73349 156862 58062 119901 -28789 272562
18352b2887J0378j4824P329l8499B14139G0510A2872i6781q3947f98j87201I1654
$$ -22887 -12509 -27333 -20004 -58503 214139 70510 12872 -96781 -180728 -698 -187899 91654
18339A71485c41733J55582I2252c04062O6633A7244O3374f6520o0987C0117a41639
$$ 171485 -341733 -186151 92252 -304062 -237429 17244 80618 -66520 -127507 30117 -141639
18327c32269a35852D269g3297A5202a49381l7332b5216m3406D0905A2498b40040
$$ -332269 -135852 4269 -73297 15202 -149381 -186713 -25216 -68622 40905 12498 -240040
18315A51355d4578A55320f4482I4257a19732A72541K7296E9069Q5024c87265a88040
$$ 151355 -44578 155320 -64482 94257 -119732 172541 199837 59069 144093 -387265 -188040
18303a47809M9454A45241n5377M4704k3105a28492F1995g2448m1234E3825O1090
$$ -147809 -98355 145241 89864 134568 111463 -128492 61995 -72448 -113682 53825 114915
18292A14915A8709K5867b42030B9193b01465A67412C3351a97879B4266H227K3245
$$ 114915 18709 44576 -242030 29193 -201465 167412 33351 -197879 24266 8227 31472
18281C1472K22734D0474J47244A8382L24093J26873b55333A00012b58582b0056
$$ 31472 254206 40474 187718 18382 342475 469348 -255333 100012 -258582 -20056
18270a04235f203C6987J96799g2982j8989j9961R233D7604K7736f2336A16164
$$ -104235 -6203 36987 233786 -72982 -91971 -111932 -102699 47604 75340 -62336 116164
18258g1601c899B06625l3022a66604B44189j04301c4891j23705A14165a71143
$$ -71601 -3899 206625 173603 -166604 244189 139888 -34891 -158596 114165 -171143
18247G6599f9855j41068b0160A6831a91951B09198a06892A66693a11530K8778
$$ 76599 -69855 -210923 -20160 16831 -191951 209198 -106892 166693 -111530 -82752
18237h2752i680A73279N5954h1638l9233A52404g1284j72208h3018j16574A92093
$$ -82752 -9680 173279 229233 -81638 -120871 152404 -71284 -243492 -83018 -199592 192093
18225a07535j11849e8141F357P5952K18080h2100C94285b88690A81635i9498A20929
$$ -107535 -219384 -58141 6357 82309 300389 -82100 394285 -288690 181635 -99498 120929
18213b08913D1624d3949D9788J05142F7991R420e667H7218i1051m0721e2052l9810
$$ -208913 41624 -43949 49788 154930 67991 77411 -5667 87218 -91051 -131772 -52052 -91862
18201i1862C4236b20575j9826Q2361a0963A96952a53355A21815b55694f3363H2694
$$ -91862 34236 -220575 -240401 -158040 -10963 196952 -153355 121815 -255694 -63363 82694
18189a71846m451h3203J7139L0914p0415A13680a05187d5172m7600a4444j84985
$$ -171846 -176297 -83203 -66064 -35150 -105565 113680 -105187 -45172 -92772 -14444 -199429
18178a99429e1644m17157a16817B41245M0971i0215j03967B3523J54362E1758
$$ -199429 -51644 -468801 -116817 241245 282216 -90215 -194182 23523 177885 51758
18167E6764b4349k42787A04767c43130g2414A25061b29471a9745A71295g1499
$$ 56764 -24349 -267136 104767 -343130 -72414 125061 -229471 -19745 171295 -71499
18156b4638j08572e7364A42933J08879c133o161H2589M6169J43083d3555G6466
$$ -24638 -133210 -57364 142933 251812 -3133 -9294 82589 128758 271841 -43555 76466
18144D3336c76552B38071I9433a48177O8047m4190D8816Q8195A1381f7101k77527
$$ 43336 -376552 238071 99433 -148177 -80130 -124320 48816 137011 11381 -67101 -344628
18133c44628g4246B06528a172q9941j47801h4729d0674G5051a1895m96537D1780
$$ -344628 -74246 206528 -1172 -91113 -238914 -84729 -40674 75051 -11895 -508432 41780
18121A59195a70072A91369r0386k4358k6168J04655a39319a9429k32453B30045
$$ 159195 -170072 191369 100983 76625 50457 155112 -139319 -19429 -251882 230045
18110C49653i2409A52549c86664a69625k1627e2941j9176J0740p7253b426A10209
$$ 349653 -92409 152549 -386664 -169625 -191252 -52941 -72117 -61377 -138630 -2426 110209
18098A1199b24039a07076C60783H0933i956q5047J7305C00320a65662M4378o5305
$$ 11199 -224039 -107076 360783 80933 -9956 -95003 -77698 300320 -165662 -121284 -186589
18087a86589l1673A70594G0971A5171R7508B4509a62134B7308h6375A39904K3891
$$ -186589 -218262 170594 70971 15171 112679 24509 -162134 27308 -86375 139904 163795
18076A63795a10773I3928J04376d2341A21034a1022j01521m7776M6324A38627
$$ 163795 -110773 93928 198304 -42341 121034 -11022 -112543 -160319 -113995 138627
18065B32261K20313I2329L63310a71458j1150G3049c601k71534H9183l4652i8232
$$ 232261 452574 92329 455639 -171458 -182608 73049 -3601 -275135 89183 54531 -98232
18053B31180c65902D6527i4658K8913k44251a30407r2293c3346B99399b3221r6806
$$ 231180 -365902 46527 -94658 -65745 -309996 -130407 -222700 -33346 299399 -23221 -120027
18042a20027E7054J10176m8994a61427j5037g7544j37945e8919B88450E7960b57191
$$ -120027 57054 167230 118236 -161427 -176464 -77544 -215489 -58919 288450 57960 -257191
18030C2156d29584b12447O7223B28973H8955b10556d7405A32465c4157A02666
$$ 32156 -429584 -212447 -145224 228973 88955 -210556 -47405 132465 -34157 102666
18019D5929L5435M3585n6046b58956A3420a1735A2748R2844a63290B29574l7108
$$ 45929 81364 124949 68903 -258956 13420 -11735 12748 105592 -163290 229574 192466
18008A92466B5754C68h2789I9257P582b90369A7080K2085E0b07664r1071d7408
$$ 192466 25754 368 -82789 99257 106839 -290369 17080 39165 50 -207664 -298735 -47408
17995F231N6863J99627k906E1074J78162o5109d39535F8744e8823C33399a59468
$$ 6231 63094 262721 259815 51074 229236 164127 -439535 68744 -58823 333399 -159468
17983h4927G554c08163D6717c14727e0607D07732I8868a01174K141b5935A27889
$$ -84927 7554 -308163 46717 -314727 -50607 407732 98868 -101174 -99033 -25935 127889
17971A00308d15801B59682q5971p0723N550B7044J08972c33248C71896g630A56978
$$ 100308 -415801 259682 173711 102988 108538 27044 136016 -333248 371896 -7630 156978
17959D1742Q1253c8117q9379M4179B51174J73B5526i7606j84562G574a713A42048
$$ 41742 122995 -38117 -127496 -83317 251174 251347 25526 -97606 -282168 7574 -1713 142048
17946a81123a8920j11282l050f2793G3657B3698a83673A73694D1376c46319a00226
$$ -181123 -18920 -130202 -133252 -62793 73657 23698 -183673 173694 41376 -346319 -100226
17934A79110J00022H9733R4757a75943A15852D6550o818a59490C0623M95942a38485
$$ 179110 279132 89733 184490 -175943 115852 46550 39732 -159490 30623 526565 -138485
17922a52996A92101c7440j56954D0482K07199a8006j30743A19081O1285a31803
$$ -152996 192101 -37440 -194394 40482 247681 -18006 -148749 119081 180366 -131803
17911D501i4919F2434R8721d42264b01915A67503F6208e9779a0447L989A85039
$$ 4501 -94919 62434 161155 -442264 -201915 167503 66208 -59779 -10447 -6458 185039
17899f4380k6211L2713l65534g8902H5182b6261B51999J13183a95139i5764M6465
$$ -64380 -90591 -57878 -423412 -78902 85182 -26261 251999 365182 -195139 -95764 -49299
17888d9299K2747k7409C6137a93941g3986G2394J68949J5033a90303K5729A49573
$$ -49299 -26552 -53961 36137 -193941 -73986 72394 241343 256376 -190303 -164574 149573
17876f6051q4816N8753L450j06230A275J47480h9158E9753b37038F4285e9790
$$ -66051 -150867 -92114 -88664 -194894 1275 148755 -89158 59753 -237038 64285 -59790
17864C0993i7586D0771o946J82271G464J48394h172B26247J7694a30955J0539
$$ 30993 -97586 40771 33825 216096 7464 155858 -8172 226247 243941 -130955 -120416
17853a20416B1561c489A30987b15825G728L6326a36214A23309b3531B8696g5993
$$ -120416 21561 -3489 130987 -215825 7728 44054 -136214 123309 -23531 28696 -75993
17841A59990b28961C3810i5138A43672K8958l5947I931L42266j74489K24096a56210
$$ 159990 -228961 33810 -95138 143672 172630 136683 9931 352197 177708 401804 -156210
17829B37718a83340h1722j92261D6186b86851B69398g2921A53175o2001a00840
$$ 237718 -183340 -81722 -273983 46186 -286851 269398 -72921 153175 91174 -100840
17818B9952N6271K10332a27778d3869A27239c76366a8926A69635B4251J13905
$$ 29952 86223 296555 -127778 -43869 127239 -376366 -18926 169635 24251 138156
17808A38156O2956q6220N4522h0672A18971M421g5687A88074a24105M0946F1221
$$ 138156 201112 114892 169414 -80672 118971 123392 -75687 188074 -124105 -83159 61221
17796C02701b71446C04848J926q2397b35545A09005R112b9001C40302h5777D3389
$$ 302701 -271446 304848 306774 224377 -235545 109005 118117 -29001 340302 -85777 43389
17784C0323Q2999a89138M3021n531e8389B01564d2729C8696a51314e3531l2626
$$ 30323 113322 -189138 -146117 -151648 -58389 201564 -42729 38696 -151314 -53531 -86157
17773h6157j85403B38451A01320Q0635a0465n0921j71361B35506I6713K90224
$$ -86157 -271560 238451 101320 181955 -10465 -61386 -232747 235506 96713 386937
17763C86937l5753E9252J26125A8527a926j20859C27295I0191h1213B9489a51092
$$ 386937 351184 59252 185377 18527 -1926 -122785 327295 90191 -81213 29489 -151092
17751a37012I5857L8736g1187B5805K25922K4981A00853h2448C23523a42221D03572
$$ -137012 95857 134593 -71187 25805 251727 276708 100853 -82448 323523 -142221 403572
17739b45574D20552j65663i7543B25632p9796l6130l8655L2154K77016c17956
$$ -245574 420552 254889 -97543 225632 145836 109706 71051 103205 380221 -317956
17728A75278n2454Q7056l6943n9607L0075q547K0107F4274a72205Q5494k02836
$$ 175278 122824 209880 172937 113330 143405 134858 154965 64274 -172205 -86711 -289547
17717b89547g1167A30929i3576a413j24177j7617C22611B6428P9214L5768P4437
$$ -289547 -71167 130929 -93576 -1413 -125590 -143207 322611 26428 105642 141410 215847
17706B15847j891N8883d1331d424C47685a4317A44703J37905a43699q8483Q9416
$$ 215847 213956 272839 -41331 -4424 347685 -14317 144703 282608 -143699 -232182 -142766
17695a42766D42777k8129i010G7958J37788A04695L0904J65442A23737J69284
$$ -142766 442777 414648 -9010 77958 215746 104695 135599 301041 123737 293021
17685B93021h6357A604L49508A64117o8917N465J5877K28636D1429b81496C65596
$$ 293021 -86357 1604 351112 164117 95200 100665 116542 345178 41429 -281496 365596
17673I812K0274a35007A88424A3180Q6865o153M8481b87433A51528e5824G6405
$$ 9812 30086 -135007 188424 13180 100045 93892 142373 -287433 151528 -55824 76405
17661h1772A26631J159m3965K78345A71992f2914A46873Q5856A00724C2830K87534
$$ -81772 126631 127790 83825 362170 171992 -62914 146873 232729 100724 32830 320364
17650C20364f9845i78B11048N0777K47482H5233J2482J48181A19011J07306O6916
$$ 320364 -69845 -978 211048 261825 509307 85233 97715 245896 119011 226317 293233
17639B93233j6399A0009K93932j34588l7219l4656m1988O7890K4121J79984r8892
$$ 293233 276834 10009 303941 169353 132134 97478 55490 123380 147501 327485 228593
17628B28593A0260L861b4486F1555e620j8348A99547P0034J97275B23014A04454
$$ 228593 10260 14121 -24486 61555 -5620 -23968 199547 269581 466856 223014 104454
17616D0707c8934n4585a6862I1032d3857A13020J22723n5197q0162i3272b913
$$ 40707 -38934 -93519 -16862 91032 -43857 113020 235743 180546 100384 -93272 -2913
17604I2413l9994c3456B48972J22734p129j46272B5200J08625J08233e3268A2193
$$ 92413 52419 -33456 248972 371706 364577 218305 25200 133825 242058 -53268 12193
17592I0105Q946J11724P8304K08196a27189B12892g721I9817d2551A02280j9458
$$ 90105 99051 210775 289079 497275 -127189 212892 -7721 99817 -42551 102280 82822
17581H2822K15609A3102K32311E9401M679K87701j50181b0798j66165D46699g2133
$$ 82822 298431 13102 245413 59401 64080 351781 201600 -20798 -186963 446699 -72133
17569H3094f0364b5337A73299f5555C69363D9369J90106B1723b7391E61785F9095
$$ 83094 -60364 -25337 173299 -65555 369363 49369 239475 21723 -27391 561785 69095
17557d2874A73712C377M41947A75919q3130K17087A14302O9037D3062c1373H7200
$$ -42874 173712 3377 445324 175919 92789 309876 114302 183339 43062 -31373 87200
17545G0110J0266J22871b3640A38568J64823G9868J69170n6777h8317A46157b8677
$$ 70110 80376 203247 -23640 138568 303391 79868 249038 192261 -88317 146157 -28677
17533B26071K8140I1500J30292q1408N7633K70593j71469M56854L35360m2817
$$ 226071 254211 91500 221792 140384 198017 468610 297141 753995 1089355 1046538
17523A046538J68471j572E12800J33467j03614k12191j32713K60704j4973J55317
$$ 1046538 1215009 1213437 512800 646267 542653 330462 197749 458453 443480 598797
17513E98797J6391J58181j15925L44749K79402J30913n23829l37062J20418B73970
$$ 598797 615188 773369 657444 1002193 1281595 1412508 888679 551617 672035 273970
17502D06887B9523Q8806J41113L05188A84864J56965K77001A95358I6816M2699
$$ 406887 29523 118329 259442 564630 184864 341829 618830 195358 96816 139515
17492A39515K47682P5685A4376R3439J44550K28638B28714q216J78362o0428o2956
$$ 139515 387197 462882 14376 107815 252365 481003 228714 220498 398860 338432 275476
17481B75476Q3194J3897i0654C37937J465J12306m082k8152k09336c175D58598
$$ 275476 358670 372567 -90654 337937 339402 451708 447626 419474 210138 -3175 458598
17469A41706E2990K87836J49764A33737b42388g4081c2391D87575j31052n608
$$ 141706 52990 340826 490590 133737 -242388 -74081 -32391 487575 356523 350915
17459C50915R1840j39071j11164N8424A08255K05543j40357j690J9939O256M30180
$$ 350915 442755 303684 192520 250944 108255 313798 173441 171751 191690 197946 628126
17448F28126j98781J35976B27738O37607k04403k98902K18613j44244A73089N0448
$$ 628126 429345 565321 227738 865345 660942 362040 580653 436409 173089 223537
17438B23537K31812Q4612N6086j52377L8923k9062J70169B61292r0143K98280
$$ 223537 455349 539961 596047 443670 482593 453531 623700 261292 171149 469429
17428D69429J14386j64478m0551n5791P9333K28789j58807k1876m2678J4491l3487
$$ 469429 583815 419337 378786 322995 402328 631117 472310 450434 407756 422247 388760
17417C88760A89910j4262P9457I9379N54327k03673O837R2441q1839m9292K62898
$$ 388760 189910 175648 255105 99379 653706 450033 456870 549311 467472 418180 681078
17406F81078B19344J04562N9575m6351N587R7379j56689D8085K88188k4627k5901
$$ 681078 219344 323906 383481 337130 342717 440096 283407 48085 336273 311646 285745
17395B85745h0016A84725O3026L6115j28344L92742B05868P5646q9108K49595
$$ 285745 -80016 184725 247751 283866 155522 548264 205868 281514 192406 442001
17385D42001F9770N43144C01876m529A31472m993K32636j07693R0677n8658J88033
$$ 442001 69770 612914 301876 297347 131472 126479 359115 251422 342099 283441 471474
17374D71474j36630G7507J70911L89738C16642K29730A15327j9827K30649A23807
$$ 471474 334844 77507 248418 638156 316642 546372 115327 95500 326149 123807
17363E10517k34989K0809o4028l5536J26282R8440j31293l5692K69764k27842
$$ 510517 275528 296337 232309 196773 323055 421495 290202 254510 524274 296432
17353B96432A09280K34842j26056K5981j20487J71660j04634q1565L3507J06736
$$ 296432 109280 344122 218066 244047 123560 295220 190586 109021 142528 249264
17343B49264K80302A99093J69047j01160J01154p6448c1731H9969R3847L08389
$$ 249264 529566 199093 368140 266980 368134 291686 -31731 89969 183816 492205
17333D92205e9961F63435k34687H1825R8809H3760K70009A42434m9893J11140
$$ 492205 -59961 663435 428748 81825 180634 83760 353769 142434 92541 203681
17323B03681Q6237A4564K54688H0188K37621M4781K06782A57978Q9433h5950A85970
$$ 203681 289918 14564 269252 80188 317809 362590 569372 157978 247411 -85950 185970
17311B74090a61618A54555K50251r7555b17746B33408J58929A94265l3890J28118
$$ 274090 -161618 154555 404806 307251 -217746 233408 392337 194265 160375 288493
17301B88493L5556K99627k61158K7696A87263H8034R8904C7475J24576Q5566e4203
$$ 288493 324049 623676 362518 390214 187263 88034 186938 37475 162051 247617 -54203
17289B97385K7630a1079D96460A92991m4333M51907A80948J19946L5155J29724
$$ 297385 325015 -11079 496460 192991 148658 600565 180948 300894 336049 465773
17279D65773p0777J68004A06356J32928J45628j65167K21211B08281M3708o6818
$$ 465773 394996 563000 106356 239284 384912 219745 440956 208281 251989 185171
17269A85171K21576j02925J9472K30068J16864J16609A76000L77807j26294A40825
$$ 185171 406747 303822 323294 553362 670226 786835 176000 553807 427513 140825
17258C81171j69637L77523j88962L3662A21512J55717L7041K45446B03949J1242
$$ 381171 211534 589057 400095 433757 121512 277229 314270 559716 203949 215191
17248B15191K66941l0916b6024D07388P4103j33108J68309j52132j68481K18033
$$ 215191 482132 451216 -26024 407388 481491 348383 516692 364560 196079 414112
17238D14112l3771m9206K6578J26452F9753M21460L76j45952o5420C1425L65636
$$ 414112 380341 331135 357713 484165 69753 491213 491589 345637 280217 31425 397061
17227C97061j28103K76910o6361J44144k34614J08501j76670K03494k38003m285
$$ 397061 268958 545868 479507 623651 389037 497538 320868 524362 286359 282074
17217B82074J32800J5137k2897Q6872j30220I7041J18409K17455A74296K83104
$$ 282074 414874 430011 407114 493986 363766 97041 215450 432905 174296 457400
17207D57400k25799M12905J3901j07594A53939n486M41500N1089J9133l26393
$$ 457400 231601 644506 658407 550813 153939 148453 589953 641042 660175 333782
17197C33782L20500A69449q0566M98363k27571q5815j34375K97870k08031O1754
$$ 333782 654282 169449 88883 587246 359675 273860 139485 437355 229324 291078
17187B91078K99405j07538k5530j36917p43J26756k17266k5475M85772l37487
$$ 291078 590483 482945 457415 320498 319755 446511 229245 203770 689542 352055
17177C52055K89499J70134C97350J45462J6098j56295n8811B7449O71091B90980
$$ 352055 641554 811688 397350 542812 558910 402615 343804 27449 698540 290980
17166C82830r0328N56220C70386J58317n2734l7329M0702N5180j19722N3834K34046
$$ 382830 292502 848722 370386 528703 475969 438640 479342 534522 414800 468634 702680
17155G02680l9698r5062j89265J8093n6753r1499N0038J44566l9754J76750L4468
$$ 702680 662982 567920 378655 396748 339995 248496 298534 443100 403346 580096 614564
17144F14564P5817k43904L6525J57293j47172K32868j72817A81068L85741J23619
$$ 614564 690381 446477 483002 640295 493123 725991 553174 181068 566809 690428
17134F90428Q2641B52274L02465k4337e3005C84676j8654J24597J75223j88197
$$ 690428 773069 252274 554739 530402 -53005 384676 366022 490619 665842 477645
17124D77645O1076j39763K86635k38415j48441L75728j74615j83105M79762k55067
$$ 477645 538721 398958 685593 447178 298737 674465 499850 316745 796507 541440
17114E41440n3869L21878j12420J27775k79847r5928K14423p8315M7467K03648
$$ 541440 487571 809449 697029 824804 544957 449029 663452 585137 632604 836252
17104H36252m12257K80997n6538J55614j74064C11406K65630J13366k32190J93289
$$ 836252 423995 704992 648454 804068 630004 311406 577036 690402 458212 651501
17094F51501p1112j31385K68880j08276J96152J70717M0099m09404j21061N87535
$$ 651501 580389 449004 717884 609608 805760 976477 1016576 607172 486111 1073646
17084A073646E04528L09953K3065k68421r261L85581C81495L34867j3170J74382
$$ 1073646 504528 814481 837546 569125 559864 945445 381495 716362 703192 877574
17074H77574J35288j74114j71701K13201P4223j7980k89407l5575K43886j9491
$$ 877574 1012862 838748 667047 880248 954471 936491 647084 611509 855395 835904
17064H35904Q7166J59829o9564l06695M6392M17867j39483j26779o615K41836
$$ 835904 923070 1082899 1013335 706640 753032 1170899 1031416 904637 898022 1139858
17054A139858k32400m7927L25852n37837Q4078o4571Q3942j82229O54713k64150
$$ 1139858 907458 859531 1185383 647546 731624 667053 750995 568766 1223479 959329
17044I59329L13559l80643J62552k24570M77835m36426O4389j71911J46570n9204
$$ 959329 1272888 892245 1054797 830227 1308062 871636 936025 764114 910684 851480
17034H51480J50758o6277j15383J73374M87128o24687J10358J51013p4530K2371
$$ 851480 1002238 935961 820578 993952 1481080 856393 966751 1117764 1043234 1065605
17024A065605J78958l19235J12258R1983l56003K15136K03011J2206k25189J17823
$$ 1065605 1244563 925328 1037586 1129569 773566 988702 1191713 1203919 978730 1096553
17014A096553j01704M01672k09264j78687K4176J73877j0194J70330l12598k9299
$$ 1096553 994849 1396521 1187257 1008570 1032746 1206623 1196429 1366759 1054161 1024862
17004A024862j831R4962R1703n2050L21726k98283J10530j70816N7188k49465
$$ 1024862 1023031 1117993 1209696 1157646 1479372 1181089 1291619 1120803 1177991 928526
16994I28526K03782J30691j43849J66044O4103k25110j35747L03699o1791r7834
$$ 928526 1132308 1262999 1119150 1285194 1349297 1124187 988440 1292139 1230348 1132514
16984A132514P2302K76848k97919O0566p0625L33628L445k89650O4789J67878
$$ 1132514 1204816 1481664 1183745 1244311 1173686 1507314 1510759 1221109 1285898 1453776
16974A453776k56594L52181k91423L59509l25160J07541O44427o00145O8834K94246
$$ 1453776 1197182 1549363 1257940 1617449 1292289 1399830 2044257 1444112 1512946 1807192
16964A807192k30048N398R8343L7483K32623m27935L73551k15789p6909J22864
$$ 1807192 1577144 1582542 1680885 1718368 1950991 1523056 1896607 1680818 1603909 1726773
16954A726773k18775K36237l18089M22218P6793j37969k67776M2222N3421M0975
$$ 1726773 1507998 1744235 1426146 1848364 1925157 1787188 1519412 1561634 1615055 1656030
16944A656030L64859k46966Q3180n1841P8753r5542L4871j14438K9906J77556
$$ 1656030 2020889 1773923 1857103 1805262 1884015 1788473 1823344 1708906 1738812 1916368
16934A916368J47956Q5306m3819N1286L3245j11619M1577N57895j23100l62172
$$ 1916368 2064324 2149630 2105811 2157097 2190342 2078723 2120300 2678195 2555095 2192923
16924B192923M0391j61793O5727J68357J6903J00921J50552k71071J01918l7296
$$ 2192923 2233314 2071521 2137248 2305605 2322508 2423429 2573981 2302910 2404828 2367532
16914B367532l8046l7010J90794J2565J04224N1455j81570J58419J18042n8014
$$ 2367532 2329486 2292476 2483270 2495835 2600059 2651514 2469944 2628363 2746405 2688391
16904B688391j48977M78958l79003M1037j2549K47864j63439K39614k45223K19203
$$ 2688391 2539414 3018372 2639369 2680406 2667857 2915721 2752282 2991896 2746673 2965876
16894B965876J53321j3644j04706k2980J07473K16003J05953K04099l65205j90409
$$ 2965876 3119197 3105553 3000847 2977867 3085340 3301343 3407296 3611395 3246190 3055781
16884C055781M77556J96279p8548L0468R5639k4755k26866j15746q0625J31206
$$ 3055781 3533337 3729616 3651068 3681536 3777175 3752420 3525554 3409808 3329183 3460389
16874C460389M90606m06515J09383K55484r5164N26114n18920M09653J40598k82412
$$ 3460389 3950995 3544480 3653863 3909347 3814183 4340297 3821377 4231030 4371628 4089216
16864D089216K05085M6052p9275P1716J31022J06830R231M19254l73897J44760
$$ 4089216 4294301 4340353 4261078 4332794 4463816 4570646 4579877 4999131 4625234 4769994
16854D769994L7577K78427j64253K61720k7366j3152K32870j1936K28559o5198
$$ 4769994 4807571 5085998 4921745 5183465 5156099 5142947 5375817 5363881 5592440 5527242
16844E527242K67701K60067j90112J15759o8518K37752L94137o47988N74831j42364
$$ 5527242 5794943 6055010 5864898 5980657 5912139 6149891 6544028 5896040 6470871 6328507
16834F328507J06510J49531M31457j16462J56279J07542K46684l57109L82988
$$ 6328507 6435017 6584548 7016005 6899543 7055822 7163364 7410048 7052939 7435927
16825G435927L28777M9880R4378K56397l4064L78698J96517l6594n0708N01123
$$ 7435927 7764704 7814584 7908962 8165359 8131295 8509993 8706510 8669916 8619208 9120331
16815I120331o4104q581N86095l2511L22518J74119j16114N93751L25985J64146
$$ 9120331 9056227 9047646 9633741 9601230 9923748 10097867 9981753 10575504 10901489 11065635
16805A1065635N95281m0071K42151R2953L23673L09354J32286N1288R01681Q7875
$$ 11065635 11660916 11620845 11862996 11955949 12279622 12588976 12721262 12772550 13674231 13762106
16795A3762106l06557P03836P76624k27357Q15608L92701M95654o504N90429O5021
$$ 13762106 13455549 14159385 14936009 14708652 15524260 15916961 16412615 16406111 16996540 17061561
16785A7061561P04469O10644M23769K56350Q72602M30443Q30140j24896J257877
$$ 17061561 17766030 18376674 18800443 19056793 19929395 20359838 21189978 21065082 22322959
16776B2322959K30677Q11551Q10549L41582P00436O93329R39888R23246J155727
$$ 22322959 22553636 23365187 24175736 24517318 25217754 25911083 26850971 27774217 28929944
16767B8929944M31088J001436N33739J334563J184854J083102Q85871J456432
$$ 28929944 29361032 30362468 30896207 32230770 33415624 34498726 35384597 36841029
16759C6841029R58272J230637J415737J739527J153252J248795J625930K390513
$$ 36841029 37799301 39029938 40445675 42185202 43338454 44587249 46213179 48603692
16751D8603692J073575J456454K079684J654599K198817K189361J785299K078565
$$ 48603692 49677267 51133721 53213405 54868004 57066821 59256182 61041481 63120046
16743F3120046K150088K228904K168824K850961K267997K075115K520906K430595
$$ 63120046 65270134 67499038 69667862 72518823 74786820 76861935 79382841 81813436
16735H1813436K232234K674274K412847K313880K334801K088921J837198K071794
$$ 81813436 84045670 86719944 89132791 91446671 93781472 95870393 97707591 99779385
16727I9779385J750094J684915J217151J453186P45636M95381O89403O24223l01211
$$ 99779385 101529479 103214394 104431545 105884731 106630367 107125748 107815151 108439374 108138163
16718A08138163m67478l82076r49211n57831j855380j249532j231498k169970
$$ 108138163 107670685 107288609 106339398 105781567 103926187 102676655 101445157 99275187
16710I9275187j991624k141810k115702k406475k323215k419405k707837k271511
$$ 99275187 97283563 95141753 93026051 90619576 88296361 85876956 83169119 80897608
16702H0897608k347555k404180k774850k169448k385534k406693k136776k189525
$$ 80897608 78550053 76145873 73371023 71201575 68816041 66409348 64272572 62083047
16694F2083047k338538k051439k047373j922001j862787j610375j945444j409774
$$ 62083047 59744509 57693070 55645697 53723696 51860909 50250534 48305090 46895316
16686D6895316j579386j649874j671099j259965j549082j423005q17452j588759
$$ 46895316 45315930 43666056 41994957 40734992 39185910 37762905 36945453 35356694
16678C5356694j027799j078911r18204j262869j126797p08438j029333q33122
$$ 35356694 34328895 33249984 32331780 31068911 29942114 29233676 28204343 27371221
16670B7371221o22950j291532O3903j186286o69828q57896l55713q03437o91783
$$ 27371221 26748271 25456739 25520642 24334356 23664528 22806632 22450919 21647482 20955699
16661B0955699p06668n31146m50282q47014k27913k43473q21926o03163p3337
$$ 20955699 20249031 19717885 19267603 18420589 18192676 17949203 17127277 16524114 16450777
16652A6450777n64605j61536n55062l57274m09931m35109r0001m14659n92485
$$ 16450777 15886172 15724636 15169574 14812300 14402369 13967260 13877259 13462600 12870115
16643A2870115J01769j79479m37768m74933r5980p27339P2271j31850m30159q3696
$$ 12870115 12971884 12792405 12354637 11879704 11783724 11056385 11128656 10996806 10566647 10482951
16633A0482951m6538m10145j23682l73717K3662l80963m88716M80830p66099J9672
$$ 10482951 10436413 10026268 9902586 9528869 9552531 9171568 8682852 9163682 8397583 8417255
16623H417255J28413k28431l29444r858k95259Q0930n70446K06779k88351j38786
$$ 8417255 8545668 8317237 7987793 7977935 7682676 7763606 7193160 7399939 7111588 6972802
16613F972802l2657j131n8957k35176j530m15021Q4316k89977K62998p307l72615
$$ 6972802 6940145 6939014 6880057 6644881 6643351 6228330 6312646 6022669 6285667 6278360 5905745
16602E905745j82787j08479J57615o27943J32048l64240K16295m408R4832k09524
$$ 5905745 5722958 5614479 5772094 5144151 5276199 4911959 5128254 5123846 5218678 5009154
16592E009154k98122M01278k79738k53701j9898k36183J94879j79130J9940K0305
$$ 5009154 4711032 5112310 4832572 4578871 4558973 4322790 4517669 4338539 4358479 4378784
16582D378784m29518J37329j2679k42375L02219k68070k11834K36890j51568j69817
$$ 4378784 3949266 4086595 4073916 3831541 4133760 3865690 3653856 3890746 3739178 3569361
16572C569361J52544p7157J04657Q531m88874j28619J68076j18789j8470l7981
$$ 3569361 3721905 3644748 3749405 3757936 3269062 3140443 3308519 3189730 3171260 3133279
16562C133279J05337J6859l65674K28581k45745O1936j1786o0803p7046L29459
$$ 3133279 3238616 3255475 2889801 3118382 2872637 2934573 2922787 2861984 2784938 3114397
16552C114397m27765j4104K5409M8035j54323M6966l56656L57790M0007l83165
$$ 3114397 2686632 2672528 2697937 2745972 2591649 2638615 2281959 2639749 2679756 2296591
16542B296591M41007k06179J23524Q1756n21762j66586M35357k87378K04637l64765
$$ 2296591 2737598 2531419 2654943 2736699 2214937 2048351 2483708 2196330 2400967 2036202
16532B036202L33988P166l67943K95166l02252o2604l5926K52781n19046N88005
$$ 2036202 2370190 2377356 2009413 2304579 2002327 1939723 1903797 2156578 1637532 2225537
16522B225537m3313k57855k938n4054m7007K62281m74485M38157l12400K52789
$$ 2225537 2182224 1924369 1921431 1867377 1820370 2082651 1608166 2046323 1733923 1986712
16512A986712k06121j61764j036M34532k36925j93652P385R9979k38785M04818
$$ 1986712 1780591 1618827 1617791 2052323 1815398 1621746 1629131 1729110 1490325 1895143
16502A895143l91580J63726j13987j04541j14812n341J85127J3080j56334J27495
$$ 1895143 1503563 1667289 1553302 1448761 1333949 1328608 1513735 1526815 1370481 1497976
16492A497976j23678J70319k47818O5225p7113o3930J83721N0368k60568K18976
$$ 1497976 1374298 1544617 1296799 1362024 1284911 1220981 1404702 1455070 1194502 1413478
16482A413478l3189L5471k8611M7863K62086n64025k2143J38921j3851n1064l2031
$$ 1413478 1380289 1415760 1387149 1435012 1697098 1133073 1110930 1249851 1236000 1184936 1152905
16471A152905J64679j54415M105k5002j85055M10143k14742J10320k34055R8506
$$ 1152905 1317584 1163169 1167274 1142272 957217 1367360 1152618 1262938 1028883 1127389
16461A127389P2701K6709n0689j47669j99873N9985J56808J58091J3355k73224
$$ 1127389 1200090 1226799 1176110 1028441 828568 888553 1045361 1203452 1216807 943583
16451I43583J6306O44j63099K50524m4923J03720K67486l41992k91193L80974
$$ 943583 959889 960533 797434 1047958 1003035 1106755 1374241 1032249 741056 1122030
16441A122030j67964p6446l6254K63892J05737r5053m10270K18017J81784k0793
$$ 1122030 954066 877620 841366 1105258 1210995 1115942 705672 923689 1105473 1084680
16431A084680D88827K63207J86496k99684L84055k44208m0291k09979K32737N0055
$$ 1084680 488827 752034 938530 638846 1022901 778693 738402 528423 761160 811215
16421H11215q4128Q8385k28806J65309n9912P6830J10475C88814N28212O0996
$$ 811215 727087 815472 586666 751975 692063 768893 879368 388814 917026 978022
16411I78022j61050D04547K17401Q2746K72810k03109L35046m46954K11301k09644
$$ 978022 816972 404547 621948 704694 977504 774395 1109441 662487 873788 664144
16401F64144j78155J46099L02184l05952j61849K46301K98756k45022j27976q2059
$$ 664144 485989 632088 934272 628320 466471 712772 1011528 766506 638530 556471
16391E56471B74994M66209k6696k36385m1505L90092l01139j12093L6204L44297
$$ 556471 274994 741203 714507 478122 436617 826709 525570 413477 449681 793978
16381G93978R8849k56182K1756k0189J03213r0838j85356J30931L8787L38194
$$ 793978 892827 636645 658401 638212 741425 650587 465231 596162 634949 973143
16371I73143D13371J97550m51Q1198k09848K0449K06289j88933m8809o500M38823
$$ 973143 413371 610921 610470 691668 481820 502269 708558 519625 470816 464316 903139
16360I03139l82687J85232q0434j5175j68533k6702k1591M0280j30676R887L34237
$$ 903139 520452 705684 625250 610075 441542 414840 393249 433529 302853 312740 646977
16349F46977m0847p8937k09377K78128k9968B61555P9829J23209A31131M57222
$$ 646977 606130 527193 317816 595944 565976 261555 341384 464593 131131 588353
16339E88353B58009l0066M66254o9661k97148J16831J56066k02684L64815j12088
$$ 588353 258009 227943 694197 624536 327388 444219 600285 397601 762416 650328
16329F50328l23789j18574N12101j91353k6578k17940N18530C75741A18322Q4446
$$ 650328 326539 207965 720066 528713 502135 284195 802725 375741 118322 202768
16319B02768L66121j35464m6298J80880n6855B53129J81589K1456J07351J31551
$$ 202768 568889 433425 387127 568007 511152 253129 434718 456174 563525 695076
16309F95076C39181J38739k13962N2683j29370I0087L67394E7795N37588B94000
$$ 695076 339181 477920 263958 316641 187271 90087 457481 57795 595383 294000
16298C07405r2344l0831E186L43492j986j2755j32321K08537L6777M9260l0623
$$ 307405 215061 184230 5186 348678 346692 333937 201616 410153 446930 496190 465567
16287D65567o4740A94391K01589n0750j05393O0686Q2076K17290k65749M0508
$$ 465567 400827 194391 395980 345230 239837 300523 382599 599889 334140 374648
16277C74648N9023L310N1361p024A53537J59354j08044r5536K55943j06216L00406
$$ 374648 433671 436981 488342 481318 153537 312891 204847 109311 365254 259038 559444
16266E59444B42093J88928L36436I3858K38559J83186H9915J77776l8791J20460
$$ 559444 242093 431021 767457 93858 332417 515603 89915 267691 228900 349360
16256C49360n2270m7260H9278O12605l23579a22799H6287J77571K11248R2031
$$ 349360 297090 249830 89278 701883 378304 -122799 86287 263858 475106 567137
16246E67137a74414B13817P8500r063L51A34778D5432K65602r7900L7553K13889
$$ 567137 -174414 213817 292317 283254 283605 134778 45432 311034 213134 250687 464576
16235D64576b6295A00471L3323Q0190F2018J67543N9790J85585A2432K29066c087
$$ 464576 -26295 100471 133794 213984 62018 229561 289351 474936 12432 241498 -3087
16223i7988H5086O0574Q4582Q4688E7162J89475j16385K58242j54967C3494K37065
$$ -97988 85086 145660 230242 314930 57162 246637 130252 388494 233527 33494 270559
16212B70559A07148a05012E4265J91571l6140q252F2402J3762R8717Q964f1369
$$ 270559 107148 -105012 54265 245836 209696 201444 62402 76164 174881 183845 -61369
16200F6282B7951a5680B9706b573A51527J54745r602L8327j44649K40395p0501
$$ 66282 27951 -15680 29706 -2573 151527 306272 296670 334997 190348 430743 360242
16189C60242m9628l9719J39880k8305j78552E63K50904L9529o4207e7734B05467
$$ 360242 310614 270895 410775 382470 203918 563 251467 290996 226789 -57734 205467
16177B62768J97289m4858n7762A35631J65382e9653B74090F3642a54227A43401
$$ 262768 460057 415199 357437 135631 301013 -59653 274090 63642 -154227 143401
16166B28031a1011A84474C5899r089J85452L2763j14970o612a6139B83882a03391
$$ 228031 -11011 184474 35899 26810 212262 245025 130055 123443 -16139 283882 -103391
16154C2316b31550A07227K66621M5727a71986C41510A39675D8974K71165A03483
$$ 32316 -231550 107227 373848 419575 -171986 341510 139675 48974 320139 103483
16143E5312h1480A95876i384A08452K69491A9742K75217B8544J07950K04381j44251
$$ 55312 -81480 195876 -9384 108452 377943 19742 294959 28544 136494 340875 196624
16132A96624k6372o4754b54818J03972A01593L8232B5968J77656n4266B1787Q6976
$$ 196624 170252 105498 -254818 -150846 101593 139825 25968 203624 149358 21787 108763
16121A08763n898a21640A55164l4191b01940A17797n0749l0049M8538j7197L97500
$$ 108763 102865 -121640 155164 120973 -201940 117797 67048 36999 85537 68340 465840
16110D65840j70502A39299K1262b345G9878k4962K66973a33691J9184G8552J89022
$$ 465840 295338 139299 160561 -2345 79878 54916 321889 -133691 -114507 78552 267574
16099B67574c99747G3339Q1549G0628b13327A22613K7157E5010a97186B83515
$$ 267574 -399747 73339 154888 70628 -213327 122613 149770 55010 -197186 283515
16088D43855b04316C04822B9861R8517D4230a8345C94553j02121d0760B53436
$$ 443855 -204316 304822 29861 128378 44230 -18345 394553 292432 -40760 253436
16077d3510J9899B43951f3955I7959l5231h9641A09878h9110E1129J5568c0160
$$ -43510 -23611 243951 -63955 97959 62728 -89641 109878 -89110 51129 66697 -30160
16065A89674b1656C28348j31342q5481M038A0579c9547B8432N108b82455J01781
$$ 189674 -21656 328348 197006 111525 115563 10579 -39547 28432 33540 -282455 -180674
16054a80674h05j38007A91521k9167A6457c1126A35969J1795a3063C0681d06924
$$ -180674 -805 -138812 191521 162354 16457 -31126 135969 147764 -13063 30681 -406924
16042a11878b2868j61295a3426G3879c1199j89449H5464J81053a02452k1998B37045
$$ -111878 -22868 -184163 -13426 73879 -31199 -220648 85464 266517 -102452 -124450 237045
16030G5046b49346B39290J54927A40089b17599E9515M8401h1351n1117A15501
$$ 75046 -249346 239290 394217 140089 -217599 59515 107916 -81351 -132468 115501
16019B0077P1476B2666Q308a62048D77157H7638K74851A40414M0238L4610a74424
$$ 20077 91553 22666 30974 -162048 477157 87638 362489 140414 180652 215262 -174424
16007G0957d1806j75936c2101A84618m9961B4682J26053K0678n5396L1916a2209
$$ 70957 -41806 -217742 -32101 184618 134657 24682 150735 171413 116017 147933 -12209
15995A77782b3641l2495E9234b2293B11259a25351B53045E3947K73596N29316
$$ 177782 -23641 -56136 59234 -22293 211259 -125351 253045 53947 327543 856859
15985H56859K28919j74464l6026K33797m87550k82384j30735B2489a11082J1100
$$ 856859 1085778 911314 875288 1109085 621535 339151 208416 22489 -111082 -99982
15975i9982A01003c6508A5054k651J24515J14069A19510R4875q3108c9226j6803
$$ -99982 101003 -36508 15054 12403 136918 250987 119510 214385 131277 -39226 -56029
15964e6029C28748j07121I4790b67615a07111M2708A10027D439J61547N8823f1518
$$ -56029 328748 221627 94790 -267615 -107111 -64403 110027 4439 165986 224809 -61518
15952H7696J12631a01044K1560j84705f6892B3421J3498J94834a65322q8078A03788
$$ 87696 200327 -101044 -79484 -264189 -66892 23421 36919 231753 -165322 -253400 103788
15940c2223A40073a65915C1139P815j5017h0112C55784e56524A01296d9242A54162
$$ -32223 140073 -165915 31139 38954 23937 -80112 355784 -556524 101296 -49242 154162
15928b22765G733a32809A87987l9201b64074D4440K6325a37949k3460g3625k28672
$$ -222765 7733 -132809 187987 148786 -264074 44440 70765 -137949 -161409 -73625 -302297
15917c02297F6961a08607B93656E1246J8375f299j88032d296A68766b46879i8895
$$ -302297 66961 -108607 293656 51246 69621 -6299 -194331 -4296 168766 -246879 -98895
15905e7863H8705a43081B89780N300A04902e1912k769j0204B260f839I0328b65267
$$ -57863 88705 -143081 289780 295080 104902 -51912 -54681 -64885 2260 -6839 90328 -265267
15892a53267A73181d1027j92759f6934A89434q5525k7240R7551h0547j52301A00215
$$ -153267 173181 -41027 -233786 -66934 189434 103909 76669 174220 -80547 -232848 100215
15880B05074E0028b65988g7350B80201a64990j27200a4574k12109A0210L18345
$$ 205074 50028 -265988 -77350 280201 -164990 -292190 -14574 -226683 10210 328555
15870C28555b80946B32295E9860a96384P5697o3057a9288k57075f7929E7710a20116
$$ 328555 -280946 232295 59860 -196384 -120687 -183744 -19288 -276363 -67929 57710 -120116
15858B03757j5863b06901b1930l2085O500J1580j7090q4640A29310E7021a04325
$$ 203757 187894 -206901 -21930 -54015 -47515 -35935 -53025 -137665 129310 57021 -104325
15846B1226a12906a9922B43794b84786I9926M5072i0526A05201a1576G4529a36270
$$ 21226 -112906 -19922 243794 -284786 99926 144998 -90526 105201 -11576 74529 -136270
15834i2645p4118f3116j9519L348A87895a55817K0843l57991A8829g0371m9572
$$ -92645 -166763 -63116 -82635 -79287 187895 -155817 -134974 -492965 18829 -70371 -119943
15823a19943I0124a10346A20037c36171B90609d1628B22284c11693J44891c5577
$$ -119943 90124 -110346 120037 -336171 290609 -41628 222284 -311693 -166802 -35577
15812a6713C0141a5715B23337F9703a02456j7433j1362B41187H5075a14354i875
$$ -16713 30141 -15715 223337 69703 -102456 -119889 -131251 241187 85075 -114354 -9875
15800b67800e177k5393l9821K7376F4740J57869a87823l982B01118R9538A10481
$$ -267800 -5177 -30570 -70391 -43015 64740 222609 -187823 -191805 201118 300656 110481
15788i9146o37A25603b63752J24237f3404A99846c2636C71433j20950b83938D6489
$$ -99146 -99783 125603 -263752 -139515 -63404 199846 -32636 371433 250483 -283938 46489
15776f8922c3566A81306J5644c2974A39700J40743a15268E8323d0346a73A05106
$$ -68922 -33566 181306 196950 -32974 139700 280443 -115268 58323 -40346 -173 105106
15764b0306k61831D3208K15945I2223b39949D3934K77562g289q8122H6235M2829
$$ -20306 -282137 43208 259153 92223 -239949 43934 321496 -7289 -95411 86235 129064
15753A29064a39811j41020a08351A51431b91825B63797b48137J20459H9271b30241
$$ 129064 -139811 -280831 -108351 151431 -291825 263797 -248137 -127678 89271 -230241
15742d6450B26234a5652j54081A52883b96007i7098C8486Q3324J61912h715j19151
$$ -46450 226234 -15652 -169733 152883 -296007 -97098 38486 121810 283722 -8715 -127866
15731a27866d6581A30798e1286j4420B51393b26749R4860G507K0743J25091D5340
$$ -127866 -46581 130798 -51286 -65706 251393 -226749 -131889 7507 28250 153341 45340
15719H4680a4617k9743Ia72557k00821A42199a57451d0500j45771h5848n7544
$$ 84680 -14617 -44360 9 -172557 -373378 142199 -157451 -40500 -186271 -85848 -143392
15708a43392f9947B17905F0204b43302J12115a4401B38988F2007a89806D140M2689
$$ -143392 -69947 217905 60204 -243302 -131187 -14401 238988 62007 -189806 4140 46829
15697D6829a5576j81871h005G1470a75282A26490b35125A45749a8658k59342b0573
$$ 46829 -15576 -197447 -8005 71470 -175282 126490 -235125 145749 -18658 -278000 -20573
15685a4724j7920l3900o6711B41522a41350f5784l9773A10548j3664h6695n3740
$$ -14724 -32644 -66544 -133255 241522 -141350 -65784 -105557 110548 96884 -86695 -140435
15674a40435c790I5285b45490B15118i3175A79018a48100A06561L5833b04952
$$ -140435 -3790 95285 -245490 215118 -93175 179018 -148100 106561 142394 -204952
15663e7627F3988b04007C07059j51574k8434b36572m7729B42448C2552K0808G181
$$ -57627 63988 -204007 307059 155485 127051 -236572 -284301 242448 32552 53360 7181
15651A68652a67271j4019B78566j21742C746K20823L8398e6959l4254p0928A75876
$$ 168652 -167271 -181290 278566 156824 3746 224569 262967 -56959 -91213 -162141 175876
15639a10188e3525p826C401b95166I8377a80538A82537O4173N0486d2002f730
$$ -110188 -53525 -61351 3401 -295166 98377 -180538 182537 246710 297196 -42002 -6730
15627F6102b4080A19718m5660a01589B1960b01793k9545A78782b09487F0359e38
$$ 66102 -24080 119718 74058 -101589 21960 -201793 -231338 178782 -209487 60359 -538
15615g2840C53380B9480a700j78186p2336d1874A91756c1183l5772j59190H0994
$$ -72840 353380 29480 -1700 -179886 -252222 -41874 191756 -31183 -66955 -226145 80994
15603b69895e0207r7769k857A9277K67509a5863B11151d434C19665A06774J76061
$$ -269895 -50207 -147976 -150833 19277 286786 -15863 211151 -4434 319665 106774 282835
15592B82835a35623m9000B5163i0180G9343Q1316L3502F6767L8845k5547a56311
$$ 282835 -135623 -184623 25163 -90180 79343 160659 194161 66767 105612 80065 -156311
15580a84508h0102A90441A0716e0086k7612A21529a9107j28440C19188h7018A50212
$$ -184508 -80102 190441 10716 -50086 -77698 121529 -19107 -147547 319188 -87018 150212
15568a95389A70502h7129D0802C366a65686o8631i9140c1011B57560A11401k3676
$$ -195389 170502 -87129 40802 3366 -165686 -234317 -99140 -31011 257560 111401 87725
15557H7725K8621J369a85173C888b14870A1570a8460B1110a64252A05914a57474
$$ 87725 116346 117715 -185173 3888 -214870 11570 -18460 21110 -164252 105914 -157474
15545d8101A79612a99917p0318E5592J7921k4548P5156M7895l3797m41O4906a83649
$$ -48101 179612 -199917 -270235 55592 73513 48965 124121 172016 138219 137778 202684 -183649
15532B63290g4024A71607f3706B13575g3659k17456b5740B35490H2563a88996
$$ 263290 -74024 171607 -63706 213575 -73659 -291115 -25740 235490 82563 -188996
15521F4352J46387k2631H7061L09209c7655B76928b40861A3849L11661C7744j8167
$$ 64352 210739 188108 87061 396270 -37655 276928 -240861 13849 325510 37744 19577
15510A9577Q0965M7922C7937K7959L36265I9008d751A19697a4383j2085I7016
$$ 19577 100542 148464 37937 65896 402161 99008 -4751 119697 -14383 -26468 97016
15498C1673K99710a75268A99067K11190a6081m8127A22692l972M5463f6619D0420
$$ 31673 331383 -175268 199067 410257 -16081 -64208 122692 118720 164183 -66619 40420
15486c27261g5164B58005B1945b71482C12998b1590n3498E6831i583B40944o792
$$ -327261 -75164 258005 21945 -271482 312998 -21590 -75088 56831 -9583 240944 234152
15475B34152K05513N53233o8675k49063k16951A73136p8935R9672k3512K1627
$$ 234152 439665 992898 924223 675160 458209 173136 94201 193873 170361 191988
15465A91988A5906a04300L5212B83022O8726i1344n2526B59262E1362K61031C7516
$$ 191988 15906 -104300 -69088 283022 351748 -91344 -143870 259262 51362 312393 37516
15453A6378J50444K6499M843k9236B8240e2066C50500j3587l2470k9084m8524
$$ 16378 166822 193321 198164 168928 28240 -52066 350500 336913 304443 275359 226835
15442B26835Q64321P8229K05941m61589k88860j18819D4322e4406G5312d429p5016
$$ 226835 1091156 1169385 1375326 913737 624877 506058 44322 -54406 75312 -4429 -79445
15431g9445B79338j18935A3403a17966j19061A13091A7704a01704j76699B4860
$$ -79445 279338 160403 13403 -117966 -237027 113091 17704 -101704 -278403 24860
15420e9673A25471a43752B18768I330J79970H9609g0607A53688F8215J4223a43956
$$ -59673 125471 -143752 218768 9330 189300 89609 -70607 153688 68215 82438 -143956
15408B1768g8158A01784L2598a68026D3571b10733R8429L2020A30901i3479B0309
$$ 21768 -78158 101784 134382 -168026 43571 -210733 -112304 -80284 130901 -93479 20309
15396c526E5028g8567A24134b12002g9472p8579d240E2561j512a64811C58179
$$ -3526 55028 -78567 124134 -212002 -79472 -158051 -4240 52561 51049 -164811 358179
15384H3958J24233o1800o7289a04007A24055A0490a12916K8558r900B21178j4000
$$ 83958 208191 146391 79102 -104007 124055 10490 -112916 -84358 -94258 221178 207178
15373B07178J22482J32677k24283P7818J50084G9160e5114A71611c1030l7555
$$ 207178 329660 462337 238054 315872 465956 79160 -55114 171611 -31030 -68585
15363f8585A75410J2291K54547L9610B08564h4397A67120j5792M0080R2696n4285
$$ -68585 175410 187701 442248 481858 208564 -84397 167120 151328 191408 284104 229819
15352B29819I3268M73356A84955Q6292j21577B3189J23234L481J5199J01401K78130
$$ 229819 93268 566624 184955 271247 149670 23189 146423 149904 165103 266504 544634
15341E44634B63723J55427J04502r2130A97794C8376a93163A60970C3485L4555
$$ 544634 263723 419150 523652 431522 197794 38376 -193163 160970 33485 68040
15331F8040K4846J72973A19316J65957J47080k00140a46010A83829J69113D2121
$$ 68040 92886 265859 119316 285273 432353 232213 -146010 183829 352942 42121
15320A38228K26617A29111J06442b69279D11776m1589a11456A30429d8259C87667
$$ 138228 364845 129111 235553 -269279 411776 370187 -111456 130429 -48259 387667
15309B90103I9515R7503p8952b4315F7658L902K17484N7553e7135J1402A33359
$$ 290103 99515 197018 118066 -24315 67658 71560 289044 346597 -57135 -45733 133359
15297C21366a14462l6018c845A0241a23788C47159g0888B94159a88658g8114B9626
$$ 321366 -114462 -150480 -3845 10241 -123788 347159 -70888 294159 -188658 -78114 29626
15285a067I1915a80557c7317G806J88376A2266J68104d47439a36137O5119o4737
$$ -1067 91915 -180557 -37317 7806 196182 12266 180370 -447439 -136137 -71018 -135755
15274a35755A68066c01233C4488P8155a80419B82489a11872A02996L1299l1605
$$ -135755 168066 -301233 34488 112643 -180419 282489 -111872 102996 134295 102690
15264A02690J40717a45220N8303C20294A27892J60955D0801K31375A11900l8199
$$ 102690 243407 -145220 -86917 320294 127892 288847 40801 272176 111900 73701
15254G3701e3000G2032R0065c2348k06175L073B27922M6990a974C93833j96031
$$ 73701 -53000 72032 162097 -32348 -238523 -235450 227922 274912 -1974 393833 197802
15243A97802K48743P7816M92284J129559I63259J239350n02633B30611R9407A2936
$$ 197802 446545 524361 1016645 2146204 963259 2202609 1699976 230611 330018 12936
15232c6691C17639I24b58419C03880d1257A35931a25969I2683l6565A5542g1001
$$ -36691 317639 924 -258419 303880 -41257 135931 -125969 92683 56118 15542 -71001
15220a86584g3999B15673B6359c6047F1861L47454a95797G2096J99464a7348A80200
$$ -186584 -73999 215673 26359 -36047 61861 409315 -195797 72096 271560 -17348 180200
15208I404a23455b1323E9606c2888F7698k9225e3865m8394b4237o6479B06353
$$ 9404 -123455 -21323 59606 -32888 67698 38473 -53865 -102259 -24237 -90716 206353
15196A09695J04032D486N7102C66J02172K10729H6219Q3484b4808j83495E1276
$$ 109695 213727 4486 61588 366 102538 313267 86219 169703 -24808 -208303 51276
15184B8728O488b27210C42773a15661B21666a9270A78611G9321f2450J2046j03252
$$ 28728 35216 -227210 342773 -115661 221666 -19270 178611 79321 -62450 -50404 -153656
15173a53656Q955J5522B62770q6804L4705j02964c6498A91976m0432i7802d96
$$ -153656 -144701 -129179 262770 175966 210671 107707 -36498 191976 151544 -97802 -496
15161a79132B60128A04726Q7249G0691b75849B40605h9395H0672c75595F3022
$$ -179132 260128 104726 191975 70691 -275849 240605 -89395 80672 -375595 63022
15150a33588B8459Q9430K34437n3220i717j26673G3530K99556a17053N6809B47086
$$ -133588 28459 117889 352326 299106 -9717 -136390 73530 373086 -117053 -60244 247086
15138b7877n4437J0985l0826a5360C62279j02942a61124B02449a30834B9539J85675
$$ -27877 -82314 -71329 -102155 -15360 362279 259337 -161124 202449 -130834 29539 215214
15127B15214J11955r8124K5329G9014a3550G2354J7131J57605l7872K07153M78269
$$ 215214 327169 229045 254374 79014 -13550 72354 89485 247090 209218 416371 894640
15116H94640C84652r2104E4735K1542K65388B0449L13933j67072P688Q8732G7614
$$ 894640 384652 292548 54735 76277 341665 20449 334382 167310 174998 263730 77614
15104B34045a25707B81598M6248j29102K47801b65289B52459g6780B07832L6320
$$ 234045 -125707 281598 327846 198744 446545 -265289 252459 -76780 207832 244152
15094B44152M5458O4493B9278R6262J09793A01860l1692L41284I8587M59104A60819
$$ 244152 289610 354103 29278 125540 235333 101860 70168 411452 98587 557691 160819
15082B93968D9381K38295A30451J09567i8658C43206j54743h8776A70742C6212
$$ 293968 49381 287676 130451 240018 -98658 343206 188463 -88776 170742 36212
15071B7818i0769B43795r5207h8153B12698j02321K50649h33A09895K7063a9431
$$ 27818 -90769 243795 148588 -88153 212698 110377 361026 -833 109895 136958 -19431
15059A46999m5614K68050J08460k33735K11529E3931a1896A55426K2024J39115
$$ 146999 101385 369435 477895 244160 455689 53931 -11896 155426 177450 316565
15049C16565A15115L39937q3556J99429A10828K9533K80104j40318K22558k16359
$$ 316565 115115 455052 371496 570925 110828 140361 420465 280147 502705 286346
15039B86346I7424L39198j98486K12224j46872K38067j17626K83940k10053K75507
$$ 286346 97424 436622 238136 450360 303488 541555 423929 707869 497816 773323
15029G73323k7825r5098J77538k39530o5430k56018Q286N30057J26716C93323
$$ 773323 745498 650400 827938 588408 522978 266960 275246 805303 932019 393323
15018F58569k30268J45752j65673J09629k03512O0093J26130B08942J12228N4076
$$ 658569 428301 574053 408380 518009 314497 374590 500720 208942 321170 375246
15008C75246L83504j86156A94130K38217j28700k8170J25537K50266C25584r6506
$$ 375246 758750 572594 194130 432347 303647 275477 401014 651280 325584 229078
14998B29078K89419j59205l7374A28500J71621A157L97355K2524N2882L49588
$$ 229078 518497 359292 321918 128500 300121 1157 398512 421036 473918 823506
14988H23506l14913j45972M6351J9308J53484J49684k59929N67112q7260k66434
$$ 823506 508593 362621 408972 428280 581764 731448 471519 1038631 951371 684937
14978F84937j87041i406C58157O2756k5807j16892M79432k5205k01247j23594
$$ 684937 497896 -9406 358157 420913 395106 278214 757646 732441 531194 407600
14968D07600J14983B09455K16155P7927E1567L62912q4888L16097k46871j33074
$$ 407600 522583 209455 425610 503537 51567 414479 329591 645688 398817 265743
14958B65743N3315M4618K10609B77060b7678B99225l0828N1531R370K04977H8574
$$ 265743 319058 363676 574285 277060 -27678 299225 268397 319928 329298 534275 88574
14946C50403L12435B42943N37212R2823l84397A80877J571J95190J81053J9989
$$ 350403 662838 242943 780155 872978 488581 180877 182448 377638 558691 578680
14936E78680m4059L3840L36497l65909M75836j93798L14358k92793M42707l0903
$$ 578680 534621 568461 904958 539049 1014885 821087 1135445 842652 1285359 1254456
14926A254456K30413J77212P5282K0570m65242n5333J94961L77241N64321q5330
$$ 1254456 1484869 1662081 1737363 1757933 1292691 1237358 1432319 1809560 2373881 2288551
14916B288551J52413m57313k74655n28742M3998l18503j57318l22334k1198j30292
$$ 2288551 2440964 1983651 1708996 1180254 1224252 905749 748431 426097 404899 274607
14906B74607L38947J2680j87248J57142j27432A63751M45990Q3533k67423o0808
$$ 274607 613554 626234 438986 596128 468696 163751 609741 693274 425851 365043
14896C65043l9170J10703k11013j02662N6174K63361N7003J3224M7315K58028
$$ 365043 325873 436576 225563 122901 179075 442436 499439 512663 559978 818006
14886H18006O7277J54058r8744o8454j46840R3132K43613q7283l73080K25244
$$ 818006 885283 1039341 940597 872143 725303 818435 1062048 974765 601685 826929
14876H26929l41565J50167k90811J85648K4200j31113M84434D37349L14372l61109
$$ 826929 485364 635531 344720 530368 554568 423455 907889 437349 751721 390612
14866C90612K12290J38338k50426J39654j14208D8587N13541B29435l0088k1964
$$ 390612 602902 741240 490814 630468 516260 48587 562128 229435 199347 177383
14856A77383L52144j93214K93440n8418J5105m7806J38808J37270l63236j32924
$$ 177383 529527 336313 629753 571335 586440 538634 677442 814712 451476 318552
14846C18552O60627j5902J96605j3543L76035l62257j50898k91856K17631N1415
$$ 318552 979179 963277 1159882 1146339 1522374 1160117 1009219 717363 934994 986409
14836I86409l11273L39466m65741O0921q049p9190j0662O0437n3551J77223Q9615
$$ 986409 675136 1014602 548861 609782 601733 522543 511881 572318 518767 695990 785605
14825G85605k03281L7363k72138O27409j67866p0111l1420m2968j82436J40846
$$ 785605 582324 619687 347549 974958 807092 736981 705561 662593 480157 621003
14815F21003J05738N7594k05670N1438k13701q3011J25112J68046N1276L61198
$$ 621003 726741 784335 578665 630103 416402 333391 458503 626549 677825 1039023
14805A039023P9483n19813N24185n41722k46818J9509Q4206q2088L23770j98164
$$ 1039023 1118506 598693 1122878 581156 334338 353847 438053 355965 679735 481571
14795D81571Q1148J65367j62214k26684n0197K98873n5892J06380J3251P2178
$$ 481571 562719 728086 565872 339188 288991 587864 531972 638352 651603 723781
14785G23781j15382B78987J4497O7802M4682L62549j24819p6285K25709L83137
$$ 723781 608399 278987 293484 361286 405968 768517 643698 567413 793122 1176259
14775A176259k20118q8151K24271j63895l65016K41767n916j47596J39307O6280
$$ 1176259 956141 867990 1092261 928366 563350 805117 799201 651605 790912 857192
14765H57192j9490j90650j95243J31740j28790L82936k01777B95677J44688o5803
$$ 857192 837702 647052 451809 583549 454759 837695 635918 295677 440365 374562
14755C74562M78688m7491B04072K02939K22656j22854J10359j40584l5671J57215
$$ 374562 853250 805759 204072 407011 629667 506813 617172 476588 440917 598132
14745E98132n3463R5712R433J15723r2639p3514K34770O6500j42894K56467D80142
$$ 598132 544669 640381 649814 765537 672898 599384 834154 900654 757760 1014227 480142
14733E12512K35569J24476K11933M18873j28600Q18559m61656O7760j18562l92661
$$ 512512 748081 872557 1084490 1503363 1374763 2193322 1731666 1799426 1680864 1288203
14723A288203k50169k24178J22872j64899J14216K30955n32690j70993M16466
$$ 1288203 1038034 813856 936728 771829 886045 1117000 584310 413317 829783
14714H29783J51195j13561j95959n6465M34868m55737K56761l0112M19169k1192
$$ 829783 980978 867417 671458 614993 1049861 594124 850885 820773 1239942 1218750
14704A218750L43638N9435M54528q7563K8732m97265j34566o22648L69724k01820
$$ 1218750 1562388 1621823 2076351 1988788 2017520 1520255 1385689 763041 1132765 930945
14694I30945l15382J64034r6315m8369K45132j91289K55234k88479L73387l9847
$$ 930945 615563 779597 683282 634913 880045 688756 943990 655511 1028898 989051
14684I89051m49880n090K23940j02731J12358J20294k88717J06557k1383P6428
$$ 989051 539171 534081 758021 655290 767648 887942 599225 705782 684399 760827
14674G60827J41482N584k33926N2560l9363K2180L92778m67927L20827l35111
$$ 760827 902309 907893 673967 726527 687164 709344 1102122 634195 955022 619911
14664F19911L72529j13706K11099j60499j00590M5256J05956J9273K86139l11507
$$ 619911 992440 878734 1089833 929334 828744 874000 979956 999229 1285368 973861
14654I73861Q5463K05126k30920K30287L3245J00008j17100l92909L29297m11140
$$ 973861 1059324 1264450 1033530 1263817 1297062 1397070 1279970 887061 1216358 805218
14644H05218J82971q6290J59380j48416J66000O7452J27811k75048k81480M12551
$$ 805218 988189 901899 1061279 912863 1078863 1146315 1274126 999078 717598 1130149
14634A130149p8752K4724P4444o4332l03121K99837L36515n3862l06191R2029
$$ 1130149 1051397 1076121 1150565 1086233 783112 1082949 1419464 1365602 1059411 1151440
14624A151440l6949n9090K96937J0712j35096n5573l24245K47411j0370J21781
$$ 1151440 1114491 1055401 1352338 1363050 1227954 1172381 848136 1095547 1085177 1206958
14614A206958J148j22222P4794L5849J9878k8068R9547P7250L7819l43301k02932
$$ 1206958 1208106 1085884 1160678 1196527 1216405 1188337 1287884 1365134 1402953 1059652 856720
14603H56720K69217L30987k99048K38865N8859J53855j23053J45141n76843K63482
$$ 856720 1125937 1456924 1157876 1396741 1455600 1609455 1486402 1631543 1054700 1318182
14593A318182J18160k96860M96533j28341j20706M30511k93226K50485k64440
$$ 1318182 1436342 1139482 1636015 1507674 1386968 1817479 1524253 1774738 1510298
14584A510298K4121J59507q1910M2507N8434k68318J84223K89677j53761o4354
$$ 1510298 1534419 1693926 1612016 1654523 1712957 1444639 1628862 1918539 1764778 1700424
14574A700424L88044k23067r1444K63193q9192k00315L40437k23997k38260M86874
$$ 1700424 2088468 1865401 1773957 2037150 1947958 1747643 2088080 1864083 1625823 2112697
14564B112697l28414L93956k73499L85743J37295n2528K15153l5290j06533N2817
$$ 2112697 1784283 2178239 1904740 2290483 2427778 2375250 2590403 2555113 2448580 2501397
14554B501397M09264O3687M12043M26633R62107K011217K906776Q238760K5116871
$$ 2501397 2910661 2974348 3386391 3813024 4775131 6786348 9693124 17931884 43048755
14545D3048755P14403A5929058E072480j886218j253561j75076O9704L66386J034464
$$ 43048755 43763158 15929058 5072480 3186262 1932701 1757625 1827329 2193715 3228179
14536C228179K168619m72367k160226j081978L20018l27799O9619K23741r8215
$$ 3228179 5396798 4924431 2764205 1682227 2002245 1674446 1744065 1967806 1869591
14527A869591P1897j54684L04181j42352k25913M13411J82958j32917m3134J2511
$$ 1869591 1941488 1786804 2090985 1948633 1722720 2136131 2319089 2186172 2143038 2155549
14517B155549J58119j49367j45323L6909N19261k69314K1944L35068j85898m2124
$$ 2155549 2313668 2164301 2018978 2055887 2575148 2305834 2327778 2662846 2476948 2434824
14507B434824M4862J42889l77908L77627J02898p860l23226M67744p3817R6153
$$ 2434824 2479686 2622575 2244667 2622294 2725192 2717332 2394106 2861850 2788033 2884186
14497B884186m20213J21463L38065j06037Q3978j30820O5588J94632R6877N7428
$$ 2884186 2463973 2585436 2923501 2817464 2901442 2770622 2836210 3030842 3127719 3185147
14487C185147k72700J86363l06789J87097K26268Q1826K24100l85473M87464k94670
$$ 3185147 2912447 3098810 2792021 2979118 3205386 3287212 3511312 3125839 3613303 3318633
14477C318633K44478k46797K11507p9418J56170q888K39254J0136j19801J26328
$$ 3318633 3563111 3316314 3527821 3448403 3604573 3595685 3834939 3845075 3725274 3851602
14467C851602q685k29054L85632j99242J14379J0648K10204j2606k02961J97152
$$ 3851602 3842917 3613863 3999495 3800253 3914632 3925280 4135484 4122878 3919917 4117069
14457D117069J66085l58332L74004j32773J19575K03663k09264L76764j03036
$$ 4117069 4283154 3924822 4298826 4166053 4285628 4489291 4280027 4656791 4553755
14448D553755M6140J29318O7400J99396r8684j8989N105K19983k6390L00129n7144
$$ 4553755 4599895 4729213 4796613 4996009 4897325 4878336 4883441 5103424 5077034 5377163 5320019
14437E320019r2753J15624M87993j96894J11090L29267k54083K94498K57188k7227
$$ 5320019 5227266 5342890 5830883 5633989 5745079 6074346 5820263 6114761 6371949 6344722
14427F344722q1216m4972Q032J91770M02437J99933J69048K94941j67206Q9449
$$ 6344722 6263506 6218534 6226566 6418336 6820773 7020706 7189754 7484695 7317489 7406938
14417G406938j30296k22207J6676L41400j83733N31981K87949j81743J11812J31310
$$ 7406938 7276642 7054435 7071111 7412511 7228778 7760759 8048708 7866965 7978777 8110087
14407H110087K33128J53744j8873M71282j75959N11849k13814l5388M70755m9502
$$ 8110087 8343215 8496959 8478086 8949368 8773409 9285258 9071444 9036056 9506811 9457309
14397I457309K76195k14255P2842L01019O00844l08092J62655K30462M53175j11062
$$ 9457309 9733504 9519249 9592091 9893110 10493954 10185862 10348517 10578979 11032154 10921092
14387A0921092J16633K41190P96377k53411L42583O56313j04352k02239K94155
$$ 10921092 11037725 11278915 12075292 11821881 12164464 12820777 12716425 12514186 12808341
14378A2808341K50080k0713N41886K32566K84485J0104N12329L67152K85219N90384
$$ 12808341 13058421 13037708 13579594 13812160 14096645 14106749 14619078 14986230 15271449 15861833
14368A5861833J65758L14273N99828k11178P56539K58838k27245O26801M81802
$$ 15861833 16027591 16341864 16941692 16730514 17487053 17745891 17518646 18145447 18627249
14359A8627249N09779L99878N1342M77472N80070Q72196K99721P34198K83047
$$ 18627249 19137028 19536906 19588248 20065720 20645790 21517986 21817707 22551905 22834952
14350B2834952Q05246M16975L12876P22863P90611P75332J099346k4411J203473
$$ 22834952 23640198 24057173 24370049 25092912 25883523 26658855 27758201 27733790 28937263
14341B8937263M49395R32690O92148J081857R47885Q52713Q36133J402781R51165
$$ 28937263 29386658 30319348 31011496 32093353 33041238 33893951 34730084 36132865 37084030
14332C7084030J139833J158077J076856J348943J392918J443696J321379J636731
$$ 37084030 38223863 39381940 40458796 41807739 43200657 44644353 45965732 47602463
14324D7602463J766961J993212J586430K007749J749366K135739K168805K291293
$$ 47602463 49369424 51362636 52949066 54956815 56706181 58841920 61010725 63302018
14316F3302018K416397K628934K496344K694048L206760L112877L045851M078611
$$ 63302018 65718415 68347349 70843693 73537741 76744501 79857378 82903229 86981840
14308H6981840L781093M045990L984254M845285M862341N204017N676715N449380
$$ 86981840 90762933 94808923 98793177 103638462 108500803 113704820 119381535 124830915
14300A24830915O254799O790456O777581P411892Q220824Q363150R270987R145677
$$ 124830915 131085714 137876170 144653751 152065643 160286467 168649617 177920604 187066281
14292A87066281J0367143J1087379J1006890J1988278J2840691J3367292J3875066
$$ 187066281 197433424 208520803 219527693 231515971 244356662 257723954 271599020
14285B71599020J4714004J5060610J5359080J5827391J6002487J5807170J5919206
$$ 271599020 286313024 301373634 316732714 332560105 348562592 364369762 380288968
14278C80288968J5242952J4675065J3671838J2401697J0093819N670365L461954
$$ 380288968 395531920 410206985 423878823 436280520 446374339 452044704 455506658
14271D55506658K329865J109811j286390l879810k958318p785098j0603895j2233002
$$ 455506658 457836523 458946334 457659944 453780134 450821816 443036718 432432823 420199821
14263D20199821j3880445j4647349j5883613j6874070j6827421j6651584j6460617
$$ 420199821 406319376 391672027 375788414 358914344 342086923 325435339 308974722
14256C08974722j5980181j5337543j4396059j4100636j3717126j2624593j1940496
$$ 308974722 292994541 277656998 263260939 249160303 235443177 222818584 210878088
14249B10878088j1416722j0768077r717611p062334q932434p906740q010097p271604
$$ 210878088 199461366 188693289 178975678 171913344 162980910 155074170 147064073 139792469
14241A39792469o948484o707231n478176n498404n099351n190300m736696m662226
$$ 139792469 132843985 126136754 120658578 115160174 110060823 104870523 100133827 95471601
14233I5471601m083878l381960l609720l352169l171588l161882k908443l160534
$$ 95471601 91387723 88005763 84396043 81043874 77872286 74710404 71801961 68641427
14225F8641427k263330k399312k782530k110437k047539j666837j772127j735614
$$ 68641427 66378097 63978785 61196255 59085818 57038279 55371442 53599315 51863701
14217E1863701k189591j950616j370175j087462p49811k154491j445211r13019
$$ 51863701 49674110 47723494 46353319 45265857 44516046 42361555 40916344 40003325
14209D0003325j593012p15214l67486j150671j440664q74488j011176j149226
$$ 40003325 38410313 37695099 37327613 36176942 34736278 33861790 32850614 31701388
14201C1701388o58819o8158j322832j214040r35223l37123m83257p85845r63533
$$ 31701388 31042569 30974411 29651579 28437539 27502316 27165193 26681936 25896091 24932558
14192B4932558l94412o28418o02801k75962r24343l75012n31930p20707k21655
$$ 24932558 24538146 23909728 23306927 23030965 22106622 21731610 21199680 20478973 20257318
14183B0257318n53310l76735m17066j97440k41575n40361m38017o85072j27931
$$ 20257318 19704008 19327273 18910207 18712767 18471192 17930831 17492814 16807742 16679811
14174A6679811j46160m63271n87643K65621m39231p13738q6307l79638K51408
$$ 16679811 16533651 16070380 15482737 15748358 15309127 14595389 14509082 14129444 14380852
14165A4380852n89663j38610l56832l71825r6209k12063l38513k9723l07887l24616
$$ 14380852 13791189 13652579 13295747 12923922 12827713 12615650 12277137 12247414 11939527 11614911
14155A1614911M2930n21490J18072m91065l65460K57914o60488K39061j77586
$$ 11614911 11657841 11136351 11254423 10763358 10397898 10655812 9995324 10234385 10056799
14146A0056799O6175q93538L52603O326n38075J59499m83301K48024n07968K31182
$$ 10056799 10122974 9229436 9582039 9588365 9050290 9209789 8726488 8974512 8466544 8697726
14136H697726l18846J44868m96287n9915M1726L37431k95190m12039j08014k6306
$$ 8697726 8378880 8523748 8027461 7967546 8009272 8346703 8051513 7639474 7531460 7505154
14126G505154k07775K51376l53243m43202L33986m3535n94025M39935n72622J991
$$ 7505154 7297379 7548755 7195512 6752310 7086296 7042761 6448736 6888671 6316049 6318040
14116F318040K43587j48348l24057K22233k62617j53116m3795J77200m79404K34216
$$ 6318040 6561627 6413279 6089222 6311455 6048838 5895722 5851927 6029127 5549723 5783939
14106E783939l40132J21325j91080M49271k23913p52858N62306R3578m33772k64769
$$ 5783939 5443807 5565132 5374052 5823323 5599410 4846552 5408858 5502436 5068664 4803895
14096D803895M22085o1134m92057j57118K03290m4603j30358L76338k23848o02722
$$ 4803895 5225980 5164846 4672789 4515671 4718961 4674358 4544000 4920338 4696490 4093768
14086D093768N19288j97794j81355k36692N0012L02592Q9661n92832L95076j06739
$$ 4093768 4613056 4415262 4233907 3997215 4047227 4349819 4439480 3846648 4241724 4134985
14076D134985m01696L15023j10013k92186K71938l30000L28872J22368m21745
$$ 4134985 3733289 4048312 3938299 3646113 3918051 3588051 3916923 4039291 3617546
14067C617546J30156K5530j03947j50440q2549L41997o3158k532k10605K06406
$$ 3617546 3747702 3773232 3669285 3518845 3436296 3778293 3715135 3712603 3501998 3708404
14057C708404o12371K86058j98783M48212m95582j13753k52296K55010J5810j28030
$$ 3708404 3096033 3382091 3183308 3631520 3135938 3022185 2769889 3024899 3040709 2912679
14047B912679J35590j96499l6294K25249j32285J56872l10309K86399k42840L3056
$$ 2912679 3048269 2851770 2815476 3040725 2908440 3065312 2755003 3041402 2798562 2831618
14037B831618m690l08698J58106Q7164j61470m7259P9573L09090l33996n0324
$$ 2831618 2826928 2518230 2676336 2763500 2602030 2554771 2634344 2943434 2609438 2559114
14027B559114K22584j75165k5361M2681l22112j27431L96584j10753j34858p4519
$$ 2559114 2781698 2606533 2581172 2623853 2301741 2174310 2570894 2460141 2325283 2250764
14017B250764J27739N1021l54832J24418l39250J91749r6931O1001J88257l9436
$$ 2250764 2378503 2429524 2074692 2199110 1859860 2051609 1954678 2015679 2203936 2164500
14007B164500J45022j58949k06683M1126l44307J72652q6160J22576J84980q8725
$$ 2164500 2309522 2150573 1943890 1985016 1640709 1813361 1727201 1849777 2034757 1946032
13997A946032P7683r0055j48016O813j04245O4407R7656K42032J001765K061375
$$ 1946032 2023715 1933660 1785644 1792457 1688212 1752619 1850275 2092307 3094072 5155447
13987E155447N087853K2027152J8141742B3881465A0657972m637321j193519q88236
$$ 5155447 10243300 32270452 50412194 23881465 10657972 6020651 4827132 3938896
13979C938896k87035m00019l43437j49902o1055k34735k70020p7741m3596K01232
$$ 3938896 3651861 3251842 2908405 2758503 2697448 2462713 2192693 2114952 2071356 2272588
13969B272588j6359j61783N9605l11245r0486J83997R1349m4507r4014L67019
$$ 2272588 2256229 2094446 2154051 1842806 1752320 1936317 2027666 1983159 1889145 2256164
13959B256164k65014O721J4755j066l94932K88696l28222k9190J95542k14797
$$ 2256164 1991150 1997871 2012626 2011560 1616628 1905324 1577102 1547912 1743454 1528657
13949A528657K10532r7694R4711j48365R2837j57270o1103J19429p6305J71546
$$ 1528657 1739189 1641495 1736206 1587841 1680678 1523408 1462305 1581734 1505429 1676975
13939A676975k59597J52809J95417j75538o8123M3932p821M5421l84146K2155
$$ 1676975 1417378 1570187 1765604 1590066 1521943 1565875 1558054 1603475 1219329 1241484
13929A241484L62761m45536K15848k68966n9874M18725j33585r2115p0134J26992
$$ 1241484 1604245 1158709 1374557 1105591 1045717 1464442 1330857 1238742 1168608 1295600
13919A295600m8814O5117K15227k0848j04510m08714M18662l64162L21361k26911
$$ 1295600 1246786 1311903 1527130 1506282 1401772 993058 1411720 1047558 1368919 1142008
13909A142008L39346l39856J4419N0316p2426l4076j07666L2471N9597Q9381J6075
$$ 1142008 1481354 1141498 1155917 1206233 1133807 1099731 992065 1024536 1084133 1173514 1189589
13898A189589O2944Q5913P8752j6378l97256O1078J61229k61733J74732l04829
$$ 1189589 1252533 1338446 1417198 1400820 1003564 1064642 1225871 964138 1138870 834041
13888H34041L00905O1361K53568J85487n92620J34518j23466m48685N6771J36625
$$ 834041 1134946 1196307 1449875 1635362 1042742 1177260 1053794 605109 661880 798505
13878G98505K92051K79425l20834E00482L89783J2699L09059k50335J11227O5992
$$ 798505 1090556 1369981 1049147 500482 890265 902964 1212023 961688 1072915 1138907
13868A138907k29293N3780j86632K84040K23018l50487k53278Q3384p8417J96757
$$ 1138907 909614 963394 776762 1060802 1283820 933333 680055 763439 685022 881779
13858H81779p6811L8833J66437p7740L8180P4229l68947m6211M15174k26944j70740
$$ 881779 804968 843801 1010238 932498 970678 1044907 675960 629749 1044923 817979 647239
13847F47239L67867R5326j78631j66122o3305J96625K7337P1112k47141J90005
$$ 647239 1015106 1110432 931801 765679 702374 898999 926336 997448 750307 940312
13837I40312l11854K17704k11040R4343j37732K03966l69894M55630k26045j14398
$$ 940312 628458 846162 635122 729465 591733 795699 425805 881435 655390 540992
13827E40992K30540J48679n8388j2456j902k98392J50457J50729J3394l50619
$$ 540992 771532 920211 861823 849367 847465 549073 699530 850259 863653 513034
13817E13034M59433j88526R8102N40P7046j53285L1683j21531o58M9025m8041
$$ 513034 972467 783941 882043 882583 959629 806344 838027 716496 715838 764863 716822
13806G16822o3305j26349j93688O16888l35604p3425J53134k59821L0404N07017
$$ 716822 653517 527168 333480 950368 614764 541339 694473 434652 465056 972073
13796I72073k06906R3559D13564L26582k06721L18617j38639L1211P688k14971
$$ 972073 765167 858726 413564 740146 533425 852042 713403 744614 752302 537331
13786E37331N41107k69424j32481N8729k20760N6625P532n4892j63556L96310
$$ 537331 1078438 809014 676533 735262 514502 571127 578659 523767 360211 756521
13776G56521l30892L93816J5513n6884C11285K03176j04859N3414L08761l42080
$$ 756521 425629 819445 834958 778074 311285 514461 409602 463016 771777 429697
13766D29697n6408J38813L37223j59177j20322J86206O3712k48839K94342D18225
$$ 429697 373289 512102 849325 690148 569826 756032 819744 570905 865247 418225
13755E01368P8447r4496K35373B21696K96839A82819J02360K11120M1139A60514
$$ 501368 579815 485319 720692 221696 518535 182819 285179 496299 537438 160514
13744A32434K23932J15086J00685J74654j27850O4027j75612m642j27601J84652
$$ 132434 356366 471452 572137 746791 618941 682968 507356 502714 375113 559765
13734E59765k1913j13140L99341l66994O9430R041Q1100j09780j02231N1708K42034
$$ 559765 537852 424712 824053 457059 526489 535530 616630 506850 404619 456327 698361
13723F98361k22840R2825J61418j99516L733k22531J76978j8553j6980K6495Q6636
$$ 698361 475521 568346 729764 530248 533981 311450 488428 469875 452895 479390 566026
13712E66026k62349J89538j05026L2091J84128j6934n5608k6444k40130J15435
$$ 566026 303677 493215 388189 420280 604408 587474 531866 505422 265292 380727
13702C80727o0718P9291K7823j29248K3815K69752j81051j17276j00225M97657
$$ 380727 320009 399300 427123 297875 321690 591442 410391 293115 192890 690547
13692F90547j15774j29386j32943p8986n2487R40J55442J23869L8405j13119J03275
$$ 690547 574773 445387 312444 233458 180971 181911 337353 461222 499627 386508 489783
13681D89783m212q3948A7497L43862J22541j51521r2611J41085m1448L21917C28299
$$ 489783 485571 401623 17497 361359 483900 332379 239768 380853 339405 661322 328299
13669D29805N7535I5484L22904k4582J08429B31715J07299J11565Q2506k33757
$$ 429805 487340 95484 418388 393806 502235 231715 339014 450579 533085 299328
13659B99328m1684K22141k7979j01539M2249A68483N19168m5790k36140j93173
$$ 299328 257644 479785 451806 350267 392516 168483 687651 641861 405721 212548
13649B12548J49398k5726N2577l2975j3416A56072L40063j91913m0290R628j36188
$$ 212548 361946 336220 388797 355822 342406 156072 496135 304222 263932 273560 137372
13638A37372L03199A96133j3158M54382j01875A88896K63602j63245o6303J29927
$$ 137372 440571 196133 182975 637357 535482 188896 452498 289253 222950 352877
13628C52877c935D77338j05492i1391B74530l2230J05776K8768J83776A74855
$$ 352877 -3935 477338 371846 -91391 274530 242300 348076 376844 560620 174855
13617B53429l0102P6538K42276k11877J31794o5595o9959Q8082q5308j36799M68646
$$ 253429 223327 299865 542141 330264 462058 396463 326504 414586 329278 192479 661125
13606F61125l05079J19115k29968K44155q3301j96024L16969R9812A64410L14270
$$ 661125 356046 475161 245193 489348 406047 210023 526992 626804 164410 478680
13596D78680j46265j46923q713L62661j87581h8972A18012M9299K65912E5267
$$ 478680 332415 185492 176779 539440 351859 -88972 118012 167311 433223 55267
13585F1369O7492K20959j40458K49235B19020K81400j98603j13181E780M34701
$$ 61369 128861 349820 209362 458597 219020 500420 301817 188636 5780 440481
13575D40481J457k11616A04727M22689A83308J9451N0263L60112I7268k3484L32024
$$ 440481 441938 230322 104727 527416 183308 202759 253022 613134 97268 73784 405808
13564D05808p4688A446L06910K81A7096K54649q6626a50429C39405n7700j17498
$$ 405808 331120 1446 308356 308637 17096 271745 185119 -150429 339405 281705 164207
13553A64207n8566L00838e5170C55196a34299A38749l0790a63095c0394B16011
$$ 164207 105641 406479 -55170 355196 -134299 138749 107959 -163095 -30394 216011
13542A14113K22823A42297K86792q5406j65170J18222l8024a22295E8992K89623
$$ 114113 336936 142297 429089 343683 178513 296735 258711 -122295 58992 348615
13532C48615A45652J21145k2251k8886O6676J65655B22090o8406J18755D8472
$$ 348615 145652 266797 244546 215660 282336 447991 222090 153684 272439 48472
13521a92984F3137k7943J74127M07738j93639c2276A7762i5561c2039F83837A70078
$$ -192984 63137 35194 209321 617059 423420 -32276 17762 -95561 -32039 683837 170078
13509C52644Q5033a9174B65805A10668M85901B69461o8579l4938J15178J28415
$$ 352644 437677 -19174 265805 110668 596569 269461 200882 165944 281122 409537
13499D09537c048C02458j30441J16891j1882a17573A47402a01263A70766A9981
$$ 409537 -3048 302458 172017 288908 277026 -117573 147402 -101263 170766 19981
13488G9621d6363B11184J90057n8580G0487L01920J65746j34145j50542A25361
$$ 79621 -46363 211184 401241 342661 70487 372407 538153 404008 253466 125361
13477A50635J52773Q3060A87397J67456J07376B04866o9172g1313I6145O5888
$$ 150635 303408 386468 187397 354853 462229 204866 135694 -71313 96145 162033
13467A62033J45636F2820J27052Q718o0475o3736h953j34053C71429g8498C08632
$$ 162033 307669 62820 189872 198590 138115 74379 -8953 -143006 371429 -78498 308632
13455A41104J69734k5423I9719J99727a00932D46189j89374a13445A27088J74530
$$ 141104 310838 285415 99719 299446 -100932 446189 256815 -113445 127088 301618
13445C01618K08100A97396J33361B4913J74390L8014i055B0541K91644j15681
$$ 301618 509718 197396 330757 24913 199303 237317 -9055 20541 312185 196504
13435A96504O0045j14096J95421j1475D0797J99466f2073A99734O9009A24224
$$ 196504 256549 142453 337874 326399 40797 240263 -62073 199734 268743 124224
13424b00136C38498A32936J15875M6824b9192A99362Q4343l3758Q7792J90892
$$ -200136 338498 132936 248811 295635 -29192 199362 283705 249947 337739 528631
13414E28631A16416m7593M59809B13866j5285M960o4572J7700a14751E5773M8167
$$ 528631 116416 68823 528632 213866 198581 203541 138969 156669 -114751 55773 103940
13403A03940B0639a1925A7089R8860E901K03411q5198D4926R1887R0730j5732
$$ 103940 20639 -11925 17089 115949 5901 209312 124114 44926 136813 227543 211811
13392B11811C2206a06411D49231G2379K78596A2245a5499A28665l8969q14a56434
$$ 211811 32206 -106411 449231 72379 350975 12245 -15499 128665 89696 88882 -156434
13380d3989G4172L0527A9604Q7188O7147a16345L9401B60364h2115A81935R8831
$$ -43989 74172 104699 19604 106792 173939 -116345 -76944 260364 -82115 181935 280766
13369B80766j06773L84451A66140G6917J5141O154L01474j65947C7266J36701
$$ 280766 173993 558444 166140 76917 92058 98212 399686 233739 37266 173967
13359A73967o4728K59108A07586C6341K20468J24877A04139D19a6166C97425A04940
$$ 173967 109239 368347 107586 36341 256809 381686 104139 419 -16166 397425 104940
13347A02642a08821J5299B93980J92401E1140J91761K9957j21950a16332F06359
$$ 102642 -108821 -93522 293980 486381 51140 242901 272858 150908 -116332 606359
13336D25206j79245l1952K86936k27178J7696q5390m8823n8411K9172M0417H2752
$$ 425206 245961 214009 500945 273767 291463 206073 157250 98839 128011 168428 82752
13324C01552b9492G9012N7733J57571C180J49675L27117c5049C73484A28234q371
$$ 301552 -29492 79012 136745 294316 3180 152855 479972 -35049 373484 128234 119863
13313A19863J05047J2465Q0498F334L05282A46604J85114d6041A40756m4309l7885
$$ 119863 224910 237375 317873 6334 311616 146604 331718 -46041 140756 96447 58562
13302E8562a58468C53566j23728H4453a4510B08855N1624b13525C06576A07925
$$ 58562 -158468 353566 229838 84453 -14510 208855 260479 -213525 306576 107925
13291b54058e6700j8007C9274c6019A0897c4558H289c70221a5132F4113J7671
$$ -254058 -56700 -74707 39274 -36019 10897 -34558 8289 -370221 -15132 64113 81784
13280H1784d4441A50044N7957E5823j1480o938b61303d1604C55487C3398b4905
$$ 81784 -44441 150044 208001 55823 44343 37405 -261303 -41604 355487 33398 -24905
13268B52397j1354B3599M59239a71441K6428A04285r322J6519c3918B26442d0271
$$ 252397 241043 23599 482838 -171441 -145013 104285 94963 111482 -33918 226442 -40271
13256H0488J70551D2092Q370j9081M6928e8686B1138P9065k0380a28450B6818
$$ 80488 251039 42092 50462 31381 78309 -58686 21138 100203 79823 -128450 26818
13244G1135a84781D46640B7815J429J62568b6209B71980q9366C8564J36257b27474
$$ 71135 -184781 446640 27815 29244 191812 -26209 271980 182614 38564 174821 -227474
13232A50015l4849f869A3465K47647l8386j5822G7267l3696i9929l7643H9858
$$ 150015 115166 -6869 13465 261112 222726 206904 77267 43571 -99929 -137572 89858
13220B39291J5234D3568c3827B84404q2540j0353k3347K4716q6547l2954P3590
$$ 239291 254525 43568 -33827 284404 201864 191511 168164 192880 106333 73379 146969
13209A46969K21515i7421B32673F3611Q3468o1430K65703j32194e5277F0205B8886
$$ 146969 368484 -97421 232673 63611 147079 85649 351352 219158 -55277 60205 28886
13197d7984A26241c2496C54891A29708M1241b02643E27618D9816a09059C86720
$$ -47984 126241 -32496 354891 129708 170949 -202643 527618 49816 -109059 386720
13186B7338J66310L1411a28070C47642E7270d1804F0494M2955d6276k27189d1883
$$ 27338 193648 225059 -128070 347642 57270 -41804 60494 103449 -46276 -273465 -41883
13174E7824a08512A85362c1211g831B52674a28809B8987K24487j12844e58A41931
$$ 57824 -108512 185362 -31211 -7831 252674 -128809 28987 253474 140630 -558 141931
13162a82149E9121L4725J66450d62315b07773A91896a39607b5447k4508h219k01442
$$ -182149 59121 93846 260296 -462315 -207773 191896 -139607 -25447 -49955 -8219 -209661
13151b09661F562b4947j70788Q736b6385B55213Q5268F9749O6212a82663B27261
$$ -209661 6562 -24947 -195735 -186999 -26385 255213 340481 69749 135961 -182663 227261
13139A0458Q6592e6490C1382b3470C0596L4846J51608B0683R3123C0356j4437
$$ 10458 97050 -56490 31382 -23470 30596 65442 217050 20683 113806 30356 15919
13128A5919O9998d2807p53C13331N9050e0842A79851n238E5853B7516J90967G8139
$$ 15919 85917 -42807 -43560 313331 372381 -50842 179851 174613 55853 27516 218483 78139
13115h448D6216a45093L6946B4099O9328l4498f0733q1160k7608J9059E4013a06573
$$ -8448 46216 -145093 -108147 24099 93427 58929 -60733 -141893 -169501 -150442 54013 -106573
13102a19902N8448b6403E3826a10551o9593g5148A93565p6091A6797K03926I116
$$ -119902 -61454 -26403 53826 -110551 -180144 -75148 193565 117474 16797 220723 9116
13090b9185A98784m6492f0950I8797a69644B31977e34610b26660A54772a79667
$$ -29185 198784 152292 -60950 98797 -169644 231977 -534610 -226660 154772 -179667
13079g195A62004c8026C47721b1226A87178L9117b82001C42273I0665J09176f4426
$$ -7195 162004 -38026 347721 -21226 187178 226295 -282001 342273 90665 199841 -64426
13067a62729o2647A36789J68212H3685c78567B69563b40315E1648e7963k10669
$$ -162729 -225376 136789 305001 83685 -378567 269563 -240315 51648 -57963 -268632
13057b68632e0797j59632E2865f3688r5355A16753H897L5240M6222J21114H8978
$$ -268632 -50797 -210429 52865 -63688 -159043 116753 8897 44137 90359 211473 88978
13045I378R9890k2103a226E4375a50155D54733E9913O6662b19770D070L33723
$$ 9378 109268 87165 -1226 54375 -150155 454733 59913 126575 -219770 4070 337793
13034C37793A50394J25406G3556h8671A41248J25711n1861b15249c0698J1465
$$ 337793 150394 275800 73556 -88671 141248 266959 215098 -215249 -30698 -19233
13024a9233A30715m7922b21327A07891a27161A96338b1886r947C16118r0008A06177
$$ -19233 130715 82793 -221327 107891 -127161 196338 -21886 -31833 316118 226110 106177
13012E6091k4354O3907p260F25h745A35448E7199a55811F920a3707C15302a03261
$$ 56091 31737 95644 88384 625 -8745 135448 57199 -155811 6920 -13707 315302 -103261
12999A2942b9743A37015I698a29686B1521J20546a28629j38863A34934n4548b58762
$$ 12942 -29743 137015 9698 -129686 21521 142067 -128629 -267492 134934 80386 -258762
12987A87721G3492g8231A65957q2761B9455J33294j4516E8285a10086k33349B13473
$$ 187721 73492 -78231 165957 83196 29455 162749 148233 58285 -110086 -343435 213473
12975D2357c81790J04007A94874a15736A93639a16856o5161f844j79516A89030
$$ 42357 -381790 -277783 194874 -115736 193639 -116856 -182017 -6844 -186360 189030
12964a98037h5790a9926p5934I7646K6568i3353c0525A57584A6760J11640b81656
$$ -198037 -85790 -19926 -95860 97646 124214 -93353 -30525 157584 16760 128400 -281656
12952C37188B2153d7091A6763c45244f578F6369J96488K149b22717i1114B22411
$$ 337188 22153 -47091 16763 -345244 -6578 66369 262857 265006 -222717 -91114 222411
12940E0768P1384b90616a8862j72320A91237E3135b33948i6919H4996b05132c3078
$$ 50768 122152 -290616 -18862 -191182 191237 53135 -233948 -96919 84996 -205132 -33078
12928f8728k12731B06013J23575j6467c9318a7610F2746L15034a39705J0533e4233
$$ -68728 -281459 206013 329588 313121 -39318 -17610 62746 377780 -139705 -129172 -54233
12916a08024c1913G7354R6169k8228e7949D3317c4792B46144j18167n7153c5850
$$ -108024 -31913 77354 173523 145295 -57949 43317 -34792 246144 127977 70824 -35850
12904B616J98904J1505c08913g0800B54362C5031b02967B09827c1524F5423L52830
$$ 2616 201520 213025 -308913 -70800 254362 35031 -202967 209827 -31524 65423 418253
12893D18253a63687K8830e3606k75262E7629P4669K6714b0455m7953j12053D6865
$$ 418253 -163687 -134857 -53606 -328868 57629 132298 159012 -20455 -68408 -180461 46865
12881D5845N0398N8367m3724h5930b4598j06434A11618a95625A87280a76833A83552
$$ 45845 96243 154610 110886 -85930 -24598 -131032 111618 -195625 187280 -176833 183552
12869A95616a64935k5986i59F5046b6667I7165e1852j62609j49296A28573J4086
$$ 195616 -164935 -190921 -959 65046 -26667 97165 -51852 -214461 -363757 128573 142659
12858A42659a01488a569q3908H4836c0338B57556C1203b76659R3901h8984b4669
$$ 142659 -101488 -1569 -85477 84836 -30338 257556 31203 -276659 -182758 -88984 -24669
12846A09366C1816a85768A74644h2248C21454c97868H078c9579E1019J4664a66448
$$ 109366 31816 -185768 174644 -82248 321454 -397868 8078 -39579 51019 65683 -166448
12834A51198o6985J43696a25214k57802A75752a88304c7221A86556b19913c64
$$ 151198 84213 227909 -125214 -383016 175752 -188304 -37221 186556 -219913 -364
12823a55123A3758d7363m7802B27911b04632L7795A7543R8401a82925p4963A86787
$$ -155123 13758 -47363 -95165 227911 -204632 -166837 17543 115944 -182925 -257888 186787
12811A81431A5381f4958q5831j01757C22745a6699k96208H049L2681a99163R0052
$$ 181431 15381 -64958 -150789 -252546 322745 -16699 -312907 8049 40730 -199163 -109111
12800a09111A422a03192l8117O6141J8879H2720A1185b68559R8619p9504k3062
$$ -109111 1422 -103192 -141309 -75168 -56289 82720 11185 -268559 -169940 -249444 -272506
12789b72506E39646a18153D4929P0176m2150a72055I4948l2540l0088m928i5419
$$ -272506 539646 -118153 44929 115105 72955 -172055 94948 62408 32320 27392 -95419
12777i4655q9363l1002C38186B6961c0138P247B84641b0869B59941l3852J30924
$$ -94655 -184018 -215020 338186 26961 -30138 -22891 284641 -20869 259941 226089 357013
12766C57013A37912b39102Q2853j40284b1927H1569L63681c45163A089K4535j0130
$$ 357013 137912 -239102 -156249 -296533 -21927 81569 445250 -345163 1089 25624 15494
12755A5494b33079A17434P2830a72280J512A4638e9536j13345J2093n0635A8475
$$ 15494 -233079 117434 190264 -172280 -170768 14638 -59536 -172881 -160788 -211423 18475
12743g0024r6761A76503D7465P0149K7861Q1076F848P7061r605J33691b0020A62535
$$ -70024 -166785 176503 47465 117614 145475 226551 6848 83909 74304 207995 -20020 162535
12730B27013p2701c5787J1134H4403b12223C49095c9124l40154F2476A4319K4654
$$ 227013 154312 -35787 -24653 84403 -212223 349095 -39124 -379278 62476 14319 38973
12719C8973f7210A73256a03798F4737a52474B35622A10161K7236K3447a782B16465
$$ 38973 -67210 173256 -103798 64737 -152474 235622 110161 137397 160844 -1782 216465
12707A02245Q3152a46452q7823O0033E46189b20834E4932J97604b65758R3813
$$ 102245 185397 -146452 -234275 -174242 546189 -220834 54932 252536 -265758 -171945
12697a71945B51185D5332J06202f1924C31118n9646H2275A4653J19620c02338
$$ -171945 251185 45332 151534 -61924 331118 271472 82275 14653 134273 -302338
12686A14404J38435j4144o1225K80318C5890J23673M7838q834C2493J67565N334
$$ 114404 252839 238695 177470 457788 35890 159563 207401 198567 32493 200058 205392
12675B05392B5740J10387b98712B13507D3173e3006d598j97288D136J82974f7447
$$ 205392 25740 136127 -298712 213507 43173 -53006 -4598 -201886 4136 187110 -67447
12663C06936p9180f9722k3018l9276M1363c5607D8161g251A05867b21285C26090
$$ 306936 227756 -69722 -92740 -132016 -90653 -35607 48161 -7251 105867 -221285 326090
12651A52033e2328A04904D2044r395a8630A24542b94127a25379D2311f2857B65242
$$ 152033 -52328 104904 42044 32649 -18630 124542 -294127 -125379 42311 -62857 265242
12639a53910g3319A22714J01135a90969b368A91839B6509b2901C0388L62859c3269
$$ -153910 -73319 122714 223849 -190969 -2368 191839 26509 -22901 30388 393247 -33269
12627B19267J94922h8948A1832P0477b18599B90711a18140b6055A59816o668J6405
$$ 219267 414189 -88948 11832 82309 -218599 290711 -118140 -26055 159816 153148 169553
12616A69553p3352C9902a69186g1142K7716B79963a13494B11676b2447l2539p7646
$$ 169553 96201 39902 -169186 -71142 -43426 279963 -113494 211676 -22447 -54986 -132632
12605a32632B66019a8445C51626N9447b08555c3434I7315K51237j11806A4963
$$ -132632 266019 -18445 351626 411073 -208555 -33434 97315 348552 236746 14963
12594A92765g0857B80218A3226J1396I825K25856b36411C38453b00797e4074j18651
$$ 192765 -70857 280218 13226 24622 9825 235681 -236411 338453 -200797 -54074 -172725
12583a72725a2895C45529a04652m05628J41070C5876A4849N9443d250H6715P4906
$$ -172725 -12895 345529 -104652 -510280 -369210 35876 14849 74292 -4250 86715 161621
12572A61621a44757H4826l9157B826b94541o4067A96271c30558J13354I6692d8133
$$ 161621 -144757 84826 45669 2826 -294541 -358608 196271 -330558 -217204 96692 -48133
12560a85795l7266A26302f362A0169a54854k27820C910a31146F172b31840l6887
$$ -185795 -223061 126302 -6362 10169 -154854 -382674 3910 -131146 6172 -231840 -268727
12549b68727a34225A7819J80964A1893b36094A55240h7841J5583a7805I5033N801
$$ -268727 -134225 17819 198783 11893 -236094 155240 -87841 -72258 -17805 95033 100834
12538A00834K7671a98072C5520b90199D5948K6938J80084d23606B29811F1678
$$ 100834 128505 -198072 35520 -290199 45948 72886 252970 -423606 229811 61678
12527c9197C0943b41479A36417J59097F2355G876K20927D213J81980i9385D1438
$$ -39197 30943 -241479 136417 295514 62355 7876 228803 4213 186193 -99385 41438
12515A7989N5619J40093i975m34920C78142G9720h4084B34007l4515a04481A18249
$$ 17989 73608 213701 -9975 -444895 378142 79720 -84084 234007 199492 -104481 118249
12503h2903C9513K90513b7644B05283a79186L0794N4183Q827I6818c17051J32478
$$ -82903 39513 330026 -27644 205283 -179186 -148392 -94209 -85382 96818 -317051 -184573
12492a84573g6038B87669a93828I9154a04846b3763k13474d7084q1961B96051
$$ -184573 -76038 287669 -193828 99154 -104846 -23763 -237237 -47084 -129045 296051
12481I201a39691B54212a295C20701J7889j06577j10163K03081c58649A72707
$$ 9201 -139691 254212 -1295 320701 338590 232013 121850 324931 -358649 172707
12470g2211j68713A77474N0630E7045J4466a85764d6559B6769c26136A3666a44560
$$ -72211 -240924 177474 228104 57045 71511 -185764 -46559 26769 -326136 13666 -144560
12458a88095h7483B44542N027C6799i8118M181C2572J03743F3860L42343b93639
$$ -188095 -87483 244542 249569 36799 -98118 -93937 32572 136315 63860 406203 -293639
12446D897K16128o4796e1995j7911E7052k1218A1885a81390d9564B50841c2956
$$ 4897 221025 156229 -51995 -69906 57052 35834 11885 -181390 -49564 250841 -32956
12434H0707j0216a1505l7224k5598k48971n4621i1397k18757B471a73162F6444
$$ 80707 70491 -11505 -48729 -74327 -323298 -377919 -91397 -310154 2471 -173162 66444
12422E6932R065J25226a54281B70899h9475G5826c82977A15238a49008r210q4427
$$ 56932 65997 191223 -154281 270899 -89475 75826 -382977 115238 -149008 -158218 -242645
12411b42645M5798g578k17084B0286h6734K9110D0630l700N2401d00089J43886
$$ -242645 -196847 -7578 -224662 20286 -86734 -57624 40630 36930 89331 -400089 -256203
12400b56203A43135e5203j36751D4866e2583j53071e6455C2166a1335A06740b24540
$$ -256203 143135 -55203 -191954 44866 -52583 -205654 -56455 32166 -11335 106740 -224540
12388a80827a0803B06410l571k8262j511J68916D1794A9862J23347A7544R9942
$$ -180827 -10803 206410 202839 174577 173066 341982 41794 19862 143209 17544 117486
12377A17486i6116b704q7153A14306K12684F1486O5370d7046A8837b5861I4240
$$ 117486 -96116 -2704 -89857 114306 326990 61486 126856 -47046 18837 -25861 94240
12365B8788J62180l4358E972b03859b4243F9349i951k3300D7534K22700a93346
$$ 28788 190968 156610 5972 -203859 -24243 69349 -9951 -33251 47534 270234 -193346
12353b90725c2798A72414J40807k5303a24605N3669C62162a31589j77454B83020
$$ -290725 -32798 172414 313221 287918 -124605 -70936 362162 -131589 -309043 283020
12342A55098N3468I1624c2270j21194B4536L00550A2826e3147D4514J08526K0412
$$ 155098 208566 91624 -32270 -153464 24536 325086 12826 -53147 44514 153040 173452
12331A73452G7037N5749J86877A0448L42622j67235f1295A25917B8043a96877
$$ 173452 77037 132786 319663 10448 353070 185835 -61295 125917 28043 -196877
12320D54439A58626K2193n8277K95810E6641J48160D1998N0289K20287b20041
$$ 454439 158626 180819 122542 418352 56641 204801 41998 92287 312574 -220041
12309B44907I491a63380B71998b5682F66J64436J32950A19409n4787K34827F7668
$$ 244907 9491 -163380 271998 -25682 666 165102 298052 119409 64622 299449 67668
12297b85786b0067B07080l3433J95171A63710O3154q6888a00481k9559B54847
$$ -285786 -20067 207080 173647 368818 163710 226864 139976 -100481 -130040 254847
12286b34270M8934B39149A12114e3774j43809C08964A37931K73318H2176m0486
$$ -234270 -185336 239149 112114 -53774 -197583 308964 137931 411249 82176 41690
12276D1690K79238H7158d0092D3046c7948a0144D65794A29862a37320L1993c645
$$ 41690 320928 87158 -40092 43046 -37948 -10144 465794 129862 -137320 -105327 -3645
12264E1441J55621O1527e89B07773Q0005A16966b6968j3375A73188a73718j57326
$$ 51441 207062 268589 -589 207773 287778 116966 -26968 -40343 173188 -173718 -331044
12253c31044A69279M9778q8840m3985K92655a96851R8038C81929B5828K26943
$$ -331044 169279 219057 130217 86232 378887 -196851 -98813 381929 25828 252771
12243B52771E8059A2048J97454a17384L3116E44300A64299a52487C27586B8544
$$ 252771 58059 12048 209502 -117384 -84268 544300 164299 -152487 327586 28544
12232i9758B61913b7440l2939m2238D58039b01132D34963A64714K60745k11077
$$ -99758 261913 -27440 -60379 -102617 458039 -201132 434963 164714 425459 214382
12222B14382i1778C43288J1425A63279M2402K44791E7567Q5373J4908a90808C66667
$$ 214382 -91778 343288 354713 163279 205681 450472 57567 142940 157848 -190808 366667
12210D5517g0147F2812a18020P106h287B66559h6581A97932a62521q6525A85263
$$ 45517 -70147 62812 -118020 -110914 -8287 266559 -86581 197932 -162521 -249046 185263
12198i4121j26432d977D91896j73352A39742L4057Q6288p7024J59581a3200C32785
$$ -94121 -220553 -4977 491896 318544 139742 173799 260087 183063 342644 -13200 332785
12186C62138j32766f549B64022c17D18685r5599r5351n5264J27931P6582A32178
$$ 362138 229372 -6549 264022 -317 418685 323086 227735 172471 300402 376984 132178
12174C49880D7071J11284J48808M40A2214K44838J55674j1647j36456L0162Q519
$$ 349880 47071 158355 307163 307603 12214 257052 412726 401079 264623 294785 303304
12163C03304p101j2509b9867A90133m4775J20046b1315A28358d6365C75735G0514
$$ 303304 296203 283694 -29867 190133 145358 265404 -21315 128358 -46365 375735 70514
12151A86129r190o7255c0391G5796a62596A89124m3054i1765C33789o0784H4134
$$ 186129 176939 109684 -30391 75796 -162596 189124 146070 -91765 333789 273005 84134
12139B67084a61039A01399a39834G0575g7162A35557P5616a86207C33157K8174
$$ 267084 -161039 101399 -139834 70575 -77162 135557 211173 -186207 333157 361331
12129C61331L586F7043L9634a35544G1797J56431P5028G4894k7119A404J99072
$$ 361331 364917 67043 106677 -135544 71797 228228 303256 74894 47775 1404 200476
12118B00476m4955e078C71876A36809o1451J8238j1382J63893H9380P304a83382
$$ 200476 155521 -5078 371876 136809 75358 93596 82214 246107 89380 96684 -183382
12106a04345A45298m5619J9972M0919D5667J9284J47433Q5087J07083A57385M7791
$$ -104345 145298 99679 119651 160570 45667 64951 212384 297471 404554 157385 205176
12095B05176a2091C42836j57644Q6512K88258h3804B52819A02267J71315d642
$$ 205176 -12091 342836 185192 271704 559962 -83804 252819 102267 273582 -4642
12084A50872d08216B5455O4724J59560q1386o538a00225l30684E1355f6939g69
$$ 150872 -408216 25455 90179 249739 168353 161815 -100225 -430909 51355 -66939 -769
12072E21454A39841j6984K6270g5133j63518C8635O7426K83144A58553C2050O6087
$$ 521454 139841 122857 149127 -75133 -238651 38635 106061 389205 158553 32050 98137
12061I8137L75466A45511i1746C00357f8656j10199l6867B23757b28272D1366
$$ 98137 473603 145511 -91746 300357 -68656 -178855 -215722 223757 -228272 41366
12050a33372A67695j9621M7389q0008a0962A04991a84081C09449c10211G1592
$$ -133372 167695 148074 195463 115455 -10962 104991 -184081 309449 -310211 71592
12039b42600e5419A84470a37316L9306M1322n5705D75450H372b05091K5387f2972
$$ -242600 -55419 184470 -137316 -98010 -56688 -112393 475450 8372 -205091 -179704 -62972
12027a23507E280J89857J54558D959J91800J78879a45937M2153E6987J43144b33182
$$ -123507 5280 195137 349695 4959 196759 375638 -145937 -103784 56987 200131 -233182
12015A34070l0811b54452a5428A18954l2189k6317K03856g2217j29713A85456
$$ 134070 103259 -254452 -15428 118954 86765 60448 264304 -72217 -201930 185456
12004a3001A39967D9141k112a36002d2012E6003Q4098K5202e078o6084j9742M3049
$$ -13001 139967 49141 47029 -136002 -42012 56003 140101 165303 -5078 -71162 -90904 -47855
11992d7855C4817J10163K4002d5331n6231l9780A5357K36502e8227j34682l68576
$$ -47855 34817 144980 168982 -45331 -101562 -141342 15357 251859 -58227 -192909 -561485
11981e61485b30161O7376l8998A89397o9426c9661B92877E770K36176K7299j21385
$$ -561485 -230161 -162785 -201783 189397 119971 -39661 292877 5770 241946 269245 147860
11970A47860c56979A14339K56517C0659c06398B9425G039a81322F0220J05732
$$ 147860 -356979 114339 370856 30659 -306398 29425 7039 -181322 60220 165952
11960A65952c05561N8956b7581p9996B80904c35920A76258g0517j3328J2451m0634
$$ 165952 -305561 -246605 -27581 -107577 280904 -335920 176258 -70517 -83845 -71394 -112028
11949a12028j36623m058A23240A4089e01479F1572L5843k6275a15650o5094C28233
$$ -112028 -248651 -252709 123240 14089 -501479 61572 97415 71140 -115650 -180744 328233
11937A24149R6255a6968q0442D81L62086D1665f8870C3780e3433A4201e87194
$$ 124149 220404 -16968 -97410 481 362567 41665 -68870 33780 -53433 14201 -587194
11925b90767B06543l3508D4151c12416a28961B93589F1041A1355a22168j0414
$$ -290767 206543 173035 44151 -312416 -128961 293589 61041 11355 -122168 -132582
11915a32582C014N2453J1533d1540B7338c921A99817A7330K1137R4542d625k94813
$$ -132582 3014 55467 67000 -41540 27338 -3921 199817 17330 38467 133009 -4625 -299438
11903b99438e0765K1957A89237b18923B5892d3273r3396C26090b03289p4084A23386
$$ -299438 -50765 -28808 189237 -218923 25892 -43273 -136669 326090 -203289 -277373 123386
11891g4774j6317L7633k6822l770o45a8964j71027A2184O7642i4012L7452C12219
$$ -74774 -91091 -53458 -80280 -84050 -84695 -18964 -189991 12184 79826 -94012 -56560 312219
11878a73665q6415a16652B7110P1780b867H9016b49353B0241a27107f990j95514
$$ -173665 -260080 -116652 27110 98890 -2867 89016 -249353 20241 -127107 -6990 -202504
11867b02504A61922a84974B48594i5663J5618h23r5822j54858A91485b5371E3880
$$ -202504 161922 -184974 248594 -95663 -80045 -823 -96645 -251503 191485 -25371 53880
11855b94758N4841c7519j38270N0251N8856B38756f7544q9958m0011A99418a69516
$$ -294758 -239917 -37519 -175789 -125538 -66682 238756 -67544 -157502 -197513 199418 -169516
11843b6908p5102j1114B6070a8967l78519A31218j0952k6536J61032I2619a66822
$$ -26908 -102010 -113124 26070 -18967 -397486 131218 120266 93730 254762 92619 -166822
11831H3674c4183j13966p7470l4008J02510p2049A68512E9625j7983e36501A3583
$$ 83674 -34183 -148149 -225619 -259627 -157117 -229166 168512 59625 41642 -536501 13583
11819C6707d3348r6012d5822j29477G3550h2409B32252c11863A5220a64676A48657
$$ 36707 -43348 -139360 -45822 -175299 73550 -82409 232252 -311863 15220 -164676 148657
11807d10796E6185O4206a16644N0968p4791H9357a87856h8543G8402f0088n1536
$$ -410796 56185 120391 -116644 -65676 -140467 89357 -187856 -88543 78402 -60088 -111624
11796a11624j21518G5820a5073k52130D0347K72871b82279A24150Q1764a21111
$$ -111624 -233142 75820 -15073 -267203 40347 313218 -282279 124150 205914 -121111
11785c7819B25580a86413q3050a971D4384J09933a02429B999M6280b07941L5976
$$ -37819 225580 -186413 -269463 -1971 44384 154317 -102429 2999 49279 -207941 -171965
11774a71965f0932b842m1663m558j43340B99955a36802D6828K24586b66429e3387
$$ -171965 -60932 -2842 -44505 -49063 -192403 299955 -136802 46828 271414 -266429 -53387
11762a48350j38157O1621i0456A70470a84255K2108k52335B31704j7077p2358
$$ -148350 -286507 -224886 -90456 170470 -184255 -162147 -414482 231704 214627 142269
11752A42269d13033a33994E3619J84575b60780A60027a59033b265A71939b01363
$$ 142269 -413033 -133994 53619 238194 -260780 160027 -159033 -2265 171939 -201363
11741d435H0256c1163C325J3545a15812N2476C8338c36378a58454B60079g384
$$ -4435 80256 -31163 3325 16870 -115812 -63336 38338 -336378 -158454 260079 -7384
11729a33469j03931B95435m356c2376I8949d2883k42708A39615c13440C5904a59843
$$ -133469 -237400 295435 291079 -32376 98949 -42883 -285591 139615 -313440 35904 -159843
11717I9453b12502B57930a14143d2603o0469k46147a02296m7534r7027C13585
$$ 99453 -212502 257930 -114143 -42603 -103072 -349219 -102296 -149830 -246857 313585
11706e4755A55330J13462b5648n7496n2904h50E43617A33655d2529A41115b84817
$$ -54755 155330 268792 -25648 -83144 -136048 -850 543617 133655 -42529 141115 -284817
11694E502K71465H7862N2947e2358J4019r4123A03928a0858A51354a39649H4858
$$ 5502 276967 87862 140809 -52358 -38339 -132462 103928 -10858 151354 -139649 84858
11682B22872g9609j90285l9021A36628A6361K66198h101D6055b30192A52493a03317
$$ 222872 -79609 -269894 -308915 136628 16361 282559 -8101 46055 -230192 152493 -103317
11670b5309D4868c7099j39891A11587O235h1863B28932a94063R2679A31620l0463
$$ -25309 44868 -37099 -176990 111587 117822 -81863 228932 -194063 -101384 131620 101157
11659A01157J41950a11686G3165a47546I7640e9430k74250H9504L02546j75492
$$ 101157 243107 -111686 73165 -147546 97640 -59430 -333680 89504 392050 216558
11649B16558a57359f6996H809a84543Q6758o0820L0727a0374B0040J57340b43283
$$ 216558 -157359 -66996 8809 -184543 -97785 -158605 -127878 -10374 20040 177380 -243283
11637a37889a6913A20288J61215c35093A96350d08316G8779C6170d5743r6433
$$ -137889 -16913 120288 281503 -335093 196350 -408316 78779 36170 -45743 -142176
11627a42176A6651d2109C9929a55762D8473M1762K7149a5215j12703A46293n3152
$$ -142176 16651 -42109 39929 -155762 48473 90235 117384 -15215 -127918 146293 93141
11616I3141a15538A16709D2874d4998j49250D6908O4710J13662b08912A3156h6408
$$ 93141 -115538 116709 42874 -44998 -194248 46908 111618 225280 -208912 13156 -86408
11604B80949c19740A5557h8083A87300c17299J15255B08112j0226g9764A34638
$$ 280949 -319740 15557 -88083 187300 -317299 -202044 208112 197886 -79764 134638
11593F6585A0539D175J57184b23899C03497b13413k6590J02560I7879b54092J19811
$$ 66585 10539 4175 161359 -223899 303497 -213413 -240003 -137443 97879 -254092 -134281
11582a34281A7599f7019c2851q9632F0364A0784O9926Q6525a27551B24071J71361
$$ -134281 17599 -67019 -32851 -122483 60364 10784 80710 167235 -127551 224071 395432
11571C95432B4228d5676B29386a46170A48125m7876J9186R918k9515Q9693p6842
$$ 395432 24228 -45676 229386 -146170 148125 100249 119435 129353 99838 189531 112689
11560A12689J28719a51134C7733J28747E7358J38534a41489E3836B3631M38057
$$ 112689 241408 -151134 37733 166480 57358 195892 -141489 53836 23631 461688
11550D61688B7958a40224B83498q9118q5250L9521d08371g6304C32100j36354
$$ 461688 27958 -140224 283498 194380 109130 148651 -408371 -76304 332100 195746
11540A95746c2500A37855a9342j08133a1724I1649g0474c3447j17682M1096D522
$$ 195746 -32500 137855 -19342 -127475 -11724 91649 -70474 -33447 -151129 -110033 4522
11528H9996a56878A65864B1849c56058D07666A06014A5420J65132p2590m7590
$$ 89996 -156878 165864 21849 -356058 407666 106014 15420 180552 107962 60372
11518F0372a06297N1661m6989B15114k5048l1481c5304B57545j8278A4969J55316
$$ 60372 -106297 -54636 -101625 215114 190066 158585 -35304 257545 239267 14969 170285
11507A70285K31672b9441H5367M01335c8540C76861i2420B36530D452K73235B6052
$$ 170285 401957 -29441 85367 486702 -38540 376861 -92420 236530 4452 277687 26052
11495f9315B21028J6355D3104K83M72669H8794f4371B26293a06601A02585L807
$$ -69315 221028 237383 43104 43387 516056 88794 -64371 226293 -106601 102585 106392
11484A06392J16995o1951J16095B2272i9999D3220J90135J92B0063q12K29434
$$ 106392 223387 161436 277531 22272 -99999 43220 233355 233547 20063 19251 248685
11473B48685F213a41057B1321J45910g902D19500j77083C2874b4605H6257M2613
$$ 248685 6213 -141057 21321 167231 -7902 419500 242417 32874 -24605 86257 128870
11462A28870K10071I5039h649A07784a17149R932B20354R0807H1327K27769J86891
$$ 128870 338941 95039 -8649 107784 -117149 -107217 220354 311161 81327 309096 495987
11451D95987j46374A715R493K01626O256H1184K21730J36455j84621P5825A20563
$$ 495987 349613 1715 11208 212834 219090 81184 302914 439369 254748 330573 120563
11439h48o4194C7901Q578a07269C14598A00915J3442K63163a41176C2642M21973
$$ -848 -65042 37901 46479 -107269 314598 100915 114357 377520 -141176 32642 454615
11428D54615f1286A80066a56023F0845e8394A4717K18101g8909B82549a07666
$$ 454615 -61286 180066 -156023 60845 -58394 14717 232818 -78909 282549 -107666
11417f2926k55814A96448b61017B50686j07875N2595a99465G3826c2992A75988
$$ -62926 -318740 196448 -261017 250686 142811 195406 -199465 73826 -32992 175988
11406a55210I2475J49622l2256A1819b09261E3619d1342k21696C27900b1927I516
$$ -155210 92475 242097 209841 11819 -209261 53619 -41342 -263038 327900 -21927 9516
11394d08862A98184c49173J08713A08265b34284e9018A48340K7548a12172A3629
$$ -408862 198184 -349173 -240460 108265 -234284 -59018 148340 175888 -112172 13629
11383a63935J9714M1253E3971f3319g901A47991C0925b84223A4532J29572a15123
$$ -163935 -144221 -102968 53971 -63319 -7901 147991 30925 -284223 14532 144104 -115123
11371D0252a2118j1825A18456a58948j15733L420K5506A10077d9322k61468F1469
$$ 40252 -12118 -23943 118456 -158948 -274681 -271261 -245755 110077 -49322 -310790 61469
11359C7466c2071j18939m4001D2195K2243c0483A12425C5485a41824r5369B35391
$$ 37466 -32071 -151010 -195011 42195 64438 -30483 112425 35485 -141824 -237193 235391
11347a37904p8793G3725c9211A21881L5657Q8735b26381D5884K4842g789B26139
$$ -137904 -216697 73725 -39211 121881 157538 246273 -226381 45884 70726 -7789 226139
11335b32542K3536f7141j66327A22725c267l2102A54643d3329m9674A8103e5351
$$ -232542 -209006 -67141 -233468 122725 -3267 -35369 154643 -43329 -93003 18103 -55351
11323i4738j06929p7516q3037A24367a35748A2189h3806q0390C11589A45055C4765
$$ -94738 -201667 -279183 -362220 124367 -135748 12189 -83806 -164196 311589 145055 34765
11311b5944A02231l2557a31655O4317A89160a4532j9956A64401l0549e2293l8994
$$ -25944 102231 69674 -131655 -67338 189160 -14532 -34488 164401 133852 -52293 -91287
11300i1287A86108c1253A07274b41112e5131r4721B1740b15827A65163l4023B6449
$$ -91287 186108 -31253 107274 -241112 -55131 -149852 21740 -215827 165163 131140 26449
11288g2203B75526b01624E4094b59986j09760A00579L9758c0319m57708B12064
$$ -72203 275526 -201624 54094 -259986 -369746 100579 140337 -30319 -488027 212064
11277b26418l6951Q7012e8296A43451d14023a99179D2311b04441Q1709n3647L9965
$$ -226418 -263369 -176357 -58296 143451 -414023 -199179 42311 -204441 -122732 -176379 -136414
11266a36414a554G9890f5947j77880c5804r6178b9656E1443I927a57207C988i8574
$$ -136414 -1554 79890 -65947 -243827 -35804 -131982 -29656 51443 9927 -157207 3988 -98574
11253a69564A67282G0588c74230I1731a15407A21092b11350M1450K1741l8459
$$ -169564 167282 70588 -374230 91731 -115407 121092 -211350 -169900 -148159 -186618
11243a86618G8055a16021J851j22334g93A14371f7692j04279q0995A47098A287
$$ -186618 78055 -116021 -114170 -236504 -793 114371 -67692 -171971 -252966 147098 1287
11231D3328N4975c29312j51443f5905B22961o1489Q061g5846k34651B4697b13782
$$ 43328 98303 -329312 -480755 -65905 222961 161472 169533 -75846 -310497 24697 -213782
11219c58030a31657p4426L9697P6332j75096i1126b4717A34486m4456J55594f7675
$$ -358030 -131657 -206083 -166386 -90054 -265150 -91126 -24717 134486 90030 245624 -67675
11207A06677O0506b79554a01973a2435j11131j22087D3962I668g5014J6558A6452
$$ 106677 167183 -279554 -101973 -12435 -123566 -245653 43962 9668 -75014 -58456 16452
11195A28178C3540j833h7131b9545l5967B10906a97109c8254B84309a4886j5273
$$ 128178 33540 31707 -87131 -29545 -65512 210906 -197109 -38254 284309 -14886 -30159
11184c0159a4621d277k98846q5227B9179i50D7140A1651b84828H1824A4752d37233
$$ -30159 -14621 -4277 -303123 -388350 29179 -950 47140 11651 -284828 81824 14752 -437233
11171a01746m959k1794F414O7162J81927F4685a1714n7667J8817j01607f5953
$$ -101746 -106705 -128499 6414 73576 255503 64685 -11714 -69381 -50564 -152171 -65953
11159c5641A87072d4234E5149c51284A0389a4005H1594e9045p8513F0319a13482
$$ -35641 187072 -44234 55149 -351284 10389 -14005 81594 -59045 -137558 60319 -113482
11147c27819a12085C2745i981k11385B62509i6194K5740j73293A06710C3686b5944
$$ -327819 -112085 32745 -9981 -221366 262509 -96194 -70454 -243747 106710 33686 -25944
11135A14821b94130F0044Q818a42789a3689A34303K24635A22129n6486M05406
$$ 114821 -294130 60044 68862 -142789 -13689 134303 358938 122129 65643 471049
11125D71049A88991a64838B17845b07201n6762b6271A91564q6837C1542J33699
$$ 471049 188991 -164838 217845 -207201 -263963 -26271 191564 104727 31542 165241
11115A65241E488e0917j38633A30691c3283C06253a13358j33566B30974n2576
$$ 165241 5488 -50917 -189550 130691 -33283 306253 -113358 -246924 230974 178398
11105A78398f0434E0736N24404C3055L47789D5437a19512B49064j23402h575D94434
$$ 178398 -60434 50736 575140 33055 380844 45437 -119512 249064 125662 -8575 494434
11093B16299Q1357A47766O7769J39374d5038k7985D3633K57555j25628K39676
$$ 216299 297656 147766 215535 354909 -45038 -73023 43633 301188 175560 415236
11083D15236A71521E1690J51713p027B5996L84646A93240q8303K31196a23277
$$ 415236 171521 51690 203403 196376 25996 410642 193240 104937 336133 -123277
11072B34290J96085J8978k14861J6211O2734M0359j22204K15099J42965K36929
$$ 234290 430375 449353 234492 250703 313437 353796 231592 446691 589656 826585
11062H26585k80379B70849p161J53002L49566K5959J44092k86174K02744K4653
$$ 826585 546206 270849 263688 416690 766256 792215 936307 650133 852877 877530
11052H77530j24615P7458J07969l8945K09654k28997J92228m979j72823O8055
$$ 877530 752915 830373 938342 899397 1109051 880054 1072282 1067303 894480 962535
11042I62535J02046j82320J70202k17305M3023K28687l74466K93102k0436J6753
$$ 962535 1064581 882261 1052463 835158 878181 1106868 732402 1025504 1005068 1021821
11032A021821j23876k40682L14777n5925J18586k00141m1809J06860K00391N195
$$ 1021821 897945 657263 972040 916115 1034701 834560 792751 899611 1100002 1105197
11022A105197k77649J01933l18725M50737l89209M1788O05324m97512j6045J39235
$$ 1105197 827548 929481 610756 1061493 672284 714072 1319396 821884 805839 945074
11012I45074k85996k24124L55925k50218j20798L69626j73108L18192k04560O9539
$$ 945074 659078 434954 790879 540661 419863 789489 616381 934573 730013 799552
11002G99552P7702K4728j05292N5800j16786l02430K90399K31338l80061O1113
$$ 799552 877254 901982 796690 852490 735704 433274 723673 955011 574950 636063
10992F36063k6533N08612j83630J7612k33745j51026J99393M14527m9247l43711
$$ 636063 609530 1118142 934512 952124 718379 567353 766746 1181273 1132026 788315
10982G88315J40853N1652M59313q3263l0064M69046l90055L17711J15314K31915
$$ 788315 929168 980820 1440133 1356870 1326806 1795852 1405797 1723508 1838822 2070737
10972B070737L1979K97137K98832K74144L79551J05382K11362J9388K69014j73406
$$ 2070737 2102716 2399853 2698685 2972829 3352380 3457762 3669124 3688512 3957526 3784120
10962C784120k93318q44149l9692r07646j18959k48745L03014q4944j97019M28577
$$ 3784120 3490802 2646653 2606961 1699315 1580356 1331611 1634625 1549681 1352662 1781239
10952A781239l84979J1036l5961N3346n3212n61850k32989K86359k81466j50765
$$ 1781239 1396260 1407296 1371335 1424681 1371469 809619 576630 862989 581523 430758
10942D30758A80514J35795p8729l4330G2123N3551a33771B53939a70206c9A28150
$$ 430758 180514 316309 237580 203250 72123 125674 -133771 253939 -170206 -39 128150
10930c34725I8652J37758E8043j2603M579a5071A51525A1769a01347C36165b23942
$$ -334725 98652 236410 58043 45440 50019 -15071 151525 11769 -101347 336165 -223942
10918a30182A31349c95128a47010a0745n9400r104A91570h6478j39876J05747
$$ -130182 131349 -395128 -147010 -10745 -70145 -79249 191570 -86478 -226354 -120607
10908a20607A86781b2836j12010j10039D27004a17532A35337i8282A51544a78528
$$ -120607 186781 -22836 -134846 -244885 427004 -117532 135337 -98282 151544 -178528
10897a13841A91575k9277b56437a10958n6776A58609N9752J69915c2640A43526
$$ -113841 191575 162298 -256437 -110958 -167734 158609 218361 388276 -32640 143526
10886c3717p96k36740A01372e6155j60559G173f4460d872m9942H5830i669l68278
$$ -33717 -34513 -271253 101372 -56155 -216714 7173 -64460 -4872 -54814 85830 -9669 -377947
10874c77947f4911I9958a1279n0604B05831b66806B14199E6436e3002A52270n885
$$ -377947 -64911 99958 -11279 -61883 205831 -266806 214199 56436 -53002 152270 146385
10863A46385h1361c8019j82646O8614j82595I1479b05064A18684h1579j84020
$$ 146385 -81361 -38019 -220665 -152051 -334646 91479 -205064 118684 -81579 -265599
10853b65599R8882B95149h4085G1691c27820c0082j2664H590a62534C6582b29645
$$ -265599 -166717 295149 -84085 71691 -327820 -30082 -42746 8590 -162534 36582 -229645
10841a52057k48776B05570a18884j12118P0706M359C3059L7779K697R7600c7879
$$ -152057 -400833 205570 -118884 -231002 -160296 -155937 33059 70838 73535 171135 -37879
10829a300B7901b1841j03201A72058m9135P4409a94242C25250A0214a9557k09957
$$ -1300 27901 -21841 -125042 172058 122923 197332 -194242 325250 10214 -19557 -229514
10818b29514P3257K3832A4556a86476B67126b39923a0738j26745A52006f5435
$$ -229514 -156257 -132425 14556 -186476 267126 -239923 -10738 -137483 152006 -65435
10807a53280A37458e7076P028n4524q0935e1674p763E3187g9356A67420L7475
$$ -153280 137458 -57076 -50048 -104572 -185507 -51674 -59437 53187 -79356 167420 204895
10796B04895a86468c1842l5984G7152b48610Q1000j04617i1084n8417b5360j71995
$$ 204895 -186468 -31842 -67826 77152 -248610 -167610 -272227 -91084 -149501 -25360 -197355
10785a97355A53828f7747A10638n2436L5849a05535n9776J1832C48798b8551n2350
$$ -197355 153828 -67747 110638 58202 94051 -105535 -165311 -153479 348798 -28551 -80901
10774h0901o0818k8476j75303B53030b28949C3467b57226B71544c43925C6339
$$ -80901 -141719 -170195 -345498 253030 -228949 33467 -257226 271544 -343925 36339
10763B58240I713a12200f073m24094E3401a97205a1047D22576B09754a45466j5939
$$ 258240 9713 -112200 -6073 -430167 53401 -197205 -11047 422576 209754 -145466 -161405
10752a61405A89338I0484a69799A3196h0988b6672j85406f4135A67178b3375k64719
$$ -161405 189338 90484 -169799 13196 -80988 -26672 -212078 -64135 167178 -23375 -288094
10741b88094a11756j25135B1649J97813a13177l43467C48807A31877D8253j1998
$$ -288094 -111756 -236891 21649 219462 -113177 -456644 348807 131877 48253 36255
10731C6255g0564k32867A08238e6336j97716B47356B2216b75253A29676a35787
$$ 36255 -70564 -303431 108238 -56336 -254052 247356 22216 -275253 129676 -135787
10720a92954A83466i9259J7369C27200e7021A60777a03742j59644R6848D4925
$$ -192954 183466 -99259 -81890 327200 -57021 160777 -103742 -263386 -166538 44925
10709c15016A38764b96524D81051a49538I5595a88457A32441J62910a07202e0239
$$ -315016 138764 -296524 481051 -149538 95595 -188457 132441 295351 -107202 -50239
10698C10147A34307n657H031e1981B22250a62012N4176c3781p580F3847e1558
$$ 310147 134307 128650 8031 -51981 222250 -162012 -107836 -33781 -41361 63847 -51558
10686H4156c9469p4968b1952B2116a7135h348k31560B63837c446l70170a6703
$$ 84156 -39469 -114437 -21952 22116 -17135 -8348 -239908 263837 -3446 -373616 -16703
10674A72765D0585J18489b92606b1069j15892G8161h530A48779M0788b23166a01719
$$ 172765 40585 159074 -292606 -21069 -136961 78161 -8530 148779 189567 -223166 -101719
10662a68148D2433b41609E0920g9805E7276b30794q707O2895j19712l1876A02857
$$ -168148 42433 -241609 50920 -79805 57276 -230794 -239501 -176606 -296318 -328194 102857
10650c13691d3628A76044b68072A01009Q0596h2721j09699q5575a9093p024G2202
$$ -313691 -43628 176044 -268072 101009 181605 -82721 -192420 -277995 -19093 -26117 72202
10638a37104B58312i1692C5074J15909b30186J7273C97394F279a37910r8098A41916
$$ -137104 258312 -91692 35074 150983 -230186 -212913 397394 6279 -137910 -236008 141916
10626e94885a49257B7655a5428j4274j91550A93045a56073A10177a95464h3452
$$ -594885 -149257 27655 -15428 -29702 -221252 193045 -156073 110177 -195464 -83452
10615a24714r8766K6579N0100n025N6810l12835B71371b39021k913D4693n128
$$ -124714 -223480 -196901 -146801 -151826 -95016 -407851 271371 -239021 -241934 44693 39565
10604C9565h3290A5433P7781a09551I6770N6304Q566a68577G7070d7420k6489
$$ 39565 -83290 15433 93214 -109551 96770 153074 161640 -168577 77070 -47420 -73909
10593g3909I6823K7701F0501f0106b5075j10704m15325e1325J3052o8734j11644
$$ -73909 96823 124524 60501 -60106 -25075 -135779 -551104 -51325 -38273 -107007 -218651
10582b18651P8596j53142d0245m3966b7686n2552c049k3418j00482j75004B0333
$$ -218651 -140055 -293197 -40245 -84211 -27686 -80238 -3049 -26467 -126949 -301953 20333
10570c91942C8480a73619B51422e2224B09451a94423m3065b9585m5339C30697
$$ -391942 38480 -173619 251422 -52224 209451 -194423 -237488 -29585 -74924 330697
10559C6146a30540c4182B36510a53869C92667h0275m6332A40793E2051a98813
$$ 36146 -130540 -34182 236510 -153869 392667 -80275 -126607 140793 52051 -198813
10548i1882m7461E9009a99140L6177G7340b21669c5738j5227A79350H4589b09215
$$ -91882 -139343 59009 -199140 -162963 77340 -221669 -35738 -50965 179350 84589 -209215
10536C2894a90630l4743O6815g3849j79540i3627B5033J3846L5334a22255j93027
$$ 32894 -190630 -225373 -158558 -73849 -253389 -93627 25033 38879 74213 -122255 -315282
10525c15282E7235a87061k81800a98412E0173b32719j09020R8834g7252B02982
$$ -315282 57235 -187061 -468861 -198412 50173 -232719 -341739 -242905 -77252 202982
10514a74776a4102j1282A07664d8324j51266I3009D1561b31330Q8891a1799j06908
$$ -174776 -14102 -25384 107664 -48324 -199590 93009 41561 -231330 -142439 -11799 -118707
10503a18707K166j31248A51245M8704a70966B39810A02965a1323A94150h91A32379
$$ -118707 -116541 -247789 151245 199949 -170966 239810 102965 -11323 194150 -891 132379
10491a81878A17928f1321A25339C6075J17321j7045J21008r8385M3501a52071
$$ -181878 117928 -61321 125339 36075 153396 136351 257359 158974 202475 -152071
10480b5977R771j96570l43937a0043D67646B33182O7414K04361J29268A26486
$$ -25977 -16206 -212776 -556713 -10043 467646 233182 300596 504957 634225 126486
10469A7161J63033g468k5588A23423e2092F8536J83762a64691l68514A95442a55395
$$ 17161 180194 -7468 -33056 123423 -52092 68536 252298 -164691 -533205 195442 -155395
10457e0234j5389C2825i5033E5915F209M6861J10306a59841r1428D9540a26343
$$ -50234 -65623 32825 -95033 55915 6209 53070 163376 -159841 -251269 49540 -126343
10445a85223F4598Q0218d2202j87161r7671B11817a57819C6719A7700e401C6455
$$ -185223 64598 144816 -42202 -229363 -327034 211817 -157819 36719 17700 -5401 36455
10433h1983k8307k9811A340a57757A38033L6540A149b94053n1669I1250k4360
$$ -81983 -110290 -140101 1340 -157757 138033 174573 1149 -294053 -345722 91250 66890
10422F6890O6768K58851c19475C293c05905A07688a13058j30302A9252N9003J21223
$$ 66890 133658 392509 -319475 3293 -305905 107688 -113058 -243360 19252 78255 199478
10411A99478J4121b72148f8196F148a66870Q3088A61075b22721q2323o387D54079
$$ 199478 213599 -272148 -68196 6148 -166870 -83782 161075 -222721 -305044 -311431 454079
10399G8169e765j56415B76567h0524A58128B9649g175l4030J3409A98461I325
$$ 78169 -5765 -162180 276567 -80524 158128 29649 -7175 -41205 -27796 198461 9325
10387B86539C7992a6181A58820J4210M6220H7114J54511b56641d9765A48378l3270
$$ 286539 37992 -16181 158820 173030 219250 87114 241625 -256641 -49765 148378 115108
10376A15108l4950J23154Q350K18174J62151B00830J8432l2892h8049E26566B35246
$$ 115108 80158 203312 211662 429836 591987 200830 219262 186370 -88049 526566 235246
10364E72909l8217j38322j8R4105L5180R8975g0741E25510I754K1198g405F4156
$$ 572909 534692 396370 396352 490457 525637 624612 -70741 525510 9754 30952 -7405 64156
10351D98518j68487K50695B02039O32165q8032q0703C27601R1665A95275L36553
$$ 498518 330031 580726 202039 834204 746172 665469 327601 419266 195275 531828
10341E31828A16562K99979A79204J97102N3094j0919A03465a18494E87358A60140
$$ 531828 116562 416541 179204 376306 429400 418481 103465 -118494 587358 160140
10330C98023l8141b17342B40782K1168E5719b15165A76674R8849f043E60544A85454
$$ 398023 359882 -217342 240782 261950 55719 -215165 176674 275523 -6043 560544 185454
10318D73259J58741B03368K12096j59740a1968B23467l2958C0783e0900H1946
$$ 473259 632000 203368 415464 255724 -11968 223467 190509 30783 -50900 81946
10307a1532A52733a34326n49j05404A07372k7449k275i2652J65c726C5975O1052
$$ -11532 152733 -134326 -134875 -240279 107372 79923 77648 -92652 -92487 -3726 35975 97027
10295I7027a92508E9550K241d9807j73595f6234A21176a01339j60617D6928h7500
$$ 97027 -192508 59550 61791 -49807 -223402 -66234 121176 -101339 -261956 46928 -87500
10283d17672h556k73273A18762b75372A92824n9738a57685g6815G0778L0459b10174
$$ -417672 -8556 -281829 118762 -275372 192824 133086 -157685 -76815 70778 101237 -210174
10271b17672D26172A81980l8682b09958P8612D67139e8215E07J15288J51179a1570
$$ -217672 426172 181980 143298 -209958 -131346 467139 -58215 507 115795 266974 -11570
10259a79814q2830L9569C8612n243A5623J32810L4970a899C44287F6185K61092
$$ -179814 -262644 -223075 38612 33369 15623 148433 183403 -1899 344287 66185 327277
10248C27277A44075c69672a49310N5259E8967A7021J2963L34067c0670N510A05186
$$ 327277 144075 -369672 -149310 -94051 58967 17021 29984 364051 -30670 -25160 105186
10236i4975j31623d3529A34343A5556a57925B0145b2829F5125J92099a83500C5970
$$ -94975 -226598 -43529 134343 15556 -157925 20145 -22829 65125 257224 -183500 35970
10224a96500F3849i9374B34225c33801i8718A73786c72755g765A73402a64172
$$ -196500 63849 -99374 234225 -333801 -98718 173786 -372755 -7765 173402 -164172
10213E1706O6970n8354B174b78695O5944D3542j355L438a72351e6459o336j75206
$$ 51706 118676 60322 2174 -278695 -212751 43542 42187 45625 -172351 -56459 -62795 -238001
10201b38001D5535J50410a91247k12655A52124b3433o9741h559D7729P828f4633
$$ -238001 45535 195945 -191247 -403902 152124 -23433 -93174 -8559 47729 55557 -64633
10189b76389E5556B0413a41789c5867m1310j33124N9048m31912C39731j45147
$$ -276389 55556 20413 -141789 -35867 -77177 -210301 -151253 -583165 339731 194584
10179A94584D4385g5973K6016E6369a846D2774b79193d5221j14161l9692A70157
$$ 194584 44385 -75973 -49957 56369 -1846 42774 -279193 -45221 -159382 -199074 170157
10167a08382c2292o6530A34460a5569B009b50994A42847a41557j93027A36270
$$ -108382 -32292 -98822 134460 -15569 2009 -250994 142847 -141557 -334584 136270
10156c65441C5945b60380c7850B16644c77478B45189i5416j71324c3937l55432
$$ -365441 35945 -260380 -37850 216644 -377478 245189 -95416 -266740 -33937 -389369
10146c89369a75566j6276N8122l37051I6953a42443B8156c4058D8687e4800j10076
$$ -389369 -175566 -191842 -133720 -470771 96953 -142443 28156 -34058 48687 -54800 -164876
10135a64876o889j8591i0957j40817L8360B8708a63988E2152f0219B89977F0350
$$ -164876 -171765 -190356 -90957 -231774 -193414 28708 -163988 52152 -60219 289977 60350
10123I9312K18975d9216l969A73838a47871F3500h7830k16261A49194d2404m957
$$ 99312 318287 -49216 -53185 173838 -147871 63500 -87830 -304091 149194 -42404 -47361
10112d7361A9371h5400n7569A31977C0020b73345J10059f9020A32475a54730m6105
$$ -47361 19371 -85400 -142969 131977 30020 -273345 -163286 -69020 132475 -154730 -200835
10101b00835E5444b72918m3410a37176A9229a22747B17981B3563b40731D72J53655
$$ -200835 55444 -272918 -316328 -137176 19229 -122747 217981 23563 -240731 472 154127
10090A54127c19788e0956l8437G9017a03296C35001c42999J62125c4582j86707
$$ 154127 -319788 -50956 -89393 79017 -103296 335001 -342999 -180874 -34582 -221289
10080b21289D5787a71148C0847c58521J52197B4408J7758a45177o7586r1443O0072
$$ -221289 45787 -171148 30847 -358521 -206324 24408 42166 -145177 -212763 -304206 -244134
10069b44134A0353R0335K7180r662g9833r9151b2354j75016R4827E6972K8769
$$ -244134 10353 100688 127868 118206 -79833 -178984 -22354 -197370 -102543 56972 85741
10058H5741a70583a634m8673N02n5588K592o8477B1058P2198J612a39228j40684
$$ 85741 -170583 -1634 -50307 -49805 -105393 -102801 -171278 21058 93256 94868 -139228 -279912
10046b79912L205q2784A76402i293F8849a11950k16003A46115B50b40858O6436
$$ -279912 -276707 -359491 176402 -9293 68849 -111950 -327953 146115 250 -240858 -174422
10035a74422A44514L4623F0560a10170k6285e8423k52691a54849C08610g3844
$$ -174422 144514 179137 60560 -110170 -136455 -58423 -311114 -154849 308610 -73844
10024F8322c97552i2835G1377J21813b67000h7996Q555p1798A01417A1468g0924
$$ 68322 -397552 -92835 71377 193190 -267000 -87996 -79441 -151239 101417 11468 -70924
10012b11315n6381O437A089K9284C290i8780j49863f8472B19105c17891a32971
$$ -211315 -267696 -261259 1089 30373 3290 -98780 -248643 -68472 219105 -317891 -132971
10000C55451g833B6462g6379l65298D3555K87009A29629b3618k42023B26224r6379
$$ 355451 -7833 26462 -76379 -441677 43555 330564 129629 -23618 -265641 226224 129845
9989A29845b60673H9124h4504j49328f8937A75267c13783a46014n7777p0834Q8279
$$ 129845 -260673 89124 -84504 -233832 -68937 175267 -313783 -146014 -203791 -274625 -186346
9978a86346A7456a72767P4404D6079r359h8491L0052j57403E28742F0638b42090
$$ -186346 17456 -172767 -98363 46079 36720 -88491 -58439 -215842 528742 60638 -242090
9966b77390d2731k6299M380j7729E16888A2492c33565a35775R313F894K52212
$$ -277390 -42731 -69030 -64650 -82379 516888 12492 -333565 -135775 -126462 6894 259106
9955B59106o8905j8174J91924h9361j8822p2594M8895C2676b79045l8951L9765
$$ 259106 190201 172027 363951 -89361 -108183 -180777 -131882 32676 -279045 -317996 -278231
9944b78231L1925I3395a33031j22121k45029a64545M8801a638G0412a3953j21473
$$ -278231 -246306 93395 -133031 -255152 -500181 -164545 -115744 -1638 70412 -13953 -135426
9933a35426j56272J03446q6115O5766G7570I193P3822b93112I983c31511K3378
$$ -135426 -291698 -188252 -274367 -208601 77570 9193 83015 -293112 9983 -331511 -308133
9922c08133m1433a15624C84028e9319j90049F4732c71715a29437l5289A26268
$$ -308133 -349566 -115624 384028 -59319 -249368 64732 -371715 -129437 -164726 126268
9911b1119j53897J8710j07891P5189c6696B42247d853k49290M5048m8865C7149
$$ -21119 -175016 -156306 -264197 -189008 -36696 242247 -4853 -254143 -209095 -257960 37149
9899C5819c15981F436b97194e2696I7908b49026D3705A3487K76634I7327a08238
$$ 35819 -315981 6436 -297194 -52696 97908 -249026 43705 13487 290121 97327 -108238
9887B9933a71876r53A17258h040E4921L4398a16789B7738b36110n4851J45043
$$ 29933 -171876 -172829 117258 -8040 54921 89319 -116789 27738 -236110 -290961 -145918
9876a45918j07982c2707l59300A92052O7869K4295A12705b20125P1280A35450
$$ -145918 -253900 -32707 -392007 192052 259921 284216 112705 -220125 -148845 135450
9865B66323e3057j59738N5369k5931M3211N2291j86666E6578b3522k9893p663
$$ 266323 -53057 -212795 -157426 -183357 -140146 -87855 -274521 56578 -23522 -53415 -61078
9854f1078k32412N0282H7588B3587a11102B07396c30870E8885i0055j28561M4105
$$ -61078 -293490 -243208 87588 23587 -111102 207396 -330870 58885 -90055 -218616 -174511
9843a74511A32002a26624I1609B5215J51725b03072R7668G4631Q4480B985L49328
$$ -174511 132002 -126624 91609 25215 176940 -203072 -105404 74631 159111 2985 352313
9832C52313b20801j41638a12443C74089a40728j01123J6058P8832a8544l07584
$$ 352313 -220801 -362439 -112443 374089 -140728 -241851 -225793 -146961 -18544 -326128
9822c26128e6660J251K333K6388B74773e6609a7534D6322Q6840n7831d22203D1355
$$ -326128 -56660 -55409 -53076 -26688 274773 -56609 -17534 46322 133162 75331 -422203 41355
9809A35577D7921i3808k7439l4501d3932B31919a42431N7025J2169D1888b81263
$$ 135577 47921 -93808 -121247 -155748 -43932 231919 -142431 -85406 -73237 41888 -281263
9797E1074g3613b6138k23231I9724h0870m40000A14195a37963d6894j83328n440
$$ 51074 -73613 -26138 -249369 99724 -80870 -520870 114195 -137963 -46894 -230222 -235662
9786b35662a13042C2173a21235B2642c93807a94893D5890c2056j35374A85363
$$ -235662 -113042 32173 -121235 22642 -393807 -194893 45890 -32056 -167430 185363
9775c4037C41138a06403j13313q4662g1723G9408L6301c72890C1654a24333k66323
$$ -34037 341138 -106403 -219716 -304378 -71723 79408 115709 -372890 31654 -124333 -390656
9764c90656f5612p6072A81591a25096A51499C2635i7965j11181O5975M5135j61803
$$ -390656 -65612 -141684 181591 -125096 151499 32635 -97965 -209146 -143171 -98036 -259839
9753b59839B40056b06018K6220J344r9704h9543j29408j94519J18240a31491H7016
$$ -259839 240056 -206018 -179798 -178454 -278158 -89543 -218951 -413470 -295230 -131491 87016
9741G7474g655q8091m08125I3839g5978H4292L0524M5458O8567b38845A27682
$$ 77474 -7655 -95746 -503871 93839 -75978 84292 114816 160274 228841 -238845 127682
9729c37064A9253a65043d8237r3451B41602b57574A79529D102b36808A44422b32167
$$ -337064 19253 -165043 -48237 -141688 241602 -257574 179529 4102 -236808 144422 -232167
9717b40631A19433b00508F5497k2205J44642a78078A08503a46867K0499k2040
$$ -240631 119433 -200508 65497 43292 187934 -178078 108503 -146867 -126368 -148408
9707a48408a9471k60665a3452C8006c22677a09880j36108d553E7681b95643B0622
$$ -148408 -19471 -280136 -13452 38006 -322677 -109880 -245988 -4553 57681 -295643 20622
9695g2930j05385h190l19496D5183a70525A28036g7397B7633a29299C55170A2862
$$ -72930 -178315 -8190 -327686 45183 -170525 128036 -77397 27633 -129299 355170 12862
9683c41402a47041N2708A65897B0012J76866C0847b20016J3282A72011b07807
$$ -341402 -147041 -94333 165897 20012 196878 30847 -220016 -206734 172011 -207807
9672b0260m08430B84764g9370j59222O3364j03682d0509k0401a4916D59764A46231
$$ -20260 -428690 284764 -79370 -238592 -175228 -278910 -40509 -60910 -14916 459764 146231
9660b13240B4065c17611J42736M3082A09649O5478d03516b6759j0803a4994j33194
$$ -213240 24065 -317611 -174875 -131793 109649 175127 -403516 -26759 -37562 -14994 -148188
9649a48188B2138N789a96320Q1381B6683J24908k1638m6105j3121b11079a02936
$$ -148188 22138 27927 -196320 -114939 26683 151591 129953 83848 70727 -211079 -102936
9637b20789C13860b52378e9250q8956K8049A65213b31998B47463a32795j15212
$$ -220789 313860 -252378 -59250 -148206 -120157 165213 -231998 247463 -132795 -248007
9627b48007C93381a7411I4243a03883j1366b6560n7016j827g010j83057f559C28067
$$ -248007 393381 -17411 94243 -103883 -115249 -26560 -83576 -85403 -7010 -190067 -6559 328067
9614A46274b30902f6174j07740A7494b8594C0032m11c02131A17361j7708c89613
$$ 146274 -230902 -66174 -173914 17494 -28594 30032 29621 -302131 117361 99653 -389613
9602a51462k45490D3444f6007I7510b87677A17775b48775G5058a80239B34152
$$ -151462 -396952 43444 -66007 97510 -287677 117775 -248775 75058 -180239 234152
9591H5084K40215c86795J39073f2258l7314B653J29303b41187g3150C8467a13503
$$ 85084 325299 -386795 -247722 -62258 -99572 2653 131956 -241187 -73150 38467 -113503
9579c07593e4436j61199N1231O6163c6847n365l4232E4270K5975J27698b9913
$$ -307593 -54436 -215635 -164404 -98241 -36847 -42212 -76444 54270 80245 207943 -29913
9567A16019R3836a50688p2591A1450e9458l9390A15855J40572a32226A09329a64110
$$ 116019 209855 -150688 -223279 11450 -59458 -98848 115855 256427 -132226 109329 -164110
9555g525k69120A52586b39039f4509C21407A59117B8144c0704r9308b7433m0604
$$ -7525 -276645 152586 -239039 -64509 321407 159117 28144 -30704 -130012 -27433 -68037
9544f8037J8765I0387i8966L195d0341j04475L7106C59372b97656j05759d3836
$$ -68037 -49272 90387 -98966 -95771 -40341 -144816 -107710 359372 -297656 -403415 -43836
9532a23745a1159A6453g6733p4875H1202b60422M8302A49184h3986b9713p395
$$ -123745 -11159 16453 -76733 -151608 81202 -260422 -212120 149184 -83986 -29713 -37108
9521c7108l58405i5935j02908I8025a12897D1568a29363A08445a21440A51383
$$ -37108 -395513 -95935 -198843 98025 -112897 41568 -129363 108445 -121440 151383
9510b56347G8397O3708c8154k84041A91607b5056j54274C44209e3583A21970h7131
$$ -256347 78397 142105 -38154 -322195 191607 -25056 -179330 344209 -53583 121970 -87131
9498E7395b39723g5741l8867j63075B07895m1419d216j40309O7307k32893J52891
$$ 57395 -239723 -75741 -114608 -277683 207895 166476 -4216 -144525 -77218 -310111 -157220
9487a57220m9612j35972a57014b4549A29723E5046p769J17549b91596a02503G3140
$$ -157220 -206832 -342804 -157014 -24549 129723 55046 47277 164826 -291596 -102503 73140
9475b29417H7973h1559c2456l0965A96040H3966c83192A5271J47826B2320c64789
$$ -229417 87973 -81559 -32456 -63421 196040 83966 -383192 15271 163097 22320 -364789
9463A16739b92379i6630A32070j4757P8920f3266H7154f7874k64780f5227n7433
$$ 116739 -292379 -96630 132070 117313 196233 -63266 87154 -67874 -332654 -65227 -122660
9452a22660j9240l91j56941B6106c6638A52060e0444n7008d28m18316a34554A74712
$$ -122660 -141900 -142291 -299232 26106 -36638 152060 -50444 -107452 -428 -418744 -134554 174712
9439A78661b31054b2598B3046R2961i960k86971R4323h5916L8865A87081b08504
$$ 178661 -231054 -22598 23046 116007 -9960 -296931 -202608 -85916 -47051 187081 -208504
9427b82257L9158h1504h49j5078k62404H6094K11453A35810c1476j67430c741
$$ -282257 -243099 -81504 -849 -15927 -278331 86094 297547 135810 -31476 -198906 -3741
9415I894J09762a7171A8428J09949e3647F4940j3041b7781I5534b92931R0803
$$ 9894 119656 -17171 18428 128377 -53647 64940 51899 -27781 95534 -292931 -202128
9404b02128C1974a98442d5330l9458k05177h1623C11038a02831j5216K2871b9943
$$ -202128 31974 -198442 -45330 -84788 -289965 -81623 311038 -102831 -118047 -95176 -29943
9392b37178J01744q4621m41056K70073A4260a01035C34467E1291a59133b1049
$$ -237178 -135434 -220055 -661111 -391038 14260 -101035 334467 51291 -159133 -21049
9381a51126A63785a02635H2268a46060e5145l9991j9662a4183k86159A11315c6237
$$ -151126 163785 -102635 82268 -146060 -55145 -95136 -114798 -14183 -300342 111315 -36237
9369c50058F3049d4126I1705a94468d0959j67294A94551k4348a41806E0136K1635
$$ -350058 63049 -44126 91705 -194468 -40959 -208253 194551 170203 -141806 50136 71771
9358G1771b09759A25456b43761A1980b78335b2816k0946r1066r9874C64146g4127
$$ 71771 -209759 125456 -243761 11980 -278335 -22816 -43762 -134828 -234702 364146 -74127
9346d9879d332D9385a70264J3284A86628G0696a53168F8592a55746a330j11255
$$ -49879 -4332 49385 -170264 -156980 186628 70696 -153168 68592 -155746 -1330 -112585
9335a12585B3853a66891B9184a8310o9020C61042f5581A44328a71893B18703a93035
$$ -112585 23853 -166891 29184 -18310 -87330 361042 -65581 144328 -171893 218703 -193035
9323c04144d4689m3190K3426k26814C1455b5385m9809B34850b85417l9730H1455
$$ -304144 -44689 -87879 -64453 -291267 31455 -25385 -75194 234850 -285417 -325147 81455
9311A10010Q9065b03789h1896D1374a99703a1917j36130E1928Q1898a35767B8641
$$ 110010 199075 -203789 -81896 41374 -199703 -11917 -148047 51928 133826 -135767 28641
9299b2448k71701r016J29599h4479k08273A33670h608k11064C61608e7185G4497
$$ -22448 -294149 -303165 -173566 -84479 -292752 133670 -8608 -219672 361608 -57185 74497
9287E5042b0365j602B6116b15969O189r0721A5514K63500a47318A943K92766c53102
$$ 55042 -20365 -21967 26116 -215969 -209780 -300501 15514 279014 -147318 1943 294709 -353102
9274F5960J06585A7162g5161G1591e7566A99753b17217K4981L9448q8177G2245
$$ 65960 172545 17162 -75161 71591 -57566 199753 -217217 -192236 -152788 -240965 72245
9262a55388E0412J7636a3931H9677B5012F476J08636c45371m8991H391b05040
$$ -155388 50412 68048 -13931 89677 25012 6476 115112 -345371 -394362 8391 -205040
9250A25325B17b14766B2568a59256A91234M7560a74068d8183A12663c143J358
$$ 125325 217 -214766 22568 -159256 191234 238794 -174068 -48183 112663 -3143 -1785
9239a785k83517J6576J27271b4537j69086G6110a84418M5654l5382K5611A86779
$$ -1785 -285302 -268726 -141455 -24537 -193623 76110 -184418 -138764 -174146 -148535 186779
9227c3688A47358l2471g6384k625m28568K40601A32875F214d44902I240a00795
$$ -33688 147358 114887 -76384 -79009 -507577 -266976 132875 6214 -444902 9240 -100795
9215B3580l550c27173A87483Q4876b00958N5913A04180b83869A0933g986p3545
$$ 23580 20030 -327173 187483 272359 -200958 -145045 104180 -283869 10933 -7986 -81531
9204h1531Q471K2402o0352r0538j72958j6669k53015i1971j95A76241a7805k22261
$$ -81531 -73060 -50658 -111010 -201548 -374506 -391175 -644190 -91971 -92166 176241 -17805 -240066
9192b40066B31993H9987B2973b34562L1373n8231H4999K3696G518d60175A06358
$$ -240066 231993 89987 22973 -234562 -203189 -261420 84999 108695 7518 -460175 106358
9180i535E1473a21844b8043O882H0471d81149b00613P5069A21333a0421j4251
$$ -9535 51473 -121844 -28043 -21161 80471 -481149 -200613 -125544 121333 -10421 -24672
9169b4672D8396A6712a29850D3825a5970l7073k74233a14931E7142b77583c1214
$$ -24672 48396 16712 -129850 43825 -15970 -53043 -327276 -114931 57142 -277583 -31214
9157d45530A54578b52293d4845j3497D96655d010q4164r3830C5450f7482m2687
$$ -445530 154578 -252293 -44845 -58342 496655 -4010 -88174 -182004 35450 -67482 -110169
9146a10169j73872p6554a80074E4838b83081R4578I3664D0194a27750C09040f613
$$ -110169 -284041 -360595 -180074 54838 -283081 -188503 93664 40194 -127750 309040 -6613
9134c56375A59990a98980c8441D7255a492l5325o9562G3885B8352K9988c16374
$$ -356375 159990 -198980 -38441 47255 -1492 -36817 -106379 73885 28352 58340 -316374
9122B8694f5160l8803C7337m167a04587A0130J28677i4195F7961b8124I0147a27919
$$ 28694 -65160 -103963 37337 33170 -104587 10130 138807 -94195 67961 -28124 90147 -127919
9109b18069i9665k8424j12100h2460E2735g7478k31960a51296O201k17077a72654
$$ -218069 -99665 -128089 -240189 -82460 52735 -77478 -309438 -151296 -145095 -362172 -172654
9097b07837n4409E5309E198a15574q4646d8409j00346O2854n4757A30363D9714
$$ -207837 -262246 55309 5198 -115574 -200220 -48409 -148755 -85901 -140658 130363 49714
9085C5278b91576D8447c72333f1768j46605d4978A6789f1013B397J15893j0766
$$ 35278 -291576 48447 -372333 -61768 -208373 -44978 16789 -61013 2397 118290 107524
9074A07524b58808G8398e0947B00367a293r1860k28477a27042J1702C9411c91296
$$ 107524 -258808 78398 -50947 200367 -1293 -93153 -321630 -127042 -115340 39411 -391296
9062b23373B21999l1019O1383a77056A10265a29031j88844M1083H257h2872Q944
$$ -223373 221999 190980 252363 -177056 110265 -129031 -317875 -276792 8257 -82872 -73928
9051g3928j16702A56501b8532k5679B75439d01555A47271e8717F0249b9726m3418
$$ -73928 -190630 156501 -28532 -54211 275439 -401555 147271 -58717 60249 -29726 -73144
9040g3144l444A71210c6141p7880d0865J2948C0666l653R0942b61950d7061j84081
$$ -73144 -76588 171210 -36141 -114021 -40865 -27917 30666 27013 117955 -261950 -47061 -231142
9028b31142C24642A55734L1965b73183E3403P788O4719G027a040k17652A29705
$$ -231142 324642 155734 187699 -273183 53403 61191 125910 7027 -1040 -218692 129705
9016A73449o2165a16256l05789A4715a37543m2134J7423l8925a9629h112H8953
$$ 173449 111284 -116256 -422045 14715 -137543 -179677 -162254 -201179 -19629 -8112 88953
9004a20477K1414L8435B01775C3597a34197B4189e1518j88197h4270D2323d6684
$$ -120477 -99063 -60628 201775 33597 -134197 24189 -51518 -239715 -84270 42323 -46684
8992a7667j42359A98715b05703e2682h319F7301f3463B76156l1790b60525M2480
$$ -17667 -160026 198715 -205703 -52682 -8319 67301 -63463 276156 244366 -260525 -218045
8981b18045A17667a17695H5031L2430L05853d21787g0645A73623J30187b65174
$$ -218045 117667 -117695 85031 117461 423314 -421787 -70645 173623 303810 -265174
8970a43088n7566B74996N3939I1304b27576d4712A08967a17238A18057O9172c9427
$$ -143088 -200654 274996 328935 91304 -227576 -44712 108967 -117238 118057 187229 -39427
8958a47628j38334B92167b59237R6348J4331A78766P5908a40751f8837k07757
$$ -147628 -285962 292167 -259237 -162889 -148558 178766 254674 -140751 -68837 -276594
8948b76594n7533C3459c77516A6012i9128C4593N7688F959a21629k0392h441H9800
$$ -276594 -334127 33459 -377516 16012 -99128 34593 92281 6959 -121629 -142021 -8441 89800
8935a43721D3074a86816B10637M6358F2972a07558B16525E7223J35856f7071j05922
$$ -143721 43074 -186816 210637 256995 62972 -107558 216525 57223 193079 -67071 -172993
8924a72993C34283b1783H76654L86973K502139J4480777G434377A495872E59248
$$ -172993 334283 -21783 876654 1263627 3765766 18246543 7434377 1495872 559248
8914C23555m5269f3943D351P6797M0206d85664b6487G2235L64571j83820A992
$$ 323555 278286 -63943 4351 81148 121354 -485664 -26487 72235 436806 252986 1992
8902b65669G5000N8490B518M1697c68571A0886b21017h8992o8497D7910O2434
$$ -265669 75000 133490 2518 44215 -368571 10886 -221017 -88992 -157489 47910 110344
8891A10344m4447R4044g5217O159I0420J98891C9535o901j3700b24174g0224C78066
$$ 110344 65897 159941 -75217 -69058 90420 289311 39535 32634 18934 -224174 -70224 378066
8878C1378o252L0784a33808A52991d83899A67326g9098b9383H4317a34114A78439
$$ 31378 25126 55910 -133808 152991 -483899 167326 -79098 -29383 84317 -134114 178439
8866H8854a09205B1179f7067p7636o9072e1448A77928i2589k9366e0727B03272
$$ 88854 -109205 21179 -67067 -144703 -213775 -51448 177928 -92589 -121955 -50727 203272
8854a35465A79594C9645o99i4839A30791b75765a08910L9254p3927M7042o2473
$$ -135465 179594 39645 38946 -94839 130791 -275765 -108910 -69656 -143583 -96541 -159014
$$ [...]
##END NTUPLES=NMR SPECTRUM
##END=
