
##TITLE=AC1356_CPIAH12175_6648174_laQqRkL1nq
##JCAMPDX= 6.0         $$ Bruker NMR JCAMP-DX V2.0
##DATA TYPE= NMR SPECTRUM
##DATA CLASS= NTUPLES
##ORIGIN= BRUKER
##OWNER= Administrator
$$ 1.72 TOPSPIN		Version 2.1
$$ 2012-08-10 22:02:33.484 -0500  Administrator@TOPSPIN
$$ Compression mode = diff/dup
##.OBSERVE FREQUENCY= 400.02188249412
##.OBSERVE NUCLEUS= ^1H
##.ACQUISITION MODE= SIMULTANEOUS (DQD)
##.ACQUISITION SCHEME= undefined
##.AVERAGES= 64
##.DIGITISER RES= 22
##SPECTROMETER/DATA SYSTEM= spect
##.PULSE SEQUENCE= noesygpps1d.comp
##.SOLVENT NAME= COFFEE_meoh
##.SHIFT REFERENCE= INTERNAL, COFFEE_meoh, 1, 14.96253
##AUDIT TRAIL= $$ (NUMBER, WHEN, WHO, WHERE, PROCESS, VERSION, WHAT)
$$ ##TITLE= Audit trail, TOPSPIN		Version 2.1
$$ ##JCAMPDX= 5.01
$$ ##ORIGIN= Bruker BioSpin GmbH
$$ ##OWNER= Administrator
$$ $$ C:\Bruker\TOPSPIN/data/COFFEE/nmr/AC1356_CPIAH12175_6648174_laQqRkL1nq/12/pdata/1/auditp.txt
$$ ##AUDIT TRAIL=  $$ (NUMBER, WHEN, WHO, WHERE, PROCESS, VERSION, WHAT)
(   1,<2012-08-10 22:02:28.593 -0500>,<Administrator>,<TOPSPIN>,<go>,<TOPSPIN 2.1>,
      <created by zg
	started at 2012-08-10 21:50:58.453 -0500,
	POWCHK enabled, PULCHK disabled,
       configuration hash MD5:
       6B 1B 68 BB D9 2E 58 E2 7F 35 AD 54 07 DF 0E 41
       data hash MD5: 64K
       E5 CF 11 99 2D 6C 57 21 35 7A D1 98 C3 DF B2 C8>)
(   2,<2012-08-10 22:02:31.453 -0500>,<Administrator>,<TOPSPIN>,<proc1d>,<TOPSPIN 2.1>,
      <Start of raw data processing
       efp LB = 0.3 FT_mod = 6 PKNL = 1 PHC0 = 0 PHC1 = 0 SI = 128K 
       data hash MD5: 128K
       BB 2F 63 D1 F1 AA 54 DA F1 27 B8 CE AB D1 82 4D>)
(   3,<2012-08-10 22:02:32.578 -0500>,<Administrator>,<TOPSPIN>,<proc1d>,<TOPSPIN 2.1>,
      <pk PHC0 = 3.416748 PHC1 = 0 
       data hash MD5: 128K
       F2 12 38 79 0B EC A8 AD 45 F6 DD A8 55 37 4E 58>)
(   4,<2012-08-10 22:02:33.140 -0500>,<Administrator>,<TOPSPIN>,<proc1d>,<TOPSPIN 2.1>,
      <abs ABSG = 1 
       data hash MD5: 128K
       D3 73 88 F8 94 4B FF A6 CD 3E 3C 1D BD 7E E0 5C>)
(   5,<2012-08-10 22:02:33.218 -0500>,<Administrator>,<TOPSPIN>,<proc1d>,<TOPSPIN 2.1>,
      <abs ABSG = 2 
       data hash MD5: 128K
       B2 51 E3 FB D2 11 26 3C E7 C4 0E 98 05 89 B9 70>)
(   6,<2012-08-10 22:02:33.281 -0500>,<Administrator>,<TOPSPIN>,<proc1d>,<TOPSPIN 2.1>,
      <abs ABSG = 3 
       data hash MD5: 128K
       4C 3B CD 9B E4 EB A5 55 9E B6 33 4C D2 BF BB E5>)
(   7,<2012-08-10 22:02:33.343 -0500>,<Administrator>,<TOPSPIN>,<proc1d>,<TOPSPIN 2.1>,
      <abs ABSG = 4 
       data hash MD5: 128K
       B5 35 5C D7 E2 A6 DB F0 72 40 63 AB 05 60 68 05>)
(   8,<2012-08-10 22:02:33.390 -0500>,<Administrator>,<TOPSPIN>,<proc1d>,<TOPSPIN 2.1>,
      <abs ABSG = 5 
       data hash MD5: 128K
       33 22 DD 73 29 6B 73 A9 05 8B 08 44 F7 C4 13 10>)
$$ ##END=
$$ 
$$ $$ hash MD5
$$ $$ 4F 16 33 6A B2 B5 E0 F6 C4 A3 B0 70 DC C9 CA 71
##$RELAX= 
##$RELAX= 
##$RELAX= 
##$RELAX= 
##$RELAX= 
##$RELAX= 
##$RELAX= 
##$RELAX= 
$$ Bruker specific parameters
$$ [...]
##$TP07= 0
##$TPNAME0= <>
##$TPNAME1= <>
##$TPNAME2= <>
##$TPNAME3= <>
##$TPNAME4= <>
##$TPNAME5= <>
##$TPNAME6= <>
##$TPNAME7= <>
##$TPOAL= (0..7)
0.5 0.5 0.5 0.5 0.5 0.5 0.5 0.5
##$TPOFFS= (0..7)
0 0 0 0 0 0 0 0
##$TUNHIN= 0
##$TUNHOUT= 0
##$TUNXOUT= 0
##$USERA1= <user>
##$USERA2= <user>
##$USERA3= <user>
##$USERA4= <user>
##$USERA5= <user>
##$V9= 5
##$VALIST= <valist>
##$VCLIST= <CCCCCCCCCCCCCCC>
##$VD= 0
##$VDLIST= <DDDDDDDDDDDDDDD>
##$VPLIST= <PPPPPPPPPPPPPPP>
##$VTLIST= <TTTTTTTTTTTTTTT>
##$WBST= 1024
##$WBSW= 4
##$XGAIN= (0..3)
0 0 0 0
##$XL= 0
##$YL= 0
##$YMAX_a= 17471414
##$YMIN_a= -10348050
##$ZGOPTNS= <>
##$ZL1= 120
##$ZL2= 120
##$ZL3= 120
##$ZL4= 120
##$ABSF1= 14.96253
##$ABSF2= -5.595652
##$ABSG= 5
##$ABSL= 3
##$ALPHA= 0
##$AQORDER= 0
##$ASSFAC= 0
##$ASSFACI= 0
##$ASSFACX= 0
##$ASSWID= 0
##$AUNMP= <proc_prof1d_extract.lims>
##$AXLEFT= 0
##$AXNAME= <>
##$AXNUC= <1H>
##$AXRIGHT= 0
##$AXTYPE= 0
##$AXUNIT= <>
##$AZFE= 0.1
##$AZFW= 0.1
##$BCFW= 0
##$BC_mod= 0
##$BYTORDP= 0
##$COROFFS= 0
##$CY= 15
##$DATMOD= 1
##$DC= 0
##$DFILT= <>
##$DTYPP= 0
##$F1P= 0
##$F2P= 0
##$FCOR= 0.5
##$FTSIZE= 131072
##$FT_mod= 6
##$GAMMA= 0
##$GB= 0
##$INTBC= 1
##$INTSCL= 1
##$ISEN= 128
##$LB= 0.3
##$LEV0= 0
##$LPBIN= 0
##$MAXI= 10000
##$MC2= 0
##$MEAN= 0
##$ME_mod= 0
##$MI= 0
##$NCOEF= 0
##$NC_proc= -2
##$NLEV= 6
##$NOISF1= 0
##$NOISF2= 0
##$NSP= 0
##$NTH_PI= 0
##$NZP= 0
##$OFFSET= 14.96253
##$PC= 1
##$PHC0= 3.416748
##$PHC1= 0
##$PH_mod= 1
##$PKNL= yes
##$PPARMOD= 0
##$PPDIAG= 0
##$PPIPTYP= 0
##$PPMPNUM= 2147483647
##$PPRESOL= 1
##$PSCAL= 4
##$PSIGN= 0
##$PYNMP= <proc.py>
##$REVERSE= no
##$SF= 400.020009024512
##$SI= 131072
##$SIGF1= 0
##$SIGF2= 0
##$SINO= 400
##$SIOLD= 131072
##$SPECTYP= <>
##$SREGLST= <1H.CDCl3>
##$SSB= 0
##$STSI= 131072
##$STSR= 0
##$SW_p= 8223.68421052631
##$SYMM= 0
##$S_DEV= 0
##$TDeff= 65536
##$TDoff= 0
##$TI= <>
##$TILT= no
##$TM1= 0
##$TM2= 0
##$TOPLEV= 0
##$USERP1= <user>
##$USERP2= <user>
##$USERP3= <user>
##$USERP4= <user>
##$USERP5= <user>
##$WDW= 1
##$XDIM= 131072
##$YMAX_p= 453015358
##$YMIN_p= -11084
##$CURPLOT= <Network HP LaserJet P1505>
##$CURPRIN= <$Network HP LaserJet P1505>
##$DFORMAT= <normdp>
##$LAYOUT= <+/1D_H.xwp>
##$LFORMAT= <normlp>
##$PFORMAT= <normpl>
##$SURQMSG= 1
$$ End of Bruker specific parameters
$$ ---------------------------------
##NTUPLES= NMR SPECTRUM
##VAR_NAME=  FREQUENCY,     SPECTRUM/REAL,   SPECTRUM/IMAG
##SYMBOL=    X,             R,               I
##VAR_TYPE=  INDEPENDENT,   DEPENDENT,       DEPENDENT
##VAR_FORM=  AFFN,          ASDF,            ASDF
##VAR_DIM=   131072,        131072,          131072
##UNITS=     HZ,            ARBITRARY UNITS, ARBITRARY UNITS
##FACTOR=    0.0627417313425164, 1,          1
##FIRST=     8223.62146879497, -1096,        -66904
##LAST=      0,             1362,            -67284
##MIN=       0,             -11084,          0
##MAX=       8223.62146879497, 453015358,    0
$$ Real data points
##PAGE= N=1
##DATA TABLE= (X++(R..R)), XYDATA
$$ [...]
60964B2540731L990196L656104K685369J366823J43899o55237r35083p49730k01137
$$ 22540731 26530927 30187031 32872400 34239223 34383122 33727885 32792802 32043072 31841935
60955C1841935N35513J147427J266395P00070m07006j661222k677355l270040
$$ 31841935 32377448 33524875 34791270 35491340 35084334 33423112 30745757 27475717
60947B7475717l455293l341821l045343k662345k264267j891710j560180j275628
$$ 27475717 24020424 20678603 17633260 14970915 12706648 10814938 9254758 7979130
60939G979130j040853q51443o97095n70448m69707l92589l33609k88124k53951
$$ 7979130 6938277 6086834 5389739 4819291 4349584 3956995 3623386 3335262 3081311
60930C081311k28049k06061j86016j68725j53858j39096j23662j09115r6082q3457
$$ 3081311 2853262 2647201 2461185 2292460 2138602 1999506 1875844 1766729 1670647 1587190
60920A587190p1517o2627n8005n6263n5733n5699n5065n2436m8152m4021m0635
$$ 1587190 1515673 1453046 1395041 1338778 1283045 1227346 1172281 1119845 1071693 1027672 987037
60909I87037l6956l2695k8806k5509k2002j8449j5975j4533j2852j0718r149q150
$$ 987037 950081 917386 888580 863071 841069 822620 806645 792112 779260 768542 759393 751243
60897G51243o423l702j324j12M48P20M68R7M63J183R08n65k073l109m315n960
$$ 751243 744820 741118 739794 739682 740130 740850 741318 741415 741878 743061 743969 743404 741331 738222 733907 727947
60881G27947p632r398j1540j3184j3106j1837j1093j1145j0730r533q590q120
$$ 727947 720315 710917 699377 686193 673087 661250 650157 639012 628282 618749 610159 602039
60869F02039p104n396m122l601k765j157L88J433K456L376L448L100L919O177
$$ 602039 594935 589539 585417 581816 579051 577894 578282 579715 582171 585547 588995 592095 596014 602191
60855F02191Q256R142R737J0951J2210J2790J3098J3737J4525J5202J5960J6842
$$ 602191 610447 619589 629326 640277 652487 665277 678375 692112 706637 721839 737799 754641
60843G54641J7571J8307J9268J9542J7775J4313J1168R490Q495P144N271K809
$$ 754641 772212 790519 809787 829329 847104 861417 872585 882075 890570 897714 902985 905794
60831I05794l55l265m383l801l272l525l389k357k154m418q337j1845j4053j5311
$$ 905794 905439 902174 897791 893990 890718 887193 883804 881447 879293 874875 866538 854693 840640 825329
60817H25329j5921j5988j5923j5993j5919j5400j4500j3137j1066q657o847n873
$$ 825329 809408 793420 777497 761504 745585 730185 715685 702548 691482 682825 675978 670105
60805F70105n007l822k737j996j212k99K56N37J438L262N142O345P198Q178R146
$$ 670105 665098 661276 658539 656543 655331 655032 655288 655825 657263 660525 665667 672012 679210 687388 696534
60790F96534J0021J1155J2508J3359J3396J3176J3099J2787J1874J0570R098P520
$$ 696534 706555 717710 730218 743577 756973 770149 783248 796035 807909 818479 827577 835097
60778H35097O344O185O637O561N894N856O945Q052Q120P485O866O196N230M259
$$ 835097 841441 847626 854263 860824 866718 872574 879519 887571 895691 903176 910042 916238 921468 925727
60764I25727L455K441J166L31K36R5q35k284l697n018o137o492o020n598n825
$$ 925727 929182 931623 932789 933120 933356 933451 932616 930332 926635 921617 915480 908988 902968 897370 891545
60749H91545o005n165l461j921j226j369k028k854l686m673n781o310n663m495
$$ 891545 885540 880375 876914 874993 873767 872398 870370 867516 863830 859157 853376 847066 841403 836908
60735H36908l987m063l545k275j640k435l561l694l060k656k658k618k508k603
$$ 836908 832921 828858 825313 823038 821398 818963 815402 811708 808648 805992 803334 800716 798208 795605
60721G95605k696k352j644j101j094j512j821j406k98N84M65j91m11k78o61j578
$$ 795605 792909 790557 788913 787812 786718 785206 783385 781979 781681 782265 782730 782539 782128 781850 781189 779611
60705G79611k150k233k706l842m817n246n905p289q724r532r972j0405j0579j0407
$$ 779611 777461 775228 772522 768680 763863 758617 752712 745423 736699 727167 717195 706790 696211 685804
60691F85804j0435j0925j1378j1463j1440j1222j0153q309o834o351o062n139
$$ 685804 675369 664444 653066 641603 630163 618941 608788 600479 593645 587294 581232 576093
60679E76093l912k960k088r70J43J151K554M446N960O477O469O519O472O200O159
$$ 576093 572181 569221 567133 566163 566306 567457 570011 574457 580417 586894 593363 599882 606354 612554 618713
60664F18713O433O236N160L976L352K880K217K065K922L856L786L191L361M444
$$ 618713 625146 631382 636542 640518 643870 646750 648967 651032 653954 657810 661596 664787 668148 672592
60650F72592N481N969O324P005P979Q884R260Q910Q426Q794J0042J0980J0687
$$ 672592 678073 684042 690366 697371 705350 714234 723494 732404 740830 749624 759666 770646 781333
60637G81333R653Q972R192J0276J1858J3041J2904J1644J0331R183P240M185J033
$$ 781333 790986 799958 809150 819426 831284 844325 857229 868873 879204 888387 895627 899812 900845
60624I00845j583m315p401r688j0637j1724j4234j6886j7522j6292j5202j5013
$$ 900845 899262 894947 887546 877858 867221 855497 841263 824377 806855 790563 775361 760348
60612G60348j4502j2683j0130p833o060m588l057r86J849M988P787J0118J2028
$$ 760348 745846 733163 723033 715200 709140 704552 701495 700509 702358 707346 715133 725251 737279
60599G37279J3148J3134J2299J1104R405P008M507K762J851J316J065J287J821
$$ 737279 750427 763561 775860 786964 796369 803377 807884 810646 812497 813813 814878 816165 817986
60586H17986K342K912L612M051L820L149K465J712O54n70j720k816l742m037l719
$$ 817986 820328 823240 826852 830903 834723 837872 840337 842049 842703 842133 840413 837597 833855 829818 826099
60571H26099l609m335n554o753p981r236r923r761r475r706j0000r712r150q865
$$ 826099 822490 818155 812601 805848 797867 788631 778708 768947 759472 749766 739766 730054 720904 712039
60557G12039q558p663o365n090l648j872l56M96J430L165M942N553N224N165N741
$$ 712039 703481 695818 689453 684363 680715 678843 678487 678983 680413 683578 688520 694073 699297 704462 710203
60542G10203O458P377R108J1505J3734J5665J8109K1710K6591L2929M0657M8549
$$ 710203 716661 724038 733146 744651 758385 774050 792159 813869 840460 873389 914046 962595
60530I62595N4621N7506N6833N2417M4142L2592J8925M192j0500k3377l2560l7302
$$ 962595 1017216 1074722 1131555 1183972 1228114 1260706 1279631 1283823 1273323 1249946 1217386 1180084
60518A180084l8104l5812l1301k5620j9532j3033o163k7L955N627O081O222O169
$$ 1180084 1141980 1106168 1074867 1049247 1029715 1016682 1010519 1010492 1014447 1020074 1026155 1032377 1038546
60505A038546N856N257M222L000K803M831Q704J2777J6122J9408K3781K9646L6699
$$ 1038546 1044402 1049659 1053881 1056881 1059684 1064515 1073219 1085996 1102118 1121526 1145307 1174953 1211652
60492A211652M4535N3011O2386P2958Q4330R5391J05475J15061J24923J35393
$$ 1211652 1256187 1309198 1371584 1444542 1528872 1624263 1729738 1844799 1969722 2105115
60482B105115J47390J63479J86526K17504K55561K99654L48142L96013M33528
$$ 2105115 2252505 2415984 2602510 2820014 3075575 3375229 3723371 4119384 4552912
60473D552912M48724M31816L78403K90199J73964L9914r9208k28921l35442m09724
$$ 4552912 5001636 5433452 5811855 6102054 6276018 6315932 6216724 5987803 5652361 5242637
60463E242637m49831m59483m45009m13812l73754l31391k90243k51518k16173
$$ 5242637 4792806 4333323 3888314 3474502 3100748 2769357 2479114 2227596 2011423
60454B011423j85210j58552j35261j15055r8346q4803p3240o3168n5155m9241
$$ 2011423 1826213 1667661 1532400 1417345 1318999 1234196 1160956 1097788 1042633 993392
60444I93392m4123l8618l2979k8163k4498k1726j9710j8428j7501j6416j5121
$$ 993392 949269 910651 877672 849509 825011 803285 783575 765147 747646 731230 716109
60433G16109j4002j3223j2354j0858q885p281o515n942m675k992k021k045k091
$$ 716109 702107 688884 676530 665672 656787 649506 642991 637049 632374 629382 627361 625316 623225
60420F23225j564j098j223j287n58M72Q85O94L67j91j075j478o23Q49J678J790
$$ 623225 621661 620563 619340 618053 617495 617967 618852 619546 619913 619722 618647 617169 616546 617395 619073 620863
60404F20863K179L230M368N142N552N436M597L515K968L045L306L674M273M678
$$ 620863 623042 626272 630640 635782 641334 646770 651367 654882 657850 660895 664201 667875 672148 676826
60390F76826M326L409K561J862J083M45J68k90j441k617k798k272k183k779l326
$$ 676826 681152 684561 687122 688984 690067 690512 690680 690390 688949 686332 683534 681262 679079 676300 672974
60375F72974l550l750l693k801j461p95r89j143q19m98l76oO58J054J062J169
$$ 672974 669424 665674 661981 659180 657719 656924 655935 654792 653973 653475 653099 653093 653751 654805 655867 657036
60359F57036J465J594J763K572L677L948L278K941L695M757N194N256N614O302
$$ 657036 658501 660095 661858 664430 668107 672055 675333 678274 681969 686726 691920 697176 702790 709092
60345G09092O979P539P895P832P552P721Q593R600J0051R718Q591O778M740L034
$$ 709092 716071 723610 731505 739337 746889 754610 763203 772803 782854 792572 801163 807941 812681 815715
60331H15715J659L37o78q19k19M83J307K878N015O438O326N279M309L550K458
$$ 815715 817374 817711 817033 816214 815995 816478 817785 820663 825678 832116 838442 843721 848030 851580 854038
60316H54038P03j515l632n071n765o243o793o846n894m679m426n018n026l709
$$ 854038 854741 853226 849594 844523 838758 832515 825722 818876 812982 808303 803877 798859 793833 790124
60302G90124j927q86q47j328j752j599n94R89K679M377O127P515Q063P951P560
$$ 790124 788197 787311 786464 785136 783384 781785 781191 782180 784859 789236 795363 802878 810941 818892 826452
60287H26452O609M759K692J471R58J38j078j663j115RJ291K881M554N597O050
$$ 826452 833061 837820 840512 841983 842941 843079 842001 840338 839223 839232 840523 843404 847958 853555 859605
60272H59605O803Q133R253R759J0428J1995J4123J6140J7988J9947K2107K4491
$$ 859605 866408 874541 883794 893553 903981 915976 930099 946239 964227 984174 1006281 1030772
60260A030772K7040K9414L1461L3952L7876M2965M7912N2245N6924O2919P0193
$$ 1030772 1057812 1087226 1118687 1152639 1190515 1233480 1281392 1333637 1390561 1453480 1523673
60249A523673P8326Q7069R5951J04329J12188J20077J28053J35477J41871J46948
$$ 1523673 1601999 1689068 1785019 1889348 2001536 2121613 2249666 2385143 2527014 2673962
60239B673962J49776J49200J45227J38810J30039J17898J02229Q4537O6291M7644
$$ 2673962 2823738 2972938 3118165 3256975 3387014 3504912 3607141 3691678 3757969 3805613
60229C805613K8493R513q601k5850m1940n5496o5168p0946p3646p3632p0668o4624
$$ 3805613 3834106 3843619 3835018 3809168 3767228 3711732 3646564 3575618 3501972 3428340 3357672 3293048
60217C293048n5854m5091l3207k0671p265P259K2497L7993N4074P1048Q8009J03671
$$ 3293048 3237194 3192103 3158896 3138225 3130960 3138219 3160716 3198709 3252783 3323831 3411840 3515511
60205C515511J18117J32182J45192J54974J60266J61417J58467J50414J37081
$$ 3515511 3633628 3765810 3911002 4065976 4226242 4387659 4546126 4696540 4833621
60196D833621J20060J00885P9550N5760L0289M311k1596m6806p0154r0776j08528
$$ 4833621 4953681 5054566 5134116 5189876 5220165 5224476 5202880 5156074 5085920 4995144 4886616
60185D886616j22851j32265j35827j34119j28291j19016j06949r3007p7488o0067
$$ 4886616 4763765 4631500 4495673 4361554 4233263 4114247 4007298 3914291 3836803 3776736
60175C776736m1238k2572m734J3527L3358N3860P3044Q9718J03265J12560J16428
$$ 3776736 3735498 3712926 3708192 3721719 3755077 3808937 3881981 3971699 4074964 4187524 4303952
60164D303952J14787J08476R8336Q5111O9698N2777L4693J6013k297j9515l5158
$$ 4303952 4418739 4527215 4625551 4710662 4780360 4833137 4867830 4883843 4881546 4862031 4826873
60153D826873m8100n6695o0149n8809n2879m2083k6950r185R881L0028N0938P1589
$$ 4826873 4778773 4722078 4661929 4603120 4550241 4508158 4481208 4472023 4481904 4511932 4562870 4634459
60141D634459R1577J11706J32665J54374J77280K02728K31197K61578K92977L25678
$$ 4634459 4726036 4837742 4970407 5124781 5302061 5504789 5735986 5997564 6290541 6616219
60131F616219L59171L90935M18479M41254M59055M69967M71642M63588M46589
$$ 6616219 6975390 7366325 7784804 8226058 8685113 9155080 9626722 10090310 10536899
60122A0536899M20699L85505L41700K90791K33744J71214J04679L5915l4225j05368
$$ 10536899 10957598 11343103 11684803 11975594 12209338 12380552 12485231 12521146 12486921 12381553
60112A2381553j76108k43809l05486l58143l99059m26833m41731m44341m34693
$$ 12381553 12205445 11961636 11656150 11298007 10898948 10472115 10030384 9586043 9151350
60103I151350m13433l82810l45406l02779k56320k08260j60425j12845o5043j8028
$$ 9151350 8737917 8355107 8009701 7706922 7450602 7242342 7081917 6969072 6904029 6886001
60093F886001K6379O7388J04888J37619J63242J80107J87798J86293J75774J57035
$$ 6886001 6912380 6979768 7084656 7222275 7385517 7565624 7753422 7939715 8115489 8272524
60083H272524J31166R9120O2459K3919j3820m9434q2276j11284j35864j57163
$$ 8272524 8403690 8502810 8565269 8589188 8575368 8525934 8443658 8332374 8196510 8039347
60073H039347j76945j95389k11132k23128k31350k35824k36181k32038k23222
$$ 8039347 7862402 7667013 7455881 7232753 7001403 6765579 6529398 6297360 6074138
60064F074138k09903j93302j75526j57810j39453j19393r8114p6871n5795l4156
$$ 6074138 5864235 5670933 5495407 5337597 5198144 5078751 4980637 4903766 4847971 4813815
60054D813815j1992R914L1487N3481P6119R8577J19697J38418J53659J64527J70471
$$ 4813815 4801823 4811737 4843224 4896705 4972824 5071401 5191098 5329516 5483175 5647702 5818173
60043E818173J70734J64211J50550J30879J06804P9282M9019J7085j5700m9200
$$ 5818173 5988907 6153118 6303668 6434547 6541351 6620633 6669652 6686737 6671037 6621837
60033F621837q2828j14791j43221j67164j85739j97532k02106k00890j95334j85241
$$ 6621837 6539009 6424218 6280997 6113833 5928094 5730562 5528456 5327566 5132232 4946991
60023D946991j70342j52288j33347j14018r3677p2745n2206l1708j0135J2242
$$ 4946991 4776649 4624361 4491014 4376996 4283319 4210574 4158368 4126660 4116525 4128767
60013D128767L4170N5722P8318J02464J27168J51583J75582J98561K19085K35789
$$ 4128767 4162937 4218659 4296977 4399441 4526609 4678192 4853774 5052335 5271420 5507209
60003E507209K47321K51676K46994K33213K11802J84095J51127J14634P6580L7706
$$ 5507209 5754530 6006206 6253200 6486413 6698215 6882310 7033437 7148071 7224651 7262357
59993G262357k048m1820p9944j15478j47966j75766j96320k08260k11875k07673
$$ 7262357 7260309 7218489 7138545 7023067 6875101 6699335 6503015 6294755 6082880 5875207
59983E875207j96123j78921j58628j36584j12553q6704o0365l4438q571J7479
$$ 5875207 5679084 5500163 5341535 5204951 5092398 5005694 4945329 4910891 4902320 4919799
59973D919799M2810O6260Q7163J04887J18676J28471J34850J37828J36835J32144
$$ 4919799 4962609 5028869 5116032 5220919 5339595 5468066 5602916 5740744 5877579 6009723
59963F009723J25181J16891J06790R4228P9646O4042M7927L1507J5302R3j3402
$$ 6009723 6134904 6251795 6358585 6452813 6532459 6596501 6644428 6675935 6691237 6691330 6677928
59952F677928k4456l2166l5528l3638k6085j3327L805K5338N2218Q4629J21149
$$ 6677928 6653472 6621306 6585778 6552140 6526055 6512728 6516533 6541871 6594089 6678718 6799867
59941F799867J60448K02895K49279K98735L49402M00425M51544N00837N44527
$$ 6799867 6960315 7163210 7412489 7711224 8060626 8461051 8912595 9413432 9957959
59932I957959N78917O00872O06379N90411N49082M81220L88173K73608J43959
$$ 9957959 10536876 11137748 11744127 12334538 12883620 13364840 13753013 14026621 14170580
59923A4170580P717j26515k51059l59012m44972n06633n44862n61963n60540n43852
$$ 14170580 14178297 14051782 13800723 13441711 12996739 12490106 11945244 11383281 10822741 10278889
59913A0278889n15790m79793m38273l93081l45721k97032k47506j98022j49622
$$ 10278889 9763099 9283306 8845033 8451952 8106231 7809199 7561693 7363671 7214049
59904G214049j02725n7250j3276K9168P0572J11248J50458J87094K20667K50481
$$ 7214049 7111324 7054074 7040798 7069966 7140538 7251786 7402244 7589338 7810005 8060486
59894H060486K74255K88809K91842K81898K57290K16690J60833R2470J4961o7701
$$ 8060486 8334741 8623550 8915392 9197290 9454580 9671270 9832103 9924573 9939534 9871833
59884I871833j49979k25858k91192l44060l83221m07855m18701m17839m07064
$$ 9871833 9721854 9495996 9204804 8860744 8477523 8069668 7650967 7233128 6826064
59875F826064l87800l62324l33452l02822k70940k38852k08215j79622j52554
$$ 6826064 6438264 6075940 5742488 5439666 5168726 4929874 4721659 4542037 4389483
59866D389483j27290j05355q7811p4491o5168n9980n8423n9245o1574o4889o7837
$$ 4389483 4262193 4156838 4069027 3994536 3929368 3869388 3810965 3751720 3690146 3625257 3557420
59855C557420o8659o6853o2999n6932m7831l6254k4311j3299k930O624J3606J6289
$$ 3557420 3488761 3421908 3358909 3301977 3254146 3217892 3193581 3180282 3177352 3183976 3197582 3213871
59843C213871J4361Q143k036j5011k8659m1299n2247o0678o5381o6164o4190o0419
$$ 3213871 3228232 3236375 3234339 3219328 3190669 3149370 3097123 3036445 2971064 2904900 2840710 2780291
59831B780291n4863m7716l9908l2034k3865j5314o769J787J0706J9659K8025L6421
$$ 2780291 2725428 2677712 2637804 2605770 2581905 2566591 2559822 2561609 2572315 2591974 2619999 2656420
59819B656420M6309N7798O9358P9863Q9183R6455R9662R7757R1675Q2795P1836
$$ 2656420 2702729 2760527 2829885 2909748 2998931 3095386 3195048 3292805 3384480 3467275 3539111
59808C539111N9808M8182L7364K6348J4606K902q132j8465k7074l1651l0903k5756
$$ 3539111 3598919 3647101 3684465 3710813 3725419 3728321 3720189 3701724 3674650 3642999 3612096 3586340
59796C586340j7607o812O428K1328L7629N6051P6886R9481J23823J51101J82073
$$ 3586340 3568733 3561921 3568349 3589677 3627306 3683357 3760243 3859724 3983547 4134648 4316721
59785D316721K16497K54780K98479L48144M02223M58398N13464N60054N85206
$$ 4316721 4533218 4787998 5086477 5434621 5836844 6295242 6808706 7368760 7953966
59776G953966N74427N17660M12672K66636R6830p2739k19745l30901m02653m37599
$$ 7953966 8528393 9046053 9458725 9725361 9822191 9749452 9529707 9198806 8796153 8358554
59766H358554m41951m24238l93011l54724l13903k73995k36746k01828j68550
$$ 8358554 7916603 7492365 7099354 6744630 6430727 6156732 5919986 5718158 5549608
59757E549608j37436j09306q3850o0297l8608j8898m38J7663L5472N2779O9901
$$ 5549608 5412172 5302866 5219016 5158719 5120111 5101213 5100775 5118438 5153910 5206689 5276590
59746E276590Q7181J04676J22933J42944J64703J87066K09889K34803K62970K93492
$$ 5276590 5363771 5468447 5591380 5734324 5899027 6086093 6295982 6530785 6793755 7087247
59736G087247L25313L59249L96792M38058M82249N28961N77546O26121O72349
$$ 7087247 7412560 7771809 8168601 8606659 9088908 9617869 10195415 10821536 11493885
59727A1493885P14137P48347P70113P75018P61308P29187O79673O16061N45532
$$ 11493885 12208022 12956369 13726482 14501500 15262808 15991995 16671668 17287729 17833261
59718A7833261M77407M19806L78576L57706L58804L80736M21175M77879N47387
$$ 17833261 18310668 18730474 19109050 19466756 19825560 20206296 20627471 21105350 21652737
59709B1652737O23613O99396P68576Q25123Q61389Q69494Q44427P84618O90500
$$ 21652737 22276350 22975746 23744322 24569445 25430834 26300328 27144755 27929373 28619873
59700B8619873N64750M14011K48832Q1291p6962k15602l26764m06100m52376m66302
$$ 28619873 29184623 29598634 29847466 29928757 29851795 29636193 29309429 28903329 28450953 27984651
59690B7984651m50154m07655l43022k60257j63485n6763N7466J78974L07979M43677
$$ 27984651 27534497 27126842 26783820 26523563 26360078 26303315 26360781 26539755 26847734 27291411
59680B7291411N85054P31654Q82076J032413J176862J308199J415989J485413
$$ 27291411 27876465 28608119 29490195 30522608 31699470 33007669 34423658 35909071
59672C5909071J499728J444060J307267J083718P77318M04612p330m26465q20271
$$ 35909071 37408799 38852859 40160126 41243844 42021162 42425774 42418444 41991979 41171708
59663D1171708j159311j422114j598991j690894j705154j652996j549092j410099
$$ 41171708 40012397 38590283 36991292 35300398 33595244 31942248 30393156 28983057
59655B8983057j252737j094521r55388q55471q08796q18037q73595r56291j042549
$$ 28983057 27730320 26635799 25680411 24824940 24016144 23198107 22324512 21368221 20325672
59646B0325672j111385j150167j155671j131127j082969j018649r44805q66297
$$ 20325672 19214287 18064120 16908449 15777322 14694353 13675704 12730899 11864602
59638A1864602p86958p10496o39585n74718n15167m60716m11556l67278l27280
$$ 11864602 11077644 10367148 9727563 9152845 8637678 8176962 7765406 7398128 7070848
59629G070848k91674k60484k32468k06022j80825j57423j35714j15208r6343q0044
$$ 7070848 6779174 6518690 6286222 6080200 5899375 5741952 5606238 5491030 5394687 5314643
59619E314643o6192n3865m3027l4851l0442l0147l3817m0844n0264o1473p4368
$$ 5314643 5248451 5194586 5151559 5116708 5086266 5056119 5022302 4981458 4931194 4869721 4795353
59608D795353q8042j00265j09284j15376j19521j21396j19990j15443j08912j01212
$$ 4795353 4707311 4607046 4497762 4382386 4262865 4141469 4021479 3906036 3797124 3695912
59598C695912r2737q4092p5524o6337n6068m5546l5697k6212j6614p590J94P476
$$ 3695912 3603175 3519083 3443559 3377222 3321154 3275608 3239911 3213699 3197085 3189495 3189689 3197165
59586C197165J4997K1732K6336K9308L1829L3384L2728L0422K8164K6125K3339
$$ 3197165 3212162 3233894 3260230 3289538 3321367 3354751 3387479 3417901 3446065 3472190 3495529
59575C495529K0344J8960J9655K1464K4575L0548L9537M9515N8902O8105P7958
$$ 3495529 3515873 3534833 3554488 3575952 3600527 3631075 3670612 3720127 3779029 3847134 3925092
59564C925092Q8565J00246J13880J29464J45783J62268J79877J99494K20682K42638
$$ 3925092 4013657 4113903 4227783 4357247 4503030 4665298 4845175 5044669 5265351 5507989
59554E507989K65237K88378L11234L32822L52588L69894L83452L91756L93872
$$ 5507989 5773226 6061604 6372838 6705660 7058248 7428142 7811594 8203350 8597222
59545H597222L89811L80444L66847L49461L28319L04448K80297K58190K39067
$$ 8597222 8987033 9367477 9734324 10083785 10412104 10716552 10996849 11255039 11494106
59536A1494106K23079K10024J98222J84733J68748J53984J45784J46192J53060
$$ 11494106 11717185 11927209 12125431 12310164 12478912 12632896 12778680 12924872 13077932
59527A3077932J62692J71080J73194J63898J40299J01981M9250j7051r4089j77175
$$ 13077932 13240624 13411704 13584898 13748796 13889095 13991076 14040326 14023275 13929186 13752011
59517A3752011k61675l43555m18409m81722n30493n63536n80587n82547n72249
$$ 13752011 13490336 13146781 12728372 12246650 11716157 11152621 10572034 9989487 9417238
59508I417238n53302n28119m98131m65293m31607l97495l62407l26853k92318
$$ 9417238 8863936 8335817 7837686 7372393 6940786 6543291 6180884 5854031 5561713
59499E561713k59538k28518j99862j74251j50874j28327j06825q7690p0845n4809
$$ 5561713 5302175 5073657 4873795 4699544 4548670 4420343 4313518 4225828 4154983 4100174
59489D100174l8987k3897r269N957K1673L6810N1598O7536Q4931J02651J20563
$$ 4100174 4061187 4037290 4028021 4033978 4055651 4092461 4144059 4211595 4296526 4399177 4519740
59478D519740J40010J61543J84209K07630K32612K58998K84912L08778L30216
$$ 4519740 4659750 4821293 5005502 5213132 5445744 5704742 5989654 6298432 6628648
59469F628648L48178L59906L62509L54071L32780K96922K46658J84458J13242
$$ 6628648 6976826 7336732 7699241 8053312 8386092 8683014 8929672 9114130 9227372
59460I227372L5558m5046j23656j95866k58862l10456l48848l73932l87240l90109
$$ 9227372 9262930 9217884 9094228 8898362 8639500 8329044 7980196 7606264 7219024 6828915
59450F828915l83409l69332l51302l31279l08908k84149k59003k35564k13905
$$ 6828915 6445506 6076174 5724872 5393593 5084685 4800536 4541533 4305969 4092064
59441D092064j93054j72849j53832j36328j20514j06479r3596q0856o8329n7213
$$ 4092064 3899010 3726161 3572329 3436001 3315487 3209008 3115412 3034556 2966227 2909014
59431B909014m8003l9692l1281k2972j5409q727k757K719Q093J3417J7860K0760
$$ 2909014 2861011 2821319 2790038 2767066 2751657 2742930 2740173 2742892 2750985 2764402 2782262 2803022
59419B803022K2923K5616K8596L0667L1969L3937L7307M1973M8319N6177O2514
$$ 2803022 2825945 2851561 2880157 2910824 2942793 2976730 3014037 3056010 3104329 3160506 3223020
59408C223020O3004N6980M8859M4012M4985N2006O4529Q1268J00782J23197J49502
$$ 3223020 3286024 3343004 3391863 3435875 3480860 3532866 3597395 3678663 3779445 3902642 4052144
59397D052144J78217K04799K25866K42793K60348K83213L14348L54670M02824
$$ 4052144 4230361 4435160 4661026 4903819 5164167 5447380 5761728 6116398 6519222
59388F519222M56256N13201N72481O31111O83975P26365P55049P66569P57190
$$ 6519222 6975478 7488679 8061160 8692271 9376246 10102611 10857660 11624229 12381419
59379A2381419P26098O77067O15862N47343M75690M05191L39154K79248K26581
$$ 12381419 13107517 13784584 14400446 14947789 15423479 15828670 16167824 16447072 16673653
59370A6673653J81720J42763J05274O5376K1489k7539q3836j48490k19576k93137
$$ 16673653 16855373 16998136 17103410 17168786 17190275 17162736 17078900 16930410 16710834 16417697
59360A6417697l64419m27212m74323n00795n05933m91591m60345m16515l66914
$$ 16417697 16053278 15626066 15151743 14650948 14145015 13653424 13193079 12776564 12409650
59351A2409650l18621k76789k45284k27393k24272k33984k53363k79625l09334
$$ 12409650 12091029 11814240 11568956 11341563 11117291 10883307 10629944 10350319 10040985
59342A0040985l37796l61102l77548l86104l85353l75324l58577l37765l13611
$$ 10040985 9703189 9342087 8964539 8578435 8193082 7817758 7459181 7121416 6807805
59333F807805k86453k58032k29961k02098j74125j47243j22583r9378p6555n4880
$$ 6807805 6521352 6263320 6033359 5831261 5657136 5509893 5387310 5287932 5211377 5156497
59323E156497l5733j9013l992Q951J9216K7335L3685L7067L6398L2688K7476K0395
$$ 5156497 5120764 5101751 5097759 5106710 5125926 5153261 5186946 5224013 5260411 5293099 5320575 5340970
59311E340970J0282k276j5510k8746m2095n4529o4368p1392p6703q0677q2641
$$ 5340970 5351252 5348976 5333466 5304720 5262625 5208096 5143728 5072336 4995633 4914956 4832315
59300D832315q2222p9531p4258o5970n5219m3208l0541j7174l208J1235K6482
$$ 4832315 4750093 4670562 4596304 4530334 4475115 4431907 4401366 4384192 4380984 4392219 4418701
59289D418701M2801N9844P7263R5212J13659J32032J50186J68682J87395K04970
$$ 4418701 4461502 4521346 4598609 4693821 4807480 4939512 5089698 5258380 5445775 5650745
59279E650745K20471K34280K46363K54846K57492K53572K43139K25635K00511
$$ 5650745 5871216 6105496 6351859 6606705 6864197 7117769 7360908 7586543 7787054
59270G787054J68507J31261R0564M8803R060k6435n7342q4305j08258j31037j54679
$$ 7787054 7955561 8086822 8177386 8226189 8235249 8208814 8151472 8067167 7958909 7827872 7673193
59259G673193j78791j99971k14988k23297k25676k22360k13980k02487j89442
$$ 7673193 7494402 7294431 7079443 6856146 6630470 6408110 6194130 5991643 5802201
59250E802201j74599j57566j39330j20632j00461p7940n4147l0272n325K2328
$$ 5802201 5627602 5470036 5330706 5210074 5109613 5031673 4977526 4947254 4941929 4964257
59240D964257N2408Q3649J16237J51405J89585K30688K75174L22981L72268M20827
$$ 4964257 5016665 5100314 5216551 5367956 5557541 5788229 6063403 6386384 6758652 7179479
59230G179479M67525N10486N44907N64701N65639N45438N02142M34894L45835
$$ 7179479 7647004 8157490 8702397 9267098 9832737 10378175 10880317 11315211 11661046
59221A1661046K39351J19961p603j37020k61115l73638m69244n42979n91856o16574
$$ 11661046 11900397 12020358 12012755 11875735 11614620 11240982 10771738 10228759 9636903 9020329
59211I020329o20274o06221n77890n39941m96991m51838m06126l61850l20706
$$ 9020329 8400055 7793834 7215944 6676003 6179012 5727174 5321048 4959198 4638492
59202D638492k82912k48224k17138j89837j65118j42050j21519j04474q9987p6796
$$ 4638492 4355580 4107356 3890218 3700381 3535263 3393213 3271694 3167220 3077233 3000437
59192C000437o5494n7170n1121m5880m1343l7796l4125k9210k4082k0303j7163
$$ 3000437 2934943 2877773 2826652 2780772 2739429 2701633 2667508 2638298 2614216 2593913 2576750
59181B576750j2757p080j643L207Q300J3602J8480K3408K9319L5767M1745M7605
$$ 2576750 2563993 2556913 2555270 2558477 2566777 2580379 2598859 2622267 2651586 2687353 2729098 2776703
59169B776703N4232O1152O7542P4112Q1662Q8702R3118R5380R7421R8992R7908
$$ 2776703 2830935 2892087 2959629 3033741 3115403 3204105 3297223 3392603 3490024 3589016 3686924
59158C686924R3513Q7091P9053O8535N5782M2264K8212J2577m229j9837l2617
$$ 3686924 3780437 3867528 3946581 4015116 4070898 4113162 4141374 4153951 4149722 4129885 4097268
59147D097268m2924n1400n7946o2541o5438o6342o4874o1615n7273n1282m2989
$$ 4097268 4054344 4002944 3944998 3882457 3817019 3750677 3685803 3624188 3566915 3515633 3472644
59136C472644l3521k4456j5281m329Q287K0962L3348M6389N9995P3139Q6185J00641
$$ 3472644 3439123 3414667 3399386 3395057 3403344 3424306 3457654 3504043 3564038 3637177 3723362 3824003
59124C824003J16722J33433J50969J70509J91740K13100K34633K57987K83234
$$ 3824003 3940725 4074158 4225127 4395636 4587376 4800476 5035109 5293096 5576330
59115E576330L08157L31223L52926L73461L90961M02540M05161L95006L68046
$$ 5576330 5884487 6215710 6568636 6942097 7333058 7735598 8140759 8535765 8903811
59106H903811L22244K58250J78183Q5623j3180j10105j98051k72277l29725l69239
$$ 8903811 9226055 9484305 9662488 9748111 9734931 9624826 9426775 9154498 8824773 8455534
59096H455534l92482m02764m02729l94483l81318l66880l52608l37783l22021
$$ 8455534 8063052 7660288 7257559 6863076 6481758 6114878 5762270 5424487 5102466
59087E102466l05760k88727k70266k51123k32774k15061j96753j78273j61452
$$ 5102466 4796706 4507979 4237713 3986590 3753816 3538755 3342002 3163729 3002277
59078C002277j46564j32188j18116j05842r5750q6326p6848o8443o1712n5442
$$ 3002277 2855713 2723525 2605409 2499567 2403817 2317491 2240643 2172200 2110488 2055046
59068B055046m8570m1540l4952k8586k2339j6571j1069n259L07M228O195P018
$$ 2055046 2006476 1964936 1929984 1901398 1879059 1862488 1851419 1846160 1846467 1850695 1856890 1863908
59056A863908O655L968j389q467j6401k4603l1779l6631l9430m1061m0850l7416
$$ 1863908 1870563 1874531 1873142 1864675 1848274 1823671 1791892 1755261 1715831 1674770 1633920 1596504
59044A596504l1390k4988j9177j3625r089p041o815n946l610j057J608O157J3040
$$ 1596504 1565114 1540126 1520949 1507324 1498235 1491194 1484379 1478433 1474823 1473766 1475374 1481531 1494571
59031A494571K0162K5818L0479L4893L8591M1032M2016M0360L4393K4653J4010
$$ 1494571 1514733 1540551 1571030 1605923 1644514 1685546 1727562 1767922 1802315 1826968 1840978
59020A840978M523l889j1251j6396j8675j8678j6644j2179o049rN672J2219J9450
$$ 1840978 1845501 1841612 1830361 1813965 1795290 1776612 1759968 1747789 1741740 1741731 1747403 1759622 1779072
59007A779072K5195K8280K9648K9804K7569K2342J5267P411j163r723j6544k1150
$$ 1779072 1804267 1832547 1862195 1891999 1919568 1941910 1957177 1964588 1963425 1953702 1937158 1916008
58995A916008k4736k7640k8590k7166k4752k2206j8829j4485j0445p281m105p75
$$ 1916008 1891272 1863632 1835042 1807876 1783124 1760918 1742089 1727604 1717159 1709878 1705773 1704998
58983A704998J447K326L490N899Q624J1011J3783J7085J9780K1699K4370K8379
$$ 1704998 1706445 1708771 1712261 1718160 1726784 1737795 1751578 1768663 1788443 1810142 1834512 1862891
58971A862891L2290L5202L8167M1967M5647M8375N0607N2322N2367N0640M8763
$$ 1862891 1895181 1930383 1968550 2010517 2056164 2104539 2155146 2207468 2259835 2310475 2359238
58960B359238M7405M5232M1685L8498L7073L6600L6239L7079M0292M5171N0565
$$ 2359238 2406643 2451875 2493560 2532058 2569131 2605731 2641970 2679049 2719341 2764512 2815077
58949B815077N6667O4065P2506Q1704R1889J02671J12979J22836J33535J45384
$$ 2815077 2871744 2935809 3008315 3090019 3181908 3284579 3397558 3520394 3653929 3799313
58939C799313J57325J69353J83093J99219K16556K34638K54879K78166L03619
$$ 3799313 3956638 4125991 4309084 4508303 4724859 4959497 5214376 5492542 5796161
58930E796161L30810L61043L95318M33182M74564N20527N71148O24820O80698
$$ 5796161 6126971 6488014 6883332 7316514 7791078 8311605 8882753 9507573 10188271
58921A0188271P39466Q00659Q61392R18615R70038J011623J036630J038460J012343
$$ 10188271 10927737 11728396 12589788 13508403 14478441 15490064 16526694 17565154 18577497
58912A8577497R53639Q57642P23056N53862L57077J41480q0778k95039m89324
$$ 18577497 19531136 20388778 21111834 21665696 22022773 22164253 22083475 21788436 21299112
58903B1299112o56972p93632q95178r60635r94071j001095r85635r51757r05526
$$ 21299112 20642140 19848508 18953330 17992695 16998624 15997529 15011894 14060137 13154611
58894A3154611q52308p94243p32554o70171o09977n52510m97606m46471m00285
$$ 13154611 12302303 11508060 10775506 10105335 9495358 8942848 8445242 7998771 7598486
58885G598486l58801l22189k92278k69971k53407k40301k30020k21677k12692
$$ 7598486 7239685 6917496 6625218 6355247 6101840 5861539 5631519 5409842 5197150
58876E197150k01433j89195j77559j65755j52602j39005j26488j15154j04853
$$ 5197150 4995717 4806522 4628963 4463208 4310606 4171601 4045113 3929959 3825106
58867C825106r6368q9662q2999p5528o8581o2839n6677m9065m1593l5580k9733
$$ 3825106 3728738 3639076 3556077 3480549 3411968 3349129 3292452 3243387 3201794 3166214 3136481
58856C136481k2719j5573r371k982M558J1918J7994K4102L1340L8278M3793M9695
$$ 3136481 3113762 3098189 3088818 3085836 3090394 3102312 3120306 3144408 3175748 3214026 3257819 3307514
58844C307514N7859O7070P5411Q3549R2897J02740J11989J21722J33235J45546
$$ 3307514 3365373 3432443 3507854 3591403 3684300 3787040 3899029 4020751 4153986 4299532
58834D299532J57504J70441J86020K03406K21191K40122K61411K84509L09189
$$ 4299532 4457036 4627477 4813497 5016903 5238094 5478216 5739627 6024136 6333325
58825F333325L37570L71243M08585M47816M90489N38888N92099O47858P06123
$$ 6333325 6670895 7042138 7450723 7898539 8389028 8927916 9520015 10167873 10873996
58816A0873996P67321Q28741Q85885R35707R75216R98418R97941R68603R06850
$$ 10873996 11641317 12470058 13355943 14291650 15266866 16265284 17263225 18231828 19138678
58807A9138678Q09008O73796N05549L12273J02223j14762l25196n15572o77698
$$ 19138678 19947686 20621482 21127031 21439304 21541527 21426765 21101569 20585997 19908299
58798A9908299q08055r04082r64799r93624r96644r78659r43624q97289q45700
$$ 19908299 19100244 18196162 17231363 16237739 15241095 14262436 13318812 12421523 11575823
58789A1575823p91869p36795o82584o31478n83165n36283m91522m50266m11685
$$ 11575823 10783954 10047159 9364575 8733097 8149932 7613649 7122127 6671861 6260176
58780F260176l74430l39800l09910k83963k59676k37075k17591k00719j85100
$$ 6260176 5885746 5545946 5236036 4952073 4692397 4455322 4237731 4037012 3851912
58771C851912j71675j61983j54460j46006j36429j27813j20328j12223j03320
$$ 3851912 3680237 3518254 3363794 3217788 3081359 2953546 2833218 2720995 2617675
58762B617675r5001q7292p9170p1113o4230n7707n0238m2976l7876l4101k9416
$$ 2617675 2522674 2435382 2356212 2285099 2220869 2163162 2112924 2069948 2032072 1997971 1968555
58751A968555k4056j9787j6176j1513o443k977o40K614O202P397N512K026k899
$$ 1968555 1944499 1924712 1908536 1897023 1890580 1887603 1886963 1889577 1895779 1903176 1908688 1910714 1907815
58738A907815j0230j8691k5332k9463l2714l5437l6378l5787l5424l5498l4743
$$ 1907815 1897585 1878894 1853562 1824099 1791385 1755948 1719570 1683783 1648359 1612861 1578118
58727A578118l3398l3098l3912l4471l4671l5353l5778l4485l2213l0918l0296
$$ 1578118 1544720 1511622 1477710 1443239 1408568 1373215 1337437 1302952 1270739 1239821 1209525
58716A209525k8373k5088k2239k0308j8341j6524j5838j5651j4513j2777j1640
$$ 1209525 1181152 1156064 1133825 1113517 1095176 1078652 1062814 1047163 1032650 1019873 1008233
58705A008233j0458p952n064l498k490k89K156K472P51j333m094q819j4160j7509
$$ 1008233 997775 989823 984759 981261 978771 978482 980638 983110 983861 982528 978434 969615 955455 937946
58691I37946j9128k1031k2688k1894j9233j7386j6501j4392j0991q384o692m104
$$ 937946 918818 897787 875099 853205 833972 816586 800085 785693 774702 766318 759626 755522
58679G55522q61Q41J048K131M671O956Q533J0403J1774J0590P381M996M415M335
$$ 755522 754661 755502 756550 758681 763352 770308 778841 789244 801018 811608 818989 823985 828400 832735
58665H32735M635O483R089J0149R440Q508P103L680r31m061n124n420m747k033
$$ 832735 837370 843853 852942 863091 872531 881039 888142 891822 890891 886830 881706 876286 871539 869506
58651H69506J412L404M884Q165J2081J3514J3004J4047J7166J9738K1394K4496
$$ 869506 870918 874322 879206 887371 899452 912966 925970 940017 957183 976921 998315 1022811
58639A022811K9180L2996L5685L9424M4184M7811N0944N6678O4998P2730P9538
$$ 1022811 1051991 1084987 1120672 1160096 1204280 1252091 1303035 1359713 1424711 1497441 1576979
58628A576979Q8655J00977J13706J25891J40179J57917J77383J97957K21105K46034
$$ 1576979 1665634 1766611 1880317 2006208 2146387 2304304 2481687 2679644 2900749 3146783
58618C146783K69227K89392L08034L23825L31166L25654L06431K72325K20976
$$ 3146783 3416010 3705402 4013436 4337261 4668427 4994081 5300512 5572837 5793813
58609E793813J53663P6521m425q5118j59738k20665k64277k92515l07456l09096
$$ 5793813 5947476 6023997 6019572 5934454 5774716 5554051 5289774 4997259 4689803 4380707
58599D380707k99591k84307k66462k45314k21398j98667j79397j61535j43326
$$ 4380707 4081116 3796809 3530347 3285033 3063635 2864968 2685571 2524036 2380710
58590B380710j26185j11042r6224q1055o7446n6092m5226l4832k7818k5152k4046
$$ 2380710 2254525 2143483 2047259 1966204 1898758 1842666 1797440 1762608 1734790 1709638 1685592
58579A685592k2700k2498k3874k4447k3154k2003k1761k0109j5841j0723n539
$$ 1685592 1662892 1640394 1616520 1592073 1568919 1546916 1525155 1505046 1489205 1478482 1472943
58568A472943J369R901J6714J9671J9675J6788R095k979j5733k7122l8199m8449
$$ 1472943 1474312 1484213 1500927 1520598 1540273 1557061 1566156 1563177 1547444 1520322 1482123 1433674
58556A433674n4584n5651n4513n2670m8486m2031l6469l2864k8836k4076k1730
$$ 1433674 1379090 1323439 1268926 1216256 1167770 1125739 1089270 1056406 1027570 1003494 981764
58545I81764k2344k2089j9336j7352j7957j8105j5612j2886j1911j0728p976n931
$$ 981764 959420 937331 917995 900643 882686 864581 848969 836083 824172 813444 805468 799537
58533G99537n938n625l699k730m274n979o267p082r261j0230r078q801j0557j0906
$$ 799537 793599 787974 784275 781545 777271 771292 765025 757943 748682 738452 729374 720573 710016 699110
58519F99110p918m821m342m456l076j906k202j681R33L039L094L672O414Q873
$$ 699110 691192 686371 682029 677573 674497 672591 670389 668708 669641 672680 675774 679446 685860 694733
58505F94733R454J0465J3146J4837J4331J4693J7454J9430J8699J8175J9665K0060
$$ 694733 704187 714652 727798 742635 756966 771659 789113 808543 827242 845417 865082 885142
58493H85142J7300J4482J3933J2790Q644M152J675j116n931r665j0187j0971j5131
$$ 885142 902442 916924 930857 943647 952291 956443 958118 957002 951071 941406 931219 920248 905117
58480I05117j9865k1624k1737k2345k1704j8397j5306j4721j4201j1747j0033
$$ 905117 885252 863628 841891 819546 797842 779445 764139 749418 735217 723470 713437
58469G13437j1024j1610r303p057p631q490p169o236p791q524n613k338k320l290
$$ 713437 702413 690803 681500 674443 666812 658322 651153 644917 637126 628602 622989 620651 618331 615041
58455F15041j957K6M30J490N040P822P323P042J0262J3830J4144J4013J7350K2140
$$ 615041 613084 613110 613540 615030 620070 627892 635215 642257 652519 666349 680493 694506 711856 733996
58441G33996K4885K7092L0905L3271L0863K6148K2229J6539O159n389j3318j8869
$$ 733996 758881 785973 816878 850149 881012 907160 929389 945928 952087 946698 933380 914511
58429I14511k4997k9497k9243k6718k5586k4114j9546j4565j2655j1531p785l593
$$ 914511 889514 860017 830774 804056 778470 754356 734810 720245 707590 696059 688274 684681
58417F84681k180j220K563O869Q547J0065J4459J8763J9411J9204K1757K4033
$$ 684681 682501 681281 683844 690713 699260 709325 723784 742547 761958 781162 802919 826952
58405H26952K1783J7375J4642J1073L048o085j1173j3809j7773k0790j9066j5409
$$ 826952 848735 866110 880752 891825 894873 888788 877615 863806 846033 825243 806177 790768
58393G90768j4502j4543j1758q559q850r786o855k694k254l666k515o39j778l038
$$ 790768 776266 761723 749965 741406 732556 722770 715915 713221 710967 707301 704786 704147 702369 699331
58379F99331K06N305P150P584J0876J4451J3525J0610J0846J2237J0113O942P816
$$ 699331 699537 704842 711992 719576 730452 744903 758428 769038 779884 792121 802234 809176 816992
58366H16992J0432R488O874P558R557Q212O179Q781J3529J4699J4219J7391K1863
$$ 816992 827424 836912 843786 851344 860901 869113 875292 884073 897602 912301 926520 943911 965774
58353I65774K1733J8606J7682J6855J0912K587j859m209r961j6480j7211j4022
$$ 965774 987507 1006113 1023795 1040650 1051562 1054149 1052290 1048081 1038120 1021640 1004429 990407
58341I90407j3444j4201j0560m508k328k302J792Q159J0196R052J0640J3495J2023
$$ 990407 976963 962762 952202 947694 945366 943064 944856 953015 963211 972263 982903 996398 1008421
58328A008421Q597R627J2953J1964Q887J0836J5973J7048J5464J8142K3592K4983
$$ 1008421 1017018 1026645 1039598 1051562 1060449 1071285 1087258 1104306 1119770 1137912 1161504 1186487
58316A186487K3921K7016L1738L0041K3210J8827J6057Q587r85m714m276p207
$$ 1186487 1210408 1237424 1269162 1299203 1322413 1341240 1357297 1365884 1364899 1360185 1355909 1348702
58304A348702j1457r265l154j886l609L47P937R759P140R284J4848J4464R503
$$ 1348702 1337245 1327980 1324826 1322940 1319331 1319678 1327615 1337374 1344514 1353798 1368646 1383110 1392613
58291A392613J0050J5750J7118J4482J6968K3834K5672K3295K6467L4688L8293
$$ 1392613 1402663 1418413 1435531 1450013 1466981 1490815 1516487 1539782 1566249 1600937 1639230
58280A639230L7791M2735N2131N5664N3713N6112O1749N9728N0275M3974M0995
$$ 1639230 1677021 1719756 1771887 1827551 1881264 1937376 1999125 2058853 2109128 2153102 2194097
58269B194097L2071J9249J3994J5441J2616P168J0922K1733K5781K3238K7231
$$ 2194097 2226168 2245417 2259411 2274852 2287468 2294636 2305558 2327291 2353072 2376310 2403541
58258B403541L7717M1783L9654M4263N4707N7026N1921N4218O4081O7095O3636
$$ 2403541 2441258 2483041 2522695 2566958 2621665 2678691 2730612 2784830 2848911 2916006 2979642
58247B979642O8753Q1583Q5483Q0359Q3585R6453J02073R9244J05137J21001J29349
$$ 2979642 3048395 3129978 3215461 3295820 3379405 3475858 3577931 3677175 3782312 3903313 4032662
58236D032662J28983J37721J56314J65875J65528J75081J95720K07052K08149
$$ 4032662 4161645 4299366 4455680 4621555 4787083 4962164 5157884 5364936 5573085
58227E573085K20857K46849K63786K70045K88922L22142L45753L59071L88548
$$ 5573085 5793942 6040791 6304577 6574622 6863544 7185686 7531439 7890510 8279058
58218H279058M35629M72605M98423N43546O10440O68154P16099P90473Q95914
$$ 8279058 8714687 9187292 9685715 10229261 10839701 11507855 12223954 13014427 13910341
58209A3910341R98156J097391J236296J421224J615323J827383K121319K517249
$$ 13910341 14908497 16005888 17242184 18663408 20278731 22106114 24227433 26744682
58201B6744682K976052L502441M158518M953614N844632O877589Q194951R878613
$$ 26744682 29720734 33223175 37381693 42335307 48179939 55057528 63252479 73131092
58193G3131092J1961962J4641905J8270976K3092007K9243198L6967301M6026610
$$ 73131092 85093054 99734959 118005935 141097942 170341140 207308441 253335051
58186B53335051N4211556N6920118M9607140L1586625P354868j6153833l3711594
$$ 253335051 307546607 364466725 414073865 445660490 453015358 436861525 403149931
58179D03149931m3703245m7160042m5982463m1988578l6671473l1073749k5762472
$$ 403149931 359446686 312286644 266304181 224315603 187644130 156570381 130807909
58172A30807909k1015356j6992212j3725576j1106985r001550p335936o047168
$$ 130807909 109792553 92800341 79074765 67967780 58966230 51630294 45583126
58165D5583126n030506m192972l502223k941327k464067k030202j641264j305860
$$ 45583126 40552620 36359648 32857425 29916098 27452031 25421829 23780565 22474705
58157B2474705j000673o93808l80344o6511K67259O64697J160269J769753K528431
$$ 22474705 21474032 20780224 20399880 20333369 20600628 21265325 22425594 24195347 26723778
58148B6723778L510145M714211N844971O258657N326992K999730k3936k765642
$$ 26723778 30233923 34948134 40793105 47051762 52378754 55378484 55354548 52588906
58140E2588906m610017n500458n668794n355574m762475m074278l410804k803879
$$ 52588906 47978889 42478431 36809637 31454063 26691588 22617310 19206506 16402627
58132A6402627k263079j818935j481568j216141r92399q15928o88353n82145m79878
$$ 16402627 14139548 12320613 10839045 9622904 8630505 7814577 7126224 6544079 6064201
58123F064201l98039l48127l10830k70497k40057k30078k25525k13634k04374
$$ 6064201 5666162 5318035 5007205 4736708 4496651 4266573 4041048 3827414 3623040
58114C623040k04021j97628j76428j55019j43707j30369j06439q4649p4311o4491
$$ 3623040 3419019 3221391 3044963 2889944 2746237 2615868 2509429 2424780 2350469 2285978
58104B285978m8295l9164m6102n5899n6362n5199o0201o2527n5610m9996n3636
$$ 2285978 2237683 2198519 2152417 2096518 2040156 1984957 1924756 1862229 1806619 1756623 1702987
58093A702987n6909n2044m8217n2730n6015m9933m3056m3458m3769l7323l2100
$$ 1702987 1646078 1594034 1545817 1493087 1437072 1387139 1344083 1300625 1256856 1219533 1187433
58082A187433l4707l6902l1720k7028k9721l2066k7000k1828k3483k4975j9576
$$ 1187433 1152726 1115824 1084104 1057076 1027355 995289 968289 946461 922978 898003 878427
58071H78427j4241j5863j7938j3640q971j0431j2409r007n870q379j0368o230
$$ 878427 864186 848323 830385 816745 807774 797343 784934 775927 770057 761678 751310 745080
58059G45080k282m713q106o922o420j1152j4559j1295q096j1121j4094j0392n595
$$ 745080 742798 738085 729979 723057 716637 705485 690926 679631 671535 660414 646320 635928 630333
58046F30333o383q050m703j328l882p345n261j725k592m058r39K661J780O73L912
$$ 630333 623950 615900 611197 609869 605987 598642 593381 591656 589064 585006 584067 586728 588508 589181 593093
58031E93093O370K737j810r95J199r05l450j058K205P68j590N75L550K010k79
$$ 593093 599463 602200 600390 599395 600594 599689 596239 595181 597386 598154 596564 597139 600689 602699 602420
58016F02420K071N186L247l47L44K618J140j402m7K305Q18j249J356N479N319
$$ 602420 604491 609677 612924 612577 612921 615539 616679 615277 615230 617535 618353 617104 618460 623939 629258
58001F29258K986L413M143J71o044r033r991j2731j4940j2754r366r886j2031
$$ 629258 632244 635657 639800 639971 633927 624894 614903 602172 587232 574478 565112 555226 543195
57988E43195j0849q085q109q998o515k695j794j992N04L330K393J22R90L062K157
$$ 543195 532346 524261 516152 507154 500639 497944 496150 494158 494662 497992 500385 500507 501497 504559 506716
57973E06716K34J310L295K131q1P07K281M78k394j779M62k8j414N85L867L438
$$ 506716 506950 508260 511555 513686 513605 514312 516593 517071 514677 512898 513360 513332 511918 512503 516370 519808
57957E19808M03p53p62l209o644p152n934o611p787n980k916k324k539J5L153
$$ 519808 520211 519458 518696 515487 508843 501691 495757 489146 481359 475379 472463 470139 467600 467615 470768
57942D70768K584J96O64K677J567j950l598l663n346p416o390m064n018q491j0190
$$ 470768 473352 473548 474212 476889 478456 476506 472908 469245 463899 456483 450093 446029 441011 432520 422330
57927D22330j0157j1479j3113j1651q460p594q202o305k606j197j924j201Q16
$$ 422330 412173 400694 387581 375930 367470 359876 351674 345369 342763 341566 339642 338441 339257
57914C39257R32l77K05K340K971K583M200P227Q509Q204Q725R324P776N674O016
$$ 339257 340189 339812 340017 342357 345328 347911 352111 359338 367847 376051 384776 394100 401876 407550 413566
57899D13566P291O121L737L551M382K736k23p46K73r57l805m614l859m932p100
$$ 413566 420857 426978 430715 434266 438648 441384 441161 440415 440688 439731 435926 431312 427453 422521 415421
57884D15421o715m403m081n704n709l950l496m316l651j974k130l307k241L69
$$ 415421 408706 404303 400222 394518 388809 384859 381363 377047 373396 371422 369292 365985 363744 364113
57870C64113J010J13J197M009M970L859L697M570L878K135K227L468K668M72K80
$$ 364113 365123 365236 366433 370442 375412 379271 382968 387538 391416 393551 395778 399246 401914 402386 402666
57855D02666J651J200o35l58J587J410q36j414m6j07j712j471O74J091p01j363
$$ 402666 404317 405517 404882 404524 406111 407521 406685 405271 405225 405118 403406 401935 402609 403700 402999 401636
57839D01636l67p62k753l081j500j440l395l955k413k132m197n702n530o054p910
$$ 401636 401269 400507 397754 394673 393173 391733 388338 384383 381970 379838 375641 369939 364409 358355 350445
57824C50445q714q129q653j0350j0260q109p145q221q429o648n163m759l515j482
$$ 350445 341731 333602 324949 314599 304339 296230 289085 280864 272435 265787 260624 255865 252350 250868
57810B50868j274k962l498k175j569k245j775J68J067O86J618L846M310K819K874
$$ 250868 249594 246632 243134 240959 239390 237145 235370 235538 236605 237291 238909 242755 247065 249884 252758
57795B52758N489P671Q381J0329J4479J7987J9218J9606J9215J5766R653M691
$$ 252758 258247 265918 274299 284628 299107 317094 336312 355918 375133 390899 400552 405243
57783D05243K259l03m013o237n920n650o722p185o505p101r424j0362q522o337
$$ 405243 407502 407199 403186 396949 391029 385379 378657 371472 364967 357866 348442 338080 329558 323221
57769C23221n291l780j409m59j312j234N21J224L1k44J483K406J106P5P93J234
$$ 323221 317930 314150 312741 312282 310970 309736 310257 311481 311512 311268 312751 315157 316263 316338 317131 318365
57753C18365M99J037L852O116N983N324N390M414J868M84J567K693K412K759M715
$$ 318365 318864 319901 323753 329869 335852 341176 346566 350980 352848 353332 354899 357592 360004 362763 367478
57738C67478N836M984M747O466P505O306N622P511R475Q979P698Q019R054R424
$$ 367478 373314 378298 383045 389511 397016 403322 408944 416455 425930 434909 442607 450626 459680 469104
57724D69104J0364J2836J4978J5459J6181J8682K1285K2449K3606K5885K7516
$$ 469104 479468 492304 507282 522741 538922 557604 578889 601338 624944 650829 678345
57713F78345K7349K7540K9816L2450L3732L5221L8703M3156M7583N3521O1934
$$ 678345 705694 733234 763050 795500 829232 864453 903156 946312 993895 1047416 1109350
57702A109350P0787P8614Q7368R9050J12554J26515J42034J59870J78278J96466
$$ 1109350 1180137 1258751 1346119 1445169 1557723 1684238 1826272 1986142 2164420 2360886
57692B360886K16907K41241K66982K90886L12133L29138L36567L28895L04258
$$ 2360886 2577793 2819034 3086016 3376902 3689035 4018173 4354740 4683635 4987893
57683D987893K62387K02593J27384M5007l5282j08097j69771k15306k41456k50062
$$ 4987893 5250280 5452873 5580257 5625264 5589982 5481885 5312114 5096808 4855352 4605290
57673D605290k44753k26822j97202j59284j16429p0676k8340l361q665m4248r6835
$$ 4605290 4360537 4133715 3936513 3777229 3660800 3590124 3561784 3558423 3549758 3505510 3408675
57662C408675j49790j90677k12748k15394k03757j84532j61613j36882j12833
$$ 3408675 3258885 3068208 2855460 2640066 2436309 2251777 2090164 1953282 1840449
57653A840449r1424p2044n3723l7851k6082j7132q493K23Q244J6291K5513L5347
$$ 1840449 1749025 1676981 1623258 1585407 1559325 1542193 1533700 1533923 1542167 1558458 1583971 1619318
57641A619318M4930N5099O6671P8614R0347J03778J20530J39180J57949J77886
$$ 1619318 1664248 1719347 1786018 1864632 1954979 2058757 2179287 2318467 2476416 2654302
57631B654302K00398K23747K45046K63842K80265K91186K91381K77440K48004
$$ 2654302 2854700 3078447 3323493 3587335 3867600 4158786 4450167 4727607 4975611
57622D975611K02068J40380O7692r104q4219j52663k09022k49760k75630k89403
$$ 4975611 5177679 5318059 5385751 5376647 5292428 5139765 4930743 4680983 4405353 4115950
57612D115950k92460k85799k72364k55528k36594k16093j95913j77651j60557
$$ 4115950 3823490 3537691 3265327 3009799 2773205 2557112 2361199 2183548 2022991
57603B022991j43498j27410j13551j01291q9983q0876p4533o8600o0982n3223
$$ 2022991 1879493 1752083 1638532 1537241 1447258 1366382 1291849 1223249 1162267 1109044
57593A109044m7778m4029m0021l6112l3606l1596k8497k5110k3009k1439j8973
$$ 1109044 1061266 1017237 977216 941104 907498 875902 847405 822295 799286 777847 758874
57582G58874j6537j5533j4684j2158r246q348q714p787n532l877k950j471J15
$$ 758874 742337 726804 712120 699962 690716 682368 673654 665867 660335 656458 653508 652037 652152
57569F52152M24K65J564L921N450O385Q425J1242J2825J2905J2988J3541J4076
$$ 652152 652576 652841 654405 658326 663776 670161 678586 689828 702653 715558 728546 742087 756163
57556G56163J5368J8584K2677K5599K7560L0419L4497L8765M3457M9672N6980
$$ 756163 771531 790115 812792 838391 865951 896370 930867 969632 1013089 1062761 1119741
57545A119741O4131P1523Q0375R0311J00405J11671J25678J41602J57425J73173
$$ 1119741 1183872 1255395 1335770 1426081 1526486 1638157 1763835 1905437 2062862 2236035
57535B236035J89964K06820K21241K31937K37784K35082K19359J89555J47695
$$ 2236035 2425999 2632819 2854060 3085997 3323781 3558863 3778222 3967777 4115472
57526D115472R5541L5051k8597q8246j39210j79926k09110k25726k31401k29461
$$ 4115472 4211013 4246064 4217467 4129221 3990011 3810085 3600975 3375249 3143848 2914387
57516B914387k21559k08094j91262j74309j57988j41040j23937j08829r5990q3753
$$ 2914387 2692828 2484734 2293472 2119163 1961175 1820135 1696198 1587369 1491379 1407626
57506A407626p2081o2726n5632m8493m0409l2939k7016k1674j6357j1825q150
$$ 1407626 1335545 1272819 1217187 1168694 1128285 1095346 1068330 1046656 1030299 1018474 1010324
57495A010324m289k0L918P716J2335J7512K2252K7032L3119L9971M5979N1557
$$ 1010324 1006035 1006015 1009933 1017649 1029984 1047496 1069748 1096780 1129899 1169870 1215849 1267406
57483A267406N8773O8152P8524Q9747J02771J17170J31607J46583J63781J82572
$$ 1267406 1326179 1394331 1472855 1562602 1665373 1782543 1914150 2060733 2224514 2407086
57473B407086K00035K14321K24875K29382K23637K05032J73557J29546P3760J0224
$$ 2407086 2607121 2821442 3046317 3275699 3499336 3704368 3877925 4007471 4081231 4091455
57463D091455n4057j13083j63504k02734k28689k41961k45405k41060k29822k13960
$$ 4091455 4037398 3924315 3760811 3558077 3329388 3087427 2842022 2600962 2371140 2157180
57453B157180j96817j79707j62010j44504j29438j16969j04895r2520q1655p3088
$$ 2157180 1960363 1780656 1618646 1474142 1344704 1227735 1122840 1030320 948665 875577
57443H75577o5269n7472n1093m6674m2545l7662l3193l0051k7365k4517k2320
$$ 875577 810308 752836 701743 655069 612524 574862 541669 511618 484253 459736 437416
57432D37416k1122j9931j8371j7270j6611j5141j2793j1158j0780j0341r148q141
$$ 437416 416294 396363 377992 360722 344111 328970 316177 305019 294239 283898 274750 266609
57420B66609p745p120o177n949o333n917m663m176m744m756l749l293l963m216
$$ 266609 258864 251744 245567 239618 233285 227368 222705 218529 213785 209029 205280 201987 198024 193808
57406A93808l263k356k215j793p52m02j089j214k01K92n77j165k53Q33O17k19
$$ 193808 190545 188189 185974 184181 183429 183027 181938 180724 180523 180815 180238 179073 178820 179653 180270 180051
57390A80051n49p33j271j504j105j068j863k352j772r99q24p77o56j211k280k350
$$ 180051 179502 178769 177498 175994 174889 173821 171958 169606 167834 166835 166011 165234 164578 163367 161087 158737
57374A58737j008J45M2m67o82j257k264k397j386r15j793k456j713p27p79j148
$$ 158737 157729 157874 157916 157449 156767 155510 153246 150849 149463 148548 146755 144299 142586 141859 141080 139932
57358A39932q36m77q17j094n20K15K89Q4J0l03o74m7J465K240J837J808K754L018
$$ 139932 139096 138619 137802 136708 136188 136403 136692 136776 136786 136483 135809 135762 137227 139467 141304 143112 145866 148884
57340A48884J653K78L04P14L43J50J092J983J540P18Q20J035J47r05m56J102K106
$$ 148884 150537 150815 151119 151833 152176 152326 153418 155401 156941 157659 158479 159514 159661 158756 158300 159402 161508
57323A61508K239K380K779L050L230L463L463L425M265N949P012O799O617P399
$$ 161508 163747 166127 168906 171956 175186 178649 182112 185537 189802 195751 202763 209562 216179 223578
57309B23578Q036P502O828P282Q219Q616R201J1083J3481J4739J4739J4624J5036
$$ 223578 231614 239116 245944 253226 261445 270061 279262 290345 303826 318565 333304 347928 362964
57296C62964J6039J7834K0175K1948K2651K3274K4710K6428K7717K8861L0071
$$ 362964 379003 396837 417012 438960 461611 484885 509595 536023 563740 592601 622672
57285F22672L0683L0524L0526L0776K9631K6005K0933J5569R382J823o060j3280
$$ 622672 653355 683879 714405 745181 774812 800817 821750 837319 846701 848524 842464 829184
57273H29184k0454k7974l4304l7893l9288l9642l8724l6283l3679l2042l0217
$$ 829184 808730 780756 746452 708559 669271 629629 590905 554622 520943 488901 458684
57262D58684k6655k2177j8688j6306j3876j1406r812q990q034o823n797m786l511
$$ 458684 432029 409852 391164 374858 360982 349576 339764 330774 322740 315917 310120 305334 301823
57249C01823k511k211j951j135l12O1O20J634K005J181N25J113J778J215M14R65
$$ 301823 299312 297101 295150 294015 293703 293764 294384 296018 298023 299204 299729 300842 302620 303835 304249 305214
57233C05214K237K560K072K217L222M218N121O445P892Q919R987J1629J3106J3590
$$ 305214 307451 310011 312083 314300 317522 321740 326861 333306 341198 350117 360104 371733 384839 398429
57219C98429J3776J4622J5549J5650J5668J6858J8793K0171K0982K1987K2922
$$ 398429 412205 426827 442376 458026 473694 490552 509345 529516 550498 572485 595407
57208E95407K3094K3024K3599K4371K4446K4324K4963K5854K5900K5470K5691
$$ 595407 618501 641525 665124 689495 713941 738265 763228 789082 814982 840452 866143
57197H66143K6424K6767K6903K7538K8171K7874K7170K7246K7808K7640K6811
$$ 866143 892567 919334 946237 973775 1001946 1029820 1056990 1084236 1112044 1139684 1166495
57186A166495K6507K6983K7462K7727K8214K8819K9199K9848L1433L3523L5294
$$ 1166495 1193002 1219985 1247447 1275174 1303388 1332207 1361406 1391254 1422687 1456210 1491504
57175A491504L6899L8738M0092M0069L9246L8812L8709L8150L7422L7600L8848
$$ 1491504 1528403 1567141 1607233 1647302 1686548 1725360 1764069 1802219 1839641 1877241 1916089
57164A916089M0438M1925M3129M3581M3281M3277M4225M5256M5454M5480M6310
$$ 1916089 1956527 1998452 2041581 2085162 2128443 2171720 2215945 2261201 2306655 2352135 2398445
57153B398445M7400M7646M7321M7411M7873M8038M7969M8050M7961M7427M7045
$$ 2398445 2445845 2493491 2540812 2588223 2636096 2684134 2732103 2780153 2828114 2875541 2922586
57142B922586M7118M6754M5370M3984M3610M3574M2897M2048M1789M1549M0602
$$ 2922586 2969704 3016458 3061828 3105812 3149422 3192996 3235893 3277941 3319730 3361279 3401881
57131C401881L9590L9231L8756L7313L5741L5228L5268L4625L3180L1382K9090
$$ 3401881 3441471 3480702 3519458 3556771 3592512 3627740 3663008 3697633 3730813 3762195 3791285
57120C791285K6454K4639K4192K4186K4223K5649K9201L3295L6306L8776M1686
$$ 3791285 3817739 3842378 3866570 3890756 3914979 3940628 3969829 4003124 4039430 4078206 4119892
57109D119892M4539M7072N1183N9236P2020Q9753J13212J42700J78385K23125
$$ 4119892 4164431 4211503 4262686 4321922 4393942 4483695 4596907 4739607 4917992 5141117
57099E141117K82331L59351M53629N64670O94703Q46195J020545J220535J449297
$$ 5141117 5423448 5782799 6236428 6801098 7495801 8341996 9362541 10583076 12032373
57090A2032373J704159J974817K248329K510831K744126K927781L044920L077798
$$ 12032373 13736532 15711349 17959678 20470509 23214635 26142416 29187336 32265134
57082C2265134L003178K817485K577352K385373K295842K231318K019452J526984
$$ 32265134 35268312 38085797 40663149 43048522 45344364 47575682 49595134 51122118
57074E1122118P54813j85135j153721k038001k760363l279670l593460l725585
$$ 51122118 51876931 51691796 50538075 48500074 45739711 42460041 38866581 35140996
57066C5140996l705646l561763l325488l030946k707098k375931k056330j763071
$$ 35140996 31435350 27873587 24548099 21517153 18810055 16434124 14377794 12614723
57058A2614723j502533j274727j079306r16048p81480o70071n78325n04193m43799
$$ 12614723 11112190 9837463 8758157 7842109 7060629 6390558 5812233 5308040 4864241
57049D864241l92564l48600l11719k80167k51485k25360k02690j82947j65083
$$ 4864241 4471677 4123077 3811358 3531191 3279706 3054346 2851656 2668709 2503626
57040B503626j49618j37148j26189j15076j04557r6015q8694q1118p3712o7523
$$ 2503626 2354008 2216860 2090671 1975595 1871038 1775023 1686329 1605211 1531499 1463976
57030A463976o1918n6032n0920m7742m5351m2110l8653l6420l4867l2583k9754
$$ 1463976 1402058 1346026 1295106 1247364 1202013 1159903 1121250 1084830 1049963 1017380 987626
57019I87626k7261k4729k1628j8979j7752j6940j5228j3133j1508r643o892m521
$$ 987626 960365 935636 914008 895029 877277 860337 845109 831976 820468 810825 803933 799412
57007G99412l675l068q27K821O724J1105J6609K2696K9098L7499M9821O6202Q6551
$$ 799412 795737 792669 791842 794663 801387 812492 829101 851797 880895 918394 968215 1034417 1120968
56994A120968J12748J47626J92113K42030K83630K92762K46814J44993J5347j02940
$$ 1120968 1233716 1381342 1573455 1815485 2099115 2391877 2638691 2783684 2799031 2696091
56984B696091j84645k26504k37533k28739k10062j88904j68170j47796j28350
$$ 2696091 2511446 2284942 2047409 1818670 1608608 1419704 1251534 1103738 975388
56975I75388j10913r4644p7955o1713m8222l7514k7725j8587j1502o496k165J684
$$ 975388 864475 769831 691876 630163 581941 544427 516702 498115 486613 480117 477952 479636
56963D79636M222O092Q951J2872J6943K1792K8306L4090L4426K7247J4708R9j4067
$$ 479636 483858 489950 498901 511773 528716 550508 578814 612904 647330 674577 689285 689384 675317
56950F75317k5113l0757l1481l0107k8368k5821k2136j8102j4089r682n218j742
$$ 675317 650204 619447 587966 557859 529491 503670 481534 463432 449343 439661 434443 432701
56938D32701P66L483O942J0848J5596K2138L0374L8889M5801M8264M2420K6585
$$ 432701 433467 436950 443892 454740 470336 492474 522848 561737 607538 655802 698222 724807
56926G24807M491j6824l2481m1707m5418m4546m0675l5758l0676k5520k1062j8108
$$ 724807 729298 712474 679993 638286 592868 548322 507647 471889 441213 415693 394631 376523
56914C76523j5857j2873r476p124n904m696l495l212l457k804j266k06J62J080
$$ 376523 360666 347793 338317 331193 325289 320593 317098 313886 310429 307625 306359 306153 306315 307395
56900C07395K865M448N360O255P299P918Q246R042J0176J0970J1861J4008J7451
$$ 307395 310260 314708 320068 326323 333622 341540 349786 358828 369004 379974 391835 405843 423294
56887D23294K1405K5762L0122L1771K7270J6371K382j1241k2665l0414l3163l1495
$$ 423294 444699 470461 500583 532354 559624 575995 578377 567136 544471 514057 480894 449399
56875D49399k7752k3475j8609j3257q252l718J130O393J1370J6212K1999K9064
$$ 449399 421647 398172 379563 366306 358054 354336 355466 361859 373229 389441 411440 440504
56863D40504L6994M6371N8635P3502Q7356R4267Q8276O6479L2322m746l5159n5092
$$ 440504 477498 523869 582504 656006 743362 837629 925905 992384 1024706 1019960 984801 929709
56851I29709o5740o8738o5006n6837m7383l7771k7310j6455o888J373J0128K0076
$$ 929709 863969 795231 730225 673388 626005 588234 560924 544469 537581 538954 549082 569158
56839E69158L0420M1495N5119P2084R1840J14238J37579J53911J50403J18967
$$ 569158 599578 641073 696192 768276 860116 974354 1111933 1265844 1416247 1535214
56829A535214O3994j48n7951r9441j21922j28393j24041j12924r7593q0653o4644
$$ 1535214 1599208 1599060 1541109 1441668 1319746 1191353 1067312 954388 856795 776142 711498
56818G11498n0439l7522k5821j5577n700N535J8082L0624M3531N9068P8022R7451
$$ 711498 661059 623537 597716 582139 576439 581974 600056 630680 674211 733279 811301 908752
56806I08752J11359J12071R2877N3499L575m2577p5768r5155j03169j01489r2530
$$ 908752 1020111 1132182 1225059 1278558 1282133 1239556 1163788 1068633 965464 863975 771445
56795G71445q0397o7964n5462m3146l2634k4426j6818q755j267N185J2069K0230
$$ 771445 691048 623084 567622 524476 491842 467416 450598 441843 440576 445761 457830 478060
56783D78060K8662L7158M7067N7118O1193N3202L3051O343k0132m1173n3865n8383
$$ 478060 506722 543880 590947 648065 709258 762460 795511 801854 781722 740549 686684 628301
56771F28301n7459n3651m7800m0692l4195k9447k5481k1069j6549j2823j0031
$$ 628301 570842 517191 469391 428699 394504 365057 339576 318507 301958 289135 279104
56760B79104q182p516p368o402m727l934m268l921k166q10j238k293k585k682
$$ 279104 270922 263406 256038 249636 244909 240975 236707 232786 230620 229810 228572 226279 223694 221012
56746B21012l331l553k442j138j105j890k257k219k413k737k949l312l605k904
$$ 221012 217681 214128 211686 210548 209443 207553 205296 203077 200664 197927 194978 191666 188061 185157
56732A85157j378o21j173j552q42k29p04j313j088q16j284j670j247q84j231j348
$$ 185157 183779 183158 181985 180433 179591 179362 178658 177345 176257 175441 174157 172487 171240 170356 169125 167777
56716A67777o79n08j686k755k193p91QM39J251J890J693J405J729J849J133O50
$$ 167777 167098 166590 164904 162149 159956 159165 159173 159612 160863 162753 164446 165851 167580 169429 170562 171212
56700A71212J242J790J179L97P22J505J645J660K291K659J926J246J927L063L138
$$ 171212 172454 174244 175423 175820 176542 178047 179692 181352 183643 186302 188228 189474 191401 194464 197602
56685A97602K575K529K593J881J120J358J814J221J94L2K81l36j547k209k444
$$ 197602 200177 202706 205299 207180 208300 209658 211472 212693 212887 212919 213200 212864 211317 209108 206664
56670B06664k970l271k554j556j413j629j155n25q32j604j748j665k289k993k570
$$ 206664 203694 200423 197869 196313 194900 193271 192116 191591 190759 189155 187407 185742 183453 180460 177890
56655A77890j482j073j261j121r15j439k089j686o25k20n42p72r81j648k126j499
$$ 177890 176408 175335 174074 172953 172038 170599 168510 166824 166199 165979 165437 164665 163684 162036 159910 158411
56639A58411l75K4j04K55J037J488J649J711R43r15k228j475J83N28l93p01K29
$$ 158411 158036 158060 157956 158211 159248 160736 162385 164096 165039 164124 161896 160421 160604 161132 160739 160038 160267
56622A60267J248J568J433J048N08L41O93O78j71p70k55M58M08M35J438K300J728
$$ 160267 161515 163083 164516 165564 166072 166413 167106 167784 167613 166843 166588 167046 167454 167889 169327 171627 173355
56605A73355O64O35J075P43M03J436K852K594Q57m56q93j303j400k84J136J059
$$ 173355 174019 174654 175729 176472 176875 178311 181163 183757 184614 184158 183265 181962 180562 180278 181414 182473
56589A82473k28p61j5Q60J463K317K990K495J309P40O70J64l27L12J434J408M10
$$ 182473 182245 181484 181469 182329 183792 186109 189099 191594 192903 193643 194313 194477 194150 194462 195896 197304 197714
56572A97714K1N41J064J668L005M183L659J963J088J484K021K470L524M700M783
$$ 197714 197735 198276 199340 201008 204013 208196 211855 213818 214906 216390 218411 220881 224405 229105 233888
56557B33888M029L669L603K975K302K554K865J861N93J123K792L049J576L56j06
$$ 233888 237917 241586 245189 248164 250466 253020 255885 257746 258339 259462 262254 265303 266879 267235 267129
56542B67129j207k860l133j742p91j346k118k096j900j940j671j223j442j995
$$ 267129 265922 263062 259929 258187 257396 256050 253932 251836 249936 247996 246325 245102 243660 241665
56528B41665j660o28k70o88q61r98k189l842m219l410l119l593l588l164l454
$$ 241665 240005 239377 239107 238419 237558 236560 234371 230529 226310 222900 219781 216188 212600 209436 205982
56513B05982l785k313L58J461L67o33k71J44k85o39n11p10r93L3K013K749J691
$$ 205982 202197 199884 200242 201703 202070 201437 201166 201310 201025 200386 199875 199165 198172 198205 200218 202967 204658
56496B04658P13O90L24r36j669j139m17r9N02J218Q81r6J64J693K360J533J008
$$ 204658 205371 206061 206385 205449 203780 202641 202224 202125 202627 203845 204726 204630 204794 206487 208847 210380 211388
56479B11388J564J717Q77N85J563K414K389K586L265K988J562R65K088L292L388
$$ 211388 212952 214669 215546 216131 217694 220108 222497 225083 228348 231336 232898 233863 235951 239243 242631
56464B42631L294L558L078J562O41J104J620J267Q31O09l59j859k109q58n7l86
$$ 242631 245925 249483 252561 254123 254764 255868 257488 258755 259586 260195 259836 257977 255868 255010 254953 254567
56448B54567j07J443K354J527N96R10J444J236J228K046K554K079J599J442M56
$$ 254567 254460 255903 258257 259784 260380 261290 262734 263970 265198 267244 269798 271877 273476 274918 275374
56433B75374j389k266j645j343k254k904k454k189k681k644j879k171l763m295
$$ 275374 273985 271719 270074 268731 266477 263573 261119 258930 256249 253605 251726 249555 245792 241497
56419B41497k860j787k575l442k801j908j943j733n51l4j015j590n53K40o96j710
$$ 241497 238637 236850 234275 230833 228032 226124 224181 222448 221897 221863 220848 219258 218705 218945 218249 216539
56403B16539j166l50o93r79Q5J205J029P16J378J635K65j130q04K85P05J162K370
$$ 216539 215373 215023 214330 213351 213436 214641 215670 216386 217764 219399 219664 218534 217730 218015 218720 219882 222252
56386B22252K889J734O99J469K783K962K863L754M634M337L889M240M066K386
$$ 222252 225141 226875 227574 229043 231826 234788 237651 241405 246039 250376 254265 258505 262571 264957
56372B64957R85J478K384J751M21o4l47j368j821m50J330J766J596J976J969P46
$$ 264957 265942 267420 269804 271555 271976 271912 271565 270197 268376 267926 269256 271022 272618 274594 276563 277309
56356B77309j41N59J260M53l38N79J714J038l07j49R82J401J514K412L220K848
$$ 277309 277168 277727 278987 279440 279102 279681 281395 282433 282126 281977 282959 284360 285874 288286 291506 294354
56340B94354K522L704N417O345P459R736J1584J1445J0779J1413J2245J1606J0610
$$ 294354 296876 300580 305997 312342 319801 329537 341121 352566 363345 374758 387003 398609 409219
56327D09219J0945J1506J0508Q850Q231P955O710N418N195M642K307l93j717k767
$$ 409219 420164 431670 442178 451028 459259 467214 473924 479342 484537 489179 491486 491093 489376 486609
56313D86609m836o205m993k902k456k847k003o23m86q31q7R24Q75R09K281L434
$$ 486609 481773 475568 470575 467673 465217 462370 460367 459744 459258 458427 458340 459264 460139 461048 463329 466763
56297D66763K908K601M363O120N386M017N094P537Q374Q133R255J1189J1776J1831
$$ 466763 469671 472272 476635 482755 488141 492158 497252 504789 513163 521296 530551 541740 553516 565347
56283E65347J3602J6236J7303J7465J9155K2031K4054K5743K8986L3044L5884
$$ 565347 578949 595185 612488 629953 649108 671139 695193 720936 749922 782966 818850
56272H18850L8211M2143M7318N2195N7599O5024P3220Q0502Q8489R9422J11847
$$ 818850 857061 899204 946522 998717 1056316 1121340 1194560 1275062 1363551 1462973 1574820
56261A574820J23253J34746J48574J63228J75799J86970J98693K09013K14385
$$ 1574820 1698073 1832819 1981393 2144621 2320420 2507390 2706083 2915096 3129481
56252C129481K15148K13422K07553J94128J73737J49291J20564Q6250M9673J6297
$$ 3129481 3344629 3558051 3765604 3959732 4133469 4282760 4403324 4489574 4539247 4555544
56242D555544j3225m1646o8046q8401j02214j12394j19206j20463j17417j14409
$$ 4555544 4542319 4500673 4432627 4344226 4242012 4129618 4010412 3889949 3772532 3658123
56232C658123j12759j10430j07507j06412j07034j07085j07043j09377j13251
$$ 3658123 3545364 3434934 3327427 3221015 3113981 3006896 2899853 2790476 2677225
56223B677225j15343j15522j16339j17518j16410j13331j10908j08681j03967
$$ 2677225 2561882 2446360 2330021 2212503 2096093 1982762 1871854 1763173 1659206
56214A659206r7482r2343q8074q1473p2925o5877o0525n4047m6769m1904l9289
$$ 1659206 1561724 1469381 1381307 1299834 1226909 1161032 1100507 1046460 999691 957787 918498
56203I18498l5560l0505k7159k5644k2953j8948j6465j5476j3189r947q857r501
$$ 918498 882938 852433 825274 799630 776677 757729 741264 725788 712599 702652 693795 684294
56191F84294q271n040l260l341k185N28J946K033L649O497P381O580P508R915
$$ 684294 676023 670983 667723 664382 662197 662725 664671 666704 670353 676850 684231 690811 698319 708234
56177G08234J0127Q108P470Q284O868L146R81P40j294n333p266o280o209q114
$$ 708234 718361 726469 733939 742223 749091 752237 753218 753958 752664 747331 740065 733785 727576 719462
56163G19462q598o643n273n258l957j354m29p61J228N042O344N011N530Q653J0343
$$ 719462 710864 704221 698948 693690 689733 688379 687950 687189 688417 693459 699803 704814 710344 718997 729340
56148G29340R930J1323J5039J7052J6928J9089K4570K9474L3094L9566M9880O0331
$$ 729340 739270 750593 765632 782684 799612 818701 843271 872745 905839 945405 995285 1055616
56136A055616P0324Q3428R9065J11479J18551J23164J24565J17669J03072Q8575
$$ 1055616 1125940 1209368 1308433 1419912 1538463 1661627 1786192 1903861 2006933 2095508
56126B095508P8412O9917O2776O1563O5787O6964N9466M5994K9655R853j0833
$$ 2095508 2173920 2243837 2306613 2368176 2433963 2500927 2560393 2606387 2636042 2645895 2635062
56115B635062k5302l1762l6523m3783n1201n8336o9748q5813r9693j07342j11815
$$ 2635062 2609760 2577998 2541475 2497692 2446491 2388155 2318407 2232594 2132901 2025559 1913744
56104A913744j14397j10993j01153r1090q3765p5054o3484n4027m8488m2019l3145
$$ 1913744 1799347 1688354 1587201 1496111 1412346 1337292 1273808 1219781 1171293 1129274 1096129
56093A096129k7192k5693k2775j6359j2340j3113j2649p934m460n212n007j179
$$ 1096129 1068937 1043244 1020469 1004110 991770 978657 966008 958074 953614 948402 943395 942216
56081I42216J021q39j166K621M787K745K439O582R053P074P052J1802J4164J0374
$$ 942216 943237 942398 941232 943853 948640 951385 953824 960406 969459 976533 983585 995387 1009551 1019925
56067A019925P622J0771J3604J1201R063J1709J3952J1815J0632J3879J5581J2114
$$ 1019925 1027547 1038318 1051922 1063123 1072186 1083895 1097847 1109662 1120294 1134173 1149754 1161868
56055A161868R868J2890J4919J2035J0829J5270J8144J4745J2265J6151K0065
$$ 1161868 1171736 1184626 1199545 1211580 1222409 1237679 1255823 1270568 1282833 1298984 1319049
56044A319049J8917J8776K3885K7256K4414K2938K7860L1469K8435K6735L2192
$$ 1319049 1337966 1356742 1380627 1407883 1432297 1455235 1483095 1514564 1542999 1569734 1601926
56033A601926L6670L3691L1053L5542L9782L7256L5448M0722M5068M1625L8382
$$ 1601926 1638596 1672287 1703340 1738882 1778664 1815920 1851368 1892090 1937158 1978783 2017165
56022B017165M2446M6037M2434M0095M6157N1818M9422M7649N4017N9262N5527
$$ 2017165 2059611 2105648 2148082 2188177 2234334 2286152 2335574 2383223 2437240 2496502 2552029
56011B552029N2796O0032O7601O6224O5339P4105Q2637Q1480Q0925R0904J00948
$$ 2552029 2604825 2664857 2732458 2798682 2864021 2938126 3020763 3102243 3183168 3274072 3375020
56000C375020J01000J02259J15533J29204J31476J33593J47341J60995J62447
$$ 3375020 3476020 3578279 3693812 3823016 3954492 4088085 4235426 4396421 4558868
55991D558868J63881J77629J90688J90423J91536K08867K28407K35382K44932
$$ 4558868 4722749 4900378 5091066 5281489 5473025 5681892 5910299 6145681 6390613
55982F390613K72971L03931L21321L41733L82542M25997M53880M86133N43889
$$ 6390613 6663584 6967515 7288836 7630569 8013111 8439108 8892988 9379121 9923010
55973I923010O07733O57012P14986Q06976R11551J005383J116312J275437J460593
$$ 9923010 10530743 11187755 11902741 12709717 13621268 14626651 15742963 17018400 18478993
55964A8478993J650418J888121K222551K635832L103794L670362M378422N195763
$$ 18478993 20129411 22017532 24240083 26875915 29979709 33650071 38028493 43224256
55956D3224256O111394P232844Q679520J0481033J2728891J5716175J9750694
$$ 43224256 49335650 56568494 65248014 75729047 88457938 104174113 123924807
55949A23924807K4984199L1620063L9833058M8592720N4421953N2404778L9696857
$$ 123924807 148909006 180529069 220362127 268954847 323376800 375781578 415478435
55942D15478435J8392129n389150k5400917l8434402m4509002m5230198m2443052
$$ 415478435 433870564 428481414 403080497 364646095 320137093 274906895 232463843
55935B32463843l7767288l2434235k7177310k2349438j8153758j4696090j1923057
$$ 232463843 194696555 162262320 135085010 112735572 94581814 79885724 67962667
55928F7962667r690161p901063o506651n419421m533452l805392l233571k781313
$$ 67962667 58272506 50371443 43864792 38445371 33911919 30106527 26872956 24091643
55920B4091643k393007k059832j799732j593344j401627j225747j090391r86052
$$ 24091643 21698636 19638804 17839072 16245728 14844101 13618354 12527963 11541911
55912A1541911q82232p80441p02586o42364n76499n09769m63383m31663l92890
$$ 11541911 10659679 9879238 9176652 8534288 7957789 7448020 6984637 6552974 6160084
55903F160084l50620l23718l07279k82104k51979k34552k25622k07722j84350
$$ 6160084 5809464 5485746 5178467 4896363 4644384 4409832 4184210 3976488 3792138
55894C792138j71831j66531j52684j33927j25687j24663j16111j03320j00386
$$ 3792138 3620307 3453776 3301092 3167165 3041478 2916815 2800704 2697384 2596998
55885B596998j03467r7836q6306q2847q4867p9042o8249o6021o9950o6476n6982
$$ 2596998 2493531 2395695 2309389 2226542 2141675 2062633 1994384 1928363 1858413 1791937 1734955
55874A734955n4060n6615n2963m4341m1736m3465l8720k9662k7752l1678l0451
$$ 1734955 1680895 1624280 1571317 1526976 1485240 1441775 1403055 1373393 1345641 1313963 1283512
55863A283512k4946k5177k9466k7245j9713j7451k0018j7570j0352p263p408j873
$$ 1283512 1258566 1233389 1203923 1176678 1156965 1139514 1119496 1101926 1091574 1084311 1076903 1075030
55851A075030Q159J3421J4549J9916K7407K6128J4992K721q792k4306m0278m7298
$$ 1075030 1083189 1096610 1111159 1131075 1158482 1184610 1199602 1202323 1193531 1169225 1128947 1081649
55839A081649m6467m7337n0647m8872m2333l8840l8409l4036k6638k3837k4816
$$ 1081649 1035182 987845 937198 888326 845993 807153 768744 734708 708070 684233 659417
55828F59417k1598j4604j1846j3425j1804o972o400j0094j0397o717o124r049
$$ 659417 637819 623215 611369 597944 586140 579168 572768 562674 552277 545560 539436 530387
55816E30387q501l922k029l432j860K733L604L68k95K344K021j888l399k023l441
$$ 530387 521886 517964 515935 512503 510643 513376 516980 517348 517053 519397 521418 519530 516131 514108 510667
55801E10667p400p506l779l136o552p933o563q281j3186j4513j1236r821j1868
$$ 510667 503267 495761 491982 488846 482294 474361 467798 459517 446331 431818 420582 410761 398893
55788C98893j1805q503p544r937j0044o779n737q071q147m399j859j894n8L710
$$ 398893 387088 378585 371041 361104 351060 344281 338544 330473 322326 317927 316068 314174 314116 317826
55774C17826L369k217o803p622q801j1720j2071r036p560q808p783l008O22J011
$$ 317826 321195 318978 312175 304553 295752 284032 271961 262925 255365 246557 238774 235766 236388 237399
55760B37399J711L417K002k626m867l170k405m207m135r65K96k308m276l307k936
$$ 237399 239110 242527 244529 241903 237036 233866 231461 227254 223119 222154 222450 220142 215866 212559 209623
55745B09623m648m881k710k270m669n611l734l161n117n267k229m79j831k070
$$ 209623 204975 200094 197384 195114 190445 184834 181100 177939 172822 167555 165326 164847 163016 160946
55731A60946Q57L163K719K430L190J404l357o000m468l160m634n459l598k379
$$ 160946 161803 164966 167685 170115 173305 174709 171352 165352 160884 157724 153090 147631 144033 141654
55717A41654l653m168k289j190k043j142K778N378M339L292M798O261O203P637
$$ 141654 138001 133833 131544 130354 128311 127169 129947 135325 139664 142956 147754 154015 160218 167855
55703A67855J1501J3504J1366Q691Q058O703K818m01q86j652m750p201o844o382
$$ 167855 179356 192860 204226 212917 220975 227678 230496 230095 229209 227557 222807 215606 208762 202380
55689B02380p810q581o947n552o081n858l275j070q63N2L154N512N389N380O728
$$ 202380 194570 185989 179042 173490 167409 161551 158276 157206 156343 156395 159549 165061 170450 175830 182558
55674A82558O319K712n76j201j659l488l778j140P36n27j765l59J072J32p29O95
$$ 182558 188877 191589 191013 189812 188153 184665 180887 179747 180483 179956 178191 177832 178904 179036 178307 179002
55658A79002J922O94o93r6L26j252k450j525j131l240n079m327l533n202p130
$$ 179002 180924 181618 180925 180829 181155 179903 177453 175928 174797 171557 166478 162151 158618 153416 146286
55643A46286o876o327p516q257o303l717l021k998k158k146l907m741l100j911
$$ 146286 139410 133083 125567 117310 111007 107290 104269 101271 99113 96967 93060 88319 85219 83308
55629H3308l285m357k479j21k63j236n48K59q32j908p77O03j66j422q48N9p72
$$ 83308 80023 75666 73187 73066 72803 71567 71019 71278 70446 68538 67761 68364 68198 66776 65928 65987 65215
55612F5215j754r05J13o78j579o61J82j178k782k039l70k77q76l88O0q87j472
$$ 65215 63461 62556 62669 61991 60412 59751 59933 58755 55973 53934 53564 53287 52411 52023 52083 51196 49724
55595D9724q0J235L92p07K39J564Q70m21j1R14K91o55M1J082M88n02J1Q07J48
$$ 49724 49644 50879 51271 50564 50803 52367 53237 52816 52805 53719 54010 53355 53396 54478 54966 54464 54475 55282 55430
55576E5430o05L11J441R81M61J836L680M035M139N658P083O743O431Q061R627
$$ 55430 54825 55136 56577 57558 58019 59855 63535 67570 71709 77367 84450 91193 97624 105685 115312
55561A15312Q494N896M150K297j319m902n928n452n667n793m434l200l781m117
$$ 115312 123806 129702 133852 136149 134830 129928 124000 118548 112881 107088 102654 99454 95673 91556
55547I1556j958M76m8k130k274q16n18j213o99O20N48o30q27M0N76Q97J645J694
$$ 91556 89598 90074 90026 87896 85622 84806 84288 83075 82376 82996 83544 82914 82087 82127 82703 83600 85245 86939
55529H6939J47j229q43l57j665l157k643j458j900l032k934k653l799m697l271
$$ 86939 87086 85857 85014 84657 82992 79835 77192 75734 73834 70802 67868 65215 61416 56719 53448
55514E3448j358j786l286k858j137p83j466r92J89J40m81J38J036K19j298j342
$$ 53448 52090 50304 47018 44160 43023 42240 40774 39782 39971 40111 39630 39768 40804 41023 39725 38383
55498C8383p56j542k663k051r16j522k524j239J138J400n6l51M41l4j470j489
$$ 38383 37627 36085 33422 31371 30455 28933 26409 25170 26308 27708 27652 27301 27742 27708 26238 24749
55482B4749l22j73p55q0J200Q03o21n62N56K12j311j500m83n97j697j488j99l00
$$ 24749 24427 24254 23499 23419 24619 25422 24801 24239 24795 25007 23696 22196 21713 21116 19419 17931 17732 17432
55464A7432j701j816k31Q13O52P64J247P59k22M8J031P36m05l41M81l2j345j098
$$ 17432 15731 13915 13684 14497 15149 15913 17160 17919 17697 17745 18776 19512 19107 18766 19247 19215 17870 16772
55446A6772L19L74p50m44J332J898P45K27J051J333M63l9P9n12j433q10J030J764
$$ 16772 17091 17465 16715 16271 17603 19501 20246 20473 21524 22857 23320 23281 23360 22848 21415 20605 21635 23399
55428B3399J129J054J734J427K01kQ52Q66NM7P32J9j735j932l51M91j10j82P61
$$ 23399 24528 25582 27316 28743 28944 28942 29794 30660 30665 30712 31444 31463 29728 27796 27445 27936 27826 27644 28405
55409B8405Q04m61j009j06O85P84J283J931J108o99j078J96Q40K07L2O35K98j050
$$ 28405 29209 28748 27739 27633 28318 29102 30385 32316 33424 32725 31647 31843 32683 32890 32922 33557 33855 32805
55391C2805j381m25j39q05m97Q85J088k40p37L36Q85J25m5J031J348J27o04K83
$$ 32805 31424 30999 30860 30055 29558 30443 31531 31291 30554 30890 31775 31900 31855 32886 34234 34361 33757 34040
55373C4040J100N91j76m58j143k237k205r53l73r02p51M89Q83k36r71l95kn69
$$ 34040 35140 35731 35555 35097 33954 31717 29512 28559 28186 27284 26533 27022 27905 27669 26698 26303 26301 25732
55355B5732q31l95n99j388p80J296K149P63m39J69Q36j00j357j355p62n75k27
$$ 25732 24901 24506 23907 22519 21739 23035 25184 25947 25508 25677 26513 26413 25056 23701 22939 22364 22137
55338B2137N85P26r5l51O21J259L98r90j853k365k437j417o5r6j080p53R85J627
$$ 22137 22722 23448 23353 23002 23623 24882 25280 24290 22437 20072 17635 16218 16153 16057 14977 14224 15209 16836
55320A6836M54j81Q98J695Q38q8K76P28K09k22J43R3q64j135m4P09J60j64O45
$$ 16836 17290 17109 18007 19702 20540 20452 20728 21456 21665 21443 21586 21679 20815 19680 19636 20345 20505 20341 20986
55301B0986R91j06q95P1J422J517J014R22N79m90j002j68P08N29J62L55K07p26
$$ 20986 21977 21871 20976 21047 22469 23986 25000 25922 26501 26011 25009 24841 25549 26078 26240 26595 26802 26076
55283B6076j221p49o37j447j709p48n3l30J1J654K541J192p10j187q67r97j040
$$ 26076 24855 24106 23469 22022 20313 19565 19512 19182 19193 20847 23388 24580 23870 22683 21816 20819 19779
55266A9779l29J11m55q61k38K84j41l85L18O75j72q28j59P31Q12R73J682J446
$$ 19779 19450 19561 19106 18245 18007 18291 18150 17765 18083 18758 18586 17758 17599 18330 19142 20115 21797 23243
55248B3243l82j732j002L68O74P20J518J769L26j101n20J023J405Q42P68R09J88
$$ 23243 22861 21129 20127 20495 21169 21889 23407 25176 25502 24401 23881 24904 26309 27151 27919 28828 29016
55231B9016q89j153q58o93k01R10J436O46kQ32J952J585K16n81o31n65j97N83
$$ 29016 28127 26974 26116 25423 25222 26132 27568 28214 28212 29044 30996 32581 32797 32216 31585 31020 30823 31406
55213C1406Q38J79j41N98J115M74p6N67J172M11p01o78j31k94p10m90k28o60j017
$$ 31406 32244 32423 32282 32880 33995 34469 34393 34960 36132 36543 35842 35164 35033 34739 34029 33539 33311 32651 31634
55194C1634n97l13q00q85K18J051L32p95q98o46r63q70M99J753J483P08P29O67
$$ 31634 31037 30724 29924 29039 29257 30308 30640 29845 28947 28301 27338 26468 26967 28720 30203 30911 31640 32307
55176C2307m68j306m52O66J02j197j215l52j68k52O34J606R73o69j442j314j493
$$ 32307 31839 30533 30081 30747 30849 29652 28437 28085 27917 27665 28299 29905 30878 30209 28767 27453 25960
55159B5960j762j077J12O70Q86J413J348j29j482q96O58J034L96L32P01K96l91
$$ 25960 24198 23121 23233 23903 24789 26202 27550 27421 25939 25043 25701 26735 27131 27463 28164 28460 28069
55142B8069MR02P04k26k88L06N3q60q42K17R58J113J556K192K097J511J436J676
$$ 28069 28073 28975 29679 29453 29165 29471 29524 28664 27822 28039 28997 30110 31666 33858 35955 37466 38902 40578
55124D0578J316O30N49P53K93n44r24j138j790k209j651r73j117j147O7J540J833
$$ 40578 41894 42524 43073 43826 44119 43575 42651 41513 39723 37514 35863 34890 33773 32626 32693 34233 36066
55107C6066J600K050K296J065l87r9J056Q37m08n33M73P68L55J025K756L496K657
$$ 36066 37666 39716 42012 43077 42690 42591 43647 44484 44076 43543 44016 44784 45139 46164 48920 52416 55073
55090E5073J825J706J267J97l95j36N1j54j65j3k00k13P11J733J474M38R2Q6r84
$$ 55073 56898 58604 59871 60068 59673 59537 59588 59434 59269 59256 59056 58843 59554 61287 62761 63199 63291 63377 62393
55071F2393k613k948k017j612k018j679k23Q82R78J016J406J426R58P10N20l72
$$ 62393 59780 56832 54815 53203 51185 49506 49283 50165 51143 52159 53565 54991 55949 56659 57179 56807
55055E6807j428j340l82n1m66m08K40L95J07M76J289J115j13r27q07n92m71J34
$$ 56807 55379 54039 53657 53606 53140 52732 52972 53367 53474 53950 55239 56354 56241 55314 54507 53915 53444 53578
55037E3578P29J99r13r57qK60m41o89j33jn62n30N06J418J645J790J837J001l21
$$ 53578 54307 54506 53593 52636 52628 52888 52447 51758 51625 51624 51062 50532 51038 52456 54101 55891 57728 58729 58408
55018E8408o61J31O37K64k46o52j448k120j519q4N30O4l37n46j338j995q76J402
$$ 58408 57747 57878 58515 58779 58533 57881 56433 54313 52794 52710 53240 53304 52967 52421 51083 49088 48212 49614
55000D9614K265J082l6J17K46o12j397j200o72k74O23J983K541J913J298J344
$$ 49614 51879 52961 52925 53042 53288 52676 51279 50079 49407 49133 49756 51739 54280 56193 57491 58835
54984E8835J280P51M57M70K5n86j96Q43Q47j31p0J495K392J289l33p48k24M32
$$ 58835 60115 60866 61323 61793 61818 61232 61036 61879 62726 62595 62525 64020 66412 67701 67368 66620 66396 66828
54966F6828J335K408K846K735L228M343M701M239M698O596Q167Q437Q848J0477
$$ 66828 68163 70571 73417 76152 79380 83723 88424 92663 97361 103957 112124 120561 129409 139886
54952A39886J2130J2622J2597J2467J0887P064K573r68m114p709j0717j1874j1940
$$ 139886 152016 164638 177235 189702 200589 207653 210226 209258 205144 197435 186718 174844 162904
54939A62904j2275j2528j1645r966q545p324n707m074l225k989k699k384k416
$$ 162904 150629 138101 126456 116490 107945 100621 94914 90840 87615 84626 81927 79543 77127
54926G7127k578k412j823q03O29J801J850J210J318K465L427L729M484O327Q309
$$ 77127 74549 72137 70314 69511 70140 71941 73791 75001 76319 78784 82211 85940 90424 96751 105060
54911A05060R681J1060J2723J3535J2776J1462J0520R043N735R63l845p815j0601
$$ 105060 114741 125801 138524 152059 164835 176297 186817 195860 201595 202558 198713 190898 180297
54898A80297j1892j1954j1755j1615j0819r184p796p374p159o242m867l636k611
$$ 180297 168405 156451 144696 133081 122262 113078 105282 97908 90749 84507 79640 76004 73393
54885G3393j859j755k086k025j513j295j332p60K09K21p83j126k14L29n46j440
$$ 73393 71534 69779 67693 65668 64155 62860 61528 60768 60977 61198 60415 59289 59075 59404 58858 57418
54869E7418r05J12n8j215k004k040j760j196l12K79J81J1L57Q58J059J208J388
$$ 57418 56513 56625 56567 55352 53348 51308 49548 48352 48040 48319 48500 48511 48868 49726 50785 51993 53381
54852E3381J095M01L18J117J579P85n02j207j378j389j021k84M5l38o18k56J66
$$ 53381 54476 54877 55195 56312 57891 58676 58174 56967 55589 54200 53179 52895 52940 52602 51984 51728 51894
54835E1894J80K50N93N76ql88k29j91m20r0Q93J404J046Q39J162R27k00p63R7
$$ 51894 52074 52324 52917 53493 53485 53097 52868 52677 52257 52167 53060 54464 55510 56349 57511 58438 58238 57475 57572
54816E7572J054P63o6j26N53J458K754M271M913M404M101M833N577N564N868P414
$$ 57572 58626 59389 59323 59197 59750 61208 63962 68233 73146 77550 81651 86484 92061 97625 103493 110907
54800A10907R171J0082J0979J2811J4493J4440J2906J0971Q516N010J175k016
$$ 110907 120078 130160 141139 153950 168443 182883 195789 206760 215276 220286 221461 219445
54788B19445m857p799r947j0380r866r594r282q156o696n737m886l487k138j627
$$ 219445 214588 206789 196842 186462 176596 167002 157720 149564 142868 137131 132245 128758 126620 124993
54774A24993j426q65n73j066j178K21K007K375J679J747L050M500N596O866Q556
$$ 124993 123567 122702 122129 121063 119885 120106 122113 124488 126167 127914 130964 135464 141060 147926 156482
54759A56482J0448J2621J5083J7071J8032J8603J9462J9895J8739J5939J1988
$$ 156482 166930 179551 194634 211705 229737 248340 267802 287697 306436 322375 334363
54748C34363O799M36n975j1321j5671j9169k0998k0717j9429j8233j6729j4484
$$ 334363 341162 341598 335623 324302 308631 289462 268464 247747 228318 210085 193356 178872
54736A78872j2519j1700j0954r005o649n364m822l813k645k436k870k742k091
$$ 178872 166353 154653 143699 134694 128045 122681 117859 114046 111401 108965 106095 103353 101262
54723A01262j815j767j156k63O0M6M21P63K20p71j156j034j069r77k79K52k28
$$ 101262 99447 97680 96524 96261 96321 96367 96788 97551 97771 97000 95844 94810 93741 92764 92485 92737 92509
54706I2509q73m46M28K92n80p82k42J4K4N80J230P83m25q62k06M80P19Q75P41
$$ 92509 91636 91190 91618 91910 91330 90548 90306 90320 90344 90924 92154 92937 92512 91650 91444 91924 92643 93518 94259
54687I4259j52j031o44O14J211R50J016J723K136J950J893K178K249K127K443
$$ 94259 94107 93076 92432 93046 94257 95207 96223 97946 100082 102032 103925 106103 108352 110479 112922
54672A12922L093L358L292L559M092M341M558N364O330O497N998N625N282M437
$$ 112922 116015 119373 122665 126224 130316 134657 139215 144579 150909 157406 163404 169029 174311 178748
54658A78748L608L638L973L494K641K854M240N700O967Q624J0386J1390J1988
$$ 178748 182356 185994 189967 193461 196102 198956 203196 208896 215863 224487 234873 246263 258251
54645B58251J3269J5034J6098J6289J6116J4808J1023N345j91n019j0187j5611
$$ 258251 271520 286554 302652 318941 335057 349865 360888 366233 366042 361023 350836 335225
54633C35225j9566k1229k1491k0900j9105j6633j4948j4132j2677j0148q016p092
$$ 335225 315659 294430 272939 252039 232934 216301 201353 187221 174544 164396 156380 149288
54621A49288o342m958l665k967k043m50Q01R79R19J524K332K580K487K508K421
$$ 149288 142946 137988 134323 131356 129313 128863 129664 130643 131562 133086 135418 137998 140485 142993 145414
54606A45414J963J387Q17j12j314k029j994j896k248k743l101l484l844l820l603
$$ 145414 147377 148764 149581 149469 148155 146126 144132 142236 139988 137245 134144 130660 126816 122996 119393
54591A19393l805m295m222l469k922l041l264l064k578k008j415j232j841k637
$$ 119393 115588 111293 107071 103602 100680 97639 94375 91311 88733 86725 85310 84078 82237 79600
54577G9600k628j926j522j641j619j254j009p84n3Q53J000M76K72N04L64j38l7
$$ 79600 76972 75046 73524 71883 70264 69010 68001 67217 67164 68017 69017 69493 69765 70269 70633 70495 70458
54560G0458P51J108O46L10O63J065J030J013J318J528J496J628J912J841J552
$$ 70458 71209 72317 72963 73273 73936 75001 76031 77044 78362 79890 81386 83014 84926 86767 88319
54545H8319J767K421K729K756L428M780N766O041O442P350Q174Q687R317R693
$$ 88319 90086 92507 95236 97992 101420 106200 111966 118007 124449 131799 139973 148660 157977 167670
54531A67670Q628O091L535J737j19k592m872o311p468q794r608r324q526p895
$$ 167670 176298 182389 185924 187661 187542 184950 180078 173767 166299 157505 147897 138573 130047 122152
54517A22152p155n923m609l766l314k965k688k400j988j754j946j980j139K1L18
$$ 122152 114997 109074 104465 100699 97385 94420 91732 89332 87344 85590 83644 81664 80525 80546 80864
54502H0864j71l22J0j31q23r94m18j44n20n70R4N71M24M37Q49N97p25j777j305
$$ 80864 80693 80371 80381 80250 79427 78433 78015 77871 77351 76781 76875 77446 77870 78307 79156 79753 79028 77251 75946
54483G5946J93J544K363K694K360J516Q27N03J86L2O51J663J800Q69R3O9k3o42
$$ 75946 76139 77683 80046 82740 85100 86616 87443 87946 88132 88164 88815 90478 92278 93147 93240 93309 93286 92644
54465I2644j069r75j168j970k428j924j104n31J01P24N10n00j021n81k80p35r59
$$ 92644 91575 90600 89432 87462 85034 83110 82006 81475 81576 82300 82810 82310 81289 80708 80428 79693 78734
54448G8734k56M33J78m70o88o38n43j4P53O53m79j258r09m00m61l07N66J130O32
$$ 78734 78478 78911 79089 78619 77931 77293 76750 76736 77489 78142 77663 76405 75496 75096 74635 74328 74894 76024 76656
54429G6656o1k50o84j644j640J58K012K009R36P16J326J400P84L49J48k50l18
$$ 76656 76595 76345 75661 74017 72377 72535 74547 76556 77492 78208 79534 80934 81718 82067 82215 81965 81647
54412H1647O18J776J994J711K119K941K885J957J434J792K336K710L269L956M298
$$ 81647 82265 84041 86035 87746 89865 92806 95691 97648 99082 100874 103210 105920 109189 113145 117443
54397A17443M456N072N996O342N812M945M101L071J717K92q63j487j545j526k117
$$ 117443 121899 126971 132967 139309 145121 150066 154167 157238 158955 159247 158384 156897 155352 153826 151709
54382A51709l215l917l862l731l946l907l226k615k710k986k713k122j715j347
$$ 151709 148494 144577 140715 136984 133038 129131 125905 123290 120580 117594 114881 112759 111044 109697
54368A09697r28r92j724k317k217j974j917j205O21K326K603J982J706J695J186
$$ 109697 108769 107777 106053 103736 101519 99545 97628 96423 97044 99370 101973 103955 105661 107356 108542
54353A08542N84Q78J748J917J229Q60J501K631L531M033M249M409M918N844O582
$$ 108542 109126 110004 111752 113669 114898 115758 117259 119890 123421 127454 131703 136112 141030 146874 153456
54338A53456O494N629M363K931J647Q89L28r47k958m483m754m563m900n582o018
$$ 153456 159950 165579 169942 172873 174520 175409 175737 174790 171832 167349 162595 158032 153132 147550 141532
54323A41532o228o181n259l501k331k821m118m754m591m408m402m282m128l981
$$ 141532 135304 129123 123864 120363 118032 115211 111093 106339 101748 97340 92938 88656 84528 80547
54309H0547l353k153j244j192j308r39o09q53j030n55j47n59j095q25k39k54n79
$$ 80547 77194 75041 73797 72605 71297 70358 69749 68896 67866 67311 67164 66605 65510 64685 64446 64192 63613
54292F3613m72k28m40o87m52k99p44r44j89M15l85j659j571k81N00K65qJ30K54
$$ 63613 63141 62913 62473 61786 61334 61035 60291 59347 59158 59573 59188 57529 55958 55677 56177 56442 56434 56564 56818
54273E6818M90J289J984J420l0p49j78P10J170J328J216O16p4j82J21K50M37J243
$$ 56818 57308 58597 60581 62001 61971 61222 61044 61754 62924 64252 65468 66084 66010 65828 65949 66199 66636 67879
54255F7879K152K090J126K76q3k79j94N05J234J144N62L88L48m71j633j677m31
$$ 67879 70031 72121 73247 73523 73440 73161 72967 73472 74706 75850 76412 76800 77148 76677 75044 73367 72936
54238G2936O61P03K95J20N5q0j87m88j363k376k584j868r80l04L64R11R30N49
$$ 72936 73597 74300 74595 74715 74770 74690 74503 74015 72652 70276 67692 65824 64844 64540 64904 65815 66745 67294
54220F7294K59l9p42j585j894j610j084k87P46J252O91j48k98k75j127k319k306
$$ 67294 67553 67514 66772 65187 63293 61683 60599 60312 61058 62310 63001 62853 62555 62280 61153 58834 56528
54203E6528r23M48R58R93Q97N54K23M29Q99Q87M20J23Ml31o27m39j80l52k60R03
$$ 56528 55605 56053 57011 58004 58901 59455 59678 60107 61006 61893 62313 62436 62440 62109 61482 61043 60863 60511 60251 61154
54183F1154K247K244J233Q38J255J133J55m28j09J08l45p49o31n23o79o43m67
$$ 61154 63401 65645 66878 67716 68971 70104 70259 69831 69722 69830 69485 68736 68105 67582 66903 66260 65793
54166F5793q34j562j552o44m3l50o98l63J31J50k4K0J53K71O33J208J561J594
$$ 65793 64959 63397 61845 61201 61158 60808 60110 59747 59878 60028 60004 60024 60177 60448 61081 62289 63850 65444
54148F5444J629J655J399J037Q70O00q0n50k12J46n34j581j415r4Q51R30R96J173
$$ 65444 67073 68728 70127 71164 72034 72634 72554 72004 71792 71938 71404 69823 68408 68314 69165 70095 71091 72264
54130G2264O11m85p89j94j27r99j467r16o08j404k217j872q93l16j49L5J33J25
$$ 72264 72875 72390 71601 71407 71280 70281 68814 67898 67290 65886 63669 61797 60904 60588 60439 60474 60607 60732
54112F0732M35R71R19J82k14K24O27L15j99l74n99j178j525j181o31l63q3N02
$$ 60732 61167 62138 63057 63239 63025 63249 63876 64191 63992 63618 63019 61841 60316 59135 58504 58141 58058 58560
54094E8560J039J218J220J091N74j53n75q33j476k100j651l35L57j68p39l66M75
$$ 58560 59599 60817 62037 63128 63702 63549 62974 62141 60665 58565 56914 56579 56936 56768 56029 55663 56138
54077E6138R98J220J325J181J009J302J751J542R02Q52J243Q45l16p23M1N07l9
$$ 56138 57136 58356 59681 60862 61871 63173 64924 66466 67368 68220 69463 70308 69992 69269 69310 69817 69778
54060F9778k70P11J637J211K22K1L99M97N25J026J507J239O17M08N50P47J275
$$ 69778 69508 70219 71856 73067 73289 73310 73709 74206 74731 75757 77264 78503 79120 79528 80078 80825 82100
54043H2100K186K644K164J574J724K188K215K019K087K169J969K022K786L776
$$ 82100 84286 86930 89094 90668 92392 94580 96795 98814 100901 103070 105039 107061 109847 113623
54029A13623M436N017N741O039N584N119N306N672N491M925M440M005L601L549
$$ 113623 118059 123076 128817 134856 140440 145559 150865 156537 162028 166953 171393 175398 178999 182548
54015A82548L567K726J127L38J184K364K331J382O76L10k91j127j999l289n090
$$ 182548 186115 188841 189968 190306 191490 193854 196185 197567 198243 198553 198262 197135 195136 191847 186757
54000A86757o430o472n791n328m892l862k556j752j485j405j578j984j938j083
$$ 186757 180327 173855 168064 162736 157844 153982 151426 149674 148189 146784 145206 143222 141284 140201
53986A40201j91r7n66j037j635k443k794k296j726j806j999j582r59p60o37o7
$$ 140201 140010 139913 139347 138310 136675 134232 131438 129142 127416 125610 123611 122029 121070 120310 119673 119606
53970A19606M58L19K0L33R69J235J251J350J122L07k41K56J081J138P49R35J557
$$ 119606 120064 120383 120403 120736 121705 122940 124191 125541 126663 126970 126729 126985 128066 129204 129953 130888 132445
53953A32445J635J104P80R10R54O72L68K70M89J229K337L167L496L916M671N057
$$ 132445 134080 135184 135964 136874 137828 138500 138868 139138 139627 140856 143193 146360 149856 153772 158443 163500
53937A63500M719M464M759M600L043Q04q88k070l221l791l105j954j571j668j052
$$ 163500 168219 172683 177442 182042 185085 185889 185001 182931 179710 175919 172814 170860 169289 167621 166569
53922A66569L29J501K128K565K690K213J805K474L998N209N594N539N377N265
$$ 166569 166898 168399 170527 173092 175782 177995 179800 182274 186272 191481 197075 202614 207991 213256
53908B13256N532O132O335N945O003P153Q270Q055O992O210N332L369R09n76j051
$$ 213256 218788 224920 231255 237200 243203 250356 258626 266681 273673 279883 285215 288584 289493 288917 287866
53893B87866j596k224k096j592k035l331l940l368k795l044l627m162n015o137
$$ 287866 286270 284046 281950 280358 278323 274992 271052 267684 264889 261845 258218 254056 249041 242904
53879B42904o775o773o790o956o687o085n991o328n899m316k838k576l178l789
$$ 242904 236129 229356 222566 215610 208923 202838 196847 190519 184620 180304 177466 174890 171712 167923
53865A67923m291m825n087m758m054l340k817k686l027l310k803j561m25M8l5
$$ 167923 163632 158807 153720 148962 144908 141568 138751 136065 133038 129728 126925 125364 124939 124987 124952
53850A24952m32r43j200j049j014j555k110j829r32l25r6L13O59N6j329k148j811
$$ 124952 124520 123577 122377 121328 120314 118759 116649 114820 113888 113563 113467 113780 114439 114495 113166 111018 109207
53833A09207j335j734k606k866k095o95O58J339J112L80k15m82n64m08N7M44L63
$$ 109207 107872 106138 103532 100666 98571 97876 98534 99873 100985 101365 101150 100668 100104 99696 99753 100197 100560
53816A00560J25K62N73N52L95O59J113J015M94N36J508K666L284L394L291L051
$$ 100560 100685 100947 101520 102072 102467 103126 104239 105254 105748 106284 107792 110458 113742 117136 120427 123478
53800A23478K743K486K300K278K688L437L795L423L142L833N040N634N379M837
$$ 123478 126221 128707 131007 133285 135973 139410 143205 146628 149770 153603 158643 164277 169656 174493
53786A74493M172L219K397K260K405K000J264J137J685K054J916J741J672J337
$$ 174493 178665 181884 184281 186541 188946 190946 192210 193347 195032 197086 199002 200743 202415 203752
53772B03752P29J94m25j499k683l364l805m586n236m806l639l029l158k999k296
$$ 203752 204481 204675 204250 202751 200068 196704 192899 188313 183077 178271 174632 171603 168445 165446 163150
53757A63150j970k297k315j598j059j363j861j779j351j162j275j534j857j829
$$ 163150 161180 158883 156568 154970 153911 152548 150687 148908 147557 146395 145120 143586 141729 139900
53743A39900r41M14J103O82j91r18j498j799j440p22n58j095j450j139p12o02
$$ 139900 138959 139373 140476 141158 140967 140049 138551 136752 135312 134590 134032 132937 131487 130348 129636 129034
53727A29034m90k15k87q75j268q78J7R49J870K661K880K423J753J203O43J14k8
$$ 129034 128544 128329 128042 127167 125899 125021 125038 125987 127857 130518 133398 135821 137574 138777 139420 139534 139506
53710A39506J95L39L78Q59J973L187L944M106L663K732J882J682K052K681L699
$$ 139506 139701 140040 140418 141277 143250 146437 150381 154487 158150 160882 162764 164446 166498 169179 172878
53695A72878N023N563M396K479J673K255K942L240L953N151N601M826M053M296
$$ 172878 177901 183464 187860 190339 192012 194267 197209 200449 204402 209553 215154 219980 224033 228329
53681B28329M932M995M541L957L129K176J872K431K859K364J465R77Q29O64P17
$$ 228329 233261 238256 242797 246754 249883 252059 253931 256362 259221 261585 263050 264027 264856 265520 266237
53666B66237J188J462Q34n06j820k673k974k662j897j118o23n10r51j883k518
$$ 266237 267425 268887 269721 269215 267395 264722 261748 259086 257189 256071 255448 254938 253987 252104 249586
53651B49586k134j264j107j667j766j040n37r44j523j429r25o43o40p75j051j176
$$ 249586 247452 246188 245081 243414 241648 240608 240071 239127 237604 236175 235250 234607 233967 233192 232141 230965
53635B30965p04n5k97j480k213j524m7J041J361J135O81N97J364K447K734K239
$$ 230965 230261 230206 229909 228429 226216 224692 224645 225686 227047 228182 228863 229460 230824 233271 236005 238244
53619B38244K124K812L423L529L867M675M925M086L284L587M418M746M674M774
$$ 238244 240368 243180 246603 250132 253999 258674 263599 267685 270969 274556 278974 283720 288394 293168
53605B93168M859M574M411M960N942O750P324P704P588P035O731O890O815O205
$$ 293168 298027 302601 307012 311972 317914 324664 331988 339692 347280 354315 361046 367936 374751 380956
53591C80956N764N844N694M975M732N748P043P288O736O454O535O336N813N401
$$ 380956 386720 392564 398258 403233 407965 413713 420756 428044 434780 441234 447769 454105 459918 465319
53577D65319N070M595M244M276M301L947L531L319K859J852Q99N49M27J20j7K44
$$ 465319 470389 474984 479228 483504 487805 491752 495283 498602 501461 503313 504212 504761 505188 505308 505291 505535
53561E05535K44m03r63q71q01j289j442m14P64M68j111k399k675k406j874j098
$$ 505535 505779 505376 504413 503542 502741 501452 500010 499596 500360 500828 499717 497318 494643 492237 490363 489265
53545D89265p23j441k600k881k198j652j721j782j492j297j376j167k78R12J794
$$ 489265 488542 487101 484501 481620 479422 477770 476049 474267 472775 471478 470102 468935 468657 469569 471363
53530D71363K097J884J562J807K931M407N440N820N913O141O824Q033R256R791
$$ 471363 473460 475344 476906 478713 481644 486051 491491 497311 503224 509365 516189 524222 533478 543269
53516E43269R885J0625J2339J4005J4819J5299J6050J6593J6518J6724J8182K0317
$$ 543269 553154 563779 576118 590123 604942 620241 636291 652884 669402 686126 704308 724625
53504G24625K1963K3177K4725K6425K7541K8312K9468L0662L0916L0501L0772
$$ 724625 746588 769765 794490 820915 848456 876768 906236 936898 967814 998315 1029087
53493A029087L2175L3774L4888L5865L7013L7950L8270L7955L7096L5961L5283
$$ 1029087 1061262 1095036 1129924 1165789 1202802 1240752 1279022 1316977 1354073 1390034 1425317
53482A425317L5533L6036L5798L5126L5254L6424L7457L7468L6996L6976L7487
$$ 1425317 1460850 1496886 1532684 1567810 1603064 1639488 1676945 1714413 1751409 1788385 1825872
53471A825872L7789L7101L5087L2102K9172K7250K6339K5628K4299K1965J8672
$$ 1825872 1863661 1900762 1935849 1967951 1997123 2024373 2050712 2076340 2100639 2122604 2141276
53460B141276J5092J2408J1329J1414J1757J2028J2174J1583R372N440N84m276
$$ 2141276 2156368 2168776 2180105 2191519 2203276 2215304 2227478 2239061 2248433 2253873 2254457 2250181
53448B250181q534j1890j4524j7100k0067k3133k5790k7995k9989l1950l4069
$$ 2250181 2241647 2229757 2215233 2198133 2178066 2154933 2129143 2101148 2071159 2039209 2005140
53437B005140l6362l8074l8263l7392l7252l8608m0135m0560m0474m0744m0447
$$ 2005140 1968778 1930704 1892441 1855049 1817797 1779189 1739054 1698494 1658020 1617276 1576829
53426A576829l8208l4754l2113l0782k9493k7604k5811k4539k3294k1803k0271
$$ 1576829 1538621 1503867 1471754 1440972 1411479 1383875 1358064 1333525 1310231 1288428 1268157
53415A268157j8353j5303j1435q036n531l000J56L332N962Q466J1401J4627J7846
$$ 1268157 1249804 1234501 1223066 1215030 1209499 1206499 1206655 1209987 1215949 1224415 1235816 1250443 1268289
53402A268289K1137K4435K7199K9069L0365L1596L2925L4371L6071L8156M0610
$$ 1268289 1289426 1313861 1341060 1370129 1400494 1432090 1465015 1499386 1535457 1573613 1614223
53391A614223M3332M5994M8127M9734N1542N4174N7354O0513O3679O7147P0636
$$ 1614223 1657555 1703549 1751676 1801410 1852952 1907126 1964480 2024993 2088672 2155819 2226455
53380B226455P3662P6358P9194Q2138Q4870Q7413Q9767R1382R1818R1505R0976
$$ 2226455 2300117 2376475 2455669 2537807 2622677 2710090 2799857 2891239 2983057 3074562 3165538
53369C165538Q9962Q8171Q6359Q5270Q4075Q1178P6254P0180O3411N5959M8762
$$ 3165538 3255500 3343671 3430030 3515300 3599375 3680553 3756807 3826987 3890398 3946357 3995119
53358C995119M3311L9692L6380L2216K7304K1913J5881R410L251k329p688j2930
$$ 3995119 4038430 4078122 4114502 4146718 4174022 4195935 4211816 4221226 4224477 4222148 4214460 4201530
53346D201530j8029k3957l2323m3545n6308o9068q0875r0640r7125j00180j00942
$$ 4201530 4183501 4159544 4127221 4083676 4027368 3958300 3877425 3786785 3689660 3589480 3488538
53335C488538j00384r8656r6166r3966r2493r0945q8540q5586q2825q0534p8735
$$ 3488538 3388154 3289498 3193332 3099366 3006873 2915928 2827388 2741802 2658977 2578443 2499708
53324B499708p7430p6253p4593p2429p0222o7809o4356n9736n4947n0755m6824
$$ 2499708 2422278 2346025 2271432 2199003 2128781 2060972 1996616 1936880 1881933 1831178 1784354
53313A784354m2638l8447l4779l1748k9264k7290k5514k3407k0860j8112j5024
$$ 1784354 1741716 1703269 1668490 1636742 1607478 1580188 1554674 1531267 1510407 1492295 1477271
53302A477271j1263p287m161k150n09J168K378K911L479M650N976O730O800O513
$$ 1477271 1466008 1458721 1454560 1452410 1451901 1453069 1455447 1458358 1461837 1466487 1472463 1479193 1485993 1492506
53288A492506O321O890Q754J1588J4583J7644K1216K4969K7935L0177L2815L6000
$$ 1492506 1498827 1505717 1514471 1526059 1540642 1558286 1579502 1604471 1632406 1662583 1695398 1731398
53276A731398L8406L9463M0505M2573M4527M4687M3334M2055M1381M0608L9389
$$ 1731398 1769804 1809267 1849772 1892345 1936872 1981559 2024893 2066948 2108329 2148937 2188326
53265B188326L7949L6002L2917K9053K5689K3357K1339J9025J6858J5370J4076
$$ 2188326 2226275 2262277 2295194 2324247 2349936 2373293 2394632 2413657 2430515 2445885 2459961
53254B459961J1936Q599M653P91k856o510j0268j4088j8104k2591k7535l2542
$$ 2459961 2471897 2480496 2485149 2485940 2483084 2476574 2466306 2452218 2434114 2411523 2383988 2351446
53242B351446l7316m1920m6231m9589n1446n2140n2486n2792n2794n2393n1803
$$ 2351446 2314130 2272210 2225979 2176390 2124944 2072804 2020318 1967526 1914732 1862339 1810536
53231A810536n1056m9939m8443m6693m4541m1790l8855l6558l5326l5008l5424
$$ 1810536 1759480 1709541 1661098 1614405 1569864 1528074 1489219 1452661 1417335 1382327 1346903
53220A346903l6373l7236l7266l6423l5316l4278l3010l1196k8901k6388k4059
$$ 1346903 1310530 1273294 1236028 1199605 1164289 1130011 1097001 1065805 1036904 1010516 986457
53209I86457k2444k1713k1270k0426j9286j8421j7905j7407j6983j6896j6885
$$ 986457 964013 942300 921030 900604 881318 862897 844992 827585 810602 793706 776821
53198G76821j6500j5961j5762j5616j4873j3866j3680j4499j5254j5182j4643
$$ 776821 760321 744360 728598 712982 698109 684243 670563 656064 640810 625628 610985
53187F10985j4245j4057j3988j4048j4020j3683j3460j3984j4933j5277j4757
$$ 610985 596740 582683 568695 554647 540627 526944 513484 499500 484567 469290 454533
53176D54533j4132j3734j2936j1438j0098r878j0553j0951j0153q293o538o095
$$ 454533 440401 426667 413731 402293 392195 382317 371764 360813 350660 342367 335829 329734
53164C29734o830p217o226m730m154m420m453m103m075m332m186l788l881m203
$$ 329734 322904 315687 309461 304731 300577 296157 291704 287601 283526 279194 275008 271220 267339 263136
53150B63136l809k957k840l340l000j479q7N62J363K595K980J855N00J95O05J092
$$ 263136 259327 256370 253530 250190 247190 245711 245624 246186 247549 250144 253124 254979 255479 255674 256279 257371
53134B57371J990L406M273L829K878K401K143J577J011O90oj356k436k546k333
$$ 257371 259361 262767 267040 270869 273747 276148 278291 279868 280879 281569 281563 280207 277771 275225 272892
53119B72892k465k443j912j815l022m783n853o122o063n611m842m532m884m814
$$ 272892 270427 267984 266072 264257 261235 256452 250599 244477 238414 232803 227961 223429 218545 213731
53105B13731l737k795k917l041j975o83p89j835k170j735j813k532k854k786l390
$$ 213731 209994 207199 204282 201241 199266 198583 197794 195959 193789 192054 190241 187709 184855 182069 178679
53090A78679m506m517k851r71l67r13j717k395k909l118k924k347j341j31M54
$$ 178679 174173 169656 166805 165834 165467 164554 162837 160442 157533 154415 151491 149144 147803 147672 148126
53075A48126j79j368j868j417q24n85m36j69pJJ17L62M59M00M74P18Q19N41j52
$$ 148126 147947 146579 144711 143294 142470 141885 141449 141280 141273 141274 141391 141753 142212 142612 143086 143804 144623 145164 145012
53056A45012j101j747j374j04Q22M18q28j669j615j087o00m44p40j084p44J63
$$ 145012 143911 142164 140790 140686 141508 141926 141098 139429 137814 136727 136127 135683 134943 133859 133115 133278
53040A33278M10n99j695j573p58n97r56n49P40J493Q34n16j498j842j683j069
$$ 133278 133688 133089 131394 129821 129063 128466 127510 126961 127701 129194 130028 129512 128014 126172 124489 123420
53024A23420l54j51n36q41n60M8M25L34q1m85o33o47q77j214j040j45P97J163
$$ 123420 123066 122915 122379 121538 120978 121026 121451 121785 121704 121219 120586 119939 119062 117848 116808 116663 117460 118623
53006A18623J206J345J290P11J40K93Q90J140J025J123J432J481J399J843K886
$$ 118623 119829 121174 122464 123175 123315 123608 124498 125638 126663 127786 129218 130699 132098 133941 136827
52991A36827L859M339M511M595M610M719N090N502N609N447N096M186K446M45
$$ 136827 140686 145025 149536 154131 158741 163460 168550 174052 179661 185108 190204 194390 196836 197281
52977A97281r41j626k193k915l599m164m563m446l604k622k304k658l098l340
$$ 197281 196340 194714 192521 189606 186007 181843 177280 172834 169230 166608 164304 161646 158548 155208
52963A55208l469l356k865k338k143j997j413o04j21J0J18J21k40p13q26o25l81
$$ 155208 151739 148383 145518 143180 141037 139040 137627 137023 136902 136912 137030 137151 136911 136198 135372 134747 134366
52946A34366j3M83M96l56j362j587j220j007q10nJ073J440J088R72J317J262M27
$$ 134366 134353 134836 135332 134976 133614 132027 130807 129800 128990 128985 130058 131498 132586 133558 134875 136137 136564
52929A36564l20j45O52J188J016K70o00j016o81L6N10O29P15Q78R25Q10O12K43
$$ 136564 136244 136099 136751 137939 138955 139225 138625 137609 136928 136964 137474 138103 138818 139696 140621 141431 142043 142286
52911A42286l19o65l61M22J146J503J433R77M65M00P48Q67N93N21Q10O87j26n99
$$ 142286 141967 141302 140941 141363 142509 144012 145445 146422 146887 147287 148035 148902 149495 150016 150826 151513 151387 150788
52893A50788L5R02R00N37R44J872K155J643J164J013R41J152J909K469J952R09
$$ 150788 150823 151725 152625 153162 154106 155978 158133 159776 160940 161953 162894 164046 165955 168424 170376 171285
52877A71285N61Q25O77J90M71J669K701L030L223L563L617L395L510L972M076
$$ 171285 171846 172671 173348 173538 174009 175678 178379 181409 184632 188195 191812 195207 198717 202689 206765
52862B06765L682L443L614L774L764L708L228J816J4j064j299j457j715j570j105
$$ 206765 210447 213890 217504 221278 225042 228750 231978 233794 233808 232744 231445 229988 228273 226703 225598
52847B25598q84p42j81L16j00q41n38N76Q62r0j003j369k213l897n177n228m834
$$ 225598 224714 223972 223791 224107 224007 223166 222628 223204 224066 223976 222973 221604 219391 215494 210317 205089 200255
52830B00255m726m416l489k538j987j465j014j379k342k456j250j73l42r99j148
$$ 200255 195529 191113 187624 185086 183099 181634 180620 179241 176899 174443 173193 173020 172678 171679 170531
52815A70531j166j565j689j010l67n46q12l15J38o16j941k155r75K49M48j77r01
$$ 170531 169365 167800 166111 165101 164734 164188 163376 163061 163199 162583 160642 158487 157512 157761 158209 158032 157131
52798A57131j219r98n89n77r81j135q16p28j336k036k051j560j162r35o61l97
$$ 157131 155912 154914 154325 153748 152767 151632 150816 150088 148752 146716 144665 143105 141943 141008 140347 139950
52782A39950k00J36N57N91J13m06p50j231j754j621p68j05j27k01R4J51m14q91
$$ 139950 139750 139886 140443 141034 141147 140741 139991 138760 137006 135385 134617 134512 134385 134184 134278 134429 134015 133124
52764A33124p33n81r95j304r52q15j805k974k667j036J04k53j335j981j848j140
$$ 133124 132391 131810 130815 129511 128559 127744 125939 122965 120298 119262 119366 119113 117778 115797 113949 112809
52748A12809j72O02Q10N64K10k35q85j510j730j564j331j158r26n48m3M82P66
$$ 112809 112637 113239 114049 114613 114823 114588 113703 112193 110463 108899 107568 106410 105484 104936 104893 105375 106141
52731A06141O87N74P55Q78M40j04K67J445K075J522Q67J238K255K810K623K119
$$ 106141 106828 107402 108157 109035 109475 109371 109638 111083 113158 114680 115547 116785 119040 121850 124473 126592
52715A26592J593J230J361J951K405K366K106J717P62p39j965k472k859l544l904
$$ 126592 128185 129415 130776 132727 135132 137498 139604 141321 142083 141344 139379 136907 134048 130504 126600
52700A26600l429k738k533k445j911j399j636k315k630k611k859l378l579l146
$$ 126600 123171 120433 117900 115455 113544 112145 110509 108194 105564 102953 100094 96716 93137 89991
52686H9991k198r93p0j18j007j604j183l52O9K52O17P72J61q53j515j735j751
$$ 89991 87793 86800 86730 86612 85605 84001 82818 82466 82535 82787 83404 84176 84337 83484 81969 80234 78483
52669G8483j437q02n18r64j373r67k77k44o23m52L10P50L96l53r31r65k96N92
$$ 78483 77046 76244 75726 74762 73389 72422 72145 71901 71278 70826 71136 71886 72282 71929 70998 70033 69737 70329
52651G0329O47m65j611j623q60m35m86l27K09O60Q43Q14L24o93j416j034rN58
$$ 70329 70976 70511 68900 67277 66417 65982 65496 65169 65378 66038 66881 67695 68019 67326 65910 64876 64867 65425
52633F5425N54O94J074J098P26O66J116J357P82l03j123j173n14L01O96P11Q08
$$ 65425 65979 66673 67747 68845 69571 70237 71353 72710 73492 73189 72066 70893 70379 70680 71376 72087 72895
52616G2895R44M80o29j392j154m95r3L39J079J405P32r7K8P29Q70M69M45R40J346
$$ 72895 73839 74319 73690 72298 71144 70649 70556 70895 71974 73379 74111 74014 74042 74771 75641 76110 76555 77495 78841
52597G8841J631K158K449J596q3j223j235q04m74qO95J208J318J259J123Q47P66
$$ 78841 80472 82630 85079 86675 86592 85369 84134 83330 82856 82848 83543 84751 86069 87328 88451 89298 90064
52580I0064J316K140K407J983J452J120Q57P43R59J130P56J99K14O75P40K89J08
$$ 90064 91380 93520 95927 97910 99362 100482 101339 102082 103041 104171 104927 105126 105340 106015 106755 107044 107152
52563A07152N56J011Q35Q5p53j085l68J291K777L049K362J675J229O40R6J67N99
$$ 107152 107708 108719 109554 109639 108886 107801 107433 108724 111501 114550 116912 118587 119816 120456 120552 120719 121318
52546A21318M90k26o50l05L13O97Q23N92j60r61r97k91K75L08L19O56Q76N62P
$$ 121318 121808 121582 120932 120627 120940 121637 122460 123052 122892 121931 120934 120643 120918 121226 121545 122201 123077 123639 123646
52527A23646k10R4O25Q49M09l24m74J02L65m34j468j514p47j96P3P46J604J708
$$ 123646 123436 123530 124155 125004 125413 125089 124615 124717 125082 124648 123180 121666 120919 120723 120796 121542 123146 124854
52509A24854J088P35Q42N99o6j45P04J507J547J249J024N24l16p39l92n0l79q79
$$ 124854 125942 126677 127519 128118 128052 127907 128611 130118 131665 132914 133938 134462 134146 133407 133015 132965 132586 131707
52491A31707p61r1O72J451K177K321J537L76k36L4Q12J493J579R87K16j00J08
$$ 131707 130946 130855 131527 132978 135155 137476 139013 139389 139153 139187 139999 141492 143071 144058 144274 144174 144282
52474A44282M28P45J242J776J927J744J680J770J568J039O78O51N08k6o24q60
$$ 144282 144710 145455 146697 148473 150400 152144 153824 155594 157162 158201 158879 159530 160038 160012 159388 158528
52458A58528o87l42k61q15j675j771o51N79N89l66j040j128j236j332q49k11m72
$$ 158528 157841 157499 157238 156423 154748 152977 152326 152905 153494 153128 152088 150960 149724 148392 147543 147332 146860
52441A46860j321j171K96J407J003M4j37K51L37J20kk34q39j271r77l63j33j63
$$ 146860 145539 144368 144664 146071 147074 147118 146981 147232 147569 147689 147687 147453 146614 145343 144366 144003 143870 143707
52423A43707P3M57M87K04J01L69P51J043J249J381J378J070L23n13n86L77J296
$$ 143707 143780 144237 144724 144928 145029 145398 146149 147192 148441 149822 151200 152270 152593 152080 151494 151871 153167
52406A53167J022J64L86J865K936K607J886J877J969J131j02l05P58J900K101
$$ 153167 154189 154353 154739 156604 159540 162147 164033 165910 167879 169010 168908 168603 169361 171261 173362
52391A73362J351K02p30r01j77R62J893K429K666K638K378J943J268L34l75j89
$$ 173362 174713 174915 174185 173284 173107 174069 175962 178391 181057 183695 186073 188016 189284 189618 189243 189054
52375A89054P82J571J588J324J535K272L008L246K740J596M35j3K48O00P42R31
$$ 189054 189836 191407 192995 194319 195854 198126 201134 204380 207120 208716 209151 209138 209386 209986 210728 211659
52359B11659J235J320J194J344J840K094J800J414J342J366J259J244J577K207
$$ 211659 212894 214214 215408 216752 218592 220686 222486 223900 225242 226608 227867 229111 230688 232895
52345B32895L028L842L982K915J337O69J168J573J065M35O63J409J747J566J343
$$ 232895 235923 239765 243747 246662 247999 248668 249836 251409 252474 252909 253572 254981 256728 258294 259637
52330B59637J179R28P79R97J350J423J146P22L63M22J204K354K993K820K434K324
$$ 259637 260816 261744 262523 263520 264870 266293 267439 268161 268524 268946 270150 272504 275497 278317 280751 283075
52314B83075K259K024K011K548L333L961M444M811M855M669M783N369N880N861
$$ 283075 285334 287358 289369 291917 295250 299211 303655 308466 313321 317990 322773 328142 334022 339883
52300C39883N543N308N278N646O672Q024Q853Q904Q800R031R444R890J0510J1072
$$ 339883 345426 350734 356012 361658 368330 376354 385207 394111 402911 411942 421386 431276 441786 452858
52286D52858J1129J1050J1779J3201J4015J3684J3271J3687J4464J4940J5398
$$ 452858 463987 475037 486816 500017 514032 527716 540987 554674 569138 584078 599476
52275E99476J6070J6267J5597J4920J4924J4799J3649J2257J1993J2530J2194
$$ 599476 615546 631813 647410 662330 677254 692053 705702 717959 729952 742482 754676
52264G54676J0328Q002O388N512M683L457J973Q12L72L13j40j167k198k909l567
$$ 754676 765004 773006 779394 784906 789589 793046 795019 795831 796203 796516 796376 795209 793011 790102 786535
52249G86535m194m291l849l635m015m351m115l659l360l008k537k249j764o9K680
$$ 786535 782341 778050 774201 770566 766551 762200 758085 754426 751066 748058 745521 743272 741508 741439 744119
52234G44119M815N515O014P392Q761R099R349J0850J2795J3345J2528J1978J2290
$$ 744119 748934 754449 760463 767855 776616 785715 795064 805914 818709 832054 844582 856560 868850
52221H68850J2541J2291J2120J2054J1262R575P935O904N903M299K323N78p08
$$ 868850 881391 893682 905802 917856 929118 938693 946628 953532 959435 963734 966057 966635 965927
52208I65927j729k856m336n872o821p206p896r331j0768j1594j2454j4034j5545
$$ 965927 964198 961342 957006 951134 944313 937107 929211 919880 909112 897518 885064 871030 855485
52195H55485j5659j4473j3248j2602j2181j1770j1524j1277j0673r843r067q141
$$ 855485 839826 825353 812105 799503 787322 775552 764028 752751 742078 732235 723168 715027
52183G15027o897n862n508n414n184n406o469p227o371m553l451l230k692j706
$$ 715027 708130 702268 696760 691346 686162 680756 674287 667060 660689 656136 652685 649455 646763 645057
52169F45057j513k508l517l626l241k856k275j553j473k378l487l932l735l393
$$ 645057 643544 641036 637519 633893 630652 627796 625521 623968 622495 620117 616630 612698 608963 605570
52155F05570l194l205l278l061k496k184k460k506j375L25J009K49q68j556k156
$$ 605570 602376 599171 595893 592832 590336 588152 585692 583186 581811 582136 583145 583394 582526 580970 578814
52140E78814k991l618l667l439l263l075k851k803k910k980l158l610l898l491
$$ 578814 575823 572205 568538 565099 561836 558761 555910 553107 550197 547217 544059 540449 536551 533060
52126E33060k741k378k215j559p38q79k063l014k924k310j765j107k96Pm79r40
$$ 533060 530319 527941 525726 524167 523429 522550 520487 517473 514549 512239 510474 509367 509071 509078 508599 507659
52110E07659n22N26J340J555J511J787K715M031M932M985M795N158N897O338O650
$$ 507659 507137 507663 509003 510558 512069 513856 516571 520602 525534 530519 535314 540472 546369 552707 559357
52095E59357P606R185J0588J1644J2922J4420J5427J5907J6756J8252J9520J9968
$$ 559357 566963 576148 586736 598380 611302 625722 641149 657056 673812 692064 711584 731552
52083G31552K0118K0523K0889K0860K0651K0351J9545J8257J7340J7274J7332
$$ 731552 751670 772193 793082 813942 834593 854944 874489 892746 910086 927360 944692
52072I44692J6625J5252J3835J2467J0847Q905O863M922L296K030P54r26k764
$$ 944692 961317 976569 990404 1002871 1013718 1022623 1029486 1034408 1037704 1039734 1040488 1039562 1036798
52059A036798m251n562p259r040r902r789r875j0815j1804j1920j1395j0833j0199
$$ 1036798 1032547 1026985 1019726 1010686 1000784 990995 981120 970305 958501 946581 935186 924353 914154
52046I14154r319q613q404q103o994n394m270l972l956l527k353n23J500L155
$$ 914154 904835 896222 887818 879715 872721 867327 863057 859085 855129 851602 849249 848726 850226 853381
52032H53381M317N324O340P120P528P870Q417R054R493R511Q897P687O451N873
$$ 853381 857698 863022 869362 876482 884010 891880 900297 909351 918844 928355 937252 944939 951390 957263
52018I57263N929N978N620M893L808K438J323Q93N16r01l306n551p121q686j0677
$$ 957263 963192 969170 974790 979683 983491 985929 987252 988145 988661 987760 984454 978903 971782 963096 952419
52003I52419j2469j3478j4049j4701j5409j6226j7622j9598k1236k1793k1543
$$ 952419 939950 926472 912423 897722 882313 866087 848465 828867 807631 785838 764295
51992G64295k1175k0981k1137k1807k2548k2453k1497k0816k1043k1256k0412
$$ 764295 743120 722139 701002 679195 656647 634194 612697 591881 570838 549582 529170
51981E29170j8962j8053j7788j7317j6254j5003j3947j3082j2312j1533j0549
$$ 529170 510208 492155 474367 457050 440796 425793 411846 398764 386452 374919 364370
51970C64370r433q655q442q334p791o977o431o279o184n890n398m854m451m280
$$ 364370 354937 346282 337840 329506 321715 314738 308307 302028 295844 289954 284556 279702 275251 270971
51956B70971m093l599k980k717k784k620k029j456j222j136j066j200j438j296
$$ 270971 266878 263279 260299 257582 254798 252178 250149 248693 247471 246335 245269 244069 242631 241335
51942B41335p39l91n25o42m34l80r18j712k255k522k563k182j569j522k413l508
$$ 241335 240596 240205 239680 239038 238604 238224 237306 235594 233339 230817 228254 226072 224503 222981 220568 217060
51926B17060l937l715l278k686j959j572j814k140j902j289r28q97q74r19j347
$$ 217060 213123 209408 206130 203444 201485 199913 198099 195959 194057 192768 191840 190943 190069 189150 187803
51911A87803k018k357k036j246m47m9j25k69m3L41K88j91m06j45j14p52j420j292
$$ 187803 185785 183428 181392 180146 179699 179650 179525 179256 179213 179554 179842 179651 179245 179100 178986 178234 176814 175522
51893A75522n15J22J89j80p06j115j221j231j478j776j520p07q2k0p7N3L1k73
$$ 175522 175007 175129 175318 175138 174432 173317 172096 170865 169387 167611 166091 165384 165302 165282 165205 165258 165289 165016
51875A65016l46n5j05p59j073k87P56P39k09p96m08L05N90M42L43O35J217J579
$$ 165016 164670 164615 164510 163751 162678 162391 163147 163886 163677 162881 162473 162778 163368 163810 164153 164788 166005 167584
51857A67584J425J243J790K895L564L491L434L742L616K554J358Q56O38O3m30
$$ 167584 169009 170252 172042 174937 178501 181992 185426 189168 192784 195338 196696 197552 198190 198253 197823
51842A97823k35J20j60o30m20L7m13j613k153j469m69Q6N03J200J870K067J811
$$ 197823 197588 197708 197548 196918 196498 196535 196122 194509 192356 190887 190418 190504 191007 192207 194077 196144 197955
51825A97955J293N50k32o53n60j93K05O30J107J576J889J774J061J27l07j75l04
$$ 197955 199248 199798 199566 198913 198353 198160 198365 198995 200102 201678 203567 205341 206402 206529 206222 206047 205743
51808B05743j123j806j429m80k17q93j576j546r88l12L34P86P82L92K1nM18J252
$$ 205743 204620 202814 201385 200905 200688 199795 198219 196673 195685 195373 195707 196493 197275 197667 197688 197683 198101 199353
51790A99353K146K411J700N56j60j46M52J559K929L825L669K862K295K236K294
$$ 199353 201499 203910 205610 206166 206006 205860 206312 207871 210800 214625 218294 221156 223451 225687 227981
51775B27981K259K213K066J699J463J801K470K842K954L514M801O144O735O540
$$ 227981 230240 232453 234519 236218 237681 239482 241952 244794 247748 251262 256063 262207 268942 275482
51761B75482O225O527P750R672J1911J4375J7185K0119K2563K4023K4224K2547
$$ 275482 281707 288234 295984 305656 317567 331942 349127 369246 391809 415832 440056 462603
51749D62603J8132J1021K601n392j1849j6114j7888j7833j7376j7067j5955j3342
$$ 462603 480735 491756 494357 488965 477116 461002 443114 425281 407905 390838 374883 361541
51737C61541j0276q222p054n607l711k328j950k059k116k019j693j141q35j225
$$ 361541 351265 343043 335989 330382 326671 324343 322393 320334 318218 316199 314506 313365 312530 311305
51723C11305j971k384k439k560k794l012l469m259m619l886k776k519k968k941
$$ 311305 309334 306950 304511 301951 299157 296145 292676 288417 283798 279912 277136 274617 271649 268708
51709B68708k212j792k147k509k302j919j779j619j268j133j444j773j788j764
$$ 268708 266496 264704 262557 260048 257746 255827 254048 252429 251161 250028 248584 246811 245023 243259
51695B43259j921j898j302l03O40J194J229Q69N97Q34J337J526J381J457K058
$$ 243259 241338 239440 238138 237835 238475 239669 240898 241767 242364 243198 244535 246061 247442 248899 250957
51680B50957K907L610L908L587K757K113K244K813L014K728K495K557K708K898
$$ 250957 253864 257474 261382 264969 267726 269839 272083 274896 277910 280638 283133 285690 288398 291296
51666B91296L120K838J507l98j840k659l552m654n325n475n818o469o468n356
$$ 291296 294416 297254 298761 298363 296523 293864 290312 285658 280333 274858 269040 262571 256103 250747
51652B50747m173m088m785n032m350l363k825k893l239l398l085k413j755j357
$$ 250747 246574 242486 237701 232669 228319 224956 222131 219238 215999 212601 209516 207103 205348 203991
51638B03991j228j301j452j456j227r96q25l27O19J222O44o80j454j245q72j022
$$ 203991 202763 201462 200010 198554 197327 196331 195506 195179 195798 197020 197664 196984 195530 194285 193413 192391
51622A92391j339j245q61o87r06j324j648j561r22j9O85J112J460J653J422R17
$$ 192391 191052 189807 188946 188259 187353 186029 184381 182820 181898 181879 182564 183676 185136 186789 188211 189128
51606A89128O63Q14R45O27j80j178j756j198N35K352L052K666K266K525L161L615
$$ 189128 189791 190605 191550 192177 191997 190819 189063 187865 188400 190752 193804 196470 198736 201261 204422 208037
51590B08037L629L226K827L092M056M761M606M585N961Q065Q820P542N691M565
$$ 208037 211666 214892 217719 220811 224867 229628 234234 238819 244780 252845 261665 269207 274898 279463
51576B79463L653J998l4j347j707j875k452l314l980m132l869l527l158k299o63
$$ 279463 283116 285114 285080 283733 282026 280151 277699 274385 270405 266273 262404 258877 255719 253420 252757
51561B52757J196K458L094L627M120M228M184M687N736O499O567O438O514O408
$$ 252757 253953 256411 259505 263132 267252 271480 275664 280351 286087 292586 299153 305591 312105 318513
51547C18513N635M335L002J964J239O02k52j141j344o34P9j8k97M03J826K567
$$ 318513 324148 328483 331485 333449 334688 335290 335038 333897 332553 331919 331998 331980 331683 332086 333912 336479
51531C36479K077J127L45l06o56m09j74j050k876m304m792n093n494n217m113
$$ 336479 338556 339683 340028 339722 339066 338657 338483 337433 334557 330253 325461 320368 314874 309657 305544
51516C05544l301l387l475k840k175k331k979l477l918m416m444l765l050k768
$$ 305544 302243 298856 295381 292541 290366 288035 285056 281579 277661 273245 268801 265036 261986 259218
51502B59218k431j703j166j134q85k0O18L43j41q2l7n97r07N4J537K063J685J664
$$ 259218 256787 255084 253918 252784 251899 251879 252497 252840 252699 252617 252580 251983 251076 251130 252667 254730 256415 258079
51484B58079K276K592K252J915J979K097K109K300K613K638K515K893L832M563
$$ 258079 260355 262947 265199 267114 269093 271190 273299 275599 278212 280850 283365 286258 290090 294653
51470B94653M582M363M687N761P086P923P915P493P462P960Q243P819P245P173
$$ 294653 299235 303598 308285 314046 321132 329055 336970 344463 351925 359885 368128 375947 383192 390365
51456C90365P211O442M816L183K137J483Q59K34k36n08p52j302k312l360l840
$$ 390365 397576 404018 408834 412017 414154 415637 416496 416730 416494 415986 415234 413932 411620 408260 404420
51441D04420l909m448n850p393q197q276q190q259q549r043r329q736p275n829
$$ 404420 400511 396063 390213 382820 374623 366347 358157 349898 341349 332306 322977 314241 306966 301137
51427C01137m911l987k589j324j018j473j913k078k046j558m10Q33J395J292J149
$$ 301137 296226 292239 289650 288326 287308 285835 283922 281844 279798 278240 277830 278663 280058 281350 282499
51412B82499J317J828K727L838M592M736M714M666L768J399j584l768m900n743
$$ 282499 283816 285644 288371 292209 296801 301537 306251 310917 314685 316084 314500 310732 305832 300089
51398C00089o706p600q387r069r077p949o448n941o586p178o868o067n513n326
$$ 300089 293383 285783 277396 268327 259250 251301 244853 238912 232326 225148 218280 212213 206700 201374
51384B01374n257n154m885m338l718l406l455l529l424l201k942k681k499k333
$$ 201374 196117 190963 186078 181740 178022 174616 171161 167632 164208 161007 158065 155384 152885 150552
51370A50552j904j138m73l32n77q32j044j305j454j302r48m96J10O44N78k1k77
$$ 150552 148648 147510 147037 146705 146128 145296 144252 142947 141493 140191 139243 138747 138857 139501 140079 140058 139781
51353A39781K64Q33O91L92Q11J594J753J320J154J307J012K40k1O59J439J531
$$ 139781 140045 140878 141569 141961 142772 144366 146119 147439 148593 149900 150912 151152 151131 151790 153229 154760
51337A54760J284J443K036K536K718K839L164L586L685L247K755L061M303N505
$$ 154760 156044 157487 159523 162059 164777 167616 170780 174366 178051 181298 184053 187114 191417 196922
51323A96922N715N105M441L874L018J911R97K60q52k496m103n088n401n308n060
$$ 196922 202637 207742 212183 216057 219075 220986 221983 222243 221391 218895 214792 209704 204303 198995 193935
51308A93935m846m730m618m486m503m637m494l907l334l274l568l741l614l194
$$ 193935 189089 184359 179741 175255 170752 166115 161621 157714 154380 151106 147538 143797 140183 136989
51294A36989k399j429r55j289j799j702j066m48J0L99N05J75j59j89m12j250j962
$$ 136989 134590 133161 132206 130917 129118 127416 126350 125902 125912 126311 126816 126991 126832 126643 126231 124981 123019
51277A23019j449Q1J303J419P21k21r60r90k00O09N95J13Q8M31L07j49J57J375
$$ 123019 121570 121651 122954 124373 125094 124873 123913 122923 122723 123332 123927 124040 124128 124559 124866 124717 124874 126249
51259A26249K108J294l86j542j682j214o12j95k40p53j326j542j346r08m53k38
$$ 126249 128357 129651 129265 127723 126041 124827 124215 124020 123780 123027 121701 120159 118813 117905 117452 117214
51243A17214l59n76n99m96m88n85o95q41q43k25J016J994K002J460J139Q64L3
$$ 117214 116855 116279 115680 115184 114696 114111 113416 112575 111732 111507 112523 114517 116519 117979 119118 119982 120015
51226A20015j010j268o34N0M28R56J685J865J127J63k17JL75O19O50N41O09J093
$$ 120015 119005 117737 117103 117153 117581 118537 120222 122087 123214 123377 123160 123161 123536 124155 124805 125346 125955 127048
51208A27048J692J853J474Q95L96J70M81J135J288N20k70m7P40Q17O3m59k51J93
$$ 127048 128740 130593 132067 132962 133358 133528 134009 135144 136432 136952 136682 136635 137375 138192 138255 137796 137545 137738
51190A37738O87J543K344K041O81k64J10J018J414J368J388J388J098P07L78j16
$$ 137738 138425 139968 142312 144353 145034 144770 144880 145898 147312 148680 150068 151456 152554 153261 153639 153523
51174A53523o94o85J58R69P55m80k011l250l794l336k095q90l26k95n55j146j897
$$ 153523 152829 152144 152302 153271 154026 153546 151535 148285 144491 141155 139060 138170 137844 137549 136994 135848 133951
51157A33951k251k032j836k064k116j198M66J785J990J275M35J13L37O16N51K97
$$ 133951 131700 129668 127832 125768 123652 122454 122920 124705 126695 127970 128405 128518 128855 129471 130022 130319
51141A30319K19L41N38R30J550J903J586J076J061J209N62r06k194k743k979l193
$$ 130319 130538 130879 131417 132347 133897 135800 137386 138462 139523 140732 141294 140388 138194 135451 132472 129279
51125A29279l034k408j872j722j549j068n50j55K91N55k1j327k182j787o81J62
$$ 129279 126245 123837 121965 120243 118694 117626 117076 116921 117212 117767 117746 116419 114237 112450 111769 111931
51109A11931N24O70P18P33Q95J065Q14K22J7N64J357J837K062K177J963J296N21
$$ 111931 112455 113125 113843 114576 115471 116536 117350 117572 117589 118153 119510 121347 123409 125586 127549 128845 129366
51092A29366j0k16K3Q39J840K334K232J991J629P53l81r14p23o15q67p43J01Q89
$$ 129366 129356 129140 129163 130002 131842 134176 136408 138399 140028 140781 140400 139486 138763 138148 137281 136538 136639 137528
51074A37528J012Q78R48R99R62J412K408K941K320J214M91L1m78n59K66J440K097
$$ 137528 138540 139418 140366 141365 142327 143739 146147 149088 151408 152622 153113 153144 152666 152107 152373 153813 155910
51057A55910K108J687Q15j58k70P35J632J283J83m80n00l54j35J63qq91j566j159
$$ 155910 158018 159705 160520 160362 160092 160827 162459 163742 163925 163445 162945 162591 162456 162619 162611 161720 160154 158995
51039A58995l18j73m46pJ055J393M26q52j229n38N60J262J182P33Q00J535J958
$$ 158995 158677 158504 158058 158051 159106 160499 160925 160073 158844 158306 158866 160128 161310 162043 162843 164378 166336
51022A66336J391N66M81Q86J016J056J589K076J417j31j109r38m23j43K48Q44
$$ 166336 167727 168293 168774 169660 170676 171732 173321 175397 176814 176683 175574 174636 174213 174070 174318 175162
51006A75162J000N72M71J305K353K633K291K222K768L461L824L957M317N145O074
$$ 175162 176162 176734 177205 178510 180863 183496 185787 188009 190777 194238 198062 202019 206336 211481 217555
50991B17555O430O049N617N874O718P513Q041Q538R060R472J0059J1361J3287
$$ 217555 223985 230034 235651 241525 248243 255756 263797 272335 281395 290867 300926 312287 325574
50978C25574J5019J6090J7046J8768K1399K4274K6739K8873L1378L4791L8846
$$ 325574 340593 356683 373729 392497 413896 438170 464909 493782 525160 559951 598797
50967E98797M2769M6234M9683N3527N7527O1196O4381O6999O8592O8677O7283
$$ 598797 641566 687800 737483 791010 848537 909733 974114 1041113 1109705 1178382 1245665
50956A245665O4629O0519N4532M6785L8044K9134K0468J2049L681m668j2535j9277
$$ 1245665 1310294 1370813 1425345 1472130 1510174 1539308 1559776 1571825 1575506 1570838 1558303 1539026
50944A539026k4804k9505l3369l5635l5787l4259l1929k9357k6895k4858k3121
$$ 1539026 1514222 1484717 1451348 1415713 1379926 1345667 1313738 1284381 1257486 1232628 1209507
50933A209507k1194j9312j8712k0103k2461k4233k5240k6498k8595l1174l3766
$$ 1209507 1188313 1169001 1150289 1130186 1107725 1083492 1058252 1031754 1003159 971985 938219
50922I38219l6109l7715l8092l7494l6709l6017l4883l2777k9787k6441k3269
$$ 938219 902110 864395 826303 788809 752100 716083 681200 648423 618636 592195 568926
50911E68926k0521j8020j5456j3003j1236j0205r188p790o600o039n300l384p28
$$ 568926 548405 530385 514929 501926 490690 480485 471297 463507 456907 450868 445568 442184 441456
50898D41456J203J815J886K315L168M009M426M202L553L138L325L623L370K649
$$ 441456 442659 444474 446360 448675 451843 455852 460278 464480 468033 471171 474496 478119 481489 484138
50884D84138K020J630J291J147J498K157K674K999L337L638L858M425N677P222
$$ 484138 486158 487788 489079 490226 491724 493881 496555 499554 502891 506529 510387 514812 520489 527711
50870E27711Q518R689J1016J2076J2506J3139J5190J8408K1284K3181K5109K8254
$$ 527711 536229 545918 556934 569010 581516 594655 609845 628253 649537 672718 697827 726081
50858G26081L2724L8042M3881N0035N6396O3277P1173Q0042Q9360R8884J08652
$$ 726081 758805 796847 840728 890763 947159 1010436 1081609 1161651 1251011 1349895 1458547
50847A458547J18308J27177J35098J42384J48869J53751J56405J56466J52985
$$ 1458547 1576855 1704032 1839130 1981514 2130383 2284134 2440539 2597005 2749990
50838B749990J44536J30636J12398R1339O8182M3204J7270q048l1144n0976o7218
$$ 2749990 2894526 3025162 3137560 3228899 3297081 3340285 3357555 3349507 3318363 3267387 3200169
50827C200169p9985q9220r4311r4665r0555q3114p3591o3023n2557m3515l6945
$$ 3200169 3120184 3030964 2936653 2841988 2751433 2668319 2594728 2531705 2479148 2435633 2398688
50816B398688l3230l2114l3034l5627m0077m6618n4562o2414o9152p4849p9616
$$ 2398688 2365458 2333344 2300310 2264683 2224606 2177988 2123426 2061012 1991860 1917011 1837395
50805A837395q2856q4109q3778q2209p8889p3515o7082o0721n4161m6570l8320
$$ 1837395 1754539 1670430 1586652 1504443 1425554 1352039 1284957 1224236 1170075 1123505 1085185
50794A085185l0479k3032j5200p179k4O236J2750K0043K7451L4461M1089M6673
$$ 1085185 1054706 1031674 1016474 1009295 1009271 1015507 1028257 1048300 1075751 1110212 1151301 1197974
50782A197974M9903N0505M9661M8199M5599M1290L5729K9580K2924J5920R297
$$ 1197974 1247877 1298382 1348043 1396242 1441841 1483131 1518860 1548440 1571364 1587284 1596581
50771A596581L588j437o041j0131j3918j8037k2572k6802l0323l3498l6460l8648
$$ 1596581 1600169 1598732 1592691 1582560 1568642 1550605 1528033 1501231 1470908 1437410 1400950 1362302
50759A362302l9744m0124l9884l8436l5707l2723l0318k8124k5418k2167j8538
$$ 1362302 1322558 1282434 1242550 1204114 1168407 1135684 1105366 1077242 1051824 1029657 1011119
50748A011119j4283r367m511k97L676Q051J2772J7504K2447K7962L3929M0134
$$ 1011119 996836 987469 982958 982661 986337 994388 1007160 1024664 1047111 1075073 1109002 1149136
50736A149136M6882N4554O2955P1636Q0525Q9686R8836J07434J14907J20415J22906
$$ 1149136 1196018 1250572 1313527 1385163 1465688 1555374 1654210 1761644 1876551 1996966 2119872
50725B119872J21785J17174J09312R8265Q4458O8752N1574L2567J1671j0082l1182
$$ 2119872 2241657 2358831 2468143 2566408 2650866 2719618 2771192 2803759 2815430 2805348 2774166
50714B774166n0549o7365q0680q9732r4363r4816r1581q5631p8152o9748o0538
$$ 2774166 2723617 2656252 2575572 2485840 2391477 2296661 2205080 2119449 2041297 1971549 1911011
50703A911011n1186m2931l6256l0556k5663k2673k2490k4483k7545l1688l7359
$$ 1911011 1859825 1816894 1780638 1750082 1724419 1701746 1679256 1654773 1627228 1595540 1558181
50692A558181m3686m8598n0805n0804m9879m8630m6573m2813l7200l0843k5134
$$ 1558181 1514495 1465897 1415092 1364288 1314409 1265779 1219206 1176393 1139193 1108350 1083216
50681A083216k0206j4917q514j595M969J1251J7880K5104L2939M1667N1518O2180
$$ 1083216 1063010 1048093 1039579 1037984 1042953 1054204 1072084 1097188 1130127 1171794 1223312 1285492
50669A285492P3152Q4127R4579J03525J10133J14125J15192J12769J06918R8805
$$ 1285492 1358644 1442771 1537350 1640875 1751008 1865133 1980325 2093094 2200012 2298817
50659B298817Q9596P9607O9109N9079N0190M1711L2484K2537J2672K937p289j7915
$$ 2298817 2388413 2468020 2537129 2596208 2646398 2688109 2720593 2743130 2755802 2758739 2751450 2733535
50647B733535k8008l7020m4982n1451n5321n6075n4401n1129m6327l9846l2169
$$ 2733535 2705527 2668507 2623525 2572074 2516753 2460678 2406277 2355148 2308821 2268975 2236806
50636B236806k4106j5944p525R03Q339J3809J7218J9198K0148J9845J8221J5926
$$ 2236806 2212700 2196756 2189231 2190134 2198473 2212282 2229500 2248698 2268846 2288691 2306912 2322838
50624B322838J3673J1305Q389N474L906M287O002Q615J2760J9177K7482L6402
$$ 2322838 2336511 2347816 2356205 2361679 2365585 2369872 2375874 2384489 2397249 2416426 2443908 2480310
50612B480310M4647N1101N4715N4886N1679M5446L6680K6363J5709N212n426j6170
$$ 2480310 2524957 2576058 2630773 2685659 2737338 2782784 2819464 2845827 2861536 2866748 2861322 2845152
50600B845152k6262l5367m4250n3732o3691p3631q3338r2272r9130j02921j03908
$$ 2845152 2818890 2783523 2739273 2685541 2621850 2548219 2464881 2372609 2273479 2170558 2066650
50589B066650j02874j00105r5804r0728q5468p9787p3559o7642o2792n8332n3076
$$ 2066650 1963776 1863671 1767867 1677139 1591671 1511884 1438325 1370683 1307891 1249559 1196483
50578A196483m7156m1692l7048l2578k7961k3624j9834j6335j2924r628o346l008
$$ 1196483 1149327 1107635 1070587 1038009 1010048 986424 966590 950255 937331 927703 921357 918349
50566I18349J39L091O515J0807J5123J8388K0943K4069K8116L2406L6837M2171
$$ 918349 918488 921579 928094 938901 954024 972412 993355 1017424 1045540 1077946 1114783 1156954
50554A156954M8519N4850O0482O6043P2367P9394Q6512R3219R8794J02013J01949
$$ 1156954 1205473 1260323 1320805 1386848 1459215 1538609 1625121 1718340 1817134 1919147 2021096
50543B021096R8705R2967Q5196P5723O5326N5261M6680M0079L5248L1735K9467
$$ 2021096 2119801 2212768 2297964 2373687 2439013 2494274 2540954 2581033 2616281 2648016 2677483
50532B677483K8697K9117K9455K8559K6688K5175K4939K6023K8436L2636L8759
$$ 2677483 2706180 2735297 2764752 2793311 2819999 2845174 2870113 2896136 2924572 2957208 2995967
50521B995967M5957N2866N8458O2356O4706O5888O6057O4763O1133N4486M4729
$$ 2995967 3041924 3094790 3153248 3215604 3280310 3346198 3412255 3477018 3538151 3592637 3637366
50510C637366L2372J8368L663j1357k6819m2495n7426p0688q2043r1293r7457
$$ 3637366 3669738 3688106 3691769 3680412 3653593 3611098 3553672 3482984 3400941 3309648 3212191
50499C212191r9390r6870r0446q0467o7125n1323l4575j8090k542J1339K2764
$$ 3212191 3112801 3015931 2925485 2845018 2777893 2726570 2691995 2673905 2671363 2682702 2705466
50488B705466L1486L7701M1314M1884L9245L3421K4019J0445p129k7597m9598
$$ 2705466 2736952 2774653 2815967 2857851 2897096 2930517 2954536 2964981 2957852 2930255 2880657
50477B880657p1604r1490j07191j18135j25206j29083j29504j26460j21143j14972
$$ 2880657 2809053 2717563 2610372 2492237 2367031 2237948 2108444 1981984 1860841 1745869
50467A745869j08295j00774r2500q4097p5980o8093o0311n2615m5046l7752l1045
$$ 1745869 1637574 1536800 1444300 1360203 1284223 1216130 1155819 1103204 1058158 1020406 989361
50456I89361k5223k0428j6678j3764j1136q216m968j823J021L799O676R451J2023
$$ 989361 964138 943710 927032 913268 902132 893916 888948 887125 888146 891945 898621 908072 920095
50443I20095J4650J7539K0573K3563K6441K8897L0354L0734L0918L1968L4080
$$ 920095 934745 952284 972857 996420 1022861 1051758 1082112 1112846 1143764 1175732 1209812
50432A209812L6614L8979M1061M2836M4107M4797M5231M5842M6661M7242M7175
$$ 1209812 1246426 1285405 1326466 1369302 1413409 1458206 1503437 1549279 1595940 1643182 1690357
50421A690357M6584M5908M5297M4408M2938M1124L9547L8590L8351L8963M0621
$$ 1690357 1736941 1782849 1828146 1872554 1915492 1956616 1996163 2034753 2073104 2112067 2152688
50410B152688M3215M6140M8556M9730M9235M7008M3339L8698L3478K7843K1752
$$ 2152688 2195903 2242043 2290599 2340329 2389564 2436572 2479911 2518609 2552087 2579930 2601682
50399B601682J5105Q000P51o458j3848k1711k9902l8058m6299n5208o4933p4721
$$ 2601682 2616787 2624787 2625538 2619080 2605232 2583521 2553619 2515561 2469262 2414054 2349121 2274400
50387B274400q3509r0533r5263r7286r6696r4101q9821q3472p4814o4646n4326
$$ 2274400 2190891 2100358 2005095 1907809 1811113 1717012 1627191 1543719 1468905 1404259 1349933
50376A349933m4569l5139k5538j5659n877L182J1103J7930K3665K7492K8152K5258
$$ 1349933 1305364 1270225 1244687 1229028 1223151 1226333 1237436 1255366 1279031 1306523 1334675 1359933
50364A359933J9696J2431L708o195j6225k5262l3018l9558m4558m7685m9208m9472
$$ 1359933 1379629 1392060 1395768 1389573 1373348 1348086 1315068 1275510 1230952 1183267 1134059 1084587
50352A084587m8343m5852m2861m0199l7671l4715l1604k8893k6253k2949j9274
$$ 1084587 1036244 990392 947531 907332 869661 834946 803342 774449 748196 725247 705973
50341G05973j6296j4276j2436j0351q405o776m927k516jJ952L177L932M691O043
$$ 705973 689677 675401 662965 652614 644209 637433 632506 629990 629989 631941 635118 639050 643741 649784
50327F49784Q264J0909J3218J4854J5914J6514J6902J7603J8839K0051K0683K1031
$$ 649784 658048 668957 682175 697029 712943 729457 746359 763962 782801 802852 823535 844566
50315H44566K1671K2523K3304K4353K5970K7472K8075K8230K8774K9131K7983
$$ 844566 866237 888760 912064 936417 962387 989859 1017934 1046164 1074938 1104069 1132052
50304A132052K5556K3479K2228K0515J7672J4920J3368J2230J0070O759L246J38
$$ 1132052 1157608 1181087 1203315 1223830 1241502 1256422 1269790 1282020 1292090 1298849 1302095 1302233
50292A302233k433m272n318o011o849q000r756j2836j7656k3682k9875l5353l9482
$$ 1302233 1299800 1295528 1290210 1284199 1277350 1269350 1259594 1246758 1229102 1205420 1175545 1140192 1100710
50279A100710m1940m2976m3047m2082l9736l6487l3563l1492k9601k7344k5174
$$ 1100710 1058770 1015794 972747 930665 890929 854442 820879 789387 759786 732442 707268
50268G07268k3607k2326k0880j9489j8405j7155j5158j2717j0696r464q633p580
$$ 707268 683661 661335 640455 620966 602561 585406 570248 557531 546835 537371 528738 521158
50256E21158n938l938k400j937k079j785q72j29J43N79J439J964J665J335J899
$$ 521158 515220 511282 508882 506945 504866 503081 502209 502080 502223 502802 504241 506205 507870 509205 511104
50241E11104L042L781L779L303K439J232J34m19o26r29j330j680k119k731l151
$$ 511104 514146 517927 521706 525009 527448 528680 528814 528395 527769 526840 525510 523830 521711 518980 515829
50226E15829l135l025l157l263l025k699k568k309j606r06p84r99r15n14k15%
$$ 515829 512694 509669 506512 503249 500224 497525 494957 492648 491042 490136 489352 488353 487438 486924 486709 486709
50210D86709N36J433K317K951L242L013K391K081K575L326L476L211L536M727
$$ 486709 487245 488678 490995 493946 497188 500201 502592 504673 507248 510574 514050 517261 520797 525524
50196E25524N813N809M852L877L522L614L539K937K141J762J818J590N48q77j899
$$ 525524 531337 537146 541998 545875 549397 553011 556550 559487 561628 563390 565208 566798 567346 566469 564570
50181E64570k465l264m734o507p882q557q729q633q165p004n123k983j083N31
$$ 564570 562105 558841 554107 547600 539718 531161 522432 513799 505634 498630 493507 490524 489441 489972
50167D89972J991L168L920M506N191N539M804L017R18j072l103n041o343o910
$$ 489972 491963 495131 499051 503557 508748 514287 519091 522108 523026 521954 518851 513810 507467 500557
50153E00557p214p329o822n824n112m808m082k723j755j808j998j369m23n8j5
$$ 500557 493343 486014 479192 473368 468256 463448 459366 456643 454888 453080 451082 449713 449290 449232 449217
50138D49217M39J053J168J115J608K202J839Q21P33K247M269N459N612N197M542
$$ 449217 449656 450709 451877 452992 454600 456802 458641 459462 460195 462442 466711 472170 477782 482979 487521
50123D87521L887L534L494L396K993K424J938J679J661J624J020l06j638k107
$$ 487521 491408 494942 498436 501832 504825 507249 509187 510866 512527 514151 515171 514865 513227 511120
50109E11120j786j520j805k374k747k700k183j363o38j82L88J434K609L265L397
$$ 511120 509334 507814 506009 503635 500888 498188 496005 494642 494004 493822 494210 495644 498253 501518 504915
50094E04915L510L809M095M326M680N107N522O198P403Q775R716J0310J1094J2113
$$ 504915 508425 512234 516329 520655 525335 530442 535964 542162 549565 558340 568056 578366 589460 601573
50080F01573J2959J3686J4783J6202J7283J7824J8403J9343K0227K0702K1059
$$ 601573 614532 628218 643001 659203 676486 694310 712713 732056 752283 772985 794044
50069G94044K1442K1241J9893J7915J6439J5883J5648J5090J4363J4192J5043
$$ 794044 815486 836727 856620 874535 890974 906857 922505 937595 951958 966150 981193
50058I81193J6709J8746K1100K4215K8413L3461L8910M4724N1294N8981O7886
$$ 981193 997902 1016648 1037748 1061963 1090376 1123837 1162747 1207471 1258765 1317746 1385632
50047A385632P7973Q9054J00638J11892J21573J27870J28686J22678J10146R2793
$$ 1385632 1463605 1552659 1653297 1765189 1886762 2014632 2143318 2265996 2376142 2468935
50037B468935P2747N2109L3107J8023Q491M854O126J0480J5886K0390K2005J8646
$$ 2468935 2541682 2593791 2626898 2644921 2653412 2658266 2664392 2674872 2690758 2711148 2733153 2751799
50025B751799Q732p956l0127n5581q1602j05095j23369j35336j41489j42577j38882
$$ 2751799 2760531 2752575 2722448 2666867 2585265 2480170 2356801 2221465 2079976 1937399 1798517
50014A798517j31117j20970j09984r8524q6556p4792o4211n4950m6638l9511l4130
$$ 1798517 1667400 1546430 1436446 1337922 1251366 1176574 1112363 1057413 1010775 971264 937134
50003I37134l0185k6639k3028j9795j7235j4992j2740j0679r037p737o707o089
$$ 937134 906949 880310 857282 837487 820252 805260 792520 781841 772804 765067 758360 752271
49991G52271n976o306p051q055q800q849q508q476q874r091q631p592o322n120
$$ 752271 746295 739989 732938 724883 716083 707234 698726 690250 681376 672285 663654 656062 649740 644620
49977F44620m281l897l536k632j315l26k3M3M61J346K522L868N232O395P294Q010
$$ 644620 640339 636442 632906 630274 628959 628633 628610 628653 629114 630460 632982 636850 642082 648477 655771 663781
49961F63781Q495Q601Q521Q815R793J1168J2395J3201J3672J4022J4477J5204
$$ 663781 672276 680877 689398 698213 708006 719174 731569 744770 758442 772464 786941 802145
49949H02145J6273J7654J9247K0938K2713K4716K7062K9626L2255L5106L8501
$$ 802145 818418 836072 855319 876257 898970 923686 950748 980374 1012629 1047735 1086236
49938A086236M2538M7357N3639O2153P2741Q4498R7201J11632J28190J46046J64068
$$ 1086236 1128774 1176131 1229770 1291923 1364664 1449162 1546363 1657995 1786185 1932231 2096299
49927B096299J81356J95983K04354K03398J93186J76488J56280J34741J14153
$$ 2096299 2277655 2473638 2677992 2881390 3074576 3251064 3407344 3542085 3656238
49918C656238R7052Q5061P8337P6160P7250P9568Q0688P8430P0567N4453K8490
$$ 3656238 3753290 3838351 3916688 3992848 4070098 4149666 4230354 4308784 4379351 4433804 4462294
49907D462294n738m3666q0516j13367j40736j61577j75447j83154j86497j87276
$$ 4462294 4456556 4412890 4332374 4219007 4078271 3916694 3741247 3558093 3371596 3184320
49897C184320j86467j83913j78907j71379j62400j53123j43642j33523j23033
$$ 3184320 2997853 2813940 2635033 2463654 2301254 2148131 2004489 1870966 1747933
49888A747933j12963j03463r4067q4736p5956o7786n9867n2385m6103m1178l6867
$$ 1747933 1634970 1531507 1437440 1352704 1276748 1208962 1149095 1096710 1050607 1009429 972562
49877I72562l2614k8678k5485k3170k1879k1672k1885k1464k0242j9141j8805
$$ 972562 939948 911270 885785 862615 840736 819064 797179 775715 755473 736332 717527
49866G17527j8817j8557j8023j7383j6467j5157j3686j2203j0504q599o971n906
$$ 717527 698710 680153 662130 644747 628280 613123 599437 587234 576730 568131 561160 555254
49854E55254n095m230l468k980k539j923j397j394j884k355k210j229J27R47P50
$$ 555254 550159 545929 542461 539481 536942 535019 533622 532228 530344 527989 525779 524550 524677 525624 526374
49839E26374O2k77j33Q8L36R42J912K946L998N141O040O387O752P930R622J0747
$$ 526374 526436 526159 526026 526114 526450 527392 529304 532250 536248 541389 547429 553816 560568 568498 578120 588867
49823E88867J1108J1661J3001J4825J6996K0023K3969K8090L2140L6996M3360
$$ 588867 599975 611636 624637 639462 656458 676481 700450 728540 760680 797676 841036
49812H41036N0693N8246O6424P6324Q8364J01910J15785J28655J39189J46127
$$ 841036 891729 949975 1016399 1092723 1181087 1282997 1398782 1527437 1666626 1812753
49802A812753J48041J43271J30881J11912Q9052O5186M2914K5072J3998R830J0654
$$ 1812753 1960794 2104065 2234946 2346858 2435910 2501096 2544010 2569082 2583080 2592910 2603564
49791B603564J4738K1308K8616L2784K9809J8038j999k8937o0514r3017j22252
$$ 2603564 2618302 2639610 2668226 2701010 2730819 2748857 2746858 2717921 2657407 2564390 2442138
49780B442138j45089j59798j65786j64025j57020j47154j35216j21203j06053
$$ 2442138 2297049 2137251 1971465 1807440 1650420 1503266 1368050 1246847 1140794
49771A140794r1611p9165o8786n9925n2041m4823l8430l3231k9038k5054k1038
$$ 1140794 1049183 970018 901232 841307 789266 744443 706013 672782 643744 618690 597652
49760E97652j7806j5995j4908j3377j1278r387q170p480p085o769o130m991l812
$$ 597652 579846 563851 548943 535566 524288 514901 506731 499251 492166 485397 479267 474276 470464
49747D70464l130k863k635k397k260k120j997k285l082l684l385k372j301m29
$$ 470464 467334 464471 461836 459439 457179 455059 453062 450777 447695 444011 440626 438254 436953 436524
49733D36524K74O57O89P57J016R42J50q44j364j566j963k453k606k459k268j957
$$ 436524 436798 437455 438144 438901 439917 440859 441009 440165 438801 437235 435272 432819 430213 427754 425486 423529
49717D23529j549j527j951j923q83K08J32p18r99n58l96q00r79n66j04J77O43
$$ 423529 421980 420453 418502 416579 415696 415904 416036 415318 414319 413761 413365 412565 411586 411020 410916 411093 411736
49700D11736J130Q39j66o06K72J637K334K299K005J493P31K67O11J307J431Q35
$$ 411736 412866 413705 413539 412933 413205 414842 417176 419475 421480 422973 423704 423971 424582 425889 427320 428155
49684D28155K18J14L27L67R8j95k23m7J6j66l44l60n02r66j138j06J972L677L833
$$ 428155 428373 428487 428814 429181 429279 429084 428861 428814 428830 428664 428320 427960 427458 426492 425354 425248 427220 430897 434730
$$ [...]
##END NTUPLES=NMR SPECTRUM
##END=
