
##TITLE=AC1357_GUARH12176_6672443_vCM8YDQbAB
##JCAMPDX= 6.0         $$ Bruker NMR JCAMP-DX V2.0
##DATA TYPE= NMR SPECTRUM
##DATA CLASS= NTUPLES
##ORIGIN= BRUKER
##OWNER= Administrator
$$ 1.72 TOPSPIN		Version 2.1
$$ 2012-08-14 16:48:31.921 -0500  Administrator@TOPSPIN
$$ Compression mode = diff/dup
##.OBSERVE FREQUENCY= 400.02188249412
##.OBSERVE NUCLEUS= ^1H
##.ACQUISITION MODE= SIMULTANEOUS (DQD)
##.ACQUISITION SCHEME= undefined
##.AVERAGES= 8
##.DIGITISER RES= 22
##SPECTROMETER/DATA SYSTEM= spect
##.PULSE SEQUENCE= zg30
##.SOLVENT NAME= COFFEE_meoh
##.SHIFT REFERENCE= INTERNAL, COFFEE_meoh, 1, 14.98509
##AUDIT TRAIL= $$ (NUMBER, WHEN, WHO, WHERE, PROCESS, VERSION, WHAT)
$$ ##TITLE= Audit trail, TOPSPIN		Version 2.1
$$ ##JCAMPDX= 5.01
$$ ##ORIGIN= Bruker BioSpin GmbH
$$ ##OWNER= Administrator
$$ $$ C:\Bruker\TOPSPIN/data/COFFEE/nmr/AC1357_GUARH12176_6672443_vCM8YDQbAB/10/pdata/1/auditp.txt
$$ ##AUDIT TRAIL=  $$ (NUMBER, WHEN, WHO, WHERE, PROCESS, VERSION, WHAT)
(   1,<2012-08-14 16:47:55.843 -0500>,<Administrator>,<TOPSPIN>,<go>,<TOPSPIN 2.1>,
      <created by zg
	started at 2012-08-14 16:46:46.578 -0500,
	POWCHK enabled, PULCHK disabled,
       configuration hash MD5:
       6B 1B 68 BB D9 2E 58 E2 7F 35 AD 54 07 DF 0E 41
       data hash MD5: 64K
       9F 63 A4 1A 25 AE 38 2F 7C 73 C1 4A 56 0D 22 0F>)
(   2,<2012-08-14 16:48:17.734 -0500>,<Administrator>,<TOPSPIN>,<proc1d>,<TOPSPIN 2.1>,
      <Start of raw data processing
       efp LB = 0 FT_mod = 6 PKNL = 1 PHC0 = 0 PHC1 = 0 SI = 32K 
       data hash MD5: 32K
       AE 59 3A B6 D1 7B E2 29 10 19 3A 82 35 84 95 52>)
(   3,<2012-08-14 16:48:18.703 -0500>,<Administrator>,<TOPSPIN>,<proc1d>,<TOPSPIN 2.1>,
      <pk PHC0 = 176.7371 PHC1 = 0 
       data hash MD5: 32K
       AA 19 93 D8 E1 B7 B7 6A 96 00 1D 06 F6 0E 8F F5>)
(   4,<2012-08-14 16:48:19.171 -0500>,<Administrator>,<TOPSPIN>,<proc1d>,<TOPSPIN 2.1>,
      <abs ABSG = 1 
       data hash MD5: 32K
       EF 9A 50 7C 78 C0 D2 C2 42 71 98 62 20 4C 1A E0>)
(   5,<2012-08-14 16:48:19.453 -0500>,<Administrator>,<TOPSPIN>,<proc1d>,<TOPSPIN 2.1>,
      <abs ABSG = 2 
       data hash MD5: 32K
       11 8A F7 CF 1E 1C 59 10 39 23 82 BE 2C FD 64 15>)
(   6,<2012-08-14 16:48:19.781 -0500>,<Administrator>,<TOPSPIN>,<proc1d>,<TOPSPIN 2.1>,
      <abs ABSG = 3 
       data hash MD5: 32K
       46 12 CF 6C EB 4D 86 15 27 D7 DE C9 DA 8E 15 68>)
(   7,<2012-08-14 16:48:20.187 -0500>,<Administrator>,<TOPSPIN>,<proc1d>,<TOPSPIN 2.1>,
      <abs ABSG = 4 
       data hash MD5: 32K
       C2 A9 DA F9 9D D2 B0 87 B4 BD DD 74 B8 7B 17 78>)
(   8,<2012-08-14 16:48:20.500 -0500>,<Administrator>,<TOPSPIN>,<proc1d>,<TOPSPIN 2.1>,
      <abs ABSG = 5 
       data hash MD5: 32K
       00 06 46 49 62 91 40 FD CA 57 D0 A0 DB 8D 38 22>)
$$ ##END=
$$ 
$$ $$ hash MD5
$$ $$ A5 7A 37 30 1C 9B B8 83 52 69 E4 BD 82 12 A4 53
##$RELAX= 
##$RELAX= 
##$RELAX= 
##$RELAX= 
##$RELAX= 
##$RELAX= 
##$RELAX= 
$$ Bruker specific parameters
$$ --------------------------
$$ [...]
##$TP= (0..7)
150 150 150 150 150 150 150 150
##$TP07= 0
##$TPNAME0= <>
##$TPNAME1= <>
##$TPNAME2= <>
##$TPNAME3= <>
##$TPNAME4= <>
##$TPNAME5= <>
##$TPNAME6= <>
##$TPNAME7= <>
##$TPOAL= (0..7)
0.5 0.5 0.5 0.5 0.5 0.5 0.5 0.5
##$TPOFFS= (0..7)
0 0 0 0 0 0 0 0
##$TUNHIN= 0
##$TUNHOUT= 0
##$TUNXOUT= 0
##$USERA1= <user>
##$USERA2= <user>
##$USERA3= <user>
##$USERA4= <user>
##$USERA5= <user>
##$V9= 5
##$VALIST= <valist>
##$VCLIST= <CCCCCCCCCCCCCCC>
##$VD= 0
##$VDLIST= <DDDDDDDDDDDDDDD>
##$VPLIST= <PPPPPPPPPPPPPPP>
##$VTLIST= <TTTTTTTTTTTTTTT>
##$WBST= 1024
##$WBSW= 4
##$XGAIN= (0..3)
0 0 0 0
##$XL= 0
##$YL= 0
##$YMAX_a= 506142
##$YMIN_a= -646091
##$ZGOPTNS= <>
##$ZL1= 120
##$ZL2= 120
##$ZL3= 120
##$ZL4= 120
##$ABSF1= 14.98509
##$ABSF2= -5.573092
##$ABSG= 5
##$ABSL= 3
##$ALPHA= 0
##$AQORDER= 0
##$ASSFAC= 0
##$ASSFACI= 0
##$ASSFACX= 0
##$ASSWID= 0
##$AUNMP= <proc_prof1d_extract_pilot.lims>
##$AXLEFT= 0
##$AXNAME= <>
##$AXNUC= <1H>
##$AXRIGHT= 0
##$AXTYPE= 0
##$AXUNIT= <>
##$AZFE= 0.1
##$AZFW= 0.1
##$BCFW= 0
##$BC_mod= 0
##$BYTORDP= 0
##$COROFFS= 0
##$CY= 15
##$DATMOD= 1
##$DC= 0
##$DFILT= <>
##$DTYPP= 0
##$F1P= 0
##$F2P= 0
##$FCOR= 0.5
##$FTSIZE= 32768
##$FT_mod= 6
##$GAMMA= 0
##$GB= 0
##$INTBC= 1
##$INTSCL= 1
##$ISEN= 128
##$LB= 0
##$LEV0= 0
##$LPBIN= 0
##$MAXI= 10000
##$MC2= 0
##$MEAN= 0
##$ME_mod= 0
##$MI= 0
##$NCOEF= 0
##$NC_proc= -8
##$NLEV= 6
##$NOISF1= 0
##$NOISF2= 0
##$NSP= 0
##$NTH_PI= 0
##$NZP= 0
##$OFFSET= 14.98509
##$PC= 1
##$PHC0= 176.7371
##$PHC1= 0
##$PH_mod= 1
##$PKNL= yes
##$PPARMOD= 0
##$PPDIAG= 0
##$PPIPTYP= 0
##$PPMPNUM= 2147483647
##$PPRESOL= 1
##$PSCAL= 4
##$PSIGN= 0
##$PYNMP= <proc.py>
##$REVERSE= no
##$SF= 400.02
##$SI= 32768
##$SIGF1= 0
##$SIGF2= 0
##$SINO= 400
##$SIOLD= 32768
##$SPECTYP= <>
##$SREGLST= <1H.CDCl3>
##$SSB= 0
##$STSI= 32768
##$STSR= 0
##$SW_p= 8223.68421052631
##$SYMM= 0
##$S_DEV= 0
##$TDeff= 65536
##$TDoff= 0
##$TI= <>
##$TILT= no
##$TM1= 0
##$TM2= 0
##$TOPLEV= 0
##$USERP1= <user>
##$USERP2= <user>
##$USERP3= <user>
##$USERP4= <user>
##$USERP5= <user>
##$WDW= 1
##$XDIM= 32768
##$YMAX_p= 468363089
##$YMIN_p= -669171
##$CURPLOT= <Network HP LaserJet P1505>
##$CURPRIN= <$Network HP LaserJet P1505>
##$DFORMAT= <normdp>
##$LAYOUT= <+/1D_H.xwp>
##$LFORMAT= <normlp>
##$PFORMAT= <normpl>
##$SURQMSG= 1
$$ End of Bruker specific parameters
$$ ---------------------------------
##NTUPLES= NMR SPECTRUM
##VAR_NAME=  FREQUENCY,     SPECTRUM/REAL,   SPECTRUM/IMAG
##SYMBOL=    X,             R,               I
##VAR_TYPE=  INDEPENDENT,   DEPENDENT,       DEPENDENT
##VAR_FORM=  AFFN,          ASDF,            ASDF
##VAR_DIM=   32768,         32768,           32768
##UNITS=     HZ,            ARBITRARY UNITS, ARBITRARY UNITS
##FACTOR=    0.250966925370066, 1,           1
##FIRST=     8223.43324360094, -33588,       2160
##LAST=      0,             -123433,         45111
##MIN=       0,             -669171,         0
##MAX=       8223.43324360094, 468363089,    0
$$ Real data points
##PAGE= N=1
##DATA TABLE= (X++(R..R)), XYDATA
$$ [...]
19563A97873f6158A97384J9811d3123B5152K7821a84136k3359r9091h4680D2165
$$ 197873 -66158 197384 217195 -43123 25152 52973 -184136 -207495 -306586 -84680 42165
19551e3117A91279o8057C0869d171j14761D96143b52229B2772K23127a38719j57874
$$ -53117 191279 123222 30869 -4171 -118932 496143 -252229 22772 245899 -138719 -296593
19540b96593A26288K4488N328a74266B68166a16371N359B5310O5541K293g9694
$$ -296593 126288 150776 156104 -174266 268166 -116371 -111012 25310 90851 93144 -79694
19528D2546a14840o1229A16620b97352J23726A18302a20183A25450a29150h014
$$ 42546 -114840 -176069 116620 -297352 -173626 118302 -120183 125450 -129150 -8014
19517a10761A42894a13785o0937H1853d00720e8921a9394j69224m8166N0734G4457
$$ -110761 142894 -113785 -174722 81853 -400720 -58921 -19394 -188618 -236784 -186050 74457
19505B3338h127k24681A54176b15665l40315B6785L86b26125p1119J04378B52480
$$ 23338 -8127 -232808 154176 -215665 -555980 26785 27171 -226125 -297244 -192866 252480
19493a88081j09567d5338B28512c35469J42675A03307c16264e6584l58867i9771
$$ -188081 -297648 -45338 228512 -335469 -192794 103307 -316264 -56584 -415451 -99771
19482F6004J03556B3288g5189j5461A87368a50988m2722B17653b3592k0739F3343
$$ 66004 169560 23288 -75189 -90650 187368 -150988 -193710 217653 -23592 -44331 63343
19470a93494j44741j22400J39551J58029C54396f9367n5766n4242M4695k8587
$$ -193494 -338235 -460635 -321084 -163055 354396 -69367 -125133 -179375 -134680 -163267
19460a63267A28283a37869d1281B3509b92792D2536N1622L1681k1931h1788L9954
$$ -163267 128283 -137869 -41281 23509 -292792 42536 94158 125839 103908 -81788 -41834
19449d1834p3074G6170j7776b1084q4257c3341p679A33307a59728P2329L2542
$$ -41834 -114908 76170 58394 -21084 -105341 -33341 -41020 133307 -159728 -87399 -54857
19438e4857j70011l63061A66684L4593a53590k1112B8674c2333n0279j43664J0501
$$ -54857 -224868 -587929 166684 201277 -153590 -174702 28674 -32333 -82612 -226276 -215775
19427b15775J01234p7082O5824j11033a12952L3484K7609K2626o849A91702D2532
$$ -215775 -114541 -191623 -125799 -236832 -112952 -79468 -51859 -29233 -36082 191702 42532
19415A18298J865i5922p0589k0301o9961d0267B05258c47723a24422k214C42982
$$ 118298 120163 -95922 -166511 -186812 -256773 -40267 205258 -347723 -124422 -126636 342982
19403B63320a88708O2911E1018Q98R7028b47842j31562a68933l04048A75747a86868
$$ 263320 -188708 -125797 51018 51916 148944 -247842 -379404 -168933 -472981 175747 -186868
19391B01553M8666o0571a23543B47172i506m4239B06853b66671C17643a9295B5572
$$ 201553 250219 189648 -123543 247172 -9506 -53745 206853 -266671 317643 -19295 25572
19379b51437c9724o7240M7757k33422r0365K1463D4236a99280P6532A38788a68612
$$ -251437 -39724 -106964 -59207 -292629 -382994 -361531 44236 -199280 -122748 138788 -168612
19367B52758a7550B61910A04355J35160o7049g4800h961l5615j60692A00245d6138
$$ 252758 -17550 261910 104355 239515 172466 -74800 -8961 -44576 -205268 100245 -46138
19355e4584j68300B69779c06027J33394n2025R9725A591a82637B09731a7632A16216
$$ -54584 -222884 269779 -306027 -172633 -224658 -124933 1591 -182637 209731 -17632 116216
19343A29968a18475K0289q0070C0459M5806J10733j1250a83398a9375B03022a81267
$$ 129968 -118475 -98186 -178256 30459 76265 186998 175748 -183398 -19375 203022 -181267
19331i0754n2885n5750I2838c24058r9105h3747j28390K5410p9483H5824J67757
$$ -90754 -143639 -199389 92838 -324058 -423163 -83747 -212137 -186727 -266210 85824 253581
19320B53581c62282J15781J1583E986J55828f2551k6795B3020a70990d6360K1873
$$ 253581 -362282 -246501 -234918 5986 161814 -62551 -89346 23020 -170990 -46360 -24487
19309b4487A40478b28319n5768A95697c25439a19567k2891j99119c1244a0735
$$ -24487 140478 -228319 -284087 195697 -325439 -119567 -142458 -341577 -31244 -10735
19298d9232B85448a90543B32968a89591A55648b45965C1229a25120G8844c88008
$$ -49232 285448 -190543 232968 -189591 155648 -245965 31229 -125120 78844 -388008
19287B59479b04991c163C58263f6552A44653C6430L1502a54433l39k2872o9757
$$ 259479 -204991 -3163 358263 -66552 144653 36430 67932 -154433 -154772 -177644 -247401
19276b47401A06760L2123m0379D0161c98750e669j91709J8162A81039M7902b34303
$$ -247401 106760 138883 98504 40161 -398750 -5669 -197378 -179216 181039 228941 -234303
19264f8016o2268j75189j6663a38983j09944k15352a31316a0592o8203A35539
$$ -68016 -130284 -305473 -322136 -138983 -248927 -464279 -131316 -10592 -78795 135539
19253I660a95876q5162G0196a3665j69961J5895L7171A56884J08399a5635j09471
$$ 9660 -195876 -281038 70196 -13665 -183626 -167731 -130560 156884 265283 -15635 -125106
19242a25106B9310c7458A54654b40571d9520l8364L3480B67234a94852C4930K88048
$$ -125106 29310 -37458 154654 -240571 -49520 -87884 -54404 267234 -194852 34930 322978
19231C22978F1493A4852K2568f2860m8029j57905J07508a0277j3530A80708p1046
$$ 322978 61493 14852 37420 -62860 -110889 -268794 -161286 -10277 -23807 180708 109662
19220A09662J48994A13338a99174a997B8846J00696e9428l6723d6589j31106A69524
$$ 109662 258656 113338 -199174 -1997 28846 129542 -59428 -96151 -46589 -177695 169524
19208A48007a63288g7425A27441B1441d7265b1012l1076F2025b9893j35800M8347
$$ 148007 -163288 -77425 127441 21441 -47265 -21012 -52088 62025 -29893 -165693 -117346
19197a17346N3484p7295J781B6749e9545I5276L110B4157i189k1615l01627k231
$$ -117346 -63862 -141157 -139376 26749 -59545 95276 98386 24157 -9189 -30804 -332431 -334662
19185c34662Q593G4917b05930q4377f9919i458j880j10188A16898m8103J6047
$$ -334662 -326069 74917 -205930 -290307 -69919 -9458 -11338 -121526 116898 68795 84842
19174H4842O2401a29905j40157E2081O675B7112b05747i2468J6122I5072A1488
$$ 84842 147243 -129905 -270062 52081 58756 27112 -205747 -92468 -76346 95072 11488
19162B20717A4993a70135C64244f5498A22903b81796J02305A481J2700b92903
$$ 220717 14993 -170135 364244 -65498 122903 -281796 -179491 1481 14181 -292903
19151A45547M9025c6208D806c67289P0142a19422B05377q2283L9438g8672F6628
$$ 145547 194572 -36208 4806 -367289 -297147 -119422 205377 123094 162532 -78672 66628
19139c1880A19154c14599H4593b45431d5693j4579p3617f4785k87079Q1286i2301
$$ -31880 119154 -314599 84593 -245431 -45693 -60272 -133889 -64785 -351864 -270578 -92301
19127a98957A25839C7954e5231K400k30899e2123G8821J02399d9078D4792b62969
$$ -198957 125839 37954 -55231 -52831 -283730 -52123 78821 181220 -49078 44792 -262969
19115I2257d6653k53523j26090A46475j0122h8018o5354c4103C1835J24583b2850
$$ 92257 -46653 -300176 -426266 146475 136353 -88018 -153372 -34103 31835 156418 -22850
19103D9226j2557b55568M4588P7803J8173m2488C46243A21801b9314I918f8045
$$ 49226 36669 -255568 -210980 -133177 -115004 -157492 346243 121801 -29314 9918 -68045
19091D383g1650A7083K44598I4437a19174H3723b83550b838m00799K01560O7247
$$ 4383 -71650 17083 261681 94437 -119174 83723 -283550 -2838 -403637 -202077 -134830
19080a34830F3373a6564I6882K1464b3098k29898A06877d02918c8334n8860D3406
$$ -134830 63373 -16564 96882 118346 -23098 -252996 106877 -402918 -38334 -97194 43406
19068d248j8080k87486N1960C1519M2262b91535A43363N2158a77886J7819M2729
$$ -4248 -22328 -309814 -257854 31519 73781 -291535 143363 195521 -177886 -160067 -117338
19057a17338j47900A47731a90885e3317j2364r2700l6309A97560f8310E1819J35019
$$ -117338 -265238 147731 -190885 -53317 -65681 -158381 -194690 197560 -68310 51819 186838
19046A86838a62551d1427C51484b8614k53133A26901g0223B98186c15890J31848
$$ 186838 -162551 -41427 351484 -28614 -281747 126901 -70223 298186 -315890 -184042
19036a84042B61160e6255k17273F8282J73216a97851a7413I4588i1848I8639I392
$$ -184042 261160 -56255 -273528 68282 241498 -197851 -17413 94588 -91848 98639 9392
19024h1706O335j2117M123c1373H574J52636A7154J6587A3908M8900N03a60285
$$ -81706 -75371 -87488 -83365 -31373 8574 161210 17154 33741 13908 62808 63311 -160285
19011I0419R51a95570I8667b11382j9695c4426k31906a26846A86875E8433g6443
$$ 90419 91370 -195570 98667 -211382 -231077 -34426 -266332 -126846 186875 58433 -76443
18999d51031C23514C760M454N0376c9111j55576C04896i3158N404K7356o3377
$$ -451031 323514 3760 8214 58590 -39111 -194687 304896 -93158 -87754 -60398 -123775
18988a23775D3252L12489a69659B35814a25119A60722f0206q3423j5612j49611
$$ -123775 43252 355741 -169659 235814 -125119 160722 -60206 -143629 -159241 -308852
18978c08852A27579a37382m9329i2875m42844c5895h15k13033b4468k12340L5450
$$ -308852 127579 -137382 -186711 -92875 -535719 -35895 -815 -213848 -24468 -236808 -201358
18967b01358A81843a93427i712k8152j63272J3594Q593f5175F2977J35183H852
$$ -201358 181843 -193427 -9712 -37864 -201136 -187542 -178949 -65175 62977 198160 8852
18955a39011c825p6574j59298D5606h8068A05237a78390p5616h3548A58974a12493
$$ -139011 -3825 -80399 -239697 45606 -88068 105237 -178390 -254006 -83548 158974 -112493
18943A11742a62746c2321J3865B03249n6617B1111J18691o883c58183C30726D7230
$$ 111742 -162746 -32321 -18456 203249 146632 21111 139802 132919 -358183 330726 47230
18931C04578I6422A3119J24597e3638k9112j96125A3016i2085A28810o0285P5453
$$ 304578 96422 13119 137716 -53638 -82750 -278875 13016 -92085 128810 68525 143978
18920A43978K94101B8814R7137e7038B75299b9681A47027d07034f2081B53191
$$ 143978 438079 28814 125951 -57038 275299 -29681 147027 -407034 -62081 253191
18909H838b80182A71337o7465k1581a05683M3231G2479a37112M8791A62705C6857
$$ 8838 -280182 171337 103872 82291 -105683 -62452 72479 -137112 -88321 162705 36857
18897a54059a6272A64743e1035m0674b7981j28578b1732n43558b08299O8702H4600
$$ -154059 -16272 164743 -51035 -91709 -27981 -156559 -21732 -565290 -208299 -139597 84600
18885a62836A96293A9680e4449j41746Q2348A24997e6839A26173h384A03823g9491
$$ -162836 196293 19680 -54449 -196195 -113847 124997 -56839 126173 -8384 103823 -79491
18873E8009i8418d93q002n2613C3666J24065c70831a3033l08875a0664j94481
$$ 58009 -98418 -493 -8495 -61108 33666 157731 -370831 -13033 -321908 -10664 -205145
18862b05145J01625A75129a00427n5957e5717k46860L6976E9108b524A35639F3092
$$ -205145 -103520 175129 -100427 -156384 -55717 -302577 -265601 59108 -2524 135639 63092
18850d74991A83421c6569A29247E9985B5172b30060L1493O7188O3750b8768l06380
$$ -474991 183421 -36569 129247 59985 25172 -230060 -198567 -131379 -67629 -28768 -335148
18839c35148J50386D2245c65617a78162k28555f209j20270A33165n7128a32208
$$ -335148 -184762 42245 -365617 -178162 -406717 -6209 -126479 133165 76037 -132208
18828A55577h4022D391L54018G7337O4143c3182k71291c5888G107d6454j81741
$$ 155577 -84022 4391 358409 77337 141480 -33182 -304473 -35888 7107 -46454 -228195
18817b28195O2614O1683F2981b69678A73114a22863h588j73809O1346N1424G7319
$$ -228195 -165581 -103898 62981 -269678 173114 -122863 -8588 -182397 -121051 -69627 77319
18805A0233K5825b47234G872b95907e425A0585a83591f8878B6186J8192b2504
$$ 10233 36058 -247234 7872 -295907 -5425 10585 -183591 -68878 26186 44378 -22504
18793b82367C43358Q1458B9995J40547h2118A7630J5968J75957I5436P8428j646
$$ -282367 343358 424816 29995 170542 -82118 17630 33598 209555 95436 173864 172218
18782A72218H2737J8653c8891k88901N9580J29870c1292A37728e1417k53922k49551
$$ 172218 82737 101390 -38891 -327792 -268212 -138342 -31292 137728 -51417 -305339 -554890
18771e54890a2862A93144C390a82991j48831K6670J4131A32282c19904a23150
$$ -554890 -12862 193144 3390 -182991 -331822 -305152 -291021 132282 -319904 -123150
18760b18000I9923a18294C72329j30282A15431e24653G2885J23246c98827C239
$$ -218000 99923 -118294 372329 242047 115431 -524653 72885 196131 -398827 3239
18749a49603A36593b63161F9161b66930a02123B08539p1969F1932c41873a04440
$$ -149603 136593 -263161 69161 -266930 -102123 208539 136570 61932 -341873 -104440
18738b0390F7848c86476c3968I0829b8928l6447B42875b69490F4382k208a77292
$$ -20390 67848 -386476 -33968 90829 -28928 -65375 242875 -269490 64382 62174 -177292
18726b33740h4630l8028F809a879j35696B04954a41387B60755A17356i6999D1587
$$ -233740 -84630 -122658 6809 -1879 -137575 204954 -141387 260755 117356 -96999 41587
18714B2825K6913a78728n6369G8103b06062a8828j11113p0384k5288B60460c60243
$$ 22825 49738 -178728 -235097 78103 -206062 -18828 -129941 -200325 -225613 260460 -360243
18702b8297a2139l2099m8943j18532d4230A48263a08090B38492a54302M665A05745
$$ -28297 -12139 -44238 -93181 -211713 -44230 148263 -108090 238492 -154302 -149637 105745
18690B8539K8604e7959m7522i714j44586A80231a68490a421l1194b047G2095B049
$$ 28539 57143 -57959 -105481 -9714 -154300 180231 -168490 -1421 -32615 -2047 72095 2049
18677b77393O8173C8920L5996a78492I1754M5452K13002B499J69290f5029j86999
$$ -277393 -209220 38920 74916 -178492 91754 137206 350208 2499 171789 -65029 -252028
18666b52028D6535b25955c2376k22282C9300P8260b4143j20817A02046a11726
$$ -252028 46535 -225955 -32376 -254658 39300 117560 -24143 -144960 102046 -111726
18655f6761A92010a69578g2850C64799a30380c0265I929g9031l8901A3856a28651
$$ -66761 192010 -169578 -72850 364799 -130380 -30265 9929 -79031 -117932 13856 -128651
18643b7670B89550g1475A7506K81922b70259J12139B7328b6982r490A6939d73319
$$ -27670 289550 -71475 17506 299428 -270259 -158120 27328 -26982 -36472 16939 -473319
18631f015n2040a8404O700A16953b98312L0750A36127b8027I657b5570J070j99716
$$ -6015 -58055 -18404 -11704 116953 -298312 -267562 136127 -28027 9657 -25570 -24500 -224216
18619b24216i6433l03923d0385B2349b70524a15456l682m9995n906e4966J0652
$$ -224216 -96433 -400356 -40385 22349 -270524 -115456 -119138 -169133 -175039 -54966 -44314
18608d4314B55158N4456j43717a35444A79141a78221j06458J02794f3364k6450
$$ -44314 255158 309614 165897 -135444 179141 -178221 -284679 -181885 -63364 -89814
18598h9814A82237c8758l8757n7134A49674J47538f8591H8155b6901A38382b01826
$$ -89814 182237 -38758 -77515 -134649 149674 297212 -68591 88155 -26901 138382 -201826
18586a53551d7136A67093E7988d8302j87256c6888j2086A31277B3448g2199A3112
$$ -153551 -47136 167093 57988 -48302 -235558 -36888 -48974 131277 23448 -72199 13112
18574E8239Q5058L2078F6002b38411A98901q1040j2041L1217e9216A21002E4407
$$ 58239 143297 175375 66002 -238411 198901 117861 105820 137037 -59216 121002 54407
18562b72391J4797P4643F0108a24111k8640M9248m5759K9521E7932c34079e4664
$$ -272391 -257594 -182951 60108 -124111 -152751 -103503 -149262 -119741 57932 -334079 -54664
18550b6459A36558E5797a3054H8664a45634A63163i8015B3425a52702c9122j15508
$$ -26459 136558 55797 -13054 88664 -145634 163163 -98015 23425 -152702 -39122 -154630
18539a54630B92301C0190M0773a62562P0408D4603a59404k58272l2863d7137A9234
$$ -154630 292301 30190 70963 -162562 -92154 44603 -159404 -417676 -450539 -47137 19234
18527f6984j15436A51915a90404j63365a70517L0118j16504F723a04933E1000
$$ -66984 -182420 151915 -190404 -353769 -170517 -140399 -256903 6723 -104933 51000
18516B6869J02517J4449B4776a54565o1574B2542c3064H3051b63497K5854a14951
$$ 26869 129386 143835 24776 -154565 -216139 22542 -33064 83051 -263497 -237643 -114951
18504B88027a06846l7731G5374J55051o3572a8852D9751J19891f1370o6823j51009
$$ 288027 -106846 -144577 75374 230425 166853 -18852 49751 169642 -61370 -128193 -279202
18493b79202M6834l2622A07466k2932a96841l88741B93221a36242j2515A1097
$$ -279202 -232368 -264990 107466 84534 -196841 -585582 293221 -136242 -148757 11097
18482A67599a84544J9134M754B3552a82548P3097j52636a12318B96145C2004J53658
$$ 167599 -184544 -165410 -160656 23552 -182548 -109451 -262087 -112318 296145 32004 185662
18471A85662a61253B61956h9004A23817h7253j81122j5134h716k9422n4339A93764
$$ 185662 -161253 261956 -89004 123817 -87253 -268375 -283509 -8716 -38138 -92477 193764
18459d7203J1752n1219K9758m91708A64540b1198C04293a97922A84451E8559c28492
$$ -47203 -35451 -86670 -56912 -548620 164540 -21198 304293 -197922 184451 58559 -328492
18447A25363K22853a7033k319B5127f14j81139B17467q0981d34630i5450J3075
$$ 125363 348216 -17033 -19352 25127 -614 -181753 217467 136486 -434630 -95450 -82375
18436h2375C6580i0634j29590A38690P1515q4025a96324M9412C26467a25638A31585
$$ -82375 36580 -90634 -220224 138690 210205 126180 -196324 -146912 326467 -125638 131585
18424a95861B29402i2256A5658a43635D1407c41273A54231b11495e1365k84440
$$ -195861 229402 -92256 15658 -143635 41407 -341273 154231 -211495 -51365 -335805
18414c35805a53715A48520a91380n5380h1060A17630b01151A24572c8663j08967
$$ -335805 -153715 148520 -191380 -246760 -81060 117630 -201151 124572 -38663 -147630
18404a47630d8064l13152a21239A89205a3303A82906d340j09944l86329g3632
$$ -147630 -48064 -361216 -121239 189205 -13303 182906 -4340 -114284 -500613 -73632
18393c7593k01256A91639E3213b1131j10414j23831O2285B26397I122R5087h8669
$$ -37593 -238849 191639 53213 -21131 -131545 -255376 -193091 226397 9122 104209 -88669
18381C20018H5219b98631J20417B44397B1802n23h9258J5315n0412b433C0210
$$ 320018 85219 -298631 -178214 244397 21802 21279 -89258 -73943 -124355 -2433 30210
18369d3166B38467a56081B07699A02629l6682P5003a61701g635k5793k97494a64934
$$ -43166 238467 -156081 207699 102629 65947 140950 -161701 -7635 -33428 -330922 -164934
18357A20843g7904A78072a82012j58299L6713A16141a04765j77416c4788C8493
$$ 120843 -77904 178072 -182012 -340311 -303598 116141 -104765 -282181 -34788 38493
18346a4912I6391a74153j88774A29074h0461j59003b5085E2056a46540A1815d55390
$$ -14912 96391 -174153 -362927 129074 -80461 -239464 -25085 52056 -146540 11815 -455390
18334A88408h2323o2861o6283j7639g4928A19618d74532a04240A76157K01234
$$ 188408 -82323 -145184 -211467 -229106 -74928 119618 -474532 -104240 176157 377391
18324C77391F5001R397a67555b3612B4989a18932j01870c4902r5866i296E8766
$$ 377391 65001 74398 -167555 -23612 24989 -118932 -220802 -34902 -130768 -9296 58766
18312a46369A40234O1529G3425e215A90303C3736a71426C3399h2530a8283M778
$$ -146369 140234 201763 73425 -5215 190303 33736 -171426 33399 -82530 -18283 -13505
18301a3505r4472F1527L698K77736j67170H5188c7310I2562b3580E19356B1733
$$ -13505 -107977 61527 65225 342961 175791 85188 -37310 92562 -23580 519356 21733
18289B86296b21427B31311o3476a17389A9378a27453k26746E3440b56373g8359
$$ 286296 -221427 231311 167835 -117389 19378 -127453 -354199 53440 -256373 -78359
18278A51217c55147J67641J7642k04961a42433A9948N5541p496p242N9220h3834
$$ 151217 -355147 -187506 -169864 -374825 -142433 19948 75489 67993 60751 119971 -83834
18266C3741b28458b3122k37296A32905k6777m2440a61190m8852d3031F8734I911
$$ 33741 -228458 -23122 -260418 132905 106128 63688 -161190 -210042 -43031 68734 9911
18254a85783O1631I2866K3639h0194j80012E4835O4265b49421d6149E3780g652
$$ -185783 -124152 92866 116505 -80194 -260206 54835 119100 -249421 -46149 53780 -7652
18242A4854a79487p2795B23578G0294J32428g3255A21926n8213A53L08168A4404
$$ 14854 -179487 -252282 223578 70294 202722 -73255 121926 63713 153 308321 14404
18230A81593d5702j30115g625A19930a51544B17348G2783a08494A225K29934a94910
$$ 181593 -45702 -175817 -7625 119930 -151544 217348 72783 -108494 1225 231159 -194910
18218a23427o3289A44838J41475b83647B16429b6695C54290a80381B26095A1362
$$ -123427 -186716 144838 286313 -283647 216429 -26695 354290 -180381 226095 11362
18207d05609B13681c21732J55362J8919A65234p4645a52364g4976j89788k79866
$$ -405609 213681 -321732 -166370 -147451 165234 90589 -152364 -74976 -264764 -544630
18197e44630B6540r90g3357k94502J56423I2923c38694O7697D6775L4562c90793
$$ -544630 26540 25550 -73357 -367859 -211436 92923 -338694 -270997 46775 81337 -390793
18185A12646m5090b92762R6840A01635N2281J09401b19798D6649a53169P3671
$$ 112646 67556 -292762 -195922 101635 153916 263317 -219798 46649 -153169 -79498
18175g9498A3684K8396L0033a77177A84622b66037R6805B90810A06625a12048
$$ -79498 13684 42080 72113 -177177 184622 -266037 -169232 290810 106625 -112048
18164H0916d9534A81968o8873C3373J5057e8193D11975a56621j52824e8286J163
$$ 80916 -49534 181968 113095 33373 48430 -58193 411975 -156621 -309445 -58286 -57123
18153e7123J1455R156H6120Q4678J98364j44708E9373c53204A58565j8642a00224
$$ -57123 -45668 -36512 86120 170798 369162 224454 59373 -353204 158565 139923 -100224
18141f7546E5522K7764c93892A32905Q287m9899a8674D6952a60843j5780f4553
$$ -67546 55522 83286 -393892 132905 141192 91293 -18674 46952 -160843 -176623 -64553
18129c08617k2307c1761A11112k3459j866N9592d34470B85661a34328A10137l1155
$$ -308617 -330924 -31761 111112 87653 85787 145379 -434470 285661 -134328 110137 78982
18118G8982a33925B9502J68806b06001H1954f311l6036k93416G2794O4454b3017
$$ 78982 -133925 29502 198308 -206001 81954 -6311 -42347 -335763 72794 137248 -23017
18106b72533D0030a90198K0464e7421l57074j3298K12332A48383j9352k7529a41444
$$ -272533 40030 -190198 -169734 -57421 -414495 -427793 -215461 148383 129031 101502 -141444
18094a34273A81205a43041A27219a48887A4835a73608P3124d7389A83972b6713
$$ -134273 181205 -143041 127219 -148887 14835 -173608 -100484 -47389 183972 -26713
18083A688d1258C37598r4063d1360m04351K12206E8114M6823h5436A79956m7540
$$ 1688 -41258 337598 243535 -41360 -445711 -233505 58114 104937 -85436 179956 132416
18072A32416o4453R2342A017b31601b1950O267j07005K8063j51147c0332B41590
$$ 132416 67963 160305 1017 -231601 -21950 -15683 -122688 -94625 -245772 -30332 241590
18060a67527B08555n5482a51923j56422J15629c662n262j40185F1587K2948B9812
$$ -167527 208555 153073 -151923 -308345 -192716 -3662 -8924 -149109 61587 84535 29812
18048a49160A19771d5838C44401g4409H7199a8524j07020A67144b05247A99109
$$ -149160 119771 -45838 344401 -74409 87199 -18524 -125544 167144 -205247 199109
18037b39436F5939a48227j15068D0601b19641p3117J03339A11167a53195C912
$$ -239436 65939 -148227 -263295 40601 -219641 -292758 -189419 111167 -153195 3912
18026B6240a25848n5791c8012J508l20765I6418a98585B22174d2830j20708a990
$$ 26240 -125848 -181639 -38012 -36504 -357269 96418 -198585 222174 -42830 -163538 -1990
18014a5887c955j49318C1537a6897p3619i321r5143B16758b42438a01088p5408
$$ -15887 -3955 -153273 31537 -16897 -90516 -9321 -104464 216758 -242438 -101088 -176496
18003a76496k1906a5872n7035L5180A47338A0627f3745A44218o9412B9929b53490
$$ -176496 -198402 -15872 -72907 -37727 147338 10627 -63745 144218 74806 29929 -253490
17991B32064F2773E180a53836C27353a44234e5413m9428j46234I7809J12850b68765
$$ 232064 62773 5180 -153836 327353 -144234 -55413 -104841 -251075 97809 210659 -268765
17979B1455J37111a54926j57782C01594G8563c46604a32441q1890d0926k91711
$$ 21455 158566 -154926 -312708 301594 78563 -346604 -132441 -214331 -40926 -332637
17969c32637A66578e6916A10036k5345a16785D64750i2703m9291A11679b61327
$$ -332637 166578 -56916 110036 84691 -116785 464750 -92703 -141994 111679 -261327
17958b58563P5569j90115d8708I0981D3748d7208A33964a40475B4999b06650o265
$$ -258563 -182994 -373109 -48708 90981 43748 -47208 133964 -140475 24999 -206650 -212915
17947b12915A17612J21165c24639F2302a01458A33629a30060B89562e1852B71118
$$ -212915 117612 238777 -324639 62302 -101458 133629 -130060 289562 -51852 271118
17936g5072j92613A3540c6514I2989b07786h4828c6947A49763a32152D87057A38017
$$ -75072 -267685 13540 -36514 92989 -207786 -84828 -36947 149763 -132152 487057 138017
17924E9068a44262H7732C430K2126K79898b65148B40679G6512K15080o462A633
$$ 59068 -144262 87732 3430 25556 305454 -265148 240679 76512 291592 285130 1633
17912g7111C6863m054d77554A40219k5122g4303n9450e4723p6408E2138b81825
$$ -77111 36863 32809 -477554 140219 115097 -74303 -133753 -54723 -131131 52138 -281825
17900a25621C77107j27604A0571R5178c3082n5883A25598H325J56050C8380J42718
$$ -125621 377107 249503 10571 105749 -33082 -88965 125598 8325 164375 38380 181098
17889A81098d4528k86954Q013D0649J00926c7910E7658Q2031o0493b7365D3407
$$ 181098 -44528 -331482 -323469 40649 141575 -37910 57658 139689 79196 -27365 43407
17877c2735H77h8423C18540A6297e8076k82128A26220b2949n854C16862A47948
$$ -32735 877 -88423 318540 16297 -58076 -340204 126220 -22949 -28803 316862 147948
17865a468j73352H1303M6576a72712f8098k4991j60467a5699I239L05585G3755
$$ -1468 -174820 81303 127879 -172712 -68098 -93089 -253556 -15699 9239 314824 73755
17853c8508F9320e0724k53851f6623j26496C9168f9925A41825d1582k60952D0666
$$ -38508 69320 -50724 -304575 -66623 -193119 39168 -69925 141825 -41582 -302534 40666
17841F5689a86518B58703P074a98317h9784p9889G4842N1164j7510e5410C15662
$$ 65689 -186518 258703 265777 -198317 -89784 -169673 74842 126006 108496 -55410 315662
17829h9613C7656M7255i7957k0748A4528a48360B25805B3558b07937C9548J18045
$$ -89613 37656 84911 -97957 -118705 14528 -148360 225805 23558 -207937 39548 157593
17818A57593c0604A12931P9730g2261I3759a71829e8279A72308p5297b43533c1750
$$ 157593 -30604 112931 192661 -72261 93759 -171829 -58279 172308 97011 -243533 -31750
17806I2869d11956A5596J1381b5964C35395L2488g5147b6569p5937C00249H3144
$$ 92869 -411956 15596 26977 -25964 335395 367883 -75147 -26569 -102506 300249 83144
17794a14724a4567j38585C8779j5144J12429i7752A95598D2050K46918H0282Q5406
$$ -114724 -14567 -153152 38779 23635 136064 -97752 195598 42050 288968 80282 165688
17783A65688e3777a8686A05193P4221a32482B90673a73310O4353o7789A96105
$$ 165688 -53777 -18686 105193 179414 -132482 290673 -173310 -108957 -176746 196105
17772H5157J402M000a37491A41677a46977a9765I0278J26053g7939A78459K0796
$$ 85157 86559 90559 -137491 141677 -146977 -19765 90278 216331 -77939 178459 199255
17761A99255J06701H1561b34966N5459L9673B31139A0724a40830A57866G85h0373
$$ 199255 305956 81561 -234966 -179507 -139834 231139 10724 -140830 157866 785 -80373
17749C98397D6695d38856f8356B8452a13904l8122k0571D33673i0721E0123g3934
$$ 398397 46695 -438856 -68356 28452 -113904 -152026 -172597 433673 -90721 50123 -73934
17737a27196c8680k71441d322A73773b30458B32151B3763f1265H5900C1204a3747
$$ -127196 -38680 -310121 -4322 173773 -230458 232151 23763 -61265 85900 31204 -13747
17725a09104F6398g3734j34327M0263i713j98796B41773j10302d01232a4281D5335
$$ -109104 66398 -73734 -208061 -167798 -9713 -208509 241773 131471 -401232 -14281 45335
17713d4806A47662O9339m9115k9751B6348R9222l4099h1368k5695C38119a86662
$$ -44806 147662 217001 167886 138135 26348 125570 91471 -81368 -107063 338119 -186662
17701b7725A48049n6842K2493c64907G4996a14756G6906J5950e1472C08313E3739
$$ -27725 148049 91207 113700 -364907 74996 -114756 76906 92856 -51472 308313 53739
17689g6302j32832M7325C13854E1843a09490A43132b77085J21588K9253l5246
$$ -76302 -209134 -161809 313854 51843 -109490 143132 -277085 -155497 -126244 -161490
17679a61490q547H931f6468A49626c65433J14214C72736a70667b9083B09039d1248
$$ -161490 -170037 8931 -66468 149626 -365433 -251219 372736 -170667 -29083 209039 -41248
17667A4755J51922R9279b1413A20338J20338A17330Q4843a39029A59778B1976
$$ 14755 166677 265956 -21413 120338 240676 117330 202173 -139029 159778 21976
17656B05412r7555N2617m7746N5317k3570D651a28813e3389E898P2738a52824
$$ 205412 107857 160474 112728 168045 144475 4651 -128813 -53389 5898 78636 -152824
17644A34682a21303Q405L5940C8737R9525M3066a61151A62395D2013a50472F4515
$$ 134682 -121303 -112898 -76958 38737 138262 181328 -161151 162395 42013 -150472 64515
17632i5989A58143c19255b6122j4503B35502d9565I5645J77084a12032H6143J34464
$$ -95989 158143 -319255 -26122 -40625 235502 -49565 95645 272729 -112032 86143 220607
17621B20607a2331k71879i4108q0675A17388J67428a16466B11088b82741a33079
$$ 220607 -12331 -284210 -94108 -174783 117388 284816 -116466 211088 -282741 -133079
17610f432D6224e8128B0146Q3415a39716A08806C71f8624F5323q549O6598b70721
$$ -6432 46224 -58128 20146 103561 -139716 108806 371 -68624 65323 56774 123372 -270721
17597g4657B55386E3520J75505A8358P7312a29622A41585l5887Q8956J64240e3329
$$ -74657 255386 53520 229025 18358 95670 -129622 141585 105698 194654 358894 -53329
17585E7045L03737b02961A47530O2171G6855p402a06182K7133b2230B44296C4068
$$ 57045 360782 -202961 147530 209701 76855 69453 -106182 -79049 -22230 244296 34068
17573A28195L2458F9919e9818R030J634B34723b58559B77560H1255e9525C9901
$$ 128195 160653 69919 -59818 -50788 -49154 234723 -258559 277560 81255 -59525 39901
17561B68675B971J53508C0328i2459d0305A59593E5017L88838E4661L2984b4782
$$ 268675 2971 156479 30328 -92459 -40305 159593 55017 443855 54661 87645 -24782
17549b49439B45514a23138L2639A04134l2739K64050f5366A37191Q3077R0261
$$ -249439 245514 -123138 -90499 104134 71395 335445 -65366 137191 220268 310529
17539C10529f9786A12142J1086a25269A78941O7474J9707j31221a10629G7997
$$ 310529 -69786 112142 123228 -125269 178941 246415 266122 134901 -110629 77997
17528C15699f1802m9673J6980d3427E3775f6071A9508J13629K29109K50585C01323
$$ 315699 -61802 -111475 -94495 -43427 53775 -66071 19508 133137 362246 612831 301323
17516g5585q4509E8341B2545a33859o2841F83445A58533o8450D3282j048j7862
$$ -75585 -160094 58341 22545 -133859 -196700 683445 158533 90083 43282 42234 24372
17505B4372J96206c18975B36213q5298h4944B87163H4605C0731M40276q920A10784
$$ 24372 220578 -318975 236213 150915 -84944 287163 84605 30731 471007 462087 110784
17493A96655M8713j06096c1197A35228P1117P3420A19283K53377a04830B14551
$$ 196655 245368 139272 -31197 135228 206345 279765 119283 372660 -104830 214551
17482b9664B08259a26875C01589F5588K15467G626O3149J37229c097r6899A04359
$$ -29664 208259 -126875 301589 65588 281055 7626 70775 208004 -3097 -99996 104359
17470h9850b000k04594b7057q8671p424A31811R4719j4757J31583a09415C36523
$$ -89850 -2000 -206594 -27057 -115728 -123152 131811 226530 211773 343356 -109415 336523
17458A0530O655J39655K40483j16144D8860K37709n6364M8299m2484J9762J5436
$$ 10530 17185 156840 397323 281179 48860 286569 230205 278504 236020 255782 271218
17447B71218K66860B45839e0288j49955D18537E9938R5130K13612g5815C72164
$$ 271218 538078 245839 -50288 -200243 418537 59938 155068 368680 -75815 372164
17436e8654B60643C3254K29016J649A10909K70652j69469L60581H8555a13399
$$ -58654 260643 33254 262270 263919 110909 381561 212092 572673 88555 -113399
17425D3603M26923A91853J97969a26325j1893G031N74918A9971g3880D57831A73682
$$ 43603 470526 191853 389822 -126325 -138218 7031 581949 19971 -73880 457831 173682
17413B68622R0044A36681K28290C4J36032L4598b9831A00636K46212j48074c2844
$$ 268622 358666 136681 364971 34 136066 170664 -29831 100636 346848 198774 -32844
17401B01219b7989A68564C5365K08892b171B23253r8085i674A88198a35268C32363
$$ 201219 -27989 168564 35365 244257 -2171 223253 125168 -9674 188198 -135268 332363
17389B8612J18643f4800A62103a68939B42791R7462j54810N62f4095A78835A100
$$ 28612 147255 -64800 162103 -168939 242791 340253 185443 186005 -64095 178835 1100
17377A15249K04105D9561J62255I4769J10680p9543b9523I2045K56688j20306
$$ 115249 319354 49561 211816 94769 205449 125906 -29523 92045 348733 228427
17367B28427K96532e1743K0872H3849a27740E9291J29743l6993D9709a26988a8160
$$ 228427 524959 -51743 -30871 83849 -127740 59291 189034 152041 49709 -126988 -18160
17355C16258A54374P4424D998K33408M0728b86947C46449r7038J06216A63097
$$ 316258 154374 228798 4998 238406 279134 -286947 346449 249411 355627 163097
17344D482J26177J54150a40145C94297j88512j01449p246J3043k2334L08516D7229
$$ 4482 130659 284809 -140145 394297 205785 104336 97090 110133 87799 396315 47229
17332A14019R146e6761A54774k0957J16888o1078Q6967J07772A1498J87160k7667
$$ 114019 123165 -56761 154774 133817 250705 189627 276594 384366 11498 198658 170991
17321A70991B1328f5087D50910b9295E55582a24837H2378J68082B104N261K39719
$$ 170991 21328 -65087 450910 -29295 555582 -124837 82378 250460 2104 7365 247084
17310B47084D4934a65371A41445a98303A53059N7465o7779k4106R6384b71481
$$ 247084 44934 -165371 141445 -198303 153059 210524 142745 118639 215023 -271481
17299A99391H6427K71499A46653J02623H0124M81242a31269C14504q0858I4750
$$ 199391 86427 357926 146653 249276 80124 561366 -131269 314504 233646 94750
17288B74564r2274b10947F20808A77518p9135N698O4370J81135c8577D07818A39580
$$ 274564 182290 -210947 620808 177518 98383 104081 168451 349586 -38577 407818 139580
17276B14813o6103L56667j97390j07801g2955C18985e6499A72629R1026F6500
$$ 214813 148710 505377 307987 200186 -72955 318985 -56499 172629 263655 66500
17265A69092p0540e1106B26718J26901H0944L40999b6012C6347J00597K72171
$$ 169092 98552 -51106 226718 353619 80944 421943 -26012 36347 136944 409115
17255D09115k03008L6461O4104A47385g1811B86779M781J12056r7874l9263L337
$$ 409115 206107 242568 306672 147385 -71811 286779 291560 403616 305742 266479 269816
17244B69816F3765a02932D5853J95293N6564O0460A5742b23866D79288D3973A2874
$$ 269816 63765 -102932 45853 241146 297710 358170 15742 -223866 479288 43973 12874
17232C29749J42620A10474M58963B42356K282Q5536L5977q0335j7099k8323A10434
$$ 329749 472369 110474 569437 242356 244638 330174 366151 285816 268717 240394 110434
17220A85584O4119o9932G1995J523K18320j6397P4524q5465N2654D558J23778
$$ 185584 249703 179771 71995 73518 291838 275441 349965 264500 317154 4558 128336
17209A28336b4261A8931P3735L13768j60847K47142q3612M5495N8097b24444H6398
$$ 128336 -24261 18931 92666 406434 245587 492729 409117 454612 512709 -224444 86398
17197d8561B16965K73327A47896N8393J71923K53249l11182N8140k1080K28105
$$ -48561 216965 490292 147896 206289 378212 631461 320279 378419 357339 585444
17187E85444k0415B74652o0716F6337J92729A11187J57876K08628A66538N1500
$$ 585444 565029 274652 213936 66337 259066 111187 269063 477691 166538 218038
17177B18038a36141b2273G5763K40847Q421g4085F1007K60192J88147r9296J24612
$$ 218038 -136141 -22273 75763 316610 325031 -74085 61007 321199 509346 410050 534662
17166E34662k33927j36230K64682r1481j51102K38413N6127I3822L04947k482
$$ 534662 300735 164505 429187 337706 186604 425017 481144 93822 398769 396287
17156C96287c3445H6530M03017B12900j7441O8528G4315P6822L07617k16210m9780
$$ 396287 -33445 86530 489547 212900 195459 263987 74315 151137 458754 242544 192764
17145A92764M4872M2506m6068N36778a8661C70430J11678G1298L75417B03061
$$ 192764 237636 280142 234074 770852 -18661 370430 482108 71298 446715 203061
17134A73575M3393K86057I9765M87835q0579k23105J42047j13297j25011L07978
$$ 173575 216968 503025 99765 587600 507021 283916 425963 312666 187655 495633
17124D95633J83262l26547P3604k893j45534L3533K41370J50195k5021B54422
$$ 495633 678895 352348 425952 423059 277525 311058 552428 702623 677602 254422
17113C06058J99075j32613L15027C19928j54118J68646J61108J92441k55037h1127
$$ 306058 505133 372520 687547 319928 165810 334456 495564 688005 432968 -81127
17102A97429K96069O2106k10451j18604J91992q6827p9039J00045K52759B73885
$$ 197429 493498 555604 345153 226549 418541 331714 252675 352720 605479 273885
17091B96895q2733M0271j12838K51439A12093J25856L55898B51173M21993k04420
$$ 296895 214162 254433 141595 393034 112093 237949 593847 251173 673166 468746
17081D68746O8677J76012C8913M41351C901L38533J58400j24487O81J47284l3937
$$ 468746 537423 713435 38913 480264 3901 342434 500834 376347 377028 524312 490375
17070D90375j36262O4927j21840J03120L34336j493m6529l27887M15199k60047
$$ 490375 354113 419040 297200 400320 734656 733163 686634 358747 773946 513899
17060E13899r5093K75715k45543p7125J74856B43712M34512J00783l00815Q4500
$$ 513899 418806 694521 448978 371853 546709 243712 678224 779007 478192 562692
17050E62692j61353J39359J40181k26673J31692O5547L0612J2581j31432l6831
$$ 562692 401339 540698 680879 454206 585898 651445 682057 694638 563206 526375
17040E26375k3227L86819C71488L95213j04883L9565P368j57578j14991Q9741
$$ 526375 503148 889967 371488 766701 661818 701383 708751 551173 436182 525923
17030E25923J83842n7092J62692l07796o0104q0567J80881N1921B16188N05442
$$ 525923 709765 652673 815365 507569 447465 366898 547779 599700 216188 721630
17020G21630j65725K14820K28766l41947J94524r4889l30316L90598B87715M60029
$$ 721630 555905 770725 999491 657544 852068 757179 426863 817461 287715 747744
17010G47744P7874p993J19518m6066N8539C58159J97592K24715j55664K17685
$$ 747744 825618 817625 937143 891077 949616 358159 555751 780466 624802 842487
17000H42487j26880j97231K81645j74638K35011J034j96223L88516n23228J98286
$$ 842487 715607 518376 800021 625383 860394 861428 665205 1053721 530493 728779
16990G28779p7782j33886L24511k58803J94708M5850q6323K2009N140Q5286L319
$$ 728779 650997 517111 841622 582819 777527 823377 737054 759063 764203 849489 852808
16979H52808k45624J24022L26601k88260J90163l70M4680k4960k80500K79186
$$ 852808 607184 731206 1057807 769547 959710 959340 1004020 979060 698560 977746
16969I77746l00575L63065j68809K94374m44068Q6067K41950k0071j0642J45649
$$ 977746 677171 1040236 871427 1165801 721733 807800 1049750 1029679 1019037 1164686
16959A164686L6612l79661m2572M27175j93424R3478o96K71019k58187J2035k50222
$$ 1164686 1201298 821637 779065 1206240 1012816 1106294 1105598 1376617 1118430 1130465 880243
16948H80243J69801J07231k14529P4023J75562K01822J11003n03906L44816r5436
$$ 880243 1050044 1157275 942746 1016769 1192331 1394153 1505156 1001250 1346066 1250630
16938A250630k86917J45465K13787K62904o31916M99931J25394k09670k28668
$$ 1250630 963713 1109178 1322965 1585869 953953 1453884 1579278 1369608 1140940
16929A140940J1996J9019J64855K52064j65164n25891O71031l11084M6302K43594
$$ 1140940 1152936 1171955 1336810 1588874 1423710 897819 1568850 1257766 1304068 1547662
16919A547662P4892O8146l49170n3553L35398J94599j66240j37448O4279K2540
$$ 1547662 1622554 1690700 1341530 1287977 1623375 1817974 1651734 1514286 1578565 1601105
16909A601105J56933K950n08051L52617L11039q9631l36477J52341J19944j15405
$$ 1601105 1758038 1760988 1252937 1605554 1916593 1826962 1490485 1642826 1762770 1647365
16899A647365J60793j37697K88861J94871m69880J06532L21053J95221m77944
$$ 1647365 1808158 1670461 1959322 2154193 1684313 1790845 2111898 2307119 1829175
16890A829175j10853K30188L30254q2301K9274m9758L5924r2824K38322j65400
$$ 1829175 1718322 1948510 2278764 2196463 2225737 2175979 2211903 2119079 2357401 2192001
16880B192001J15216m1604J59633M9288k15197M2540J44800K48011q7599M9284
$$ 2192001 2307217 2265613 2425246 2474534 2259337 2301877 2446677 2694688 2607089 2656373
16870B656373j19530J55297l0094Q1516l81279N44758k69986P7715J19586K99648
$$ 2656373 2536843 2692140 2662046 2743562 2362283 2907041 2637055 2714770 2834356 3134004
16860C134004k15355L29353l24308L77044p3005P1383P0565L61774k44903o4233
$$ 3134004 2918649 3248002 2923694 3300738 3227733 3299116 3369681 3731455 3486552 3422319
16850C422319j21332O5231K19061p370J86788j02870j67525K55584N8093P5122
$$ 3422319 3300987 3366218 3585279 3577909 3764697 3661827 3494302 3749886 3807979 3883101
16840C883101m235L61296L0978J8924Q9235m3777Q25M47036j96374O4472M08275
$$ 3883101 3878866 4240162 4271140 4290064 4379299 4335522 4336347 4783383 4587009 4651481 5059756
16829E059756k68875L36616k20780L07248K15567m71517M60021l1210K38739J8110
$$ 5059756 4790881 5127497 4906717 5213965 5429532 4958015 5418036 5386826 5625565 5643675
16819E643675l5594O41946l66099J28891J99031K39145J97600J81284K45540k55069
$$ 5643675 5608081 6250027 5883928 6012819 6211850 6450995 6648595 6829879 7075419 6820350
16809F820350O9771O31087N2450j04650K65074K72161K8555J00107M64281l57013
$$ 6820350 6890121 7521208 7573658 7469008 7734082 8006243 8034798 8134905 8599186 8242173
16799H242173Q25176J85444O4995L5683L38720J47194M34480N68714k3631O04187
$$ 8242173 9067349 9252793 9317788 9353471 9692191 9839385 10273865 10842579 10818948 11423135
16789A1423135M5774K54684L80066J19829N86871O92402m8692L15107M68879L35441
$$ 11423135 11468909 11723593 12103659 12223488 12810359 13502761 13454069 13769176 14238055 14573496
16779A4573496L34381M06701O84817N25701O58374Q00659N90162N46751M68323
$$ 14573496 14907877 15314578 15999395 16525096 17183470 17984129 18574291 19121042 19589365
16770A9589365N26146P84630J184518K90829J062602O01260O45408J478754R31370
$$ 19589365 20115511 20900141 22084659 22375488 23438090 24039350 24684758 26163512 27094882
16761B7094882J194044J031639J194122J415911J651625J200431J672083J383478
$$ 27094882 28288926 29320565 30514687 31930598 33582223 34782654 36454737 37838215
16753C7838215J888207K006063J983249J742864K436574K458574K518144K335867
$$ 37838215 39726422 41732485 43715734 45458598 47895172 50353746 52871890 55207757
16745E5207757K910135L653527L247787L374646L854793L905993M371895M700048
$$ 55207757 58117892 61771419 65019206 68393852 72248645 76154638 80526533 85226581
16737H5226581M833187N060252N808526N727840O400682O727110O154087P210060
$$ 85226581 90059768 95120020 100928546 106656386 113057068 119784178 125938265 133148325
16729A33148325O859298P382593P180340P127836O373851O366905O098722M918627
$$ 133148325 140007623 147390216 154570556 161698392 168072243 174439148 180537870 185456497
16721A85456497M164382L401154K099977P31019n68149j354792k893705l779252
$$ 185456497 189620879 193022033 195122010 195853029 195284880 193930088 191036383 187257131
16713A87257131m964443n612616o336726o765531o957103p422512p213366p658727
$$ 187257131 182292688 176680072 170343346 163577815 156620712 149198200 141984834 134326107
16705A34326107o914597o898693o910886o477786n991976o026986n017993n112742
$$ 134326107 127411510 120512817 113601931 107124145 101132169 95105183 90087190 84974448
16697H4974448m936588m692543m002074l991304l359101l585320l450871k793062
$$ 84974448 80037860 75345317 71343243 67351939 63992838 60407518 56956647 54163585
16689E4163585k514448l002843k199939k477610j855451j692346k349496j605266
$$ 54163585 51649137 48646294 46446355 43968745 42113294 40420948 38071452 36466186
16681C6466186j581960j489793j608161j752405q60089r83834j430885j068754
$$ 36466186 34884226 33394433 31786272 30033867 29173778 28189944 26759059 25690305
16673B5690305j018777q63863j052356p06597q80861q41883n14317p79676o82509
$$ 25690305 24671528 23807665 22755309 22048712 21167851 20325968 19811651 19031975 18349466
16664A8349466p88478o10290l26914q05457l31773l16057q17604p05129k63940
$$ 18349466 17560988 16950698 16623784 15818327 15486554 15170497 14352893 13647764 13383824
16655A3383824j92184l15246l20052n29013m97523j97375l52081k95870k51129
$$ 13383824 13191640 12876394 12556342 12027329 11529806 11332431 10980350 10684480 10433351
16646A0433351k32547m68133K50517o19649j75337m7432n03845l47240K2860m56283
$$ 10433351 10200804 9732671 9983188 9363539 9188202 9140770 8636925 8289685 8312545 7856262
16636G856262M5524n4695l57009k47751l39010K28204l88745o0935m84751M359
$$ 7856262 7901786 7847091 7490082 7242331 6903321 7131525 6742780 6681845 6197094 6201453
16626F201453M15782m81564o1530K7613n20270n0087j801k64030K05280l79436
$$ 6201453 6617235 6135671 6074141 6101754 5581484 5531397 5529596 5265566 5470846 5091410
16616E091410j11642K69568j51622l34252l49836L41740o02847N07655m14622
$$ 5091410 4979768 5249336 5097714 4763462 4413626 4755366 4152519 4660174 4245552
16607D245552k01851R8222k7638j07020k68071M02936m09126l7539j39680J12128
$$ 4245552 4043701 4141923 4114285 4007265 3739194 4142130 3733004 3695465 3555785 3667913
16597C667913j61203J6747K0365l84613J59588J95675j23408m25366j8198O1081
$$ 3667913 3506710 3523457 3543822 3159209 3318797 3514472 3391064 2965698 2947500 3008581
16587C008581R0738j67151J4438k22072K0894r7091k83916L82472K7912k75357
$$ 3008581 3099319 2932168 2946606 2724534 2745428 2648337 2364421 2746893 2774805 2499448
16577B499448O25528l33309k23698m874L0124k172J7682k21198o7418k9285J5704
$$ 2499448 3124976 2791667 2567969 2563095 2593219 2591047 2608729 2387531 2320113 2290828 2306532
16566B306532k20643j35589L20826J3095r6424l01955M06903l46389L67703m39957
$$ 2306532 2085889 1950300 2271126 2284221 2187797 1885842 2292745 1946356 2314059 1874102
16556A874102j34058Q2665R9357k74254L08302j98026J14644j746m3068m1339
$$ 1874102 1740044 1822709 1922066 1647812 1956114 1758088 1872732 1870986 1827918 1786579
16546A786579R9699j79295l31536N95220n62266J72618q9235N648K68498k66201
$$ 1786579 1886278 1706983 1375447 1970667 1408401 1581019 1491784 1497432 1765930 1499729
16536A499729J47112k64007K68090l1276k77126J66421k54981M27012p37361L59975
$$ 1499729 1646841 1382834 1650924 1619648 1342522 1508943 1253962 1680974 943613 1303588
16526A303588L72394k89972k24344j50411R2254O69158l97573J99128k49309k43182
$$ 1303588 1675982 1386010 1161666 1011255 1103509 1772667 1375094 1574222 1324913 1081731
16516A081731M32461j28448j07177j45328L12782l97829m9392K81045k05581J93760
$$ 1081731 1514192 1385744 1278567 1133239 1446021 1048192 998800 1279845 1074264 1268024
16506A268024k29974r7954K82582k40896L50429n56616M2736L49891M9957J14338
$$ 1268024 1038050 940096 1222678 981782 1332211 775595 818331 1168222 1218179 1332517
16496A332517l49312L54723l03004l62954M53838k70812L37869n37986K32499
$$ 1332517 983205 1337928 1034924 671970 1125808 854996 1192865 654879 887378
16487H87378J38967j49512K87017k80348J66427l99107J28118J36450K51644l84305
$$ 887378 1026345 876833 1163850 883502 1049929 650822 778940 915390 1167034 782729
16477G82729K37799m94167N57381k44950P2059R2025k55061J44159o1251K93650
$$ 782729 1020528 526361 1083742 838792 910851 1002876 747815 891974 830723 1124373
16467A124373l70079j60222L59396m30067M37136k17595r5243L9535k54862J69767
$$ 1124373 754294 594072 953468 523401 960537 742942 647699 687234 432372 602139
16457F02139J8654J08118k72575L8581K20771r6891j71988L9006O4752J71865
$$ 602139 620793 728911 456336 494917 715688 618797 446809 485815 550567 722432
16447G22432o4667K3018R4912j42374R5169J5637R0217D07849L80871l68542M32814
$$ 722432 657765 680783 775695 633321 728490 744127 834344 407849 788720 420178 852992
16436H52992A60067L22813Q2116K58334l25907M52528l83520B64140L78592j10219
$$ 852992 160067 482880 564996 823330 497423 949951 566431 264140 642732 532513
16426E32513k3944J63780A14861O25402A74814M74958p576B84892L07771K39631
$$ 532513 508569 672349 114861 740263 174814 649772 642196 284892 592663 832294
16416H32294r7040l09396J85219J26677A10085L63399j08681K25781B55683K17593
$$ 832294 735254 425858 611077 737754 110085 473484 364803 590584 255683 473276
16406D73276J95257k3703K2567m3754n7506j19858A94614K49730j22472Q6889
$$ 473276 668533 644830 667397 623643 566137 446279 194614 444344 321872 408761
16396D08761J99088A75895M67519r0774J60878j20779j25927Q8292K0006A34175
$$ 408761 607849 175895 643414 552640 713518 592739 466812 555104 575110 134175
16385B54414P26263l27504j54519J71346j62889B09657J74558J81359J3446J80464
$$ 254414 980677 653173 498654 670000 507111 209657 384215 565574 579020 759484
16375G59484j91206O9866k99118n9554L00016j59348F8196J90361L38840j52801
$$ 759484 568278 638144 339026 279472 579488 420140 68196 258557 597397 444596
16365D44596m7683j22848O3286l9987n7266a2104A91313q2405N69147B44841D0674
$$ 444596 396913 274065 337351 297364 240098 -12104 191313 108908 678055 244841 40674
16353C28172A03009j1104J58758J46911N9558n2679q4708q7984J0856G9020K25140
$$ 328172 103009 91905 250663 397574 457132 404453 319745 231761 242617 79020 304160
16342C04160J63827k22740q828q420M7201m5180H2320K04889j15694J44748j49349
$$ 304160 467987 245247 236419 227999 275200 230020 82320 287209 171515 316263 166914
16331A66914E0609Q4024D9557R6841P858i3440C18075M1607I0455B7682K4596
$$ 166914 50609 134633 49557 146398 154256 -93440 318075 359682 90455 27682 52278
16320E2278J63245L7174L33144k5046A28070J49461K15657j82873m6667h8468
$$ 52278 215523 252697 585841 560795 128070 277531 493188 310315 263648 -88468
16309A51861K07444K12145k61459D5507J56633K4083p8114R77k1267J13900L71915
$$ 151861 359305 571450 309991 45507 202140 226223 148109 149086 127819 241719 613634
16298F13634k54444j73638L10027C9451L73415C4965K65440H4126L28787j5387
$$ 613634 359190 185552 495579 39451 412866 34965 300405 84126 412913 397526
16288C97526A98623g3302A07536F109J48965p5191K27915Q0628M7972q2770D0945
$$ 397526 198623 -73302 107536 6109 155074 79883 307798 388426 436398 353628 40945
16276E48559C0579K61116b47819I7216N5465J24559K731I525K03026K39241r5698
$$ 548559 30579 291695 -247819 97216 152681 277240 279971 9525 212551 451792 356094
16265C56094d2203B60069E5783J58795b39783C02756k3574J39062A09113f505
$$ 356094 -42203 260069 55783 214578 -239783 302756 279182 418244 109113 -6505
16254C22259B4557i0641a3718A80157g8418B67922K23706j98825e8428m4702C0297
$$ 322259 24557 -90641 -13718 180157 -78418 267922 491628 292803 -58428 -103130 30297
16242c2044A37423J86012A48344P4431o4890f7049C68737A55048a00510E9210
$$ -32044 137423 323435 148344 222775 157885 -67049 368737 155048 -100510 59210
16231c0216M102A68567J1782e9144C08446l1874c8714D67489L9257A83981g0941
$$ -30216 -26114 168567 180349 -59144 308446 276572 -38714 467489 506746 183981 -70941
16219B73966K42291r0031j49307a3909n2298e891C26521j56516a17930A68033
$$ 273966 516257 426226 276919 -13909 -66207 -5891 326521 170005 -117930 168033
16208B19047C2120K05692A04218P9097J3741K80352B10310P3947k4018P4340G0986
$$ 219047 32120 237812 104218 183315 197056 477408 210310 284257 260239 334579 70986
16196A04384N2939N6360K30364B11464a61983g600A13293K77463A01464a11058
$$ 104384 157323 213683 444047 211464 -161983 -7600 113293 390756 101464 -111058
16185E15511A26228a31993B44886n0714q4432N7745K9424a4932D0047a79763B32503
$$ 515511 126228 -131993 244886 194172 109740 167485 196909 -14932 40047 -179763 232503
16173B18292p9772H954i0075o7335A83792q8269f3830A78836b6712A23497G541
$$ 218292 138520 8954 -90075 -157410 183792 95523 -63830 178836 -26712 123497 7541
16161C59605n0942K88657B52429j11371E8413B3522L57767a38282B41756e4835
$$ 359605 308663 597320 252429 141058 58413 23522 381289 -138282 241756 -54835
16150F5406K66303A65144b75943f4019q6220c4063k89673b1452A17826g8039l8432
$$ 65406 331709 165144 -275943 -64019 -150239 -34063 -323736 -21452 117826 -78039 -116471
16139a16471E3830R555a69612B30075A03886b55681E0216J15090C3271K1952l318
$$ -116471 53830 63385 -169612 230075 103886 -255681 50216 165306 33271 55223 51905
16128E1905K27742f3464A85542I2588N9661G0986J56676j06248a75734c7983k43151
$$ 51905 279647 -63464 185542 92588 152249 70986 227662 121414 -175734 -37983 -281134
16117b81134c946j59965M2561e9809a2045A13520J05234b56953A59962Q491J80389
$$ -281134 -3946 -163911 -121350 -59809 -12045 113520 218754 -256953 159962 168453 348842
16106C48842I2083K0592J08452h5434h949C47090j56642j4242l2415a82938n5482
$$ 348842 92083 112675 221127 -85434 -8949 347090 190448 176206 143791 -182938 -238420
16095b38420E0185d8993n5483I7154a42010j53106B39269a07152A39079a20051
$$ -238420 50185 -48993 -104476 97154 -142010 -295116 239269 -107152 139079 -120051
16084D12670a76688h5658I1542j1436c1527j58521E7360e6953j3416k38141B92840
$$ 412670 -176688 -85658 91542 80106 -31527 -190048 57360 -56953 -70369 -308510 292840
16072B83924H6631K21243b8902B38971e49955c238A48164l032d2850g432B07619
$$ 283924 86631 307874 -28902 238971 -549955 -3238 148164 145132 -42850 -7432 207619
16060H4837h0672r1742j32682a15567B56305o6729B3713K06767b1116G4479h0588
$$ 84837 -80672 -172414 -305096 -115567 256305 189576 23713 230480 -21116 74479 -80588
16048E155b25658i545n0744l5823d2433l35038f3485J0994m365B95822a05280
$$ 5155 -225658 -9545 -60289 -96112 -42433 -377471 -63485 -52491 -56856 295822 -105280
16036a54959c9920F7861K63155e9809j24776B11615c0647l24958B34890c8556
$$ -154959 -39920 67861 331016 -59809 -184585 211615 -30647 -355605 234890 -38556
16025A78329a89175E8560j1926N2812b7654k26570a25851b2709A55128M5199g7330
$$ 178329 -189175 58560 46634 99446 -27654 -254224 -125851 -22709 155128 200327 -77330
16013A66162f3903A00143i4549A38583K25638H2159c41978A28628K6822E7572
$$ 166162 -63903 100143 -94549 138583 364221 82159 -341978 128628 155450 57572
16002g6602h384m6345o84j0484A08428h4053c4893j24689E9668L6990I693b26114
$$ -76602 -8384 -54729 -55413 -65897 108428 -84053 -34893 -159582 59668 96658 9693 -226114
15989b77338a22712d1907q0269p0849B20989c04094B58252f0036F88970k20926
$$ -277338 -122712 -41907 -122176 -193025 220989 -304094 258252 -60036 688970 468044
15979D68044A28448K19635D1500a06733j70231j45335B59442d5619B42010b22082
$$ 468044 128448 348083 41500 -106733 -276964 -422299 259442 -45619 242010 -222082
15968A73508n0492b66534a8886j55975J9001b0909l26889e3460k8380B78267j07974
$$ 173508 123016 -266534 -18886 -174861 -155860 -20909 -347798 -53460 -81840 278267 170293
15957A70293K1207R2680c77886J70570J7870h4263j26555G0873c5558A9338c00978
$$ 170293 191500 284180 -377886 -207316 -189446 -84263 -210818 70873 -35558 19338 -300978
15945A46621b73688P0997A12202a58197J3433j7292D7357c53221c9760j27154
$$ 146621 -273688 -202691 112202 -158197 -144764 -162056 47357 -353221 -39760 -166914
15935a66914N0348l8460C3789d206H1025a23532E4952a57568g1898G734a44681
$$ -166914 -116566 -155026 33789 -4206 81025 -123532 54952 -157568 -71898 7734 -144681
15923c39155H6584a57880I3573c47608a8490j3600H8451J31818a59773j13390
$$ -339155 86584 -157880 93573 -347608 -18490 -32090 88451 220269 -159773 -273163
15913b73163a10630k25900F4383R457a23761E2634M5214J20388H7833a49795c4206
$$ -273163 -110630 -336530 64383 73840 -123761 52634 97848 218236 87833 -149795 -34206
15901f5276A7933Q7307a16246B4675a18687B02964b35491a0236A79519B91M19789
$$ -65276 17933 105240 -116246 24675 -118687 202964 -235491 -10236 179519 291 420080
15890D20080j50452a50106O529A83378g2593k9380j5552e3070k07850h07C51850
$$ 420080 269628 -150106 -143577 183378 -72593 -101973 -117525 -53070 -260920 -807 351850
15878B9875K0776c8372D4264M0177b3828I7477L0674h0329A18479d5012p459j46749
$$ 29875 50651 -38372 44264 84441 -23828 97477 128151 -80329 118479 -45012 -52471 -199220
15866a99220B63702F657L73710D1342K27479a09579o3155A77619O5193b06936
$$ -199220 263702 6657 380367 41342 268821 -109579 -172734 177619 242812 -206936
15855f116A18558d3983A03997b99093D60200a83471p2128A5584J05900e6517j5092
$$ -6116 118558 -43983 103997 -299093 460200 -183471 -255599 15584 121484 -56517 -71609
15844g1609A12066n3593g4075E903c63452D238a00085J2942B61963A20991c6217
$$ -71609 112066 58473 -74075 5903 -363452 4238 -100085 -87143 261963 120991 -36217
15832b11131n075L1938N7255A25948P1089b36576j64025i1776A59554b41820F4591
$$ -211131 -216206 -184268 -127013 125948 197037 -236576 -400601 -91776 159554 -241820 64591
15820d0077A39784E1990b40574e7771A26916a12238j86850J48149A15786b75224
$$ -40077 139784 51990 -240574 -57771 126916 -112238 -299088 -150939 115786 -275224
15809c89067a04835B91384G6880B1834J40117R6783d94369B86326j20560J41233
$$ -389067 -104835 291384 76880 21834 161951 258734 -494369 286326 165766 306999
15799C06999b52873B43388D3445b56154d6361j84616n2275a33823b4201q6295
$$ 306999 -252873 243388 43445 -256154 -46361 -230977 -283252 -133823 -24201 -110496
15789a10496j41381D6739P0866a4034j48241j2496J199A74367a18914D5914l660
$$ -110496 -251877 46739 117605 -14034 -162275 -174771 -173572 174367 -118914 45914 42254
15778D2254a88545P4716A01172d05840E520b38686j76357a69307A6545O4503c44421
$$ 42254 -188545 -113829 101172 -405840 5520 -238686 -415043 -169307 16545 81048 -344421
15766b43034R0004C21299A56905c95727i7319C15488j38810G3791J3736c50313
$$ -243034 -153030 321299 156905 -395727 -97319 315488 176678 73791 87527 -350313
15755H2767A3259a13818A83578h8173k8958B4582b60794m4325a45624E4338O172
$$ 82767 13259 -113818 183578 -88173 -117131 24582 -260794 -305119 -145624 54338 60510
15744F0510J95083i6390j42182P9833f9305o3661n9978O5340A14691d28427K07432
$$ 60510 255593 -96390 -238572 -158739 -69305 -132966 -192944 -127604 114691 -428427 -220995
15733b20995d6545A78505B818b6391p572B88178a193l14553e6535A31556A7516
$$ -220995 -46545 178505 2818 -26391 -33963 288178 -1193 -315746 -56535 131556 17516
15721c26648a50795A17415l8171l5046g8113A3991J9685j1744a17960q0539A1523
$$ -326648 -150795 117415 79244 44198 -78113 13991 33676 21932 -117960 -198499 11523
15709A0851J00362J8560N2542b7315I1849e4767m8092j23991h9729B9361b26678
$$ 10851 111213 129773 182315 -27315 91849 -54767 -102859 -226850 -89729 29361 -226678
15697f1134G9220e0194B71236b4785k49212r633C2613f173n5632q6164B2667g3818
$$ -61134 79220 -50194 271236 -24785 -273997 -283630 32613 -6173 -61805 -147969 22667 -73818
15684a05222G7411d2520F6060b7471A12967L59659a28428N6933H3731a58113H6214
$$ -105222 77411 -42520 66060 -27471 112967 472626 -128428 -71495 83731 -158113 86214
15672b75280O6283c8518j65556g0939b6900C1352a15491a2996B12659e8169j30841
$$ -275280 -208997 -38518 -204074 -70939 -26900 31352 -115491 -12996 212659 -58169 -189010
15661a89010J5303j3802F4190M7472b69846B87194o557m7197c22016e4982k59629
$$ -189010 -173707 -187509 64190 111662 -269846 287194 280637 233440 -322016 -54982 -314611
15650c14611i7619n3776n5693o6046h5534o4835G4062A3023R6881j4068a19208
$$ -314611 -97619 -151395 -207088 -273134 -85534 -150369 74062 13023 109904 95836 -119208
15638E5529a28995G3012l400a12k99990e7794a6167k63399j3316H3760L16242
$$ 55529 -128995 73012 69612 -112 -300102 -57794 -16167 -279566 -292882 83760 400002
15627D00002A54555a16308f854C49908A7793a48280B78557D8638K08723b5522
$$ 400002 154555 -116308 -6854 349908 17793 -148280 278557 48638 257361 -25522
15616C31812F1457J63174c10358b6989I6265b5415A03780l24i3172k70674I2852
$$ 331812 61457 224631 -310358 -26989 96265 -25415 103780 103456 -93172 -363846 92852
15604A54828M6382c46970a57515c7136j1544H465c70662d4150D35a90814J2022
$$ 154828 201210 -346970 -157515 -37136 -48680 8465 -370662 -44150 435 -190814 -178792
15593a78792L35N5080O0849p0814d0790A99505f9439o5614C44226A0667K28064
$$ -178792 -178457 -123377 -62528 -133342 -40790 199505 -69439 -135053 344226 10667 238731
15582B38731F4525g1164A8593K30549e9789n6828k9527E1846c81795C03616a89469
$$ 238731 64525 -71164 18593 249142 -59789 -116617 -146144 51846 -381795 303616 -189469
15570D9519a93723A42818B0277c26088L8865L0601D9453q176R4052k8709b69820
$$ 49519 -193723 142818 20277 -326088 -287223 -256622 49453 41277 135329 106620 -269820
15558d43502A91521a74742O3296A1001J76919a52120f2433B89672b97852e5843
$$ -443502 191521 -174742 -111446 11001 187920 -152120 -62433 289672 -297852 -55843
15547B55828k5670b13048Q5073B74741r6930a20086c5372j41886B11477h12q766
$$ 255828 230158 -213048 -127975 274741 177811 -120086 -35372 -177258 211477 -812 -9578
15536i578B69696a86924K8115G18J18947N7286M9821E9740O078q143R1071b33991
$$ -9578 269696 -186924 -158809 718 119665 176951 226772 59740 65818 57675 148746 -233991
15523e181j64399b035C3703a18586C444P3439K08126r3494E0894c1019j92358
$$ -5181 -169580 -2035 33703 -118586 3444 76883 285009 191515 50894 -31019 -223377
15512b23377P3942M6400p111j68809A69086h7856k81758a14102B37970b60800
$$ -223377 -149435 -103035 -110146 -278955 169086 -87856 -369614 -114102 237970 -260800
15501B65548h7915A677g5911k68814A37357B0547J5025a79075A01654J8774b29200
$$ 265548 -87915 1677 -75911 -344725 137357 20547 35572 -179075 101654 120428 -229200
15489b48997A11911a84587G3617b25109A374a96115e9359j70030A4860O5584g617
$$ -248997 111911 -184587 73617 -225109 1374 -196115 -59359 -229389 14860 80444 -7617
15477a92175i0704C46481G8651b82553B58340a03815i130j10434B76069a71405
$$ -192175 -90704 346481 78651 -282553 258340 -103815 -9130 -119564 276069 -171405
15466b7077A61057C2721a79091k09489i9160l69235A21357D8236A1708R2273a34799
$$ -27077 161057 32721 -179091 -388580 -99160 -468395 121357 48236 11708 103981 -134799
15454H5746e361B34517a01544d0231A97662j30H5311k3111K28939r3811R1664
$$ 85746 -5361 234517 -101544 -40231 197662 197532 85311 62200 291139 197328 288992
15443B88992a34561e5477n1310A51632b74763B6791M7775M3852g4207j05832B95189
$$ 288992 -134561 -55477 -106787 151632 -274763 26791 74566 118418 -74207 -180039 295189
15431F8770d70568G3390b93993J33096O4230j34116G7558B0863l174L51647a03280
$$ 68770 -470568 73390 -293993 -160897 -96667 -230783 77558 20863 17689 369336 -103280
15419C33521j61570k9592l8835a40739f7164B78650C9793a02880A35543a03031
$$ 333521 171951 142359 103524 -140739 -67164 278650 39793 -102880 135543 -103031
15408d3962B0041a4809C3837J04863K16596B1245K39656c80826C6791K89901A52712
$$ -43962 20041 -14809 33837 138700 355296 21245 260901 -380826 36791 326692 152712
15396B08196a77035A18818H544c8587k8861a2138k94566a51176d0825C04303k5423
$$ 208196 -177035 118818 8544 -38587 -67448 -12138 -306704 -151176 -40825 304303 278880
15385B78880b55826m3210a18533B27034d9249A76761A1446J5245f979l12996A84998
$$ 278880 -255826 -299036 -118533 227034 -49249 176761 11446 26691 -6979 -319975 184998
15373b23455K2045d3046D0320b1142j38720A22844b7705k96605C25352A893K56634
$$ -223455 -201410 -43046 40320 -21142 -159862 122844 -27705 -324310 325352 1893 258527
15362B58527g627A90325J7515J56262c19744A67296n936l7801a9588j79127i8557
$$ 258527 -7627 190325 207840 364102 -319744 167296 161360 123559 -19588 -198715 -98557
15350B51585E0848A8404P2239h3378A1213e3619B99124A28906b33215G721b8575
$$ 251585 50848 18404 90643 -83378 11213 -53619 299124 128906 -233215 7721 -28575
15338g5818q8967P9239j87104A09648K822n4119J29276e7772B01961j0174h1965
$$ -75818 -164785 -85546 -272650 109648 112470 58351 187627 -57772 201961 191787 -81965
15326E7677k7365n854R0485B8302J36893a25124D9197a72546B37825c7867C60202
$$ 57677 30312 24458 114943 28302 165195 -125124 49197 -172546 237825 -37867 360202
15314A02085d1123A14385K051a6398C4114J33796K5623d18718A46980f8124A32182
$$ 102085 -41123 114385 116436 -16398 34114 167910 193533 -418718 146980 -68124 132182
15302c53462A92976c06213a47678k32683c1886H6875K37519b56135A22054d1491
$$ -353462 192976 -306213 -147678 -380361 -31886 86875 324394 -256135 122054 -41491
15291A7815M3755a85860B7346L14895e5497A18867N4871L8443n8465J97128i231
$$ 17815 61570 -185860 27346 342241 -55497 118867 173738 212181 153716 350844 -9231
15279C72882a42133D2785a8177H4181i6454B64437J23139j48801a25393A90815
$$ 372882 -142133 42785 -18177 84181 -96454 264437 387576 238775 -125393 190815
15268D3325A3843M0689N1978a1340G2681J70946c467D67525p9789I4477b08146
$$ 43325 13843 54532 106510 -11340 72681 243627 -3467 467525 387736 94477 -208146
15256D1579K33399c51529h414l5374E3314b5039j09860D27554P7095M51001J725409
$$ 41579 274978 -351529 -8414 -43788 53314 -25039 -134899 427554 504649 955650 2681059
15245B681059q51403j23491O85155H35469k68998k68123K8004j07432o1549a56347
$$ 2681059 1829656 1706165 2391320 835469 566471 298348 326352 218920 157371 -156347
15234a19884A41023a72735e802j8385D82847H977a11426A0990a263G0689a88454
$$ -119884 141023 -172735 -5802 -24187 482847 8977 -111426 10990 -1263 70689 -188454
15222C45629g101B95366q9034K4853C7382K09518a00553E3710J24770b9116I2608
$$ 345629 -7101 295366 206332 231185 37382 246900 -100553 53710 178480 -29116 92608
15210D61563B11178d814o0756E0754L45b14099B80925n0698I1252f7066E26521
$$ 461563 211178 -4814 -65570 50754 51099 -214099 280925 230227 91252 -67066 526521
15198A37578J72849A9232N1038L6125L68491f6631k5028C18614F485d71366B1253
$$ 137578 310427 19232 70270 106395 474886 -66631 -91659 318614 6485 -471366 21253
15186C97772A92352b80177F4332P2853m7012a35049C21652c27407A84294a41413
$$ 397772 192352 -280177 64332 137185 90173 -135049 321652 -327407 184294 -141413
15175B46325a53761o6228C07032R2409b47783i7346B16836F9069R1144O7229g6999
$$ 246325 -153761 -219989 307032 399441 -247783 -97346 216836 69069 160213 227442 -76999
15163A90870P7524A31320b47204B72776a23659A11800m0737a47254B44292a13667
$$ 190870 268394 131320 -247204 272776 -123659 111800 71063 -147254 244292 -113667
15152B46069j6944n3625J70119o5535D0930N7052J6803B6506L23715j59581J15828
$$ 246069 229125 175500 345619 280084 40930 97982 114785 26506 350221 190640 306468
15141C06468e5784E5990A5057a26412H3969a77807B41734a28901B00829K5254
$$ 306468 -55784 55990 15057 -126412 83969 -177807 241734 -128901 200829 226083
15131B26083j11239l0632k7873K84273D7867L88110b1051A29676J70431b56973
$$ 226083 114844 84212 56339 340612 47867 435977 -21051 129676 300107 -256973
15120B77784r5539M5166m3212J08381i3423A94271L8684l3423K47167a59434A95104
$$ 277784 182245 227411 184199 292580 -93423 194271 232955 199532 446699 -159434 195104
15108A93662D4677J95718h9557C75889j76023N1110A19766R4921b61001E27236
$$ 193662 44677 240395 -89557 375889 199866 250976 119766 214687 -261001 527236
15097i6969D56261e9399J359E40368h6042H7641R8191K0399e5154B96307n729
$$ -96969 456261 -59399 -58040 540368 -86042 87641 185832 206231 -55154 296307 290578
15086B90578E9441L70950A41061b3383j03260B29295b74526A86171P1571n0365
$$ 290578 59441 430391 141061 -23383 -126643 229295 -274526 186171 257742 207377
15076B07377l7304m023J89700b3311D9106J8179M07196A18168e0387B52014A03604
$$ 207377 170073 166050 355750 -23311 49106 67285 474481 118168 -50387 252014 103604
15064C14543C5186K698b77437f8656B97252J07901L6942G5303J09993J97378J0470
$$ 314543 35186 37884 -277437 -68656 297252 405153 442095 75303 185296 382674 393144
15053C93144h2117B61322r1027C4331K14970a09597E16508o7762B20342K47969
$$ 393144 -82117 261322 170295 34331 249301 -109597 516508 448746 220342 468311
15043D68311R6206b5632C03548L5713A51922R6164c3031A15371K14080A52987
$$ 468311 564517 -25632 303548 339261 151922 248086 -33031 115371 329451 152987
15032A8007d9150D74496B13209N4514K16045B10233H1360K86261m4333N8602A76339
$$ 18007 -49150 474496 213209 267723 483768 210233 81360 367621 323288 381890 176339
15020B10423k5849J20460A48556E3770M02854k05402M5883J07279I5136N0291
$$ 210423 184574 305034 148556 53770 456624 251222 297105 404384 95136 145427
15010A45427J71029d6308B17812H0393J01571P8412k7599M4253c9647A07909K22306
$$ 145427 316456 -46308 217812 80393 181964 260376 232777 277030 -39647 107909 330215
14999C30215J47127k22319J79665P407m4106C9400L58532j82045K6274M22198
$$ 330215 477342 255023 434688 442095 397989 39400 397932 215887 242161 664359
14989F64359j00217A12714R5849b0408C71729A03566n0286a15410K9757C80752
$$ 664359 564142 112714 208563 -20408 371729 103566 53280 -115410 -85653 380752
14978F1983M80648A80371a52336D58569A10300J91535G8860a64561C58233J19017
$$ 61983 542631 180371 -152336 458569 110300 301835 78860 -164561 358233 477250
14968D77250M8997j55465A32390l3548L36419K09878C03284K53833k53314J00931
$$ 477250 526247 370782 132390 98842 435261 645139 303284 557117 303803 404734
14958D04734B1222L97175j09895j0449j5921b3226D03339j11992c7508A18079
$$ 404734 21222 418397 308502 298053 282132 -23226 403339 291347 -37508 118079
14947E37268G8215K09048J41153A33387K59212j86219J58911l8639j33142q4300
$$ 537268 78215 287263 428416 133387 392599 206380 365291 326652 193510 109210
14937A09210J92109f3361A66911L23498j61378q5368R7258K9225o6358m7075R0769
$$ 109210 301319 -63361 166911 490409 329031 243663 340921 370146 303788 256713 347482
14926C47482o886D7947L59800j16282K16129j05565j98629K02860r6527r7617
$$ 347482 340596 47947 407747 291465 507594 402029 203400 406260 309733 212116
14916B12116J68890F4868M45981j69901G3730K40637J49799p2296J51724j75923
$$ 212116 381006 64868 510849 340948 73730 314367 464166 391870 543594 367671
14906C67671E0764K30700J62055J67837j93024P2315j21305A47405J02110K01099
$$ 367671 50764 281464 443519 611356 418332 490647 369342 147405 249515 450614
14896D50614j36834N7220J7450A38834L29178M4469B50116Q6042r5629q5946k6750
$$ 450614 313780 371000 388450 138834 468012 512481 250116 336158 240529 154583 127833
14885A27833J85463A09244L27026A36437L42764j02273m1432K17824B73706r9954
$$ 127833 313296 109244 436270 136437 479201 376928 335496 553320 273706 173752
14875A73752H4488L21864k5774Q9780j91756K90440A12660K60324L16837C05731
$$ 173752 84488 406352 380578 470358 278602 569042 112660 372984 689821 305731
14864E31000j85882J38101j32451M8726L1411K2430J74571k39842P3599N28513
$$ 531000 345118 483219 350768 399494 430905 453335 627906 388064 461663 990176
14854I90176B75091J891J10754N4129m4563K74853r7118A71043Q5929L15353n7485
$$ 990176 275091 276982 387736 441865 397302 672155 575037 171043 256972 572325 514840
14843E14840J70562B54442K95274k72544K08088B27170o4195N58640C47600C1724
$$ 514840 685402 254442 549716 277172 485260 227170 162975 721615 347600 31724
14832C52403L23213C33619K71971R3301l45818K93469P8909k31200r7399J03691
$$ 352403 675616 333619 605590 698891 353073 646542 725451 494251 396852 500543
14822E00543R4168k01813N1447J51250B35370M48931l19543M15481j48309j20072
$$ 500543 594711 392898 444345 595595 235370 684301 364758 780239 631930 511858
14812E11858r5470J80238A24294O84912C98571l2064M70727m04045K43434K33037
$$ 511858 416388 596626 124294 809206 398571 366507 837234 433189 676623 909660
14802I09660k11180l30790M90283C76583M47641k80906J2124r3607J9460N3658
$$ 909660 698480 367690 857973 376583 824224 543318 555442 461835 481295 534953
14792E34953J15509M786k78658K02949j42884M5517J83761j29262J17661K4663
$$ 534953 650462 655248 376590 579539 436655 482172 665933 536671 654332 678995
14782F78995m8590j52907M61687k45916k83310J24038N02006k85403q648k33709
$$ 678995 630405 477498 939185 693269 409959 533997 1036003 750600 741952 508243
14772E08243R5574O9614j36540M07699m01740o2422K28142P3270n6768n4408j6491
$$ 508243 603817 673431 536891 944590 542850 480428 708570 781840 725072 670664 654173
14761F54173k9209o3489J6275J42581C21338K88545M77060n07391o3147O6950
$$ 654173 624964 561475 577750 720331 321338 609883 1086943 579552 516405 583355
14751E83355L31168B01331L11780M63930D83782j43180o730K17807J57664j79786
$$ 583355 914523 201331 513111 977041 483782 340602 333872 551679 709343 529557
14741E29557K71407P8568j84451K84429l46119k2752L571k05577J60039J68762
$$ 529557 800964 879532 695081 979510 633391 610639 614210 408633 568672 737434
14731G37434K19860j34499J67952j56348K60326E35145N9152J25903J73409j16161
$$ 737434 957294 822795 990747 834399 1094725 535145 594297 720200 893609 777448
14721G77448p3788N65838k37751q0779p3136k48646K14111n8181R0486J63400
$$ 777448 703660 1269498 1031747 950968 877832 629186 843297 785116 875602 1039002
14711A039002k59214J90810j23542M7381o2154k7461l3484J39970J85803o8610
$$ 1039002 779788 970598 847056 894437 832283 804822 771338 911308 1097111 1028501
14701A028501M9621k66957L05664l34920L21729O3937l03562K27328k4631r1059
$$ 1028501 1078122 811165 1116829 781909 1103638 1167575 864013 1091341 1066710 975651
14691I75651K7883p6658j73676R2268k52851M17811K60442j00913k0871k26546
$$ 975651 1003534 926876 753200 845468 592617 1010428 1270870 1169957 1149086 922540
14681I22540J70073j18674J42550K50303m59500j01186K07709K7713J10313L66283
$$ 922540 1092613 973939 1116489 1366792 907292 806106 1013815 1041528 1151841 1518124
14671A518124m79629k54332L62007k12197K02914l1880o5543K15693L2073l58575
$$ 1518124 1038495 784163 1146170 933973 1136887 1105007 1039464 1255157 1287230 928655
14661I28655N67821m17872l32159J74005M2158M9220N27419n52469J61172J10214
$$ 928655 1496476 1078604 746445 920450 962608 1011828 1539247 986778 1147950 1258164
14651A258164l5031l3483j16575N3047K07559J41458N0064Q6679n07593K21543
$$ 1258164 1223133 1189650 1073075 1126122 1333681 1475139 1525203 1611882 1104289 1325832
14641A325832Q7728l12336M10269l06933K91895N6791k19235l1019K72497J53499
$$ 1325832 1413560 1101224 1511493 1204560 1496455 1553246 1334011 1302992 1575489 1728988
14631A728988k22643j55512J94646j40283k44581J86972L09975k32029R4840L4051
$$ 1728988 1506345 1350833 1545479 1405196 1160615 1347587 1657562 1425533 1520373 1554424
14621A554424j17310L62012k1536j3091j90783K12463m214l22319K19691k95815
$$ 1554424 1437114 1799126 1777590 1764499 1573716 1786179 1781965 1459646 1679337 1383522
14611A383522J58357K44523k37612K62009l2516j43254J04023q2929J63311l97606
$$ 1383522 1541879 1786402 1548790 1810799 1778283 1635029 1739052 1656123 1819434 1421828
14601A421828N06502j46560Q8877L47066m98980J58729R1955k98672K39235m8503
$$ 1421828 1928330 1781770 1870647 2217713 1718733 1877462 1969417 1670745 1909980 1861477
14591A861477l2034J2669M05395q1224Q4042l73712j64907R8491L31198k33939
$$ 1861477 1829443 1842112 2247507 2166283 2250325 1876613 1711706 1810197 2141395 1907456
14581A907456J91685k0222o0591j57117L19567m3033L03599j51083p1695j7506
$$ 1907456 2099141 2078919 2018328 1861211 2180778 2137745 2441344 2290261 2218566 2201060
14571B201060J07411J59162J69046j0521j51995K94043k65635K35532P7455k23317
$$ 2201060 2308471 2467633 2636679 2626158 2474163 2768206 2502571 2738103 2815558 2592241
14561B592241J18321M65253k42388K71376J82574J02268j23962L00757N03825
$$ 2592241 2710562 3175815 2933427 3204803 3387377 3489645 3365683 3666440 4170265
14552D170265P55797Q13190J519041J937708M423985Q605431J6259216M781293
$$ 4170265 4926062 5739252 7258293 9196001 13619986 22225417 38484633 43265926
14544D3265926B0239928I826711j629052r71188l606039j130135J40710p32523
$$ 43265926 20239928 9826711 8197659 7226471 3620432 2490297 2631007 1898484
14536A898484N94171o6723n8527Q6514l87845K87034L76042l79631n9037K13554
$$ 1898484 2492655 2425932 2367405 2453919 2066074 2353108 2729150 2349519 2290482 2504036
14526B504036r8360J12491j18067o2998L20122p7415K12605r1021J82162l12644
$$ 2504036 2405676 2518167 2400100 2337102 2657224 2579809 2792414 2701393 2883555 2570911
14516B570911N5955L81993l2064J69825n27127M13604m47434N64601m6675n8129
$$ 2570911 2626866 3008859 2976795 3146620 2619493 3033097 2585663 3150264 3103589 3045460
14506C045460J68032r765J36776j92413M04348k24546j90875L14112j02217J03102
$$ 3045460 3213492 3203727 3340503 3148090 3552438 3327892 3137017 3451129 3348912 3452014
14496C452014N6211K82263m6862j57316K95688p31385M97060P8481j61405O33895
$$ 3452014 3508225 3790488 3743626 3586310 3881998 3150613 3647673 3726154 3564749 4198644
14486D198644n10833L20445M468N1255L7119L0388R9452R3563k06275Q9224J70086
$$ 4198644 3687811 4008256 4012724 4063979 4101098 4131486 4230938 4324501 4118226 4207450 4377536
14475D377536M36777q70764M14530K41380l2298Q5407J33734k02074L17073l55300
$$ 4377536 4814313 3943549 4358079 4599459 4567161 4652568 4786302 4584228 4901301 4546001
14465D546001M33960M7348l8279k8438J43173j83699L3692K71091K4390J92402
$$ 4546001 4979961 5027309 4989030 4960592 5103765 4920066 4953758 5224849 5249239 5441641
14455E441641m1511k9788J4380K88798L0961j08088K51151L20984k39144J16788
$$ 5441641 5400130 5370342 5384722 5673520 5704481 5596393 5847544 6168528 5929384 6046172
14445F046172J45112o5095L07344j66432K49877J61667j38395L28001k90184K30212
$$ 6046172 6191284 6126189 6433533 6267101 6516978 6678645 6540250 6868251 6578067 6808279
14435F808279M65377m63079M88725J71219q2762J19854J86904K34308o2885K11384
$$ 6808279 7273656 6810577 7299302 7470521 7387759 7507613 7694517 7928825 7865940 8077324
14425H077324L8229k73427L60106J74934L86433l34989J51170K72593J66556K30352
$$ 8077324 8115553 7842126 8202232 8377166 8763599 8428610 8579780 8852373 9018929 9249281
14415I249281M8060j63641K40353K09607K66284o1604K63657m6324N15685J42511
$$ 9249281 9297341 9133700 9374053 9583660 9849944 9788340 10051997 10005673 10521358 10663869
14405A0663869k21272M57716L1925K38648L26551K71696J45187L69194j58412
$$ 10663869 10442597 10900313 10932238 11170886 11497437 11769133 11914320 12283514 12125102
14396A2125102r3121K64416M47234N07854j1690K3005M45692M32486j84762P05153
$$ 12125102 12031981 12296397 12743631 13251485 13239795 13262800 13708492 14140978 13956216 14661369
14386A4661369l59436K02575O55281L08752J44944N51985M54981J55320m11131
$$ 14661369 14301933 14504508 15159789 15468541 15613485 16165470 16620451 16775771 16364640
14377A6364640O42093M23399L51250M93197J26104M80483J69975Q77464J40229
$$ 16364640 17006733 17430132 17781382 18274579 18400683 18881166 19051141 19928605 20068834
14368B0068834M35345J68344N14742O85281L68152L54673O31318N74673K5726
$$ 20068834 20504179 20672523 21187265 21872546 22240698 22595371 23226689 23801362 23827088
14359B3827088R40192L29042N13118O54433K19619P70505J237432k9014R10959
$$ 23827088 24767280 25096322 25609440 26263873 26483492 27253997 28491429 28462415 29373374
14350B9373374Q73778O35545Q70039Q57921Q09125Q16082O51984J434573P96595
$$ 29373374 30247152 30882697 31752736 32610657 33419782 34235864 34887848 36322421 37119016
14341C7119016Q52622J071058J060041J227704J436521J164315Q20633J503207
$$ 37119016 37971638 39042696 40102737 41330441 42766962 43931277 44751910 46255117
14333D6255117J436270J477149J508077J625296J339708J917362J711729J744414
$$ 46255117 47691387 49168536 50676613 52301909 53641617 55558979 57270708 59015122
14325E9015122K097510J921525K076632K551435K080258K650056K212943L105189
$$ 59015122 61112632 63034157 65110789 67662224 69742482 72392538 74605481 77710670
14317G7710670K537480L383844L438658L378006L353651L600895L895627M378689
$$ 77710670 80248150 83631994 87070652 90448658 93802309 97403204 101298831 105677520
14309A05677520M615068M430918N281147N063904N106374N688404N963573O915640
$$ 105677520 110292588 114723506 120004653 125068557 130174931 135863335 141826908 148742548
14301A48742548O641455P400232P781055Q051213Q599748Q838185R548076J0021642
$$ 148742548 155384003 162784235 170565290 178616503 187216251 196054436 205602512 215624154
14293B15624154J0391803J1531306J1345631J2247550J2727783J3169216J3793202
$$ 215624154 226015957 237547263 248892894 261140444 273868227 287037443 300830645
14286C00830645J4190473J4275102J4725995J4787575J4540054J4719960J4118902
$$ 300830645 315021118 329296220 344022215 358809790 373349844 388069804 402188706
14279D02188706J3700328J2621521J1799278J0665244Q512071N195062K356068
$$ 402188706 415889034 428510555 440309833 450975077 459487148 464682210 467038278
14272D67038278R33597Q3981L07233p80736m465080n311422q525233j0427939
$$ 467038278 467971875 468055856 468363089 467582353 463117273 457805851 449280618 438852679
14264D38852679j1922574j3199560j3408474j5074664j4834318j5383955j5388284
$$ 438852679 426930105 413730545 400322071 385247407 370413089 355029134 339640850
14257C39640850j5047654j5455262j4462228j4117646j3918584j1224049j2205984
$$ 339640850 324593196 309137934 294675706 280558060 266639476 255415427 243209443
14250B43209443j2177875j1058887j1049749j0051676r637884q680741q552229
$$ 243209443 231031568 219972681 208922932 198871256 189233372 180552631 172000402
14243A72000402p759225p435873p299409o700075o296171n703785n506136n426790
$$ 172000402 164241177 156805304 149505895 142805820 136509649 130805864 125299728 119872938
14235A19872938n038470m913108m144073m589378l122452m403372l656366l492580
$$ 119872938 114834468 109921360 105777287 101187909 98065457 93662085 90005719 86513139
14227H6513139k980755l163808l029643l010525k532616k730997j991589k026189
$$ 86513139 83532384 80368576 77338933 74328408 71795792 69064795 67073206 65047017
14219F5047017k235754k268991k002765j712392j760006j488696j620517j713387
$$ 65047017 62811263 60542272 58539507 56827115 55067109 53578413 51957896 50244509
14211E0244509j596599j527550j420054j304620m88761j332052j248631j204380
$$ 50244509 48647910 47120360 45700306 44395686 43906925 42574873 41326242 40121862
14203D0121862j465365q78798q36172n46773j102170r32003j097808r86110p03134
$$ 40121862 38656497 37777699 36941527 36394754 35292584 34360581 33262773 32276663 31573529
14194C1573529p92512q41105n71279o96403o77708m59338j107196j28275r50329
$$ 31573529 30781017 29939912 29368633 28672230 27994522 27535184 26427988 26299713 25349384
14185B5349384l91136m11980n25610n40540o74838j23197q38986m30686m68363
$$ 25349384 24958248 24546268 24020658 23480118 22805280 22682083 21843097 21412411 20944048
14176B0944048k93147k84635o51018o13797L7648n98935k92079n62120k56764
$$ 20944048 20650901 20366266 19715248 19101451 19139099 18540164 18248085 17685965 17429201
14167A7429201k92368k88690m55896j2690m31987j03866m60175j38833k55632
$$ 17429201 17136833 16848143 16392247 16379557 15947570 15843704 15383529 15244696 14989064
14158A4989064m25260k65719J05692m65289l62815m04071P59j16486l03779k55517
$$ 14989064 14563804 14298085 14403777 13938488 13575673 13171602 13172361 13055875 12752096 12496579
14148A2496579j7481k19602p4033k11028k49492k41167J6331n36020N1933j15848
$$ 12496579 12479098 12259496 12185463 11974435 11724943 11483776 11500107 10964087 11016020 10900172
14138A0900172n8979p89797P23225o40371l72234Q5536Q7969j74702l09034q1715
$$ 10900172 10841193 10051396 10774621 10134250 9762016 9847552 9935521 9760819 9451785 9370070
14128I370070k8880j37880r7047j40652l18034k38905K39143l42539K34173l29503
$$ 9370070 9341190 9203310 9106263 8965611 8647577 8408672 8647815 8305276 8539449 8209946
14118H209946r1089m73098K52436k14796j21913K95303n80879k42559K80626k91686
$$ 8209946 8118857 7645759 7898195 7683399 7561486 7856789 7275910 7033351 7313977 7022291
14108G022291J31819l5777l62911o4178L47861k75392j38490m79529M92328m00419
$$ 7022291 7154110 7118333 6755422 6691244 7039105 6763713 6625223 6145694 6638022 6237603
14098F237603L79589o97794J17702O7471N2377j65945j42334J123p7179m41057
$$ 6237603 6617192 5919398 6037100 6104571 6156948 5991003 5848669 5849792 5772613 5331556
14088E331556O3334n276J67463L9205J5169k6668l10853L73516m43382k24080
$$ 5331556 5394890 5389614 5557077 5596282 5611451 5584783 5273930 5647446 5204064 4979984
14078D979984L06442l807m37230K89908j2765l16526l8534J42441j22340j78867
$$ 4979984 5286426 5282619 4845389 5135297 5122532 4806006 4767472 4909913 4787573 4608706
14068D608706J28702J8846j56654j60696L30049l54746j86029O9484n6168j35563
$$ 4608706 4737408 4756254 4599600 4438904 4768953 4414207 4228178 4297662 4241494 4105931
14058D105931J0261L89169l76917k12k18687J39374j87643K14749o26660L61678
$$ 4105931 4116192 4505361 4128444 4128232 3909545 4048919 3861276 4076025 3449365 3811043
14048C811043j29798K40462k17074q4053J30647l83297L30866j45713j21682J28063
$$ 3811043 3681245 3921707 3704633 3620580 3751227 3367930 3698796 3553083 3431401 3559464
14038C559464k62789k64713M96477l98088k3748K97541m739P8085k47485L5708
$$ 3559464 3296675 3031962 3528439 3130351 3106603 3404144 3399405 3477490 3230005 3265713
14028C265713Q9180l74487K00349j99284j80592K4901K9842O4419j06963K79018
$$ 3265713 3354893 2980406 3180755 2981471 2800879 2825780 2855622 2920041 2813078 3092096
14018C092096l6054o9272l46288q0965r105j8712R7935J4539j51790Q7943k36651
$$ 3092096 3056042 2986770 2640482 2559517 2550412 2531700 2629635 2644174 2492384 2580327 2343676
14007B343676J13772K98276j69438J1770J38946l21320J58780j89065l27768N40717
$$ 2343676 2457448 2755724 2586286 2598056 2737002 2415682 2574462 2385397 2057629 2598346
13997B598346n50712K54633k29779Q6040N11894j77533M29311O16844J448229
$$ 2598346 2047634 2302267 2072488 2158528 2670422 2492889 2922200 3539044 4987273
13988D987273L407789P059890J6272580J3303472j8828995j2512316n244605k245109
$$ 4987273 8395062 15454952 31727532 45031004 26202009 13689693 8445088 6199979
13980F199979j056679p62055m21764l08399j01864m6762m55242k18843n6933p3677
$$ 6199979 5143300 4381245 3959481 3651082 3549218 3502456 3047214 2828371 2771438 2697761
13970B697761Q7024K2874o6095J53338j78739l2511j89684k9125o7698n4695j05521
$$ 2697761 2784785 2807659 2741564 2894902 2716163 2683652 2493968 2464843 2397145 2342450 2236929
13959B236929Q2977P7030j27490k66102M17504k37424L2210k22286J04385l6782
$$ 2236929 2319906 2396936 2269446 2003344 2420848 2183424 2215634 1993348 2097733 2060951
13949B060951j18826O0059m4279k66217K80430l54434J22070K57425j16214J05827
$$ 2060951 1942125 2002184 1957905 1691688 1972118 1617684 1739754 1997179 1880965 1986792
13939A986792j97070R7690k70261L63297j78697k81519L17880q4426k64064J63487
$$ 1986792 1789722 1887412 1617151 1980448 1801751 1520232 1838112 1753686 1489622 1653109
13929A653109k11699K78361j72657O551J79508r1964J88385J2486l28814k9091
$$ 1653109 1441410 1719771 1547114 1553665 1733173 1641209 1829594 1842080 1513266 1484175
13919A484175L8038K43553k65730L02165k26097j60284J54582Q3532K02710j35199
$$ 1484175 1522213 1765766 1500036 1802201 1576104 1415820 1570402 1653934 1856644 1721445
13909A721445j59848r5654M97259k73725k44892l9764j07008K10676k07511K77102
$$ 1721445 1561597 1465943 1963202 1689477 1444585 1404821 1297813 1508489 1300978 1578080
13899A578080j90218J44656L8150J832M8556k49756l71845M64471k0539q036M42900
$$ 1578080 1387862 1532518 1570668 1572500 1621056 1371300 999455 1463926 1443387 1435351 1878251
13888A878251m49891m94239M67346K4800o9251k99028j8042L17144j94034j3074
$$ 1878251 1428360 934121 1401467 1426267 1357016 1057988 1039946 1357090 1163056 1149982
13878A149982J60780m5648K38597k36471K27951l33359j17447L15181l03309L91824
$$ 1149982 1310762 1265114 1503711 1267240 1495191 1161832 1044385 1359566 1056257 1448081
13868A448081n89919K56777J49628P8910m01499L99925j77673O7424J3468J64822
$$ 1448081 858162 1114939 1264567 1343477 941978 1341903 1164230 1231654 1245122 1409944
13858A409944L8276m18155P6430Q1714m80J89059l95435J64354k0584k23922K30470
$$ 1409944 1448220 1030065 1106495 1188209 1187729 1376788 981353 1145707 1125123 901201 1131671
13847A131671j13300j50589K91219K07675k91782o5892j2525N67483o45407M72792
$$ 1131671 1018371 867782 1159001 1366676 1074894 1009002 996477 1563960 918553 1391345
13837A391345k86115J29684j78242j32976L97383n87723K69517K67799n52643
$$ 1391345 1105230 1234914 1056672 923696 1321079 733356 1002873 1270672 718029
13828G18029M19840j49707Q362j48663J65788D25130P55843p300n72167L63429
$$ 718029 1137869 988162 996524 847861 1013649 425130 1180973 1173673 601506 964935
13818I64935Q8298r3590k45284J69740K84153E57511J22536N61740l02940M013
$$ 964935 1053233 959643 714359 884099 1168252 557511 680047 1241787 938847 942860
13808I42860j25700K28924K17344m84258K96109O2929l34643l76125K00438J40600
$$ 942860 817160 1046084 1263428 779170 1075279 1138208 803565 427440 627878 768478
13798G68478j88052K76880J30845J9018k39954Q2777m0594M18674k85617m0032
$$ 768478 580426 857306 988151 1007169 767215 849992 809398 1228072 942455 902423
13788I02423l3046k97274L79288k21224Q2645J74484l46846J91674p0069J42403
$$ 902423 869377 572103 951391 730167 812812 987296 640450 832124 762055 904458
13778I04458Q3846J0519j62278J1739j16659J25733j29289M6298l1838k0147j90080
$$ 904458 988304 998823 836545 848284 731625 857358 728069 774367 742529 722382 532302
13767E32302Q4564M46030n19508J85926R8127k38228J62924Q3916l7365J40772
$$ 532302 616866 1062896 543388 729314 827441 589213 752137 836053 798688 939460
13757I39460P3652k88767J13581j02005K57291k70771o1724p9119L0357L26870
$$ 939460 1013112 724345 837926 735921 993212 722441 660717 581598 611955 938825
13747I38825C81223K6013j48263M44813J85563k86173J48921l08175M14125q1660
$$ 938825 381223 407236 258973 703786 889349 603176 752097 443922 858047 776387
13737G76387Q0319J3358j29070K58613j71744j41862k61700K84m94L12687j19001
$$ 776387 856706 870064 740994 999607 827863 686001 424301 424585 424091 736778 617777
13726F17777k83438M48415K9137k08016J25678B95380L59420j41891J33494k16215
$$ 617777 334339 782754 811891 603875 729553 295380 654800 512909 646403 430188
13716D30188N7589R1015k61747M59248K7992j01927K9941k15731o7446L1867J75518
$$ 430188 487777 578792 317045 776293 804285 702358 732299 516568 449122 480989 656507
13705F56507K18696k31561r1930K7290N4697Q013k18143K35076j03647q4919J48909
$$ 656507 875203 643642 551712 579002 633699 641712 423569 658645 554998 470079 618988
13694F18988l08406L95748k75042K06934C01416J52768Q4078J74125k99962K86886
$$ 618988 310582 706330 431288 638222 301416 454184 538262 712387 412425 699311
13684F99311L3603A2644M22837J77767k75285N6629j0207j50169J60802k39J49603
$$ 699311 732914 12644 435481 613248 337963 394592 384385 234216 395018 394779 544382
13673E44382j06689k6458J28341K02922A14116L75369j01342K53862j66867J60668
$$ 544382 437693 411235 539576 742498 114116 489485 388143 642005 475138 635806
13663F35806k69969J61182j15157L9895J31552Q0047B76424L51769j34119L51101
$$ 635806 365837 527019 411862 451757 583309 663356 276424 628193 494074 845175
13653H45175l488F5916L98591J32807k69156N97706C87147p8396J86615A51811
$$ 845175 841687 65916 464507 597314 328158 925864 387147 308751 495366 151811
13642G11577C44117J65070m6314J69156B75495M40169k48988j5438G1535O21829
$$ 711577 344117 509187 462873 632029 275495 715664 466676 451238 71535 693364
13632F93364j66258o8858R5096n8130k19273M52042k48068j50569M9145J59193
$$ 693364 527106 458248 553344 495214 275941 727983 479915 329346 378491 537684
13622E37684m1127N4912j67207o6554L90519k42647j12823n1142Q3890p1179L27381
$$ 537684 496557 551469 384262 317708 708227 465580 352757 301615 385505 314326 641707
13611F41707P2063k62554B6856K35302N0562J29676j27166K86505j61498Q5924
$$ 641707 713770 451216 26856 262158 312720 442396 315230 601735 440237 526161
13601E26161k49863J22591o1707J17925n6229K04391k76345A57385L11597k1940
$$ 526161 276298 398889 337182 455107 398878 603269 326924 157385 468982 447042
13591D47042J29799J97973j12823B92992L959K3757j47275K44319P2737A14680
$$ 447042 576841 774814 661991 292992 296951 320708 173433 417752 490489 114680
13580D49474J77941r5175A89769K33410j22243R1800K5858A93241C875M61351
$$ 449474 627415 532240 189769 423179 300936 392736 418594 193241 3875 465226
13570D65226k29718J66829Q4330A99587I0197P2070J42395j27899L73334A53667
$$ 465226 235508 402337 486667 199587 90197 162267 304662 176763 550097 153667
13559c6357D67518A89792J23235k200L93546k76915j12580A54673D9471J79592
$$ -36357 467518 189792 313027 310827 704373 427458 314878 154673 49471 229063
13549B29063j3681E6324K12522J00113Q1799K26337A40731M66114H443J70998
$$ 229063 215382 56324 268846 368959 450758 677095 140731 606845 8443 179441
13539A79441J90329A01282K58411H2321J66805N9524p6164a01779E25006L1872
$$ 179441 369770 101282 359693 82321 249126 308650 232486 -101779 525006 556878
13529E56878B49643a7029C83813j53008J36309K1814j29988n9553N1673J32716
$$ 556878 249643 -17029 383813 230805 367114 388928 258940 199387 251060 383776
13519C83776j69977M3611J57565J35561K77400l33516j76760B3123P6086L30185
$$ 383776 213799 257410 414975 550536 827936 494420 317660 23123 99209 429394
13509D29394j34814j906j12040J70744n5629R8205j31151K65954A86353q7295
$$ 429394 294580 292674 180634 351378 295749 393954 262803 528757 186353 99058
13499I9058M44620A62597K30792m9469j67363J25011J01356A78652l0876m3015
$$ 99058 543678 162597 393389 343920 176557 301568 402924 178652 147776 104761
13489A04761J97116J34182j76092L2603p608m4347J24404I1930N0030P3536K4281
$$ 104761 301877 436059 259967 292570 284962 240615 365019 91930 141960 215496 239777
13478B39777j7666J55951o3402j0176o6645j13151M2448K05581c35905A94830
$$ 239777 222111 378062 314660 304484 237839 124688 167136 372717 -335905 194830
13467C56078Q7710j99924a1477F59925B94753A4918K96984Q1375A63988L29078
$$ 356078 443788 243864 -11477 659925 294753 14918 311902 393277 163988 493066
13457D93066l6280j84114r6273L24441j51886F9808K64115P0857J15501B57128
$$ 493066 456786 272672 176399 500840 348954 69808 333923 404780 520281 257128
13446D89267c611k2477A92507p3903b81479A00732L446j3386j6857J07054L15026
$$ 489267 -3611 -26088 192507 118604 -281479 100732 104178 90792 73935 180989 496015
13435D96015B22660e8957D11021r4058d644C55914q7887J80100j80856K53137
$$ 496015 222660 -58957 411021 316963 -4644 355914 268027 448127 267271 520408
13425E20408k09711A23144K43225A78678L57637A48968K47244A34318Q2549p2856
$$ 520408 310697 123144 366369 178678 536315 148968 396212 134318 216867 144011
13415A44011J50128G943N3953b96366B90541j8838E9868M26377n0434k11402K2563
$$ 144011 294139 7943 61896 -296366 290541 271703 59868 486245 435811 224409 246972
13404B46972G7840J84745m8143M38231B66037Q4875A07436L62207D9658N70698
$$ 246972 77840 262585 214442 652673 266037 350912 107436 469643 49658 620356
13394F20356A80689J43339q3474a17352B3856a40402E9028K98229N967K44166
$$ 620356 180689 324028 240554 -117352 23856 -140402 59028 357257 363224 607390
13384F07390k58341j07156r9229n719K11440j10995n3133q5702J99078K97622
$$ 607390 349049 241893 142664 136945 348385 237390 184257 98555 297633 595255
13374E95255j89801c09742A50630K09771J28894B43252J45271j83781Q4618K2807
$$ 595255 405454 -309742 150630 360401 489295 243252 388523 204742 289360 312167
13364C12167m742B7620L42626j56530J24106H5336Q0760J50883E6822L95185B13782
$$ 312167 307425 27620 370246 213716 337822 85336 166096 316979 56822 452007 213782
13352C37619m7262C2501K66483K853a25008a9302A870f3211A03354J37038R387
$$ 337619 290357 32501 298984 301837 -125008 -19302 1870 -63211 103354 240392 249779
13341B49779J6263A01804K42904o8862j19212P1860M2880j32230Q7780R9661e1397
$$ 249779 266042 101804 344708 275846 156634 228494 271374 139144 226924 326585 -51397
13329C61177l2792q0937H1690P5146K67987j09192g5486C4462L86326D0509O3992
$$ 361177 328385 247448 81690 156836 424823 315631 -75486 34462 420788 40509 104501
13318A04501f0390C64024o1877J9336B7115J78255a88112A53689j4940l944J43870
$$ 104501 -60390 364024 302147 321483 27115 205370 -188112 153689 138749 134805 278675
13307B78675J13110j65124K07166H4491d6289D77819A92680K0950K29175B18514
$$ 278675 391785 226661 433827 84491 -46289 477819 192680 213630 442805 218514
13296h1655A00753M49465A18123E8207M2651N3654J75347j1121G8298Q4259c7407
$$ -81655 100753 550218 118123 58207 100858 154512 329859 318738 78298 162557 -37407
13284B24315J19452a9583F41398B84231N7209r4495a21418F2120h8729D88369
$$ 224315 343767 -19583 641398 284231 341440 246945 -121418 62120 -88729 488369
13273A31595M5794J27112b04616D1433J18436J83907A38793a3599L61D47362A43612
$$ 131595 177389 304501 -204616 41433 159869 343776 138793 -13599 -13238 447362 143612
13261F6376K477B4091b5357C77030b6405C68557A53835a01021B39507J25384f1576
$$ 66376 68853 24091 -25357 377030 -26405 368557 153835 -101021 239507 364891 -61576
13249A84314l7844N5037l4388o935a00983j52185C85976j92549A780M42108i3906
$$ 184314 146470 201507 167119 160184 -100983 -253168 385976 193427 1780 443888 -93906
13237C0647K56414d8491r0105C6828L03966A62697A2464L25328a34612A02309
$$ 30647 287061 -48491 -138596 36828 340794 162697 12464 337792 -134612 102309
13226c6494A58920j5952a04592I562i96C14810D4903o026J7128J27103O6526i9191
$$ -36494 158920 142968 -104592 9562 -996 314810 44903 38877 56005 183108 249634 -99191
13213A09642M9757l8697J87341a16883A15071J49759J6311b91890A00476i7409
$$ 109642 159399 120702 308043 -116883 115071 264830 281141 -291890 100476 -97409
13202A07529K45279A63217E7803j4782e8083A73211Q7820a86586A27831L3727
$$ 107529 352808 163217 57803 43021 -58083 173211 261031 -186586 127831 161558
13192A61558K68338F2284N1977J9551L82684F4922K1360J96082d6583b78A46162
$$ 161558 429896 62284 114261 133812 516496 64922 86282 282364 -46583 -278 146162
13180D6854e2660A85883M0137F5428M4735D8710g4071D7437g192B39124g7149
$$ 46854 -52660 185883 226020 65428 110163 48710 -74071 47437 -7192 239124 -77149
13168B64505G4427L10858e4092D03640G1192J44356G4884J90480e7094k24893
$$ 264505 74427 385285 -54092 403640 71192 215548 74884 265364 -57094 -281987
13158b81987f3170H4554P8289d8823C31031P7132a74527A35076a15787K077C61593
$$ -281987 -63170 84554 162843 -48823 331031 408163 -174527 135076 -115787 -113710 361593
13146G9396a01459j33651A45320l6116i9847b2144j23855f2720A39954R3838o2477
$$ 79396 -101459 -235110 145320 109204 -99847 -22144 -145999 -62720 139954 233792 171315
13135A71315J2852p5312O5692b26951H7790K87758n1918A02173J50067q3892d4897
$$ 171315 184167 108855 174547 -226951 87790 375548 323630 102173 252240 168348 -44897
13123A67615O378k6809a9084A51478l6095M0538c091l66485A313P5552J69748
$$ 167615 173993 147184 -19084 151478 115383 155921 -3091 -369576 1313 76865 246613
13112B46613j10462a26019A56936K15205A02177K64706a5658g531B56507g0637
$$ 246613 136151 -126019 156936 372141 102177 366883 -15658 -7531 256507 -70637
13101B48768i6195A20159J00777H5953a16896K6669E3663B2770K21135C9103J53575
$$ 248768 -96195 120159 220936 85953 -116896 -90227 53663 22770 243905 39103 192678
13090A92678D6178b0469A08837b8270J4070C48619c3865G5572a4732k85139G2583
$$ 192678 46178 -20469 108837 -28270 -14200 348619 -33865 75572 -14732 -299871 72583
13078g0954A45071i5244B49053F2053B0422K22702a35652A7111L46801e7466A85708
$$ -70954 145071 -95244 249053 62053 20422 243124 -135652 17111 363912 -57466 185708
13066B18228G1431L15606a31477c5882A26235a7065B6216J22276B313M50977C4481
$$ 218228 71431 387037 -131477 -35882 126235 -17065 26216 148492 2313 453290 34481
13054a33838m7065A29336Q8084c3674C415Q9223O7015a95472D23016G5790Q3204
$$ -133838 -180903 129336 217420 -33674 3415 92638 159653 -195472 423016 75790 158994
13043A58994a61208B06254b81093M0105C60647a36425D32381A36064E4039J46932
$$ 158994 -161208 206254 -281093 -240988 360647 -136425 432381 136064 54039 200971
13033B00971p4788J23126r4322J73711A23178a60903A95917M395G5543A9815J77248
$$ 200971 126183 249309 154987 328698 123178 -160903 195917 200312 75543 19815 197063
13022A97063K5657p3326J07396a17287c2876n6315l5853A12827E2500g2742L4527
$$ 197063 222720 149394 256790 -117287 -32876 -89191 -125044 112827 52500 -72742 -38215
13011c8215I8537J61780m8317b8513C719b38789a5954A78141q1441J43487A07930
$$ -38215 98537 260317 212000 -28513 3719 -238789 -15954 178141 96700 240187 107930
12999b27709H9338c2885B48236C978K3824N4978O8963L1183q0665g8303A98003
$$ -227709 89338 -32885 248236 3978 27802 82780 151743 182926 102261 -78303 198003
12987A21538J98834F5087a0746A66606a67092j24408J13141G0041P6120a85432
$$ 121538 320372 65087 -10746 166606 -167092 -291500 -178359 70041 146161 -185432
12976A31757d6554H8670C7995d9986C69265j29129F379K06543q992n9272C2910
$$ 131757 -46554 88670 37995 -49986 369265 240136 6379 212922 203930 144658 32910
12964f2979H1436J7246P5840J71743B1366m98J9533J26910a10365k4994c7715
$$ -62979 81436 98682 174522 346265 21366 20868 40401 167311 -110365 -135359 -37715
12952a13435p0539O100Q2840j96429O6328h5769A8394K4009a72446g2296A53820
$$ -113435 -183974 -177874 -95034 -291463 -225135 -85769 18394 42403 -172446 -72296 153820
12940B82635o2644o9100J73880A05735b37633A53857K94248A46546P8343b5241
$$ 282635 219991 150891 324771 105735 -237633 153857 448105 146546 224889 -25241
12929A79027o00N8504D7929J11437G6873C4942a1054D4069J87126I60a4560j26496
$$ 179027 178427 236931 47929 159366 76873 34942 -11054 44069 231195 960 -14560 -141056
12917a41056B43455J31102a39590E6523L1305a17385D75694j36106D1349J36133
$$ -141056 243455 374557 -139590 56523 87828 -117385 475694 339588 41349 177482
12907A77482k6236J09423P8788A029i5688A25152a43898D9376K9265a94148Q1023
$$ 177482 151246 260669 339457 1029 -95688 125152 -143898 49376 78641 -194148 -113125
12896a13125C40198A9966d9286j39903G5883J17164K43480g9530C87383d5861
$$ -113125 340198 19966 -49286 -189189 75883 193047 436527 -79530 387383 -45861
12885A18679L1744f5283A33530J29169j5992B4124K26323M5140c2380C868J06284
$$ 118679 150423 -65283 133530 262699 246707 24124 250447 295587 -32380 3868 110152
12874A10152N9234j1186d2550B37260a82199i0440b8849B12861a56230b7363A37770
$$ 110152 169386 158200 -42550 237260 -182199 -90440 -28849 212861 -156230 -27363 137770
12862A12500R2535D1843L12805a99624C11414j33647H0063a89614M1579G6656
$$ 112500 205035 41843 354648 -199624 311414 177767 80063 -189614 -148035 76656
12851E92839f0858m8828A3082K01914p4730M42786B00707J63562A17369m8603
$$ 592839 -60858 -109686 13082 214996 140266 583052 200707 364269 117369 68766
12841F8766K87823a2260F9397C3875f1190j8117A2927K93806i2031A09170i0810
$$ 68766 356589 -12260 69397 33875 -61190 -79307 12927 306733 -92031 109170 -90810
12829a25464A61897a66452O4221B07642I9371K51272h2042j61021F7204Q9876
$$ -125464 161897 -166452 -102231 207642 99371 350643 -82042 -243063 67204 157080
12819A57080e8080a3902E3704b25233B8810J48790q30j8701O1975b85160a7498
$$ 157080 -58080 -13902 53704 -225233 28810 177600 176770 158069 220044 -285160 -17498
12807a08546A72298D8237e5989E711a18786B51486g5263C23255c31851a49629
$$ -108546 172298 48237 -55989 5711 -118786 251486 -75263 323255 -331851 -149629
12796B39792n3870H1869b55867a07344A6050c58562D4477A1615f9762A78271f4921
$$ 239792 185922 81869 -255867 -107344 16050 -358562 44477 11615 -69762 178271 -64921
12784B24947r3884a6801r404G0519L18273B3847a71087E5047K2576J92228h1741
$$ 224947 131063 -16801 -26205 70519 388792 23847 -171087 55047 77623 269851 -81741
12772d66715D8210a4732l33458c6522A18907i4090o195A66141O9446C7613L6744
$$ -466715 48210 -14732 -348190 -36522 118907 -94090 -100285 166141 235587 37613 74357
12761G4357K47118h4097h165j821B21570c26948J29251j29954b7730j37880L9208
$$ 74357 321475 -84097 -8165 -9986 221570 -326948 -197697 -327651 -27730 -165610 -126402
12750a26402B0651Q3824R2540I071O9999l0939M8549a35912A35293a18240a0583
$$ -126402 20651 104475 197015 9071 79070 48131 96680 -135912 135293 -118240 -10583
12738h1241I5049J04627f5345A92172D6654L83827A38614A8534a46931m0434f1119
$$ -81241 95049 199676 -65345 192172 46654 430481 138614 18534 -146931 -187365 -61119
12726B63277d5435m25238E3388a60583B52386b53318a24845D3355J51852C8749
$$ 263277 -45435 -470673 53388 -160583 252386 -253318 -124845 43355 195207 38749
12715H8803e9514B0880h2711a6251A27395i2047A30200a35481C45514D0568J8765
$$ 88803 -59514 20880 -82711 -16251 127395 -92047 130200 -135481 345514 40568 59333
12704E9333A3369K02177a04199C23878j32524a18128c2720D18501A71389b4383
$$ 59333 13369 215546 -104199 323878 191354 -118128 -32720 418501 171389 -24383
12693A55304K5196b32870C8035J48365i4276o0822C80172m6539a30288D9334l872
$$ 155304 180500 -232870 38035 186400 -94276 -155098 380172 333633 -130288 49334 45462
12682D5462c79460a54459C96191h8977B24168r6831n1312j7209d07051C3912J7850
$$ 45462 -379460 -154459 396191 -88977 224168 127337 76025 58816 -407051 33912 51762
12671E1762O1862d03263b6957i323A04405E776R2814J9427A0697a49882J1908
$$ 51762 113624 -403263 -26957 -9323 104405 5776 98590 118017 10697 -149882 -137974
12660a37974G0820N9352J26927r0696J99644d1849k8575C21339b055j12130A07849
$$ -137974 70820 130172 257099 166403 366047 -41849 -70424 321339 -2055 -114185 107849
12648I9716A2405J09518Q6444k1760C6725Q3998E9847K75155o3680c59914c0088
$$ 99716 12405 121923 208367 186607 36725 120723 59847 335002 271322 -359914 -30088
12636A46684i1214B32186K28755j13136c0726A59631K3278l4066K9176P2606J06465
$$ 146684 -91214 232186 460941 347805 -30726 159631 182909 148843 178019 250625 357090
12625C57090a42700A36836J37192j35407N7074I7486F229J90735k2012o0449e005
$$ 357090 -142700 136836 274028 138621 195695 97486 6229 196964 174952 114503 -5005
12613a89138A42603b02132I5866a40801D62758G2501a51496b1037B42917A06910
$$ -189138 142603 -202132 95866 -140801 462758 72501 -151496 -21037 242917 106910
12602i7232A53679k0546j6641l4222e0206I8038a25233A04033Q9057c4352A02143
$$ -97232 153679 133133 116492 82270 -50206 98038 -125233 104033 193090 -34352 102143
12590B8816K02010D9112b1879I7604k4083i3824K0328C24882A8511a86262O8254
$$ 28816 230826 49112 -21879 97604 73521 -93824 -73496 324882 18511 -186262 -118008
12579a18008H4181K04343C1399J40920E19h1350m943j43389e7671D01670A94721
$$ -118008 84181 288524 31399 172319 519 -81350 -86293 -229682 -57671 401670 194721
12567B02520p0637J2253a18316K010B24436a06997I9364R1549b04969D3927J33141
$$ 202520 131883 144136 -118316 -116306 224436 -106997 99364 190913 -204969 43927 177068
12556A77068e8254A11976O0209L3365N6486A08630b01880j20015C87815a32009
$$ 177068 -58254 111976 172185 205550 262036 108630 -201880 -321895 387815 -132009
12545A19677B8762h3719o4468M4087B665a26243k8950A60059a25897l19617f4271
$$ 119677 28762 -83719 -148187 -104100 2665 -126243 -155193 160059 -125897 -445514 -64271
12533D01365b13451B3572M0187Q3425b76769h628A15549d6100A53626G3149J35149
$$ 401365 -213451 23572 63759 147184 -276769 -8628 115549 -46100 153626 73149 208298
12522B08298m9539h1993j80288e0086e033A0946J61347E1285N73618F256a09975
$$ 208298 158759 -81993 -262281 -50086 -5033 10946 172293 51285 624903 6256 -109975
12510a73873B43602b9052A00028a17782A4264a70177A51419J48010a47744B972
$$ -173873 243602 -29052 100028 -117782 14264 -170177 151419 299429 -147744 2972
12499H2567e5851b7548D9133j3947J38255B1019b18106e6842G1888h0079G764
$$ 82567 -55851 -27548 49133 35186 173441 21019 -218106 -56842 71888 -80079 7764
12487C28684C1016R2575k0841D2961P0011M9945A833a32759D0161f9610B13498
$$ 328684 31016 123591 102750 42961 112972 162917 1833 -132759 40161 -69610 213498
12475H3534b78298a2218D4015M6885k3203j8055h5607j1329q8333L4980l2701
$$ 83534 -278298 -12218 44015 90900 67697 49642 -85607 -96936 -185269 -150289 -182990
12464a82990G8842J27352I1002b66488a515n6971j75948A73061m127b7342A57146
$$ -182990 78842 206194 91002 -266488 -1515 -58486 -234434 173061 168934 -27342 157146
12452A03532b04572E2775h9852j25899E282P779b32092A22919h1911B19772E5548
$$ 103532 -204572 52775 -89852 -215751 5282 13061 -232092 122919 -81911 219772 55548
12440h4847G0967R3592K12689A54890M5731e0636j4797D4695L6061k7037b86697
$$ -84847 70967 164559 377248 154890 200621 -50636 -65433 44695 80756 53719 -286697
12428c37301A36753c058H3578R9769h5362A4467j240J57088h6257R99F5328B6915
$$ -337301 136753 -3058 83578 183347 -85362 14467 13227 170315 -86257 -85258 65328 26915
12415g7100B51318C5385i9520F942J25576a17244C09564j28064c27352B68663
$$ -77100 251318 35385 -99520 6942 132518 -117244 309564 181500 -327352 268663
12404a56838B20983a36676d5466H9663i0702n0353L5721j8662b5281B07702A6088
$$ -156838 220983 -136676 -45466 89663 -90702 -141055 -105334 -123996 -25281 207702 16088
12392b11338d3728k0344A68186c65077B3171b11405i2912A38618m2313i0739j12618
$$ -211338 -43728 -64072 168186 -365077 23171 -211405 -92912 138618 96305 -90739 -203357
12381b03357j87382G6457c94439J79910A81519F4777K9404J68285a38213A33329
$$ -203357 -390739 76457 -394439 -214529 181519 64777 94181 262466 -138213 133329
12370b63964i757j67799C20747h7932A39235n3134l3672b91099a01313h883B25524
$$ -263964 -9757 -177556 320747 -87932 139235 86101 52429 -291099 -101313 -8883 225524
12358B29821g6337k10435e7152B82865j35424d16370J91421A05442B4461J52162
$$ 229821 -76337 -286772 -57152 282865 147441 -416370 -224949 105442 24461 176623
12348A76623a10080H2287a84105g954q2109A38941B9813a55439a9430B57460G9976
$$ 176623 -110080 82287 -184105 -7954 -90063 138941 29813 -155439 -19430 257460 79976
12336a04833A41505J4041C8474L49235j61997i2753B27258d77498A27418k2918
$$ -104833 141505 155546 38474 387709 225712 -92753 227258 -477498 127418 104500
12326A04500K6549J2530a78381A00057c6931r4902j69823A3024b0754A158a12723
$$ 104500 131049 143579 -178381 100057 -36931 -131833 -301656 13024 -20754 1158 -112723
12314A23859J0148b6137A36670L41907c14394A39445c7743C13314c51191D4046
$$ 123859 134007 -26137 136670 478577 -314394 139445 -37743 313314 -351191 44046
12303G0872Q4624F8151k7818J8277c47373G1271j8731G706J83784F6558R8167
$$ 70872 155496 68151 40333 58610 -347373 71271 52540 7706 191490 66558 164725
12292A64725F0911L27837A43359E4420e3302m6656I6202B233J61166J96759h6280
$$ 164725 60911 388748 143359 54420 -53302 -99958 96202 2233 163399 360158 -86280
12280a79900A79974i9055b7731l9636E5537d8859H8849J88479o1553p1504G0728
$$ -179900 179974 -99055 -27731 -67367 55537 -48859 88849 277328 215775 144271 70728
12268b03560i281p1709A57370b47178B5699L2207b13251A8300K39710c02228a42789
$$ -203560 -9281 -80990 157370 -247178 25699 57906 -213251 18300 258010 -302228 -142789
12256I575M7551b93273G281J5209b8960j71413C51858a20140L2463B27262e2153
$$ 9575 57126 -293273 7281 22490 -28960 -200373 351858 -120140 -87677 227262 -52153
12244C03970A37339j5575b8771B94731c1300l0233j790B1731J85455m5371F6334
$$ 303970 137339 121764 -28771 294731 -31300 -61533 -63323 21731 207186 161815 66334
12232B02971d1529H0433M8920g6040I4141J62801K6409E742J84631r4681a53552
$$ 202971 -41529 80433 129353 -76040 94141 256942 283351 5742 190373 95692 -153552
12220A26686a86071A70953p9843K18675I0333f6003j25523B7589J49284b23370
$$ 126686 -186071 170953 91110 309785 90333 -66003 -191526 27589 176873 -223370
12209f5433C80126b31303Q4439A36511L98953j99911A56079o5471A3843K91997
$$ -65433 380126 -231303 -146864 136511 535464 335553 156079 90608 13843 305840
12199C05840I7927N5833J70917d6353A54866b97228A88177K12235H2690L29815
$$ 305840 97927 153760 324677 -46353 154866 -297228 188177 400412 82690 412505
12189D12505f1503C19453a13523A70121F6668j1720R6455c41091h0666I5056K26098
$$ 412505 -61503 319453 -113523 170121 66668 54948 151403 -341091 -80666 95056 321154
12178C21154p2033a673D3744K72708b5545B9149Q1571B5850J39136P6467J78295
$$ 321154 249121 -1673 43744 316452 -25545 29149 110720 25850 164986 241453 419748
12167D19748A24550J71381g3011D7971c04043B98287H2891a7728K713I5885j3152
$$ 419748 124550 295931 -73011 47971 -304043 298287 82891 -17728 -15015 95885 82733
12156H2733O0701L2928K95455A67595m3828a34326H6799N3255J0495E0256Q9614
$$ 82733 143434 176362 471817 167595 123767 -134326 86799 140054 150549 50256 139870
12145A39870c25566A09545f3886L1786j6386C48243D1810K31515H3670K51175
$$ 139870 -325566 109545 -63886 -32100 -48486 348243 41810 273325 83670 334845
12135C34845D0857J40731F2915R1755n8327a17821p4643h2793A17714a10079B22424
$$ 334845 40857 181588 62915 154670 96343 -117821 -192464 -82793 117714 -110079 222424
12123B78613A37122k9421j9923b27582D65347d2516B03713b879l86291a80803
$$ 278613 137122 107701 87778 -227582 465347 -42516 203713 -2879 -389170 -180803
12112B65418a35907d6268I4650a11633m39672b63251J5773B87943c97202B54663
$$ 265418 -135907 -46268 94650 -111633 -551305 -263251 -247478 287943 -397202 254663
12101A32033i8243k5005L7329B07840f2346p3570a7782E4711a75763B6075a03464
$$ 132033 -98243 -123248 -85919 207840 -62346 -135916 -17782 54711 -175763 26075 -103464
12089A95058f5478A35477P0485a71544B55135F8135d9300l3322F1098h4243A20646
$$ 195058 -65478 135477 205962 -171544 255135 68135 -49300 -82622 61098 -84243 120646
12077B36199h5315A07309K1339f8153D3666n804Q544j8852J06351N8432R1496
$$ 236199 -85315 107309 128648 -68153 43666 37862 46406 27554 133905 192337 283833
12066B83833L44068J190536B44446B1214J30960a04849C25410H1198B9796i2980
$$ 283833 627901 1818437 244446 21214 152174 -104849 325410 81198 29796 -92980
12055A62281i0628I5081b13917K8457Q1316l3016B41683d28526B2615L08024a51692
$$ 162281 -90628 95081 -213917 -185460 -104144 -137160 241683 -428526 22615 330639 -151692
12043A59784J13657D9276f6541A9704a24270F8887d9133k93144B58831E7267J52719
$$ 159784 273441 49276 -66541 19704 -124270 68887 -49133 -342277 258831 57267 209986
12032B09986c56047J68708A1594J32238D2588c1964A29157E6543c0623m8071B05883
$$ 209986 -356047 -187339 11594 143832 42588 -31964 129157 56543 -30623 -78694 205883
12020d7229C6078J04827d7177r3787k50662c9374r7766B02821B6862M1032Q5067
$$ -47229 36078 140905 -47177 -140964 -391626 -39374 -137140 202821 26862 67894 152961
12009A52961K28332e1873l5446B19328H0831d29925e1976D58292b42633A19507
$$ 152961 381293 -51873 -87319 219328 80831 -429925 -51976 458292 -242633 119507
11998C38293b8983r1196k0516A08612L7758F193a87682H2044c04641J51884d0822
$$ 338293 -28983 -120179 -140695 108612 146370 6193 -187682 82044 -304641 -152757 -40822
11986D7130a53826j26458c4990H4143i7064j53290A14144g7856G2565a78450Q0307
$$ 47130 -153826 -280284 -34990 84143 -97064 -250354 114144 -77856 72565 -178450 -98143
11975i8143d912k44082N3841k09165B57591E2237b89917M4788A62060b9373l65329
$$ -98143 -4912 -248994 -195153 -404318 257591 52237 -289917 -245129 162060 -29373 -394702
11964c94702C8141Q6587b11709K8974A79994a10472b7514j77565J2935K2920p5052
$$ -394702 38141 124728 -211709 -182735 179994 -110472 -27514 -205079 -192144 -169224 -244276
11953b44276O6581b7053C2670g7685l5031k37428A6061P2039a24008d528m33092
$$ -244276 -177695 -27053 32670 -77685 -112716 -350144 16061 88100 -124008 -4528 -437620
11942d37620E0144b61272c8706A35181b2028l0467C18792a05039D92144a19005
$$ -437620 50144 -261272 -38706 135181 -22028 -52495 318792 -105039 492144 -119005
11931b43660a4761B33692b26199f8564m6076n5655A48533o6958i1282L9117A10614
$$ -243660 -14761 233692 -226199 -68564 -114640 -170295 148533 81575 -91282 -52165 110614
11919B45258F323a11756d0223m079o0175L7401A01586l1474J13507p4859j052
$$ 245258 6323 -111756 -40223 -44302 -104477 -67076 101586 70112 183619 108760 107708
11908A07708f2637B30536A01898J20493a7514l31275E3111A7208a36670A21708
$$ 107708 -62637 230536 101898 222391 -17514 -348789 53111 17208 -136670 121708
11897g7300m14774b8069j57790A30845l9634b2065l21701a45489e9392J7073H3013
$$ -77300 -492074 -28069 -185859 130845 91211 -22065 -343766 -145489 -59392 -42319 83013
11885A35891e5843A30994n3280f2557k79283A39899c40719L1251F4435k4959e03545
$$ 135891 -55843 130994 77714 -62557 -341840 139899 -340719 -309468 64435 39476 -503545
11873B63202a95222e0952i293p4076b5511k97534E3847a96325d7709C1761J54166
$$ 263202 -195222 -50952 -9293 -83369 -25511 -323045 53847 -196325 -47709 31761 185927
11862A85927b20975A747K2676a05163r820r9956Q1601E6611E399b27304b6070
$$ 185927 -220975 1747 24423 -105163 -114983 -214939 -133338 56611 5399 -227304 -26070
11850B85034A25549b28803J09306q7948Q8084A23859a51703c1994A10777d3281
$$ 285034 125549 -228803 -119497 -207445 -119361 123859 -151703 -31994 110777 -43281
11839B71625G3592a36909l70431B9666R2684m5234O2332o5680J56711I1895Q8782
$$ 271625 73592 -136909 -507340 29666 122350 77116 139448 73768 230479 91895 180677
11828A80677D4147h3851L4788H7008g7162j73895B59199B5466d04657d3682A01178
$$ 180677 44147 -83851 -49063 87008 -77162 -251057 259199 25466 -404657 -43682 101178
11816a22156C21684A43910K15265j51098j8767k069e12452E7458a77761A5805
$$ -122156 321684 143910 359175 208077 189310 187241 -512452 57458 -177761 15805
11805a75965Q0849p9101B43444c66351B11905I0670b06090A00122a5052l0114
$$ -175965 -95116 -174217 243444 -366351 211905 90670 -206090 100122 -15052 -45166
11795d5166B36079g2519p3883a9619j51877A70248q962i5876A27706K31127A20838
$$ -45166 236079 -72519 -146402 -19619 -171496 170248 161286 -95876 127706 358833 120838
11783E2602a97613k12529E4186f6753J4515A47461g8233E5154a48208k25377A00925
$$ 52602 -197613 -410142 54186 -66753 -52238 147461 -78233 55154 -148208 -373585 100925
11771C8079O1226c5675l28730I9074J78547b10010B29459b15021A69258d1693
$$ 38079 99305 -35675 -364405 99074 277621 -210010 229459 -215021 169258 -41693
11760d10l8976j93561g8768P248A58883a44639A334h1628B00477c16487O0198
$$ -410 -39386 -232947 -78768 -71520 158883 -144639 1334 -81628 200477 -316487 -256289
11749b56289m8739G9433g2140j81312a7009B6117K28928a68018B61894c10760
$$ -256289 -305028 79433 -72140 -253452 -17009 26117 255045 -168018 261894 -310760
11738b80506a36605c6384G7833j2120a62252k06696a03975p5591A49533a49000
$$ -280506 -136605 -36384 77833 65713 -162252 -368948 -103975 -179566 149533 -149000
11727d04820J90352h7084A58900g9932j17862A16028e731A04530d7137I9558e5923
$$ -404820 -214468 -87084 158900 -79932 -197794 116028 -5731 104530 -47137 99558 -55923
11715a47998B65342J2930Q7508h5317a5407D14630j84518b4136j54944l03D1103
$$ -147998 265342 278272 365780 -85317 -15407 414630 230112 -24136 -179080 -179383 41103
11703f7509H561O0801b57320I754i7264j48781E3841d6060B10267B2491b11782
$$ -67509 8561 69362 -257320 9754 -97264 -246045 53841 -46060 210267 22491 -211782
11691D58102A59565J03632d3204C20677a2489j85751p540A0095c43859B98881
$$ 458102 159565 263197 -43204 320677 -12489 -198240 -205780 10095 -343859 298881
11680A16187a92100A80032B7386a16132H3586b32756B5363N3242b07085A05152
$$ 116187 -192100 180032 27386 -116132 83586 -232756 25363 78605 -207085 105152
11669h488l2495j60894f6539j03287c4870D2296b24590N4420e5134B45929d9513
$$ -8488 -40983 -201877 -66539 -169826 -34870 42296 -224590 -170170 -55134 245929 -49513
11657D27264l8899G9194f6304L1817m4485b1240C8832n875a69464A19037l4115
$$ 427264 388365 79194 -66304 -34487 -78972 -21240 38832 32957 -169464 119037 84922
11646H4922R5368c29147A76622d2649A93686f9095j23828d4851H409h7368b5785
$$ 84922 180290 -329147 176622 -42649 193686 -69095 -192923 -44851 8409 -87368 -25785
11634a40971A99817c96835c5742p0369J7575a0020m4852A26487a00570L4693H4114
$$ -140971 199817 -396835 -35742 -106111 -88536 -10020 -54872 126487 -100570 -65877 84114
11622b2570A74619b45545B7282a66084e7645n525o5831M2288C90037C6297a30501
$$ -22570 174619 -245545 27282 -166084 -57645 -63170 -129001 -86713 390037 36297 -130501
11610A01685B9995a26658p1268i0181l2044n2423b976o9317K7712r4655B76915
$$ 101685 29995 -126658 -197926 -90181 -122225 -174648 -2976 -72293 -44581 -139236 276915
11598A75794N8383F3434A5366a54915P4116C82675A30261b26036e7251A13162
$$ 175794 234177 63434 15366 -154915 -80799 382675 130261 -226036 -57251 113162
11587H2616K7378a27262A43361P9833o5704c5371F3830M9273i2063G5444F181
$$ 82616 109994 -127262 143361 223194 157490 -35371 63830 113103 -92063 75444 6181
11575A23481E9990O191a39862N5997b1849j50615B96722a10880k24886J07358
$$ 123481 59990 66181 -139862 -83865 -21849 -172464 296722 -110880 -335766 -228408
11565b28408c6148p722C33380a06900O652I8176a97225C10100C3057N8468J66105
$$ -228408 -36148 -43870 333380 -106900 -100248 98176 -197225 310100 33057 91525 257630
11554B57630c09372J2435B75433j16913a46970G3726a02738k4008j24954A00714
$$ 257630 -309372 -296937 275433 158520 -146970 73726 -102738 -126746 -251700 100714
11543D2487J7603B8203L59527h7200C15032a33887C27940A4392b04123K3488A04006
$$ 42487 60090 28203 387730 -87200 315032 -133887 327940 14392 -204123 -180635 104006
11531D4279J09220K21749i3239A7138g3703e907A53588F9807J73313B3985a47706
$$ 44279 153499 375248 -93239 17138 -73703 -5907 153588 69807 243120 23985 -147706
11519B60848b29517b5354j62575A72179c7419l70710E2183N9543d6601D42107
$$ 260848 -229517 -25354 -187929 172179 -37419 -408129 52183 111726 -46601 442107
11508a26967M6633B51111C0647a12749H6100i641C9247R0272k0219A0738P4986
$$ -126967 -80334 251111 30647 -112749 86100 -9641 39247 129519 109300 10738 85724
11497H5724J9758a11757C29382D8941L4228L88902d1093H3392L9316l1853a32618
$$ 85724 105482 -111757 329382 48941 83169 472071 -41093 83392 122708 90855 -132618
11485G5210K24449B6669a6176A74602k5748C768J48540g5956l6153q7700I7897
$$ 75210 299659 26669 -16176 174602 148854 3768 152308 -75956 -112109 -199809 97897
11473A8768O3959L39543a38901B07502J52125f6565F0089b8008k58986B00328
$$ 18768 82727 422270 -138901 207502 359627 -66565 60089 -28008 -286994 200328
11462E7055b6651j09882B89029i2042c6945j93959C14759d8198A04072L55699
$$ 57055 -26651 -136533 289029 -92042 -36945 -230904 314759 -48198 104072 459771
11452D59771b50221A57893a541A01818a18964C8783b6429A25802n1549K2074L64634
$$ 459771 -250221 157893 -1541 101818 -118964 38783 -26429 125802 74253 96327 460961
11441D60961G3316J13305n1538A7480J21127e9568q3030A52941P1054G0866M109
$$ 460961 73316 186621 135083 17480 138607 -59568 -142598 152941 223995 70866 74975
11430G4975B8357K09278h4266H921g2548M193A22320C3741L6589l2486N0178B0080
$$ 74975 28357 237635 -84266 8921 -72548 -68355 122320 33741 70330 37844 88022 20080
11417a56133L6653N4394D7849J34878J56085E5401a73297E9283k5811c76657a3462
$$ -156133 -119480 -65086 47849 182727 338812 55401 -173297 59283 33472 -376657 -13462
11405d3785k19706f2650K5980p0646M6373K0135B22463c9117H8949m3976j5261
$$ -43785 -263491 -62650 -36670 -107316 -60943 -40808 222463 -39117 88949 44973 29712
11394B9712a55421L314d339E0971Q7429E4247b98123K1459g087k39386J18966
$$ 29712 -155421 -152107 -4339 50971 138400 54247 -298123 -276664 -7087 -246473 -127507
11383a27507l0081A33419a27254H9391D1349J18014J0613n1496f6324A23042C6731
$$ -127507 -157588 133419 -127254 89391 41349 159363 169976 118480 -66324 123042 36731
11371E7335a733m0008k0383p4138A23810j2429a64219g1944C5814b52875C5926
$$ 57335 -1733 -41741 -62124 -136262 123810 111381 -164219 -71944 35814 -252875 35926
11359F2135b2028j60353O1943k65196a88028J6406l00738b00218j9492I6223e4560
$$ 62135 -22028 -182381 -120438 -385634 -188028 -171622 -472360 -200218 -219710 96223 -54560
11347F2093a54557N7381j09940A58420b78351f3361j4989d774j96465a2964l6847
$$ 62093 -154557 -97176 -207116 158420 -278351 -63361 -78350 -4774 -201239 -12964 -49811
11336d9811C6477c8387j41798O4222A24187b10532Q9398H036a5722l07046D2939
$$ -49811 36477 -38387 -180185 -115963 124187 -210532 -121134 8036 -15722 -322768 42939
11324c4028P119A40026B1635c00651R1404B12373B9810P2930a29469D5379J52633
$$ -34028 -26909 140026 21635 -300651 -209247 212373 29810 102740 -129469 45379 198012
11313A98012F4609K48688a62640j834d5313A589a63894k54485a45712j191A39889
$$ 198012 64609 313297 -162640 -164474 -45313 1589 -163894 -418379 -145712 -146903 139889
11301a81595d7257A55513a96840O9887m9j51430R5723j37967j24608a27889P769
$$ -181595 -47257 155513 -196840 -126953 -127002 -278432 -182709 -320676 -445284 -127889 -120120
11290a20120K1600C46935L114G9627b467k06410i434j97555B37606D1636R7878
$$ -120120 -98520 346935 350049 79627 -2467 -208877 -9434 -206989 237606 41636 139514
11279A39514a187B2646K15213B9890i3079D1528G075L5161a27958l4332K2627
$$ 139514 -1187 22646 237859 29890 -93079 41528 7075 42236 -127958 -162290 -139663
11268a39663k65994I1192g8183B58484d19714J73789B4444J84518C0755b14082
$$ -139663 -405657 91192 -78183 258484 -419714 -245925 24444 208962 30755 -214082
11257C00800m4654p5849J32397c6994A89281a11884A07517a11434j34587l05335
$$ 300800 256146 180297 312694 -36994 189281 -111884 107517 -111434 -246021 -551356
11247e51356I2007J53993g2495G8079A1827i7929k1917l7288F875c29951h8330
$$ -551356 92007 246000 -72495 78079 11827 -97929 -119846 -157134 6875 -329951 -88330
11235H8248f9274c4396A43040a9316l50034A42125D17N8213a47629C9253a11153
$$ 88248 -69274 -34396 143040 -19316 -369350 142125 417 58630 -147629 39253 -111153
11223d39B784K96771A4890b11698H8684J86373E3226a86310mD1326f6157j52483
$$ -439 2784 299555 14890 -211698 88684 275057 53226 -186310 -186314 41326 -66157 -218640
11211b18640e2668H4342K09666e7216r2597j90120a21776C13865c55905J19423
$$ -218640 -52668 84342 294008 -57216 -149813 -339933 -121776 313865 -355905 -236482
11201b36482k0262j99654J34520E7702A8381a20476N0964k05085h51k16051o4951
$$ -236482 -256744 -456398 -321878 57702 18381 -120476 -69512 -274597 -851 -216902 -281853
11190b81853h0986j48334I7960a95487g7007c3301n5503B57010d557B40473c50608
$$ -281853 -80986 -229320 97960 -195487 -77007 -33301 -88804 257010 -4557 240473 -350608
11178a28481l1332H1611a21443j89033E1371d3504L560A67464B6895f9807D6485
$$ -128481 -159813 81611 -121443 -310476 51371 -43504 -39944 167464 26895 -69807 46485
11166a15684a7939G3074j1188a38822O0590j78497H8346A44P8278B5410N4547
$$ -115684 -17939 73074 61886 -138822 -78232 -256729 88346 144 78422 25410 79957
11155G9957b35689a14905e5032l7198B67832a01650B9462j2015c42561i0366D4563
$$ 79957 -235689 -114905 -55032 -92230 267832 -101650 29462 17447 -342561 -90366 44563
11143b6958l28648a27800k24955h3736J7981C4518d7745E0941c6043B22835C7392
$$ -26958 -355606 -127800 -352755 -83736 -65755 34518 -47745 50941 -36043 222835 37392
11131C20411K5160a12764B10523n8685b88043B3467J06438F0112d1956E7257b43401
$$ 320411 345571 -112764 210523 151838 -288043 23467 129905 60112 -41956 57257 -243401
11119g2205A48957d5684j27546D6320a28723A59368k0309c69534b1728H666d8295
$$ -72205 148957 -45684 -173230 46320 -128723 159368 139059 -369534 -21728 8666 -48295
11107c8017p1231B37020p1485J5804C0218Q1388m0002B6908a04582k58373d3141
$$ -38017 -109248 237020 165535 181339 30218 111606 71604 26908 -104582 -362955 -43141
11095B56589b92579C397i919n9768A44404P8796n2164b938K3k26661I8714a11166
$$ 256589 -292579 3397 -9919 -69687 144404 223200 171036 -2938 -2915 -229576 98714 -111166
11082A93914J72293D4853k0032R5136E8676M02116j58757o7266r8701J66756e3454
$$ 193914 366207 44853 24821 119957 58676 460792 302035 234769 136068 302824 -53454
11070A59944J60011M25938B39245g30A95047K56299B24653K89159j35234c2468
$$ 159944 319955 745893 239245 -730 195047 451346 224653 513812 378578 -32468
11059I72743D19412K89120B93750M4026l1645J14323m578l4546K01360m232B68526
$$ 972743 419412 708532 293750 337776 306131 420454 415876 381330 582690 578458 268526
11047G50490C60552J34548n4983J83480A76734K62879m8215P6036q64G9232M98909
$$ 750490 360552 495100 440117 623597 176734 439613 391398 467434 466570 79232 578141
11036E78141j50214k00639J24285L0952l4413j00279P2224L88894k95197K83363
$$ 578141 427927 227288 351573 382525 348112 247833 320057 708951 413754 697117
11026F97117N0392C44419O9274J42426j46627q1812j2952M2739N3151K47403k83814
$$ 697117 747509 344419 413693 556119 409492 327680 314728 357467 410618 658021 374207
11015C74207k2590R2566K75500A7740N56214j57431r6798j52689M76525j94875
$$ 374207 351617 444183 719683 17740 573954 416523 319725 167036 643561 448686
11005D48686j26863l6443J26723j88577J68851L83846k47738L53586k36793J2865
$$ 448686 321823 285380 412103 223526 392377 776223 528485 882071 645278 658143
10995F58143q5884m199j8263J78681k03694o8276L6324L640J55137l5770L38694
$$ 658143 572259 568060 549797 728478 524784 456508 492832 496472 651609 615839 954533
10984I54533k37866L881j43461P4489L18351o2451k4602J05329M67106K95551
$$ 954533 716667 720548 577087 651576 969927 907476 882874 988203 1455309 1750860
10974A750860j86053J92662J15524J69209J87920J24081n71575l79002k97593
$$ 1750860 1564807 1757469 1872993 2042202 2230122 2354203 1782628 1403626 1106033
10965A106033N6699k72519K23170k50862K52763j85223n2282L8549O9845l9894
$$ 1106033 1162732 890213 1113383 862521 1115284 930061 877779 916328 986173 946279
10955I46279q8245l3954l25316j35522J71862A59460Q7316n1543J9350P9821K35322
$$ 946279 858034 824080 498764 363242 535104 159460 246776 195233 214583 294404 529726
10944E29726F3680l1488L73790C17J4827a72797n0824A55772E8883K37668A45203
$$ 529726 63680 32192 405982 317 15144 -172797 -223621 155772 58883 296551 145203
10932I072K91410D4257l378a80417A70522H372J55345b17323A51329e1022A13630
$$ 9072 300482 44257 40879 -180417 170522 8372 163717 -217323 151329 -51022 113630
10920B04873Q0159I2397J99313I2300a42213f7116r6269H5366C1249b37224c2702
$$ 204873 285032 92397 291710 92300 -142213 -67116 -163385 85366 31249 -237224 -32702
10908g2535A642a71295h0942F6472b28542i0666A25334a03622C09001b50550A6326
$$ -72535 1642 -171295 -80942 66472 -228542 -90666 125334 -103622 309001 -250550 16326
10896A06728b1466A36270a60851P3587b6236F3767b58437J27453B62039a91907
$$ 106728 -21466 136270 -160851 -87264 -26236 63767 -258437 -130984 262039 -191907
10885E2553a36289F3688a09491j70590C804c7498J0980A49245a26776r9040c4473
$$ 52553 -136289 63688 -109491 -280081 3804 -37498 -26518 149245 -126776 -225816 -34473
10873b82415J24770A47843f605F9701a02597D5759a94501D7939K1081c8785A02796
$$ -282415 -157645 147843 -6605 69701 -102597 45759 -194501 47939 69020 -38785 102796
10861b21895A60586a48529H8429M23086A60597o396P7130h2249j67208k847G0090
$$ -221895 160586 -148529 88429 511515 160597 154201 231331 -82249 -249457 -252304 70090
10849A12436E4828M8478B3729J36198K48310a70449G236c9869l04062A33728J06400
$$ 112436 54828 103306 23729 159927 408237 -170449 7236 -39869 -343931 133728 240128
10838B40128a84621B82123j05984b62000A4460a48260C39704c76983H7462a38352
$$ 240128 -184621 282123 176139 -262000 14460 -148260 339704 -376983 87462 -138352
10827C35504j64253f650A66165b54828B97203g3456k32136c435k42587B52708
$$ 335504 171251 -6650 166165 -254828 297203 -73456 -305592 -3435 -246022 252708
10816A20484b58635B2143c23416e2320l40702J00252B5744b42296B68598b82738
$$ 120484 -258635 22143 -323416 -52320 -393022 -292770 25744 -242296 268598 -282738
10805a54378l2892g932l13424B78802a91038m9317c9193j37204a8796r3960c1876
$$ -154378 -187270 -7932 -321356 278802 -191038 -240355 -39193 -176397 -18796 -112756 -31876
10793a93600A91963C1085J52101a33539r5552a14248c3958k99225A69329a20336
$$ -193600 191963 31085 183186 -133539 -229091 -114248 -33958 -333183 169329 -120336
10782a27215B77939h7168I536i2362I8392d8670j43552d8333a8832k768m5271
$$ -127215 277939 -87168 9536 -92362 98392 -48670 -192222 -48333 -18832 -21600 -66871
10771f6871A6547i4332A10624a89021J7393c9906e149j05173d5514C180a33922
$$ -66871 16547 -94332 110624 -189021 -171628 -39906 -5149 -110322 -45514 3180 -133922
10759I7504d5127H5768j255a49059A28613K1254b0154D2382a0321l83678j87894
$$ 97504 -45127 85768 84513 -149059 128613 149867 -20154 42382 -10321 -393999 -581893
10748e81893b60518Q9748M1235D653b12095C37591A62382a48219b0658k8538E6166
$$ -581893 -260518 -170770 -129535 4653 -212095 337591 162382 -148219 -20658 -49196 56166
10736f1691l66765a51448F9840a43012A72128i9641b9867j66229i6993m6912A28478
$$ -61691 -428456 -151448 69840 -143012 172128 -99641 -29867 -196096 -96993 -143905 128478
10724A65938b86496g8243A93805J26819b62566g8378k0669p4092b7708o9431j61588
$$ 165938 -286496 -78243 193805 320624 -262566 -78378 -99047 -173139 -27708 -97139 -258727
10713b58727a26659j42197J22891j28432B16694d8503E4941a20704m67843G7396
$$ -258727 -126659 -268856 -145965 -274397 216694 -48503 54941 -120704 -588547 77396
10702d8858E4220a21023H7521a55193r4594J16770A83966a07500c1538k63513
$$ -48858 54220 -121023 87521 -155193 -249787 -133017 183966 -107500 -31538 -295051
10692b95051C3625a08147K2481j06660I1760B6567P9200b88738G2291C3945b12566
$$ -295051 33625 -108147 -85666 -192326 91760 26567 105767 -288738 72291 33945 -212566
10680A84421A2897K7491b02531D3009b44306d2105B09522c43028B1397e0972J8267
$$ 184421 12897 40388 -202531 43009 -244306 -42105 209522 -343028 21397 -50972 -32705
10669c2705A03246e20415A31765D6824a6573P189k1818j98844J11431n5862j00860
$$ -32705 103246 -520415 131765 46824 -16573 -9384 -31202 -230046 -118615 -174477 -275337
10658b75337A16484a5034j34355M8917n7703A48097i8026j78068g1001C27265
$$ -275337 116484 -15034 -149389 -100472 -158175 148097 -98026 -276094 -71001 327265
10647G3886b57303h5771n1394B60379b01048f0479A54333a17384c9808k00785
$$ 73886 -257303 -85771 -137165 260379 -201048 -60479 154333 -117384 -39808 -240593
10637b40593B5312N7681k050b70870A11489O1524C901b74972A79459n3492a25838
$$ -240593 25312 82993 80943 -270870 111489 173013 3901 -274972 179459 125967 -125838
10625b60798C36398b38420R4442G8711b28854A6987d427I8240b04558k62827F4116
$$ -260798 336398 -238420 -143978 78711 -228854 16987 -4427 98240 -204558 -467385 64116
10613a88493D4281b08645J02703M4638D2012L4376e9933J0166A16378a00117L689
$$ -188493 44281 -208645 -105942 -61304 42012 76388 -59933 -49767 116378 -100117 -96428
10602i6428E9350k3548Q6569H515a34947a3632j73746E8689c27540J13646p2359
$$ -96428 59350 35802 122371 8515 -134947 -13632 -187378 58689 -327540 -213894 -286253
10591b86253B62249F5731d18559C8183j6025c4804j46339J3249O6656k10203A29183
$$ -286253 262249 65731 -418559 38183 22158 -34804 -181143 -167894 -101238 -311441 129183
10579g4003B30090g3507m4784A09962k8241e355E0777J21139q3648f2695A7622
$$ -74003 230090 -73507 -118291 109962 81721 -5355 50777 171916 88268 -62695 17622
10567i5231D5999J6324J35605n1725K59751H4877b42190D27307a05149a4936B79862
$$ -95231 45999 62323 197928 146203 405954 84877 -242190 427307 -105149 -14936 279862
10555a0021j85840d2687k16345J24992K9893B352J80913e5008G3513a37038d0842
$$ -10021 -195861 -42687 -259032 -134040 -104147 2352 183265 -55008 73513 -137038 -40842
10543a96161k28039J62047N774A1260h5356J3654l66994A04107a51675A9418N4842
$$ -196161 -424200 -262153 -256379 11260 -85356 -71702 -438696 104107 -151675 19418 74260
10532G4260c30815A3680a11395A39740J29771n1873d5284k80920a08326r4862
$$ 74260 -330815 13680 -111395 139740 269511 217638 -45284 -326204 -108326 -203188
10522b03188r886L3534h8533l7152q6360n146Q8706J0531k48344A0930b73196
$$ -203188 -213074 -179540 -88533 -125685 -212045 -217191 -128485 -117954 -366298 10930 -273196
10510A39832D5768P9063J16082q4329o9075K2011f5476k22505f7456J1674B63420
$$ 139832 45768 124831 240913 156584 87509 109520 -65476 -287981 -67456 -55782 263420
10498a15733c2131C38226c0411j89162j60986A08444P6283f0273l20254A46980
$$ -115733 -32131 338226 -30411 -219573 -380559 108444 184727 -60273 -380527 146980
10487a26606p2991F2377Q2353A1430Q5628a81956j75178C6635a79886A65415b98598
$$ -126606 -199597 62377 144730 11430 97058 -181956 -357134 36635 -179886 165415 -298598
10475I3856a07783H9488J84636q4181c37349N0812c9530B84633a33608q696b2237
$$ 93856 -107783 89488 274124 189943 -337349 -286537 -39530 284633 -133608 -142304 -22237
10463g9236j71302J00395k85062I4541K4584a89295k5429f4797j561A08949J74602
$$ -79236 -250538 -150143 -435205 94541 119125 -189295 -214724 -64797 -66358 108949 283551
10452B83551g1270L5617H80b37673F3680M5742a46248A4839K6268J97883e5869
$$ 283551 -71270 -35653 880 -237673 63680 109422 -146248 14839 41107 238990 -55869
10440D5133h5905B9224N4728J27625r3902a42831B95036C0744K51412j15348d5869
$$ 45133 -85905 29224 83952 211577 117675 -142831 295036 30744 282156 166808 -45869
10428a39483A78199K3190F133a90095A80580e7546G7296O5112h3115L9941H5047
$$ -139483 178199 201389 6133 -190095 180580 -57546 77296 142408 -83115 -43174 85047
10416B9399g6674L2760j15922A75739F351J33892b47527a12982A50963d9376o4017
$$ 29399 -76674 -43914 -159836 175739 6351 140243 -247527 -112982 150963 -49376 -113393
10405a13393k4314Q444O1158A90705B1633e8124k02513C83J73566a33114A22526
$$ -113393 -137707 -129263 -68105 190705 21633 -58124 -260637 383 173949 -133114 122526
10393h1481C43595j23949b32652C60583g4421J786A30308L6779a12573A13567
$$ -81481 343595 219646 -232652 360583 -74421 -72635 130308 167087 -112573 113567
10382F6859a57285A07924P6930F6308J513K42365K4463n1282a18771A75134c3752
$$ 66859 -157285 107924 184854 66308 67821 310186 334649 283367 -118771 175134 -33752
10370A68843i2831A77271P7787L75296B80140A11699K75437r4845a08038A55382
$$ 168843 -92831 177271 255058 630354 280140 111699 387136 292291 -108038 155382
10359h216A76576M6773C2054K35564c5296D37752j21115l1559O8015L04764E1572
$$ -8216 176576 223349 32054 267618 -35296 437752 316637 285078 353093 657857 51572
10347C52564E190K18226C3161q031i6694G0874b72101C3060K08796b06812B23509
$$ 352564 5190 223416 33161 25130 -96694 70874 -272101 33060 241856 -206812 223509
10335A8905P1192L7185N630c21050C28013l1312a3521H5087g600j25245D39634
$$ 18905 90097 127282 132912 -321050 328013 296701 -13521 85087 -7600 -132845 439634
10323D20499K4600A31213J70666h8986c7831j24590A10207b22167B11956p3261
$$ 420499 445099 131213 301879 -88986 -37831 -162421 110207 -222167 211956 138695
10313A38695F4255f5116D0529J55438d9337r3542l1596p9446Q8025j42910A16829
$$ 138695 64255 -65116 40529 195967 -49337 -142879 -174475 -253921 -165896 -308806 116829
10301a76343L6077e6386C12571a48140c3919F567K33055b51526J7215A82990b9791
$$ -176343 -140266 -56386 312571 -148140 -33919 6567 239622 -251526 -234311 182990 -29791
10289c61451D4266d0266E3873J9453J18346d47773f2902k8473k01184C0581A2306
$$ -361451 44266 -40266 53873 73326 191672 -447773 -62902 -91375 -292559 30581 12306
10277d9713j33745K3595B18410a55919f4758j7635B2044O9230a5032E3872K05436
$$ -49713 -183458 -159863 218410 -155919 -64758 -82393 22044 91274 -15032 53872 259308
10266B59308F0841b82528D23357c4337p8125B28072C965a3174D6650J60135K18584
$$ 259308 60841 -282528 423357 -34337 -112462 228072 3965 -13174 46650 206785 425369
10255D25369A12981a69850A48112a86206f034A05843a03034C4140e9577n1534
$$ 425369 112981 -169850 148112 -186206 -6034 105843 -103034 34140 -59577 -111111
10245a11111q2276d3129l39879A9319e6399J8389k04911c0196j73397I5130k286
$$ -111111 -193387 -43129 -383008 19319 -56399 -38010 -242921 -30196 -203593 95130 92844
10234I2844k6593b91384b4791j07033j91924J52343j5311j73573D9495a01378
$$ 92844 66251 -291384 -24791 -131824 -323748 -171405 -186716 -360289 49495 -101378
10223h7139j36796G6328c7289j1423p8057e4751G0492l2324M1179a54433J7983
$$ -87139 -223935 76328 -37289 -48712 -126769 -54751 70492 38168 79347 -154433 -136450
10212a36450B3359c21734a26907L4682l15703c5791A11468b17631a013j32828
$$ -136450 23359 -321734 -126907 -92225 -407928 -35791 111468 -217631 -1013 -133841
10202a33841j19630B57121b80749a27356j6234L3270A35429e7501A33438b02511
$$ -133841 -253471 257121 -280749 -127356 -143590 -110320 135429 -57501 133438 -202511
10191b44259M3908e2926l93054a32332F387P0628R2193C6416d19138a92868F1306
$$ -244259 -200351 -52926 -445980 -132332 6387 77015 169208 36416 -419138 -192868 61306
10179F6701a20722j8756e882A49393a31736M2956J3078p3915j47696A4556K3161
$$ 66701 -120722 -139478 -5882 149393 -131736 -88780 -75702 -149617 -297313 14556 37717
10168C7717P6578b23842g9278k82052J56130c46A48889n6407a00325b8911C4671
$$ 37717 114295 -223842 -79278 -361330 -205200 -346 148889 92482 -100325 -28911 34671
10156h3606B6088M2317c30693B09607h1307B03488a5590A17042i0903o9124j07202
$$ -83606 26088 68405 -330693 209607 -81307 203488 -15590 117042 -90903 -160027 -267229
10145b67229I962R6098J17178J03756A33592f3247H5857A1799J29806a86884J9592
$$ -267229 9962 106060 223238 326994 133592 -63247 85857 11799 141605 -186884 -167292
10134a67292j588C3020A0262f4546a0151q4871j44031a03B9020M09119a4748m3392
$$ -167292 -168880 33020 10262 -64546 -10151 -95022 -239053 -103 29020 438139 -14748 -58140
10122e8140J7691q5282r7603a03101l0532n7382A8622b24066G5059a97168d2918
$$ -58140 -40449 -125731 -223334 -103101 -133633 -191015 18622 -224066 75059 -197168 -42918
10110A72594D3078h089H8857a46440P2470L4474A24661l6378J39526r6036a47303
$$ 172594 43078 -8089 88857 -146440 -73970 -39496 124661 88283 227809 131773 -147303
10098A0071a35246j3573d0556A67978b0659M814k38208B8241b03003B03421f2574
$$ 10071 -135246 -148819 -40556 167978 -20659 -15845 -254053 28241 -203003 203421 -62574
10086c63740E1709a21606K8169L8525l8008r8101f956j58853A50301a2457j41646
$$ -363740 51709 -121606 -93437 -54912 -92920 -191021 -6956 -165809 150301 -12457 -154103
10075a54103H2890a05072H2849K90713e7484b7218o6342O23D7264N6817c270A8520
$$ -154103 82890 -105072 82849 373562 -57484 -27218 -93560 -92937 47264 104081 -3270 18520
10062a69900A68809M1216b52815a02538r3604A08198c06163d432j12589C63971
$$ -169900 168809 210025 -252815 -102538 -196142 108198 -306163 -4432 -117021 363971
10051a93986n6737b2942m71871K29591A11098a63858k25457J79468j26966B49210
$$ -193986 -250723 -22942 -494813 -265222 111098 -163858 -389315 -209847 -336813 249210
10040A06786a81451A92892D286K1417c1383k12599g7440c7404o5653B23595a95639
$$ 106786 -181451 192892 4286 25703 -31383 -243982 -77440 -37404 -103057 223595 -195639
10028B31716A7665Q1266d870k76042F5658j0760b2678E7527c7307D38959e2698
$$ 231716 17665 98931 -4870 -280912 65658 54898 -22678 57527 -37307 438959 -52698
10016b62756c1921n1420l0988l46568K17522j33195B38334a77636A61368C3469
$$ -262756 -31921 -83341 -114329 -460897 -243375 -376570 238334 -177636 161368 33469
10005a50700q0145b2591E654J51791e9332A2259d46707a10976r0088B3998b40078
$$ -150700 -230845 -22591 5654 157445 -59332 12259 -446707 -110976 -201064 23998 -240078
9993a16807l6337B258d6371k70141E9741N1647b00451c4899r7757B10649i3263
$$ -116807 -153144 2258 -46371 -316512 59741 111388 -200451 -34899 -132656 210649 -93263
9981c27537d3475k40668J39094j25948Q9768j9913A73430m0709a73561F7478b4695
$$ -327537 -43475 -284143 -145049 -270997 -181229 -201142 173430 132721 -173561 67478 -24695
9969b60199i5306A6341c49881e7631k12271J31096k79973c23I9262j9188O4881
$$ -260199 -95306 16341 -349881 -57631 -269902 -138806 -418779 -323 99262 80074 144955
9958A44955M4236J24357b51073B190J66006q507a87745l057o2928m0779a17707
$$ 144955 189191 313548 -251073 2190 168196 159689 -187745 -190802 -253730 -294509 -117707
9946a92919C85211F9686i77B4924J75848c808m2487q3724l29425C48576G1938
$$ -192919 385211 69686 -977 24924 200772 -3808 -46295 -130019 -459444 348576 71938
9934A14166J24014f1580q0K320A59466d7816k6174E3823g6137q4121L8616q076
$$ 114166 238180 -61580 -61660 -59340 159466 -47816 -73990 53823 -76137 -160258 -121642 -129718
9922a29718A98362c98896R9933L0969f4237l45847a80088c9857p538j73835P3765
$$ -129718 198362 -398896 -298963 -267994 -64237 -410084 -180088 -39857 -47395 -221230 -147465
9911a47465j42742L2024E4949d1391j39411E9479a36086l02263H9099f6319B6874
$$ -147465 -290207 -258183 54949 -41391 -180802 59479 -136086 -438349 89099 -66319 26874
9899I6875a70340D6680a29564k1214l0770f9730A93943b5022C53238c22566c7555
$$ 96875 -170340 46680 -129564 -150778 -181548 -69730 193943 -25022 353238 -322566 -37555
9887I6779f5893j1737C784a23954A30566C8966a53746A21849a14693j75370a27239
$$ 96779 -65893 -77630 3784 -123954 130566 38966 -153746 121849 -114693 -290063 -127239
9875B5834b96706i3201B12075a67938b5582B00945I8096m6067i8542B4849M45708
$$ 25834 -296706 -93201 212075 -167938 -25582 200945 98096 52029 -98542 24849 470557
9864D70557i4670G6062h8269l2410B96201c55859a07344d6954j13132r4257N6078
$$ 470557 -94670 76062 -88269 -120679 296201 -355859 -107344 -46954 -160086 -254343 -198265
9853a98265A634c20759F8842b27221a833m9055Q08o6290l4840k39614D1724N3233
$$ -198265 1634 -320759 68842 -227221 -1833 -50888 -50080 -116370 -151210 -390824 41724 94957
9841I4957a53837j22469P3449f8038H8590b06638c2511E4254a4072A91644a16229
$$ 94957 -153837 -276306 -202857 -68038 88590 -206638 -32511 54254 -14072 191644 -116229
9829b84607a27836m3118j2114g3671C01704a8630F4326J27402I707a3835j09530
$$ -284607 -127836 -170954 -183068 -73671 301704 -18630 64326 191728 9707 -13835 -123365
9818a23365d6004A77767a96638C05837a46929i521j15632G5370a51101f9332n7780
$$ -123365 -46004 177767 -196638 305837 -146929 -9521 -125153 75370 -151101 -69332 -127112
9807a27112A91053c3205k25473C54101a33221B55061A10586a94962j27431i0688
$$ -127112 191053 -33205 -258678 354101 -133221 255061 110586 -194962 -322393 -90688
9796A58669b98036a47815L9238m2125j7622A27209J61382a28269m2178K3797F4515
$$ 158669 -298036 -147815 -108577 -150702 -168324 127209 288591 -128269 -170447 -146650 64515
9784a76847B92162A39229b08032K0576g3281l7314F018a29578m2899M1490D602
$$ -176847 292162 139229 -208032 -187456 -73281 -110595 6018 -129578 -172477 -130987 4602
9772a64165A93256e2190j96734B3295a86602d6104j99337l1342f3165G0384b4701
$$ -164165 193256 -52190 -248924 23295 -186602 -46104 -245441 -276783 -63165 70384 -24701
9760F0065h1492r7364h5955B10009m2715d21653B22161c58310a35988M8332n8842
$$ 60065 -81492 -178856 -85955 210009 167294 -421653 222161 -358310 -135988 -87656 -146498
9749a46498J3121C3353d9136m31958f6692k41591g5596G59g9818p1976m1926C72702
$$ -146498 -133377 33353 -49136 -481094 -66692 -308283 -75596 759 -79818 -151794 -193720 372702
9736b77212O8483F9153a44040B93420F4600a50841j18463C33079A07263J24497
$$ -277212 -208729 69153 -144040 293420 64600 -150841 -269304 333079 107263 231760
9726B31760q5621d1372j07610O295j10327D101b71051B36992c94205B41402J53321
$$ 231760 146139 -41372 -148982 -142687 -253014 4101 -271051 236992 -394205 241402 394723
9715C94723e231j99720F8081a5711N77C02248b04925B73612a7979H9821a35137
$$ 394723 -5231 -204951 68081 -15711 -15134 302248 -204925 273612 -17979 89821 -135137
9703b75580b4816j45772g8550j23440h5539L6557j91769P5803a0035o6069m5751
$$ -275580 -24816 -170588 -78550 -201990 -85539 -48982 -240751 -164948 -10035 -76104 -121855
9692a21855M908D7506b75411D4102a23116C24398F8436a42395C0587L1280N05103
$$ -121855 -116947 47506 -275411 44102 -123116 324398 68436 -142395 30587 61867 566970
9681E66970E5990K41456a88077k69468p981e5893F9198d8948G2410d48185a75081
$$ 566970 55990 297446 -188077 -457545 -465526 -55893 69198 -48948 72410 -448185 -175081
9669a3049F8288i8996q7045A30625e4289B34505b50212F3536b91715A99088b32893
$$ -13049 68288 -98996 -186041 130625 -54289 234505 -250212 63536 -291715 199088 -232893
9657d5189j27031O0826k36579F6723B2699a81422A5031R7695g3353k95072D36527
$$ -45189 -172220 -111394 -347973 66723 22699 -181422 15031 112726 -73353 -368425 436527
9645A03890h5898A65156i8288k08838J19417i065j58245L4581A4584c15011a10217
$$ 103890 -85898 165156 -98288 -307126 -187709 -9065 -167310 -132729 14584 -315011 -110217
9633D0667a36861K8964m3363A5170a2314E848a80007P0510j41114a19141C04795
$$ 40667 -136861 -107897 -151260 15170 -12314 5848 -180007 -109497 -250611 -119141 304795
9621B99940b9450j82630m7799p39h1886A36539f5791q2243G7541a78159j36117
$$ 299940 -29450 -212080 -259879 -260618 -81886 136539 -65791 -148034 77541 -178159 -314276
9610c14276h7841A22427c16257O6069l0120C10939a59973J3318M3125j73086E4161
$$ -314276 -87841 122427 -316257 -250188 -280308 310939 -159973 -146655 -103530 -276616 54161
9598e5728j62952A34142K50611a15137l26327I6037J40282c5578j96029a07915
$$ -55728 -218680 134142 384753 -115137 -441464 96037 236319 -35578 -231607 -107915
9587b65956G8444k664Q1015b37713j9876a2405j80338A9455a48287F7703a1754
$$ -265956 78444 75780 156795 -237713 -257589 -12405 -192743 19455 -148287 67703 -11754
9575E05217a39970A5252J46576F4046b08152a00335D5699c37559e0766l9858k20980
$$ 505217 -139970 15252 161828 64046 -208152 -100335 45699 -337559 -50766 -90624 -311604
9564c11604A13066a77398A11614a1476B1848a76753B05361D0442J00418d5334
$$ -311604 113066 -177398 111614 -11476 21848 -176753 205361 40442 140860 -45334
9553a68035j59328J10133m0316r3532J12893H3037h7671a4161q3961m3957b2157
$$ -168035 -327363 -217230 -257546 -351078 -238185 83037 -87671 -14161 -98122 -142079 -22157
9541a39159O1076q2736k73014h8931Q530j92894A13895J75430c8638k81714D2382
$$ -139159 -78083 -160819 -433833 -88931 -80401 -273295 113895 289325 -38638 -320352 42382
9529a72226j82478a48798q9267A08635d90284e2736l5753K3115l70232d8642k18968
$$ -172226 -354704 -148798 -238065 108635 -490284 -52736 -88489 -65374 -435606 -48642 -267610
9518b67610b7701A42695C0968A3956e2355C082b76970A16483a21904e6216C43193
$$ -267610 -27701 142695 30968 13956 -52355 3082 -276970 116483 -121904 -56216 343193
9506a72637K8683E5894h0279F2368P3635i0178j80794g7048A13967a68209O2445
$$ -172637 -143954 55894 -80279 62368 136003 -90178 -270972 -77048 113967 -168209 -105764
9495a05764j42329A94449a90537Q0964J1063k7330A72845A6301O3164i0835A57026
$$ -105764 -248093 194449 -190537 -109573 -98510 -125840 172845 16301 79465 -90835 157026
9483B72215a1059I1944C2983b44446g0769k04343e4691n5938j10900D3391a04911
$$ 272215 -11059 91944 32983 -244446 -70769 -275112 -54691 -110629 -221529 43391 -104911
9471G5161a52160m1056F8953d79749g3082D14195b88216h8137b4602m5582A89580
$$ 75161 -152160 -193216 68953 -479749 -73082 414195 -288216 -88137 -24602 -70184 189580
9459c3236A20250i8718A70541a63837D7499a40565o1578C54705b49293E2560K83421
$$ -33236 120250 -98718 170541 -163837 47499 -140565 -202143 354705 -249293 52560 335981
9448C35981A14842a82652D0151b72934C0711a40262k47031A82347p9243f0882
$$ 335981 114842 -182652 40151 -272934 30711 -140262 -387293 182347 103104 -60882
9437b49127a07473e0424k3545l4751G6291a49296I9129a18598n9637A88339a51484
$$ -249127 -107473 -50424 -73969 -108720 76291 -149296 99129 -118598 -178235 188339 -151484
9425A62463B1854b0679k88743i8873A6785N4766J32519c45090a63452H2058j0353
$$ 162463 21854 -20679 -309422 -98873 16785 71551 204070 -345090 -163452 82058 71705
9414G1705J51338a8840A12882l9405M2504c10187e1162A1264J03673c38871f2631
$$ 71705 223043 -18840 112882 73477 115981 -310187 -51162 11264 114937 -338871 -62631
9402a55802B18761c7099k11605k71G9395c06602a15374K8063A5393J08361C1817
$$ -155802 218761 -37099 -248704 -248975 79395 -306602 -115374 -87311 15393 123754 31817
9390b79954K8638A69222a91968h1255L6999j53061C70464I2799e7605q1297N8685
$$ -279954 -251316 169222 -191968 -81255 -44256 -197317 370464 92799 -57605 -138902 -80217
9379h0217H0713P2194b26616p8761k9525g0753D515c41740I6302b26866e7329
$$ -80217 80713 152907 -226616 -305377 -334902 -70753 4515 -341740 96302 -226866 -57329
9367B82096a14574G5896k6702a26677N7938j06287d2300j03574B99270b09543
$$ 282096 -114574 75896 49194 -126677 -68739 -175026 -42300 -145874 299270 -209543
9356I6516a71951j0072N335A03044J04034a63656O3283j14133R8852p7341K3722
$$ 96516 -171951 -182023 -176688 103044 207078 -163656 -100373 -214506 -115654 -192995 -169273
9345a69273D5586a3347k87333G0487J82794a28845c1457j01056j99039F3045J47004
$$ -169273 45586 -13347 -300680 70487 253281 -128845 -31457 -132513 -331552 63045 210049
9334B10049d4557E19468A75117a44148E5389d3792l5200k72815A11515a33193
$$ 210049 -44557 519468 175117 -144148 55389 -43792 -78992 -351807 111515 -133193
9323b67930J27021j91076i6036j22057n6064G4286a47435m2365E9757J48972a74342
$$ -267930 -140909 -331985 -96036 -218093 -274157 74286 -147435 -189800 59757 208729 -174342
9311C5637K00810f8815G6911J16729a59195B60517j13716d12924J42748H4022
$$ 35637 236447 -68815 76911 193640 -159195 260517 146801 -412924 -270176 84022
9300a68553m3503h8284B63735a4160k49134l34151K05736A55004b69908a03490
$$ -168553 -212056 -88284 263735 -14160 -263294 -597445 -391709 155004 -269908 -103490
9289e4696f501I0518B7961a25337b8559A65305d98603C32949E7538c633j48094
$$ -54696 -6501 90518 27961 -125337 -28559 165305 -498603 332949 57538 -3633 -151727
9278a51727G5537O4726b46012a18572A65625p4500K068b79740A32571F3876i3262
$$ -151727 75537 140263 -246012 -118572 165625 91125 93193 -279740 132571 63876 -93262
9266d31400i5948F8489a16154l3881o5443a1435A6640b31221J8772N3818a6337
$$ -431400 -95948 68489 -116154 -150035 -215478 -11435 16640 -231221 -212449 -158631 -16337
9254d0759k14336E1293a75644F3232g2233o3472p4034A74521a06224D5878R689
$$ -40759 -255095 51293 -175644 63232 -72233 -135705 -209739 174521 -106224 45878 55567
9243E5567b34581f7275j76952P8526e7571a8205A3187P3441P0184a04601A57038
$$ 55567 -234581 -67275 -244227 -165701 -57571 -18205 13187 86628 156812 -104601 157038
9231C339b91770A3414h3191A59427c2193J5202B24438a14269A38992b81060d1672
$$ 3339 -291770 13414 -83191 159427 -32193 -16991 224438 -114269 138992 -281060 -41672
9219B38158b48831d2846m2214j71365k2778A47759j4484F6033a83827E2464A2690
$$ 238158 -248831 -42846 -85060 -256425 -279203 147759 133275 66033 -183827 52464 12690
9207b41503Q1047j35270l6470E3862a75434G4785c5964C2087b22804a6290k15486
$$ -241503 -160456 -295726 -332196 53862 -175434 74785 -35964 32087 -222804 -16290 -231776
9196b31776L4133B02901r7243i4282o1325G0116c4189C3710J54126a30386H7961
$$ -231776 -197643 202901 105658 -94282 -155607 70116 -34189 33710 187836 -130386 87961
9184b25913e7896j30477R1531r5327A3503J77908a33682E5907a62938j17944A48151
$$ -225913 -57896 -188373 -96842 -192169 13503 191411 -133682 55907 -162938 -280882 148151
9172E2558J30686a71191C21174b59790R4894D5708d8532p838A65679a5301F6619
$$ 52558 183244 -171191 321174 -259790 -164896 45708 -48532 -56370 165679 -15301 66619
9160a80140a3179j31765A76522n2313a94237f7261a3245A48752o2705b0887A7230
$$ -180140 -13179 -144944 176522 124209 -194237 -67261 -13245 148752 86047 -20887 17230
9148a47595n0475l6399G8080N5944f6912j11172Q501A26952g9461o5299a9402
$$ -147595 -198070 -234469 78080 134024 -66912 -178084 -169583 126952 -79461 -144760 -19402
9136a85279I4940a12443D5993a75502O0626A16349g8336b3154k7863j52637P9544
$$ -185279 94940 -112443 45993 -175502 -114876 116349 -78336 -23154 -51017 -203654 -124110
9125a24110e4900k8774l10506C36628b43293j80745a98018Q4760a0111k91544
$$ -124110 -54900 -83674 -394180 336628 -243293 -424038 -198018 -113258 -10111 -301655
9115c01655b3004r5978F2538g023A07710O6786a68500G9212a31366j23242O6852
$$ -301655 -23004 -118982 62538 -7023 107710 174496 -168500 79212 -131366 -254608 -187756
9104a87756e2316B98709c2324o6477C5882b15715e7987j74290j8804J09266L6018
$$ -187756 -52316 298709 -32324 -98801 35882 -215715 -57987 -232277 -251081 -141815 -105797
9093a05797l3430A70788a99630l6951A75929D7545b24615J3841Q4155A34451E0443
$$ -105797 -139227 170788 -199630 -236581 175929 47545 -224615 -210774 -126619 134451 50443
9081C04940A45362F7614b81209C5865b9896F3595j8576b66180P1997F357J87511
$$ 304940 145362 67614 -281209 35865 -29896 63595 45019 -266180 -194183 6357 193868
9070A93868f5300D649d8317G597a63533B15831a73764F8648b92765h7655k241
$$ 193868 -65300 4649 -48317 7597 -163533 215831 -173764 68648 -292765 -87655 -89896
9059h9896A0824f6811j52684G5095f2015j21877j7301g7677l99418K14981i5093
$$ -89896 10824 -66811 -219495 75095 -62015 -183892 -201193 -77677 -477095 -262114 -95093
9047B10002R8175A07473J37585J19785a59292q7765C41751h5269k3216F2650J41536
$$ 210002 308177 107473 245058 364843 -159292 -247057 341751 -85269 -108485 62650 204186
9036B04186a32493A41150l7817J09760P7767e5453A8976a94836A81725a49386
$$ 204186 -132493 141150 103333 213093 290860 -55453 18976 -194836 181725 -149386
9025F3821c7862F3491a10837o7942l6281A33438b43094k19084C46233A04438m464
$$ 63821 -37862 63491 -110837 -178779 -215060 133438 -243094 -462178 346233 104438 99974
9014I9974i4237j49435Q0671k4372A24392o786K13119b11887g7550C4890c6615
$$ 99974 -94237 -243672 -163001 -187373 124392 117606 330725 -211887 -77550 34890 -36615
9002E8297f1756k31926L7904h7898N814k9644k40241C1726J94248j04356c703
$$ 58297 -61756 -293682 -255778 -87898 -82084 -111728 -351969 31726 225974 121618 -3703
8990E6191a98002o8116a06420K4133K1378q1938F209b64916A81568b8933A51469
$$ 56191 -198002 -266118 -106420 -82287 -60909 -142847 6209 -264916 181568 -28933 151469
8978b82781e9275k9876K2084j46465F7167g2360K8204G4821j1327c7134A51109
$$ -282781 -59275 -89151 -67067 -213532 67167 -72360 -44156 74821 63494 -37134 151109
8966b03170G1293d2136a3723E3309e4402A30965d92628F3176d22386f1102a8062
$$ -203170 71293 -42136 -13723 53309 -54402 130965 -492628 63176 -422386 -61102 -18062
8954e0274D95988a85967F9720K37095A2752c7391l32533a16472j74175O6264a1845
$$ -50274 495988 -185967 69720 306815 12752 -37391 -369924 -116472 -290647 -224383 -11845
8942f414j4961n8210b5267I2255C665J72051A4558b0664D53044F3519j2358A3799
$$ -6414 -21375 -79585 -25267 92255 3665 175716 14558 -20664 453044 63519 51161 13799
8929I3537R2331L9693M1848j04413P37141K46522K076537N119814O344421C342958
$$ 93537 185868 225561 267409 162996 900137 1146659 3223196 8343010 14687431 3342958
8918A060492D53964j50865E0956a6397j25565A21121a02816R515B77942K0159
$$ 1060492 453964 303099 50956 -16397 -141962 121121 -102816 -93301 277942 298101
8908B98101J31120p4622A01575K2278J37544l0735p9045a15610m2300d5787j77237
$$ 298101 429221 354599 101575 123853 261397 230662 151617 -115610 -157910 -45787 -223024
8897b23024a5733j1240A69844c1896k38384J28346A58935A3140P6845J032c6958
$$ -223024 -15733 -26973 169844 -31896 -270280 -141934 158935 13140 89985 91017 -36958
8885f9812G9321b4751j11758l2637q7143P4896C95885h1356j78405O9815A47601
$$ -69812 79321 -24751 -136509 -169146 -256289 -181393 395885 -81356 -259761 -189946 147601
8873c0853A42596F5105J45094B1191c00k237n704A4072a63276A28506b12624e0048
$$ -30853 142596 65105 210199 21191 -300 -2537 -8241 14072 -163276 128506 -212624 -50048
8860A599c5141q2722E0493b66878A75638a43187B30609B7085Q8496a02008k08017
$$ 1599 -35141 -117863 50493 -266878 175638 -143187 230609 27085 115581 -102008 -310025
$$ [...]
##END NTUPLES=NMR SPECTRUM
##END=
