
##TITLE=AC1357_GUARH12176_6648269_MCSoYVqaRd
##JCAMPDX= 6.0         $$ Bruker NMR JCAMP-DX V2.0
##DATA TYPE= NMR SPECTRUM
##DATA CLASS= NTUPLES
##ORIGIN= BRUKER
##OWNER= Administrator
$$ 1.72 TOPSPIN		Version 2.1
$$ 2012-08-10 23:38:47.453 -0500  Administrator@TOPSPIN
$$ Compression mode = diff/dup
##.OBSERVE FREQUENCY= 400.02188249412
##.OBSERVE NUCLEUS= ^1H
##.ACQUISITION MODE= SIMULTANEOUS (DQD)
##.ACQUISITION SCHEME= undefined
##.AVERAGES= 8
##.DIGITISER RES= 22
##SPECTROMETER/DATA SYSTEM= spect
##.PULSE SEQUENCE= zg30
##.SOLVENT NAME= COFFEE_meoh
##.SHIFT REFERENCE= INTERNAL, COFFEE_meoh, 1, 14.98509
##AUDIT TRAIL= $$ (NUMBER, WHEN, WHO, WHERE, PROCESS, VERSION, WHAT)
$$ ##TITLE= Audit trail, TOPSPIN		Version 2.1
$$ ##JCAMPDX= 5.01
$$ ##ORIGIN= Bruker BioSpin GmbH
$$ ##OWNER= Administrator
$$ $$ C:\Bruker\TOPSPIN/data/COFFEE/nmr/AC1357_GUARH12176_6648269_MCSoYVqaRd/10/pdata/1/auditp.txt
$$ ##AUDIT TRAIL=  $$ (NUMBER, WHEN, WHO, WHERE, PROCESS, VERSION, WHAT)
(   1,<2012-08-10 23:38:39.265 -0500>,<Administrator>,<TOPSPIN>,<go>,<TOPSPIN 2.1>,
      <created by zg
	started at 2012-08-10 23:37:32.343 -0500,
	POWCHK enabled, PULCHK disabled,
       configuration hash MD5:
       6B 1B 68 BB D9 2E 58 E2 7F 35 AD 54 07 DF 0E 41
       data hash MD5: 64K
       2A 99 EA 1B 4C CF 4C 42 1C 86 56 08 D3 62 D4 77>)
(   2,<2012-08-10 23:38:43.093 -0500>,<Administrator>,<TOPSPIN>,<proc1d>,<TOPSPIN 2.1>,
      <Start of raw data processing
       efp LB = 0 FT_mod = 6 PKNL = 1 PHC0 = 0 PHC1 = 0 SI = 32K 
       data hash MD5: 32K
       EB B0 BB 8C DA 3B 57 8B 61 C9 32 A6 76 C7 88 47>)
(   3,<2012-08-10 23:38:43.359 -0500>,<Administrator>,<TOPSPIN>,<proc1d>,<TOPSPIN 2.1>,
      <pk PHC0 = 182.7686 PHC1 = 0 
       data hash MD5: 32K
       33 05 D2 11 82 3A 3B 19 96 05 FF A8 40 22 2C 88>)
(   4,<2012-08-10 23:38:43.437 -0500>,<Administrator>,<TOPSPIN>,<proc1d>,<TOPSPIN 2.1>,
      <abs ABSG = 1 
       data hash MD5: 32K
       74 D5 D4 48 81 20 DF C9 D9 12 1F F8 AD F0 BC D2>)
(   5,<2012-08-10 23:38:43.468 -0500>,<Administrator>,<TOPSPIN>,<proc1d>,<TOPSPIN 2.1>,
      <abs ABSG = 2 
       data hash MD5: 32K
       FF 56 47 0A FA EC 4A 5C 53 76 4A 0A F7 AA 88 2D>)
(   6,<2012-08-10 23:38:43.500 -0500>,<Administrator>,<TOPSPIN>,<proc1d>,<TOPSPIN 2.1>,
      <abs ABSG = 3 
       data hash MD5: 32K
       EC 76 6E FE C3 65 D6 20 99 A6 4C B0 56 FF 18 8E>)
(   7,<2012-08-10 23:38:43.531 -0500>,<Administrator>,<TOPSPIN>,<proc1d>,<TOPSPIN 2.1>,
      <abs ABSG = 4 
       data hash MD5: 32K
       D8 E2 AD D6 29 4E 09 7E B8 4A A9 D3 9F 7C A4 BA>)
(   8,<2012-08-10 23:38:43.562 -0500>,<Administrator>,<TOPSPIN>,<proc1d>,<TOPSPIN 2.1>,
      <abs ABSG = 5 
       data hash MD5: 32K
       1A 13 5F F3 AB E7 03 0F D3 10 CD 29 CF 29 CE 53>)
$$ ##END=
$$ 
$$ $$ hash MD5
$$ $$ 39 C3 C5 B1 53 7F 61 7B 20 D9 5A 39 08 9F A4 56
##$RELAX= 
##$RELAX= 
##$RELAX= 
##$RELAX= 
##$RELAX= 
##$RELAX= 
##$RELAX= 
$$ Bruker specific parameters
$$ --------------------------
$$ [...]
150 150 150 150 150 150 150 150
##$TP07= 0
##$TPNAME0= <>
##$TPNAME1= <>
##$TPNAME2= <>
##$TPNAME3= <>
##$TPNAME4= <>
##$TPNAME5= <>
##$TPNAME6= <>
##$TPNAME7= <>
##$TPOAL= (0..7)
0.5 0.5 0.5 0.5 0.5 0.5 0.5 0.5
##$TPOFFS= (0..7)
0 0 0 0 0 0 0 0
##$TUNHIN= 0
##$TUNHOUT= 0
##$TUNXOUT= 0
##$USERA1= <user>
##$USERA2= <user>
##$USERA3= <user>
##$USERA4= <user>
##$USERA5= <user>
##$V9= 5
##$VALIST= <valist>
##$VCLIST= <CCCCCCCCCCCCCCC>
##$VD= 0
##$VDLIST= <DDDDDDDDDDDDDDD>
##$VPLIST= <PPPPPPPPPPPPPPP>
##$VTLIST= <TTTTTTTTTTTTTTT>
##$WBST= 1024
##$WBSW= 4
##$XGAIN= (0..3)
0 0 0 0
##$XL= 0
##$YL= 0
##$YMAX_a= 489632
##$YMIN_a= -643044
##$ZGOPTNS= <>
##$ZL1= 120
##$ZL2= 120
##$ZL3= 120
##$ZL4= 120
##$ABSF1= 14.98509
##$ABSF2= -5.573092
##$ABSG= 5
##$ABSL= 3
##$ALPHA= 0
##$AQORDER= 0
##$ASSFAC= 0
##$ASSFACI= 0
##$ASSFACX= 0
##$ASSWID= 0
##$AUNMP= <proc_prof1d_extract_pilot.lims>
##$AXLEFT= 0
##$AXNAME= <>
##$AXNUC= <1H>
##$AXRIGHT= 0
##$AXTYPE= 0
##$AXUNIT= <>
##$AZFE= 0.1
##$AZFW= 0.1
##$BCFW= 0
##$BC_mod= 0
##$BYTORDP= 0
##$COROFFS= 0
##$CY= 15
##$DATMOD= 1
##$DC= 0
##$DFILT= <>
##$DTYPP= 0
##$F1P= 0
##$F2P= 0
##$FCOR= 0.5
##$FTSIZE= 32768
##$FT_mod= 6
##$GAMMA= 0
##$GB= 0
##$INTBC= 1
##$INTSCL= 1
##$ISEN= 128
##$LB= 0
##$LEV0= 0
##$LPBIN= 0
##$MAXI= 10000
##$MC2= 0
##$MEAN= 0
##$ME_mod= 0
##$MI= 0
##$NCOEF= 0
##$NC_proc= -8
##$NLEV= 6
##$NOISF1= 0
##$NOISF2= 0
##$NSP= 0
##$NTH_PI= 0
##$NZP= 0
##$OFFSET= 14.98509
##$PC= 1
##$PHC0= 182.7686
##$PHC1= 0
##$PH_mod= 1
##$PKNL= yes
##$PPARMOD= 0
##$PPDIAG= 0
##$PPIPTYP= 0
##$PPMPNUM= 2147483647
##$PPRESOL= 1
##$PSCAL= 4
##$PSIGN= 0
##$PYNMP= <proc.py>
##$REVERSE= no
##$SF= 400.02
##$SI= 32768
##$SIGF1= 0
##$SIGF2= 0
##$SINO= 400
##$SIOLD= 32768
##$SPECTYP= <>
##$SREGLST= <1H.CDCl3>
##$SSB= 0
##$STSI= 32768
##$STSR= 0
##$SW_p= 8223.68421052631
##$SYMM= 0
##$S_DEV= 0
##$TDeff= 65536
##$TDoff= 0
##$TI= <>
##$TILT= no
##$TM1= 0
##$TM2= 0
##$TOPLEV= 0
##$USERP1= <user>
##$USERP2= <user>
##$USERP3= <user>
##$USERP4= <user>
##$USERP5= <user>
##$WDW= 1
##$XDIM= 32768
##$YMAX_p= 457396943
##$YMIN_p= -771958
##$CURPLOT= <Network HP LaserJet P1505>
##$CURPRIN= <$Network HP LaserJet P1505>
##$DFORMAT= <normdp>
##$LAYOUT= <+/1D_H.xwp>
##$LFORMAT= <normlp>
##$PFORMAT= <normpl>
##$SURQMSG= 1
$$ End of Bruker specific parameters
$$ ---------------------------------
##NTUPLES= NMR SPECTRUM
##VAR_NAME=  FREQUENCY,     SPECTRUM/REAL,   SPECTRUM/IMAG
##SYMBOL=    X,             R,               I
##VAR_TYPE=  INDEPENDENT,   DEPENDENT,       DEPENDENT
##VAR_FORM=  AFFN,          ASDF,            ASDF
##VAR_DIM=   32768,         32768,           32768
##UNITS=     HZ,            ARBITRARY UNITS, ARBITRARY UNITS
##FACTOR=    0.250966925370066, 1,           1
##FIRST=     8223.43324360094, -47830,       -188708
##LAST=      0,             121323,          -116817
##MIN=       0,             -771958,         0
##MAX=       8223.43324360094, 457396943,    0
$$ Real data points
##PAGE= N=1
##DATA TABLE= (X++(R..R)), XYDATA
$$ [...]
19470b44979a17890A58422b30802N1796B39131c07766K2200G1437c10370N0757
19460b59613m1886C6178b13850D6615g2723n5964m8175b3321r8098r7828f4116
19448g5219r0165B84011a54309A14305b97842A08685D5598J45511d529k83962
19438b88491I5392c08867A1827g6628c3568p613l3093j48896O8921K5557k1334
19427a50026B13426b65115C541L9014d3263A677Q0298c1415A23785f7251j48714
19416b15965A21669b09576k47491A62636i720j20913F6997c85930I3739d12541
19405f5722A4660J0023a1373C1639g6750C23123E4937h8154q0524m8828d6576
19393a6457c039F7376f1653k33914B89148b64000d7200j37761a9936m49236F0207
$$ plain form
19470 -244979 -117890 158422 -230802 -179006 239131 -307766 -285566 71437 -310370 -259613
19460 -259613 -301499 36178 -213850 46615 -72723 -128687 -176862 -23321 -121419 -219247 -64116
19448 -75219 -165384 284011 -154309 114305 -297842 108685 45598 191109 -4529 -288491
19438 -288491 95392 -308867 11827 -76628 -33568 -41181 -74274 -223170 -154249 -128692 -150026
19427 -150026 213426 -265115 3541 42555 -43263 1677 81975 -31415 123785 -67251 -215965
19416 -215965 121669 -209576 -457067 162636 -9720 -130633 66997 -385930 93739 -412541
19405 -65722 14660 24683 -11373 31639 -76750 323123 54937 -88154 -168678 -217506 -46576
19393 -16457 -3039 67376 -61653 -295567 289148 -264000 -47200 -184961 -19936 -469172 60207
19381a89975A72715a07773j20494e0683k69492c3202l6279L4713p2422b5759o3575
19370h9334A36109d36352H1544a00656G0066b40727H6539b50228A83330b04226
19359c93671G8353L7607J10845b17601c5312E2851L2277a47467k41288a22033
19348a66820p2532K320A44934a15989k62115A47663g8228H7501a00215I9359a27251
19336A4655b00064F3194c10128C7697M6886a22973o5888f2003F2155b29856D5689
19324a74700A938c7110j45614Q5872I2599h8719a9575j43182j18370G0175K16149
19313B86324b02150D447d44910d6149C71944a37288b4676e322D3921M7557l3391
19302E8087b32169l09638A49841a2467k78382J06143n739A97765F8877a81120
$$ plain form
19381 -189975 172715 -107773 -228267 -50683 -320175 -33202 -69481 -34768 -107190 -25759 -89334
19370 -89334 136109 -436352 81544 -100656 70066 -240727 86539 -250228 183330 -204226
19359 -393671 78353 115960 226805 -217601 -35312 52851 85128 -147467 -388755 -122033
19348 -166820 -239352 -237032 144934 -115989 -378104 147663 -78228 87501 -100215 99359 -127251
19336 14655 -200064 63194 -310128 37697 84583 -122973 -188861 -62003 62155 -229856 45689
19324 -174700 1938 -37110 -182724 -96852 92599 -88719 -19575 -162757 -281127 70175 286324
19313 286324 -202150 4447 -444910 -46149 371944 -137288 -24676 -5322 43921 91478 58087
19302 58087 -232169 -541807 149841 -12467 -290849 -184706 -190445 197765 68877 -181120
19291c33309f8843K0831q8828j64038g5324b8694j21807B66356a17550a3373l36439
19280c49812g9332N238j10757d8607l4962A43102a19156B3946O0478b50404J15077
19269a35327O5143A80634a16041A9118b6102B3523b04152B90308E7805R436L2592
19258I9833a98477k4038I8296c42653a40215a3114C567c00660a9684A42029d8335
19246b59721j54271A2380a05375M9838r3553H5625b01036N8600E2979i4209k3376
19235a17585B35319E1626c64621A41314L5996c72627B6909j021N0070B9048a08862
19223A70997b64062A49962c04526a41364l0018B36792a19199l949R521B597J58923
19212A61520C505N4306J36508l2671d1236A0444J9569a29773j80896N1378A46192
$$ plain form
19291 -333309 -68843 -48012 -136840 -300878 -75324 -28694 -150501 266356 -117550 -13373 -349812
19280 -349812 -79332 -74094 -184851 -48607 -83569 143102 -119156 23946 84424 -250404 -135327
19269 -135327 -70184 180634 -116041 19118 -26102 23523 -204152 290308 57805 67241 99833
19258 99833 -198477 -222515 98296 -342653 -140215 -13114 3567 -300660 -19684 142029 -48335
19246 -259721 -413992 12380 -105375 -55537 -149090 85625 -201036 -142436 52979 -94209 -117585
19235 -117585 235319 51626 -364621 141314 177310 -372627 26909 25888 75958 29048 -108862
19223 170997 -264062 149962 -304526 -141364 -171382 236792 -119199 -123148 -113627 2597 161520
19212 161520 3505 57811 194319 161648 -41236 10444 30013 -129773 -310669 -259291 146192
19200H2971a14425j84723a13099A37658b95635E4539a04738H2750M7249D2835
19189a36566N1472k58144C2171a9943k12801c5332A78176E6812a88602R2698j70219
19178b66123A87976c56552a18604B82066n2176c56128g3468j83468b8035j09316
19168a37351j65714Q5296J1070j1455j50678A0305a96810j02436A38670c17913
19157b02917M7853l2156B13336h1209k78741C2078c62996B10374H1203m0403B0
19145i09B11033a29675K0063C09796c26679E3193L16996G2271b5167k90481A8574
19133H8L9305A7537m62a25571N6284K3329q3381j0073I0510b36157C35535B7952
19120c81828a65953B16875a31871A67112c11042B13347H6743m2101B0467K36907
$$ plain form
19200 82971 -114425 -299148 -113099 137658 -295635 54539 -104738 82750 129999 42835
19189 -136566 -85094 -343238 32171 -19943 -232744 -35332 178176 56812 -188602 -95904 -266123
19178 -266123 187976 -356552 -118604 282066 229890 -356128 -73468 -256936 -28035 -137351
19168 -137351 -303065 -217769 -206699 -218154 -368832 10305 -196810 -299246 138670 -317913
19157 -202917 -155064 -187220 213336 -81209 -359950 32078 -362996 210374 81203 40800 20
19145 -909 211033 -129675 -109612 309796 -326679 53193 370189 72271 -25167 -315648 18574
19133 88 39393 17537 17075 -125571 -69287 -45958 -129339 -139412 90510 -236157 335535 27952
19120 -381828 -165953 216875 -131871 167112 -311042 213347 86743 44642 20467 257374
19110B57374A05337c89495H9951a00303A89231B5372a92030E1703e7774B60638
19099A56538L3093b97134j15570e164B56874c21225a09735A28208l4962J46572
19089B39818b72049R8233O6716c181B13636a2597A65523K3702f435k49388A2521
19077C1133J17572C6819M2052a0298j23847A89895G7534b18145B43666c1589l97938
19066d29527G6782p393R2329j4734a3960j70478B4161a64061R109J4767A9813
19054D9040K20098J10036E1999K90820a16452b6217F0895b38864F1390M0391J3489
19043A15270C7224P9474R3255a77417h3436A8548a40420A49242d0914o2265L4760
19032f8419E5829i3542l1479p8844A90191b75709I4904a59820A11296e9482k38149
$$ plain form
19110 257374 105337 -389495 89951 -100303 189231 25372 -192030 51703 -57774 260638
19099 156538 189631 -297134 -412704 -5164 256874 -321225 -109735 128208 93246 239818
19089 239818 -272049 -173816 -107100 -3181 213636 -12597 165523 189225 -6435 -255823 12521
19077 31133 148705 36819 78871 -10298 -134145 189895 77534 -218145 243666 -31589 -429527
19066 -429527 76782 69389 161718 146984 -13960 -184438 24161 -164061 -154952 -140185 19813
19054 49040 269138 379174 51999 342819 -116452 -26217 60895 -238864 61390 101781 115270
19043 115270 37224 116698 209953 -177417 -83436 18548 -140420 149242 -40914 -103179 -68419
19032 -68419 55829 -93542 -125021 -203865 190191 -275709 94904 -159820 111296 -59482 -297631
19021b97631o510r292e3284p2618A0525O1049k3029O1765b06661i4012n2155j572
19009a47739k2933b9148o9454F2724b6847k64776C46469f560B55825a36523O4351
18998g2172A2487K6192b04626E5921d2652J5936A96334a1556B99348b9307E221
18986e356A28042O380g9131B17694p6895j9768A1607J98972b03277i1863A6489
18974B68736c40220P6059B17840a88347A57869a5030E304K99818A45579L49322
18964D94901K18914C29203M2134I7911a0613j11556A58081J66310E950a93141
18953b56214A23346a64013M2308B25688g1491G6381P3247h706k88421P6309M2729
18942a78089o0795B18442j5892a31450j14135A94188b8653A2650c3207C2109d5602
$$ plain form
19021 -297631 -304141 -313433 -53284 -125902 10525 71574 48545 110310 -206661 -94012 -146167 -147739
19009 -147739 -170672 -29148 -98602 62724 -26847 -291623 346469 -6560 255825 -136523 -72172
18998 -72172 12487 38679 -204626 55921 -42652 -26716 196334 -11556 299348 -29307 5221
18986 -5356 128042 134422 -79131 217694 140799 121031 11607 210579 -203277 -91863 16489
18974 268736 -340220 -264161 217840 -188347 157869 -15030 5304 305122 145579 494901
18964 494901 713815 329203 371337 97911 -10613 -122169 158081 324391 5950 -193141
18953 -256214 123346 -164013 -121705 225688 -71491 76381 149628 -8706 -297127 -220818 -178089
18942 -178089 -238884 218442 202550 -131450 -245585 194188 -28653 12650 -33207 32109 -45602
18930I1260A2062a92524A14739j9197Q6449H5837g45B04579b76010D8618A845
18918E839J07229b71578h5546H3636G230d1124k38396a15900E4056M1790a9008
18906d3197R043A90991l7119K53887j56475N30838C40313A02477L74350H424d7980
18894B1092a72340B14732b19447r3188B84147D3492a31945A58791c73117E7159
18883a03648a48j24425m4313D5700g4556h811E6764J933b39216i126q7391M7635
18871d8882A47437b5858m2446k7723o5920P3832a3B8094a26708k03374j7213j3087
18859c60382J59091B25726k2272a32038C0257a88215k4942C3869a03603j60031
18849b63634a11975K0886j77689a2284C91294h3786f584j17235k8220o8736G6613
$$ plain form
18930 91260 12062 -192524 114739 95542 181991 85837 -745 204579 -276010 48618 1845
18918 5839 113068 -271578 -85546 83636 7230 -41124 -279520 -115900 54056 95846 -19008
18906 -43197 -34154 190991 153872 407759 251284 782122 340313 102477 476827 8424 -47980
18894 21092 -172340 214732 -219447 -312635 284147 43492 -131945 158791 -373117 57159
18883 -103648 -148 -124573 -168886 45700 -74556 -8811 56764 58697 -239216 -9126 -96517 -48882
18871 -48882 147437 -25858 -68304 -96027 -161947 -88115 -13 28094 -126708 -330082 -347295 -360382
18859 -360382 -201291 225726 203454 -132038 30257 -188215 -213157 33869 -103603 -263634
18849 -263634 -111975 -91089 -268778 -12284 391294 -83786 -6584 -123819 -152039 -220775 76613
18837h8558C6028c24106a04769j72498Q4553K3959I8882a08422B35721a31798
18826I9527a53819B37843a97050o955D0388J19215c16707A27420d39354b7230
18815a71518B92193h257m84667a14742L1719a770F4153J17396a47621B25015J1403
18804B36418j07355P5346h8048A71962a2133G4186N4139E3072b31793R8171C53234
18792a11182l7672A46389O0852j01785c23777h9630j11732E279M6431J82955a24336
18780a01018F6356a17824d9843j48256F0373g9385A15269d0408k05504A2688a05668
18768e3605A48326D5343f1205D183f7769l10238i5360g330j03885K7652k35012
18757c18575m991J28632M1708A53539N2652a61397B3323a98992b5142j83232O0213
$$ plain form
18837 -88558 36028 -324106 -104769 -277267 -192714 -168755 98882 -108422 235721 -131798
18826 99527 -153819 237843 -197050 -204005 40388 159603 -316707 127420 -439354 -27230
18815 -171518 292193 -8257 -492924 -114742 -83023 -1770 64153 181549 -147621 225015 236418
18804 236418 129063 204409 -88048 171962 -12133 74186 128325 53072 -231793 -133622 353234
18792 -111182 -148854 146389 207241 105456 -323777 -89630 -201362 5279 51710 234665 -124336
18780 -101018 66356 -117824 -49843 -198099 60373 -79385 115269 -40408 -245912 12688 -105668
18768 -53605 148326 45343 -61205 4183 -67769 -378007 -95360 -7330 -111215 -83563 -318575
18757 -318575 -323566 -194934 -153226 153539 206191 -161397 23323 -198992 -25142 -208374 -148161
18746a48161J5509b4852A10011C1526K32798i2102k309l01910E0337a01858A36056
18734a48717j08919j04796i9880Q548A37633c76518i9958G4579h0121E3213f8130
18722g6198j53231a13771C0965P7436j1978J9867a05650A04866a18748E7715L4284
18711I1999J9455b42425h5355E07870A21878c52681J57686G319f4140k24483J36932
18700a51691o8563j52139i1919j35573P5786k31757d8969M540a13k32665G3790
18688c7522j90165g5831B14471L3850b09748P9537j1864j17446q815i1775G0125
18676A24266a70955H136i8394o3240A99168A5638e2163k46522g7952j6983A23175
18664B14335D3245r354d4431o6244M9019j54514H632J61562i1232L1161n1308
$$ plain form
18746 -148161 -132652 -24852 110011 31526 264324 -92102 -94411 -396321 50337 -101858 136056
18734 -148717 -257636 -362432 -99880 -91332 137633 -376518 -99958 74579 -80121 53213 -68130
18722 -76198 -229429 -113771 30965 108401 96423 116290 -105650 104866 -118748 57715 91999
18711 91999 111454 -242425 -85355 507870 121878 -352681 -194995 7319 -64140 -288623 -151691
18700 -151691 -220254 -372393 -91919 -227492 -151706 -383463 -48969 -44429 -113 -232778 73790
18688 -37522 -227687 -75831 214471 248321 -209748 -130211 -142075 -259521 -268336 -91775 70125
18676 124266 -170955 8136 -98394 -161634 199168 15638 -52163 -298685 -77952 -94935 123175
18664 214335 43245 33891 -44431 -110675 -61656 -216170 8632 170194 -91232 -60071 -111379
18653a11379K6288j36669l28312B3173P257b72152a21269A35796i3890M4623k9235
18642g8502E976a97907B16284a08876A65015Q410a46468e5201j34922e9987k51572
18631c11559D9019a85275C9974R9362a37872F0773J85108b43639B92532a95379
18620a52911A19897h7k87274f9962l5417A78494b322B13206e75618K32528e988
18608I6850J51669a4612F0151P9437J8042n0845C3528b02373e037D07983B3135
18596h4511C1884J88189c24007C5623J24272G6930b24490B11911a9166l5101C8835
18584a52138f2998j28746h7119A1861J0572a87525B6882K0040b01511A310a62668
18572F6722h9796B33192b28572A77509A8926J31717a6722m08987H3257O2974a30819
$$ plain form
18653 -111379 -85091 -221760 -550072 23173 30430 -272152 -121269 135796 -93890 -49267 -78502
18642 -78502 5976 -197907 216284 -108876 165015 173425 -146468 -55201 -190123 -59987 -311559
18631 -311559 49019 -185275 39974 139336 -137872 60773 245881 -243639 292532 -195379
18620 -152911 119897 -87 -287361 -69962 -105379 178494 -2322 213206 -575618 -343090 -5988
18608 96850 248519 -14612 60151 139588 157630 106785 33528 -202373 -5037 407983 23135
18596 -84511 31884 220073 -324007 35623 159895 76930 -224490 211911 -19166 -54267 38835
18584 -152138 -62998 -191744 -87119 11861 22433 -187525 26882 46922 -201511 1310 -162668
18572 66722 -89796 233192 -228572 177509 18926 150643 -16722 -425709 83257 146231 -130819
18560b45536M8164B983c87397a44667E0222a71422A2717b34818A3850a23914k23733
18549c47647a5629j12286B04002b2253O074I3448b36231E8813k3376a43914j12355
18538b56269A18492E4550a17835d6037j74847J03259a6820r1587A21248a38445
18527c19409A8178Q4448L938a66676h324k26432p2537a07196k1373e8858j79565
18516b38423D6754P1899a25478A01095O3400l8947A2200M0198c44588J66267L5706
18505a42615f1763n6466m4339j62268B21163o5216b33916r1978b0796F8871c7988
18493a51955l9041A19075e3118A35008b91960f6761K6862L671A65327k5866H771
18481b10614J02017J4376A16045a3047l63983i0853j67663a23412L6584A11360
$$ plain form
18560 -245536 -197372 2983 -387397 -144667 50222 -171422 12717 -234818 13850 -123914 -347647
18549 -347647 -15629 -127915 204002 -22253 -16179 93448 -236231 58813 35437 -143914 -256269
18538 -256269 118492 54550 -117835 -46037 -220884 -117625 -16820 -108407 121248 -138445
18527 -319409 18178 102626 106564 -166676 -8324 -234756 -307293 -107196 -128569 -58858 -238423
18516 -238423 46754 118653 -125478 101095 164495 125548 12200 52398 -344588 -178321 -142615
18505 -142615 -61763 -118229 -162568 -324836 221163 155947 -233916 -325894 -20796 68871 -37988
18493 -151955 -190996 119075 -53118 135008 -291960 -66761 -39899 -36228 165327 139461 8771
18481 -210614 -108597 -94221 116045 -13047 -377030 -90853 -258516 -123412 -86828 111360
18470A5747J00364g6283B54164c11395a14544D0690a53510A95204g8223A1341
18459F6353g171n3599H6528i0520b7361H3631a54457A04689m3670c55789b4220
18447c20325B3763J29301K01967M1352A8044O6201a19918J6891o9f362A65099
18435A91808o92a75937A00537Q3565l8792B948c31541h4780I1376i4903n8718
18424a53621p0641M1973D20068a80849e8499A0280J11981f7519c376q5931k66455
18413c55762I0550l5352N2880a21798l42389c251A85421a82440a460j51404C54993
18401a81056e0421m3118B22842b01845Q6454A49259b0228j91583N5529O1980A46252
18389a41764A8316O8446b89396c4736l60661A11428g7401H6644a28963q9012C4244
$$ plain form
18470 15747 116111 -76283 254164 -311395 -114544 40690 -153510 195204 -78223 11341
18459 66353 -7171 -60770 86528 -90520 -27361 83631 -154457 104689 61019 -355789 -24220
18447 -320325 23763 153064 355031 396383 18044 84245 -119918 -103027 -103096 -6362 165099
18435 191808 191116 -175937 100537 184102 145310 2948 -331541 -84780 91376 -94903 -153621
18424 -153621 -224262 -182289 420068 -180849 -58499 10280 122261 -67519 -3376 -89307 -355762
18413 -355762 90550 55198 108078 -121798 -464187 -3251 185421 -182440 -1460 -152864 354993
18401 -181056 -50421 -93539 222842 -201845 -115391 149259 -20228 -211811 -156282 -94302 146252
18389 -141764 18316 86762 -289396 -34736 -395397 111428 -77401 86644 -128963 -217975 34244
18377B04027a17442F2465c65036H7101L4584C2345j1896b75956b9499q5025n6414
18366a70938l5107l0705A49832J72815A55625a03394I943a04178j45413J14295
18356a35296o3884g5133B1823M137K8476j5610L56931b57204d9751E4535B2516
18344C2242a79016j07668I6789Q5013a23701A15009h8987a8146A89077a69379
18333c58881a61017A01657D1757K390c3343k0308j33952A53661d3602E9578C213
18321b21422B36363j09548L3451E3153J57241C0068a53996g0824B59961F6434
18310a9777D7330M0559b01780N0109e1563J2221A67138b14636c4823B52264A4667
18298d28844A53209P2522b39006B1529g4948J7156D1827a69885C1175J03581P7122
$$ plain form
18377 204027 -117442 62465 -365036 87101 121685 32345 20449 -275956 -29499 -114524 -170938
18366 -170938 -206045 -236750 149832 322647 155625 -103394 9943 -104178 -249591 -135296
18356 -135296 -199180 -75133 21823 25960 54436 38826 395757 -257204 -49751 54535 22516
18344 32242 -179016 -286684 96789 181802 -123701 115009 -88987 -18146 189077 -169379
18333 -358881 -161017 101657 41757 44147 -33343 -53651 -187603 153661 -43602 59578 3213
18321 -221422 236363 126815 160266 53153 210394 30068 -153996 -70824 259961 66434
18310 -19777 47330 87889 -201780 -151671 -51563 -39342 167138 -214636 -34823 252264 14667
18298 -428844 153209 225731 -239006 21529 -74948 -57792 41827 -169885 31175 134756 211878
18287B11878a4866I1203D0072K3600K06989A8423a68515A87852i8015j74671a34228
18275b42359A85079m30a38068B15807H6712K1591a45285j80064C3707b51101O0886
18264a90215j50223H5859a66388j35613c1566D1838J21165b89882a32315c1671
18253e2789F8007c466j67475O0214A27863B9117d3716H6954j4851K4291a65992
18241A14038E6230b19962k1514r250A14995b34129b4373j22504e1988A30874K2609
18230A53483K27416b11954F1352K126a36617O8305l8109C25860b14630d6703C5544
18218I4335l0731h3136k79442J2277h8508m8197c4156l01430b843j04324k17781
18207c24948c572j01588C0962P8989a14602B3302O2305a02158j43368A36375d31651
$$ plain form
18287 211878 -14866 91203 40072 63672 270661 18423 -168515 187852 -98015 -272686 -134228
18275 -242359 185079 184649 -138068 215807 86712 108303 -145285 -325349 33707 -251101 -190215
18264 -190215 -340438 85859 -166388 -302001 -31566 41838 163003 -289882 -132315 -31671
18253 -52789 68007 -3466 -170941 -110727 127863 29117 -43716 86954 72103 96394 -165992
18241 114038 56230 -219962 -241476 -250726 114995 -234129 -24373 -146877 -51988 130874 153483
18230 153483 380899 -211954 61352 63478 -136617 -68312 -106421 325860 -214630 -46703 35544
18218 94335 63604 -83136 -362578 -350301 -88508 -136705 -34156 -335586 -2843 -107167 -324948
18207 -324948 -3572 -105160 30962 109951 -114602 23302 85607 -102158 -245526 136375 -431651
18195e4538l1493q6837j32794R8214A50478b07801D0379e2166B19414c00810J38804
18184a62006J1088E0146L7994J42375H7069O207a98672I2009j0682J73468i8616
18172B46371K1045j00008b0123j82341o7569B05775D5031M8221a64459B21005
18161B26257B1429q912f69B79124e2386B06831D8030L4968e242E8192J5146b2292
18148A57892G658J8390K43753q5251I442R6714a57118A29789n715R2355C6804
18136h2468c171k86123a28208e2844j8124J2694G737a6858A05391a0890A39636
18124a68444f6887j65367m2502h6864m000A69126F3030K44053D5597j6498J74228
18113B03327I3579Q628l8802a09558N0055B2831i1941A41460j8461e1151j4138
$$ plain form
18195 -54538 -86031 -172868 -305662 -207448 150478 -207801 40379 -52166 219414 -300810 -162006
18184 -162006 -150918 50146 88140 230515 87069 93276 -198672 92009 81327 254795 -98616
18172 246371 267416 167408 -20123 -202464 -270033 205775 45031 93252 -164459 221005
18161 226257 21429 12517 -669 279124 -52386 206831 48030 82998 -5242 58192 73338 -22292
18148 157892 7658 26048 269801 184550 9442 106156 -157118 129789 124074 216429 36804
18136 -82468 -3171 -289294 -128208 -52844 -70968 -58274 7737 -16858 105391 -10890 139636
18124 -168444 -66887 -232254 -274756 -86864 -90864 169126 63030 307083 45597 29099 203327
18113 203327 93579 102207 63405 -109558 -59503 22831 -91941 141460 122999 -51151 -65289
18102f5289q6028M5306A48218d08300J78112a3581k04278b6453i330n5146C0239
18090h1005k00814G3563a76918i982k73469J2042C5285L69115A4604l168K5315
18079C6751b0933C8793M18976b43527k25928A06779O0570a20375B02265C7154
18068a86592P6835b1144A8949c7702j22099A09025c45786A16660J93197a43267
18057b5807B01882a62632H5461J96440a94267R2889K8803O156B53951c7605A40308
18045c39827H61b70044A15597b09991H2591a06004A22789J80638l041a44805q3788
18034b28593D95618A03177a06687G2001j3469K34363C1613b43061m1616A90940
18023f2270D7869b29554e4720k25049B2299a41221p6325e0373C3836K3002d4626
$$ plain form
18102 -65289 -151317 -106011 148218 -408300 -230188 -13581 -217859 -26453 -9330 -64476 30239
18090 -81005 -281819 73563 -176918 -9982 -283451 -271409 35285 404400 14604 11436 36751
18079 36751 -20933 38793 457769 -243527 -469455 106779 167349 -120375 202265 37154
18068 -186592 -109757 -21144 18949 -37702 -159801 109025 -345786 116660 309857 -143267
18057 -25807 201882 -162632 85461 281901 -194267 -101378 -72575 -66419 253951 -37605 140308
18045 -339827 861 -270044 115597 -209991 82591 -106004 122789 303427 300386 -144805 -228593
18034 -228593 495618 103177 -106687 72001 58532 292895 31613 -243061 -284677 190940
18023 -62270 47869 -229554 -54720 -279769 22299 -141221 -217546 -50373 33836 56838 -44626
18011b63991A27465a0889A1712b98557A4837a1574A16897h2316C9076K9079d0845
17999f181B05573E8487f4075I6691N3132N8551q3263J47123b36171N8682j38875
17988c16364B17521b13306l0712A14900b16844f5365A62444l5350b391q381A99236
17976b53731Q6879D8556h7167D0144Q5208J88688o5704G1143a2372B04626a11282
17964a53397o9621Q830C15403A47665J6836A796J1648b7449A22403c61552B99347
17952c36693J03161d5504Q953n0406B4010a69653P2332F1283h8617k0505j01496
17941b10618G8906e245A61064g6437B9159K6408K62660b18892e0436I7012k2215
17930G4797K05773j14513C4478N8155h9785j1129k7915F793a860F0596e8825a5187
$$ plain form
18011 -263991 127465 -10889 11712 -298557 14837 -11574 116897 -82316 39076 68155 -40845
17999 -6181 205573 58487 -64075 96691 149823 208374 125111 272234 -236171 -177489 -316364
17988 -316364 217521 -213306 -244018 114900 -216844 -65365 162444 127094 -2391 -10772 199236
17976 -253731 -166852 48556 -87167 40144 125352 314040 248336 71143 -12372 204626 -111282
17964 -153397 -223018 -214188 315403 147665 164501 1796 13444 -27449 122403 -361552 299347
17952 -336693 -233532 -45504 -36551 -86957 24010 -169653 -97321 61283 -88617 -109122 -210618
17941 -210618 78906 -5245 161064 -76437 29159 55567 318227 -218892 -50436 97012 74797
17930 74797 280570 166057 34478 92633 -89785 -100914 -128829 6793 -1860 60596 -58825 -15187
17917B03042Q8382j26236g0294D3399K58866q8075I5831a9700E7936A9431K57391
17906B76822a73886k25951f7018K4482a5333A24886l883J57544m1175n963m0070
17895A91339a71458A03798D4814a18767A83310q1053l1906J5315P8022b6823E8717
17883B84170D5860d5249B05478a15558l7301A24141b148j68505B28210I3642B8877
17871A67217i2608M0927B40881q9218J30815f4920C00343i4051a6718A62117a65876
17859F3429b0555G3274a09727j52951H2827K33673j19556B5905J38674h5042b9995
17847a1428B72745B4299K25958C0580K54640H2403N9551B7234e9061o5248b4352
17835B5868d09633A77689H826c9514B96520L018n1095a93168B42041r042d330
$$ plain form
17917 203042 291424 165188 -70294 43399 302265 214190 95831 -19700 57936 19431 276822
17906 276822 -173886 -399837 -67018 -42536 -15333 124886 121003 278547 237372 231409 191339
17895 191339 -171458 103798 44814 -118767 183310 102257 70351 85666 163688 -26823 58717
17883 284170 45860 -45249 205478 -115558 -152859 124141 -2148 -170653 228210 93642 28877
17871 167217 -92608 -51681 240881 151663 282478 -64920 300343 -94051 -16718 162117 -165876
17859 63429 -20555 73274 -109727 -262678 82827 316500 196944 25905 164579 -85042 -29995
17847 -11428 272745 24299 250257 30580 285220 82403 141954 27234 -59061 -124309 -24352
17835 25868 -409633 177689 8826 -39514 296520 299538 248443 -193168 242041 232999 -4330
17823A80664o8626j8798e5936B29394q5011j7465e6322J7903r3378B81833a35941
17811B50628d247H3967K15387a54575b4746B76864o4869d1439A18989g2280G6457
17799A57667f8746b337B3014L55578i7957A74101l2396O0878b8345l5015A98748
17787b9768p8050j55800B20490N3653b09388G7929b57128A36879A3838a42119
17776A43709P6256q0957b0564A35865A4363J56264F7690a57886J9363a8522A37867
17764D36614E5329L8945J05943K34363A34801o3432b31226B31826G7880a0175
17753I9286k7632a30818M7307A1975K1325J93783j04848J6162b56081C64502e2372
17741a94392H6833K3688a48000E8799K03342A18601a36188j4181C68110A05220
$$ plain form
17823 180664 112038 93240 -55936 229394 144383 126918 -56322 -38419 -131797 281833 -135941
17811 250628 -4247 83967 299354 -154575 -24746 276864 211995 -41439 118989 -72280 76457
17799 157667 -68746 -2337 23014 378592 -97957 174101 141705 202583 -28345 -63360 198748
17787 -29768 -107818 -263618 220490 274143 -209388 77929 -257128 136879 13838 -142119
17776 143709 219965 139008 -20564 135865 14363 170627 67690 -157886 -138523 -18522 137867
17764 436614 55329 94274 200217 434580 134801 71369 -231226 231826 77880 -10175
17753 99286 71654 -130818 -83511 11975 33300 227083 122235 138397 -256081 364502 -52372
17741 -194392 86833 110521 -148000 58799 262141 118601 -136188 -150369 368110 105220
17730A23840b7166F4145B4943M5971a18671A05971J55209J7746A20387O1819a05864
17718b39538A67867B8898R246c61608G3763J07670K6628n0889p6162a24154A89110
17706d7814C24317Q5935n4782j12787i3599A71611a45690L5763b9490j69623B77539
17694e0369D98038F8775l3089Q5731M5017K36297j52322A17179a68008F5202a2331
17682D5480a39839A53030n5354M2786J03331c01717J25171G5295N1528P08J22625
17671B50156E1959K90245A53468J1073L73527c9868A32898L2287J48219j54669
17661A58735E3942J28370D4057J93668a4449p3098a1074B81033j18200n4532J63193
17650B71494n3623a33234B72235f4624r5175D36442b7332G4775C0923K49779B7015
$$ plain form
17730 123840 -27166 64145 24943 70914 -118671 105971 261180 278926 120387 182206 -105864
17718 -239538 167867 28898 38144 -361608 73763 181433 208061 157172 81010 -124154 189110
17706 -47814 324317 410252 355470 242683 -93599 171611 -145690 -109927 -29490 -199113 277539
17694 -50369 498038 68775 35686 121417 166434 402731 250409 117179 -168008 65202 -12331
17682 45480 -139839 153030 97676 140462 243793 -301717 -176546 75295 126823 127531 250156
17671 250156 51959 342204 153468 164541 538068 -39868 132898 165185 313404 158735
17661 158735 53942 182312 44057 237725 -14449 -87547 -11074 281033 162833 108301 271494
17650 271494 217871 -133234 272235 -64624 -159799 436442 -27332 74775 30923 280702 27015
17638c46096B80378b6336o3358o4421B32393j01305a62509B15250k8815k1857
17628A64578o9652O6420Q8170K29710A51632n8565J13466J92665a6551A66966
17617C5578a3052C50551a54289A7119L78722B105J28059a23638B52820h2276k1743
17606a04019A77794K23909j09762H5651c0635A11967E0986K05355a14403D51955
17595A78706Q338I0292b80375B33065D0451c60A26954K84160d0823B19998Q7486
17584C07484P2214L8622A98276D4992Q5124n4370K05998A00620J25806a9880A19917
17572A25204M240a0381B06348h9853o1990A8587L28701E1278K36729j31161a4208
17560a14571C93032J10440j80049j7129j00894k5128J9861J76785b2386F2647
$$ plain form
17638 -346096 280378 -26336 -89694 -154115 232393 131088 -162509 215250 186435 164578
17628 164578 94926 161346 249516 479226 151632 93067 206533 399198 -16551 166966
17617 35578 -13052 350551 -154289 17119 395841 2105 130164 -123638 252820 -82276 -104019
17606 -104019 177794 401703 291941 85651 -30635 111967 50986 256341 -114403 451955
17595 178706 187044 90292 -280375 233065 40451 -360 126954 411114 -40823 219998 307484
17584 307484 379698 418320 198276 44992 130116 75746 281744 100620 226426 -19880 119917
17572 125204 129444 -10381 206348 -89853 -151843 18587 347288 51278 288007 156846 -14208
17560 -114571 393032 503472 323423 306294 205400 180272 200133 376918 -22386 62647
17549E26424a83548B85909I7358K69952J27149Q3166j79819J49531C6348f118
17538F23835A19598b5643E20057k48008K9942J98247k8351j83984J41214M8616
17528D77733N8378J83893J18799L6351K99571m65179k53653A67767P4203j4260
17518B27710Q4142o8619N44034l21509O1648P2663M96663l42230J66569r9243
17508H21828P2651k91816J5158j78537A19592K83263k2869r3851J93075O1377
17498E40587l2495j46545p0985j5483O8784l7260J02813N5854A36965L48499B42125
17486C71055o0323n9035J79024r8535A09078L75793B21330K53826k2116H1466
17475C81638A83383D9733O0871L14781M5965j99089J48114j64774A01779M51285
$$ plain form
17549 526424 -183548 285909 97358 367310 494459 577625 397806 547337 36348 -6118
17538 623835 119598 -25643 520057 272049 301991 500238 471887 287903 429117 477733
17528 477733 536111 720004 838803 875154 1174725 709546 455893 167767 241970 227710
17518 227710 311852 243233 787267 465758 527406 600069 1096732 754502 921071 821828
17508 821828 894479 602663 617821 439284 119592 402855 379986 286135 479210 540587
17498 540587 508092 361547 290562 275079 343863 306603 409416 465270 136965 485464 242125
17486 371055 310732 251697 430721 332186 109078 484871 221330 475156 453040 81466
17475 381638 183383 49733 110604 425385 471350 272261 420375 255601 101779 553064
17465E53064B50192P442R4558O7352J35929r6012o2404P5819A85109J80986j11896
17454B54199b4343C70091j60188k4847J26585M1111j0250p8506M54946B59154
17443D47205R5208j12347K27703j51138j14001N1239k07586m5621J96205J66504
17433E53371B10686j1498d6748C35859H7963N52525J4142B07992J28300j1532
17423C24760J00328J02178K0173A39403K03773Q6327J74911k05006j32616k938
17413B63854J09189R4281P7179k37757K96982j07652j20534L3529k5L3275j42083
17402C00238j28942R9488P2959A67465j2783J67570j26568q6131l4483J99334
17392B74404Q3352J57494j17105c6169B05056L08875j50899J43552j43817j25272
$$ plain form
17465 553064 250192 257634 352192 419544 555473 459461 397057 472876 185109 366095 254199
17454 254199 -24343 370091 209903 185056 311641 352752 342502 263996 718942 259154
17443 447205 542413 430066 657769 506631 392630 443869 236283 190662 386867 553371
17433 553371 210686 199188 -46748 335859 87963 640488 654630 207992 336292 324760
17423 324760 425088 527266 547439 139403 343176 429503 604414 399408 266792 263854
17413 263854 373043 467324 544503 306746 603728 496076 375542 409071 409046 442321 300238
17402 300238 171296 270784 343743 167465 154682 322252 195684 109553 75070 274404
17392 274404 357756 515250 398145 -36169 205056 513931 363032 506584 362767 237495
17382B37495M39821D8537J37276G7875M90928B04655J05750J47012A29463N1182
17372A80645R8166j25382P7578l3423I3026a16037C04666r2149a05087B77246
17361F05782B65748k0488Q0610A56305B9146K81537l6209r8637K20629n8723N9370
17350C97113j21587J96144j18066q2335P9675q6489L1207I8142K17041J10756
17340D25939N8151k15908q5465M34088r5198A68977M20692a8750o7517D90913
17329B23060K67566B03922a78902A63L30168K64126k45271q5875J3317K70110
17319E46738B07756K57532A69884K33720L8172A1997L53688n8847J80519n6571
17309D30786j91879j6794N3098K16038j0142a8438C92300J24716H4900K62233
$$ plain form
17382 237495 677316 48537 185813 77875 568803 204655 310405 457417 129463 180645
17372 180645 278811 153429 231007 197584 93026 -116037 304666 212517 -105087 277246
17361 605782 265748 245260 325870 156305 29146 310683 274474 175837 396466 337743 397113
17350 397113 275526 471670 353604 271269 350944 264455 295662 98142 315183 425939
17340 425939 484090 268182 182717 616805 521607 168977 589669 -18750 -86267 490913
17329 223060 490626 203922 -178902 163 330331 594457 349186 263311 276628 546738
17319 546738 207756 465288 169884 403604 441776 11997 365685 306838 487357 430786
17309 430786 238907 222113 275211 491249 481107 -18438 392300 517016 84900 347133
17299C47133m2841m5265J3108K3304J53515j60854R0570Q9231J2128J38745j93479
17288D25295o244o1258K76439k49171m1065j52075O3903N9689J07464J08122J10685
17277F41784j73673K62057C02608j04635L62298B08336J07147l2418j2295I6621
17266F48830A06536K85226L2504N6024j48935J87973j65488O4669j36093K13363
17256D95779j8739B13937K4674P8066J56023k23349L41587j7891j44929B11699
17245B02799K350K15597j88502L24079B09398K57617O4956n5548O4933B43107
17234C34855k1499L12613k66827J10618B32412M92694l49148J18005j09088l0682
17224C54193j76147K4974K71968k27539K38408J38802k44893k1817A50476N11015
$$ plain form
17299 347133 304292 259027 272135 295439 448954 288100 378670 467901 480029 618774 425295
17288 425295 419051 357793 634232 385061 343996 191921 255824 315513 422977 531099 641784
17277 641784 468111 730168 302608 197973 560271 208336 315483 283065 270770 96621
17266 648830 106536 391762 424266 480290 331355 519328 353840 418509 282416 495779
17256 495779 477040 213937 238611 316677 472700 249351 590938 573047 428118 211699
17245 202799 205149 420746 232244 556323 209398 467015 531971 476423 541356 243107
17234 334855 313356 625969 359142 469760 232412 725106 375958 493963 384875 354193
17224 354193 178046 203020 474988 247449 485857 624659 379766 357949 150476 661491
17214F61491B92612K08626K38613k13128m9037M6834r8099K38810k24890k1050
17204D19291q7667n579q4627K01744R2441r1919K62638J03569k96793j30811m9455
17193C32832L7169J23893K23911j36360J06874l40330K3031L23966C12744K14784
17183E27528K1949L25478l56156j53330J45655j45622r7082J79416J33186j32152
17173D48870J19296m9524k8479J70383J46498k46055k13766Q4521J01648J19992
17163F53384k20936M43554k13168q0961L4403K6658J04760j13809k73633K04539
17153E64791j64027K77911j3317L0360K02051k4899k96111k01678N91292l95330
17143E71043M218j56386N33481m45294K26365p7505J59639p6874J96917l14925
$$ plain form
17214 661491 292612 501238 739851 526723 477686 524520 426421 665231 440341 419291
17204 419291 331624 326045 241418 443162 535603 443684 706322 809891 513098 382287 332832
17193 332832 370001 493894 717805 581445 688319 347989 371020 694986 312744 527528
17183 527528 549477 874955 518799 365469 511124 365502 268420 447836 581022 448870
17173 448870 568166 518642 490163 660546 807044 560989 347223 431744 533392 653384
17163 653384 432448 876002 662834 581873 616276 642934 747694 633885 360252 564791
17153 564791 400764 678675 665358 695718 897769 872870 576759 375081 966373 571043
17143 571043 575261 418875 952356 507062 733427 655922 815561 738687 935604 620679
17133F20679K19067j86444j90382L36071l02216J82104B95171M74385O95040p02313
17123G62283J66354l42635K59870l74778N60570l38817K32947k46254J00105p3823
17113G05822K33317m05409K52586K47795k89335O1479j33631K01343K15148m92102
17103E97013M73110m5189j88879j23982K10685L4771j71674J27428Q4342P4578
17093A072203k04627D25475M51208m6247k33349L89925k06239R4818k27292J03229
17083G51528J6170K56356K74378o35393N56647l09951j00051m4223P6380l0996
17073H10845j89317N17238k59791n1983P9017J42497J22702k36073N8130o1769
17063I31496r2036Q8002L27002l38301k40601L46786L33172k88790J342j91224
$$ plain form
17133 620679 839746 653302 462920 798991 496775 678879 295171 769556 1464596 762283
17123 762283 928637 586002 845872 471094 1031664 692847 925794 679540 779645 705822
17113 705822 939139 533730 786316 1034111 744776 806255 672624 873967 1089115 597013
17103 597013 1070123 1024934 836055 712073 922758 957529 785855 913283 997625 1072203
17093 1072203 867576 425475 876683 830436 597087 987012 780773 875591 648299 751528
17083 751528 767698 1024054 1298432 663039 1219686 909735 809684 765461 841841 810845
17073 810845 621528 1138766 878975 826992 906009 1048506 1171208 935135 993265 931496
17063 931496 839460 927462 1254464 916163 675562 1022348 1355520 1066730 1068072 876848
17053H76848J47946j36241K40231p9145K06357k81266J51821l15697M11857j87776
17043A034935P4513p3735M51369l96775J70393P7935M96324n36450l40879O6916
17033A024546J4368N37543o47494N51253l53926j3399K66571K28942m23714j61374
17023A023316Q5415K15511m4454O5152J9240L0662O7604j33040J33861k3948K0183
17012A459502r9198J32855j35941j45831J99619j87901N17252n32853L92517O2874
17002A662895l73089L11986R2571k91572L71662l28076K82021n4036J85461l69389
16992A490434N9201l6269K90821k24657J73765L4219K24098m08677o524J91065
16982A787476o174j35628q3968K85225q3986L76578n99353L36412Q4009k7458
$$ plain form
17053 876848 1024794 888553 1128784 1049639 1255996 974730 1126551 810854 1222711 1034935
17043 1034935 1109448 1035713 1487082 1090307 1260700 1338635 1834959 1298509 957630 1024546
17033 1024546 1038914 1576457 928963 1480216 1126290 1112891 1379462 1608404 1184690 1023316
17023 1023316 1108731 1324242 1279788 1344940 1364180 1394842 1462446 1329406 1463267 1439319 1459502
17012 1459502 1360304 1493159 1357218 1211387 1411006 1223105 1740357 1207504 1600021 1662895
17002 1662895 1289806 1601792 1694363 1402791 1774453 1446377 1728398 1674362 1859823 1490434
16992 1490434 1549635 1513366 1804187 1579530 1753295 1787514 2011612 1602935 1596411 1787476
16982 1787476 1781302 1645674 1561706 1846931 1762945 2139523 1540170 1876582 1960591 1933133
16972A933133J03544q1101j42818J03935J0843k63131K06835m8243K28495J8358
16962B069850M6547j21595j63860K5255K55273M0201k69472J44527J50347J943
16952B179016J77856J04309l77701J7108J82021K26690k26791K84413l8599k53196
16942B275126J71734j9608K20022l33172L07664j89770o9610K55566K567J34473
16932B754992J38022j42362o9625L27316l30444K66129k37795J64874M7354r2136
16922B826325P988q6698J27149q5151M32232j45092K86978n60970K54571K34599
16912C291931m97310N93708j7412M2171L19848n05019K8187j9805M7090J27127
16902C410516L83213k12304J38180Q992n3049M11675o46241M17500k23940K47910
$$ plain form
16972 1933133 2036677 1955576 1812758 1916693 1927536 1664405 1871240 1822997 2051492 2069850
16962 2069850 2116397 1994802 1830942 1856197 2111470 2151671 1882199 2026726 2177073 2179016
16952 2179016 2356872 2461181 2083480 2100588 2282609 2509299 2282508 2566921 2528322 2275126
16942 2275126 2446860 2427252 2647274 2314102 2621766 2431996 2362386 2617952 2620519 2754992
16932 2754992 2893014 2750652 2681027 3008343 2677899 2944028 2706233 2871107 2918461 2826325
16922 2826325 2834313 2747615 2874764 2789613 3221845 3076753 3363731 2802761 3057332 3291931
16912 3291931 2794621 3388329 3370917 3413088 3732936 3227917 3256104 3236299 3283389 3410516
16902 3410516 3793729 3581425 3719605 3728597 3675548 4087223 3440982 3858482 3634542 3882452
16892C882452M4055l7187K50781q2499M04904R8799r8966m3092J26429k55392
16882D290284J55796k4259J50247K82707j00655o4125K76324K48156l50239J83705
16872E047941R1826Q9879n6220K12544k45239O9609J93008M15638m8120N1505
16862E822371K3163R4695j70012M89044k26029Q1538p3290M25456n6820K37840
16852F647956k5156j6155L4054M46366n9582L46839j55169J0151J67467L63045
16842G759816K07302J36430J85529M3176J03868j52646K59251P7078k49378L57346
16832H727772M01970R4113L9195L44846M97277k80036m0235O1031M78032K82766
16822A0606731J93752M3970N35275L8132K96525j4403J83442K15385M68654k20717
$$ plain form
16892 3882452 3926507 3889320 4140101 4057602 4462506 4561305 4462339 4419247 4545676 4290284
16882 4290284 4446080 4421821 4572068 4854775 4754120 4689995 4966319 5214475 4864236 5047941
16872 5047941 5139767 5229646 5173426 5385970 5140731 5210340 5403348 5818986 5770866 5822371
16862 5822371 5845534 5940229 5770217 6259261 6033232 6114770 6041480 6466936 6410116 6647956
16852 6647956 6622800 6606645 6640699 7087065 7027483 7374322 7219153 7229304 7396771 7759816
16842 7759816 7967118 8103548 8289077 8332253 8436121 8283475 8542726 8619804 8370426 8727772
16832 8727772 9129742 9223855 9263050 9607896 10105173 9825137 9784902 9845933 10323965 10606731
16822 10606731 10800483 10844453 11379728 11417860 11714385 11699982 11883424 12098809 12567463 12346746
16812A2346746M96812M65825J28689K23952J17632N33181J5653J080989r0768
16803A5318711K87224L13837N25463p298O51775R8929O76118L23260M72574N19606
16793A9180199L55836N50176K86530M18308O69168N34027N16004N90239N72660
16784B3673147N46907N97954O87858R50774O73671O00504Q10230P65707Q36045
16775C0142797O25686R72218R26169P67457J090156Q51635J087315J094513J273134
16766C8831080R56931J317961J425772J127240J139436J421264J054512J811747
16758D9085943J834453J160696K216722J318602J578218J751431J859201K124754
16750F2930020J881182J893020K041614J726967K517951J592608K358768J911173
$$ plain form
16812 12346746 12843558 13309383 13438072 13662024 13779656 14312837 14328490 15409479 15318711
16803 15318711 15605935 15919772 16445235 16437937 17089712 17188641 17864759 18188019 18660593 19180199
16793 19180199 19536035 20086211 20372741 20791049 21460217 21994244 22510248 23100487 23673147
16784 23673147 24220054 24818008 25505866 26456640 27130311 27730815 28541045 29306752 30142797
16775 30142797 30768483 31740701 32666870 33434327 34524483 35376118 36463433 37557946 38831080
16766 38831080 39788011 41105972 42531744 43658984 44798420 46219684 47274196 49085943
16758 49085943 50920396 52081092 54297814 55616416 57194634 58946065 60805266 62930020
16750 62930020 64811202 66704222 68745836 70472803 72990754 74583362 76942130 78853303
16742G8853303K212241K333189K122274J581082K324274K001175J637618J997880
16734I5063036J767639J749159J250283J100008J173292J165253O34431Q72565
16726A04775666O34180K55822k67468j78145l42692o32392p99201r12095j425356
16717A01108319r57203j476372j773716j919801j758635j912881k440173k020249
16709H6849289k012371j810613k387365k203428k743330j836212k334829k011802
16701F9509339k033059k226087j640340k325702j837721j707548k030967k058988
16693E3648927j622922j279135j615492j953191j038410j724350j425677j065813
16685D1923937j595159j347436j391228j240017q00099r83740j212582r67825
$$ plain form
16742 78853303 81065544 83398733 85521007 87102089 89426363 91427538 93065156 95063036
16734 95063036 96830675 98579834 99830117 100930125 102103417 103268670 103903101 104775666
16726 104775666 105409846 105665668 105398200 105220055 104877363 104244971 103445770 102533675 101108319
16717 101108319 100151116 98674744 96901028 94981227 93222592 91309711 88869538 86849289
16709 86849289 84836918 83026305 80638940 78435512 75692182 73855970 71521141 69509339
16701 69509339 67476280 65250193 63609853 61284151 59446430 57738882 55707915 53648927
16693 53648927 52026005 50746870 49131378 47178187 46139777 44415427 42989750 41923937
16685 41923937 40328778 38981342 37590114 36350097 35549998 34566258 33353676 32385851
16677C2385851q49790j020678j191959j26138j381859o91469q53929j059022l80046
16668B4830961n95938o48549q35614m73222p70253j38927j062237k273p99901
16659A9504047l41985m56801p11988o28780k8350n22552l95341l46313p19807
16650A5352130k45873l57634k95032o2654l66928p63675n004l49607l66327m49138
16640A2090258j32510k10843j25071k97661k46982k77621o4767m69651j13987
16631A0151165j42488n61080N546j95614j80853L8851m55967K47913l82553j26653
16621H398267k09512j1464j19511j94485n5403O5283m39619k97658j20467K52065
16611G267496k83038k84961K0825k0426j59369M2025J92874n98553j63366n7527
$$ plain form
16677 32385851 31536061 30515383 29323424 29197286 27815427 27123958 26270029 25211007 24830961
16668 24830961 24235023 23586474 22750860 22277638 21507385 21368458 20306221 20303948 19504047
16659 19504047 19162062 18705261 17993273 17364493 17336143 16813591 16418250 16071937 15352130
16650 15352130 15106257 14748623 14453591 14390937 14024009 13260334 13255330 12905723 12539396 12090258
16640 12090258 11957748 11746905 11621834 11324173 11077191 10799570 10734803 10265152 10151165
16631 10151165 10008677 9447597 9453143 9257529 9076676 9115527 8659560 8907473 8524920 8398267
16621 8398267 8188755 8177291 8057780 7863295 7807892 7873175 7433556 7135898 7015431 7267496
16611 7267496 6984458 6699497 6720322 6699896 6540527 6582552 6775426 6176873 6013507 5955980
16601E955980l29362l5447K49095k72856r5183k280k36184L03064l07567J06070
16591E335330m94700J32074k75362Q5779j84601P1895P2892m73513L3294Q0893
16581D383981p1659J0460j97020L8743K18739n57360K3244L27185o51004K39080
16571C764389k74164J84540M6085k29456L14879m85744J87135K4216j52026k41987
16561C137867P2706J64484j60007j53464L28876k26457l45044j72182L152L3223
16551B683154J69487L31206l28333q0490J03547m00370Q1924j49682J59335J42806
16541B712584l69830L16054l04400K92181l07768j04794J83518K54058l43895
16532B327708J31288j7383R7769j5513l24367k73292M9016L83433J55789k80865
$$ plain form
16601 5955980 5626618 5591171 5840266 5567410 5472227 5469947 5233763 5536827 5229260 5335330
16591 5335330 4840630 4972704 4697342 4783121 4598520 4670415 4743307 4269794 4303088 4383981
16581 4383981 4312322 4322782 4125762 4164505 4383244 3825884 3849128 4176313 3525309 3764389
16571 3764389 3490225 3674765 3720850 3491394 3806273 3320529 3507664 3531880 3379854 3137867
16561 3137867 3210573 3375057 3215050 3061586 3390462 3164005 2818961 2646779 2649931 2683154
16551 2683154 2852641 3183847 2855514 2775024 2878571 2478201 2560125 2410443 2569778 2712584
16541 2712584 2342754 2658808 2354408 2646589 2338821 2234027 2417545 2671603 2327708
16532 2327708 2458996 2441613 2539382 2523869 2199502 1926210 1975226 2358659 2514448 2233583
16522B233583J58424p2570l44500p2456K11624L04773n75033J23457j46549K36699
16512B057452l41803K96454l49457K57706J7307N7818k93706k9449Q6202O5770
16502A824294N1854m22148J15213J72469j03825m5436j60353K786J90913J29809
16492A755576J5161o09449M46346J64438j57929j38171l4524j11222K00625k96701
16482A234150K28011j68058n1907n028K541K12985K1143j28614J77221k69344
16472A253100k12245J55407j32896L23841J48158m52277N5083O0710k22695P8200
16462A054386J69533r331n5638J26292k50853K41875j00266l98627M24383l8035
16452A163719m34284N0008K57945E16570M41539j29674Q2434K03790l70118J49813
$$ plain form
16522 2233583 2392007 2319437 1974937 1902481 2114105 2418878 1843845 1967302 1820753 2057452
16512 2057452 1715649 2012103 1662646 1920352 1937659 1995477 1701771 1672322 1758524 1824294
16502 1824294 1876148 1454000 1569213 1741682 1637857 1592421 1432068 1434854 1625767 1755576
16492 1755576 1770737 1161288 1607634 1772072 1614143 1475972 1441448 1330226 1530851 1234150
16482 1234150 1462161 1294103 1242196 1237168 1239709 1452694 1473837 1345223 1522444 1253100
16472 1253100 1040855 1196262 1063366 1387207 1535365 1083088 1138171 1198881 976186 1054386
16462 1054386 1223919 1214588 1158950 1285242 1034389 1276264 1175998 777371 1201754 1163719
16452 1163719 729435 779443 1037388 516570 958109 828435 910869 1114659 744541 894354
16442H94354K65555o2175K68307m10007l02455N68743l40238K54176l37690J44809
16432I43379L6826k36752j33409M73106k6820m63555M86513J84892n58924Q0874
16422G86130J3725R7840l20586K71628O0792k21769N4192J76345M8517C54304
16411I03500j37676k84620L95690j37736J91468l45331m0736N03551l46645p4687
16401F26778r2839J87612J09174q6413J99643j43227j6062k86013n7958M73258
16391I13953C82348O08410D92757j11519J66327O4047k05891K84212j74116K44846
16381G60663j48067p4975R6838K6339o9234k11261R7807j40489M45902r9112j5593
16370F68818k78746J71130q1580Q7438k55173l8136M45765B59718K90813B45950
$$ plain form
16442 894354 1159909 1097734 1366041 956034 653579 1222322 882084 1136260 798570 943379
16432 943379 980205 743453 610044 1083150 1056330 592775 1079288 1264180 705256 786130
16422 786130 799855 897695 577109 848737 909529 687760 741952 918297 966814 354304
16411 903500 765824 481204 876894 739158 930626 585295 544559 1048110 701465 626778
16401 626778 533939 721551 830725 744312 943955 800728 784666 498653 440695 913953
16391 913953 382348 990758 492757 381238 547565 611612 405721 689933 515817 760663
16381 760663 612596 537621 634459 660798 591564 380303 478110 337621 783523 684411 668818
16370 668818 390072 561202 479622 567060 311887 273751 719516 259718 550531 245950
16359D90362B34352M33580k21020k05392M09926L0282j61093j19786j59158l5093
16349B06598J03592R9090J67146B31242K99147L00994l81268R2081L0037K5251
16339E97484P0687k87782k5996J40600m8447r1418j06022k7529K09141L19792
16329G50510B47409M8048j12555Q6590L4208A49661J42052J35871m2626P5213
16319D60171J20542j51741J69189k26959l8019K09895k58386A08918M07502A43194
16308F91939E0747M08642A28925K82648m0951J70780l8454A20131M31791B50385
16297E33039A47856K43386J59841a4699B49263J05683K70353j70858D2555K20697
16287B63252A14094N70678j83466d4961B40759o6677j6431J0277k7834K28745
$$ plain form
16359 490362 234352 667932 446912 241520 651446 681728 520635 400849 241691 206598
16349 206598 310190 409280 576426 231242 530389 831383 450115 542196 572233 597484
16339 597484 668171 380389 354393 494993 446546 355128 249106 221577 430718 750510
16329 750510 247409 295457 182902 269492 303700 149661 291713 427584 384958 460171
16319 460171 580713 428972 598161 371202 333183 543078 284692 108918 516420 143194
16308 691939 50747 459389 128925 411573 370622 541402 502948 120131 551922 250385
16297 533039 147856 391242 551083 -14699 249263 354946 625299 454441 42555 263252
16287 263252 114094 684772 501306 -44961 240759 174082 157651 167928 140094 368839
16277C68839A52197K44275N4877E8355K03561j00138K10541L07273B19731p4807
16267A44924M6392R9465n3184E9605K41481k3696A08074K76782m1144O7687b06942
16255C85271j55910J51831A26762J40515J04312j81857q5586L00920F5528f3717
16244B91402A41649f421H3813M91746B34397M09727a63939C27813Q06n5995J16056
16233C88680A09707J06452R0199L01538k54986K7435j11338J09607E0724Q9088
16223A39812K4505M0558o1579c2230B96245j40715b99388C56135i6267E12521
16212B46370o7225q2541k4354K14016D6351N1136O8314m0720F0062J46491A01542
16200C18098J3143A08450l5877a8145D05700j68245K08503F3695K21340r0580
$$ plain form
16277 368839 152197 396472 451349 58355 261916 161778 372319 679592 219731 144924
16267 144924 191316 290781 237597 59605 301086 277390 108074 384856 343712 411399 -206942
16255 385271 229361 381192 126762 267277 371589 189732 104146 405066 65528 -63717
16244 291402 141649 -6421 83813 575559 234397 644124 -163939 327813 328619 272624 388680
16233 388680 109707 216159 306358 607896 352910 380345 269007 378614 50724 139812
16223 139812 164317 204875 143296 -32230 296245 155530 -299388 356135 -96267 512521
16212 246370 179145 96604 72250 286266 46351 97487 165801 125081 60062 206553 101542
16200 318098 331241 108450 72573 -18145 405700 237455 445958 63695 285035 194455
16190A94455K42672A68288C6141K25012b1188B20421j7893J21422R9775A86545
16179D42830i7048B61535Q5810A3335L84538F0052N3986J54678F5850f9742A53292
16167c75922A47340l5557O3798M1520a88026A33600E6167N2508J88525n8254h7967
16155A22637M35047k55894A44973i0641A13112O8124K27127D8210j4728f3921
16144E3334a94272A97883a37828A56329M9735e8685A54674D0784K49386D7071
16133A11172g0534A35623A7085a5198H554L9492J35895b3613G6228H110J45247
16122A53357N2907P3971a74108p696B58619r985F0748J33090g4399A83072h9602
16110H9528O28M1692h3653E5263J1533L6632a66203f3985A06555a49675A65238
$$ plain form
16190 194455 437127 168288 36141 261153 -21188 220421 202528 323950 423725 186545
16179 442830 -97048 261535 347345 13335 397873 60052 114038 268716 65850 -69742 153292
16167 -375922 147340 111783 175581 217101 -188026 133600 56167 108675 297200 238946 -87967
16155 122637 557684 301790 144973 -90641 113112 181236 408363 48210 33482 -63921
16144 53334 -194272 197883 -137828 156329 206064 -58685 154674 40784 290170 47071
16133 111172 -70534 135623 17085 -15198 8554 48046 183941 -23613 76228 8110 153357
16122 153357 206264 280235 -174108 -181804 258619 248634 60748 193838 -74399 183072 -89602
16110 89528 90156 131848 -83653 55263 66796 103428 -166203 -63985 106555 -149675 165238
16098A01204b35176A5740N0835J30637q4830P3507n5631r799J59177a29482N9111
16087g0371A25105J71541E3460b759H263J59659J3863a21421A08947J69589n7219
16076B21317a56163b9505a2121j14972H2726C0158f6914C3498K54000M1442j24112
16065B04828J95740A46623b1800A64173m7983B9772K8039d04827J98474O8784
16055a37569L0383H2152c35586a19558G0276J09201Q6616B4278g7581k53695J2216
16044c19060A04994K64011A34409f3196A49894o6700P2379b6894E9638b8281I3183
16032A85429M9298E9638J35434r1645b59540J02728C5845c0583I9353f8781A85690
16020C07628b16241h4029B6429N7848M8541d4466A4802b4237j25021B7189K2716
$$ plain form
16098 101204 -235176 15740 66575 197212 112382 185889 130258 120459 279636 -129482 -70371
16087 -70371 125105 296646 53460 -2759 8263 167922 181785 -121421 108947 278536 221317
16076 221317 -156163 -29505 -12121 -127093 82726 30158 -66914 33498 287498 328940 204828
16065 204828 400568 146623 -21800 164173 116190 29772 57811 -404827 -206353 -137569
16055 -137569 -107186 82152 -335586 -119558 70276 179477 266093 24278 -77581 -331276 -319060
16044 -319060 104994 369005 134409 -63196 149894 83194 155573 -26894 59638 -28281 93183
16032 185429 234727 59638 195072 103427 -259540 -156812 35845 -30583 99353 -68781 185690
16020 307628 -216241 -84029 26429 84277 132818 -44466 14802 -24237 -149258 27189 49905
16009D9905J15737b75090F6667b55572G485a99744r3518C4660J21808d4139k08793
15998b52932F243L4689Q4435J47471d3419A4431J83716r4373b26193B21544H3384
15986b24448B6509h1612j78174A50134a77743B15928K4151J02233L77272J09300
15976H28884K33354k30572J24319D09200j42111a80704A84109L52020b5697C25708
15965B11595d0178B02097h9362b6471C63347d30570A96625H038c01815J23430
15955a78385A11098B0035K4073a3777A54159j5628P4932a04588F3480J30581m9747
15944A44314J34384a47167H9385c15041G9724e9523D30045j79856F8335J39985
15934B08320J00887b26263F9433a1788F7997J8563g7480k57713A75191a56220
$$ plain form
16009 49905 165642 -275090 66667 -255572 7485 -199744 -293262 34660 156468 -44139 -252932
15998 -252932 6243 40932 125367 272838 -43419 14431 198147 103774 -226193 221544 83384
15986 -224448 26509 -81612 -259786 150134 -177743 215928 240079 342312 719584 828884
15976 828884 1062238 831666 955985 409200 267089 -180704 184109 536129 -25697 325708
15965 211595 -40178 202097 -89362 -26471 363347 -430570 196625 8038 -301815 -178385
15955 -178385 111098 20035 44108 -13777 154159 138531 213463 -104588 63480 194061 144314
15944 144314 278698 -147167 89385 -315041 79724 -59523 430045 250189 68335 208320
15934 208320 309207 -226263 69433 -11788 67997 86560 -77480 -335193 175191 -156220
15923g6058B09383b83596J8143a17452e526j41735A34956K95655i5227k7567K1728
15912a01066a601j9876k0390a2347j14171B01258a90304f9981A31905k1265J3400
15901A24040b5096H0764g1976B52J49310g1861I9281a05659d3419b361j47262
15890a49623o6858A39903g9152A28293f133m5277F9802b3269C22253a1292l0576
15879d1868j23063H7579f027j41215d3482k1339A1259J19731b05986B9742c35317
15867b03453q6433a01313K580j46358L5454B14632J7012i411H7391a35698B33854
15855f1195C5773j6219J50937j3531f9113A54248j8322n6353J23059d22782A15503
15843c8113A24723i7252A05607a02508j05774A1991Q6307k1692a94111H4733j1851
$$ plain form
15923 -76058 209383 -283596 -265453 -117452 -5526 -147261 134956 430611 -95227 -122794 -101066
15912 -101066 -1601 -21477 -41867 -12347 -126518 201258 -190304 -69981 131905 110640 124040
15901 124040 -25096 80764 -71976 252 149562 -71861 99281 -105659 -43419 -2361 -149623
15890 -149623 -216481 139903 -79152 128293 -6133 -51410 69802 -23269 322253 -11292 -41868
15879 -41868 -164931 87579 -6027 -147242 -43482 -64821 11259 130990 -205986 29742 -335317
15867 -203453 -289886 -101313 -98733 -245091 -209637 214632 231644 -9411 87391 -135698 233854
15855 -61195 35773 19554 170491 156960 -69113 154248 135926 79573 202632 -422782 115503
15843 -38113 124723 -97252 105607 -102508 -208282 11991 98298 76606 -194111 84733 72882
15832G2882O3324b2669F5613b15752g4063j559B05065a56388P3304l9829b3574
15820h5639l41499B13577F5690L62042i499B6672L53316j13984K12065f3425C1582
15808A8459O1477C3721b77394J20562O9448I1192b24215Q2693n6679A08879a6763
15796F6311P1262K00596I7107J36289b76068i1665m6400A79869r285E3324c5903
15784A81647a11008j79514I1072C1777J28471P7939G9417b86678a24532A67395
15773B52225P054g3326k46385j0746b0469B13749O670F2804a36918j03286Q1569
15762a58635d8007A78801m9260J42216g101o6548B23860b43139B92602a33256
15751i8504A52877D3602a49815A91855b45304j5223A17317i0350k8051A22011
$$ plain form
15832 72882 136206 -22669 65613 -215752 -74063 -75622 205065 -156388 -83084 -122913 -23574
15820 -85639 -427138 213577 65690 427732 -9499 26672 379988 266004 478069 -63425 31582
15808 18459 79936 33721 -277394 -156832 -87384 91192 -224215 -141522 -198201 108879 -16763
15796 66311 137573 338169 97107 233396 -276068 -91665 -138065 179869 170584 53324 -35903
15784 181647 -111008 -290522 91072 31777 160248 238187 79417 -286678 -124532 167395
15773 252225 259279 -73326 -319711 -330457 -20469 213749 220419 62804 -136918 -240204 -158635
15762 -158635 -48007 178801 129541 271757 -7101 -73649 223860 -243139 292602 -133256
15751 -98504 152877 43602 -149815 191855 -245304 -260527 117317 -90350 -118401 122011
15740a48669j58565f1503C2421f5005a7906j34702m8666A8535M9220Q5996E876
15728a13730A62247p0196d25140A78675b47909G6275A4515h7125A50922d6641
15717A05172J5346a6555F7464O4547P4251R9783C7411a70540C56413c8512B38982
15705H7727c1804A84727b33079e2166A1776b98650A74243A4150J57325c34793
15694B15953E2417a3900k13427o9450a34083E996P3078a31542o906g032a714A48561
15681a1396A8570m713b09336d3809B7045J2786g5781l6360r841I1430a83319A92703
15668D8136b07370n0265h7955C27893b30010E0407A8513a74799A34672P9173k6305
15657A87540c40543A64001N8551b56467a10170b0289m46075J38881A42802b22319
$$ plain form
15740 -148669 -307234 -61503 32421 -65005 -17906 -152608 -201274 18535 67755 153751 5876
15728 -113730 162247 92051 -425140 178675 -247909 76275 14515 -87125 150922 -46641
15717 105172 120518 -16555 67464 132011 206262 306045 37411 -170540 356413 -38512 238982
15705 87727 -31804 184727 -233079 -52166 11776 -298650 174243 14150 171475 -334793
15694 215953 52417 -13900 -227327 -296777 -134083 5996 79074 -131542 -138448 -7032 -1714 148561
15681 -11396 18570 13857 -209336 -43809 27045 39831 -75781 -112141 -121982 91430 -183319 192703
15668 48136 -207370 -257635 -87955 327893 -230010 50407 18513 -174799 134672 213845 187540
15657 187540 -340543 164001 222552 -256467 -110170 -20289 -466364 -327483 142802 -222319
15646e00367A4756c999l14995A44362i4179A17505p581k0432M8304J2370i9535
15634b19619B89723g4270C026h6138l994A88517b11129a03697A42861e970A37433
15622B1928J1240a53283f6498A85157j4903l1774a6409A11212J55146g4459C2191
15610A20018a60229e1911k10365E423a41746A36467a75466B10356a89008a1194
15599a36191F6917L126c20910a49633m07359A01349J20211a3303A33463b7564
15588A35351C1933I116K2816N6671L112c56549A61109a61758A79415e443A78082
15576G9333R0513g5085k73836J41983q73M8522P0204A75498g2827p2478M0932
15565a04373B46177e6257m897C9629J51740c7700A8300J57619b86689A14286R7440
$$ plain form
15646 -500367 14756 -3999 -318994 144362 -94179 117505 109924 89492 137796 150166 -99535
15634 -219619 289723 -74270 3026 -86138 -90132 188517 -211129 -103697 142861 -5970 137433
15622 21928 33168 -153283 -66498 185157 170254 138480 -16409 111212 266358 -74459 32191
15610 120018 -160229 -51911 -262276 5423 -141746 136467 -175466 210356 -189008 -11194
15599 -136191 66917 70043 -320910 -149633 -556992 101349 221560 -13303 133463 -27564
15588 135351 31933 9116 31932 88603 91715 -356549 161109 -161758 179415 -5443 178082
15576 79333 169846 -75085 -348921 -206938 -207811 -159289 -89085 175498 -72827 -145305 -104373
15565 -104373 246177 -56257 -61154 39629 191369 -37700 18300 175919 -286689 114286 211726
15554B11726E2618J62652a90826g9209k84610A9742a5449A23864K33505D1086
15543A10477a45509H8976l4780a42814A72402J40437A03534O5510E7377K91450
15533C48827q4682A09299l7894a08382H8650a00395F9775R3693J84474B6850P1565
15522I8415d0456C05448m4855J22129N8330j83375I3900k6029J79587K94038j86112
15511C55384l0202C6587L32730A40425N2444o4113N1241k8722J03002J46899j99025
15500B02151J00436j42516l7962C6552K87043j37784K21395l9191A9475K9320
15490D8795K46867j01996e6077r0712B06948a73191B66647H0615K74961M3415
15480C98991a47194B53254a36190B69562P5524j14656O67726D00339K25698l08136
$$ plain form
15554 211726 52618 215270 -190826 -79209 -363819 19742 -15449 123864 357369 41086
15543 110477 -145509 88976 54196 -142814 172402 312839 103534 169044 57377 348827
15533 348827 264145 109299 71405 -108382 88650 -100395 69775 163468 347942 26850 98415
15522 98415 -40456 305448 260593 382722 441052 257677 93900 67871 247458 541496 355384
15511 355384 325182 36587 369317 140425 192869 128756 179997 151275 254277 401176 202151
15500 202151 302587 160071 122109 36552 323595 185811 407206 368015 19475 48795
15490 48795 295662 193666 -56077 -146789 206948 -173191 266647 80615 355576 398991
15480 398991 -147194 253254 -136190 269562 345086 230430 898156 400339 626037 317901
15470C17901D0787J9960L0962g2095B48201e4575B9914J5076a7003J011G4985
15458g888C56557g1129r228p6790C24744q4777r3762J64676a1065A13692r500
15447A04192b374A63145N06918j81062J04393Q8670R8296M44993C87588j27885
15437B59703B2231d4548A1708K02574p6983j953J5945J10537a19853a7353B23250
15425g7862A68924J5449B3204b63091A32899c90477D9333e4840k24146h2759j39136
15414b21895o553N1292h3686E1006h4920i920j20742b0717m9061C36775a33933
15402A30362b05077j65999a65508D9174n174b46657h4596g161B17456i5870A87118
15390a16135a042A09719J44039j22034J61637j24648A1840d596k96162A67283
$$ plain form
15470 317901 40787 60747 91709 -72095 248201 -54575 29914 44990 -17003 -15992 74985
15458 -7888 356557 -71129 -80357 -157147 324744 239967 146205 310881 -11065 113692 104192
15447 104192 -2374 163145 670063 489001 593394 682064 780360 1225353 387588 259703
15437 259703 22231 -44548 11708 214282 137299 135346 151291 261828 -119853 -17353 223250
15425 -77862 168924 184373 23204 -263091 132899 -390477 49333 -54840 -278986 -82759 -221895
15414 -221895 -228448 -177156 -83686 51006 -84920 -9920 -130662 -20717 -69778 336775 -133933
15402 130362 -205077 -371076 -165508 49174 44000 -246657 -84596 -7161 217456 -95870 187118
15390 -116135 -1042 109719 253758 131724 293361 168713 11840 -4596 -300758 167283
15379A19550i5783C69703a12071B2063a71485A60090N38428B82230b9569B17387
15368a23578F5238K10301a40069E7507j257R8005Q6202o5207J99068l258A06701
15356C93936j69323F7403K2085m2200J08447K11300j27827G7270K27230i0523
15345H3861O31898l07003K5455A54468K19835A56473Q3877f0641A94002a63028
15334a18927C54537A50965a69676c8585C71055J04895B36164H1535J44736n9402
15324A66869K51270H4440a09866d1650B43907b5566j55759g4904B96240n2288
15314B43952j0933A04009L6551k2888b0191A15863m8532J26019h0006q9427b1180
15302B90463H2350K13269a55017A20836d2962B18273J33o1551B9619N5713C5415
$$ plain form
15379 119550 -95783 369703 -112071 22063 -171485 160090 698518 282230 -29569 217387
15368 -123578 65238 275539 -140069 57507 56250 154255 240457 175250 374318 371060 106701
15356 393936 224613 67403 89488 47288 155735 367035 239208 77270 304500 -90523
15345 83861 715759 408756 434211 154468 374303 156473 240350 -60641 194002 -163028
15334 -118927 354537 150965 -169676 -38585 371055 475950 236164 81535 226271 166869
15324 166869 418139 84440 -109866 -41650 243907 -25566 -181325 -74904 296240 243952
15314 243952 233019 104009 140560 117672 -20191 115863 67331 193350 -80006 -169433 -21180
15302 290463 82350 295619 -155017 120836 -42962 218273 218406 156855 29619 85332 35415
15290g5371A09667a80854G0203M1027f9955n1953A24715j150m0935e5408j91819
15279b47227h679n8916G5283B2303a39543B35608q9441b14025B4028b81858A08708
15267A26292P3501C0751e6951F9880d7002E1116L978K44784D9198K65348A41748
15255a55847G5837a3230n4355A63757a31079B92349a39042B18542F2125J6274
15245G8399M5688g1470B30293k5640J03724b9564B31804M03262E9158J19561j2988
15234A65731J8475D0459M79272j64114O10889R32941J785918p11855L55495k7127
15224C301878A321371B67312P9711A42256L4388G206a41591C9625a58574D74649
15213i0940C34629G9677J45815r7187b97216A11694A1762K22619J76484a80487
$$ plain form
15290 -75371 109667 -180854 70203 111230 -69955 -121908 124715 123565 82630 -55408 -247227
15279 -247227 -8679 -67595 75283 22303 -139543 235608 146167 -214025 24028 -281858 108708
15267 126292 199793 30751 -56951 69880 -47002 51116 55094 299878 49198 314546 141748
15255 -155847 75837 -13230 -67585 163757 -131079 292349 -139042 218542 62125 78399
15245 78399 124087 -71470 230293 204653 308377 -29564 231804 635066 59158 178719 165731
15234 165731 184206 40459 519731 355617 966506 1899447 3685365 2973510 3329005 3301878
15224 3301878 1321371 267312 347023 142256 176644 7206 -141591 39625 -158574 474649
15213 -90940 334629 79677 225492 128305 -297216 111694 11762 234381 410865 -180487
15202H7760J43068b52991M8846F793R9688C3873J13745J77230j49649l9491K94906
15191D30614p9827L9140A61205H956a61503f9744B02025K7402c07850b0414I5931
15179A95145b4872j1928A77068M2257A07932m95m7578F83g9418j03813C06406
15167a28j0861H1433M0312O2459c6292o535A39030J34108B7922K87806b26829
15155D27430B1914J34751a23098B31655n1293c93123c5575E19150B5614L2751
15145E8365B2522P4971a54262H346K19194F8171L08028a90466A14390h7023F091
15133I6291e1985A85470K78046r0291k7224C2298b21226B2895M67705j76281m1099
15122B73220n3879K38630j08131p165J4764N5480K08081n9476N33096J00883m71565
$$ plain form
15202 87760 230828 -252991 -204145 6793 106481 33873 147618 324848 175199 135708 430614
15191 430614 350787 389927 161205 8956 -161503 -69744 202025 229427 -307850 -20414 95931
15179 195145 -24872 -36800 177068 219325 107932 107437 59859 683 -79418 -183231 306406
15167 -128 -10989 81433 121745 184204 -36292 -42827 139030 273138 27922 315728 -226829
15155 427430 21914 156665 -123098 231655 180362 -393123 -35575 519150 25614 58365
15145 58365 22522 97493 -154262 8346 227540 68171 376199 -190466 114390 -87023 6091
15133 96291 -51985 185470 463516 373225 346001 32298 -221226 22895 490600 314319 273220
15122 273220 219341 457971 349840 342675 357439 412919 621000 561524 1094620 1195503 723938
15111G23938B14821Q8608q463K85769a74273A90986l0834a20631A36060L877l2635
15100A07302K16952J17240g9976A47781C3163J01740F6691a70112G6412B4857
15089A89555m7327D3922J75117O3107j22349L6392i1990a1249d981D19076a35549
15077D2638J10184J50353k6683r6740L15973B34611F9613i3012C52953A08962
15066D1628M9622K82675A59646G1729K4817K90443P0223I4221L27350j21325L4449
15055C34695m5600P9213A28553J9624J90013J26818j6164A97629R9445J94432
15045D91506A24821d6194A90433K74998N9298j83255J79566p2796k7624J01606
15035E22226k29081L05110O5167l27311M81960k26455Q5986j10412k46989J04561
$$ plain form
15111 723938 214821 303429 294966 580735 -174273 190986 160152 -120631 136060 139937 107302
15100 107302 324254 441494 -79976 147781 33163 134903 66691 -170112 76412 24857
15089 189555 142228 43922 219039 282146 159797 196189 -91990 -11249 -4981 419076 -135549
15077 42638 152822 303175 276492 179752 495725 234611 69613 -93012 352953 108962
15066 41628 91250 373925 159646 71729 96546 386989 457212 94221 421571 300246 334695
15055 334695 289095 368308 128553 148177 338190 465008 448844 197629 297074 491506
15045 491506 124821 -46194 190433 465431 524729 341474 521040 448244 420620 522226
15035 522226 293145 598255 663422 336111 818071 591616 677602 567190 320201 424762
15025D24762K369j4944l9245K07506p4534J40470k23560A13452L66868Q7406p0089
15014D97637j3348J00741A11263K70344O7531j51549K66536B23193J7519L51507
15004E92219k63053m8187k695L67216l01123R3350o0024r4686j4600J51095J26791
14993E46303p8726J57599l9098j65274j83619P25507C27242J26068J12887o4988
14983E01209m283L89595C75348K80123B02207L67601H7373K14855M54292k2631
14973G33889j27239k73317P7820N7068n97j62122K51306r8468o7400A10416Q7256
14962A97672L99887k12029o7062r4820K57962G2711M34170B21233J16553o5291
14952B72495p5214n7918R260J07246O1248J5289K23539o2426L30388j82694k32096
$$ plain form
15025 424762 427131 412187 372942 580448 505914 646384 422824 113452 480320 567726 497637
15014 497637 484289 585030 111263 381607 449138 297589 564125 223193 240712 592219
15004 592219 329166 280979 278284 645500 344377 437727 377703 283017 268417 419512 546303
14993 546303 467577 625176 586078 420804 237185 962692 327242 453310 566197 501209
14983 501209 496926 886521 375348 655471 202207 569808 87373 302228 756520 733889
14973 733889 606650 333333 411153 468221 467624 305502 556808 458340 390940 110416 197672
14962 197672 597559 385530 318468 223648 481610 72711 506881 221233 337786 272495
14952 272495 197281 139363 148623 255869 317117 332406 555945 493519 823907 641213 409117
14941D09117J44418l5392A94992Q1591K11992j76555J81316J70508K25307j40510
14931G48641O6115L93058j5764J2112Q0590k01053N06953n5015j71190k37342
14921A127105K99666Q9851M03432j72968M17143n32666l84102P5638m45963j44578
14911G32558j38554M0906k41619K4161l7995q0778M60436k15050k7352q8909j72818
14900B54986J02050J74149i4270E03646J36184k46646K76641l16373J36709J92516
14890F82677k20108K1105R2853K09855k6920j69901K30936p0151L3736j13379
14880F70703L55891j79820k02809k19411J25836C9319L36741K81280j79466k1693
14870D56181P1139J0563k33526N65497j26049l7724M2758o6111j86668J09265
$$ plain form
14941 409117 553535 518143 194992 276583 488575 312020 493336 663844 889151 748641
14931 748641 814756 1207814 1192050 1204162 1284752 1083699 1590652 1535637 1364447 1127105
14921 1127105 1426771 1516622 1920054 1747086 2164229 1631563 1247461 1323099 877136 732558
14911 732558 594004 634910 393291 417452 379457 298679 759115 544065 516713 427804 254986
14900 254986 357036 531185 -94270 503646 639830 393184 669825 353452 490161 682677
14890 682677 462569 483674 576527 786382 759462 589561 820497 750346 784082 670703
14880 670703 1026594 846774 643965 424554 550390 39319 376060 657340 477874 456181
14870 456181 527320 537883 304357 869854 743805 706081 748839 682728 496060 605325
14860F05325o2348K44040k69294m3833M06089j81736c5784F91725j04641j25098
14850D61986O0658L96555j2881l3224k53278K51707n2478Q5092j31664k7108Q5864
14839H31229k39753K32185J12994L4614q5511l95858M3050P0826P25j33190L91977
14828H63288j57612j23288O6343K32062K8831k23341j28673q5929M66828j94915
14818G43594J82764q0485J15239p3444j30039Q9915k01469J07940j16552K83904
14808I21367j04196R8253m9713j57805J0052n4403k93250J19777L07375N540k6942
14797G76055n1650j95383j83567L83288L6154k9067R9197n3003K4251J1189j73102
14786F44362k01379M47429l24265m9533Q1757O9803M88342k43704J20233n7660
$$ plain form
14860 605325 542977 787017 517723 473890 879979 698243 -35784 691725 587084 461986
14850 461986 522644 919199 906318 873094 619816 871523 819045 904137 772473 745365 831229
14839 831229 591476 823661 936655 971269 885758 489900 532950 603776 604501 471311 863288
14828 863288 705676 582388 648731 880793 909624 686283 557610 471681 938509 743594
14818 743594 926358 845873 961112 887668 757629 847544 646075 754015 637463 921367
14808 921367 817171 915424 865711 707906 717958 663555 370305 490082 797457 802997 776055
14797 776055 724405 529022 345455 728743 764897 735830 835027 782024 806275 817464 644362
14786 644362 442983 890412 566147 516614 598371 668174 1156516 912812 1033045 975385
14776I75385k73034J77253J80044k97189k59003N22038j93681m02425K92218k68320
14766D53286K88104k83507J02626j21684K63381l23053O73243l22309K1176j42627
14756F08636j37644J19561q7346J24906L43588j65320l89342J9792K84594L99214
14746A120639j61630k96776O5092L6331r0944L45983o1706l61750L59875K4515
14736I79629J13295J04854L5015o9805K68376N9110K84265k2882k50692l4805
14726A466360m83811J78407k06395k2192l734k5226m8699k9764K14755n1163j56637
14715H31901K1820q8939k12649L64145q7063o1667L38011Q5317J01043p8853L83914
14704A596980N34974m31869j5948o0353n37355p4957Q4643k00390K1338k92075
$$ plain form
14776 975385 702351 879604 1059648 762459 503456 1025494 831813 429388 721606 453286
14766 453286 741390 457883 560509 438825 702206 379153 1052396 730087 751263 608636
14756 608636 470992 590553 503207 628113 971701 806381 417039 436831 721425 1120639
14746 1120639 959009 662233 727325 763656 672712 1018695 956989 595239 955114 979629
14736 979629 1092924 1197778 1232793 1162988 1431364 1490474 1774739 1751857 1501165 1466360
14726 1466360 982549 1160956 954561 932369 928635 903409 854710 824946 1039701 988538 831901
14715 831901 853721 764782 552133 916278 829215 767548 1105559 1190876 1291919 1213066 1596980
14704 1596980 2131954 1700085 1684137 1623784 1086429 1011472 1096115 895725 917063 624988
14694F24988M36202j09648k79340O1483j27896L67108j23946J18807o1701k46333
14684F59724j10381N56304J5058k34355n0831K77960P185j54574o0737l0607k628
14673H72118O03784m66378J59066k39440J91217j20368K13763q722l73105K33335
14663A065270j32867K53191K51388k13372k44323K19569N0289p1258J65190K6604
14653A369681J31960j11004q1131O2329k30211J63512j12706Q2192r9389J47060
14643A322293k35709M2912L09125J49281n09308J06498L26040p5041l50427j2116
14633A073548K98858p2822p684O528N8279K9401J61741k04849m3317J06567M10757
14622A817007k93586j18594k03880K50499J75390m44155M50947l79509J46373
$$ plain form
14694 624988 1061190 951542 672202 733685 605789 972897 848951 967758 906057 659724
14684 659724 549343 1105647 1120705 886350 835519 1113479 1120664 966090 905353 874746 872118
14673 872118 1475902 1009524 1168590 929150 1120367 999999 1213762 1205040 831935 1065270
14663 1065270 932403 1185594 1436982 1223610 979287 1198856 1249145 1177887 1343077 1369681
14653 1369681 1501641 1390637 1309506 1371835 1141624 1305136 1192430 1274622 1175233 1322293
14643 1322293 1086584 1129496 1438621 1587902 1078594 1185092 1511132 1436091 1085664 1073548
14633 1073548 1372406 1299584 1291900 1298428 1356707 1386108 1547849 1343000 1299683 1406250 1817007
14622 1817007 1523421 1404827 1200947 1451446 1626836 1182681 1633628 1254119 1400492
14613A400492K52363J5769Q5200k48223k25628R7670q5955K90336J39959k2905
14603A699078l4487M15169l18462j31849k5812j09476K15756l18192N65750q9905
14593A867570m8408K9129n001Q9312k50608K05027k77863j0321L20724o1029K80562
14582B139094m40472K94587R3550j91623L3609J3097o9308K63899J32450k51534
14572B017349Q8552J30776K4017L09340l63508K03386j60698R6068L55562k05690
14562B495154j20133j16253M98585q5322J72838M38787q6482J34184m5311L31207
14552C617254N85623K39483J581652J804036L235846O941229J7366453J4556260
14544D9927836B0760060G863492C564375j402751r9301j04341K3272P8584M1981
$$ plain form
14613 1400492 1652855 1668624 1753824 1505601 1279973 1377643 1291688 1582024 1721983 1699078
14603 1699078 1664591 2079760 1761298 1629449 1603637 1494161 1709917 1391725 1957475 1867570
14593 1867570 1819162 1848291 1843290 1932602 1681994 1887021 1609158 1598837 1919561 1858532 2139094
14582 2139094 1698622 1993209 2086759 1895136 1928745 1941842 1872534 2136433 2268883 2017349
14572 2017349 2105901 2236677 2260694 2570034 2206526 2409912 2249214 2345282 2700844 2495154
14562 2495154 2375021 2258768 2757353 2672031 2844869 3283656 3197174 3331358 3286047 3617254
14552 3617254 4202877 4442360 6024012 7828048 11063894 18005123 35371576 49927836
14544 49927836 20760060 7863492 3564375 2161624 2062323 1957982 1981254 2059838 2101819
14535B101819k27075R3843N47975m5156j08387J6900J67937K4217K41977P15018
14525C529068M45041K181746L268162m275172j780253m14728o60216J05284M61209
14516B860141R5096l62520L03538k68817L13630j57343L851J08061O7088k3111
14506B939614j34336M76712n4328l45781L66458l8628J79486l32447l56818O34375
14496C334307K11446q8839j95906L56167n26248N35609m578k18934K97335r9435
14486C600924m2613K17666r8636M3504Q0821q9566L99375j16223M35077j96277
14476D234052k84882J70856M6028K20791j81268L15755l25322j9259K45482M6384
14466D468617K33328j63128L63536K93816n17264l9997J22162K51609J50366l97676
$$ plain form
14535 2101819 1874744 1968587 2516562 2471406 2363019 2379919 2547856 2572073 2814050 3529068
14525 3529068 3974109 6155855 9424017 5148845 3368592 2953864 2293648 2398932 2860141
14516 2860141 2955237 2592717 2896255 2627438 2941068 2783725 2787576 2895637 2962725 2939614
14506 2939614 2805278 3281990 3227662 2881881 3248339 3209711 3389197 3056750 2699932 3334307
14496 3334307 3545753 3456914 3261008 3617175 3090927 3626536 3621958 3403024 3700359 3600924
14486 3600924 3558311 3775977 3677341 3720845 3801666 3712100 4111475 3995252 4430329 4234052
14476 4234052 3949170 4120026 4166054 4386845 4205577 4521332 4196010 4176751 4422233 4468617
14466 4468617 4701945 4538817 4902353 5196169 4678905 4638908 4761070 5012679 5163045 4765369
14456D765369L26294j58869J24275M10695K862m3656k31376M72415j00320J48081
14446E715770J09131M1013L5084J76643m1323o6594J43694J20037k39965N99314
14436F592804k66918K52763J90034Q336j71487L87877J48428L61335m25117N48927
14426G626982R6230K45011m2550L76758K61796k03932L62099j06186J1928k54098
14416H374038N63370j80906K79322K76280k83475K75392M2573L99114L445N18821
14406A0267974k36436J74018L57905J1204J65710J93121J6666j41413j3374O95910
14396A1491285L68465N029j33587M27748J2889N84136k02506O19784J98131J5765
14386A3387139M87123K23470J97914K36051k2744L42938K79865L11343M19770
$$ plain form
14456 4765369 5091663 4932794 5057069 5467764 5470626 5426970 5195594 5668009 5567689 5715770
14446 5715770 5824901 5865914 5900998 6077641 6036318 5969724 6113418 6233455 5993490 6592804
14436 6592804 6325886 6578649 6768683 6777019 6605532 6993409 7141837 7503172 7078055 7626982
14426 7626982 7723212 7968223 7925673 8302431 8564227 8360295 8722394 8616208 8628136 8374038
14416 8374038 8937408 8756502 9035824 9312104 9028629 9304021 9346594 9745708 9749153 10267974
14406 10267974 10031538 10205556 10563461 10574665 10740375 10933496 10950162 10808749 10795375 11491285
14396 11491285 11859750 11864779 11731192 12158940 12171829 12755965 12553459 13173243 13371374 13387139
14386 13387139 13874262 14097732 14295646 14531697 14508953 14851891 15131756 15443099 15862869
14377A5862869J51021N11146j5421O13221J43925L48289J99998Q36168M76739
14368A9127955k07248Q18950L58067K96477L29899N57295K36976O54559L53394
14359B2526324L89633M65895M62792R84579K79993M84658P52468Q03224N01117
14350B7650683O37635O47707M55881R55390M70132J077571R42715R27642O11407
14341C4376763R44210J290096Q13962O43386P78028J811984R43934J130051J714216
14332D4446630R65011J179414J484776J564814J651972J472736J605314J934094
14324E6304761J760678J732845J967674K236627K116256K229823K469178K494824
14316G3312666K546188K666156K843055L077021L456055L430251L734031L668987
$$ plain form
14377 15862869 16013890 16525036 16509615 17122836 17266761 17615050 17815048 18651216 19127955
14368 19127955 18920707 19739657 20097724 20394201 20724100 21281395 21518371 22172930 22526324
14359 22526324 22915957 23381852 23844644 24829223 25109216 25593874 26346342 27149566 27650683
14350 27650683 28288318 28936025 29391906 30347296 30817428 31894999 32837714 33765356 34376763
14341 34376763 35320973 36611069 37425031 38068417 38846445 40658429 41602363 42732414 44446630
14332 44446630 45411641 46591055 48075831 49640645 51292617 52765353 54370667 56304761
14324 56304761 58065439 59798284 61765958 64002585 66118841 68348664 70817842 73312666
14316 73312666 75858854 78525010 81368065 84445086 87901141 91331392 95065423 98734410
14308I8734410M179902M141713M368364M649179M913923N476281N481229O376662
14300A38321663O231145O397939P214762P341826P933057Q259053Q911666R324724
14292A99935835R980334J0347872J0917007J1351630J2024419J2339968J3132406
14285B80029471J3360421J3913692J4634062J4806148J4977306J4596820J5203291
14278C81521211J4751209J3991589J3465861J1520051O662067M285751L982880
14271D50180619K808018L373438J034868j069878k848413k923301p519862j0757766
14263D32277723j2304874j4177654j4764091j5544070j5537745j6081331j5678426
14256C28189532j5537165j5105030j4845999j3764500j3481758j2797301j1978477
$$ plain form
14308 98734410 102914312 107056025 111424389 116073568 120987491 126463772 131945001 138321663
14300 138321663 144552808 150950747 158165509 165507335 173440392 181699445 190611111 199935835
14292 199935835 209916169 220264041 231181048 242532678 254557097 266897065 280029471
14285 280029471 293389892 307303584 321937646 336743794 351721100 366317920 381521211
14278 381521211 396272420 410264009 423729870 435249921 441911988 446197739 450180619
14271 450180619 452988637 456362075 457396943 456327065 453478652 450555351 443035489 432277723
14263 432277723 419972849 405795195 391031104 375487034 359949289 343867958 328189532
14256 328189532 312652367 297547337 282701338 268936838 255455080 242657779 230679302
14249B30679302j1649965j1188325j0400950r427674r637485p994661q272656
14242A62107586p622236p378778p316443o450550n948492n416680m987596j099605
14234A15887206n201757n421594n143169l666302m140815l741498l957270l140322
14226H1474479k838332l341364k801957k536909k618034k064674k346767k178905
14218F0747537k287543j900954j544300k300960j334056j199035j542311j804978
14210D6833400j395061j477023j196170m47983j274072j484816j069117j325391
14202C7163767r11555p52842n10520j005610j197895q44980j165562k89922q13766
14193B9671115j191523k15444q92609p99619m52561o40052m55289l58102j183042
$$ plain form
14249 230679302 219029337 207841012 197440062 188012388 178374903 170380242 162107586
14242 162107586 154485350 147106572 139790129 133339579 127391087 121974407 116986811 115887206
14234 115887206 110685449 105263855 100120686 96454384 92313569 88572071 84614801 81474479
14226 81474479 78636147 75294783 72492826 69955917 67337883 65273209 62926442 60747537
14218 60747537 58459994 56559040 55014740 52713780 51379724 50180689 48638378 46833400
14210 46833400 45438339 43961316 42765146 42317163 41043091 39558275 38489158 37163767
14202 37163767 36252212 35499370 34988850 33983240 32785345 31940365 30774803 30484881 29671115
14193 29671115 28479592 28264148 27371539 26571920 26119359 25479307 25024018 24665916 23482874
14184B3482874l48722j39840r62703n43418o13440J003n07425k68126n79113k88845
14174A9232245Q3467r27386l00252n55561l01591k56364l05662l66774l35536
14165A5966586j83513j84509n20389j14968o02985J6170l09899r2433l06208j36652
14155A3531200l46008j14536m93942L98807p24655r6042p4656p37706K88590k53024
14145A1378028m39039J42702k22631j66409k61913J42441m13709j37841P1051
14136A0092680k84772j65644j69679j37589N0416l71827J71542m76032R689k39424
14126H479360j37527r1911k14024O7663l5913j47676n3299k60934K20113k38903
14116G586949Q670m80554L10990k12141k10224N6259k72345j07040J96922n6277
$$ plain form
14184 23482874 23134152 22994312 22031609 21488191 20874751 20875754 20368329 20100203 19521090 19232245
14174 19232245 19315712 18388326 18088074 17532513 17230922 16974558 16668896 16302122 15966586
14165 15966586 15783073 15598564 15078175 14963207 14360222 14376392 14066493 13974060 13667852 13531200
14155 13531200 13185192 13070656 12576714 12975521 12250866 12154824 12080168 11342462 11631052 11378028
14145 11378028 10938989 11081691 10859060 10692651 10430738 10573179 10159470 10021629 10092680
14136 10092680 9807908 9642264 9472585 9334996 9385412 9013585 9185127 8709095 8718784 8479360
14126 8479360 8341833 8249922 8035898 8103561 8067648 7919972 7866673 7605739 7825852 7586949
14116 7586949 7595619 7115065 7426055 7213914 7003690 7059949 6787604 6680564 6877486 6821209
14106F821209j58260k48124k05069K18175j56532j08193J86708n49183J96577
14097E997308p8522l3625J26782k32268k71289J55818k6300m27152R0326J81872
14087E482950j94509r237l43326J98581k7435l33501m1942L57045l60790j4928
14077D712908J32956O741l71109N3053K54244k44987m6746k28601m9050R107k8458
14066D200058j15654j68931K3047L4041k2957J80843m3162L34495m46855M72295
14056D447220n56046M34437o93976M44635j68599k61888R6670l08598K77985k21935
14046C489905j66055J31591J53395j04032J05604p35606P59656m13520p3855N1918
14036C199001R58k13198j75274M64894m92559J41943l01156M0790K92035j58695
$$ plain form
14106 6821209 6662949 6414825 6209756 6427931 6271399 6163206 6349914 5800731 5997308
14097 5997308 5918786 5885161 6011943 5779675 5508386 5664204 5637904 5210752 5301078 5482950
14087 5482950 5288441 5279204 4935878 5134459 5107024 4773523 4731581 5088626 4727836 4712908
14077 4712908 4845864 4852605 4481496 4534549 4788793 4543806 4497060 4268459 4219409 4228516 4200058
14066 4200058 4084404 3915473 3938520 3972561 3949604 4130447 4087285 4421780 3974925 4447220
14056 4447220 3891174 4325611 3631635 4076270 3907671 3645783 3742453 3433855 3711840 3489905
14046 3489905 3323850 3455441 3608836 3504804 3610408 2874802 3634458 3220938 3147083 3199001
14036 3199001 3199959 2986761 2811487 3276381 2783822 2925765 2624609 2665399 2957434 2798739
14026B798739l077J12572J45743r0892l64528K9547K70849l20273L29651l03018
14016B605313j53027J27837m6683o8598K29447n74897L4952L01378l84782M43850
14006B514790n14386L20746J51347k90175J8180j93786M91230l08805j0044J49135
13996B328232j17385m4471j31509P0883k26505M18669M39792J278795K226213
13987F242714N063187J4467519K6920459k2570323A4238384o007209k508847j556460
13979D165868m45196k61069k95190j07143j49869l84309Q2410n0875n9488J96385
13969B691524l13123K33999m48697M900J78783k6226M0053j50000J0035N6636
13959B277884k451k0475j67507k40637K74578k69579J61970K28720l81895N6115
$$ plain form
14026 2798739 2795662 2908234 3053977 2963085 2598557 2628104 2898953 2578680 2908331 2605313
14016 2605313 2452286 2580123 2533440 2464842 2694289 2119392 2154344 2455722 2070940 2514790
14006 2514790 2000404 2321150 2472497 2182322 2200502 2006716 2497946 2189141 2179097 2328232
13996 2328232 2210847 2166376 2034867 2105750 1879245 2297914 2737706 4016501 6242714
13987 6242714 11305901 25773420 52693879 30123556 14238384 8231175 5722328 4165868
13979 4165868 3720672 3459603 3164413 3057270 2907401 2523092 2605502 2554627 2495139 2691524
13969 2691524 2378401 2612400 2163703 2168603 2347386 2321160 2361213 2211213 2221248 2277884
13959 2277884 2275433 2254958 2087451 1846814 2121392 1851813 2013783 2242503 1860608 1916723
13949A916723P4012j0737J73517k03539k88366M10607j91546L65974n25846J74625
13939A895424l97731L54210k45046j1340K64539k94887m0284L3906M05416k31281
13929A732926j41082l43201M57714p8839j21411j97945K02961m8989K5312j09850
13919A377596L5471O8347j1364k46295J17320N61524n55755L88401j21922k10370
13909A402953J4165K59042k53882r9773P1154l22216L66757n0109o3598J96496
13899A520989j81990m9455j13118L11343k28345J5572j81371M83499o38700M06376
13889A344800o1776L9833m8332j01238l6955j30489L26162m1017k09233Q6318
13879A168073Q6998l12699K00797J57262J62793o59664L09428J02247L56385o45037
$$ plain form
13949 1916723 1990735 1979998 2153515 1949976 1661610 2072217 1880671 2246645 1720799 1895424
13939 1895424 1497693 1851903 1606857 1595517 1860056 1565169 1524885 1558791 1964207 1732926
13929 1732926 1591844 1248643 1706357 1627518 1506107 1308162 1511123 1462134 1487446 1377596
13919 1377596 1413067 1481414 1470050 1223755 1341075 1902599 1346844 1735245 1613323 1402953
13909 1402953 1417118 1676160 1422278 1322505 1393659 1071443 1438200 1388091 1324493 1520989
13899 1520989 1338999 1289544 1176426 1487769 1259424 1274996 1093625 1577124 938424 1344800
13889 1344800 1283024 1322857 1274525 1173287 1136332 1005843 1332005 1290988 1081755 1168073
13879 1168073 1255071 942372 1143169 1300431 1463224 803560 1112988 1215235 1571620 926583
13869I26583K76277l8346N3178k92013K81815l2043P1161j1878j87612k20995
13859H26127l0003M1765M82402n01736K64632l3745j41189M37819n11859M10527
13849A244740o15764M36376n1796K6392R1677j0982L358L9079P517j78797j14184
13838H77616L9854L1532n1576R6446q4665j93848L58238k61699K00444l45795
13828F66547J37223J18195n39j34230k21749K11814K16155n6267q8989O73j90743
13817F58090Q7459M490K66117k57586q6421L1799P114K48908k38949j90658M6266
13806E76629M9538J4481J07830P3208k85656L15124r2308M59518m14079J43717
13796I48002k04033J81722k31343j13053M86522k96062k0828j31136J1392K88494
$$ plain form
13869 926583 1202860 1164514 1217692 925679 1207494 1175451 1246612 1234734 1047122 826127
13859 826127 796124 837889 1320291 818555 1083187 1049442 908253 1346072 834213 1244740
13849 1244740 628976 1065352 1013556 1039948 1131625 1120643 1124001 1163080 1170597 991800 877616
13838 877616 917470 949002 897426 993872 909207 715359 1073597 811898 1012342 666547
13828 666547 803770 921965 921426 787196 565447 777261 993416 937149 848160 848833 658090
13817 658090 745549 750039 1016156 758570 672149 703948 711062 959970 721021 530363 576629
13806 576629 626167 640648 748478 821686 536030 851154 758846 1218364 804285 948002
13796 948002 743969 925691 694348 581295 1067817 771755 750927 619791 631183 919677
13786I19677j63575q8630L79853j55l89875J88978D01216L90084J3040o9279L2438
13775G67499C37032M45041k11587N7264R6896K7705K13374k68390C31830P63055
13765A094885D29734N14845m25069N9684L45364k24410l18707J41164L01674n0519
13755G73760m5316R3634J83745B94700L01031J47998l66649J89609R18j91253
13745C76354K14799l9592k17960K50976M71000l98183k1923j2418k17834k5004
13735C80215P2794j29369K49350J77516B93936J83539R640R7737J933J27259N3985
13724G68029l18688L73951j50517B71800N53340k66508k49927L18524A90066J23502
13714C13568K51576j78562N6789j52076J29969j9315A80606K97593J35803L9282
$$ plain form
13786 919677 756102 667472 1047325 1047170 657295 846273 401216 791300 804340 735061 767499
13775 767499 337032 782073 570486 627750 724646 752351 965725 697335 331830 1094885
13765 1094885 429734 944579 519510 579194 924558 700148 381441 522605 824279 773760
13755 773760 728444 822078 1005823 294700 595731 743729 377080 566689 567607 376354
13745 376354 591153 551561 333601 584577 1055577 657394 635471 623053 405219 380215
13735 380215 453009 323640 572990 750506 293936 477475 487115 584852 586785 714044 768029
13724 768029 449341 823292 672775 271800 825140 558632 308705 627229 190066 313568
13714 313568 565144 386582 443371 291295 421264 401949 180606 478199 614002 653284
13704F53284l1499j7877k04262J10305n7220j10858J90392m6462A66081L55232
13694E21313k33243N83563l64411K85657B53427K53281K20815k96139J91291j18416
13684E04259A64594K50670N1440J90591N8861A08570O44931j78747p4549J40763
13674F40968A14047L67441k8887K20820j99276k23784L4523L12644k9766B60258
13663D13720R8699q3752Q8371A85719L21168K4623L06702l44575m9240j64906
13653B79491N7107J59155j74431p7053K03069k13055R7253R5441G9970P3907N0036
13642B03913J2348J49849j45673K37952J26705r1966A45612K38283J35142J12006
13632F31043k60830L4226j30616R5496K79386j96594j16944k6124J41652N9596
$$ plain form
13704 653284 621785 603908 399646 509951 452731 341873 532265 485803 166081 521313
13694 521313 288070 871633 507222 792879 253427 506708 727523 431384 622675 504259
13684 504259 164594 415264 466704 657295 716156 108570 753501 574754 500205 640968
13674 640968 114047 481488 452601 673421 474145 250361 284884 597528 567762 260258
13663 413720 512419 428667 517038 185719 506887 531510 838212 493637 444397 279491
13653 279491 336598 495753 321322 244269 447338 234283 331536 426977 79970 153877 203913
13642 203913 216261 366110 220437 458389 585094 493128 145612 383895 519037 631043
13632 631043 370213 404439 273823 369319 648705 452111 335167 309043 450695 510291
13622E10291J14258B35324K43487m174j89667J17522a32137C9216K24727J95690
13612D59633j82602K35184A39325K25920p5247R2806k1029D1116L95681j30331
13602C06466A17060K21366R8805P1948J90245D5601N58474j51389k8206A29233
13591B52555K13143A12870J1072O12432C14512m7017J81360L18314l10451H3413
13580D66469A75204J23433K03918B37804O0005j8846o5617K37557k24986R4820
13570C20737n0123K08183k36441a7542G3647M73273B03180L4160K23158j59256
13560C01242F9536J29119J52183A48250R3167J50132R8122j58573q9421J38774
13550C80451J73706r8122J70348B73575G0989M26838N4768j88428r0864J06108
$$ plain form
13622 510291 624549 235324 478811 474637 284970 402492 -132137 39216 263943 459633
13612 459633 277031 512215 139325 365245 289998 382804 361775 41116 436797 306466
13602 306466 117060 338426 437231 509179 699424 45601 604075 452686 424480 129233
13591 252555 465698 112870 123942 736374 314512 267495 448855 767169 456718 83413
13580 466469 175204 298637 502555 237804 297809 278963 213346 450903 225917 320737
13570 320737 270614 478797 242356 -17542 73647 546920 203180 237340 460498 301242
13560 301242 69536 198655 350838 148250 241417 391549 489671 331098 241677 380451
13550 380451 554157 456035 626383 273575 70989 497827 552595 364167 273303 379411
13540C79411k3201F2813J04523a36764E85756B34367K89018j39739j9751l3173
13530C30722m6800K35066j86613d7648D02353n921p9977c0566B31852G9658M91389
13519E71047B65696C6720O24294B32088j3344O757J47728j74166J28632n6322
13509B71373b4025m6079C7769L85404j38559K36688k5187b53533B29877k5232
13499B04645M2677k7371N1243q7442P0746F2519Q4586K29776A15676O7148G8585
13487b8037A26994J51489J42144A35398C5586e6150C05478q2866Q4013L44357
13477F50982B18954A2699J79101K11702j82225J48010F5607A1035R0634i1455
13466A71629K37884D2486L34641A47409p1591K00077O5225N6548h0062C36549
$$ plain form
13540 379411 356210 62813 167336 -136764 585756 234367 523385 383646 363895 330722
13530 330722 283922 518988 332375 -47648 402353 396432 316455 -30566 231852 79658 571047
13519 571047 265696 36720 661014 232088 218744 225501 373229 199063 327695 271373
13509 271373 -24025 -70104 37769 423173 284614 521302 496115 -253533 229877 204645
13499 204645 247322 219951 271194 183752 254498 62519 147105 376881 115676 182824 78585
13487 -28037 126994 278483 420627 135398 35586 -56150 305478 222612 306625 650982
13477 650982 218954 12699 191800 403502 221277 369287 65607 11035 101669 -91455
13466 171629 409513 42486 377127 147409 75818 275895 341120 397668 -80062 336549
13455C57764a2819A98525P9985j11074J26485J14251b9196E67225A91522r4529
13445I6993J93731A12809L01347A49297K27928H1986k269b27753C26535n5022
13435B71513B3591K51514E3359K12266m8036n2663J30063F8787c0859H3356K24367
13424C07723g4425A60361p3896O5798K33114I3834e1182A1300R904J74074K22817
13413D18095c908B51807c9768p4985B91051q0118m9999Q849a64253A34770R5730
13402B30500A3480Q8896J54908n1322q7563a11475A97688M2761E1146K6787K53514
13391C31447j43103q6326m6638M04781g8605B5781d9881B3602J63627p2388J1608
13380A26449J03632n1905K2007B2131P2946j5366L22097m3816p7704H8814L6090
$$ plain form
13455 357764 -12819 198525 278510 167436 293921 408172 -29196 567225 191522 96993
13445 96993 290724 112809 414156 149297 377225 81986 79717 -227753 326535 271513
13435 271513 23591 275105 53359 265625 217589 164926 294989 68787 -30859 83356 307723
13424 307723 -74425 160361 86465 152263 385377 93834 -51182 11300 21204 195278 418095
13413 418095 -3908 251807 -39768 -114753 291051 210933 160934 169783 -164253 134770 230500
13402 230500 13480 102376 257284 205962 118399 -111475 197688 240449 51146 77933 331447
13391 331447 188344 102018 55380 460161 -78605 25781 -49881 23602 187229 114841 126449
13380 126449 230081 178176 200183 22131 95077 79711 401808 357992 280288 88814 124904
13369A24904K80296k01536K67611j51417r8431J93277K5961D658L856L09759l0737
13358B87536K29328A58752N3919k238K31744j38714R8556c6189B29303F9498L5941
13347A05439J664Q718K56301A42761L36291A83269M71124j84309j50611P9681
13337C99154j68568K03313j02536R7577j46605j10622j4998K35139H9098A8431
13326B95400k4711D5028L24636j50916J5667C58M29962n2916a0016B61641Q7939
13315C49580J18367G3259J01221J14237q0562N2433E969M06964F884L67950p3162
13304C01672M9262r1798m3949a70784F4289f7541A29706B9801J3085M1696k6156
13293E8426J07865Q4418a37635B08779p7054F4967B8888a44577E8148M8196a11887
$$ plain form
13369 124904 405200 203664 471275 319858 221427 414704 440665 4658 8514 318273 287536
13358 287536 516864 158752 212671 210433 442177 303463 402019 -36189 229303 69498 105439
13347 105439 107103 115821 372122 142761 479052 183269 654393 470084 319473 399154
13337 399154 230586 433899 331363 428940 282335 171713 156715 391854 89098 18431
13326 295400 270689 45028 369664 218748 234415 358 430320 377404 -10016 261641 349580
13315 349580 467947 73259 174480 288717 208155 260588 5969 412933 6884 374834 301672
13304 301672 350934 259136 215187 -170784 64289 -67541 129706 29801 42886 84582 58426
13293 58426 166291 250709 -137635 208779 131725 64967 28888 -144577 58148 106344 -111887
13281H6551J53858K0697f2391k9046A89653k312j2804D4578Q998c78843B49552
13269A14175h6396F4782L181a87783B6684J48941a14256B62419a65054B34656
13258C04451c08994A40909O7433J85061A38864a72863C14614g2795C07647e5694
13247e095A10411e7587j97080f5982B04244N9362j15341Q5472g5665C77656r8278
13236B79378B4987J03548m8778a97824A15889E825a1694A08845L05168a41717
13225F7355J0215J15666c9602B8451N0856d5388A5506J00782O6590m3837i5602
13213c34373c7810B60117A10989g5628C68425b2354B57833b7373C9688L83917
13203D23605F2460a53794j61991B14892a55356M7487B87315J67150f1136l092
$$ plain form
13281 86551 240409 261106 -62391 -91437 189653 187341 174537 44578 53576 -378843 249552
13269 114175 -86396 64782 67963 -187783 26684 175625 -114256 262419 -165054 234656
13258 304451 -308994 140909 208342 393403 138864 -172863 314614 -72795 307647 -55694
13247 -5095 110411 -57587 -254667 -65982 204244 263606 148265 233737 -75665 377656 279378
13236 279378 24987 128535 79757 -197824 115889 5825 -11694 108845 414013 -141717
13225 67355 77570 193236 -39602 28451 79307 -45388 15506 116288 182878 139041 -95602
13213 -334373 -37810 260117 110989 -75628 368425 -22354 257833 -27373 39688 423605
13203 423605 62460 -153794 -315785 214892 -155356 -107869 287315 454465 -61136 -64228
13193f4228G749K76504a00911j07554E8195J70171i8369C1435K31815i761G3531
13181F7576M6789A4777P5047J01194G5369i9360A37738J17285J30023b32388A96434
13169A63383g1122B60519A5011M10821F8267a14848A11765a4318H656J37761j4030
13158A32387a34041B49467a06753G8809f946l5672A88523J6753C2072K27883a00222
13146c5042m5462H0080a25699A14693M8341m6708m0092J75514J56905b50844I3218
13134A11901n0867b20888A05936a60944B57772A1656P0650d9981I3752b54864
13123a78400H1995J95848j21343a0095A04478j0673h5516r9324A2494a62802C82009
13111C0903e2300B80870F1567a12267m395C6598J46444a76249K8211m6099A71105
$$ plain form
13193 -64228 7749 284253 -100911 -208465 58195 228366 -98369 31435 263250 -9761 73531
13181 67576 114365 14777 89824 191018 75369 -99360 137738 255023 385046 -232388 196434
13169 163383 -71122 260519 15011 425832 68267 -114848 111765 -14318 8656 146417 132387
13158 132387 -134041 249467 -106753 78809 -6946 -42618 188523 205276 32072 259955 -100222
13146 -35042 -80504 80080 -125699 114693 163034 116326 76234 251748 408653 -250844 93218
13134 111901 61034 -220888 105936 -160944 257772 11656 82306 -49981 93752 -254864
13123 -178400 81995 277843 156500 -10095 104478 93805 -85516 -184840 12494 -162802 382009
13111 30903 -52300 280870 61567 -112267 -116662 36598 183042 -176249 -148038 -194137 171105
13099G1253O980b36232a14012e3958k27653J17338K1103D28057C3849N0033i7158
13087a9243k17265J06843E1297M3987R0385o2878B4816R5269c03774a49041B07196
13075b4314j56049J7440j0461E940a98091H8140a5008q8271B81819E6136J63309
13064B19445a77485a0183A94139a8249k02716b5237k76970H6853d8337B60026
13053B86478L4980c6307C37015b31101I6917d8291n5753B30149a96239d4885k7792
13042g2677n2914B74978m5797L4226q4312J02489b2894k7397m9022I5092a76638
13030E6432O433f872A61313B574J5195b29247A60807E2952L50251a00993B80041
13018C7074J00221c0824A40841J30892A26401P1536c172j01994B1738J02866a57721
$$ plain form
13099 71253 78233 -236232 -114012 -53958 -281611 -164273 -143170 428057 33849 83882 -97158
13087 -19243 -236508 -129665 51297 95284 185669 122791 24816 120085 -303774 -149041 207196
13075 -24314 -180363 -162923 -173384 5940 -198091 88140 -15008 -103279 281819 56136 219445
13064 219445 -177485 -10183 194139 -18249 -220965 -25237 -302207 86853 -48337 260026
13053 286478 321458 -36307 337015 -231101 96917 -48291 -104044 230149 -196239 -44885 -72677
13042 -72677 -125591 274978 229181 263407 179095 281584 -22894 -50291 -99313 95092 -176638
13030 56432 62865 -6872 161313 2574 17769 -229247 160807 52952 403203 -100993 280041
13018 37074 137295 -30824 140841 271733 126401 197937 -3172 -105166 21738 124604 -157721
13006A739J18692f0324E1352b007m990B07469a1202A40R1027b95760f2983A30176
12993B75659G4108L7327Q6258e4499j8325C9410J96313d3477A54535J38827A35398
12981F5269h09n9833A8026J19996i6245H1550a42418C87306A88885g5799j21082
12970a96881A34103Q3833d5243C53376A02949a68255F4419F774O2330L9868a46296
12958a78646D0758K36562p729e89309A34177l6265b21103O6796C9214R8230f4823
12946e5960D23122G3259f03623a20702a6500j4242m2224B96818g2842L2018D5094
12934a93391f2855l53471A23258J15316a32666A42572k7179E0416J1501c16549
12923I1232h0184a8587q3392B92867a15989H8212a84274b9826G8969B0321K09959
$$ plain form
13006 1739 120431 -60324 51352 -2007 -6997 207469 -11202 140 91167 -295760 -62983 130176
12993 275659 74108 111435 197693 -54499 -72824 39410 235723 -43477 154535 293362 135398
12981 65269 -809 -60642 18026 138022 -96245 81550 -142418 387306 188885 -75799 -196881
12970 -196881 134103 217936 -45243 353376 102949 -168255 64419 6774 69104 108972 -146296
12958 -178646 40758 277320 269591 -589309 134177 97912 -221103 -154307 39214 137444 -64823
12946 -55960 423122 73259 -603623 -120702 -16500 -30742 -72966 296818 -72842 -40824 45094
12934 -193391 -62855 -416326 123258 238574 -132666 142572 115393 50416 61917 -316549
12923 91232 -80184 -18587 -101979 292867 -115989 88212 -184274 -29826 78969 20321 230280
12912B30280a32160m07319f3749C10970J01375j53626E5727k236J30821c840E4151
12900a83717h0817j76911D4635j7382K05806N7158e4971F0948N2236a14206B28694
12888f116A61221J32295C8574K6553b02928A71932j4107g9891b8511q9648q0252
12877a98411j2736B1229J69131b90977b4312j2625D05844H9164j7203c7778B9094
12865H8943d10213A20573a0736m8667B07726d465k12971C7650j2183J28493c9210
12853a4687C17172a9713D77930B6481a06290j33024B3265K07679F433P3286k3724
12842E5995a22144p52k5711I2031m4052K55588c8878j00380j22775A60004b69258
12830B8868K03776a11164k20145A28556A6599J44769P0395a93655l1095g5502
$$ plain form
12912 230280 -132160 -539479 -63749 310970 412345 258719 55727 53491 184312 -3840 54151
12900 -183717 -80817 -257728 44635 27253 233059 290217 -54971 60948 113184 -114206 228694
12888 -6116 161221 293516 38574 65127 -202928 171932 157825 -79891 -28511 -118159 -198411
12877 -198411 -211147 21229 190360 -290977 -24312 -36937 405844 89164 71961 -37778 29094
12865 88943 -410213 120573 -10736 -59403 207726 -4465 -217436 37650 25467 153960 -39210
12853 -14687 317172 -19713 477930 26481 -106290 -239314 23265 230944 6433 79719 55995
12842 55995 -122144 -122896 -148607 92031 47979 303567 -38878 -139258 -262033 160004 -269258
12830 28868 232644 -111164 -331309 128556 16599 161368 231763 -193655 -224750 -75502
12819F9595R8676k9560j6368J57588k8245b52626k27202A9809e5354d587A8794
12807b18325k6467h9384A35838d6759B13316c3728A27100a70696k62502i719n8801
12796f8520G8347K1830d4726j20793L2097m7503b0557A60316a88310r9738h1011
12784a98978B55808b15966L2113Q8453M6124p8440l787l3841N2247A33314b74657
12772h3902l7991F04a6973k8595C8871L2311b52518A94528m4078a71798P121N3353
12760a11324B77877f3285B17121J27651b81163A7105b09401R3299r6948j24232
12750c37282R5846E5521a29691I9156P9925a40834j05263A17629b50144a00130
12739H6433a05503B86413H7998a0561A26146a64208D9731e168k60958G4619J17334
$$ plain form
12819 69595 168271 138711 122343 279931 251686 -252626 -479828 19809 -55354 -4587 18794
12807 -218325 -244792 -89384 135838 -46759 213316 -33728 127100 -170696 -433198 -9719 -68520
12796 -68520 78347 100177 -44726 -165519 -133422 -180925 -20557 160316 -188310 -288048 -81011
12784 -198978 255808 -215966 -183853 -95400 -49276 -127716 -131503 -165344 -113097 133314 -274657
12772 -83902 -121893 604 -16973 -45568 38871 71182 -252518 194528 150450 -171798 -164677 -111324
12760 -111324 277877 -63285 217121 344772 -281163 17105 -209401 -116102 -213050 -337282
12750 -337282 -241436 55521 -129691 99156 179081 -140834 -246097 117629 -250144 -100130
12739 86433 -105503 286413 87998 -10561 126146 -164208 49731 -5168 -266126 74619 191953
12728A91953d1376I8487a64893l826r0649J23541B57319b48475P0585B54401a17164
12716D08714B3011H954P3924a25492A48702f0555C01204j50562g9565A52083K24408
12705C76491I4518M1710C8382a52299B4505N7201K10062n7677L4624C121i491
12693b74032a00453j05550d3903G4534Q6663i3420D6192e7468G0846K01786b38320
12681B43516n7999g9534Q501m4749A21239a22547d9887J1960j69237L2494C3490
12669a54124B46261A8798g3661j20967A99168a85610b0796B4975Q2043J23010
12659B30028b8556H2378a47448b0819D20634j78242G198f1809m26j1490C21052
12647A80165h0760I4942J48729L3117a5143k0966k8166j49178J03295k6996B05159
$$ plain form
12728 191953 -41376 98487 -164893 -168719 -259368 -135827 257319 -248475 -177890 254401 -117164
12716 408714 23011 8954 82878 -125492 148702 -60555 301204 150642 -79565 152083 376491
12705 376491 94518 136228 38382 -152299 24505 81706 291768 234091 268715 3121 -9491
12693 -274032 -100453 -206003 -43903 74534 161197 -93420 46192 -57468 70846 272632 -238320
12681 243516 185517 -79534 -71033 -115782 121239 -122547 -49887 -37927 -207164 -174670 33490
12669 -154124 246261 18798 -73661 -194628 199168 -185610 -20796 24975 107018 230028
12659 230028 -28556 82378 -147448 -20819 420634 242392 7198 -61809 -62235 -73725 321052
12647 180165 -80760 94942 243671 276788 -15143 -36109 -64275 -213453 -110158 -137154 205159
12635a51103A38148d3810j12331A04857J33905C8457p984K88300A36283C833f978
12623A08716L9046l9430a94569H4032L6486b1495j74829C6480b8901j50198A00541
12611C338R8090j7430a93862A69388b97777F9475P3475M5130P0554n4366H4304
12599a3267C32286I1985a36324g263H09J20489E544J73225a35785j07411H9242
12587d31988I0808a50282B93071j30201b00466f7568K7447G8930B7822A1414J1963
12576B3377b90478J31449B5327c72270A78955c5117A21536J79226Q8818j36809
12566B52771C1865J89183c9656A85590b1294m17096a11871B53850b46851E3719
12555B40690i2642A04178a26732p8470b4830j14451A71005c84891A83276m9496
$$ plain form
12635 -151103 138148 -43810 -156141 104857 238762 38457 30473 318773 136283 3833 -6978
12623 108716 147762 108332 -194569 84032 120518 -21495 -196324 36480 -28901 -179099 100541
12611 3338 101428 83998 -193862 169388 -297777 69475 142950 188080 258634 204268 84304
12599 -13267 332286 91985 -136324 -7263 809 121298 5544 178769 -135785 -243196 89242
12587 -431988 90808 -150282 293071 162870 -200466 -67568 -40121 78930 27822 11414 23377
12576 23377 -290478 -159029 25327 -372270 178955 -35117 121536 300762 389580 252771
12566 252771 31865 221048 -39656 185590 -21294 -438390 -111871 253850 -246851 53719
12555 240690 -92642 104178 -126732 -205202 -24830 -139281 171005 -384891 183276 133780
12545A33780c7527A52564J07289g1900j03342k86769K18782a1787j78796A09179
12534A35812B1700c05501J04151G2466c01248j12016A20262a41070j61995b9603
12523A48441a79282I9314B9358G777g0187A88339I0849e7423B30798j6235H9720
12511A16362d8869J9412A11127J41585q8171f4271B61225m4299G6487a34033E9203
12499H8552a79354r3478b951k34779A8385K43438c41221H6875d5610j70693c7231
12487c4607B58493J6407j4445p5180c1068C24300a74874E1869a0306B21654I9947
12475B19965I0585j9950M9019N9660a50469D5324K34901h9091B05845H3855a49647
12463A89071G7232c500r3052A63627D7163J2242k5671c1615m9628A59732k0889
$$ plain form
12545 133780 -37527 152564 259853 -71900 -175242 -462011 -243229 -11787 -190583 109179
12534 135812 21700 -305501 -201350 72466 -301248 -413264 120262 -141070 -303065 -29603
12523 148441 -179282 99314 29358 7777 -70187 188339 90849 -57423 230798 214563 89720
12511 116362 -48869 -29457 111127 252712 164541 -64271 261225 216926 76487 -134033 59203
12499 88552 -179354 -272832 -2951 -237730 18385 261823 -341221 86875 -45610 -216303 -37231
12487 -34607 258493 274900 260455 185275 -31068 324300 -174874 51869 -10306 221654 99947
12475 219965 90585 70635 119654 179314 -150469 45324 280225 -89091 205845 83855 -149647
12463 189071 77232 -3500 -96552 163627 47163 59405 33734 -31615 -81243 159732 138843
12452A38843J73927A1826g7143D39940j70989n8460H2648K23718j39787E8229
12441i5612L1995A85460b7588A61345j2483i3444B2591a68242N9192M4224b2040
12429A05585k7650K26629a47510B8544e1825j53945A05452i0681j3264b2301j2928
12418c5229m6213E0977h365o4898K2683K1566q1293K6912C7254b1694A43785c7058
12405B09715B3078a00286K9j65816B2293c83322G8914o633J67384H1202j9955
12394F1247K48495n2252A10681K19121j24429p7006J04071A06427J34456k6620
12384B14263H4673A7745K08927C8527c938A88794K8480a05506M5706B72320J36550
12373D08870j30336a29826M7704j39696k6495B4631b4216j89867A5777b61117
$$ plain form
12452 138843 312770 11826 -77143 439940 268951 210491 82648 306366 166579 58229
12441 -95612 -63617 185460 -27588 161345 148862 -93444 22591 -168242 -109050 -64826 -22040
12429 105585 77935 304564 -147510 28544 -51825 -205770 105452 -90681 -103945 -22301 -35229
12418 -35229 -81442 50977 -8365 -73263 -50580 -29014 -110307 -83395 37254 -21694 143785 -37058
12405 209715 23078 -100286 -100257 -266073 22293 -383322 78914 72281 239665 81202 61247
12394 61247 309742 257490 110681 329802 205373 128367 232438 106427 240883 214263
12384 214263 84673 17745 226672 38527 -3938 188794 217274 -105506 -59800 272320 408870
12373 408870 278534 -129826 -82122 -221818 -248313 24631 -24216 -214083 15777 -261117
12362A63555f9276E1185a04485o2835e9918k09862h1295p7609B7783J5458J77825
12351B21066a51210A67110b19865B01509I6069h196q4570B37558I9912a17926
12340B61683h173B19493q2724J2359K86643A37864b2457A34218e2221E7542K49702
12329C07244Q9677i4452A41330D85J50615J55606N3160r2632O6421j50838K22721
12318D05538A31050l4618J15172A6620Q9144L5847l1413n0157J8551J80625b9292
12306h490A62177d9245B78980A36397N5994F0911a97016L9204C68579c5860D24174
12294a57897A5604a28243B01304C4674j0659a61639A09438K0870a65300A14700
12283A03326K4796N9120F2942K0453j3285p787b7100C07288k2204E4823J33862
$$ plain form
12362 163555 -69276 51185 -104485 -167320 -59918 -269780 -81295 -158904 27783 43241 221066
12351 221066 -151210 167110 -219865 201509 96069 -8196 -92766 237558 99912 -117926
12340 261683 -8173 219493 136769 149128 435771 137864 -22457 134218 -52221 57542 307244
12329 307244 396921 -94452 141330 485 151100 306706 359866 267234 333655 182817 405538
12318 405538 131050 96432 211604 16620 105764 141611 110198 60041 78592 259217 -29292
12306 -8490 162177 -49245 278980 136397 192391 60911 -197016 -157812 368579 -35860 424174
12294 -157897 15604 -128243 201304 34674 24015 -161639 109438 130308 -165300 114700
12283 103326 128122 187242 62942 83395 70110 62323 -27100 307288 285084 54823 188685
12272A88685K38854A20239e9660A02883J00336b6671C04552p6560e1910N07D38322
12260C35001j64142j6125f0137A22232i6692k3913l4824C12219D8376b3768C11134
12248d5800B44947p9107G4718A2259a79066C89901j94928N585o1935c0281A82540
12236G055M41599k00863J01946m9026n0215B3793a34456B05961n2498L3744Q0683
12225B67890B6288K32882D5889L05469a86173A53048J35233o7768P1016A34655
12214C54367o0190j12373J17077A05704P3956l5869i009B79533b4085j6778A37960
12202B44888c32143E1627c9199B96222D3131M4154L03263j53049H3343a00998
12191h615A36613P1039d6462E08069j57495O6110j73620Q0367R751q9172a06786
$$ plain form
12272 188685 427539 120239 -59660 102883 203219 -26671 304552 227992 -51910 -51403 438322
12260 335001 170859 154734 -60137 122232 -96692 -120605 -155429 312219 48376 -23768 311134
12248 -45800 244947 165840 74718 12259 -179066 389901 194973 200558 138623 -30281 182540
12236 7055 448654 247791 349737 300711 250496 23793 -134456 205961 153463 187207 267890
12225 267890 26288 259170 45889 351358 -186173 153048 288281 220513 291529 134655
12214 354367 294177 181804 298881 105704 179660 143791 -9009 279533 -24085 -40863 137960
12202 244888 -332143 51627 -39199 296222 43131 87285 390548 237499 83343 -100998
12191 -8615 136613 207652 -46462 508069 350574 416684 243064 323431 333182 244010 -106786
12179B60374K03351j98551h4450A28797g9862J9759A33210e2270C63908A30428
12168A87259Q9047d7283E42894i7911C56405P4668j17159Q6246p8207q6989R8007
12157C32971j55066K45632d4125G8720a22498N8817E5159J43805F9013d858q9855
12146i4713C33907c83C4627a50368B65923G3278L7396j9178b55096A95000l3577
12135A61423K1419i980C44068q8109B5898K33118K8457R8430j53885r7676b5187
12123I4037c6140A22715K8429m3057L08416A60073J90693A21531J18838b37781
12112I4094D6895K5472K64760B3274R9086M51459A37714B8454f3059A55711a18440
12100B87464j8469i2706A3513e65839a07544B05254q1650O1619F3101J14083K85724
$$ plain form
12179 260374 463725 265174 -84450 128797 -79862 -60103 133210 -52270 363908 130428
12168 187259 276306 -47283 542894 -97911 356405 431073 313914 400160 321953 234964 332971
12157 332971 177905 423537 -44125 78720 -122498 -63681 55159 198964 69013 -4858 -94713
12146 -94713 333907 -383 34627 -150368 265923 73278 110674 91496 -255096 195000 161423
12135 161423 182842 -9980 344068 255959 25898 259016 287473 385903 232018 134342 -25187
12123 94037 -36140 122715 151144 108087 416503 160073 350766 121531 240369 -237781
12112 94094 46895 72367 337127 23274 122360 573819 137714 28454 -63059 155711 -118440
12100 287464 268995 -92706 13513 -565839 -107544 205254 123604 185223 63101 177184 462908
12089D62908H8893J10496J04469A33826M6005L2513P1819L2438j0732C0048L46749
12078C76797A135O2218P0594k6201J22553M9799C5417L46516K8574F6162g7424
12066c5992F9005h9537C2672a00241c8383B1452J49896d157F6233J5684h2058
12054a21148e5298J6847l4831A08580a44110A08a161k37530a7963k29352H9569
12042a11241a5113b592C7040c6116j20394A58498P5813P5325q0765E2738e5966
12030a45141r0853K3830A66843C3586h3403j6282B77862A17783R134K07218j50296
12019A83839F1721a0614k7426r3922A39262a9897D13982A31599f6221J2821A53817
12007C13962b4780A14073a36810L4989B19715p6543B7855d3966k90361h8209B55982
$$ plain form
12089 462908 88893 199389 303858 133826 179831 212344 284163 316601 305869 30048 376797
12078 376797 1135 63353 133947 107746 230299 280098 35417 381933 410507 66162 -77424
12066 -35992 69005 -89537 32672 -100241 -38383 21452 171348 -4157 66233 81917 -82058
12054 -121148 -55298 -38451 -73282 108580 -144110 108 -1161 -238691 -17963 -247315 89569
12042 -111241 -15113 -2592 37040 -36116 -156510 158498 234311 309636 228871 52738 -55966
12030 -145141 -235994 -212164 166843 33586 -83403 -99685 277862 117783 126917 334135 183839
12019 183839 61721 -10614 -38040 -131962 139262 -19897 413982 131599 -66221 -53400 153817
12007 313962 -24780 114073 -136810 -101821 219715 143172 27855 -43966 -334327 -88209 255982
11995A6317c8955j44595J4085g9935Q03b9486l5274m9131l4348C5043J07238b8257
11982f5747a2043A27595n1712M6523a75833B9083J18069a14197A15086b06145
11971a65602f9411C9045J85445d97833e4560C9393a83520C7538K2512e9088C791
11959A10615h4394E1142c53736C12464j47766a46040k27902h420G4738g8188A00014
11947d4113k9014G6848h2968F1925A6161m91a82841j5985A61079b01258J00180
11936a01078l969p4796g5914K5193A45352c49091B28084h4463j35598p6198a34640
11924a25647K0274L9455j33433F0752b52781e7402j00642j47779D8680K27225
11914B75905A37261L7423a70404b5979j26597q4094a13306A27600b14243A36689
$$ plain form
11995 16317 -38955 -183550 -169465 -79935 -79132 -29486 -64760 -113891 -148239 35043 142281 -28257
11982 -65747 -12043 127595 75883 122406 -175833 29083 147152 -114197 115086 -206145
11971 -165602 -69411 39045 224490 -497833 -54560 39393 -183520 37538 60050 -59088 3791
11959 110615 -84394 51142 -353736 312464 164698 -146040 -373942 -8420 74738 -78188 100014
11947 -44113 -73127 76848 -82968 61925 16161 15670 -182841 -198826 161079 -201258 -101078
11936 -101078 -105047 -179843 -75914 -50721 145352 -349091 228084 -84463 -220061 -296259 -134640
11924 -125647 -105373 -65918 -199351 60752 -252781 -57402 -158044 -305823 48680 275905
11914 275905 137261 174684 -170404 -25979 -152576 -236670 -113306 127600 -214243 136689
11903B0450K51669B7935e4639j27801k3441j87538R1280a4813A13278c19414a22540
11891a11222l16446N3218j526D51474a30032F3376K2806i2197l4007k1584c7901
11879F2542g4614m964C00931b33494l8797e6896k06568a22042A191a55109p0516
11868b25625R9589k6202b6193o9335b9065j7619k48873A17650a05572C76206a93196
11856b03159C7405N4946b37304L4990P1246A59965a81797q6124C8708a50775q1598
11845b32373A1362a81128f2185A66962D6792J4437h9681E5146h4514I4339j5084
11834G9255a83395j32431M0230N4686e0725A3456c81570a00903b262A32059b1868
11822H6062g8152l20595a18190m4550M6928M0418G606a72421A83020b7998a156
$$ plain form
11903 20450 272119 27935 -54639 -182440 -205881 -393419 -302139 -14813 113278 -319414 -122540
11891 -111222 -427668 -374450 -375976 451474 -130032 63376 86182 -92197 -126204 -147788 -37901
11879 62542 -74614 -79578 300931 -233494 -272291 -56896 -263464 -122042 1191 -155109 -225625
11868 -225625 -126036 -152238 -26193 -95528 -29065 -46684 -295557 117650 -105572 376206 -193196
11856 -203159 37405 92351 -237304 -202314 -131068 159965 -181797 -267921 38708 -150775 -232373
11845 -232373 11362 -181128 -62185 166962 46792 61229 -89681 55146 -84514 94339 79255
11834 79255 -183395 -315826 -275596 -220910 -50725 13456 -381570 -100903 -2262 132059 -21868
11822 86062 -78152 -398747 -118190 -162740 -115812 -75394 7606 -172421 183020 -27998 -1156
11810G2041N7002r858b28692N6305M6964b9283F153R8184a04770F185i3737E101
11797a97116A12461f3692H4877L119J1973a22999C11643I4369i5566B4113L3091
11786E7204a28934B18683c76521a604k72260N2715a03217l1048E7211b563p3522
11775g6085G7525a96158f3748B33072h8329A24059a65604m1865R9538c9708p5005
11764a14713E9149h7499B74631B711c27506a46181D209b10444j16237B0926b0603
11752a50459N9723F8923i0285k45869I2965J23677j03086i4139L8694A1542c78794
11740B4725a96154C5756b39796e4059j72154D06855a83069B46265a68645A46754
11729c3287N518j73210k21982a77842j02587C0497a57134j40705a17421E3981
$$ plain form
11810 72041 129043 119185 -228692 -172387 -125423 -29283 6153 104337 -104770 6185 -93737 5101
11797 -197116 112461 -63692 84877 87996 99969 -122999 311643 94369 -95566 24113 57204
11786 57204 -128934 218683 -376521 -1604 -273864 -221149 -103217 -134265 57211 -2563 -76085
11775 -76085 77525 -196158 -63748 233072 -88329 124059 -165604 -207469 -107931 -39708 -114713
11764 -114713 59149 -87499 274631 2711 -327506 -146181 4209 -210444 -326681 20926 -20603
11752 -150459 -90736 68923 -90285 -336154 92965 216642 113556 -94139 -55445 11542 -378794
11740 24725 -196154 35756 -239796 -54059 -226213 406855 -183069 246265 -168645 146754
11729 -33287 -27769 -200979 -422961 -177842 -280429 30497 -157134 -297839 -117421 53981
11718A43877b02690i7900k36077a52683k5533E8297H067J49564a22491j66231
11708b88722J5803J23027d5856C116d8127r8233c1359j73286i1818l608A85667
11696A77126a81834c1047q6920m1786B22020c7256A81498b58025J08874B15824
11685c02596B62534a28827k03506J49020A25499b5815A03538b55419a123k3115
11675b4238A25615J11028G9697a72087k60855A35382a20838j10688A40347b42475
11664a91600C7908E652b48660c3708q0928B72825q4782e2526A37153b95415g4154
11652I336b37471O6149k6872Q1076J5409L9092A75145a51452P3464A98903J6339
11641B15242b15991Q9058j57660c6278A07933b18893O9244E8866b52741b7513
$$ plain form
11718 143877 -202690 -97900 -333977 -152683 -178216 58297 8067 157631 -122491 -288722
11708 -288722 -272919 -149892 -45856 3116 -48127 -146360 -31359 -204645 -91818 -95426 185667
11696 177126 -181834 -31047 -117967 -159753 222020 -37256 181498 -258025 -149151 215824
11685 -302596 262534 -128827 -332333 -183313 125499 -25815 103538 -255419 -1123 -24238
11675 -24238 125615 236643 79697 -172087 -432942 135382 -120838 -231526 140347 -242475
11664 -191600 37908 5652 -248660 -33708 -114636 272825 188043 -52526 137153 -295415 -74154
11652 9336 -237471 -171322 -198194 -117118 -101709 -62617 175145 -151452 -77988 198903 215242
11641 215242 -215991 -126933 -284593 -36278 107933 -218893 -149649 58866 -252741 -27513
11630B29375b15655D3244b76374B25060D9014i1120b8956l97984B24850B4497
11619a15634L9374b5060A35644B0775J73700b42993M0199j57850j3608r921A16506
11607B41655a49847b9698A77759c29780g3994k47934r482I4203a95847l6207A45762
11595A40023J3104e4048l7438B7540b26154F2913i2642L1764o6601A32199b4989
11583a67387I3226J1062J15608c11682i7452k08318A7209b54916d9817K307q484
11572e5994j67892N5445D1337O8096J137b48897a23028b0846C27267c9446n5605
11561i5051D1037L06578a97048A03305b95264B8983b02141F1860c31151I0011
11550A12945B6109a478r0890I5586M2439J91038f4031B8418J62113b59923A6460
$$ plain form
11630 229375 -215655 43244 -276374 225060 49014 -91120 -28956 -426940 224850 24497
11619 -115634 -76260 -25060 135644 20775 194475 -242993 -202794 -360644 -374252 -384173 116506
11607 241655 -149847 -29698 177759 -329780 -73994 -321928 -331410 94203 -195847 -232054 145762
11595 140023 153127 -54048 -91486 27540 -226154 62913 -92642 -60878 -127479 132199 -24989
11583 -167387 93226 104288 219896 -311682 -97452 -305770 17209 -254916 -49817 -47510 -55994
11572 -55994 -223886 -168441 41337 109433 110570 -248897 -123028 -20846 327267 -39446 -95051
11561 -95051 41037 347615 -197048 103305 -295264 28983 -202141 61860 -331151 90011
11550 112945 26109 -1478 -92368 95586 138025 329063 -64031 28418 190531 -259923 16460
11538F9094J84047j20923m4570C3268a9109B84008a64170B60485j9911p5406M5480
11527B10648F003a65626P8389B95393A25797b266A37504E7267g8321E8147a16685
11515B40170a6516B97532a19091N1130q1266G4783l4463e7127j16078F4560B3086
11503a22335L2964B09981H0324O7749a48541p9224l782b9008B7388P7830h0410
11491D3944a60518A28010c41251E7720O455J56760g4024K2544o3055A77821q4787
11480I3034h2564H9317B9346M1208A4122K27988G7746d4280k31117D13768B1401
11468B33904I5554A9895J54714o2914J38647J03811B2835j843L7756b267C80063
11456H5799J61968L2678e7847B08246q7244K152a966j81048D53037a30705A70371
$$ plain form
11538 69094 253141 132218 87648 33268 -19109 284008 -164170 260485 240574 165168 210648
11527 210648 6003 -165626 -87237 295393 125797 -2266 137504 57267 -78321 58147 -116685
11515 240170 -16516 297532 -119091 -67961 -149227 74783 40320 -57127 -173205 64560 23086
11503 -122335 -89371 209981 80324 148073 -148541 -227765 -231547 -29008 27388 105218 -80410
11491 43944 -160518 128010 -341251 57720 64175 220935 -74024 -51480 -114535 177821 93034
11480 93034 -82564 89317 29346 70554 14122 242110 77746 -44280 -275397 413768 21401
11468 233904 95554 19895 174609 111695 250342 354153 22835 20992 58748 -2267 380063
11456 85799 247767 280445 -57847 208246 121002 123154 -1966 -183014 453037 -130705 170371
11444d38799A58544b82259D8138k0902J46701C8740b7339r6487k8487q8340B69338
11432I691J40313N538Q9623M4830A10780J30185I0728J18351P1332F30g0327A62846
11419A24428a3520A6166h2497l6906j70229B40064b69142B5727a10292C02699
11408a8349q1915A31466D4592c7284k56270H9912M93d1449J3604k0826j46042
11397a94713G367b99039a40669j8040g2519B6269R5494a23416A23330B2746a08885
11385F396b29285A22063a87161F5272K79104j49885F3267a20589J9997j71615
11375b72207J31881o4292C17865a69988O7672j16458j18332b0713H098a01610
11364a6826F2845a00936j0982j31660Q2410D3184d9497m298b1091G1664f2613
$$ plain form
11444 -438799 158544 -282259 48138 27236 173937 38740 -27339 -123826 -152313 -240653 269338
11432 9691 150004 155542 245165 289995 110780 240965 90728 209079 280411 630 -70327 162846
11419 124428 -13520 16166 -82497 -119403 -289632 240064 -269142 25727 -110292 302699
11408 -18349 -100264 131466 44592 -37284 -293554 89912 90405 -41449 -27845 -48671 -194713
11397 -194713 7367 -299039 -140669 -158709 -72519 26269 121763 -123416 123330 22746 -108885
11385 6396 -229285 122063 -187161 65272 344376 194491 63267 -120589 -100592 -272207
11375 -272207 -140326 -204618 317865 -169988 -102316 -218774 -337106 -20713 8098 -101610
11364 -16826 62845 -100936 -111918 -243578 -161168 43184 -49497 -53795 -21091 71664 -62613
11352a62658J5949M8120B4233J71091b76809M8107j4009D23566a36854j8015l4559
11341a89428G3382b22906J07069A97362a67191A62533L4505D0691a09846A29352
11330b4624K830m0229A36241c9027J3463j4918m91k04557h2422b6208D12867b62571
11317a1282E3152i3887a5323B6800R4449d42892J33671F7135d10550g1683A17
11305C36475d9466r4754c055A092K613a47700l4686A72644A0334a22204k53503
11294c75707C6120b69876H2971M0332F778b17566R5396c6304j38579c3437k8505
11283f1942J7770k25924a17545c4427n8223j8328A34290c48786j3527a08589B1777
11271a46229q5876O2192H9829M5729c25850B99896c74109G709J85078H2756K05066
$$ plain form
11352 -162658 -146709 -98589 24233 195324 -276809 -228702 -242711 423566 -136854 -154869 -189428
11341 -189428 73382 -222906 -115837 197362 -167191 162533 197038 40691 -109846 129352
11330 -24624 -21794 -62023 136241 -39027 -25564 -40482 -40973 -245530 -82422 -26208 412867 -262571
11317 -11282 53152 -93887 -15323 26800 121249 -442892 -309221 67135 -410550 -71683 117
11305 336475 -49466 -144220 -3055 1092 3705 -147700 -182386 172644 10334 -122204 -375707
11294 -375707 36120 -269876 82971 123303 6778 -217566 -122170 -36304 -174883 -33437 -61942
11283 -61942 -44172 -270096 -117545 -34427 -92650 -110978 134290 -348786 -362313 -108589 21777
11271 -146229 -232105 -169913 89829 135558 -325850 299896 -374109 7709 192787 82756 287822
11260B87822a61993D4165E688a97832A67879i8320j30518a8440l6045r7731P925
11249a44291A07379f7073j51166e7099A96934i8802j41534a04720A7995a8968
11238C3408i9278a5017o6602F6036c2486l4447E6187j1765c1428k06081b8622
11226a90195Q8470p9498g2058k449C2312g6946H7498b09192H1449C464b5445m65629
11214d91074A36419C069L0886a46642b5757l27135C33980A30737a86775b2820
11203a91591Q1791l77251E940c16094L6454J39390b0567m3050A57646b46466e2540
11191a43038D5170N4314a25188K2814M1305A8320a82439h1953C4070N4717e5091
11179g1020r3807N8324p28j6463L3988L2365l73109f221l72654P5210f6385E1122
$$ plain form
11260 287822 -161993 44165 5688 -197832 167879 -98320 -228838 -18440 -54485 -152216 -144291
11249 -144291 107379 -67073 -218239 -57099 196934 -98802 -240336 -104720 17995 -18968
11238 33408 -99278 -15017 -81619 66036 -32486 -66933 56187 44422 -31428 -237509 -28622
11226 -190195 -101725 -181223 -72058 -74507 32312 -76946 87498 -209192 81449 3464 -25445 -491074
11214 -491074 136419 3069 33955 -146642 -25757 -352892 333980 130737 -186775 -22820
11203 -191591 -109800 -487051 5940 -316094 -279640 -140250 -20567 -63617 157646 -246466 -52540
11191 -143038 45170 99484 -125188 -102374 -61069 18320 -182439 -81953 34070 88787 -55091
11179 -71020 -164827 -106503 -107231 -123694 -89706 -57341 -430450 -6221 -378875 -303665 -66385 51122
11166f7488D8142d8399k86976a53895I7642e4036C69701F7427J7543h1678j4432
11155i6110a2007C8334J27667Q9783F6546C0101a06349k18649l4688a22016r9582
11144b21598J5682A14574J85955f4385j67438g0513j3460A32886a19996k46361
11134c66357A49462K08293j59011J9406C2480N8d8590A7571b4507A8245b65481
11122A73103a53114H1348M9934J96735j32896J67069B9750J09983C0503b01759
11111G663a47338B53097J11264b9633C3327P8504C930f3138j16722g0145A39395
11099G5798k0638L05759g5914q656C18344j54084l2560J9478l2335Q6741f291
11087a06957b9124B93767A29954k011k0179J01440Q1635Q0867M07524B49657j6088
$$ plain form
11166 -67488 48142 -48399 -335375 -153895 97642 -54036 369701 67427 84970 -81678 -96110
11155 -96110 -12007 38334 166001 255784 66546 30101 -106349 -324998 -359686 -122016 -221598
11144 -221598 -205916 114574 300529 -64385 -231823 -70513 -83973 132886 -119996 -366357
11134 -366357 149462 357755 198744 218150 32480 32538 -48590 17571 -24507 18245 -265481
11122 173103 -153114 81348 131282 328017 195121 362190 29750 139733 30503 -201759
11111 7663 -147338 253097 364361 -29633 33327 111831 3930 -63138 -179860 -70145 139395
11099 75798 55160 360919 -75914 -84570 318344 164260 131700 151178 118843 205584 -6291
11087 -106957 -29124 293767 129954 127943 107764 209204 290839 371706 779230 249657 233569
11076B33569K18599I9470h0187B06208H9303M1626L8999Q1588A03297J43546n8161
11065A88682H8592J89759J83433A14055k2285J41675L5186J31707p0847J19557
11055D49048M7935J70953k67694J91736K47412j65490K8072K5130J77577p9089
11045H25590j32558l570J85051L5647k96591J76020P5563j20446K02543k14293
11035G32956K75589m46014L41243k33133n6819J98385n071r8134J69323R1417
11025I69742O8069K0856l50138O5032j15512J09773M3591p7147R4846k97774K09438
11014G40776j01373k72863M47156j85224o0672K454N24026l80818p7960o4128
11004E71374B00209N17530k02656L17988j37555J14650j49621O2715J43506k55174
$$ plain form
11076 233569 452168 99470 -80187 206208 89303 130929 169928 251516 103297 246843 188682
11065 188682 88592 278351 461784 114055 91770 233445 268631 400338 329491 449048
11055 449048 496983 667936 400242 591978 839390 673900 701972 727102 904679 825590
11045 825590 693032 689462 874513 910160 613569 789589 865152 744706 947249 732956
11035 732956 1008545 562531 903774 670641 613822 812207 807136 709002 878325 969742
11025 969742 1037811 1058667 708529 773561 658049 767822 811413 734266 829112 531338 740776
11014 740776 639403 366540 813696 628472 567800 570254 1094280 713462 635502 571374
11004 571374 200209 717739 515083 833071 695516 810166 660545 723260 866766 611592
10994F11592J43148j1451Q8368K58372j3077m20193K91604j24266k30459q7797
10984E05841L46983o2798k30148M34163j34957J92326o4650K71924k57961N78225
10974A578948l66322J54168Q6743K52376K67256K81103J13217M72450R9673K43867
10964C183479J76472L54640j24665j36750o8268o53922m25701l58202l29035m60747
10954A157301q8401j27421j07144j51257M19088l26807J53207l4762o5926C06766
10943C53753Q6832A1906L40532C1662K24027K0414A21110K7628m1479j2482o364
10932H8413J4902K36234k1325j6601E5830R099c20073J42742L1288C8433R8221
10921A36654i3662B993L8395a51795A86538C0043a97225A49700a31465j8258e029
$$ plain form
10994 611592 754740 743289 831657 1090029 1076952 656759 948363 824097 593638 505841
10984 505841 852824 790026 559878 994041 859084 1051410 986760 1258684 1000723 1578948
10974 1578948 1212626 1366794 1453537 1705913 1973169 2254272 2367489 2839939 2939612 3183479
10964 3183479 3359951 3714591 3589926 3453176 3384908 2730986 2305285 1947083 1618048 1157301
10954 1157301 1068900 941479 834335 683078 1102166 775359 928566 893804 827878 306766
10943 353753 440585 11906 352438 31662 255689 276103 121110 148738 107259 94777 88413
10932 88413 103315 339549 318224 301623 55830 64929 -320073 -177331 -146043 38433 136654
10921 136654 -93662 2993 41388 -151795 186538 30043 -197225 149700 -131465 -149723 -5029
10909d4041I6949c90924B170N9521A975d6960A22728h5806j98805P9836A46872
10897A17873f7908B55628A00666c70A68671i3000A40597b27855O8373A76192R139
10886A85331k52a89215Q0629d859j5748k410B18165a23491n6858A98767p2016
10875A26751J1615F4645J5156a56155k66318A18571a87907C7597J58710E648a4690
10863b22602J0800g0812N870C20161b94061a08964A8653a97746A35313a61564
10852A75168d9698j22915j49664A71469f0274j28658H7474a42433C2922a08080
10841A51871c62188D8429c98073J02355J19691E9933f2557j13159N8303K7453
10831h9960j69449a23579l389o1315p5399K0824d6788B50304a6023k76842Q28
$$ plain form
10909 -44041 96949 -390924 2170 61691 1975 -46960 122728 -85806 -284611 -204775 146872
10897 117873 -67908 255628 100666 -370 168671 -93000 140597 -227855 -159482 176192 185331
10886 185331 185079 -189215 -108586 -4859 -20607 -23017 218165 -123491 -180349 198767 126751
10875 126751 138366 64645 79801 -156155 -422473 118571 -187907 37597 196307 5648 -14690
10863 -222602 -211802 -70812 -64942 320161 -294061 -108964 18653 -197746 135313 -161564
10852 175168 -49698 -172613 -322277 171469 -60274 -188932 87474 -142433 32922 -108080
10841 151871 -362188 48429 -398073 -295718 -176027 59933 -62557 -175716 -117413 -89960
10831 -89960 -259409 -123579 -126968 -188283 -263682 -242858 -46788 250304 -16023 -292865 -292037
10820b92037A68909B9295a05529l08686b01228D5192a07465N298I4328a43663
10809a6455j31045D2192b31908f0741c333B72659b39249n32709A05985O3875b6008
10797e2153j47548R6916a3868j74070j04301a15401d1747C21388a47294g0458
10786a8391F3226c61602a10980c3976j24179E8187c97186A024L58961f4386n2349
10775a16735n4906m2548M3492l534r9343B84014n7242B0201a30250M750h04A93359
10762A50327d8676n7134A29055b5892n1375A58395a43174B3411b72222f8472J8647
10751d9825E0424J43801b16898R2203M2629j17348K4928H0620h3032b5364A08224
10739B78636a33262A27159c33352B1628d8567l403E988d5708A04970c5306A08419
$$ plain form
10820 -292037 168909 29295 -105529 -414215 -201228 45192 -107465 -102167 94328 -143663
10809 -16455 -147500 42192 -231908 -60741 -3333 272659 -239249 -771958 105985 169860 -26008
10797 -52153 -199701 -102785 -13868 -187938 -292239 -115401 -41747 321388 -147294 -70458
10786 -18391 63226 -361602 -110980 -33976 -158155 58187 -397186 1024 359985 -64386 -116735
10775 -116735 -171641 -214189 -170697 -174231 -273574 284014 226772 20201 -130250 -125500 -804 193359
10762 150327 -48676 -105810 129055 -25892 -77267 158395 -143174 23411 -272222 -68472 -49825
10751 -49825 50424 194225 -216898 -124695 -82066 -199414 -174486 80620 -83032 -25364 108224
10739 278636 -133262 127159 -333352 21628 -48567 -51970 5988 -45708 104970 -35306 108419
10727g9433k29029e4869l46847G1513b53132l2306G6582n4a47878F7504O0825
10716A28329J3790R1678a58360D1167K15194G7835b05021C26899G9747d7471A1500
10704C5411J88528a18507a7856E9030b23443d9226k01178f406l12291k3061a33480
10692a14817o4858B17870a7790k14812G0248b7401F4336h4116k1101M193l05091
10681d06115a49425C05316j24718D3394b33184c7591n564k0391j01349L9302p5241
10670b00834K6534M4856k5250O6457B64056f7537j59901A5036i7866P818c8943
10658a99851Q4505B96010c90938j7413D1332b75518A42048l8945b31785j89785
10648d21570b8037j8836p2137I6978c0021j4664A02865c19903a53956A36810l5484
$$ plain form
10727 -79433 -308462 -54869 -401716 71513 -253132 -285438 76582 76528 -147878 67504 128329
10716 128329 142119 233797 -158360 41167 256361 77835 -205021 326899 79747 -47471 11500
10704 35411 223939 -118507 -17856 59030 -223443 -49226 -250404 -6406 -318697 -341758 -133480
10692 -114817 -179675 217870 -17790 -232602 70248 -27401 64336 -84116 -105217 -101024 -406115
10681 -406115 -149425 305316 180598 43394 -233184 -37591 -43155 -63546 -164895 -125593 -200834
10670 -200834 -174300 -129444 -154694 -88237 264056 -67537 -227438 15036 -97866 -90048 -38943
10658 -199851 -115346 296010 -390938 -408351 41332 -275518 142048 103103 -231785 -421570
10648 -421570 -28037 -46873 -119010 96978 -30021 -44685 102865 -319903 -153956 136810 101326
10637A01326d5781a8039m00329a13243A80172a06502B44321a79695C2868a84094
10626H5015J54745A19009J10096n2700a37863m1137R599b384P36j34531N7056
10615g9123q7515k8718p9121a23544A92565i5203G5376c4571k20291A21145a68584
10603A86892l6376b34493A29831D9589O478a74555j19251d3295n3692k2256D2765
10591C1793P7029a43769m67741H4216a06473j1953A73916H1360c01687I103c11872
10579C4384A1002N8339J4043B024d2354j41611q0714P9464R2466B3506K03843
10568B27349b2948j40100M2918c1611C1394a10371A28639L4379A8360a84485O2129
10557a22356I5438K2651h554j73885A29422c53443J33489F7176J75156a18583
$$ plain form
10637 101326 -45781 -18039 -418368 -113243 180172 -106502 244321 -179695 32868 -184094
10626 85015 239760 119009 229105 176405 -137863 -179000 -169401 -2384 -1648 -136179 -79123
10615 -79123 -166638 -195356 -274477 -123544 192565 -95203 75376 -34571 -254862 121145 -168584
10603 186892 150516 -234493 129831 49589 56067 -174555 -293806 -43295 -96987 -119243 42765
10591 31793 108822 -143769 -611510 84216 -106473 -118426 173916 81360 -301687 9103 -311872
10579 34384 11002 69341 83384 2024 -42354 -183965 -264679 -185215 -92749 23506 227349
10568 227349 -22948 -163048 -120130 -31611 31394 -110371 128639 163018 18360 -184485 -122356
10557 -122356 95438 118089 -8554 -182439 129422 -353443 -219954 67176 242332 -118583
10546A28257a3967l9150B05019a51549A22991i6582j08744m9922a05344A76667
10535c03567f6492B24842G9510a24868a3896m27166h4414g301l6246j15797B30890
10523B62744r5565c44710E2004J33976D2085c41372A1939h4368n9961B00654b84699
10511h4988L9961j14038j93116J13860J06460F5319c20327B08036c89487A02593
10500a25330j5961j1357j5216J8306O8676B0537E494c78741B24114a51692q8106
10489b39798A34890a32229A76762J7919b58183I4042m1566f3781o5864B29529
10478i0953B09083c0492E4077d35903E1055A1394a29471p9976c1062G9394J08618
10467A88012b63212p718H0954O5239J15207B3684b72374d5023l4037k03874B155
$$ plain form
10546 128257 -13967 -53117 205019 -151549 122991 -96582 -205326 -255248 -105344 176667
10535 -303567 -66492 224842 79510 -124868 -13896 -441062 -84414 -7301 -43547 -159344 230890
10523 262744 167179 -344710 52004 185980 42085 -341372 11939 -84368 -144329 200654 -284699
10511 -84988 -45027 -159065 -352181 -238321 -131861 65319 -320327 208036 -389487 102593
10500 -125330 -141291 -152648 -167864 -149558 -80882 20537 5494 -378741 224114 -151692 -239798
10489 -239798 134890 -132229 176762 194681 -258183 94042 52476 -63781 -129645 229529
10478 -90953 209083 -30492 54077 -435903 51055 11394 -129471 -209447 -31062 79394 188012
10467 188012 -263212 -270930 80954 146193 261400 23684 -272374 -45023 -79060 -282934 2155
10455D9662a58771A9869e0929j01564J5243l7001h0841N282H7724b55339P0419
10444a84920O7957D9411b58725R8166A72540C2698J3055b59781e882r8529k10780
10433c15191g3128A4387Q3331C454a0449D6996a93769A34603n2517b24533h4692
10421b22111C30200b16865A38659a4858B06154o2329b45645J02065K0240j39735
10411b63075C9453f7700b4145p7336m2530j98704N4279g3319j58970M2691C12460
10399A21702c6193B48555c3716G9394b44924j02186C16661e5006B98822B8085
10388D6151J86590J06042c2506A97746a35655M3892C11820j47419h0219g102G3118
10376H8149J33862I0283L92693A37830J89258O0567G5046K12784n0173J40175
$$ plain form
10455 49662 -158771 19869 -50929 -152493 -137250 -174251 -80841 -75559 87724 -255339 -184920
10444 -184920 -116963 49411 -258725 -160559 172540 32698 45753 -259781 -5882 -104411 -315191
10433 -315191 -73128 14387 97718 3454 -10449 46996 -193769 134603 82086 -224533 -84692
10421 -222111 330200 -216865 138659 -14858 206154 143825 -245645 -143580 -123340 -263075
10411 -263075 39453 -67700 -24145 -101481 -144011 -342715 -288436 -73319 -232289 -189598 312460
10399 121702 -36193 248555 -33716 79394 -244924 -347110 316661 -55006 298822 28085
10388 46151 232741 338783 -32506 197746 -135655 -91763 311820 164401 -80219 -7102 73118
10376 88149 222011 90283 482976 137830 327088 387655 75046 287830 237657 377832
10366C77832j12317L70091A69974L45482Q1694K2162k00661R7426j81790A41142
10355B78308A17208B4873L60585A71172H1314K97821L1757j15943N39014l49647
10345D84316j09338j05868J41319p5750j27173J0306M4363j14324R3922K29491
10335D71264B2326J10139P4119a35949B75071a08087A19633K25499J7839J7252
10325C80223A33352k9164A1427K51228C5639K07133J01142L6804J06305j96727
10315B90296J19705a69374C35878k1364f8439B21654a29724a3001k552k93819
10305c09372i7837c6014h304C298a95878D6542J83843F484M631g2893k17875A32987
10292b76012P2063H7896a15237c1415B35121a04426A08316l2416b12471J8968
$$ plain form
10366 377832 265515 635606 169974 515456 597150 619312 418651 516077 334287 141142
10355 278308 117208 24873 385458 171172 81314 379135 410892 294949 833963 484316
10345 484316 374978 269110 410429 334679 207506 217812 262175 147851 241773 471264
10335 471264 22326 132465 206584 -135949 275071 -108087 119633 345132 362971 380223
10325 380223 133352 104188 11427 262655 35639 242772 343914 380718 487023 290296
10315 290296 410001 -169374 335878 314514 -68439 221654 -129724 -13001 -15553 -309372
10305 -309372 -97837 -36014 -8304 3298 -195878 46542 230385 6484 11115 -72893 -290768 132987
10292 -276012 -203949 87896 -115237 -31415 235121 -104426 108316 75900 -212471 -193503
10282a93503j52974a28589L1374H7425b49529n3653A7512d27696d657B8767a36288
10270H3437d0968F1170e44A19074J64415A31212J01417N9354b68632f8043G0148
10258b97617R4313J7840F4737a24127n4836f7436A1421K19746a24913B8784a7139
10246H4595J03614m3020L2361J21725D5521b0120G9573K42960d4081o9877N0257
10235f3701H5516J04999e3890F6921a081n8719D1482N2859P607R6589a55021N1213
10223a03808A54991E1453b36421N7460k02727g407D6762a50655A92137N1845c34108
10211A04214G335a62647l31770a04003A33547h1994e124j55717B27155c91306
10200e1704j09740A8997b70615J20161A85953i7345l50080f7127C0994O4100e92789
$$ plain form
10282 -193503 -346477 -128589 -97215 87425 -249529 -303182 17512 -427696 -4657 28767 -136288
10270 83437 -40968 61170 -544 119074 283489 131212 232629 291983 -268632 -68043 70148
10258 -297617 -203304 -185464 64737 -124127 -178963 -67436 11421 231167 -124913 28784 -17139
10246 84595 188209 145189 177550 299275 45521 -20120 79573 322533 -44081 -113958 -63701
10235 -63701 85516 190515 -53890 66921 -1081 -59800 41482 94341 101948 198537 -155021 -103808
10223 -103808 154991 51453 -236421 -178961 -381688 -7407 46762 -150655 192137 243982 -334108
10211 104214 7335 -162647 -494417 -104003 133547 -81994 -5124 -160841 227155 -391306
10200 -51704 -161444 18997 -270615 -150454 185953 -97345 -447425 -67127 30994 95094 -592789
10188D244e2490B03616a41319l5089A20391i9419q1675k39410h1656j38259F6563
10176c34205J35007e9887a8830j5242j06304j9785A84714b42646A9058Q3406e8267
10164a45662f4934b7111j4381m9565c7071m2567p5308d667F561a83227a0427B82791
10151B69775D2858a36500B12248a34505A45736i8074a971j96793a005j48942n1352
10140b01299Q0343j06062c8170r8530j57660g2132D2709b20791H2191b36648i9124
10128c50747J37655R5011J0886l44028b22208l7394b2802n4715b6311k52495J22302
10117a56504B78654L4858a10744H8034o183h7986A27333o1598b0812j66086m7262
10106b34160p4021K4744f2303k6727l0872M575I289a08232b9280k7405k44457
$$ plain form
10188 4244 -52490 203616 -141319 -176408 120391 -99419 -181094 -420504 -81656 -219915 66563
10176 -334205 -199198 -59887 -18830 -34072 -140376 -160161 184714 -242646 19058 102464 -58267
10164 -145662 -64934 -27111 -41492 -91057 -37071 -79638 -154946 -4667 6561 -183227 -10427 282791
10151 269775 42858 -136500 212248 -134505 145736 -98074 -1971 -198764 -1005 -149947 -201299
10140 -201299 -120956 -227018 -38170 -136700 -294360 -72132 42709 -220791 82191 -236648 -99124
10128 -350747 -213092 -118081 -107195 -451223 -222208 -259602 -22802 -77517 -26311 -278806 -156504
10117 -156504 278654 313512 -110744 88034 81851 -87986 127333 65735 -20812 -186898 -234160
10106 -234160 -308181 -283437 -62303 -89030 -119902 -115327 9289 -108232 -29280 -56685 -301142
10095c01142a50411d7986j5239a6597l6676B7095J05664c2827j03107B38933a43475
10083b21283m1541K5344R1496K6446B10531f6135o9437A1794a59941F4469a16119
10071a60383e0626o33r3131A51000b66947n2496l1127A2058M4442f1833k95697
10060c57530a48402N796G3218b22431p4200a15398G5163b2167G3920g686A34270
10048a71926F6640a61897h0257c2316j53208d4774j76372A31582C0371L7720J09087
10037A77178O906a69466j59752g4270H4981J78243d6010C8035d6491k74444a39931
10025D6671a0226B4974b09215A24320a20831B37684c53177i4061a2679l52285
10015c64964L2701I1714J65225D5342L0597c19746B0822J5341M5340b57245k42040
$$ plain form
10095 -301142 -150411 -47986 -63225 -16597 -53273 27095 132759 -32827 -135934 238933 -143475
10083 -221283 -262824 -237480 -145984 -119538 210531 -66135 -135572 11794 -159941 64469 -116119
10071 -160383 -50626 -51259 -144390 151000 -266947 -319443 -350570 12058 56500 -61833 -357530
10060 -357530 -148402 -142606 73218 -222431 -296631 -115398 75163 -22167 73920 -7686 134270
10048 -171926 66640 -161897 -80257 -32316 -185524 -44774 -221146 131582 30371 68091 177178
10037 177178 184084 -169466 -329218 -74270 84981 263224 -46010 38035 -46491 -320935 -139931
10025 46671 -10226 24974 -209215 124320 -120831 237684 -353177 -94061 -12679 -364964
10015 -364964 -332263 91714 256939 45342 75939 -319746 20822 36163 81503 -257245 -499285
10004d99285F4573c38096i2924j9208A61080C5140J9287b7038F3732c2086k56064
9993b88150n2215i6919A68116e1276k78304g0858e862I2993i2378J8650j69451
9982b43179P9846g9244K5953p384b0589A36069f3675B30152a82932i77j13126
9971a14103j43674K477F8694b07342H8749K4458r09e1216k76880b6388k38591
9960b64979G8417f4855m2381l7184J9953L457O725C7435j87g3679a9782C37894
9947a47387A67637A2187d1709a1753j85932A06758e19518a02980I9445D4119c45130
9935a15292H5296b18510h8930j95841J7557B11387b52913D5653P3908c82121a77054
9923A22184a60847A08719m3230a68574n834j62540A05923R7638l2507a70608j08701
$$ plain form
10004 -499285 64573 -338096 -92924 -112132 161080 35140 54427 -27038 63732 -32086 -288150
9993 -288150 -340365 -96919 168116 -51276 -329580 -70858 -5862 92993 -92378 -73728 -243179
9982 -243179 -163333 -79244 -53291 -60675 -20589 136069 -63675 230152 -182932 -977 -114103
9971 -114103 -257777 -255300 68694 -207342 88749 113207 112298 -51216 -328096 -26388 -264979
9960 -264979 78417 -64855 -107236 -144420 -124467 -121010 -114285 37435 37248 -73679 -19782 337894
9947 -147387 167637 12187 -41709 -11753 -197685 106758 -519518 -102980 99445 44119 -345130
9935 -115292 85296 -218510 -88930 -284771 -267214 211387 -252913 45653 119561 -382121 -177054
9923 122184 -160847 108719 65489 -168574 -174408 -336948 105923 203561 171054 -170608 -279309
9912b79309i6889I097a86948N4260m02413B01792q4535a16737b0664r7258A9265
9900a69951q2520D3997g796n12k41979A33608F1866G336e04202K27565j27121
9889d03758F0687a86945F0703L6879c1993P926B4915L73792A9906J33082d4724
9877a10946A4248Q3059c90216J94663n3589H9420a08568j09143I9180J64940i2777
9865b24781D02637b82180h1561d077o8553F6974a85916A32499n4258d41947F3429
9853b46386h5367A55932A8357b11407B0907K21759f941m998k30992A1542J70124
9842A81666a73321K5149m368D4392N7045A641b63329J2974C0097f3115D3825a02603
9829b39139D7530P1660J21391a91279f1657A81520b99245J21086L3704R752C3771
$$ plain form
9912 -279309 -96889 9097 -186948 -132688 -535101 201792 117257 -116737 -20664 -117922 19265
9900 -169951 -252471 43997 -7796 -8308 -250287 133608 61866 7336 -504202 -276637 -403758
9889 -403758 60687 -186945 60703 97582 -31993 -24067 24915 398707 19906 152988 -44724
9877 -110946 14248 97307 -390216 -195553 -249142 89420 -108568 -217711 99180 264120 -92777
9865 -224781 402637 -282180 -81561 -4077 -72630 66974 -185916 132499 78241 -441947 63429
9853 -246386 -85367 155932 18357 -211407 20907 242666 -6941 -11939 -242931 11542 181666
9842 181666 -173321 -148172 -152540 44392 101437 1641 -263329 -250355 30097 -63115 43825 -102603
9829 -239139 47530 119190 240581 -191279 -61657 181520 -299245 -178159 -144455 -134703 33771
9817E8616b37114B63969d32054g1459A13412c52305P4692a15434N4482m8986E9329
9805a93771h8759k21474D0360c27782G2676P683J11579b09683F3972R2540b31919
9793c0758k13345H0682b62085L5617b9055l51395a53659N0665A41901c65608B7264
9781G8548R6833b52875J7999d412k24661B5061a51779G1781K754j4916j0337c59539
9768a45438j5867C1596A4266c81743A36456F5737b5926A08382B0346Q0892g497
9756a33788A11583N3608b04057d9658E8200a50701L8428L4144j8382r8770d1779
9744A18138K8255a77283k68283L7637B67069c29053H6471a00000n6841D4335K7068
9733G1403b81979a8376G1444J47477n5164b12592C00743j29298a80832P7087j8586
$$ plain form
9817 58616 -237114 263969 -432054 -71459 113412 -352305 -277613 -115434 -60952 -109938 59329
9805 -193771 -88759 -310233 40360 -327782 72676 80359 191938 -209683 63972 156512 -231919
9793 -30758 -244103 80682 -262085 -226468 -29055 -380450 -153659 -102994 141901 -365608 27264
9781 78548 175381 -252875 -234876 -4412 -229073 25061 -151779 71781 74535 59619 49282 -359539
9768 -145438 -161305 31596 14266 -381743 136456 65737 -25926 108382 20346 101238 -7497
9756 -133788 111583 165191 -204057 -49658 58200 -150701 -112273 -78129 -96511 -195281 -41779
9744 118138 146393 -177283 -445566 -407929 267069 -329053 86471 -100000 -156841 44335 71403
9733 71403 -281979 -18376 71444 218921 163757 -212592 300743 171445 -180832 -103745 -122331
9722a22331A21334N396i888H3392h6181a1436l28546J62943M5317C16642f5201
9710g3292a5611m6533j33429F7734b32502B10521b09901c7537j83514k69128a87174
9698E882M8557g921k34274i0677B1584J03426b6453k81026A4316N5948K7202K11718
9686C09184p2785C1584P9685N5748a93219m13634a13524j17868j8740a00122M5577
9675e4545k42662b3996j96566G1383A1178g9281l04441a23928B22422G8902A5205
9663F3702a47538k5319A94448P899b1090A8860M03089a72993m3690J3836A42949
9651a54012D6306c71588f8739o2529j46259c0589J2408A24064a75599j3218j68234
9640c57051h0853j85887B01489p4268a53006a4718c027B27406c5194j22180I4882
$$ plain form
9722 -122331 121334 126730 -9888 83392 -86181 -11436 -339982 -177039 -131722 316642 -65201
9710 -73292 -15611 -62144 -195573 67734 -232502 210521 -209901 -37537 -221051 -490179 -187174
9698 5882 54439 -7921 -242195 -90677 21584 125010 -26453 -307479 14316 70264 97466 309184
9686 309184 236399 31584 111269 167017 -193219 -606853 -113524 -231392 -250132 -100122 -54545
9675 -54545 -297207 -23996 -220562 71383 11178 -79281 -383722 -123928 222422 78902 15205
9663 63702 -147538 -172857 194448 202347 -21090 18860 421949 -172993 -216683 -202847 142949
9651 -154012 46306 -371588 -68739 -131268 -277527 -30589 -18181 124064 -175599 -188817 -357051
9640 -357051 -80853 -266740 201489 127221 -153006 -14718 -3027 227406 -35194 -157374 94882
9628B9559b00299L247c2756g121j36874e7738G2955b2929n5121j02905a1444j8840
9616c0284j12261l6248i149A49523c51503A5349c52524B1548a40928B47642c02635
9604I7494b3235j79786B46988A18433a0448k87473a14870K8217k71172c6400k4993
9593f1393J4410j64994I7530b53896A16736a49152C69244b15539j05435H7659
9582a27390M6891j08026G7122a20296N7508A48271b24630M6072A16531d07443
9571b24126A92298H0713A5709K46373d00738Q2896a5440A8541e8198r2214J495
9560a48917A93256d398k45006k3949B17375a65990k4947j24272J14093R3879j56912
9549b64149a31996K8905M7564G6364i4561a9996r6463b4600q40q5645E0582J36350
$$ plain form
9628 29559 -200299 -197052 -32756 -7121 -143995 -57738 72955 -22929 -78050 -180955 -11444 -30284
9616 -30284 -142545 -178793 -9149 149523 -351503 15349 -352524 21548 -140928 247642 -302635
9604 97494 -23235 -203021 246988 118433 -10448 -297921 -114870 -86653 -357825 -36400 -61393
9593 -61393 -46983 -211977 97530 -253896 116736 -149152 369244 -215539 -320974 87659
9582 -127390 -80499 -188525 77122 -120296 -62788 148271 -224630 -178558 116531 -407443
9571 -224126 192298 80713 15709 262082 -400738 -317842 -15440 18541 -58198 -150412 -148917
9560 -148917 193256 -4398 -249404 -273353 217375 -165990 -190937 -315209 -201116 -107237 -264149
9549 -264149 -131996 -103091 -55527 76364 -94561 -19996 -116459 -24600 -25440 -111085 50582 186932
9537A86932b48753J11051j28193k04269b0442I2390O6898a04961j3263e0831j33648
9526a84479j58503G6028b52688A50947F6747B8744c74889A91946P5558q3038b37821
9514I0618L6064e2253k5497A3467L8619f4275k125A72630C0212a23268j88559
9503c11827d0799j21543r1642J03519j05971B51772i2653j52768g435A79461d77790
9491e6114j2885D013L42147c1952a2784j87660g2142k0697l03785a79593I4672
9479e8558j42330B70022a08336k16838C71930c9080j12651H7261a55997m4077
9469b00074D4452J19478j0047k1617j1709O531a5764D3423O7589j5724b39550
9457A76565d58028B7146R6685J46463r7033c40600A25567a76267k058K003l536
$$ plain form
9537 186932 -248753 -137702 -265895 -470164 -20442 92390 159288 -104961 -118224 -50831 -184479
9526 -184479 -342982 76028 -252688 150947 66747 28744 -374889 191946 267504 184466 -237821
9514 90618 126682 -52253 -77750 13467 52086 -64275 -66400 172630 30212 -123268 -311827
9503 -311827 -40799 -162342 -253984 -150465 -256436 251772 -92653 -245421 -7435 179461 -477790
9491 -56114 -68999 4013 346160 -31952 -12784 -200444 -72142 -92839 -396624 -179593 94672
9479 -58558 -200888 270022 -108336 -325174 371930 -39080 -151731 87261 -155997 -200074
9469 -200074 44452 163930 153883 132266 120557 127088 -15764 43423 111012 95288 -239550
9457 176565 -458028 27146 123831 270294 173261 -340600 125567 -176267 -178325 -176322 -179858
9446a79858A82417M9265r9779b47431D3819a3109n4238k104A65786D9440O4013
9435A13453A251b00400g5162l66726A0593g3140I4578k1446J41172q243d880D7412
9422h9827b673p9750C3129N6280D2814b90741m3281A36249b17565h2605j50816
9411b33421p90B52275A04047m9558c8594F5186b17904j31853L320l02540a95174
9399a16826F0052L330J0837a00986k27037e5591C5146h0748j42281a11249B51848
9387A19188a0300j46962o2855M3661p9411C9816b6710H9790b23801P4295d1238
9375A22723a87022m6602j9234P4698F5620r475K25554j40595D4400J99251n1060
9364A92591a76249A55770a83592d9603o4725K1808a9889j56631d3796j27545l402
$$ plain form
9446 -179858 182417 231682 131903 -247431 43819 -13109 -67347 -69451 165786 49440 113453
9435 113453 1251 -200400 -75162 -441888 10593 -73140 94578 73132 214304 206061 -4880 47412
9422 -89827 -2673 -82423 33129 89409 42814 -290741 -334022 136249 -217565 -82605 -233421
9411 -233421 -234211 252275 104047 54489 -38594 65186 -217904 -349757 -346437 -648977 -195174
9399 -116826 60052 63382 74219 -100986 -328023 -55591 35146 -80748 -223029 -111249 251848
9387 119188 -10300 -157262 -220117 -176456 -255867 39816 -26710 89790 -223801 -149506 -41238
9375 122723 -187022 -233624 -252858 -178160 65620 56145 281699 141104 44400 243651 192591
9364 192591 -176249 155770 -183592 -49603 -114328 -92520 -19889 -176520 -43796 -171341 -174743
9353a74743e6667j76755C4686a16238F9143e8496m0908p5658K8535a6015m3613
9342e9628j3628j16665A34425p712m0088e2797k16635D3252a14141L3208K1752
9331e9181M075G2859b74017f8044A12607n3549c0305N69Ga44410k02760c3649
9318C3242L1655J23019C6662b06916A22259P7392b38461j58091a55227N9703j05610
9307b01134G0227K30250D4989b2670C8921d80699a59076d8927l04008f0613k8104
9296h8717L6915B48564f648k83933a23077C05420C2135O3634a40269A63802c46334
9284e5658J2927G5530k210J73487a14093A17392N1520f983o024A6283J31670a78799
9271B36906o2494b86800J33520c7654l9938j22544A02994c8677J4097D6007a34631
$$ plain form
9353 -174743 -56667 -233422 34686 -116238 69143 -58496 -99404 -175062 -146527 -16015 -59628
9342 -59628 -73256 -189921 134425 126713 86625 -52797 -269432 43252 -114141 -80933 -59181
9331 -59181 -55106 72859 -274017 -68044 112607 59058 -30305 -29736 7 -144410 -347170 -33649
9318 33242 64897 187916 36662 -206916 122259 199651 -238461 -396552 -155227 -95524 -201134
9307 -201134 70227 300477 44989 -22670 38921 -480699 -159076 -48927 -352935 -60613 -88717
9296 -88717 -51802 248564 -6648 -290581 -123077 305420 32135 95769 -140269 163802 -346334
9284 -55658 -42731 75530 73320 246807 -114093 117392 168912 -6983 -13007 16283 147953 -178799
9271 236906 174412 -286800 -153280 -37654 -77592 -200136 102994 -38677 -24580 46007 -134631
9259b63036F4587b67730d3240A68500a2845j44979D7841h1265E3557b0002B2768
9247D1141b97882R1972a498j96494f0634B17804q0208c08470d1069a1588k80991
9236b92579j87822C1686b02493A7147a92430P2819j07593O3557E0215a40101C1046
9224A24994b49211i6731q3734l6989f4481j8329k69117B25381a10539A22655e4331
9212A95624G6776c2871A08058e2955D03517A22984a69943k6984d6417m6296A30884
9200c28443f4013j23735Q6673l46255D0395b01782k1556E3867b14461j2641e370
9188i5627G8009c82775J10752d4730l47370b5430j02228A45603M4397j6768e9741
9176e10391i1437j20127H3663a85150j0523g7480A13498F825J48711Q365J4955
$$ plain form
9259 -263036 64587 -267730 -43240 168500 -12845 -157824 47841 -81265 53557 -20002 22768
9247 41141 -297882 -205910 -1498 -197992 -60634 217804 137596 -308470 -41069 -11588 -292579
9236 -292579 -480401 31686 -202493 17147 -192430 -119611 -227204 -163647 50215 -140101 31046
9224 124994 -249211 -96731 -180465 -217454 -64481 -82810 -351927 225381 -110539 122655 -54331
9212 195624 76776 -32871 108058 -52955 403517 122984 -169943 -196927 -46417 -92713 130884
9200 -328443 -64013 -187748 -101075 -447330 40395 -201782 -223338 53867 -214461 -227102 -5370
9188 -95627 78009 -382775 -272023 -44730 -392100 -25430 -127658 145603 190000 173232 -59741
9176 -510391 -91437 -211564 83663 -185150 -195673 -77480 113498 6825 155536 163901 178856
9165A78856G6011M84G699J53283b6855k63107A9407R4387a17505A16298m4396
9154G1902l5820J18570J16526D1897a18994A78508q1816k6190a68067k5237A1532
9142C79567A69183a44922A31401D8350a90777P6549A38914b25090E2222K23376
9132B75598e417l22570J62109A29435b26012G9223d54454B1468b2191C0913b01904
9120F5902b8212j92962N5985m5120j13193I9753d58k23752E0436J81513B2110
9108A45310l5361e735I3302b99968A79843K4028j01223c27135a06984o3714r1187
9097b61885I4132M885m6279b23162A47957a77843d6885k59080J32909j68393J03046
9086b38403K4878e6610j15501A66352a60998k0618C8268i7902k31147B24508A2343
$$ plain form
9165 178856 76011 76495 7699 160982 -26855 -289962 19407 113794 -117505 116298 71902
9154 71902 36082 154652 271178 41897 -118994 178508 96692 70502 -168067 -193304 11532
9142 379567 169183 -144922 131401 48350 -190777 -114228 138914 -225090 52222 275598
9132 275598 -5417 -327987 -165878 129435 -226012 79223 -454454 21468 -22191 30913 -201904
9120 65902 -28212 -221174 -165189 -210309 -323502 99753 -458 -224210 50436 231949 22110
9108 145310 109949 -5735 93302 -299968 179843 203871 102648 -327135 -106984 -170698 -261885
9097 -261885 94132 99017 52738 -223162 147957 -177843 -46885 -305965 -173056 -341449 -238403
9086 -238403 -213525 -56610 -172111 166352 -160998 -181616 38268 -97902 -329049 224508 12343
9074a87910R0464c5148D2450a59408k03748A61149f2456c486k48778h9751I213
9062G4242J46132e0059B0354a94144f1834j74681G4409R5775a52596j79182J29753
9051b02025d6831k1247B53724o4205b50313a997p7250l58676F6876A5209b15474
9039D543d6744j63851A52633J17563c47535P4401a34685B3645c4582a7068I3198
9027a4672A19432a53839I1510h8810B7729b2722Q820k6949d149F8091i1552A7920
9014b67107Q737a22756A81329b24945J9736h3681m704G5454a33132j33345A93583
9002c78132i6164j58084i0610D4385J40247e6F5969b48074B03266b95281g2476
8990f0269j58027n5972b2637o689j51911M9475M0058j2881M6109A25463a25585
$$ plain form
9074 -187910 -97446 -35148 42450 -159408 -363156 161149 -62456 -3486 -252264 -89751 9213
9062 74242 220374 -50059 20354 -194144 -61834 -236515 74409 170184 -152596 -331778 -202025
9051 -202025 -46831 -68078 253724 189519 -250313 -1997 -79247 -437923 66876 15209 -215474
9039 4543 -46744 -210595 152633 270196 -347535 -273134 -134685 23645 -34582 -17068 93198
9027 -14672 119432 -153839 91510 -88810 27729 -22722 -13902 -40851 -4149 68091 -91552 17920
9014 -267107 -258370 -122756 181329 -224945 -205209 -83681 -88385 75454 -133132 -266477 193583
9002 -378132 -96164 -254248 -90610 44385 184632 -56 65969 -248074 203266 -295281 -72476
8990 -60269 -218296 -274268 -22637 -29326 -181237 -131762 -91704 -104585 -58476 125463 -125585
8978a5773L179r7199F0140c4788k61834J43763C30296h5764D1094b63907M4242
8967b19665k07687a85022N9669k84790J39108Q7987g9901o0720C2861J37347a00284
8955F3938R3071B6777c6762A64346L841h301I2620J44613a9467D767g6449b8814
8942a03072j1451K8172A89894b43191B24643c02201a5310k34765B12125N9620
8932B71745j10370m5384J47203n2147A8762R4087B5667J73629l4292J14198K16417
8921D95619N15069N48148J772805P877843o112B767972A145686E27239M6919H9507
8910A95766i640j49043c7765B559K13962P0919Q3725h9438C2052J12751K5461
8899A70264c07319I615i8578D8927c09313P2266c5765i461m4550A11565a16644
$$ plain form
8978 -15773 -12594 -109793 60140 -34788 -296622 -152859 330296 -85764 41094 -263907 -219665
8967 -219665 -427352 -185022 -125353 -410143 -271035 -183048 -79901 -140621 32861 170208 -100284
8955 63938 157009 26777 -36762 164346 168187 -8301 92620 237233 -19467 4767 -76449 -28814
8942 -103072 -114523 -86351 189894 -243191 224643 -302201 -15310 -250075 212125 271745
8932 271745 161375 115991 263194 211047 18762 112849 25667 199296 165004 279202 495619
8921 495619 1010688 1558836 3331641 11209484 11203372 2767972 1145686 527239 574158 89507
8910 195766 -9640 -158683 -37765 2559 216521 287440 371165 -89438 32052 144803 170264
8899 170264 -307319 9615 -98578 48927 -309313 -237047 -35765 -9461 -54011 111565 -116644
8887B64215G633c79091B0833J8536J00746c2366G0227a49948D4525b51139P8765
8876a72374A77115b86318h1070k49280J45362Q0590j2680a9338j17045l17261
8866d53644c5788B8256b06544D4821c24838a19644I4973a17841M2916i611A96590
8854a08366A17498C0996a9541k04860B56707d5184J4891p0683A16474a10937F5083
$$ plain form
8887 264215 7633 -379091 20833 39369 140115 -32366 70227 -149948 44525 -251139 -172374
8876 -172374 177115 -286318 -81070 -330350 -184988 -104398 -117078 -19338 -136383 -453644
8866 -453644 -35788 28256 -206544 44821 -324838 -119644 94973 -117841 -74925 -9611 196590
8854 -108366 117498 30996 -19541 -224401 256707 -45184 -30293 -100976 116474 -110937 65083
$$ [...]
##END NTUPLES=NMR SPECTRUM
##END=
