
##TITLE=AC1357_GUARH12176_6648269_MCSoYVqaRd
##JCAMPDX= 6.0         $$ Bruker NMR JCAMP-DX V2.0
##DATA TYPE= NMR SPECTRUM
##DATA CLASS= NTUPLES
##ORIGIN= BRUKER
##OWNER= Administrator
$$ 1.72 TOPSPIN		Version 2.1
$$ 2012-08-10 23:51:50.546 -0500  Administrator@TOPSPIN
$$ Compression mode = diff/dup
##.OBSERVE FREQUENCY= 400.02188249412
##.OBSERVE NUCLEUS= ^1H
##.ACQUISITION MODE= SIMULTANEOUS (DQD)
##.ACQUISITION SCHEME= undefined
##.AVERAGES= 64
##.DIGITISER RES= 22
##SPECTROMETER/DATA SYSTEM= spect
##.PULSE SEQUENCE= noesygpps1d.comp
##.SOLVENT NAME= COFFEE_meoh
##.SHIFT REFERENCE= INTERNAL, COFFEE_meoh, 1, 14.96338
##AUDIT TRAIL= $$ (NUMBER, WHEN, WHO, WHERE, PROCESS, VERSION, WHAT)
$$ ##TITLE= Audit trail, TOPSPIN		Version 2.1
$$ ##JCAMPDX= 5.01
$$ ##ORIGIN= Bruker BioSpin GmbH
$$ ##OWNER= Administrator
$$ $$ C:\Bruker\TOPSPIN/data/COFFEE/nmr/AC1357_GUARH12176_6648269_MCSoYVqaRd/12/pdata/1/auditp.txt
$$ ##AUDIT TRAIL=  $$ (NUMBER, WHEN, WHO, WHERE, PROCESS, VERSION, WHAT)
(   1,<2012-08-10 23:51:45.343 -0500>,<Administrator>,<TOPSPIN>,<go>,<TOPSPIN 2.1>,
      <created by zg
	started at 2012-08-10 23:40:15.109 -0500,
	POWCHK enabled, PULCHK disabled,
       configuration hash MD5:
       6B 1B 68 BB D9 2E 58 E2 7F 35 AD 54 07 DF 0E 41
       data hash MD5: 64K
       82 FE 43 5C 31 BE 1C 47 F8 27 95 C9 D7 F9 34 4B>)
(   2,<2012-08-10 23:51:48.234 -0500>,<Administrator>,<TOPSPIN>,<proc1d>,<TOPSPIN 2.1>,
      <Start of raw data processing
       efp LB = 0.3 FT_mod = 6 PKNL = 1 PHC0 = 0 PHC1 = 0 SI = 128K 
       data hash MD5: 128K
       10 9C 52 43 31 0D 50 43 1B D7 1E 1B C2 75 2B 20>)
(   3,<2012-08-10 23:51:49.640 -0500>,<Administrator>,<TOPSPIN>,<proc1d>,<TOPSPIN 2.1>,
      <pk PHC0 = 4.916382 PHC1 = 0 
       data hash MD5: 128K
       78 FE 25 D7 89 E8 33 F2 DF DB 9E ED FC 29 31 50>)
(   4,<2012-08-10 23:51:50.203 -0500>,<Administrator>,<TOPSPIN>,<proc1d>,<TOPSPIN 2.1>,
      <abs ABSG = 1 
       data hash MD5: 128K
       FC 07 29 E8 BA 7A 11 01 CA 5B D3 08 31 62 17 DE>)
(   5,<2012-08-10 23:51:50.281 -0500>,<Administrator>,<TOPSPIN>,<proc1d>,<TOPSPIN 2.1>,
      <abs ABSG = 2 
       data hash MD5: 128K
       76 06 90 33 FC 77 46 9A F0 98 7A 00 F4 DE E2 E8>)
(   6,<2012-08-10 23:51:50.343 -0500>,<Administrator>,<TOPSPIN>,<proc1d>,<TOPSPIN 2.1>,
      <abs ABSG = 3 
       data hash MD5: 128K
       E2 50 AF 95 2A 9A BA 6C A1 5C 1B 88 EE EB BC 7C>)
(   7,<2012-08-10 23:51:50.421 -0500>,<Administrator>,<TOPSPIN>,<proc1d>,<TOPSPIN 2.1>,
      <abs ABSG = 4 
       data hash MD5: 128K
       60 1C 21 56 90 F0 0E F2 37 7A 5E 6F 7E 58 96 D9>)
(   8,<2012-08-10 23:51:50.468 -0500>,<Administrator>,<TOPSPIN>,<proc1d>,<TOPSPIN 2.1>,
      <abs ABSG = 5 
       data hash MD5: 128K
       7F A3 D8 DB 5A E3 B3 CA DA 3D 80 4B 66 8A 2B 91>)
$$ ##END=
$$ 
$$ $$ hash MD5
$$ $$ 4C A8 AA 28 77 B5 6C E0 E0 AB A3 B9 29 23 50 D3
##$RELAX= 
##$RELAX= 
##$RELAX= 
##$RELAX= 
##$RELAX= 
##$RELAX= 
##$RELAX= 
##$RELAX= 
$$ Bruker specific parameters
$$ [...]
150 150 150 150 150 150 150 150
##$TP07= 0
##$TPNAME0= <>
##$TPNAME1= <>
##$TPNAME2= <>
##$TPNAME3= <>
##$TPNAME4= <>
##$TPNAME5= <>
##$TPNAME6= <>
##$TPNAME7= <>
##$TPOAL= (0..7)
0.5 0.5 0.5 0.5 0.5 0.5 0.5 0.5
##$TPOFFS= (0..7)
0 0 0 0 0 0 0 0
##$TUNHIN= 0
##$TUNHOUT= 0
##$TUNXOUT= 0
##$USERA1= <user>
##$USERA2= <user>
##$USERA3= <user>
##$USERA4= <user>
##$USERA5= <user>
##$V9= 5
##$VALIST= <valist>
##$VCLIST= <CCCCCCCCCCCCCCC>
##$VD= 0
##$VDLIST= <DDDDDDDDDDDDDDD>
##$VPLIST= <PPPPPPPPPPPPPPP>
##$VTLIST= <TTTTTTTTTTTTTTT>
##$WBST= 1024
##$WBSW= 4
##$XGAIN= (0..3)
0 0 0 0
##$XL= 0
##$YL= 0
##$YMAX_a= 18586448
##$YMIN_a= -9209308
##$ZGOPTNS= <>
##$ZL1= 120
##$ZL2= 120
##$ZL3= 120
##$ZL4= 120
##$ABSF1= 14.96338
##$ABSF2= -5.594802
##$ABSG= 5
##$ABSL= 3
##$ALPHA= 0
##$AQORDER= 0
##$ASSFAC= 0
##$ASSFACI= 0
##$ASSFACX= 0
##$ASSWID= 0
##$AUNMP= <proc_prof1d_extract.lims>
##$AXLEFT= 0
##$AXNAME= <>
##$AXNUC= <1H>
##$AXRIGHT= 0
##$AXTYPE= 0
##$AXUNIT= <>
##$AZFE= 0.1
##$AZFW= 0.1
##$BCFW= 0
##$BC_mod= 0
##$BYTORDP= 0
##$COROFFS= 0
##$CY= 15
##$DATMOD= 1
##$DC= 0
##$DFILT= <>
##$DTYPP= 0
##$F1P= 0
##$F2P= 0
##$FCOR= 0.5
##$FTSIZE= 131072
##$FT_mod= 6
##$GAMMA= 0
##$GB= 0
##$INTBC= 1
##$INTSCL= 1
##$ISEN= 128
##$LB= 0.3
##$LEV0= 0
##$LPBIN= 0
##$MAXI= 10000
##$MC2= 0
##$MEAN= 0
##$ME_mod= 0
##$MI= 0
##$NCOEF= 0
##$NC_proc= -2
##$NLEV= 6
##$NOISF1= 0
##$NOISF2= 0
##$NSP= 0
##$NTH_PI= 0
##$NZP= 0
##$OFFSET= 14.96338
##$PC= 1
##$PHC0= 4.916382
##$PHC1= 0
##$PH_mod= 1
##$PKNL= yes
##$PPARMOD= 0
##$PPDIAG= 0
##$PPIPTYP= 0
##$PPMPNUM= 2147483647
##$PPRESOL= 1
##$PSCAL= 4
##$PSIGN= 0
##$PYNMP= <proc.py>
##$REVERSE= no
##$SF= 400.020008683354
##$SI= 131072
##$SIGF1= 0
##$SIGF2= 0
##$SINO= 400
##$SIOLD= 131072
##$SPECTYP= <>
##$SREGLST= <1H.CDCl3>
##$SSB= 0
##$STSI= 131072
##$STSR= 0
##$SW_p= 8223.68421052631
##$SYMM= 0
##$S_DEV= 0
##$TDeff= 65536
##$TDoff= 0
##$TI= <>
##$TILT= no
##$TM1= 0
##$TM2= 0
##$TOPLEV= 0
##$USERP1= <user>
##$USERP2= <user>
##$USERP3= <user>
##$USERP4= <user>
##$USERP5= <user>
##$WDW= 1
##$XDIM= 131072
##$YMAX_p= 446332771
##$YMIN_p= -11656
##$CURPLOT= <Network HP LaserJet P1505>
##$CURPRIN= <$Network HP LaserJet P1505>
##$DFORMAT= <normdp>
##$LAYOUT= <+/1D_H.xwp>
##$LFORMAT= <normlp>
##$PFORMAT= <normpl>
##$SURQMSG= 1
$$ End of Bruker specific parameters
$$ ---------------------------------
##NTUPLES= NMR SPECTRUM
##VAR_NAME=  FREQUENCY,     SPECTRUM/REAL,   SPECTRUM/IMAG
##SYMBOL=    X,             R,               I
##VAR_TYPE=  INDEPENDENT,   DEPENDENT,       DEPENDENT
##VAR_FORM=  AFFN,          ASDF,            ASDF
##VAR_DIM=   131072,        131072,          131072
##UNITS=     HZ,            ARBITRARY UNITS, ARBITRARY UNITS
##FACTOR=    0.0627417313425164, 1,          1
##FIRST=     8223.62146879497, 1830,         -54766
##LAST=      0,             2767,            -55550
##MIN=       0,             -11656,          0
##MAX=       8223.62146879497, 446332771,    0
$$ Real data points
##PAGE= N=1
##DATA TABLE= (X++(R..R)), XYDATA
$$ [...]
63319D54699p430o384n072m089l384k651j980j533j082m91j75m62r06q71m21J2
$$ 454699 447269 440885 435813 431724 428340 425689 423709 422176 421094 420603 420428 419966 419060 418189 417768 417780
63303D17780N47J643L118M064L850K821J982K199L509M924N192M080K693K198
$$ 417780 418327 419970 423088 427152 431002 433823 435805 438004 441513 446437 451629 455709 458402 460600
63289D60600K546K768K250J295N93N44R78J308J116O82O91J260J721J509P90K
$$ 460600 463146 465914 468164 469459 470052 470596 471574 472882 473998 474680 475371 476631 478352 479861 480651 480653
63273D80653o60j046r20m76l58p64j096r24o44o60o60l33j21m19o55j93M20J44
$$ 480653 479993 478947 478027 477551 477193 476429 475333 474409 473765 473105 472445 472112 471991 471572 470917 470724 471144 471288
63255D71288r22j602j288m66K50P23Q88O22J61m2j4j62n09o47m32j42J39O45J400
$$ 471288 470366 468764 467476 467010 467260 467983 468871 469493 469654 469612 469598 469436 468927 468280 467848 467706 467845 468490 469890
63236D69890K088K490K535K033R45k16q40j021j272j574j463r94q10j156j590
$$ 469890 471978 474468 477003 479036 479981 479765 478925 477904 476632 475058 473595 472601 471791 470635 469045
63221D69045j834k146k647k955k788k338j877j455j226j479k100k507k339j887
$$ 469045 467211 465065 462418 459463 456675 454337 452460 451005 449779 448300 446200 443693 441354 439467
63207D39467j573j479j445j281p46K02J077J281R30P11Q23P12K0p70r86n35K82
$$ 439467 437894 436415 434970 433689 432943 433145 434222 435503 436433 437144 437967 438679 438699 437929 436943 436408 436690
63190D36690J188J897K135K055K208K786L333L489L591M119M977N757O413P168
$$ 436690 437878 439775 441910 443965 446173 448959 452292 455781 459372 463491 468468 474225 480638 487806
63176D87806Q008Q725R314R958J0715J1491J2213J2753J2863J2469J1952J1775
$$ 487806 495814 504539 513853 523811 534526 546017 558230 570983 583846 596315 608267 620042
63164F20042J1943J2110J2090J1999J1904J1642J1089J0331R425Q145O195L682
$$ 620042 631985 644095 656185 668184 680088 691730 702819 713150 722575 730720 736915 740597
63152G40597J283k78r48j473k708m820p227r221j0492j1165j1585j2033j2427
$$ 740597 741880 741602 740654 739181 736473 731653 724426 715205 704713 693548 681963 669930 657503
63139F57503j2333j1515j0480j0055j0295j0209q894o704m832l825l091j980p50
$$ 657503 645170 633655 623175 613120 602825 592616 583722 577018 572186 568361 565270 563290 562540
63126E62540oM03J211K562L745M273M498M858N197N431O146P679R113R272Q470
$$ 562540 562534 562937 564148 566710 570455 574728 579226 584084 589281 594712 600858 608537 617650 626922 635392
63111F35392Q122Q652R036Q632Q142Q160Q020O985N633N038N127M918M022K905
$$ 635392 643514 652166 661202 669834 677976 686136 694156 701141 706774 711812 716939 721857 725879 728784
63097G28784J920R47q6j102k180l395m478n134n501n733n554m860m329m617n243
$$ 728784 730704 731651 731565 730463 728283 724888 720410 715276 709775 704042 698488 693628 689299 684682 679439
63082F79439n135m130l068k466k042j515j020n72J01J031J980L049M609O500Q004
$$ 679439 674304 670174 667106 664640 662598 661083 660063 659491 659592 660623 662603 665652 670261 676761 684765
63067F84765Q792R286R886J0485J1033J1936J3442J5118J6294J6810J7082J7602
$$ 684765 693557 702843 712729 723214 734247 746183 759625 774743 791037 807847 824929 842531
63055H42531J8501J9362J9437J8286J6270J4184J2456J0941R294P246M637J642
$$ 842531 861032 880394 899831 918117 934387 948571 961027 971968 981262 988508 993145 994787
63043I94787j171l306m811n997o983p850q823r852j0360j0023r401r218r363r355
$$ 994787 993616 990310 985499 979502 972519 964669 955846 945994 935634 925611 916210 906992 897629 888274
63029H88274r309r553r639q797p236n978n462n317n342n616n635m621k836j477
$$ 888274 878965 869412 859773 850976 843740 837762 832300 826983 821641 816025 810390 805769 802933 801456
63015H01456r28l03R31K098K586K873L520M154M304M465N408O979Q369R218R805
$$ 801456 800528 800225 801156 803254 805840 808713 812233 816387 820691 825156 830564 837543 845912 855130 864935
63000H64935J0427J1171J2028J2859J3469J3975J4718J5604J6041J5742J5120
$$ 864935 875362 886533 898561 911420 924889 938864 953582 969186 985227 1000969 1016089
62989A016089J4626J4297J4144J4213J4050J2870J0740Q728P382N961L815J668
$$ 1016089 1030715 1045012 1059156 1073369 1087419 1100289 1111029 1119757 1127139 1133100 1136915 1138583
62977A138583N99M40K09l56p86j098j912l422n191p028r256j1992j4859j7554
$$ 1138583 1139182 1139622 1139831 1139475 1138689 1137591 1135679 1132257 1127066 1120038 1110782 1098790 1083931 1066377
62963A066377k0030k1978k2828k2626k2248k2320k2369k1559j9988j8624j7977
$$ 1066377 1046347 1024369 1001541 978915 956667 934347 911978 890419 870431 851807 833830
62952H33830j7413j6016j3715j1223r205p922p430p528p530o847n896n707o395
$$ 833830 816417 800401 786686 775463 766258 758336 750906 743378 735848 729001 723105 717398 711003
62939G11003o815o273n640o037p149p914q217q665r135q912q202q080q737r133
$$ 711003 704188 697915 692275 686238 679089 671175 662958 654293 645158 636246 628044 619964 611227 602094
62925F02094q699q187q336q773q791q261p327o022m779m367m824n183m809m213
$$ 602094 593395 585208 576872 568099 559308 551047 543720 537698 532919 528552 523728 518545 513736 509523
62911E09523l999l885l430k910k779k846k710k411k029j359m98r2k95k48O50J645
$$ 509523 505524 501639 498209 495299 492520 489674 486964 484553 482524 481165 480667 480575 480280 480032 480682 482327
62895D82327J658Q14K0m34q83j272j217q70q15j157j365j117o04j18K49N20Q24
$$ 482327 483985 484799 484819 484385 483502 482230 481013 480143 479328 478171 476806 475689 475085 474967 475216 475736 476560
62878D76560J356K013K366K285K227K591L145L490L675L926M236M599N181N826
$$ 476560 477916 479929 482295 484580 486807 489398 492543 496033 499708 503634 507870 512469 517650 523476
62864E23476N974N599N621O707Q158Q687P961O764N949N814O183O478N985M605
$$ 523476 529450 535049 540670 547377 555535 564222 572183 578947 584896 590710 596893 603371 609356 613961
62850F13961L069K043J352M75p20k100l625n090o101o769p768r222j0268j0298
$$ 613961 617030 619073 620425 620900 620180 618080 614455 609365 603264 596495 588727 579505 569237 558939
62836E58939r875r723r654r317r076r189q970p949p070p394q218q012o732n697
$$ 558939 549064 539341 529687 520370 511294 502105 493135 485186 478116 470722 462504 454492 447760 442063
62822D42063n414n127m491m159m420m649m459m230m191l981l513l244l339l356
$$ 442063 436649 431522 427031 422872 418452 413803 409344 405114 400923 396942 393429 390185 386846 383490
62808C83490l132l063l272l348l190l216l452l254k388j552j313j313r75l81R7
$$ 383490 380358 377295 374023 370675 367485 364269 360817 357563 355175 353623 352310 350997 350022 349641 349738
62793C49738M48P64P94L55j93l27k6L47O16R00J294J736K185K644L061L228K932
$$ 349738 350186 350950 351744 352099 351906 351579 351553 351900 352516 353416 354710 356446 358631 361275 364336 367564 370496
62776C70496K306J947K402L409M051L847L297L060L074K943K763K911L338L685
$$ 370496 372802 374749 377151 380560 384611 388458 391755 394815 397889 400832 403595 406506 409844 413529
62762D13529L854L881L580K828J999J495J107M87j21k90k82o71j321j580j351
$$ 413529 417383 421264 424844 427672 429671 431166 432273 432760 432639 432349 432067 431396 430075 428495 427144
62747D27144j162j216j240j189j371j772k066k263k611k889k606j930j569j638
$$ 427144 425982 424766 423526 422337 420966 419194 417128 414865 412254 409365 406759 404829 403260 401622
62733D01622j491r20p34j736l649n431o298o220n821n814o346o857o824o386n898
$$ 401622 400131 399211 398477 396741 393092 387661 381363 375143 369322 363508 357162 350305 343481 337095 331197
62718C31197n303m458l719l479l417k960k179j585j285j118j190j409j002M71
$$ 331197 325894 321436 317717 314238 310821 307861 305682 304097 302812 301694 300504 299095 298093 298564
62704B98564J966K076J058M65R36J765K588L956N889P372P823P894Q251Q680Q931
$$ 298564 300530 302606 303664 304129 305065 306830 309418 313374 319263 326635 334458 342352 350603 359283 368214
62689C68214R363J0167J0923J1581J2930J5380J8088J9952K0898K1571K2368K3299
$$ 368214 377577 387744 398667 410248 423178 438558 456646 476598 497496 519067 541435 564734
62677E64734K4216K4765K4599K3997K3586K3175K1538J7835J2611P108K151k064
$$ 564734 588950 613715 638314 662311 685897 709072 730610 748445 761056 768164 770315 768251
62665G68251n790r646j3989j8182k1146k2804k4095k5424k6165k5964k5409k4950
$$ 768251 762461 752815 738826 720644 699498 676694 652599 627175 601010 575046 549637 524687
62653E24687k4228k3042k1880k0881j9304j6807j4329j2845j2073j1243j0337
$$ 524687 500459 477417 455537 434656 415352 398545 384216 371371 359298 348055 337718
62642C37718r710r207q457p535o576n425m299m012m765n424m879l487k353j874
$$ 337718 328008 318801 310344 302809 296233 290808 286509 282497 277732 272308 267429 263942 261589 259715
62628B59715j819k187k906l254k619j467p31n82o56r31j511j919j625r36m92k25
$$ 259715 257896 255709 252803 249549 246930 245463 244732 244150 243494 242563 241052 239133 237508 236572 236080 235855
62612B35855K48O36L77k13k64L21R07J351K098L061L456L031K559K765L455M034
$$ 235855 236103 236739 237116 236903 236639 236960 237867 239218 241316 244377 247833 250864 253423 256188 259643 263677
62596B63677M389M843N561O271O505O098N552N629O347O753O057M696L821L963
$$ 263677 268066 272909 278470 284741 291246 297344 302896 308525 314872 321625 327682 332378 336199 340162
62582C40162M660N135M931M097L209K881K996K708J672O66M71O81L94l51q32r63
$$ 340162 344822 349957 354888 358985 362194 365075 368071 370779 372451 373117 373588 374269 374663 374312 373480 372517
62566C72517j312j871j873j084l61n24j303j839j803j635j902k697l517l716l186
$$ 372517 371205 369334 367461 366377 366016 365492 364189 362350 360547 358912 357010 354313 350796 347080 343894
62551C43894k587k669l410m095m136l676l415m003n476p079p774p127n603m016
$$ 343894 341307 338638 335228 331133 326997 323321 319906 315903 310427 303348 295574 288447 282844 278828
62537B78828k916k479k567k723k519k046j644j163j33J192J811J371P53O90O55
$$ 278828 275912 273433 270866 268143 265624 263578 261934 260771 260638 261830 263641 265012 265765 266455 267110
62522B67110j04j207j677j319o27K05J214J981K109K103K805M013M651M386M070
$$ 267110 267006 265799 264122 262803 262176 262381 263595 265576 267685 269788 272593 276606 281257 285643 289713
62507B89713M489N478O533P547Q604R539J0111J0362J0666J1474J2919J4479J5323
$$ 289713 294202 299680 306213 313760 322364 331903 342014 352376 363042 374516 387435 401914 417237
62494D17237J5205J4778J4665J4700J4406J3697J2516J0471P573M813L004J490
$$ 417237 432442 447220 461885 476585 490991 504688 517204 527675 535248 540061 543065 544555
62482E44555q84l807n753o146o070o537p290p650p623p531p337o865o218n428
$$ 544555 543671 539864 534111 527965 521895 515358 508068 500418 492795 485264 477927 471062 464844 459416
62468D59416m307k944j939j600j386o30N43J445J745J713J699J788J931K088K129
$$ 459416 455109 452165 450226 448626 447240 446610 447153 448598 450343 452056 453755 455543 457474 459562 461691
62453D61691J836J132L55N7M30R86J133J005J304K196K924K788J996J091l2j779
$$ 461691 463527 464659 465014 465071 465501 466487 467620 468625 469929 472125 475049 477837 479833 480924 480892 479113
62437D79113l895n582o603p547q869j0111j0349r154p076n237m351m034l254j629
$$ 479113 475218 469636 463033 455486 446617 436506 426157 417003 409927 404690 400339 396305 393051 391422
62423C91422P6J032J446K170L552N232O764P994Q899R561J0195J0892J1503J1976
$$ 391422 391498 392530 393976 396146 399698 404930 411694 419688 428587 438148 448343 459235 470738 482714
62409D82714J2476J2896J2701J1597R886P834N333K572L08j180k619m463n898
$$ 482714 495190 508086 520787 532384 542270 550104 555437 558009 558317 557137 554518 550055 544157
62396E44157o140n940o516p530p565o381n206m805m594l855k639j221K98J585
$$ 544157 538017 532077 525561 518031 510466 504085 498879 494074 489480 485625 482986 481765 482063 483648
62382D83648K235K631L695N584P516R110J0909J3326J5975J8447K0902K3539K6177
$$ 483648 485883 488514 492209 497793 505309 514419 525328 538654 554629 573076 593978 617517 643694
62369F43694K8703L1227L3545L5142L6005L6723L7528L8012L7927L7538L6923
$$ 643694 672397 703624 737169 772311 808316 845039 882567 920579 958506 996044 1032967
62358A032967L5730L3956L2174L0675K9025K6755K3791K0018J5177R477L593k198
$$ 1032967 1068697 1102653 1134827 1165502 1194527 1221282 1245073 1265091 1280268 1289745 1293338 1291140
62346A291140q040j3520j7683k0351k2500k4876k7129k8725k9766l0356l0197
$$ 1291140 1283100 1269580 1251897 1231546 1209046 1184170 1157041 1128316 1098550 1068194 1037997
62335A037997k9441k8916k8744k7665k4716k0828j7717j5841j4417j2905j1389
$$ 1037997 1008556 979640 950896 923231 898515 877687 859970 844129 829712 816807 805418
62324H05418r836q058o341n189m567m026l470l173l225l611m568o163p717q424
$$ 805418 795582 787524 781183 775994 771427 767401 763931 760758 757533 753922 749354 743191 735474 727050
62310G27050q435q579r088r363r134r011r560j0365j0460r438p836o543n967n720
$$ 727050 718615 710036 700948 691585 682451 673440 663880 653515 643055 633617 625781 619238 613271 607551
62296F07551n072l723k129j001o29p36q18m53N12J841L052L819M235M606N143
$$ 607551 602479 598756 596627 595626 594997 594261 593443 592990 593502 595343 598395 602214 606449 611055 616198
62281F16198N849O568P080P371P750Q473R277R602R308Q886Q902R555J0787J2441
$$ 616198 622047 628615 635695 643066 650816 659289 668566 678168 687476 696362 705264 714819 725606 738047
62267G38047J4220J5893J7566J9438K1323K2954K4695K7361L1151L5386L9482
$$ 738047 752267 768160 785726 805164 826487 849441 874136 901497 932648 968034 1007516
62256A007516M3584M7891N1943N4995N6708N7061N5870N2737M7252L9165K8723
$$ 1007516 1051100 1098991 1150934 1205929 1262637 1319698 1375568 1428305 1475557 1514722 1543445
62245A543445J7013N592m480j2898j9551k4304k7499k9932l1983l3311l3673l3446
$$ 1543445 1560458 1566050 1561570 1548672 1529121 1504817 1477318 1447386 1415403 1382092 1348419 1314973
62233A314973l2989l2056l0276k7802k5131k2658k0674j9200j7642j5261j2399
$$ 1314973 1281984 1249928 1219652 1191850 1166719 1144061 1123387 1104187 1086545 1071284 1058885
62222A058885j0476j0242j0696j0303q749o814n101l683k588j802r77J90J473
$$ 1058885 1048409 1038167 1027471 1017168 1008419 1001605 996504 992821 990233 988431 987454 987644 989117
62209I89117K478L335M439N789P114Q465J0150J2180J4247J6162J7914J9492K1001
$$ 989117 991595 994930 999369 1005158 1012272 1020737 1030887 1043067 1057314 1073476 1091390 1110882 1131883
62196A131883K2822K5269K8177L1112L3766L5969L7665L9106M0652M2057M2274
$$ 1131883 1154705 1179974 1208151 1239263 1273029 1308998 1346663 1385769 1426421 1468478 1510752
62185A510752M0373L6246L0311K3053J5216P798J308m456r459j2940j4436j4589
$$ 1510752 1551125 1587371 1617682 1640735 1655951 1663749 1665057 1660601 1651142 1638202 1623766 1609177
62173A609177j4139j2745r754n614j421K658P374J2911J8445K3292K7570L1457
$$ 1609177 1595038 1582293 1572539 1566925 1565504 1568162 1575536 1588447 1606892 1630184 1657754 1689211
62161A689211L4567L6316L6401L4705L1269K6571K1480J6766J2783R517O663L862
$$ 1689211 1723778 1760094 1796495 1831200 1862469 1889040 1910520 1927286 1940069 1949586 1956249 1960111
62149A960111J241n85j398j852k531k977k423j160j50N44J871M237O816Q704R991
$$ 1960111 1961352 1960767 1959369 1957517 1954986 1952009 1949586 1948426 1948276 1948820 1950691 1954928 1961744 1970448 1980439
62134A980439J1268J2823J4697J6897J9090K0566K1094K1433K2585K4717K7218
$$ 1980439 1991707 2004530 2019227 2036124 2055214 2075780 2096874 2118307 2140892 2165609 2192827
62123B192827K9559L1713L3793L5742L7397L8786M0148M1716M3386M4716M5337
$$ 2192827 2222386 2254099 2287892 2323634 2361031 2399817 2439965 2481681 2525067 2569783 2615120
62112B615120M5308M5030M4841M4781M4594M3911M2607M1094M0056L9711L9622
$$ 2615120 2660428 2705458 2750299 2795080 2839674 2883585 2926192 2967286 3007342 3047053 3086675
62101C086675L9412L9261L9432L9638L9408L8887L8798L9658M1428M3780M6332
$$ 3086675 3126087 3165348 3204780 3244418 3283826 3322713 3361511 3401169 3442597 3486377 3532709
62090C532709M8758N0988N3298N5998N9209O3115O7905P3114P7509Q0303Q2092
$$ 3532709 3581467 3632455 3685753 3741751 3800960 3864075 3931980 4005094 4082603 4162906 4244998
62079D244998Q3946Q5796Q6489Q5252Q2374P8548P4411P0730O8271O7253O7466
$$ 4244998 4328944 4414740 4501229 4586481 4668855 4747403 4821814 4892544 4960815 5028068 5095534
62068E095534O8938P1697P4866P6911P7085P5893P3808P0411O5327N9242N3096
$$ 5095534 5164472 5236169 5311035 5387946 5465031 5540924 5614732 5685143 5750470 5809712 5862808
62057E862808M6718L9108K9919K0010J0486J757o372j4107k1339k7691l2801l6781
$$ 5862808 5909526 5948634 5978553 5998563 6009049 6010806 6004434 5990327 5968988 5941297 5908496 5871715
62045E871715m0258m3762m6909m8494m7587m4360l9793l4705k9504k4830k1961
$$ 5871715 5831457 5787695 5740786 5692292 5644705 5600345 5560552 5525847 5496343 5471513 5449552
62034E449552k2034k4797k8410l0623l0051k6531k0798j4178q299m626m012o513
$$ 5449552 5427518 5402721 5374311 5343688 5313637 5287106 5266308 5252130 5243831 5239205 5235193 5228680
62022E228680j1293j6646k0545k1672j9989j6286j1416o058q76L480O591Q391
$$ 5228680 5217387 5200741 5180196 5158524 5138535 5122249 5110833 5104775 5103899 5107379 5113970 5122361
62010E122361R219R690J0229J0623J0350R328P995O576M856K780O76j487m445
$$ 5122361 5131580 5141270 5151499 5162122 5172472 5181800 5189795 5196371 5201227 5204007 5204683 5203196 5198751
61997E198751q870j4840k2421l2125m4056n7188p0167q2370r3446j02334j07789
$$ 5198751 5189881 5175041 5152620 5120495 5076439 5019251 4949084 4866714 4773268 4670934 4563145
61986D563145j09747j09275j07228j03770r9101r3820q8398q2997p7825p3103
$$ 4563145 4453398 4344123 4236895 4133125 4034024 3940204 3851806 3768809 3690984 3617881
61976C617881o8620o4019n9559n5887n2985n0027m6435m2448l8592l5191l2551
$$ 3617881 3549261 3485242 3425683 3369796 3316811 3266784 3220349 3177901 3139309 3104118 3071567
61965C071567l0886k9749k8189k5847k3458k1880k1080k0372j9312j8008j6799
$$ 3071567 3040681 3010932 2982743 2956896 2933438 2911558 2890478 2870106 2850794 2832786 2815987
61954B815987j5996j5701j5636j5223j3988j1882r299o840m938l411j545J099
$$ 2815987 2799991 2784290 2768654 2753431 2739443 2727561 2718262 2711422 2706484 2703073 2701528 2702627
61942B702627M060O450P918Q827R622J0465J1370J2314J3225J4197J5499J7030
$$ 2702627 2706687 2713137 2721055 2729882 2739504 2749969 2761339 2773653 2786878 2801075 2816574 2833604
61930B833604J8082J8173J7809J7826J8321J8968K0122K2711K7181L3429M1673
$$ 2833604 2851686 2869859 2887668 2905494 2923815 2942783 2962905 2985616 3012797 3046226 3087899
61919C087899N2436O5583Q0485R7252J16745J38958J62462J86092K10351K36519
$$ 3087899 3140335 3205918 3286403 3383655 3500400 3639358 3801820 3987912 4198263 4434782
61909D434782K65082K95819L28815L64651M03842M46635M92804N40696N86166
$$ 4434782 4699864 4995683 5324498 5689149 6092991 6539626 7032430 7573126 8159292
61900H159292O22461O40797O31026N83132M90282L52432J78322j5364k07633l78645
$$ 8159292 8781753 9422550 10053576 10636708 11126990 11479422 11657744 11642380 11434747 11056102
61890A1056102n14628o09798o64967o85134o77756o51200o12833n67907n20026
$$ 11056102 10541474 9931676 9266709 8581575 7903819 7252619 6639786 6071879 5551853
61881E551853m72010m25723l81752l40147l01477k66612k35730k08191j83358
$$ 5551853 5079843 4654120 4272368 3932221 3630744 3364132 3128402 2920211 2736853
61872B736853j61050j41158j23407j07512r3223q0181o8037n6781m6584l7345
$$ 2736853 2575803 2434645 2311238 2203726 2110503 2030322 1962285 1905504 1858920 1821575
61862A821575k8716k0569j3059o128O69P607J4343K0329K5580L0714L6082M1097
$$ 1821575 1792859 1772290 1759231 1753103 1753772 1761379 1775722 1796051 1821631 1852345 1888427 1929524
61850A929524M4696M6404M6622M5770M3527L9320L3285K6205J8614J0540K357
$$ 1929524 1974220 2020624 2067246 2113016 2156543 2195863 2229148 2255353 2273967 2284507 2286864
61839B286864m752r583j1916j2312j1147q371m106R59N965J0372J3851J5903J5840
$$ 2286864 2282112 2272529 2260613 2248301 2237154 2228783 2224677 2225636 2231601 2241973 2255824 2271727 2287567
61826B287567J3222Q167J215p024j6017k5180l3730m0753m5555m8038m8736m8258
$$ 2287567 2300789 2308956 2310171 2303147 2287130 2261950 2228220 2187467 2141912 2093874 2045138 1996880
61814A996880m6711m3804l9580l4557k8993k2543j5163p781j261M860J1623J8909
$$ 1996880 1950169 1906365 1866785 1832228 1803235 1780692 1765529 1757748 1756487 1761347 1772970 1791879
61802A791879K5652L1739L8226M5357N2023N7886O4490P3100Q2751R1967J01295
$$ 1791879 1817531 1849270 1887496 1932853 1984876 2042762 2107252 2180352 2263103 2355070 2456365
61791B456365J12448J25666J39886J55203J73167J94594K18722K44930K73762
$$ 2456365 2568813 2694479 2834365 2989568 3162735 3357329 3576051 3820981 4094743
61782D094743L05888L41405L80777M25343M76263N33819N98095O69521P48238
$$ 4094743 4400631 4742036 5122813 5548156 6024419 6558238 7156333 7825854 8574092
61773H574092Q33581R23991J015949J102030J170250J205300J189921J106701
$$ 8574092 9407673 10331664 11347613 12449643 13619893 14825193 16015114 17121815
61765A7121815R42732O96819L84012L3601l18023o35829q93487j077746j188059
$$ 17121815 18064547 18761366 19145378 19178979 18860956 18225127 17331640 16253894 15065835
61756A5065835j232422j223193j174742j101243j013957r20326q25744p34910
$$ 15065835 13833413 12610220 11435478 10334235 9320278 8399952 7574208 6839298
61748F839298o50888n74257n04641m42476l88425l41893l01375k65810k34672
$$ 6839298 6188410 5614153 5109512 4667036 4278611 3936718 3635343 3369533 3134861
61739C134861k07269j82848j61085j41771j24416j08839r5467q4347p4505o5127
$$ 3134861 2927592 2744744 2583659 2441888 2317472 2208633 2113166 2028819 1954314 1889187
61729A889187n6723n0292m5891m3002m1555m1533m1994m1793m0949m0286l9893
$$ 1889187 1832464 1782172 1736281 1693279 1651724 1610191 1568197 1526404 1485455 1445169 1405276
61718A405276l8973l7100l4630l1933k9126k6517k4487k2898k1287j9606j8153
$$ 1405276 1366303 1329203 1294573 1262640 1233514 1206997 1182510 1159612 1138325 1118719 1100566
61707A100566j6960j5841j4953j4640j4899j5498j6362j7281j7606j6958j5903
$$ 1100566 1083606 1067765 1052812 1038172 1023273 1007775 991413 974132 956526 939568 923665
61696I23665j5201j4772j4105j3263j2634j2034j1037r940r310q882p876o356
$$ 923665 908464 893692 879587 866324 853690 841656 830619 820679 811369 802487 794611 788255
61684G88255n185m693m344l821l418l235k888k200j375m75N16J096O75l26p25
$$ 788255 783070 778377 774033 770212 766794 763559 760671 758471 757096 756621 757137 758233 758908 758582 757857
61669G57857j48N15M41k30j070j992k834l100k597j742r23k18J00m20j441j710
$$ 757857 757709 758224 758665 758435 757365 755373 752539 749439 746842 745100 744177 743959 744059 743639 742198 740488
61653G40488n12J292K313K321K325L154M490N274M844L616K647K513K820L008
$$ 740488 739976 741268 743581 745902 748227 751381 755871 761145 765989 769605 772252 774765 777585 780593
61639G80593L215L892M946O058P554R942J2664J4331J4435J3856J3379J2567J0645
$$ 780593 783808 787700 792646 798704 806258 816200 828864 843195 857630 871486 884865 897432 908077
61626I08077P603L932j17m294p975j0599j2227j3165j3470j3216j2792j2476j2034
$$ 908077 915680 919612 919495 915201 907226 896627 884400 871235 857765 844549 831757 819281 807247
61613H07247j1221j0270r459q677p833p246p063o678n497m016l366l750m076l359
$$ 807247 796026 785756 776297 767620 759787 752541 745478 738800 733303 729287 725921 722171 718095 714736
61599G14736j878o38m3L69R82J394R36k42j121j043n53n62r58o78Q46K999M915
$$ 714736 712858 712220 712177 712546 713528 714922 715858 715616 714495 713452 712899 712337 711379 710701 711547 714546 719461
61582G19461O422P774Q975R965J1088J2836J5198J7642J9659K1032K1750K2027
$$ 719461 725883 733657 742632 752597 763685 776521 791719 809361 829020 850052 871802 893829
61570H93829K2380K3301K4773K6178K6767K6198K4759K3109K1741K0687J9793
$$ 893829 916209 939510 964283 990461 1017228 1043426 1068185 1091294 1113035 1133722 1153515
61559A153515J9118J8793J8571J7979J6978J6033J5370J4586J3255J1453R375
$$ 1153515 1172633 1191426 1209997 1227976 1244954 1260987 1276357 1290943 1304198 1315651 1325026
61548A325026O827L531l14m226q025j1768j5253j7958j9503j9855j9190j7895
$$ 1325026 1331853 1335384 1335070 1330844 1322819 1311051 1295798 1277840 1258337 1238482 1219292 1201397
61536A201397j6551j5471j4229j2123r195o368m330k733p99J630M139O627R579
$$ 1201397 1184846 1169375 1155146 1143023 1133828 1127460 1123130 1120397 1119598 1121228 1125367 1131994 1141573
61523A141573J3323J7504K1563K5423K9464L4026L9239M5170N1795N8877O6209
$$ 1141573 1154896 1172400 1193963 1219386 1248850 1282876 1322115 1367285 1419080 1477957 1544166
61512A544166P3966Q2579R2317J03222J15330J28524J42243J55886J69542J83736
$$ 1544166 1618132 1700711 1793028 1896250 2011580 2140104 2282347 2438233 2607775 2791511
61502B791511J98164K11138K20478K24445K21398K09292J86481J53133J11493
$$ 2791511 2989675 3200813 3421291 3645736 3867134 4076426 4262907 4416040 4527533
61493D527533O4896J6887k9150p0329j04679j31160j49484j60240j64885j64958
$$ 4527533 4592429 4609316 4580166 4509837 4405158 4273998 4124514 3964274 3799389 3634431
61483C634431j61241j54032j44057j32503j20158j07072r3236p9154o5516n2688
$$ 3634431 3473190 3319158 3175101 3042598 2922440 2815368 2722132 2642978 2577462 2524774
61473B524774m0701k9481j8904q878N27R144J6935K3965L0148L5215L8942M1185
$$ 2524774 2484073 2454592 2435688 2426810 2427337 2436481 2453416 2477381 2507529 2542744 2581686 2622871
61461B622871M1858M1164L9734L8164L6414L4064L1115K8225K6186K5526K6488
$$ 2622871 2664729 2705893 2745627 2783791 2820205 2854269 2885384 2913609 2939795 2965321 2991809
61450B991809K8893L1943L4689L6879L9032M1597M4417M7017M8964M9822M9303
$$ 2991809 3020702 3052645 3087334 3124213 3163245 3204842 3249259 3296276 3345240 3395062 3444365
61439C444365M7655M5397M2376L7579L0370K1413J1916K277p835j8273k8082l6558
$$ 3444365 3492020 3537417 3579793 3617372 3647742 3669155 3681071 3683348 3675513 3657240 3629158 3592600
61427C592600m3908n0438n5588n8339n8413n6502n3331m9157m4238l9126l3987
$$ 3592600 3548692 3498254 3442666 3384327 3325914 3269412 3216081 3166924 3122686 3083560 3049573
61416C049573k8181k1253j3954p559k283K735P913J2625J6282J8959K0541K0275
$$ 3049573 3021392 3000139 2986185 2978626 2976343 2979078 2986991 2999616 3015898 3034857 3055398 3075673
61404C075673J7882J4302J0533O439J684k777n309n369l611m17M545J1344J9482
$$ 3075673 3093555 3107857 3118390 3124829 3126513 3123736 3118427 3113058 3109447 3109030 3113575 3124919 3144401
61391C144401K8802L9771N2627O7034Q2696R9515J17018J34541J52142J70408
$$ 3144401 3173203 3212974 3265601 3332635 3415331 3514846 3631864 3766405 3918547 4088955
61381D088955J89020K06397K21162K32938K41017K43139K36500K19591J92455
$$ 4088955 4277975 4484372 4705534 4938472 5179489 5422628 5659128 5878719 6071174
61372F071174J55915J11689O3011J4080l1612p2152j06797j35510j58980j78310
$$ 6071174 6227089 6338778 6401789 6415869 6384257 6312105 6205308 6069798 5910818 5732508
61362E732508j94182k06447k14690k18850k19149k15753k08961j99649j89072
$$ 5732508 5538326 5331879 5117189 4898339 4679190 4463437 4254476 4054827 3865755
61353C865755j78006j66361j53902j41100j28876j17586j06801r6147q5844p6100
$$ 3865755 3687749 3521388 3367486 3226386 3097510 2979924 2873123 2776976 2691132 2615032
61343B615032o6497n6428m5810l4968k4200j3899m697L150J0229J7189K3716K8909
$$ 2615032 2548535 2492107 2446297 2411329 2387129 2373230 2368533 2371683 2381912 2399101 2422817 2451726
61331B451726L2438L4610L5519L4979L3305L1247K9084K6482K3449K0577J8209
$$ 2451726 2484164 2518774 2554293 2589272 2622577 2653824 2682908 2709390 2732839 2753416 2771625
61320B771625J6064J3990J2339J1301J0495R660R076R018R247R419R434R068P852
$$ 2771625 2787689 2801679 2814018 2825319 2835814 2845474 2854550 2863568 2872815 2882234 2891668 2900736 2908588
61307B908588N687L067L14k894o807j0989j4964j8957k3423k8172l2565l6282
$$ 2908588 2914275 2917342 2917656 2914762 2907955 2896966 2882002 2863045 2839622 2811450 2778885 2742603
61295B742603l9292m1270m1716m0665l8750l6461l3714l0210k5979k1405j6924
$$ 2742603 2703311 2662041 2620325 2579660 2540910 2504449 2470735 2440525 2414546 2393141 2376217
61284B376217j2841r378o741m928l556k186q45jK76P02J912L526M616M875M713
$$ 2376217 2363376 2353998 2347257 2342329 2338773 2336587 2335742 2335741 2336017 2336719 2338631 2342157 2346773 2351648 2356361
61269B356361M366L589K289P27r42k650l836l559j448K050O539J2156J8922K6371
$$ 2356361 2360727 2364316 2366605 2367332 2366390 2363740 2359904 2356345 2354897 2356947 2363486 2375642 2394564 2420935
61255B420935L4207M2823N2634O3303P3919Q3674R2085R8857J03707J06018J04524
$$ 2420935 2455142 2497965 2550599 2613902 2687821 2771495 2863580 2962437 3066144 3172162 3276686
61244C276686R7750Q4815O5502L9770Q086k7515o3480r6233j23327j43251j55241
$$ 3276686 3374436 3459251 3524753 3564523 3572609 3545094 3481614 3385381 3262054 3118803 2963562
61233B963562j59688j58047j51807j42036j30023j17456j05289r3185q0742o8686
$$ 2963562 2803874 2645827 2494020 2351984 2221961 2104505 1999216 1906031 1825289 1756603
61223A756603n8184m9490m1992l5199k9111k3852j9580j6413j4045j1707q964
$$ 1756603 1698419 1648929 1606937 1571738 1542627 1518775 1499195 1482782 1468737 1457030 1448066
61212A448066o143l681j465O88K414L288L574L966M826O084P543Q837R557R894
$$ 1448066 1441923 1438242 1436777 1437465 1439879 1443167 1446741 1450707 1455533 1461617 1469160 1477997 1487554 1497448
61198A497448J0720J2453J4274J5046J4639J3719J2579J0848Q194M714Q41k680
$$ 1497448 1508168 1520621 1534895 1549941 1564580 1578299 1590878 1601726 1609920 1614634 1615475 1612795
61186A612795n015o051o772q274j0545j2760j4473j5902j7190j8078j8369j8270
$$ 1612795 1607780 1601729 1594957 1586683 1576138 1563378 1548905 1533003 1515813 1497735 1479366 1461096
61174A461096j8224j8766k0363k2962k5780k7928k9194k9978l0619l1108l1319
$$ 1461096 1442872 1424106 1403743 1380781 1355001 1327073 1297879 1267901 1237282 1206174 1174855
61163A174855l1181l0744l0303l0242l0511l0547k9953k8884k7553k5774k3423
$$ 1174855 1143674 1112930 1082627 1052385 1021874 991327 961374 932490 904937 879163 855740
61152H55740k0888j8597j6428j4106j1831r984q461o844m961k835m04K220M482
$$ 855740 834852 816255 799827 785721 773890 763906 755445 748601 743640 740805 740401 742621 747103
61139G47103N951O932Q007R256J0454J1777J3586J5627J7095J7499J6958J5644
$$ 747103 753054 759986 767993 777249 787703 799480 813066 828693 845788 863287 880245 895889
61127H95889J3582J1025Q558O595N166M222L837L935M155M129L799L316K705J720
$$ 895889 909471 920496 929054 935649 940815 945037 948874 952809 956964 961093 964892 968208 970913 972633
61113I72633J50j680k999l458l710m614n996o870o862o609o580o351n561m787
$$ 972633 972783 971103 968104 964646 960936 956322 950326 943456 936594 929985 923405 917054 911493 906706
61099I06706m782n337n630n342m843m538m548m849n274n585n791o082o287n900
$$ 906706 901924 896587 890957 885615 880772 876234 871686 866837 861563 855978 850187 844105 837818 831918
61085H31918n011m622n515p276q900r927j0433j0414r855r102q592q387q344q439
$$ 831918 826907 822285 816770 809494 800594 790667 780234 769820 759965 750863 742271 733884 725540 717101
61071G17101q638q759q809q962q972q240o759n349m545l973l256k633k124j059
$$ 717101 708463 699704 690895 681933 672961 664721 657962 652613 648068 644095 640839 638206 636082 635023
61057F35023P59K335K895L183M232N626O283O335O841P941Q768R051R445J0192
$$ 635023 635782 638117 641012 644195 648427 654053 660336 666671 673512 681453 690221 699272 708717 718909
61043G18909J0669J0507J0079R585Q603O990N415M566M255L730K582J164K35J95
$$ 718909 729578 740085 750164 759749 768352 775342 780757 785323 789578 793308 795890 797054 797289 797484
61029G97484O01O55K41K3L23O53O58P74J358J907J934J865K253K701K576K200
$$ 797484 798085 798740 798981 799004 799327 799980 800638 801412 802770 804677 806611 808476 810729 813430 816006 818206
61013H18206K295K764L056L356M313N903P570R241J1144J2926J4024J4725J5793
$$ 818206 820501 823265 826321 829677 833990 839893 847463 856704 867848 880774 894798 909523 925316
61000I25316J7171J8081J8261J8124J7778J6915J5575J4117J2469J0305P883N903
$$ 925316 942487 960568 978829 996953 1014731 1031646 1047221 1061338 1073807 1084112 1091995 1097898
60988A097898M603L749L336L479L893M321N172O914R170J1332J3591J6368J9126
$$ 1097898 1102501 1106250 1109586 1113065 1116958 1121279 1126451 1133365 1142535 1153867 1167458 1183826 1202952
60975A202952K0866K1562K2054K2832K3975K5801K8384L0798L2083L2716L3845
$$ 1202952 1223818 1245380 1267434 1290266 1314241 1340042 1368426 1399224 1431307 1464023 1497868
60964A497868L5505L6930L8304M0613M3854M6961M9563N2437N6136O0424O5146
$$ 1497868 1533373 1570303 1608607 1649220 1693074 1740035 1789598 1842035 1898171 1958595 2023741
60953B023741P0475P6233Q2034Q8081R4842J02091J09172J15819J21761J26411
$$ 2023741 2094216 2170449 2252483 2340564 2435406 2537497 2646669 2762488 2884249 3010660
60943C010660J30348J36343J47386J64307J86771K15303K50148K89126L29184
$$ 3010660 3141008 3277351 3424737 3589044 3775815 3991118 4241266 4530392 4859576
60934D859576L69673M12005M57372N07784N68365O45215P41534Q59036J002002
$$ 4859576 5229249 5641254 6098626 6606410 7174775 7819990 8561524 9420560 10422562
60925A0422562J175927J384038J630996J929244K295563K743809L288612L942517
$$ 10422562 11598489 12982527 14613523 16542767 18838330 21582139 24870751 28813268
60917B8813268M666582N292089N517502N059005L871330K238984O35301n29763
$$ 28813268 33479850 38771939 44289441 49348446 53219776 55458760 56094061 55564298
60909E5564298j061749r65812l79536M34043J083072J156926M42369r27847k542733
$$ 55564298 54502549 53536737 53157201 53591244 54674316 55831242 56273611 55345764 52803031
60900E2803031l947550m855217n204915n094413m684816m134077l560095l026958
$$ 52803031 48855481 44000264 38795349 33700936 29016120 24882043 21321948 18294990
60892A8294990k555154k144728j791333j489537j233185j017978q41664p00978
$$ 18294990 15739836 13595108 11803775 10314238 9081053 8063075 7221411 6520433
60884F520433n90691n05540m40476l89392l46598l09687k78437k51221k25219
$$ 6520433 5929742 5424202 4983726 4594334 4247736 3938049 3659612 3408391 3183172
60875C183172j99816j76651j56086j36770j19144j06118r9106r5866r3442r0995
$$ 3183172 2983356 2806705 2650619 2513849 2394705 2288587 2189481 2093615 2000173 1909178
60865A909178q8592q5363q0476p4362o7710o0487n2979m6394m1415l7191l2779
$$ 1909178 1820586 1735223 1654747 1580385 1512675 1452188 1399209 1352815 1311400 1274209 1241430
60854A241430k8461k4830k1601j8342j5414j3240j1416r366p298n750m685l756
$$ 1241430 1212969 1188139 1166538 1148196 1132782 1119542 1108126 1098760 1091462 1085712 1081027 1077271
60842A077271k961k562k690l332m343n324n967o610p796r240j0005r824r425r373
$$ 1077271 1074310 1071748 1069058 1065726 1061383 1056059 1050092 1043482 1035686 1026446 1016441 1006617 997192 987819
60828I87819r352q959q464q327q542q790q859q710q458q372q600q931r148r412
$$ 987819 978467 969508 961044 952717 944175 935385 926526 917816 909358 900986 892386 883455 874307 864895
60814H64895r814r907r299q369p654o860n330l205j233M01K110L958N603P121
$$ 864895 855081 845174 835875 827506 819852 812992 807662 804457 803224 803625 805735 809693 815296 822417
60800H22417Q848J0532J1612J2297J3314J4582J5194J4725J3579J1995R725O933
$$ 822417 831265 841797 853409 865706 879020 893602 908796 923521 937100 949095 958820 965753
60788I65753M356K393P96n92j666k657l984n452o468o950p112o493m496j814M9
$$ 965753 970109 972502 973298 972706 971040 968383 964399 958947 952479 945529 938417 931924 927428 925614 925663
60773I25663Q38J763L396M714M726L765K643J692J169J388J853J433L1j049j103
$$ 925663 926501 928264 931660 936374 941100 944865 947508 949200 950369 951757 953610 955043 955074 954025 952922
60758I52922j083j822k458j823m25K63j07n47k33R00K589M307N199M918M347M655
$$ 952922 951839 950017 947559 945736 945311 945574 945467 944920 944687 945587 948176 952483 957682 962600 966947 971602
60742I71602N811O705O557N435L558R57k098n038p513r626j1496j2976j3822j4014
$$ 971602 977413 984118 990675 996110 999668 1000625 998527 993489 985976 976350 964854 951878 938056 924042
60728I24042j3920j4173j5141j6344j6685j5560j3435j1222r380p880o621n485
$$ 924042 910122 895949 880808 864464 847779 832219 818784 807562 798182 790302 783681 778196
60716G78196m249k830j526p02m69p57j466k245k494k002j432j710k940m253m820
$$ 778196 773947 771117 769591 768889 768420 767663 766197 763952 761458 759456 758024 756314 753374 749121 744301
60701G44301m781n034o177p841r136r646r767j0072j0678j1306j1596j1247j0201
$$ 744301 739520 734486 728309 720468 711332 701686 691919 681847 671169 659863 648267 637020 626819
60688F26819q941q138p747o994n572m179l318k416r56L31O26P64K292M987O909
$$ 626819 617878 609740 601993 594999 589427 585248 581930 579514 578558 578889 579515 580279 582571 587558 594467
60673E94467P115O838P443Q621R280R124Q523P717O935O551O422N739M215K787
$$ 594467 601582 608420 615863 624484 633764 642888 651411 659128 666063 672614 679036 684775 688990 691777
60659F91777K479L164M158N348O897Q335Q953Q883R000R834J1250J3029J5039
$$ 691777 694256 697420 701578 706926 713823 722158 731111 739994 748994 758828 770078 783107 798146
60646G98146J6829J7761J7775J7573J7798J8282J8313J7447J5886J4080J2155
$$ 798146 814975 832736 850511 868084 885882 904164 922477 939924 955810 969890 982045
60635I82045R915P379M912K687L51k349m977o985q627j0639j3058j5107j6292
$$ 982045 991960 999339 1004251 1006938 1007289 1004940 999963 992978 984351 973712 960654 945547 929255
60622I29255j6910j7343j7521j7335j6917j6279j5192j3691j2204j0887r392p533
$$ 929255 912345 895002 877481 860146 843229 826950 811758 798067 785863 774976 765584 758051
60610G58051n677m227l159k283j502n97O75K112L196L986N208P173R184J0516
$$ 758051 752374 748147 744988 742705 741203 740606 741281 743393 746589 750575 755783 762956 772140 782656
60596G82656J1488J3028J5423J8054K0148K1561K2822K4547K6665K8387K9157
$$ 782656 794144 807172 822595 840649 860797 882358 905180 929727 956392 984779 1013936
60585A013936K9341K9420K8849K6538K2431J7633J2866P758J938m196j0276j6531
$$ 1013936 1043277 1072697 1101546 1128084 1150515 1168148 1181014 1188772 1190710 1186514 1176238 1159707
60573A159707k2922k8428l1855l2906l1987k9671k6876k4776k3701k2687k0740
$$ 1159707 1136785 1108357 1076502 1043596 1011609 981938 955062 930286 906585 883898 863158
60562H63158j8137j5753j3713j1527r256p579o807o513o135n441m415l207k134
$$ 863158 845021 829268 815555 804028 794772 787193 780386 773873 767738 762297 757882 754675 752541
60549G52541j319m72O71J844K569K874L254M020M985N786O352P093Q628J1097
$$ 752541 751222 750750 751421 753265 755834 758708 761962 765982 770967 776753 783105 790198 798826 809923
60535H09923J3783J5847J7475J9737K3196K7226L0990L4466L8089M2050M6551
$$ 809923 823706 839553 857028 876765 899961 927187 958177 992643 1030732 1072782 1119333
60524A119333N2225N9535O8056P6983Q6280R6682J08421J20175J29241J32627
$$ 1119333 1171558 1231093 1299149 1376132 1462412 1559094 1667515 1787690 1916931 2049558
60514B049558J28341J16029R6531P1025M1060R409j9912m3078n7867o3779o1436
$$ 2049558 2177899 2293928 2390459 2461484 2502544 2511953 2492041 2448963 2391096 2327317 2265881
60503B265881n2311l8458k1811l789J4250L0554M3360N1527N4636N2809M6695
$$ 2265881 2213570 2175112 2153301 2149512 2163762 2194316 2237676 2289203 2343839 2396648 2443343
60492B443343L7344K5878J3566K250n954r734q917l703N785J8951L4622N2196
$$ 2443343 2480687 2506565 2520131 2522381 2516427 2506693 2497776 2494073 2499858 2518809 2553431 2605627
60480B605627P2350R5910J22589J51520J82606K16449K53026K91101L29103L66291
$$ 2605627 2677977 2773887 2896476 3047996 3230602 3447051 3700077 3991178 4320281 4686572
60470D686572M03186M41417M83318N31474N88448O56507P36583Q26241R17390
$$ 4686572 5089758 5531175 6014493 6545967 7134415 7790922 8527505 9353746 10271136
60461A0271136R94765J036687J019725R26696P53428N09531K14153j07730m26395
$$ 10271136 11265901 12302588 13322313 14249009 15002437 15511968 15726121 15618391 15191996
60452A5191996p09905r31115j075287j142402j143538j095352j015528r19447
$$ 15191996 14482091 13550976 12475689 11333287 10189749 9094397 8078869 7159422
60444G159422q18364p19571o27503n44324m70286m04793l47499k98229k56262
$$ 7159422 6341058 5621487 4993984 4449660 3979374 3574581 3227082 2928853 2672591
60435B672591k20444j89851j63955j42217j23957j08392r4574q1698o9848o0024
$$ 2672591 2452147 2262296 2098341 1956124 1832167 1723775 1629201 1547503 1477655 1417631
60425A417631n2861m7759m3655m0234l7716l5917l4189l2096k9597k6814k4056
$$ 1417631 1364770 1317011 1273356 1233122 1195406 1159489 1125300 1093204 1063607 1036793 1012737
60414A012737k1783k0091j8525j6763j5099j3833j2733j1550j0596j0159r896
$$ 1012737 990954 970863 952338 935575 920476 906643 893910 882360 871764 861605 851709
60403H51709r389q764q253p579o515n442m735m121l392l110l687m453m640m738
$$ 851709 842320 833556 825303 817724 811209 805767 801032 796911 793519 790409 786722 782269 777629 772891
60389G72891n691p157p917p742p582p875p991p587p237p377p586p415p087o881
$$ 772891 767200 760043 752126 744384 736802 728927 720936 713349 706112 698735 691149 683734 676647 669766
60375F69766o487n514m178l083k534k391k355k275k291k598k983k836j931q68
$$ 669766 663279 657765 653587 650504 647970 645579 643224 640949 638658 636060 633077 630241 628310 627442
60361F27442l38l13l75m42n98o17l48k15n89r88p41j31K7k44j35O07J337J601
$$ 627442 627104 626791 626416 625974 625376 624759 624411 624196 623607 622619 621878 621747 621774 621530 621395 622002 623339 624940
60343F24940J635J643J443J044Q06Q23Q16P55R58J447J884K221K755L441L909
$$ 624940 626575 628218 629661 630705 631511 632334 633150 633905 634863 636310 638194 640415 643170 646611 650520
60328F50520M200M761N557O012O005O053O299O177N417M560M033L523K819K467
$$ 650520 654720 659481 665038 671050 677055 683108 689407 695584 701001 705561 709594 713117 715936 718403
60314G18403K978L982M890N862P308Q880R761R781R466R026Q067O383M376K506
$$ 718403 721381 725363 730253 736115 743423 752303 762064 771845 781311 790337 798404 804787 809163 811669
60300H11669Q17o72j568j587j178j069j204o63J100L370M991N776O522P784R321
$$ 811669 812486 811814 810246 808659 807481 806412 805208 804545 805645 809015 814006 819782 826304 834088 843409
60285H43409J0891J2800J5209J7466J8669J8625J7812J6582J4953J2936J0732
$$ 843409 854300 867100 882309 899775 918444 937069 954881 971463 986416 999352 1010084
60274A010084Q683P306P161Q303J0119J2027J4139J6940K0524K4519K8593L2689
$$ 1010084 1018767 1026073 1033234 1041537 1051656 1063683 1077822 1094762 1115286 1139805 1168398 1201087
60262A201087L6938M1551M6616N1850N6871O1888O7591P4124Q0774Q6993R3033
$$ 1201087 1238025 1279576 1326192 1378042 1434913 1496801 1564392 1638516 1719290 1806283 1899316
60251A899316R9066J04256J07522J08703J08274J06217J01979R5283Q6413P5916
$$ 1899316 1998382 2102638 2210160 2318863 2427137 2533354 2635333 2730616 2817029 2892945
60241B892945O4519N2870M0848K7612J2974j800j5239k7077l7554m5993n1288
$$ 2892945 2957464 3010334 3051182 3078794 3091768 3089968 3074729 3047652 3010098 2964105 2912817
60230B912817n3448n3534n2037m8477m2528l4635k5422j5408n175M991J5582K7140
$$ 2912817 2859369 2805835 2753798 2705321 2662793 2628158 2602736 2587328 2582153 2587144 2602726 2629866
60218B629866L9123N0354O0530P0311P9983Q9006R6880J03411J08014J09682J07901
$$ 2629866 2668989 2719343 2779873 2850184 2930167 3019173 3116053 3219464 3327478 3437160 3545061
60207C545061J02818R4487Q2875O8758N3521L7753K0931K891j5251l2099m7171
$$ 3545061 3647879 3742366 3825241 3893999 3947520 3985273 4006204 4009095 3993844 3961745 3914574
60196C914574o0571p2113q1246q7472r0424q9907q6104p9554p0812o0317m8486
$$ 3914574 3854003 3781890 3700644 3613172 3522748 3432841 3346737 3267183 3196371 3136054 3087568
60185C087568l5635k1995q180M748J6226K6914L7724M8454N8073O5986P2130P6074
$$ 3087568 3051933 3029938 3021758 3026506 3042732 3069646 3107370 3155824 3213897 3279883 3352013 3428087
60173C428087P7119P5284P1320O5745N8706N0651M2198L3468K4522J6328J0244
$$ 3428087 3505206 3580490 3651810 3717555 3776261 3826912 3869110 3902578 3927100 3943428 3953672
60162C953672O592M867N306R030J6434K6482L7745M9142N9589O8123P4623P9426
$$ 3953672 3960264 3965131 3970437 3979467 3995901 4022383 4060128 4109270 4168859 4236982 4311605 4391031
60150D391031Q2333Q3177Q3462Q5943R2301J02412J16008J33401J54137J76532
$$ 4391031 4473364 4556541 4640003 4725946 4818247 4920659 5036667 5170068 5324205 5500737
60140E500737J99271K22092K44250K63838K79507K91374K99211L01172K95593
$$ 5500737 5700008 5922100 6166350 6430188 6709695 7001069 7300280 7601452 7897045
60131G897045K82907K64437K40420K10710J76521J39781J01157O0142J6814k7740
$$ 7897045 8179952 8444389 8684809 8895519 9072040 9211821 9312978 9373120 9389934 9362194
60121I362194p2522j16917j59849j99603k34434k62638k82308k92090k92265k84390
$$ 9362194 9289672 9172755 9012906 8813303 8578869 8316231 8033923 7741833 7449568 7165178
60111G165178k69764k48823k22117j91283j58738j26579r5731o6135l7739j1207
$$ 7165178 6895414 6646591 6424474 6233191 6074453 5947874 5852143 5786008 5748269 5737062
60101E737062J2843L5050N6799P8220R7467J12409J22241J26890J25716J17717
$$ 5737062 5749905 5784955 5841754 5919974 6017441 6129850 6252091 6378981 6504697 6622414
60091F622414J02669Q1428N5521K6980j839k8979n3348p4324r1523j05276j16631
$$ 6622414 6725083 6806511 6862032 6889012 6887173 6858194 6804846 6730522 6638999 6533723 6417092
60080F417092j26180j33329j37144j37362j34115j27329j17163j04539r0658p6447
$$ 6417092 6290912 6157583 6020439 5883077 5748962 5621633 5504470 5399931 5309273 5232826
60070E232826o3001n1806m3820l8762l5994l5373l6317l6675l3787k6649j6226
$$ 5232826 5169825 5118019 5074199 5035437 4999443 4964070 4927753 4891078 4857291 4830642 4814416
60059D814416l823R987K4949M0507N5769O9537Q0362Q7180Q9845Q8620Q3252P3061
$$ 4814416 4810593 4820580 4845529 4886036 4941805 5011342 5091704 5178884 5268729 5357349 5440601 5513662
60047E513662N7843L8184J5022j0609l7337o3531q7698j08620j25298j37189j44445
$$ 5513662 5571505 5609689 5624711 5614102 5576765 5513234 5425536 5316916 5191618 5054429 4909984
60036D909984j47604j47006j42794j35347j25407j13682j00522q6021p0406n4298
$$ 4909984 4762380 4615374 4472580 4337233 4211826 4098144 3997622 3911601 3841195 3786897
60026C786897l8412k2952p479Q236K3524L7418M9780O1328P2798Q4660R7364J10947
$$ 3786897 3748485 3725533 3718054 3726290 3749814 3787232 3837012 3898340 3971138 4055798 4153162 4264109
60014D264109J24242J35359J43058J47016J46800J41675J31584J17322R9512P8409
$$ 4264109 4388351 4523710 4666768 4813784 4960584 5102259 5233843 5351165 5450677 5529086
60004E529086N4946L0740O577j8074m3427o8318r1309j11736j28900j41336j47905
$$ 5529086 5584032 5614772 5621349 5603275 5559848 5491530 5400221 5288485 5159585 5018249 4870344
59993D870344j48857j45039j36851j24800j10191r4276p7403n9857m2660k6554
$$ 4870344 4721487 4576448 4439597 4314797 4204606 4110330 4032927 3973070 3930410 3903856
59983C903856j0928N092K1109L6058M9752O2622P4361Q4050R1363R6560R9483
$$ 3903856 3892928 3898020 3919129 3955187 4004939 4067561 4141922 4225972 4317335 4413895 4513378
59972D513378R9541R6567R0814Q2396P1552N9291M6895L4953K3543J3089M164
$$ 4513378 4612919 4709486 4800300 4882696 4954248 5013539 5060434 5095387 5118930 5132019 5136183
59961E136183l222r165j2909j3196r441j869R403K4515M3203O4709Q8431J14109
$$ 5136183 5132961 5123796 5110887 5097691 5088250 5086381 5095784 5120299 5163502 5228211 5316642 5430751
59949E430751J41445J70060J99693K30025K60499K90610L19960L47558L71520
$$ 5430751 5572196 5742256 5941949 6171974 6432473 6723083 7043043 7390601 7762121
59940G762121L89871M00994M02674L91444L63895L18480K55759J77800Q8382o738
$$ 7762121 8151992 8552986 8955660 9347104 9710999 10029479 10285238 10463038 10551420 10544682
59930A0544682j01121j89285k66862l30077l76334m05262m18233m17100m03996
$$ 10544682 10443561 10254276 9987414 9657337 9281003 8875741 8457508 8040408 7636412
59921G636412l81761l53385l21018k86150k50213k14196j78157j42159j07295
$$ 7636412 7254651 6901266 6580248 6294098 6043885 5829689 5651532 5509373 5402078
59912E402078p4712m4068j4171J5148M3006O9130R4235J18536J40930J59828J73958
$$ 5402078 5327366 5283298 5269127 5284275 5327281 5396411 5490646 5609182 5750112 5909940 6083898
59901F083898J82148J83131J75828J59367J33071R7061N2849K835n0519j04481
$$ 6083898 6266046 6449177 6625005 6784372 6917443 7014504 7067353 7070188 7019669 6915188
59891F915188j55549k00275k36565k63671k81396k90115k91113k85862k75179
$$ 6915188 6759639 6559364 6322799 6059128 5777732 5487617 5196504 4910642 4635463
59882D635463k59816k41347k21401k00444j78507j56732j36889j19416j03232
$$ 4635463 4375647 4134300 3912899 3712455 3533948 3377216 3240327 3120911 3017679
59873C017679q7490p2435n8533m5959l5143k6752k0927j7301j5792j6559j9161
$$ 3017679 2930189 2857754 2799221 2753262 2718119 2691367 2670440 2653139 2637347 2620788 2601627
59862B601627k2612k6253k9859l3022l5324l6860l7674l6966l3842k8670k2680
$$ 2601627 2579015 2552762 2522903 2489881 2454557 2417697 2380023 2343057 2309215 2280545 2257865
59851B257865j6451r891l387K270O832J0246J1509R354M064k737j0026j7677k4863
$$ 2257865 2241414 2231523 2228136 2230406 2237238 2247484 2258993 2268347 2272411 2269674 2259648 2241971 2217108
59838B217108k9934l2215l2498l1346k8341k3493j7921j2518p135j598L680Q702
$$ 2217108 2187174 2154959 2122461 2091115 2062774 2039281 2021360 2008842 2001707 2000109 2003789 2012491
59826B012491J4219K0383K6216L1119L5769M0855M5909N0170N3581N6121N7043
$$ 2012491 2026710 2047093 2073309 2104428 2140197 2181052 2226961 2277131 2330712 2386833 2443876
59815B443876N5677N2258M7184M0200L1176K1104J1522L303l366q313j1266j2117
$$ 2443876 2499553 2551811 2598995 2639195 2670371 2691475 2702997 2706300 2702934 2694621 2683355 2671238
59803B671238j0905p812l350K032Q575J6869K6772L7490M8836O1477P5719R1051
$$ 2671238 2660333 2652521 2649171 2651203 2659778 2676647 2703419 2740909 2789745 2851222 2926941 3017992
59791C017992J07253J24924J44504J65829J89212K15725K45543K76794L06799
$$ 3017992 3125245 3250169 3394673 3560502 3749714 3965439 4210982 4487776 4794575
59782D794575L33253L52808L59024L43489K99876K27567J32674K6659p6758j65490
$$ 4794575 5127828 5480636 5839660 6183149 6483025 6710592 6843266 6869925 6793167 6627677
59772F627677k31897k73304k90997k88964k72552k46992k16698j85590j57095
$$ 6627677 6395780 6122476 5831479 5542515 5269963 5022971 4806273 4620683 4463588
59763D463588j33037j12824r4361p5815n6534l6764j7125J677J8896L3672M5191
$$ 4463588 4330551 4217727 4123366 4047551 3991017 3954253 3937128 3938805 3957701 3991373 4036564
59752D036564N3425N9799O6636P5732Q7675J02227J18812J36609J54973J74053
$$ 4036564 4089989 4149788 4216424 4292156 4379831 4482058 4600870 4737479 4892452 5066505
59742E066505J94572K16923K40902K66257K92946L20795L49492L78924M08953
$$ 5066505 5261077 5478000 5718902 5985159 6278105 6598900 6948392 7327316 7736269
59733G736269M38797M67136M92574N13358N26826N30149N21767N01674M70780
$$ 7736269 8175066 8642202 9134776 9648134 10174960 10705109 11226876 11728550 12199330
59724A2199330M31146L86722L42660L03551K72933K53976K49069K58525K80904
$$ 12199330 12630476 13017198 13359858 13663409 13936342 14190318 14439387 14697912 14978816
59715A4978816L14817L59168M11486M67579N23326N75519O20397O52740O67258
$$ 14978816 15293633 15652801 16064287 16531866 17055192 17630711 18251108 18903848 19571106
59706A9571106O60033O28309N70515M87623L83820K65279J39337J5025r7541j90150
$$ 19571106 20231139 20859448 21429963 21917586 22301406 22566685 22706022 22721047 22623506 22433356
59696B2433356k58648l01810l19500l12985k85689k41890j84891j17187m1503
$$ 22433356 22174708 21872898 21553398 21240413 20954724 20712834 20527943 20410756 20369253
59687B0369253L9801J25895K16918L12501M11688N13793O18052P22294Q22463
$$ 20369253 20409054 20534949 20751867 21064368 21476056 21989849 22607901 23330195 24152658
59678B4152658R12887R86077J032377J040825J000953R04389P46609N29554K63842
$$ 24152658 25065545 26051622 27083999 28124824 29125777 30030166 30776775 31306329 31570171
59669C1570171l1573l32743o15377q59011j049383j178992j246855j258335j223871
$$ 31570171 31538598 31205855 30590478 29731467 28682084 27503092 26256237 24997902 23774031
59660B3774031j155568j064134r59505q53755p61047o93517o57638o53977o77817
$$ 23774031 22618463 21554329 20594824 19741069 18980022 18286505 17628867 16974890 16297073
59651A6297073p18892p63043p97405q14870q13747p94954p61110p16826o67176
$$ 16297073 15578181 14815138 14017733 13202863 12389116 11594162 10833052 10116226 9449050
59642I449050o15426n63129n11878m63426m18368l76261l37122l01699k70192
$$ 9449050 8833624 8270495 7758617 7295191 6876823 6500562 6163440 5861741 5591549
59633E591549k41799k15712j91821j70276j50991j33626j17615j02357q7839p4709
$$ 5591549 5349750 5134038 4942217 4771941 4620950 4487324 4369709 4267352 4179513 4104804
59623D104804o3302n3051m3491l5257k9321k5786k4286k5143k9048l5725m3832
$$ 4104804 4041502 3988451 3944960 3909703 3880382 3854596 3830310 3805167 3776119 3740394 3696562
59612C696562n2138o0141o7635p4338p9884q3814q5659q5396q3486q0165p5244
$$ 3696562 3644424 3584283 3516648 3442310 3362426 3278612 3192953 3107557 3024071 2943906 2868662
59601B868662o8947o2252n5806m9153m1787l4273k7537k1607j5965j0597n825
$$ 2868662 2799715 2737463 2681657 2632504 2590717 2556444 2528907 2507300 2491335 2480738 2474913
59590B474913j534K517O042Q729J0985J3270J5097J5691J5302J4910J4931J5153
$$ 2474913 2473379 2475896 2481938 2490667 2501652 2514922 2530019 2545710 2561012 2575922 2590853 2606006
59578B606006J5725J7088J9107K1207K3472K6743L1496L7280M3323M9237N5194
$$ 2606006 2621731 2638819 2657926 2679133 2702605 2729348 2760844 2798124 2841447 2890684 2945878
59567B945878O1828O9713P8627Q7710R6748J06692J18323J31111J44216J57946
$$ 2945878 3007706 3077419 3156046 3243756 3340504 3447196 3565519 3696630 3840846 3998792
59557C998792J73196J89882K07076K24462K42527K61444K80665K99555L17468
$$ 3998792 4171988 4361870 4568946 4793408 5035935 5297379 5578044 5877599 6195067
59548F195067L33326L45990L55231L61617L65466L66491L64526L60021L53912
$$ 6195067 6528393 6874383 7229614 7591231 7956697 8323188 8687714 9047735 9401647
59539I401647L47287L40778L33665L23933L09723K90123K64012K29093J83361
$$ 9401647 9748934 10089712 10423377 10747310 11057033 11347156 11611168 11840261 12023622
59530A2023622J27132O2384r620q8564j72713k57503l36946m05863m60802m99897
$$ 12023622 12150754 12213138 12203518 12114954 11942241 11684738 11347792 10941929 10481127 9981230
59520I981230n22638n29766n23166n05835m81334m52667m21674l89713l58321
$$ 9981230 9458592 8928826 8405660 7899825 7418491 6965824 6544150 6154437 5796116
59511E796116l28686l01005k75101k51182k29342k08836j88810j69352j51072
$$ 5796116 5467430 5166425 4891324 4640142 4410800 4201964 4013154 3843802 3692730
59502C692730j33981j17718j02538q9084p7354o6692n6632m7039l7716k8647k0275
$$ 3692730 3558749 3441031 3338493 3249409 3172055 3105363 3048731 3001692 2963976 2935329 2915054
59491B915054j2745n270K870J1179J8809K6203L4615M4263N4194O3983P4384Q6149
$$ 2915054 2902309 2897039 2899909 2911088 2929897 2956100 2990715 3034978 3089172 3153155 3227539 3313688
59479C313688R9196J13160J27917J43297J58995J74930J91150K07363K22961K37270
$$ 3313688 3412884 3526044 3653961 3797258 3956253 4131183 4322333 4529696 4752657 4989927
59469D989927K49250K57303K59939K56244K45066K24470J93113J51843J03106
$$ 4989927 5239177 5496480 5756419 6012663 6257729 6482199 6675312 6827155 6930261
59460F930261M9204p771o4947j18979j67355k08439k40658k62971k76006k81461
$$ 6930261 6979465 6971694 6906747 6787768 6620413 6411974 6171316 5908345 5632339 5350878
59450E350878k80454k73581k62211k48247k32512k14820j95718j76802j59123
$$ 5350878 5070424 4796843 4534632 4286385 4053873 3839053 3643335 3466533 3307410
59441C307410j42591j27189j13382j01008q9141p7515o6874n7451m8370l9222
$$ 3307410 3164819 3037630 2924248 2823240 2734099 2656584 2589710 2532259 2483889 2444667
59431B444667l0958k4352j8581j2248n156J730P572J2143J5507J7996K0318K3091
$$ 2444667 2413709 2389357 2370776 2358528 2353372 2355102 2362674 2374817 2390324 2408320 2428638 2451729
59419B451729K6285K9456L2478L5855M0310M5989N2202N8307O4868P3326Q4141
$$ 2451729 2478014 2507470 2539948 2575803 2616113 2662102 2714304 2772611 2837479 2910805 2994946
59408B994946R6216J08853J23357J41235J61355J80371J96131K09606K23567K40720
$$ 2994946 3091162 3200015 3323372 3464607 3625962 3806333 4002464 4212070 4435637 4676357
59398D676357K63114K91758L25913L63574M03037M43253M82116N15142N36532
$$ 4676357 4939471 5231229 5557142 5920716 6323753 6767006 7249122 7764264 8300796
59389H300796N41718N29280N01225M61598M14400L62777L09906K59374K13480
$$ 8300796 8842514 9371794 9873019 10334617 10749017 11111794 11421700 11681074 11894554
59380A1894554J71778J32588R5569O1442K9611k298l6497p4093j16092j63444
$$ 11894554 12066332 12198920 12294489 12355931 12385542 12383244 12346747 12272654 12156562 11993118
59370A1993118k15418k69095l20905l67582m05410m30365m40099m34997m16726
$$ 11993118 11777700 11508605 11187700 10820118 10414708 9984343 9544244 9109247 8692521
59361H692521l86764l46915l00130k49691j98067j47118r8770n4779j6332J5500
$$ 8692521 8305757 7958842 7658712 7409021 7210954 7063836 6965066 6910287 6893955 6909455
59351F909455L9281N3599N7719N1665L6141J2589j6943n0144q4390j16768j44767
$$ 6909455 6948736 7002335 7060054 7111719 7147860 7160449 7143506 7093362 7008972 6892204 6747437
59340F747437j66968j82632j91073j92239j87509j78846j67338j53438j38231
$$ 6747437 6580469 6397837 6206764 6014525 5827016 5648170 5480832 5327394 5189163
59331E189163j23131j08413r3351p7752o2173m6637l0586j4161J865J7629L4160
$$ 5189163 5066032 4957619 4864268 4786516 4724343 4677706 4647120 4632959 4634824 4652453 4686613
59320D686613N1370O7492Q1063R2278J01834J09506J14430J15672J12106J02778
$$ 4686613 4737983 4805475 4886538 4978816 5080650 5190156 5304586 5420258 5532364 5635142
59310E635142Q7997O9262M7761K3919j447k6683n0334p1479q8741j00453j06326
$$ 5635142 5723139 5792401 5840162 5864081 5862634 5835951 5785617 5714138 5625397 5524944 5418618
59299E418618j07827j06224j01420r3139q2035o8919n4117l8243k2500p407P791
$$ 5418618 5310791 5204567 5103147 5010008 4927973 4859054 4804937 4766694 4744194 4736787 4744578
59288D744578K3804M0289N6662P2778Q8312J02706J16277J30171J44520J57898
$$ 4744578 4768382 4808671 4865333 4938111 5026423 5129129 5245406 5375577 5520097 5677995
59278E677995J69297J79199J87697J93010J93239J88493J79959J67663J50714
$$ 5677995 5847292 6026491 6214188 6407198 6600437 6788930 6968889 7136552 7287266
59269G287266J29188J04551P8529N2600K8226O558j2156k8288m2325n4899o6766
$$ 7287266 7416454 7521005 7599534 7652134 7680360 7686918 7674762 7646474 7604149 7549250 7482484
59258G482484p8146q8606r7894j06237j13417j18397j20290j18883j13793j04129
$$ 7482484 7404338 7315732 7217838 7111601 6998184 6879787 6759497 6640614 6526821 6422692
59248F422692q9549p0789m8437k2220P909M0988P6086J13129J51736J90164K26272
$$ 6422692 6333143 6262354 6213917 6191697 6199606 6240594 6316680 6429809 6581545 6771709 6997981
59237F997981K58636K85685L04513L11711L04936K83035K45502J92978J27826
$$ 6997981 7256617 7542302 7846815 8158526 8463462 8746497 8991999 9184977 9312803
59228I312803N3263k7584j11102j92480k66723l30120l80191m14929m33276m36141
$$ 9312803 9366066 9338482 9227380 9034900 8768177 8438057 8057866 7642937 7209661 6773520
59218F773520m26171m06466l79725l48045l13197k77658k45478k20982k05674
$$ 6773520 6347349 5940883 5561158 5213113 4899916 4622258 4376780 4155798 3950124
59209C950124j96935j90329j82543j72009j58233j41778j24226j07033r0731p5647
$$ 3950124 3753189 3562860 3380317 3208308 3050075 2908297 2784071 2677038 2586307 2510660
59199B510660o2478n1344m1246l1400k2425j5246r623m707m12K945N783R081J3252
$$ 2510660 2448182 2396838 2355592 2324192 2301767 2286521 2276898 2272191 2271779 2274724 2280507 2289588 2302840
59186B302840J8014K2957K7687L1928L6074M0930M6337N0838N3456N4954N6499
$$ 2302840 2320854 2343811 2371498 2403426 2439500 2480430 2526767 2577605 2631061 2686015 2742514
59175B742514N7991N8748N9068N9897O1486O3528O6217P0161P5495Q1967Q9580
$$ 2742514 2800505 2859253 2918321 2978218 3039704 3103232 3169449 3239610 3315105 3397072 3486652
59164C486652R8261J07212J15358J22344J28426J33630J37473J39156J37582J31660
$$ 3486652 3584913 3692125 3807483 3929827 4058253 4191883 4329356 4468512 4606094 4737754
59154D737754J21116J06603Q8830O8144M5226K1393k155k4508m4282n9764p0458
$$ 4737754 4858870 4965473 5054303 5122447 5167673 5189066 5186911 5162403 5118121 5058357 4987899
59143D987899p7326q0954q0520p5231o5665n2864l7313j9625r81J8119L8422O0253
$$ 4987899 4910573 4829619 4749099 4673868 4608203 4555339 4518026 4498401 4497420 4515539 4553961 4614214
59131D614214Q2415J03930J25668J48906J73235J97255K20328K42110K61101K75202
$$ 4614214 4696629 4800559 4926227 5075133 5248368 5445623 5665951 5908061 6169162 6444364
59121F444364K83176K84154K76281K57309K26554J85410J36594Q3884L1923j5155
$$ 6444364 6727540 7011694 7287975 7545284 7771838 7957248 8093842 8177726 8209649 8194494
59111H194494n4978q6465j09120j23612j32126j36849j38805j38963j39282j41255
$$ 8194494 8139516 8053051 7943931 7820319 7688193 7551344 7412539 7273576 7134294 6993039
59101F993039j44350j47476j51230j57242j65953j76476j88128k00488k12494
$$ 6993039 6848689 6701213 6549983 6392741 6226788 6050312 5862184 5661696 5449202
59092E449202k22979k31809k39151k44008k44798k41065k33533k22941k10105
$$ 5449202 5226223 4994414 4755263 4511255 4266457 4025392 3791859 3568918 3358813
59083C358813j96515j83377j70329j56361j41717j27708j15086j03754r3619q4553
$$ 3358813 3162298 2978921 2808592 2652231 2510514 2382806 2267720 2163966 2070347 1985794
59073A985794p5968o7566o0069n4073m8847m3462l8414l4756l2290l0148k8471
$$ 1985794 1909826 1842260 1782191 1728118 1679271 1635809 1597395 1562639 1530349 1500201 1471730
59062A471730k7883k7882k7392k6559k6302k6331k5267k2619j9177j5628j2170
$$ 1471730 1443847 1415965 1388573 1362014 1335712 1309381 1284114 1261495 1242318 1226690 1214520
59051A214520r249p183n170k149J445M086N176N357N074M227L228L001L909N665
$$ 1214520 1205271 1198088 1192918 1190769 1192214 1196300 1201476 1206833 1211907 1216134 1219362 1222363 1226272 1231937
59037A231937Q193J1507J5112J8540K2205K6571L1080L5000L8627M2163M4015
$$ 1231937 1240130 1251637 1266749 1285289 1307494 1334065 1365145 1400145 1438772 1480935 1524950
59026A524950M1942L5643K6800J6988P022k089r260j4345j7600j8505j6499j2468
$$ 1524950 1566892 1602535 1629335 1646323 1653345 1651256 1641996 1627651 1610051 1591546 1575047 1562579
59014A562579p891k907L210J0055J6277K1425K5824K8939K9572K7604K3754J7867
$$ 1562579 1554688 1551781 1554991 1565046 1581323 1602748 1628572 1657511 1687083 1714687 1738441 1756308
59002A756308R229j384j1744k0298k6788l1016l2680l2311l0774k7886k3107j7313
$$ 1756308 1765537 1764153 1752409 1732111 1705323 1674307 1641627 1609316 1578542 1550656 1527549 1510236
58990A510236j2166p960l790M59M218P919J2428J7001J9959K1524K3697K7156
$$ 1510236 1498070 1490110 1486320 1486779 1490997 1498916 1511344 1528345 1548304 1569828 1593525 1620681
58978A620681L0419L2451L4008L5888L7806L9579M1725M4372M7034M9720N2741
$$ 1620681 1651100 1683551 1717559 1753447 1791253 1830832 1872557 1916929 1963963 2013683 2066424
58967B066424N5393N6585N6782N7414N8508N8958N9078O0468O3053O4926O5689
$$ 2066424 2121817 2178402 2235184 2292598 2351106 2410064 2469142 2529610 2592663 2657589 2723278
58956B723278O7556P2211P8935Q6769R6314J08089J21076J34358J48613J64751
$$ 2723278 2790834 2863045 2941980 3028749 3125063 3233152 3354228 3488586 3637199 3801950
58946C801950J82490K01348K21734K43938K67238K91038L15922L42830L72174
$$ 3801950 3984440 4185788 4407522 4651460 4918698 5209736 5525658 5868488 6240662
58937F240662M04157M38835M75541N13491N53096N95104O38084O78275P12160
$$ 6240662 6644819 7083654 7559195 8072686 8625782 9220886 9858970 10537245 11249405
58928A1249405P37420P51054P48451P25113O77819O03947N01980L73827K25379
$$ 11249405 11986825 12737879 13486330 14211443 14889262 15493209 15995189 16369016 16594395
58919A6594395O4340j00989k60881m05176n26770o23035o93417p37715p57463
$$ 16594395 16658735 16557746 16296865 15891689 15364919 14741884 14048467 13310752 12553289
58910A2553289p56699p39840p10228o71517o28389n84356n40318m96482m54173
$$ 12553289 11796590 11056750 10346522 9675005 9046616 8462260 7921942 7425460 6971287
58901F971287m14696l77960l43561l11949k83406k57141k32475k09773j89398
$$ 6971287 6556591 6178631 5835070 5523121 5239715 4982574 4750099 4540326 4350928
58892D350928j70987j54512j40555j28879j18197j08154r9844r3634q8213q2642
$$ 4350928 4179941 4025429 3884874 3755995 3637798 3529644 3429800 3336166 3247953 3165311
58882C165311p7487p2959o7905o1826n5927n0946m5793l9803l4417l0998k8556
$$ 3165311 3087824 3014865 2946960 2885134 2829207 2778261 2732468 2692665 2658248 2627250 2598694
58871B598694k5437k1779j8634j5887j2781r351n875j916K689O955J0218J3374
$$ 2598694 2573257 2551478 2532844 2516957 2504176 2494825 2488950 2487034 2489723 2496678 2506896 2520270
58859B520270J7409K1877K6159L0964L7120M3942N0309N6490O3560P1858Q1090
$$ 2520270 2537679 2559556 2585715 2616679 2653799 2697741 2748050 2804540 2868100 2939958 3021048
58848C021048R1146J01738J12227J22713J34292J47419J61286J75651J91767K10502
$$ 3021048 3112194 3213932 3326159 3448872 3583164 3730583 3891869 4067520 4259287 4469789
58838D469789K30992K52392K75410L00818L28013L56495L87350M21697M58868
$$ 4469789 4700781 4953173 5228583 5529401 5857414 6213909 6601259 7022956 7481824
58829G481824M97518N37275N77835O17601O54537O87034P12528P26526P24402
$$ 7481824 7979342 8516617 9094452 9712053 10366590 11053624 11766152 12492678 13217080
58820A3217080P02903O58832N88314M89601L65609K22232O5653r6838k55327l99545
$$ 13217080 13919983 14578815 15167129 15656730 16022339 16244571 16310224 16213386 15958059 15558514
58810A5558514n22682o21667o95072p42851p67304p71922p59516p32921o96536
$$ 15558514 15035832 14414165 13719093 12976242 12208938 11437016 10677500 9944579 9248043
58801I248043o55049o10974n65173n19207m75377m34727l96830l61396l28757
$$ 9248043 8592994 7982020 7416847 6897640 6422263 5987536 5590706 5229310 4900553
58792D900553k99042k72175k48431k27793k09157j91368j74594j59648j46581
$$ 4900553 4601511 4329336 4080905 3853112 3643955 3452587 3277993 3118345 2971764
58783B971764j34955j24748j15905j07660r9407r1492q4125p6544o8384o0812
$$ 2971764 2836809 2712061 2596156 2488496 2389089 2297597 2213472 2136928 2068544 2007732
58773B007732n4994n0422m6158m2660m0760l9659l7613l4109k9959k5745k1493
$$ 2007732 1952738 1902316 1856158 1813498 1772738 1733079 1695466 1661357 1631398 1605653 1584160
58762A584160j7395j3637r884n907k138J088L976O338P376P258P564R179J1082
$$ 1584160 1566765 1553128 1543244 1537337 1535199 1536287 1540263 1546601 1553977 1561235 1568799 1577978 1589060
58749A589060J2317J3477J5043J5839J4647J1747P335K87r553j9448k6405l0486
$$ 1589060 1601377 1614854 1629897 1645736 1660383 1672130 1679465 1679752 1670199 1650751 1624346 1593860
58737A593860l3478l5660l6277l6004l6324l7138l7331l7023l7066l6952l5578
$$ 1593860 1560382 1524722 1488445 1452441 1416117 1378979 1341648 1304625 1267559 1230607 1195029
58726A195029l3540l2374l1823l0144k6973k3745k1291j8971j6307j3767j1690
$$ 1195029 1161489 1129115 1097292 1067148 1040175 1016430 995139 976168 959861 946094 934404
58715I34404r887q266o811n147l177j663j009k43J537L352L420J357j876n459
$$ 934404 924517 916251 909440 904293 901116 899453 898444 898201 899738 903090 906510 907867 905991 900532
58701I00532q870j1406j2993j4579j6599j7962j7891j7332j7113j6162j3467j0400
$$ 900532 891662 880256 867263 852684 836085 818123 800232 782900 765787 749625 736158 725758
58689G25758q925q577p538n748m524l855k461j40K129M049O088P963Q991R500
$$ 725758 716833 708256 700718 694970 690446 686591 684130 683990 686119 690168 696256 704219 713210 722710
58675G22710J0296J1069J1006J0317R644Q646O863N146M628N087N882P378R737
$$ 722710 733006 744075 755081 765398 775042 783688 790551 795697 800325 805412 811294 818672 828409
58662H28409J1560J1719J1409J2169J3120J2475J0717R844J0341J1395J3193J6412
$$ 828409 839969 851688 863097 875266 888386 900861 911578 921422 931763 943158 956351 972763
58650I72763K0135K2935K5441K9399L4677L9665M4116M9085N4566N9704O5011
$$ 972763 992898 1015833 1041274 1070673 1105350 1145015 1189131 1238216 1292782 1352486 1417497
58639A417497P1925Q0467Q9571R9277J10387J22498J34732J47740J62585J78263
$$ 1417497 1489422 1569889 1659460 1758737 1869124 1991622 2126354 2274094 2436679 2614942
58629B614942J92858K06473K20106K32055K38241K35932K24421K02346J67424
$$ 2614942 2807800 3014273 3234379 3466434 3704675 3940607 4165028 4367374 4534798
58620D534798J19553O2074k09o2358j19176j66346k02136k26500k39185k40589
$$ 4534798 4654351 4716425 4716216 4653858 4534682 4368336 4166200 3939700 3700515 3459926
58610C459926k33514k21531k06097j87417j67179j47793j29753j12430r6783q4344
$$ 3459926 3226412 3004881 2798784 2611367 2444188 2296395 2166642 2054212 1957429 1873085
58600A873085p4256o4401n4919m7622m2331l6969l1000k5667k1080j6260j1958
$$ 1873085 1798829 1734428 1679509 1631887 1589556 1552587 1521587 1495920 1474840 1458580 1446622
58589A446622j0274j1281j2949j4322j5969j7526j7786j7160j7053j6952j5051
$$ 1446622 1436348 1425067 1412118 1397796 1381827 1364301 1346515 1329355 1312302 1295350 1280299
58578A280299j1482p907m258Q17O651J1052J3982J7165K0223K0773J8309J4338
$$ 1280299 1268817 1260910 1256652 1257469 1264120 1275172 1289154 1306319 1326542 1347315 1365624 1379962
58566A379962Q595r72j3992k7129l8233m7482n4216n6612n5213n2945n0756m6827
$$ 1379962 1388557 1387585 1373593 1346464 1308231 1260749 1206533 1149921 1094708 1041763 991007 944180
58554I44180m0830l5207l1249k7504k3194j9683j7428j4925j1801r756r353r001
$$ 944180 903350 868143 836894 809390 786196 766513 749085 734160 722359 712603 703250 694249
58542F94249q017p429p027n115k113p49j584j981o62L57k60r47n27l03j162j863
$$ 694249 686232 678803 671776 666661 664548 663799 662215 660234 659572 659929 659669 658722 658195 657892 656730 654867
58526F54867j700j825k449j871L36K249L015M173O344P849Q114R065J1684J4265
$$ 654867 653167 651342 648893 647022 647358 649607 652622 656795 663139 670988 679102 688167 699851 714116
58512G14116J5599J6671J7817J7456J5171J2922J1641R829O829M339L225K164
$$ 714116 729715 746386 764203 781659 796830 809752 821393 831222 838051 842390 845615 847779
58500H47779Q08R07K836M446M823N667P406P656N334K709J509L95j811l879n047
$$ 847779 848587 849494 852330 856776 861599 867266 874672 882328 887662 890371 891880 892275 890464 886585 881538
58485H81538o704r335j1098j1278j1673j2912j2972j1156r777r982r750q103p296
$$ 881538 874834 865499 854401 843123 831450 818538 805566 794410 784633 774651 764901 756798 749502
58472G49502q538r436q221o742o646o337m413k521k028j363N73J938J659K084
$$ 749502 740964 731528 723307 716565 709919 703582 699169 696648 694620 693257 693830 695768 697427 699511
58458F99511M958Q190R569J0410J2416J4274J4488J4542J6027J7482J7086J5790
$$ 699511 704469 712659 722228 732638 745054 759328 773816 788358 804385 821867 838953 854743
58446H54743J4994J3852J1620R858R669R417P504M597J094m278j1180j6505j8842
$$ 854743 869737 883589 895209 905067 914736 924153 931657 936254 937348 933070 921890 905385 886543
58433H86543k0431k2433k2370j8901j5035j3472j2660j0565q418p460n936k712
$$ 886543 866112 843679 821309 802408 787373 773901 761241 750676 742258 734798 728862 726150
58421G26150l6O47J756N054Q089Q744R306J2110J5157J6102J6720J9150K1351
$$ 726150 726114 726761 728517 733571 741660 750404 759710 771820 786977 803079 819799 838949 860300
58408H60300K0567J7904J5291J1462N120j306n279q137j1448j3081j1192q478
$$ 860300 880867 898771 914062 925524 930644 929338 924059 915922 904474 891393 880201 871723
58396H71723p975q138o476m481m321m204j795J073J836K003L858N774N501M691
$$ 871723 863748 855610 849134 844653 840332 836128 834333 835406 837242 839245 843103 848877 854378 859069
58382H59069N326N223K021j719k580j969k737l523j816P39J481J884M316O915
$$ 859069 864395 869618 871639 869920 867340 865371 862634 859111 857295 858034 859515 861399 865715 872630
58368H72630P152P087R505J2224J2032J1013J2933J6442J7895J7986J9498K1320
$$ 872630 879782 886869 896374 908598 920630 931643 944576 961018 978913 996899 1016397 1037717
58356A037717K0794J9184J8861J7844J3207P081L266Q21k904o048n482l282l274
$$ 1037717 1058511 1077695 1096556 1114400 1127607 1134688 1137954 1138775 1135871 1129823 1124341 1121059 1117785
58343A117785l968j659K164L374K682L770O287P323P525R237J0989J0315R386
$$ 1117785 1113817 1112158 1114322 1117696 1120378 1124148 1130435 1137758 1145283 1154520 1165509 1175824 1185210
58330A185210J1370J4062J3821J2748J4871J8377J9065J8458K0726K4395K5124
$$ 1185210 1196580 1210642 1224463 1237211 1252082 1270459 1289524 1307982 1328708 1353103 1378227
58319A378227K4082K5438K7842K6642K2443J9451J7281J2527O445L192K266M87
$$ 1378227 1402309 1427747 1455589 1482231 1504674 1524125 1541406 1553933 1560378 1563570 1565836 1566323
58307A566323q59J347M820N380N061Q419J3495J5183J4806J7263K1289K1983K0660
$$ 1566323 1565464 1566811 1571631 1577011 1582072 1590491 1603986 1619169 1633975 1651238 1672527 1694510 1715170
58294A715170K2526K6665K7998K7186K8967L2579L3668L3650L7273M2875M5134
$$ 1715170 1737696 1764361 1792359 1819545 1848512 1881091 1914759 1948409 1985682 2028557 2073691
58283B073691M5471M9361N5401N7577N6510N7609N9905N7634N1218M5800M0804
$$ 2073691 2119162 2168523 2223924 2281501 2338011 2395620 2455525 2513159 2564377 2610177 2650981
58272B650981L2102K2514J8567J8780J6920J4585J8277K6124L0437L1628L6460
$$ 2650981 2683083 2705597 2724164 2742944 2759864 2774449 2792726 2818850 2849287 2880915 2917375
58261B917375M4174M7954M8608N2980O0076O2773O2095O5567P2470P5293P4683
$$ 2917375 2961549 3009503 3058111 3111091 3171167 3233940 3296035 3361602 3434072 3509365 3584048
58250C584048P8186Q5270Q8694Q9552R5366J04568J08858J09679J15743J25703
$$ 3584048 3662234 3747504 3836198 3925750 4021116 4125684 4234542 4344221 4459964 4585667
58240D585667J30484J31412J38041J49344J55768J58689J68321J83404J93254
$$ 4585667 4716151 4847563 4985604 5134948 5290716 5449405 5617726 5801130 5994384
58231E994384J98935K11508K30109K43548K52773K69089K91207L07808L21757
$$ 5994384 6193319 6404827 6634936 6878484 7131257 7400346 7691553 7999361 8321118
58222H321118L46500L79495M05989M28256M62780N09197N52161N93720O51744
$$ 8321118 8667618 9047113 9453102 9881358 10344138 10853335 11405496 11999216 12650960
58213A2650960P26207Q01206Q81016R87975J124044J273577J445547J671002J956056
$$ 12650960 13377167 14178373 15059389 16047364 17171408 18444985 19890532 21561534 23517590
58204B3517590K280989K646286L070393L541675M029861M550575N161511N894933
$$ 23517590 25798579 28444865 31515258 35056933 39086794 43637369 48798880 54693813
58196E4693813O761631P820152R162924J0840023J2897387J5484372J8800253
$$ 54693813 61455444 69275596 78438520 89278543 102175930 117660302 136460555
58189A36460555K2956674K8062100L4310831M1388990M7355466M8519127M1412415
$$ 136460555 159417229 187479329 221790160 263179150 310534616 359053743 400466158
58182D00466158K5583967M531779j6235196l2201274m1485904m4547253m3055125
$$ 400466158 426050125 430581904 414346708 382145434 340659530 296112277 253057152
58175B53057152l8949001l3856702k8793254k4188970k0156644j6709037j3804715
$$ 253057152 214108151 180251449 151458195 127269225 107112581 90403544 76598829
58168G6598829j1360949r315017p642645o304093n224688m344057l637888l078654
$$ 76598829 65237880 55922863 48280218 41976125 36751437 32407380 28769492 25690838
58160B5690838k619496k230329j910859j655443j439289j248591j090990r66371
$$ 25690838 23071342 20841013 18930154 17274711 15835422 14586831 13495841 12529470
58152A2529470q56967p54569o69418o04168n44876m84951m33649l94271l56591
$$ 12529470 11672503 10917934 10248516 9644348 9099472 8614521 8180872 7786601 7430010
58143G430010l16969k84517k61648k38465k11538j89165j73515j55570j32201
$$ 7430010 7113041 6828524 6566876 6328411 6116873 5927708 5754193 5598623 5466422
58134E466422j11343r6242q0455o1787m5982l3662j7850K993K2999M1595O5228
$$ 5466422 5355079 5258837 5178382 5116595 5070613 5036951 5019101 5022094 5045093 5086688 5151916
58123E151916R5241J26484J58689J96820K39367K77770L08617L36786L67220M02914
$$ 5151916 5247157 5373641 5532330 5729150 5968517 6246287 6554904 6891690 7258910 7661824
58113G661824M49538N13023N93898O90933Q07322R48052J117128J322672J577690
$$ 7661824 8111362 8624385 9218283 9909216 10716538 11664590 12781718 14104390 15682080
58104A5682080J892927K279381K758450L355645M090657M994961O102602P315099
$$ 15682080 17575007 19854388 22612838 25968483 30059140 35054101 41156703 48471802
58096D8471802Q218807Q137896O548424L536724j60499l588684o070712p392033
$$ 48471802 56690609 64828505 71376929 74913653 74753154 71164470 65093758 57701725
58088E7701725p691264p277525o489220n591406m727907l950326l275401k706660
$$ 57701725 50010461 42732936 36243716 30652310 25924403 21974077 18698676 15992016
58080A5992016k230730j829309j495813j227017j008219q22909o68902n50222
$$ 15992016 13761286 11931977 10436164 9209147 8200928 7378019 6709117 6158895
58072F158895m60914l90335l36390l00424k76244k56184k40926k32094k22405
$$ 6158895 5697981 5307646 4971256 4670832 4394588 4138404 3897478 3665384 3442979
58063C442979k04086j80259j57844j36428j14161r7156r2094r5341r9061j02086
$$ 3442979 3238893 3058634 2900790 2764362 2650201 2553045 2460951 2365610 2266549 2164463
58053B164463j05902j06558j00241r1153q4715p8579o8753n8678n3311m9919m3592
$$ 2164463 2058561 1952003 1851762 1760609 1675894 1597315 1528562 1469884 1416573 1366654 1323062
58042A323062l6578l3419l1864k7275k1582j9435j9640j8228j5983j5445j4634
$$ 1323062 1286484 1253065 1221201 1193926 1172344 1152909 1133269 1115041 1099058 1083613 1068979
58031A068979j1127q212r751j2889j2894j1100j1178j1720r641o998p314q757
$$ 1068979 1057852 1049640 1039889 1027000 1014106 1003006 991828 980108 970467 963469 956155 947398
58019I47398p741n678n577n655l029q9m37j908m25K467K660J054J342K892K390
$$ 947398 939657 933979 928402 922747 919718 919629 919192 917284 916859 919326 921986 923040 924382 927274 929664
58004I29664J99j091k191n414r577j2073j3713j6308j8070j6643j4108j3745j4472
$$ 929664 929863 928772 926581 921167 911590 899517 885804 869496 851426 834783 820675 806930 792458
57991G92458j3594j2230j2695j3270j1035p424n656n112l435j688k136l374k772
$$ 792458 778864 766634 753939 740669 729634 722210 716554 711442 708007 706319 704183 700809 698037
57978F98037j510k088l188k120m0K21o58l51L80l44j200j24J319P40m13K18J016
$$ 698037 696527 694439 691251 689131 689091 689312 688654 688303 688683 688339 687139 687015 688334 689074 688661 688879 689895
57961F89895n14k506j893l02j252l766m424l656m442o460p126o874p968r528r040
$$ 689895 689381 686875 684982 684680 683428 679662 675238 671582 667140 660680 653554 646680 638712 629184 620144
57946F20144p452p589q759q127o099n348n665m799l171k802k760o55K497L853
$$ 620144 612692 605103 596344 588217 582118 576770 571105 566306 563135 560333 557573 556918 559415 563268
57932E63268L978N456P435O774L763J611R20l03j849j529J71O38K3R68L689N786
$$ 563268 567246 572702 580137 586911 590674 592285 593205 592902 591053 589524 589695 590333 590356 591324 595013 600799
57916F00799O654P748Q876Q587P767Q466R710Q801O215M810M692L474J141p9l76
$$ 600799 607453 615201 624077 632664 640431 648897 658607 667408 673623 678433 683125 686599 687740 687661 687285
57901F87285k152n169o589o017n943o926o785n046l840l872l550k595k573l375
$$ 687285 685133 679964 673375 667358 661415 654489 647704 642658 638818 634946 631396 628801 626228 622853
57887F22853l043j558j065j843j838o10n8p11r16k28j04o86l40J098J921J840
$$ 622853 619810 618252 617187 615344 613506 612896 612838 612127 611211 610983 610879 610193 609853 610951 612872 614712
57871F14712K441L932M609L985L404L307K810K155K564L567L472K404J919J895
$$ 614712 617153 621085 625694 629679 633083 636390 639200 641355 643919 647486 650958 653362 655281 657176
57857F57176J051R2P49K084J588j51Q7K775M804M530L765L943M095L704M068N607
$$ 657176 658227 658319 659068 661152 662740 662589 662676 665451 670255 674785 678550 682493 686588 690292 694360 699967
57841F99967O809O902O881P112O633N475M963N226M881L618K486J583J6j832k761
$$ 699967 706776 713678 720559 727671 734304 739779 744742 749968 754849 758467 760953 762536 762552 760720 757959
57826G57959l303m939p071p814p408p636q270p632o268o259p135o484m580m104
$$ 757959 754656 749717 742646 734832 727424 719788 711518 703886 697618 691359 684224 677740 673160 669056
57812F69056n067m455j535Q38J205J482K830L611K948K441K876K806J815J596
$$ 669056 663989 659534 657999 658837 660042 661524 664354 667965 670913 673354 676230 679036 680851 682447
57798F82447K446K202J70j437j409j403k358k605j279k13n52p31L49J214Q55P80
$$ 682447 684893 687095 687265 685828 684419 683016 680658 678053 676774 676561 676009 675278 675627 676841 677696 678476
57782F78476K075L288L196L032M056N446O301P251Q428Q539P454P070Q024Q390
$$ 678476 680551 683839 687035 690067 694123 699569 705870 713121 721549 730088 737542 744612 752636 761026
57768G61026P201O453P727R632J0485J0889J1729J2208J1824J1757J2513J2627
$$ 761026 768227 774680 782407 792039 802524 813413 825142 837350 849174 860931 873444 886071
57756H86071J1551J1095J2116J2547J0810Q503P415O444M044J328O4l56j401k571
$$ 886071 897622 908717 920833 933380 944190 952693 960108 966552 970596 971924 971988 971632 970231 967660
57742I67660k516j523o30K29J321J938J870K485M535O617P490Q112R646J1364
$$ 967660 965144 963621 962991 963220 964541 966479 968349 970834 975369 981986 989476 997588 1007234 1018598
57728A018598J2345J3368J5237J7049J8019J9227K1612K4003K5115K5801K7441
$$ 1018598 1030943 1044311 1059548 1076597 1094616 1113843 1135455 1159458 1184573 1210374 1237815
57717A237815K9823L2349L5555L9565M2961M5175M8118N3388N9676O5182P0659
$$ 1237815 1267638 1299987 1335542 1375107 1418068 1463243 1511361 1564749 1624425 1689607 1760266
57706A760266P7802Q6311R5151J05109J17628J32177J47242J62887J80107J98507
$$ 1760266 1838068 1924379 2019530 2124639 2242267 2374444 2521686 2684573 2864680 3063187
57696C063187K16622K33521K48049K57326K57688K46390K21264J80565J25360
$$ 3063187 3279809 3513330 3761379 4018705 4276393 4522783 4744047 4924612 5049972
57687E049972O1069n226o8168j23855j68375j99106k16542k22930k20066k09808
$$ 5049972 5111041 5105815 5037647 4913792 4745417 4546311 4329769 4106839 3886773 3676965
57677C676965j95023j77895j58536j37029j15390r5515p6622n6941l6687j7146
$$ 3676965 3481942 3304047 3145511 3008482 2893092 2797577 2720955 2664014 2627327 2610181
57667B610181K082K2645M5218O9852R7431J28012J57471J77189J77186J50091
$$ 2610181 2612263 2634908 2680126 2749978 2847409 2975421 3132892 3310081 3487267 3637358
57657C637358R5364K2594n0802j08442j42795j54924j49450j31884j08272q3367
$$ 3637358 3732722 3755316 3704514 3596072 3453277 3298353 3148903 3017019 2908747 2825380
57647B825380n8754l4374j1062J0172L0024M9759O9145Q7448J05443J24191J42826
$$ 2825380 2766626 2732252 2721190 2731362 2761386 2811145 2880290 2967738 3073181 3197372 3340198
57636C340198J59709J74832J88770K00048K05750K03842J92807J70100J33881
$$ 3340198 3499907 3674739 3863509 4063557 4269307 4473149 4665956 4836056 4969937
57627D969937Q6122L1930k3804p7291j24488j61750j87949k04153k11449k10775
$$ 4969937 5056059 5087989 5064185 4986894 4862406 4700656 4512707 4308554 4097105 3886330
57617C886330k04148j93962j81264j66397j50647j35559j21346j07697r5375q5136
$$ 3886330 3682182 3488220 3306956 3140559 2989912 2854353 2733007 2625310 2529935 2444799
57607B444799p6090o7114n8840n2231m6330l9848l3873l0326k8528k6089k2588
$$ 2444799 2368709 2301595 2242755 2190524 2144194 2104346 2070473 2040147 2011619 1985530 1962942
57596A962942j9571j7378j4901j2301j0968j0748r921q126o716n995m663k438
$$ 1962942 1943371 1925993 1911092 1898791 1887823 1877075 1867154 1859028 1852312 1846317 1841654 1839216
57584A839216p18o1O89K210L675M490N149N873O227O504P608R291J0235J0219
$$ 1839216 1838498 1838437 1839126 1841336 1845011 1849501 1854650 1860523 1866750 1873254 1880862 1890153 1900388 1910607
57570A910607J0428J1379J2370J3231J4769J7079J9228K1049K3479K6661K9440
$$ 1910607 1921035 1932414 1944784 1958015 1972784 1989863 2009091 2030140 2053619 2080280 2109720
57559B109720L1254L3025L5647L8977M2761M7180N2132N7224O2697O9150P6359
$$ 2109720 2140974 2173999 2209646 2248623 2291384 2338564 2390696 2447920 2510617 2579767 2656126
57548B656126Q3658R1406J00545J10813J21076J31428J43142J56243J68672J78196
$$ 2656126 2739784 2831190 2931735 3042548 3163624 3295052 3438194 3594437 3763109 3941305
57538C941305J83679J84155J78087J63987J40836J08159O7045K1088k5032o7832
$$ 3941305 4124984 4309139 4487226 4651213 4792049 4900208 4967253 4988341 4963309 4895477
57528D895477j04895j33535j51778j60511j62631j59908j52573j41745j29874
$$ 4895477 4790582 4657047 4505269 4344758 4182127 4022219 3869646 3727901 3598027
57519C598027j18254j06164r3128q0295o8917n9025n0174m2166l4658k7321k0631
$$ 3598027 3479773 3373609 3280481 3200186 3131269 3072244 3022070 2979904 2945246 2917925 2897294
57508B897294j5283j0799o151j567J920M625Q005J2218J5878J8583K1644K5887
$$ 2897294 2882011 2871212 2865061 2863494 2865414 2870039 2878044 2890262 2906140 2924723 2946367 2972254
57496B972254L0518L4760L8913M3220M7309N1386N6548O3256P0837P8832Q7510
$$ 2972254 3002772 3037532 3076445 3119665 3166974 3218360 3274908 3338164 3409001 3487833 3575343
57485C575343R6754J05992J15473J26191J38135J49959J60570J69509J75578J76623
$$ 3575343 3672097 3778089 3893562 4019753 4157888 4307847 4468417 4637926 4813504 4990127
57475D990127J70773J56572J32206R6875N3241O596l8749q0541j16270j42596
$$ 4990127 5160900 5317472 5449678 5546553 5599794 5606390 5567641 5487100 5370830 5228234
57465E228234j58092j64505j64309j58755j49017j37154j24608j11366r7580q4543
$$ 5228234 5070142 4905637 4741328 4582573 4433556 4296402 4171794 4060428 3962848 3878305
57455C878305p3159o2945n3428m5088l8043l1289k4260j7858j3019r422o339l561
$$ 3878305 3805146 3742201 3688773 3643685 3605642 3574353 3550093 3532235 3519216 3509794 3503455 3499894
57443C499894q75K156N202P264Q283R417J1215J2943J4134J5298J6555J7158J7018
$$ 3499894 3499019 3501175 3506377 3513641 3521924 3531341 3542556 3555499 3569633 3584931 3601486 3618644 3635662
57430C635662J7190J8127J9000J9365J9926K0972K1619K1413K1231K1778K2634
$$ 3635662 3652852 3670979 3689979 3709344 3729270 3750242 3771861 3793274 3814505 3836283 3858917
57419C858917K3443K4511K5630K5887K5410K5687K7290K8865K9248K9033K9152
$$ 3858917 3882360 3906871 3932501 3958388 3983798 4009485 4036775 4065640 4094888 4123921 4153073
57408D153073K9446K9616L0084L0957L1506L1528L1961L3294L4695L5480L6020
$$ 4153073 4182519 4212135 4242219 4273176 4304682 4336210 4368171 4401465 4436160 4471640 4507660
57397D507660L6525L6449L5851L5811L6633L7249L7130L7188L7952L8557L8430
$$ 4507660 4544185 4580634 4616485 4652296 4688929 4726178 4763308 4800496 4838448 4877005 4915435
57386D915435L8297L8585L8519L7801L7428L7809L7825L6874L6138L6582L7412
$$ 4915435 4953732 4992317 5030836 5068637 5106065 5143874 5181699 5218573 5254711 5291293 5328705
57375E328705L7732L8050L8817L9127L8271L7099L6495L5995L5186L4872L5500
$$ 5328705 5366437 5404487 5443304 5482431 5520702 5557801 5594296 5630291 5665477 5700349 5735849
57364E735849L5974L5494L5102L5887L7109L7590L7653L8178L8967L9461L9877
$$ 5735849 5771823 5807317 5842419 5878306 5915415 5953005 5990658 6028836 6067803 6107264 6147141
57353F147141M0392M0456M0078M0395M1778M2881M2785M2478M2918M3404M3318
$$ 6147141 6187533 6227989 6268067 6308462 6350240 6393121 6435906 6478384 6521302 6564706 6608024
57342F608024M3690M5321M7035M7629M7905M8961N0012M9898M9315M9535N0212
$$ 6608024 6651714 6697035 6744070 6791699 6839604 6888565 6938577 6988475 7037790 7087325 7137537
57331G137537N0477N0873N2180N3522N3732N3518N4178N5263N5529N5330N5981
$$ 7137537 7188014 7238887 7291067 7344589 7398321 7451839 7506017 7561280 7616809 7672139 7728120
57320G728120N7527N8962N9908O0358N9756N8151N7198N8201O0055O0897O0798
$$ 7728120 7785647 7844609 7904517 7964875 8024631 8082782 8139980 8198181 8258236 8319133 8379931
57309H379931O0981O1512O1752O2105O3237O4337O4229O3464O3378O3918O4221
$$ 8379931 8440912 8502424 8564176 8626281 8689518 8753855 8818084 8881548 8944926 9008844 9073065
57298I073065O4474O5274O6029O6036O6254O7992P0557P2217P2739P3052P3219
$$ 9073065 9137539 9202813 9268842 9334878 9401132 9469124 9539681 9611898 9684637 9757689 9830908
57287I830908P2760P2214P2344P2530P1792P0584O9642O8085O4800O0664N7175
$$ 9830908 9903668 9975882 10048226 10120756 10192548 10263132 10332774 10400859 10465659 10526323 10583498
57276A0583498N3835M9235M3768L8821L4098K8432K2553J8331J5901J4161J3551
$$ 10583498 10637333 10686568 10730336 10769157 10803255 10831687 10854240 10872571 10888472 10902633 10916184
57265A0916184J5439J9100K2270K4566K7589L1517L4462L5489L5705L5964L5883
$$ 10916184 10931623 10950723 10972993 10997559 11025148 11056665 11091127 11126616 11162321 11198285 11234168
57254A1234168L5545L5812L6430L5934L3958L1783L0276K9171K8530K9052L0511
$$ 11234168 11269713 11305525 11341955 11377889 11411847 11443630 11473906 11503077 11531607 11560659 11591170
57243A1591170L1719L2298L2902L3747L4536L5649L7617L9596M0300M0219M0862
$$ 11591170 11622889 11655187 11688089 11721836 11756372 11792021 11829638 11869234 11909534 11949753 11990615
57232A1990615M2077M2292M1317M0694M1049M1283M0512L8946L6684L3568L0376
$$ 11990615 12032692 12074984 12116301 12156995 12198044 12239327 12279839 12318785 12355469 12389037 12419413
57221A2419413K8238K6822K4746K1710J8493J5216J1462P773M980K487o87l717
$$ 12419413 12447651 12474473 12499219 12520929 12539422 12554638 12566100 12573873 12578853 12581340 12580653 12576936
57209A2576936n149n711p373r982j1564j1794j2385j4001j5531j6593j8068j9913
$$ 12576936 12571787 12566076 12558703 12548721 12537157 12525363 12512978 12498977 12483446 12466853 12448785 12428872
57197A2428872k0908k0927k1097k1525k1263k0481k0275k0430j9903j9261j9849
$$ 12428872 12407964 12387037 12365940 12344415 12323152 12302671 12282396 12261966 12242063 12222802 12202953
57186A2202953k0786j9932j7737j6934j8230j9695k0611k2440k5421k7768k9105
$$ 12202953 12182167 12162235 12144498 12127564 12109334 12089639 12069028 12046588 12021167 11993399 11964294
57175A1964294l1257l4765l7920m0264m3604m8357n2362n4731n7772o3298p0051
$$ 11964294 11933037 11898272 11860352 11820088 11776484 11728127 11675765 11621034 11563262 11499964 11429913
57164A1429913p6329q2457q9018r5150j00240j05084j10095j14433j17731j20266
$$ 11429913 11353584 11271127 11182109 11086959 10986719 10881635 10771540 10657107 10539376 10419110
57154A0419110j20936j17917j11971j06062j00893r4106q4674p4582o5176n5493
$$ 10419110 10298174 10180257 10068286 9962224 9861331 9767225 9682551 9607969 9542793 9487300
57144I487300m5548l7540l2341k8352k5409k6023l1036l7912m5174n4679o7247
$$ 9487300 9441752 9404212 9371871 9343519 9318110 9292087 9261051 9223139 9177965 9123286 9056039
57133I056039p9850q9570r6699j01572j02047r6933q8509p9080o8333n6527m6751
$$ 9056039 8976189 8886619 8789920 8688348 8586301 8489368 8400859 8321779 8253446 8196919 8150168
57122H150168m1356l9530m0585m5777n4228o1077o2626n9611n2921m0631k2458
$$ 8150168 8108812 8069282 8028697 7982920 7928692 7867615 7804989 7745378 7692457 7651826 7629368
57111G629368k475J6328L6033N9125Q4705J13231J50018J99624K61341L34372
$$ 7629368 7626893 7643221 7679254 7738379 7823084 7936315 8086333 8285957 8547298 8881670
57101H881670M22333N28206O50779P91545R59515J163623J406482J691503K028734
$$ 8881670 9304003 9832209 10482988 11274533 12234048 13397671 14804153 16495656 18524390
57092A8524390K425538K877583L376499L917929M490778N063145N586086O002911
$$ 18524390 20949928 23827511 27204010 31121939 35612717 40675862 46261948 52264859
57084E2264859O252221O291266O148197N933347N745507N547004N162609M427746
$$ 52264859 58517080 64808346 70956543 76889890 82635397 88182401 93345010 97772756
57076I7772756L326549J979044N28253r28271k322060l586774m668156n539321
$$ 97772756 101099305 103078349 103606602 102678331 100356271 96769497 92101341 86562020
57068H6562020o192649o628190o856082o896112o764767o470941o031753n485719
$$ 86562020 80369371 73741181 66885099 59988987 53224220 46753279 40721526 35235807
57060C5235807m883521m270327l680071l137724k657603k241574j885074j584283
$$ 35235807 30352286 26081959 22401888 19264164 16606561 14364987 12479913 10895630
57052A0895630j335268j130299r60179q18897p02757o06881n26006m57374l99922
$$ 10895630 9560362 8430063 7469884 6650987 5948230 5341349 4815343 4357969 3958047
57043C958047l51559l09647k73105k41687k14117j88986j66586j47911j32378
$$ 3958047 3606488 3296841 3023736 2782049 2567932 2378946 2212360 2064449 1932071
57034A932071j18379j05503r4611q6008p8984p2845o7300o2080n7135n2960m9837
$$ 1932071 1813692 1708189 1613578 1527570 1448586 1375741 1308441 1246361 1189226 1136266 1086429
57023A086429m7085m3876m0389l7497l5521l4038l2613l1183k9858k8780k8032
$$ 1086429 1039344 995468 955079 917582 882061 848023 815410 784227 754369 725589 697557
57012F97557k7397k6549k5608k5049k4874k4448k3454k2325k1472k0628j9481
$$ 697557 670160 643611 618003 592954 568080 543632 520178 497853 476381 455753 436272
57001D36272j8174j6781j4929j2563j0419r043p832n933l544j478K74K495N408
$$ 436272 418098 401317 386388 373825 363406 354363 346531 340598 337054 335576 335850 338345 343753
56988C43753Q363J0971J3722J7318K2086K8026L4300L8378L6887K8353J4931Q57
$$ 343753 352116 363087 376809 394127 416213 444239 478539 516917 553804 582157 597088 597945
56976E97945j0390j7223j9326j7149j1869m871L054J1628K0538K9361L7963M6366
$$ 597945 587555 570332 551006 533857 521988 517117 520171 531799 552337 581698 619661 666027
56964F66027N4504O2559P1262Q1228R2355J04736J19787J39527J64461J92579
$$ 666027 720531 783090 854352 935580 1027935 1132671 1252458 1391985 1556446 1749025
56954A749025K20435K45482K68808K96556L37627L99198M85272N97462P28088
$$ 1749025 1969460 2214942 2483750 2780306 3117933 3517131 4002403 4599865 5327953
56945E327953Q43780Q80361P71780N00297J21665k63216n65744p46829q13613
$$ 5327953 6171733 7052094 7823874 8324171 8445836 8182620 7616876 6870047 6056434
56936F056434p95488p25111o30250n30482m36283l51352k76582k13114j63703
$$ 6056434 5260946 4535835 3905585 3375103 2938820 2587468 2310886 2097772 1934069
56927A934069j31746j17842j17122j21274j23647j21712j15518j06043r5296q5678
$$ 1934069 1802323 1684481 1567359 1446085 1322438 1200726 1085208 979165 883869 798191
56917G98191p8024p1291o4520n7890n1520m4871l8022l2169k8087k5155k2450
$$ 798191 720167 648876 584356 526466 474946 430075 392053 359884 331797 306642 284192
56906B84192j9788j7267j4848j2819j1613j0787r265p013n254m619m216l061j272
$$ 284192 264404 247137 232289 219470 207857 197070 187805 180792 175538 170919 166703 163642 162370
56893A62370O71K809N191P599J0296J4239J9965K7004L4474M0983M3707L9280
$$ 162370 163041 165850 171041 178640 188936 203175 223140 250144 284618 325601 369308 408588
56881D08588K6938J0045o251j8382k5292k7398k5831k1975j6804j0765m489J104
$$ 408588 435526 445571 439320 420938 395646 368248 342417 320442 303638 292873 288384 289488
56869B89488N744J0139J4936K0111K5669L2163L9996M9039N9437P1988Q6650J00463
$$ 289488 295232 305371 320307 340418 366087 398250 438246 487285 546722 618710 705360 805823
56857H05823J07245R9899P4609L4591j0091m7879p2102q2678q2834p5846o4582
$$ 805823 913068 1012967 1087576 1122167 1112076 1064197 992095 909417 826583 750737 686155
56846F86155n1845l9603k8304j7512o714M550J6481K8747M1038N3987O8839Q6607
$$ 686155 634310 594707 566403 548891 542177 546727 563208 591955 632993 686980 755819 842426
56834H42426J08129J33523J59008J74222J65905J27057O3068j0812p7381j24407
$$ 842426 950555 1084078 1243086 1417308 1583213 1710270 1773338 1762526 1685145 1560738
56824A560738j47944j51756j43231j28383j10268r0940p2711n6718m2112k7846
$$ 1560738 1412794 1261038 1117807 989424 879156 788216 715505 658787 616675 588829
56814E88829j4236j812J0189K3062L7174N2332O8977Q7708J07080J21620J22339
$$ 588829 574593 572781 582970 606032 643206 695538 764515 852223 959303 1080923 1203262
56803A203262J01106N7286P59n3209r3082j15404j22105j16803j04091q9053p4898
$$ 1203262 1304368 1361654 1362413 1309204 1216122 1100718 978613 861810 757719 668666 593768
56792E93768o1882m9442l8065k8227j9241j0458k323M910J2276K0805L0358M0667
$$ 593768 531886 482444 444379 416152 396911 386453 384130 389040 401316 422121 452479 493146
56780D93146N1743O1540O4685N5824L4380N288k4265m8145o2988o8845o8268o3946
$$ 493146 544889 606429 671114 726938 761318 766606 742341 694196 631208 562363 494095 430149
56768D30149n7221m9031m0963l4308k8946k4213k0156j7070j4624j2380j0491
$$ 430149 372928 323897 282934 248626 219680 195467 175311 158241 143617 131237 120746
56757A20746r080p681o076m892m582m543m003l057k131j277n34k09k12k5K28j73
$$ 120746 111666 103985 97909 93017 88435 83892 79889 76832 74701 73424 72890 72681 72469 72444 72672 72499
56741G2499j016j057oP63K97n91r43j123j596j773j266r94j679k476k399j999
$$ 72499 71483 70426 70420 71183 71480 70889 69946 68823 67227 65454 64188 63194 61515 59039 56640 54641
56725E4641k243k736k477j504n10L84J245J516P90k98q59p95k95O61J613J552
$$ 54641 52398 49662 47185 45681 45171 45555 46800 48316 49106 48808 47949 47154 46859 47520 49133 50685
56709E0685M28m53l29N1J16N25J490J775P27k67J27J123J351J065J196J498J264
$$ 50685 51113 50660 50331 50382 50498 51023 52513 54288 55015 54748 54875 55998 57349 58414 59610 61108 62372
56692F2372P27K39o73j985k430j547j005k067l397l326k637k795k959j454R29
$$ 62372 63099 63338 62665 60680 58250 56703 55698 53631 50234 46908 44271 41476 38517 37063 37992
56677C7992J853J014K44M86J023J344J587J454O42K9N27J323J108M00O07J439
$$ 37992 39845 40859 41103 41589 42612 43956 45543 46997 47639 47668 48195 49518 50626 51026 51633 53072
56661E3072J503Q36O78J104J223J241K014K833K165M59j48R23J949J699Q20J51
$$ 53072 54575 55411 56089 57193 58416 59657 61671 64504 66669 67128 66980 67903 69852 71551 72371 72522
56645G2522l85p96p35m97q02j369j199l34J49j08m93p98j300j618j052M1P00R18
$$ 72522 72137 71341 70606 70109 69307 67938 66739 66405 66554 66446 65953 65155 63855 62237 61185 61226 61926 62844
56627F2844J274J447P72j36j88J95j45p83l16R97J479Q96P33J465J875J415J105
$$ 62844 64118 65565 66337 66201 66013 66208 66063 65280 64964 65961 67440 68336 69069 70534 72409 73824 74929
56610G4929J523J882J686J469J406R17J19rO71J105Q48O46Q76R63P33P60J073
$$ 74929 76452 78334 80020 81489 82895 83812 83931 83922 84593 85698 86546 87192 88068 89031 89764 90524 91597
56593I1597R92N89P67J652K298K339K361K469K059J277J146J867K457K370K104
$$ 91597 92589 93178 93945 95597 97895 100234 102595 105064 107123 108400 109546 111413 113870 116240 118344
56578A18344J943J558J034R51J199J156J011J535K434K559J853J496J943K429
$$ 118344 120287 121845 122879 123830 125029 126185 127196 128731 131165 133724 135577 137073 139016 141445
56564A41445K536K698K983K939K842L547M853N593N548N718O476P027O974O934
$$ 141445 143981 146679 149662 152601 155443 158990 163843 169436 174984 180702 187178 194205 201179 208113
56550B08113P402Q268R497J0879J1338J0111Q481Q533J0283J1806J2118J1963
$$ 208113 215515 223783 233280 244159 255497 265608 274089 282622 292905 304711 316829 328792
56538C28792J1764J0999R828R302R472R129P804O318N110L738K275J367P37n36
$$ 328792 340556 351555 361383 370685 380157 389286 397090 403408 408518 412256 414531 415898 416635 416099
56524D16099k165l007l281m393o342p530p433p317p926q619r211j0368j1778j2152
$$ 416099 413934 410927 407646 403253 396911 389381 381948 374631 366705 358086 348875 338507 326729 314577
56510C14577j1562j1573j2453j2634j1532j0479j0105r294p675o714p081p202
$$ 314577 303015 291442 278989 266355 254823 244344 234239 224945 217270 210556 203475 196273
56498A96273n820l986l077k758k244j909k227k617k577k580k774k302r19J90K11
$$ 196273 190453 186467 183390 180632 178388 176479 174252 171635 169058 166478 163704 161402 160483 160673 160884
56483A60884j09pO4l05m64QL93J41j65J6K87L51O34J186J268O39R7J69M93P92
$$ 160884 160775 160768 160832 160527 160063 160071 160464 160605 160440 160456 160743 161094 161728 162914 164182 164821 164918 165087 165580 166372
56463A66372J194J372Q71L48Q75J974K174J573J722K893L769M050M875O190O290
$$ 166372 167566 168938 169809 170157 171032 173006 175180 176753 178475 181368 185137 189187 194062 200252 206542
56448B06542M864L921M712O036O700P337Q547R403R099Q297P675O928O124O230
$$ 206542 211406 215327 220039 226075 232775 240112 248659 258062 267161 275458 283133 290061 296185 302415
56434C02415P399Q499R018R618J0236R915Q964Q892R469Q557N759L517L362L762
$$ 302415 309814 318313 327331 336949 347185 357100 366064 374956 384425 392982 398741 402258 405620 409382
56420D09382L119K217K038J614J1j727k487l125m796o910q346r139r692r778r508
$$ 409382 412501 414718 416756 418370 418381 416654 414167 411042 406246 399336 390990 381851 372159 362381 352873
56405C52873r673j0242j0148r319q906q994q284o765o149o809o953n839m986n138
$$ 352873 343200 332958 322810 313491 304585 295591 287307 280542 274393 267584 260631 254792 249806 244668
56391B44668m840l407k393k628k717j913j623k344k191l74Q88m8j578j916j977
$$ 244668 239828 236421 234028 231400 228683 226770 225147 222803 220612 220238 221126 221078 219500 217584 215607
56376B15607k892l455k482j221r51o38O86J678J158L95O42Q03l5l27J089K460
$$ 215607 212715 209260 206778 205557 204606 203968 204654 206332 207490 207885 208527 209330 209295 208968 210057 212517
56360B12517K029J072J373K051J703J307K123K944K339J474J817K264J509J099
$$ 212517 214546 215618 216991 219042 220745 222052 224175 227119 229458 230932 232749 235013 236522 237621
56346B37621K898N442O059N009M421M746N133N816P264Q391Q281Q116Q996R677
$$ 237621 240519 245961 252020 257029 261450 266196 271329 277145 284409 292800 301081 309197 318193 327870
56332C27870Q880P832P819P520N543L503L349L779K592O41J16O09L39m08l33m8
$$ 327870 336750 344582 352401 359921 365464 368967 372316 376095 378687 379328 379444 380053 380392 379984 379651 379603
56316C79603o80j104K07K089K621K554L592M884M658L801M346N776O300O374P518
$$ 379603 378923 377819 378026 380115 382736 385290 388882 393766 398424 402225 406571 412347 418647 425021 432539
56301D32539Q895Q593P186O674O912O445N701O097O946O572N412N045N164M545
$$ 432539 441434 450027 457213 463887 470799 477244 482945 489042 495988 502560 507972 513017 518181 522726
56287E22726L754L846L773K181L44J13M66n21j878j421K29R30J008K267M200M909
$$ 522726 526480 530326 534099 536280 536624 536737 537203 536682 534804 533383 533612 534542 535550 537817 542017 546926
56271E46926M778N693P519Q779R738J1568J3548J4435J5314J7805K0840K2581
$$ 546926 551704 557397 564916 573695 583433 595001 608549 622984 638298 656103 676943 699524
56259F99524K4028K7179L1145L3908L6361M0688M6169N0611N4642O0510O7720
$$ 699524 723552 750731 781876 815784 852145 892833 939002 989613 1044255 1104765 1172485
56248A172485P4016P9602Q6418R4199J01161J07502J14474J20990J24974J26842
$$ 1172485 1246501 1326103 1412521 1506720 1607881 1715383 1829857 1950847 2075821 2202663
56238B202663J27934J26928J21676J12979J02525Q8918P0216M8741K8777J0868
$$ 2202663 2330597 2457525 2579201 2692180 2794705 2883623 2953839 3002580 3031357 3042225
56228C042225p008k4246l8366m9456n8868o5033o5648o2733o0197n7636n1963
$$ 3042225 3035217 3010971 2972605 2923149 2864281 2799248 2733600 2670867 2610670 2553034 2501071
56217B501071m4008l7758l3842k9591k5052k3188k4227k5433k6494k9840l5553
$$ 2501071 2457063 2419305 2385463 2355872 2330820 2307632 2283405 2257972 2231478 2201638 2166085
56206B166085m1072m5918n1695n7617o1110o2635o4803o7134o6813o4195o2179
$$ 2166085 2125013 2079095 2027400 1969783 1908673 1846038 1781235 1714101 1647288 1583093 1520914
56195A520914o0560n6580n0694m6129m2904l8090l1871k7541k5410k2503j8568
$$ 1520914 1460354 1403774 1353080 1306951 1264047 1225957 1194086 1166545 1141135 1118632 1100064
56184A100064j6518j6704j6385j5209j5487j6942j6817j5401j5642j7245j7067
$$ 1100064 1083546 1066842 1050457 1035248 1019761 1002819 986002 970601 954959 937714 920647
56173I20647j5340j5421j7219j7211j5208j4615j5671j4964j2212j0894j1433
$$ 920647 905307 889886 872667 855456 840248 825633 809962 794998 782786 771892 760459
56162G60459j0421p499o269p391p337n173l951m384l676j701j636l303k777K34
$$ 760459 750038 742539 736270 728879 721542 716369 712418 708034 704358 702657 701021 697718 694941 695175
56148F95175J498M1k37J926L196K675L654O557P404N364M580O394O997M981M094
$$ 695175 696673 696714 696477 698403 701599 704274 707928 714485 721889 727253 731833 738227 745224 750205 754299
56133G54299O063P790Q107J0078J4150J6256J5412J6030J9894K3016K3317K4285
$$ 754299 760362 768152 776259 786337 800487 816743 832155 848185 868079 891095 914412 938697
56121I38697K7947L1291L2849L5790M1299M5658M7161M9201N3493N6956N8376
$$ 938697 966644 997935 1030784 1066574 1107873 1153531 1200692 1249893 1303386 1360342 1418718
56110A418718O1379O7753P4637Q1233R1378J06399J22102J35403J46885J54484
$$ 1418718 1480097 1547850 1622487 1703720 1795098 1901497 2023599 2159002 2305887 2460371
56100B460371J52532J40238J23820J07510R0168P3069O2109N8497N5500M8145
$$ 2460371 2612903 2753141 2876961 2984471 3074639 3147708 3209817 3268314 3323814 3371959
56090C371959L8295K7137J1621p562k3271l1652l6783m2192m6572n1495o3674
$$ 3371959 3410254 3437391 3449012 3441450 3418179 3386527 3349744 3307552 3260980 3209485 3145811
56079C145811q4544j06274j22749j35693j45737j47388j38502j25515j13597j00262
$$ 3145811 3061267 2954993 2832244 2696551 2550814 2403426 2264924 2139409 2025812 1925550
56069A925550q3906o9371n9395m9614l7685k8275k3526j8046r126k333r58L61
$$ 1925550 1841644 1772273 1712878 1663264 1625579 1597304 1573778 1555732 1546606 1544273 1543315 1543676
56057A543676N400R510R343R497J3116J5730J4919J5948K1251K4686K2998K2371
$$ 1543676 1549076 1558586 1567929 1577426 1590542 1606272 1621191 1637139 1658390 1683076 1706074 1728445
56045A728445K6651L0000K8498K7843L1858L4707L2567L1482L5379L7905L4837
$$ 1728445 1755096 1785096 1813594 1841437 1873295 1908002 1940569 1972051 2007430 2045335 2080172
56034B080172L2823L6750M0274L8211L6450L9983M3158M1532M1206M6422N0344
$$ 2080172 2112995 2149745 2190019 2228230 2264680 2304663 2347821 2389353 2430559 2476981 2527325
56023B527325M8386M7899N4144N9708N8776N8404O4306O9292O7718O7351P4473
$$ 2527325 2575711 2623610 2677754 2737462 2796238 2854642 2918948 2988240 3055958 3123309 3197782
56012C197782Q1413Q1552Q2244Q9681R5996R5071R5757J04974J13469J13311J13408
$$ 3197782 3279195 3360747 3442991 3532672 3628668 3723739 3819496 3924470 4037939 4151250 4264658
56001D264658J22005J30304J29856J29479J37897J46709J48123J51917J66479
$$ 4264658 4386663 4516967 4646823 4776302 4914199 5060908 5209031 5360948 5527427
55992E527427J81276J87014J94339K12793K31266K39971K51102K75598L01148
$$ 5527427 5708703 5895717 6090056 6302849 6534115 6774086 7025188 7300786 7601934
55983G601934L16500L34903L68632M04000M28102M55760N01919N52977N95416
$$ 7601934 7918434 8253337 8621969 9025969 9454071 9909831 10411750 10964727 11560143
55974A1560143O45680P19806Q02090Q78284R69702J097706J246946J404058J598340
$$ 11560143 12205823 12925629 13727719 14606003 15575705 16673411 17920357 19324415 20922755
55965B0922755J859765K172389K515406K909827L373129L873674M390787M974916
$$ 20922755 22782520 24954909 27470315 30380142 33753271 37626945 42017732 46992648
55957D6992648N687138O535139P539169Q793875J0382876J2317252J4663631J7634520
$$ 46992648 52679786 59214925 66754094 75547969 85930845 98248097 112911728 130546248
55949A30546248K1434709K6169448L2034000L9160303M6532417N0982243M8191527
$$ 130546248 151980957 178150405 210184405 249344708 295877125 346859368 395050895
55942C95050895L5747189J5534687p056985k6384731l9244075m5244696m5693217
$$ 395050895 430798084 446332771 439275786 412891055 373646980 328402284 282709067
55935B82709067m2501061l7544941l2222879k7244570k2816948j8978596j5728037
$$ 282709067 240208006 202663065 170440186 143195616 120378668 101400072 85672035
55928H5672035j2994323j0681666q753956p202301n964390m951518m124127l473084
$$ 85672035 72677712 61996046 53242090 46039789 40075399 35123881 30999754 27526670
55920B7526670k956327k518090k146087j851995j616716j406333j220779j077544
$$ 27526670 24570343 22052253 19906166 18054171 16437455 15031122 13810343 12732799
55912A2732799r65270q58173p58915o85010o28474n68361n08489m65510m33271
$$ 12732799 11767529 10909356 10150441 9465431 8836957 8268596 7760107 7294597 6861326
55903F861326l94180l52955l25724l07558k82583k54826k38641k29146k11408
$$ 6861326 6467146 6114191 5788467 5480909 5198326 4943500 4704859 4475713 4264305
55894D264305j89046j75980j69104j55832j39742j32884j31052j21592j07856
$$ 4264305 4075259 3899279 3730175 3574343 3434601 3301717 3170665 3049073 2941217
55885B941217j02005j01135r3709q2455p8352p8658p2749o3317o0673o2077n7215
$$ 2941217 2839212 2738077 2644368 2561913 2483561 2404903 2332154 2268837 2208164 2146087 2088872
55874B088872m8298m4873m4454l7796k7825k4158k3999j7305n977M44L519J2272
$$ 2088872 2040574 1995701 1951247 1913451 1885626 1861468 1837469 1820164 1814187 1814631 1818150 1830422
55862A830422K5252L4018M0380N2739O8836P9113Q3755Q9612R3329Q4234O1837
$$ 1830422 1855674 1889692 1930072 1982811 2051647 2130760 2214515 2304127 2397456 2481690 2543527
55851B543527L4929N912k8545o3819r0001j06756j21144j32588j34317j27837
$$ 2543527 2578456 2584368 2555823 2492004 2402003 2295247 2174103 2041515 1907198 1779361
55841A779361j21530j16181j05627r0684p8871p1158o1913n1171m4410m1013l5165
$$ 1779361 1657831 1541650 1436023 1345339 1266468 1195310 1133397 1082226 1037816 996803 961638
55830I61638k7406k3513k2801j9215j2948r595q788n157M18J853o25j046J058
$$ 961638 934232 910719 887918 868703 855755 846160 837372 832215 832633 834486 833861 832815 833873
55817H33873O67k199k689j056j967m682m146j047o01k190l33M915Q680J1294J7282
$$ 833873 834540 832341 829652 828596 826629 821947 817801 816754 816153 813963 813630 818545 827225 838519 855801
55802H55801K4891K6909K1636J3430L138j1809k8239l8583m1684m2931m3783m0725
$$ 855801 880692 907601 929237 942667 945805 933996 905757 867174 825490 782559 738776 698051
55790F98051l4418k9951k7626k2889j5812j1387j0194p909m337l678n522m879
$$ 698051 663633 633682 606056 583167 567355 555968 545774 537865 533528 529850 524328 519449
55778E19449j741j365m344n488l506k720m049l181Q83M048N160P482J0706R905
$$ 519449 517708 516343 511999 506511 503005 500285 496236 493055 493938 497986 503146 510628 521334 531239
55764E31239M133j777n459r389j3717j4681j1928r834r785q294m399j878k544
$$ 531239 535372 533595 528136 518747 505030 490349 478421 468587 458802 450508 446109 444231 441687
55751D41687m250o727j2402k0068k4681k4835k3922k3004j9481j3721r806q468
$$ 441687 437437 430710 418308 398240 373559 348724 324802 301798 282317 268596 258790 250322
55739B50322o254k764j544k719k128Q45J935M4p71R22J446o67k052j379j785m178
$$ 250322 244068 241304 239760 237041 234913 235758 237693 237737 236966 237888 239334 238667 236615 235236 233451 229273
55723B29273m837k298j49m68p30M54O69q35j080R21K245J942K900N760P057N638
$$ 229273 224436 222138 221989 221521 220791 221245 221914 221079 219999 220920 223165 225107 228007 233767 240824 246462
55707B46462M910O364O928N090L657L860K622j511n425p070q526j0882j1620r815
$$ 246462 251372 257736 264664 269754 273411 277271 279893 278382 272957 265887 257361 246479 234859 225044
55693B25044q461q863q139n093l112m219n519m656l711m555n118l643k013j882
$$ 225044 216583 207720 199581 194488 191376 187157 181638 176982 173271 168716 163598 159955 157942 156060
55679A56060j677k71O17K61P16K337K061j202l999l846k846l164l407k347j840
$$ 156060 154383 154112 154729 154990 155706 158043 160104 158902 154903 151057 148211 145047 141640 139293 137453
55664A37453l025l735k516j357j756k018j044p87k280l234k162r73j021n93J153
$$ 137453 134428 130693 128177 126820 125064 123046 122002 121215 118935 115701 113539 112566 111545 110952 112105
55649A12105J858K65j208q28o61k552m756n259m804m214k433L85J621M09o56j43
$$ 112105 113963 114228 113020 112192 111531 108979 104223 98964 94160 89946 87513 87898 89519 89928 89272 89129
55633H9129p1j358j512N59J915O69n85M44J774J155R4M25P31m08j142J94J659
$$ 89129 89058 87700 86188 86747 88662 89331 88746 89190 90964 92119 92213 92638 93369 92961 91819 92013 93672
55616I3672J135r0k76n44k088l313k890k503l513m135k926j781k324k666j027
$$ 93672 94807 94717 94441 93897 91809 88496 85606 83103 79590 75455 72529 70748 68424 65758 64731
55601F4731O96L77n48j31L20r11k240j530N2M52L87J289K083J346L25O15J152
$$ 64731 65427 65804 65256 65125 65445 64534 62294 60764 60816 61268 61655 62944 65027 66373 66698 67313 68465
55584F8465O06J83J114J883J124N83J979L546L097K087L029N120O052O095O961
$$ 68465 69071 69254 70368 72251 73375 73958 75937 79483 82580 84667 87696 92816 98868 104963 111924
55569A11924Q435R439J0656J2944J4887J5023J4786J6327J9081K1285K2918K4336
$$ 111924 120359 129798 140454 153398 168285 183308 198094 214421 233502 254787 277705 302041
55557C02041K3967K0368J4864R423L723k983r199j3226j5986j9029k1566k2231
$$ 302041 326008 346376 361240 370663 374386 371403 362204 348978 332992 313963 292397 270166
55545B70166k1813k1522k0523j7973j5397j4176j2786r575o196n132n681n543
$$ 270166 248353 226831 206308 188335 172938 158762 145976 136401 130205 125073 119392 113849
55533A13849m692m456m413l373k052j819k120j846j721k652l362k401r56r07j690
$$ 113849 109157 104701 100288 96915 94863 93044 90924 89078 87357 84705 81343 78942 77986 77079 75389
55518G5389j788j581k083k528j931j356j921k343j204J97K1r28j033q78j590k105
$$ 75389 73601 72020 69937 67409 65478 64122 62201 59858 58654 58851 58872 57944 56911 56033 54443 52338
55502E2338j148ol02r46m25n9j562l412l284k217k575l538k660n20K23n80q67
$$ 52338 51190 51184 50882 49936 49511 49452 47890 44478 41194 38977 36402 32864 30204 29684 29907 29327 28460
55485B8460l58n20j178q36J49J60m49J4J192J268L59J61O74M01m92l99O52J050
$$ 28460 28102 27582 26404 25568 25717 25877 25428 25442 26634 27902 28261 28422 29096 29497 29005 28606 29258 30308
55467C0308M91L1k46r79j495o85N64N11m52o04k0j05p00m39M70O05J1m9M76P05
$$ 30308 30799 30830 30584 29605 28110 27425 27989 28500 28048 27444 27424 27319 26619 26180 26650 27255 27266 27217 27693 28398
55447B8398R00J738K300J389J4m0P08N07l65l53K64P4m15M64K209K734J894J393
$$ 28398 29298 31036 33336 34725 34739 34699 35407 35914 35549 35196 35460 35534 35119 35583 37792 40526 42420 43813
55429D3813J526R71l19r53p41p72j001l59Q46J191O58M62O89M16j76j58K09J48
$$ 43813 45339 46310 45991 45038 44297 43525 42524 42165 43011 44202 44860 45322 46011 46427 46251 46093 46302 46450
55411D6450K21J185J955J229J92P21K025K071J367K006L687M239L580L682M830
$$ 46450 46671 47856 49811 51040 51232 51953 53978 56049 57416 59422 63109 67348 70928 74610 79440
55396G9440N342M931N024N642N239L673K297J128r67l324l952l069l022m448n575
$$ 79440 84782 89713 94737 100379 105618 109291 111588 112716 111749 108425 104473 101404 98382 93934 88359
55381H8359n546n356n300m567l624l951n094n008l536k553k447j703l10j73j498
$$ 88359 82813 77457 72157 67590 63966 60015 54921 49913 46377 43824 41377 39674 39364 39191 37693
55366C7693k014p00P32R45O67M91j91j188j182k57q3r03r87J24O49l06j346j423
$$ 37693 35679 34979 35711 36656 37323 37814 37623 36435 35253 34996 34913 34010 33023 33147 33796 33490 32144 30721
55348C0721j239j149l21J003J062n13j742j375m99j19M07J442J922J388R68J217
$$ 30721 29482 28333 28012 29015 30077 29564 27822 26447 25948 25829 26236 27678 29600 30988 31956 33173
55332C3173J043r6r94p52j81j59l58m50q03j220q43J14L73k15l98J34K89j92k82
$$ 33173 34216 34120 33126 32374 32193 32034 31676 31226 30423 29203 28360 28474 28847 28632 28234 28368 28657 28465 28183
55313B8183J36j6n44J96K218L215J977J51m96l34k83j42K84L82P8K50R10Q62o7
$$ 28183 28319 28303 27759 27955 30173 33388 35365 35516 35020 34686 34403 34261 34545 34927 35005 35255 36165 37027 36960
55294C6960m36L70J117R61O64P13K43j159k422k630k070j124J51R54L42q03o54
$$ 36960 36524 36894 38011 38972 39636 40349 40592 39433 37011 34381 32311 31187 31338 32292 32634 31831 31177
55277C1177M94M91r17j480k68Q96P68N75J239J603Q73K41M46K50r75j605m85R72
$$ 31177 31671 32162 31245 29765 29497 30393 31161 31736 32975 34578 35451 35692 36138 36388 35413 33808 33323 34295
55259C4295J206Q72R67P80l44j171n54M87N17m2j84k56q64j361j119r01j304j376
$$ 34295 35501 36373 37340 38120 37776 36605 36051 36538 37055 37013 36829 36573 35709 34348 33229 32328 31024 29648
55241B9648l62O28L90l01r8P14J020P70N08J14n73r15n20j33l34n35k41o4l68
$$ 29648 29286 29914 30304 30003 29905 30619 31639 32409 32917 33031 32458 31543 31023 30890 30556 30021 29780 29716 29348
55222B9348l22N97J416J196M27o3k72k40M70J462J345j50j360j153m69l66k92
$$ 29348 29026 29623 31039 32235 32662 32599 32327 32087 32557 34019 35364 35214 33854 32701 32232 31866 31574
55205C1574M19J054R22P08J027J236R31R89J764J961Q32k04K14J139J030K02j56
$$ 31574 31993 33047 33969 34677 35704 36940 37871 38860 40624 42585 43417 43213 43427 44566 45596 45798 45642
55188D5642j07l81p42n97k77k98l38j02q2l95k06O31Q39j58j052q31m25p99j184
$$ 45642 45535 45154 44412 43815 43538 43240 42902 42800 42718 42323 42117 42748 43587 43429 42377 41546 41121 40322 39138
55169C9138q15o82j704k791k605j740j302p62O83J984J662K92m24k50j54l62m50
$$ 39138 38323 37641 35937 33146 30541 28801 27499 26737 27420 29404 31066 31358 30934 30684 30530 30168 29718
55152B9718o11j164j506r84p3N58J131J725J516L27l98K46J037O94L7L05Q93O96
$$ 29718 29107 27943 26437 25453 25380 25938 27069 28794 30310 30637 30239 30485 31522 32216 32253 32558 33451 34147
55134C4147K94O67J100N64j16L27J133R01L13R50K286K425J300N68O69N04j56
$$ 34147 34441 35108 36208 36772 36656 36983 38116 39017 39330 40280 42566 44991 46291 46859 47528 48032 47876
55117D7876k92K56M34o7l95k66m49j279k096k346k110j518o63P9M76Q13J100P25
$$ 47876 47584 47840 48274 48207 47812 47546 47097 45818 43722 41376 39266 37748 37085 37164 37640 38453 39553 40278
55099D0278k53n98K38R68N79K64J473L256L583K428J474J393J496J545J803J731
$$ 40278 40025 39427 39665 40633 41212 41476 42949 46205 49788 52216 53690 55083 56579 58124 59927 61658
55083F1658N89q35r97Q6J015J266J517J901J652O17l83p61o16j25M72N76L7k95
$$ 61658 62247 61412 60415 60501 61516 62782 64299 66200 67852 68469 68086 67325 66709 66584 67056 67632 67669 67374
55065F7374K23Q60O85R1o3P3j3K3N13P29J60k01N14J255P18l11l11L32K59k82
$$ 67374 67597 68457 69142 69233 69170 69243 69230 69253 69766 70495 70655 70454 70968 72223 72941 72630 72319 72651 72910 72628
55045G2628p8N57M15j39K00J036Q28j36nJ511K684K672K442K594K514K122K271
$$ 72628 72550 73107 73522 73383 73583 74619 75447 75311 75306 76817 79501 82173 84615 87209 89723 91845 94116
55028I4116K945K998K128J318R55L31o78j233j161j232j513j217n46q26k359l886
$$ 94116 97061 100059 102187 103505 104460 104791 104113 102880 101719 100487 98974 97757 97211 96385 94026 90140
55012I0140m563m859m978m237k649j520j670k306k349j778j113o61o85j265j705
$$ 90140 85577 80718 75740 71503 68854 67334 65664 63358 61009 59231 58118 57457 56772 55507 53802
54997E3802j157J2N69K34oM37J003J038N61j42o98n25M53J207Q47J05K44J027
$$ 53802 52645 52657 53226 53460 53454 53891 54894 55932 56493 56351 55653 55128 55581 56788 57635 57740 57984 59011
54979E9011J255R55J112J522R59m01p98M56K006K569K448K352K327K477L349M913
$$ 59011 60266 61221 62333 63855 64814 64413 63615 64071 66077 68646 71094 73446 75773 78250 81599 86512
54963H6512O297O958P181P230P124P377Q685J0804J2881J4857J7229J9534K0597
$$ 86512 92809 99767 106948 114178 121302 128679 137364 148168 161049 175906 193135 212669 233266
54950B33266K0256J9211J7213J3179P305J331l652q013j1899j4549j5819j6689
$$ 233266 253522 272733 289946 303125 310430 311761 308109 300096 288197 273648 257829 241140
54938B41140j7628j7797j6534j4291j1761r288p468o854o775n856m038k626k052
$$ 241140 223512 205715 189181 174890 163129 153841 146373 139519 132744 126888 122850 120224 118172
54925A18172j304L5R69R69R45J654K582L190L820M641N173N519O713R012J1247
$$ 118172 116868 116903 117872 118841 119786 121440 124022 127212 131032 135673 140846 146365 153078 162090 173337
54910A73337J2683J4134J6258J7963J7608J4886J0676N879J101l313p495j1627
$$ 173337 186020 200154 216412 234375 251983 266869 277545 283424 284525 281212 273717 262090
54898B62090j4991j6449j6106j5319j4786j3896j2258j0498q957p038m564k475
$$ 262090 247099 230650 214544 199225 184439 170543 158285 147787 138830 131792 127228 124753
54886A24753j502j251j194j427j860j944j782k295l612m512m207l412k950k520
$$ 124753 123251 122000 120806 119379 117519 115575 113793 111498 107886 103374 99167 95755 92805 90285
54872I0285j783j428k138l332l873l383k240j004l96r47k156k824k566k066j661
$$ 90285 88502 87074 84936 81604 77731 74348 72108 71104 70708 69761 67605 64781 62215 60149 58488
54857E8488q65K78Q27N02L14Q75J313Q03k6r7N45J127J289J095O11Q2p1R5J07
$$ 58488 57623 57901 58728 59230 59544 60419 61732 62535 62509 62412 62957 64084 65373 66468 67079 67161 67090 67185 67292
54838F7292pK74Q31Q28O6p04j066j373j644j371p29n61p41j07J467K476J981Q56
$$ 67292 67285 67559 68390 69218 69284 68580 67514 66141 64497 63126 62397 61836 61095 60988 62455 64931 66912 67768
54820F7768J95m6j1P76K160K829K244J655K167L120L545L833M685N683O223O802
$$ 67768 67963 67917 67906 68682 70842 73671 75915 77570 79737 82857 86402 90235 94920 100603 106826 113628
54804A13628Q025R395J0357J1538J3641J5979J7450J8172J8818J9061J7904J5073
$$ 113628 121653 131048 141405 152943 166584 182563 200013 218185 237003 256064 273968 289041
54792B89041J0926N693j88n600r652j2507j4573j5657j5743j5577j5545j4873
$$ 289041 299967 305660 305472 299872 290220 277713 263140 247483 231740 216163 200618 185745
54780A85745j2983j0717r052p630n826m283l943m231l791k501j283l65Q42K269
$$ 185745 172762 162045 152993 145363 139537 135254 131311 127080 123289 120788 119505 119140 119982 122251
54766A22251L107L192L345M147N287O300P260Q623J0717J3342J5756J7349J8430
$$ 122251 125358 128550 131895 136042 141329 147629 154889 163512 174229 187571 203327 220676 239106
54753B39106J9716K0906K0704J8511J5065J0926N596j086p796j3067j6836j9620
$$ 239106 258822 279728 300432 318943 334008 344934 350530 349444 341648 328581 311745 292125
54741B92125k1164k1034j9877j8787j7909j6674j5016j3358j1851j0376q983p681
$$ 292125 270961 249927 230050 211263 193354 176680 161664 148306 136455 126079 117096 109415
54729A09415o265m912m212m103l618k319j088p68j006j207j470j719j124M40J528
$$ 109415 103150 98238 94026 89923 86305 83986 82898 82130 81124 79917 78447 76728 75604 76044 77572
54714G7572J044m8l37k16r12k075k287j362m47m9K88N59J79o28q51k94J04k00
$$ 77572 78616 78568 78231 78015 77103 75028 72741 71379 70932 70883 71171 71730 71909 71281 70430 70136 70240 70040
54696G0040o46o23k03L57J017J617J848J722J527J289Q03J29m03o09l98L82J582
$$ 70040 69394 68771 68568 68925 69942 71559 73407 75129 76656 77945 78748 78877 78474 77865 77467 77849 79431
54679G9431K523K657K223J834J765K073K820L762M305M243M078M180M287M270
$$ 79431 81954 84611 86834 88668 90433 92506 95326 99088 103393 107636 111714 115894 120181 124451
54665A24451M613N567O611P323P994Q774R088Q666Q185Q144P991P229O391O011
$$ 124451 129064 134631 141242 148565 156559 165333 174421 183087 191272 199416 207407 214636 221027 227038
54651B27038N554M474L422L237L573L660L666M140M851N385O099P223P780O707
$$ 227038 232592 237066 240488 243725 247298 250958 254624 258764 263615 269000 275099 282322 290102 296809
54637B96809M433K012o57m257q338j1598j3569j4705j5183j4925j4398j4077j3456
$$ 296809 301242 303254 302597 298340 290002 278404 264835 250130 234947 220022 205624 191547 178091
54624A78091j1853r772q259p277o093m800m021l526k568j378q17p81l20P62J769
$$ 178091 166238 156466 148207 140930 134837 130037 126016 122490 119922 118544 117727 116946 116626 117388 119157
54609A19157K452L147L748L852L773M135M664M658M384M582M812L918K070O42
$$ 119157 121609 124756 128504 132356 136129 140264 144928 149586 153970 158552 163364 167282 169352 169994
54595A69994k1j063k990m711n222m931m704m685m682m741m803m524l834l165k885
$$ 169994 169973 168910 165920 161209 155987 151056 146352 141667 136985 132244 127441 122917 119083 115918 113033
54580A13033l059l673m406m389l113j487r49j601k202k019j583j514j651j618
$$ 113033 109974 106301 101895 97506 94393 92906 91957 90356 88154 86135 84552 83038 81387 79769
54566G9769j378r60m03p6l76j006j259r45m11J58P12Q57L42k26m7O37R63Q49R29
$$ 79769 78391 77431 77028 76952 76576 75570 74311 73366 72955 73113 73825 74682 75024 74798 74751 75388 76351 77200 78129
54547G8129J273J319J024R76J270J381J231J368J974K624L150L861M726N246N204
$$ 78129 79402 80721 81745 82721 83991 85372 86603 87971 89945 92569 95719 99580 104306 109552 114756
54532A14756M960M863N024N435N795N464M274K933J857K41k617n685p202o938
$$ 114756 119716 124579 129603 135038 140833 146297 150571 153504 155361 155602 152985 147300 140098 133160
54518A33160o201n874n797n775n833n539m441l090k407k175j469m13m2n16r12
$$ 133160 126959 121085 115288 109513 103680 98141 93700 90610 88203 86028 84559 84146 84104 83588 82676
54503H2676q09o73o35k94J62P4l79l73Q8K90L36R87J898J821Q17M47J290K024
$$ 82676 81867 81194 80559 80265 80427 80501 80122 79749 79837 80127 80463 81450 83348 85169 85986 86433 87723 89747
54485H9747J657J032J302K201K786K746K263J465O93L77L16r2o74o53r8O8l16
$$ 89747 91404 92436 93738 95939 98725 101471 103734 105199 105892 106269 106585 106493 105819 105166 105068 105136 104820
54468A04820m52k45n57j394j532o05N2m12r99p37m21j195k472k754j787o33r4
$$ 104820 104368 104123 103566 102172 100640 100035 100087 99675 98676 97939 97518 96323 93851 91097 89310 88677 88583
54451H8583q6k28k82k63n40j339k016j645n23q5q50j655j516j037j105j295p20
$$ 88583 88497 88269 87987 87724 87184 85845 83829 82184 81661 81576 80726 79071 77555 76518 75413 74118 73398
54434G3398M05J106J060O59J48m46q32o58r3L48L94R5l43n88l67K12P94J221J406
$$ 73398 73803 74909 75969 76628 76776 76330 75498 74840 74747 75095 75489 75584 75241 74653 74286 74498 75292 76513 77919
54415G7919J067K40j78N86J830K102J247N21N92Q54R16J321K299L125L375L585
$$ 77919 78986 79226 79048 79634 81464 83566 84813 85334 85926 86780 87696 89017 91316 94441 97816 101401
54399A01401M107M444M386M628N526O328O414O310O733P462P926Q070P991P482
$$ 101401 105508 109952 114338 118966 124492 130820 137234 143544 150277 157739 165665 173735 181726 189208
54385A89208O451N099L315Q68j597k902l080l468m552n175m520l521l373l918
$$ 189208 195659 200758 204073 204941 203344 200442 197362 193894 189342 184167 179647 176126 172753 168835
54371A68835m418m781n013m656l786l464m111m526l595k016j114r41p66n44o21
$$ 168835 164417 159636 154623 149967 146181 142717 138606 134080 130485 128469 127355 126414 125648 125104 124483
54356A24483o68k15L16K64r4j1O06J385K213K912K952K344K120K888L755L699
$$ 124483 123815 123600 123916 124180 124086 124075 124681 126066 128279 131191 134143 136487 138607 141495 145250 148949
54340A48949L307L846N250O290O360N928N452M903M214L417K493J640J188Q14
$$ 148949 152256 156102 161352 167642 174002 179930 185382 190285 194499 197916 200409 202049 203237 204051
54326B04051m33k659m594n256n306n801o559o798o598o473o293n825n661o249
$$ 204051 203618 200959 196365 191109 185803 180002 173443 166645 160047 153574 147281 141456 135795 129546
54312A29546o663n792m235l581m102m612m358l703l068k516k364k890l481l200
$$ 129546 122883 117091 112856 109275 105173 100561 96203 92500 89432 86916 84552 81662 78181 74981
54298G4981k265j787j983j858q57K28M40j42p62r24o70k99p2M8K92N73M02l27
$$ 74981 72716 70929 68946 67088 66231 66459 66899 66757 65995 65071 64401 64102 64030 64078 64370 64943 65345 65018
54280F5018r10p11q4J76n9l33m23m83o05q15j158j425j148l15M54Q74J395K141
$$ 65018 64108 63397 63313 63489 63430 63097 62674 62191 61586 60771 59613 58188 57040 56725 57179 58053 59448 61589
54262F1589K302J411L31R0M22M90L17L95N27K78N9M91J090Q84L2m50l33k79l88
$$ 61589 63891 65302 65633 65723 66145 66635 66952 67347 67874 68152 68211 68702 69792 70676 70708 70258 69925 69646 69258
54243F9258n3P19J070O79J98R8K5l25o18n32l00k42k80k71l33o17j056j411j435
$$ 69258 69205 69924 70994 71673 71871 71969 71994 71669 71051 70519 70219 69977 69697 69426 69093 68476 67420 66009 64574
54224F4574j065o57p05j095j106m73R8j0m44o04o77j083j505j372r25q65j249
$$ 64574 63509 62852 62147 61052 59946 59473 59571 59561 59117 58513 57836 56753 55248 53876 52951 52086 50837
54207E0837j479j216n50L27R89P81k81j089p75O1K69k04n51n19m81m73k74r2k64
$$ 50837 49358 48142 47592 47919 48908 49689 49408 48319 47544 47605 47874 47670 47119 46600 46119 45646 45372 45280 45016
54188D5016m90l36j65n26j048r75m81k96l39M1P29R75P22O16P84P57N09L74O9
$$ 45016 44526 44190 44025 43499 42451 41476 40995 40699 40360 40401 41130 42105 42827 43443 44227 44984 45493 45867 45936
54169D5936q85j854j582j46R20P18%k19R0N43J027J374J173M34k35m12k28J25
$$ 45936 45051 43197 41615 41469 42389 43107 43107 42888 42978 43521 44548 45922 47095 47529 47294 46882 46654 46779
54151D6779N30O16J07m99m54Qk3n95p18R1J127J637J628J257M41m85o93nO43M04
$$ 46779 47309 47925 48032 47533 47079 47087 47064 46469 45751 45842 46969 48606 50234 51491 51932 51447 50754 50749 51392 51796
54131E1796m36j094j306j198p51J6P27R86R18R89J424J887J761P46o34j315p44
$$ 51796 51360 50266 48960 47762 47011 47027 47754 48740 49658 50647 52071 53958 55719 56465 55831 54516 53772
54114E3772N58J732K450K734K480J732R79N27K4p67j232q44k90o03j505j695o45
$$ 53772 54330 56062 58512 61246 63726 65458 66437 66964 66988 66221 64989 64145 63855 63252 61747 60052 59407
54097E9407Q33J673J389L2j643k280j198N27J258P41j4m68q70j190j096q86j116
$$ 59407 60240 61913 63302 63334 61691 59411 58213 58740 59998 60739 60725 60257 59387 58197 57101 56215 55099
54080E5099j274l33J372K244J667P40L97K46k40o35l74K64O79O81L21l01p58o04
$$ 55099 53825 53492 54864 57108 58775 59515 59912 60158 59918 59283 58909 59173 59852 60533 60854 60553 59795 59191
54062E9191j14J7j82k4N64R14Q49R36J319J398R77O28O40O75P18J203J886J847
$$ 59191 59077 59094 58912 58888 59452 60366 61215 62151 63470 64868 65845 66473 67113 67788 68506 69709 71595 73442
54044G3442R95M04O42R69P24L61M42O93P70R87J551J950J816J605J771K052K127
$$ 73442 74437 74841 75483 76452 77176 77537 77979 78672 79442 80429 81980 83930 85746 87351 89122 91174 93301
54027I3301K242K556K723K605K673L150L552L604L794M468N132N267N102N042
$$ 93301 95543 98099 100822 103427 106100 109250 112802 116406 120200 124668 129800 135067 140169 145211
54013A45211N036N037N311N821N945N358M484L728K982K255J950K111K215K120
$$ 145211 150247 155284 160595 166416 172361 177719 182203 185931 188913 191168 193118 195229 197444 199564
53999A99564K292K695K504J437L73k1l47j394k879l954m291m075l627l494m105
$$ 199564 201856 204551 207055 208492 208865 208844 208497 207103 204224 200270 195979 191904 188277 184783 180678
53984A80678m939m952m272m244n252n779m624k761j901k138k295j820j106m56
$$ 180678 175739 170787 166515 162271 157019 151240 146616 143855 141954 139816 137521 135701 134595 134139
53970A34139J3m1p71j597j934j994k172k230j898j605j735j744j032j06J32j62
$$ 134139 134152 134111 133340 131743 129809 127815 125643 123413 121515 119910 118175 116431 115399 115293 115425 115263
53954A15263p4O91J604K238K519K362J851J460J470J545J502J856K863L678L474
$$ 115263 115189 115880 117484 119722 122241 124603 126454 127914 129384 130929 132431 134287 137150 140828 144302
53939A44302K810K832L527L919L665L259K851K032R02K74O24J586K597L366L673
$$ 144302 147112 149944 153471 157390 161055 164314 167165 169197 170099 170373 170997 172583 175180 178546 182219
53924A82219L386K836K562K620K546K051J307N57q3n24p28q56j115j467j697j561
$$ 182219 185605 188441 191003 193623 196169 198220 199527 200084 200001 199477 198749 197893 196778 195311 193614 192053
53908A92053q32N24K056L149L753M320M918N101M869M950N632O195O050N721N946
$$ 192053 191221 191745 193801 196950 200703 205023 209941 215042 219911 224861 230493 236688 242738 248459 254405
53893B54405O456O436N654M490L353K651K677K899K120J33j611j859j288j257
$$ 254405 260861 267297 272951 277441 280794 283445 286122 289021 291141 291274 289663 287804 286516 285259
53879B85259j704j663j334j929l517m649m469l875m090n036n742n630m856l874
$$ 285259 283555 281892 280558 278629 275112 270463 265994 262119 258029 252993 247251 241621 236765 232891
53865B32891l138k951l305l933m584n103n329n200m891m659m585m626m695m588
$$ 232891 229753 226802 223497 219564 214980 209877 204548 199348 194457 189798 185213 180587 175892 171304
53851A71304m096l406k982k958k988k891k819k680k140j477j603k724l787l828
$$ 171304 167208 163802 160820 157862 154874 151983 149164 146484 144344 142867 141264 138540 134753 130925
53837A30925l138k458j874j306j221j800k160j495m85m02j191j681j385r15p16
$$ 130925 127787 125329 123455 122149 120928 119128 116968 115473 114988 114586 113395 111714 110329 109414 108698
53822A08698n52l36m02p59q98n36K1L93M49K37k8OL10L10k65p78n81j1K60L76
$$ 108698 108146 107810 107408 106649 105751 105215 105236 105629 106078 106315 106287 106293 106603 106913 106648 105870 105289 105278 105538 105914
53802A05914Q58J428J316N71N0K07P82J570K429K808K256J426J430K230K779K797
$$ 105914 106772 108200 109516 110087 110137 110344 111126 112696 115125 117933 120189 121615 123045 125275 128054 130851
53786A30851L161M220N010M712L939L749M167M471M381M185L983L528K817K232
$$ 130851 134012 138232 143242 147954 151893 155642 159809 164280 168661 172846 176829 180357 183174 185406
53772A85406K065K167K270K347K482K476J878O04p52j614k114k621k816k159j175
$$ 185406 187471 189638 191908 194255 196737 199213 201091 201695 200943 199329 197215 194594 191778 189619 188444
53757A88444j189k361l227k778j963k139k968l054k070r18k91j93o35j511j978
$$ 188444 187255 184894 181667 178889 176926 174787 171819 168765 166695 165777 165486 165293 164658 163147 161169
53742A61169j179M11J444J488J341J491J428P31j64o48o36k91K93Q67J082J029
$$ 161169 159990 160401 161845 163333 164674 166165 167593 168324 168160 167512 166876 166585 166878 167745 168827 169856
53726A69856J166J620J979J928J624J381J340J485J591J240L05p49j392j713k168
$$ 169856 171022 172642 174621 176549 178173 179554 180894 182379 183970 185210 185515 184766 183374 181661 179493
53711A79493k869l570m069m214l838l094k416j849r54R7K87p26j662j246m3O02
$$ 179493 176624 173054 168985 164771 160933 157839 155423 153574 152620 152717 153004 152278 150616 149370 149327 149929
53695A49929O73J148K018K247J572Q38N26K99J40N94J615K307K207J797J568J508
$$ 149929 150602 151750 153768 156015 157587 158425 158951 159250 159390 159984 161599 163906 166113 167910 169478 170986
53679A70986J707K397L218L361K721K082K016K464L373M716N814N750M686L729
$$ 170986 172693 175090 178308 181669 184390 186472 188488 190952 194325 199041 204855 210605 215291 219020
53665B19020L351K903J930Q95L01O1J7K06L31p5q24j267j435j901k456k172j053
$$ 219020 222371 225274 227204 228099 228400 228461 228478 228684 229015 228940 228116 226849 225414 223513 221057 218885 217832
53648B17832m07j033k180k799k817k617k230j695j361j285j014m13J0l2j98k72
$$ 217832 217425 216392 214212 211413 208596 205979 203749 202054 200693 199408 198394 197981 197991 197959 197761 197489
53632A97489n16r21r91n67n9L70R46J361Q41n63j789k221k243k054j214J27Q56
$$ 197489 196973 196052 195061 194494 194435 194805 195751 197112 197953 197390 195601 193380 191137 189083 187869 187996 188852
53615A88852N55L21J104K331L057L390L793L958L400K440J632R95O39J272L028
$$ 188852 189407 189728 190832 193163 196220 199610 203403 207361 210761 213201 214833 215828 216467 217739 220767
53600B20767M633M859M172L847M036M022L800M133N095N836N874N643N641N766
$$ 220767 225400 230259 234431 238278 242314 246336 250136 254269 259364 265200 271074 276717 282358 288124
53586B88124N799N879O243O788P102O896O356N978N865N522M717M190M677N544
$$ 288124 293923 299802 306045 312833 319935 326831 333187 339165 345030 350552 355269 359459 364136 369680
53572C69680N540M767M601N430O070N852N722O365O838O212N234M941M792L810
$$ 369680 375220 379987 384588 390018 396088 401940 407662 414027 420865 427077 432311 437252 442044 445854
53558D45854K618K584L498L854L198K503K367K300K000J878K066K066J648J160
$$ 445854 448472 451056 454554 458408 461606 464109 466476 468776 470776 472654 474720 476786 478434 479594
53544D79594P73L39R1N02J250J333M37n97r60p49l78Q4O74J243J801K588L503
$$ 479594 480367 480706 480797 481299 482549 483882 484319 483722 482762 482013 481635 481719 482393 483636 485437 488025 491528
53527D91528M001L860L579L728M245M713M999N328N905O698P407P648P437P383
$$ 491528 495529 499389 502968 506696 510941 515654 520653 525981 531886 538584 545991 553639 561076 568459
53513E68459Q130R519J0692J1095J1034J1108J1482J1885J2049J1948J1794J1949
$$ 568459 576589 586108 596800 607895 618929 630037 641519 653404 665453 677401 689195 701144
53501G01144J2738J4124J5628J6728J7345J7799J8286J8636J8744J9041K0037
$$ 701144 713882 728006 743634 760362 777707 795506 813792 832428 851172 870213 890250
53490H90250K1445K2379K2643K3189K4774K6657K7508K7198K6770K6804K6876
$$ 890250 911695 934074 956717 979906 1004680 1031337 1058845 1086043 1112813 1139617 1166493
53479A166493K6686K6615K6825K6774K6153K5499K5406K5773K6293K6990K7756
$$ 1166493 1193179 1219794 1246619 1273393 1299546 1325045 1350451 1376224 1402517 1429507 1457263
53468A457263K8139K8071K8140K8542K8386K6838K4408K2333K1048J9948J8416
$$ 1457263 1485402 1513473 1541613 1570155 1598541 1625379 1649787 1672120 1693168 1713116 1731532
53457A731532J6411J4166J1861R522P081M643K775K032K063J836R31r3r66k413
$$ 1731532 1747943 1762109 1773970 1783492 1790573 1795216 1797991 1800023 1802086 1803922 1804853 1804760 1803794 1801381
53443A801381n007q131j0824j2978j4981j6748j8043j9273k1080k3422k5726k7636
$$ 1801381 1796374 1788243 1777419 1764441 1749460 1732712 1714669 1695396 1674316 1650894 1625168 1597532
53431A597532k9066k9898l0294l0889l1957l2800l2638l1720l0926l0567l0339
$$ 1597532 1568466 1538568 1508274 1477385 1445428 1412628 1379990 1348270 1317344 1286777 1256438
53420A256438l0001k9414k8265k6471k4574k3096k1859k0521j9243j8160j6717
$$ 1256438 1226437 1197023 1168758 1142287 1117713 1094617 1072758 1052237 1032994 1014834 998117
53409I98117j4445j1900r917q256n955k831L57L112N684Q431J1363J4302J6894
$$ 998117 983672 971772 961855 953599 947644 944813 945170 948282 953966 962397 973760 988062 1004956
53396A004956J8740K0043K1790K4560K7633K9967L1672L3611L6007L8326M0242
$$ 1004956 1023696 1043739 1065529 1090089 1117722 1147689 1179361 1212972 1248979 1287305 1327547
53385A327547M1729M2639M3122M4165M6611M9890N2750N4928N7024N9096O0635
$$ 1327547 1369276 1411915 1455037 1499202 1545813 1595703 1648453 1703381 1760405 1819501 1880136
53374A880136O1816O3341O5111O6344O7113O8384P0330P1878P2258P1821P1022
$$ 1880136 1941952 2005293 2070404 2136748 2203861 2272245 2342575 2414453 2486711 2558532 2629554
53363B629554O9773O8233O7026O6166O4765O2349N9461N6479N2782M7722M1669
$$ 2629554 2699327 2767560 2834586 2900752 2965517 3027866 3087327 3143806 3196588 3244310 3285979
53352C285979L5499K9806K4957K1102J7596J3311Q007K619k253p196j2670j7948
$$ 3285979 3321478 3351284 3376241 3397343 3414939 3428250 3436257 3438876 3436623 3429427 3416757 3398809
53340C398809k2156k5619k9295l3593l8674m5170n3405o2235o9743p5078p8761
$$ 3398809 3376653 3351034 3321739 3288146 3249472 3204302 3150897 3088662 3018919 2943841 2865080
53329B865080q1359q2795q2926q2114q0892p9556p8154p6564p4634p2446p0322
$$ 2865080 2783721 2700926 2618000 2535886 2454994 2375438 2297284 2220720 2146086 2073640 2003318
53318B003318o8298o5924o2912n9724n7021n4833n2775n0754m8855m6701m3639
$$ 2003318 1935020 1869096 1806184 1746460 1689439 1634606 1581831 1531077 1482222 1435521 1391882
53307A391882l9637l5361l1371k7731k4426k1495j8642j5342j1648q304n659l057
$$ 1391882 1352245 1316884 1285513 1257782 1233356 1211861 1193219 1177877 1166229 1157925 1152266 1149209
53295A149209J90L672O409Q192R620J0936J1721J1869J2052J2779J3649J4130
$$ 1149209 1149399 1153071 1159480 1167672 1177292 1188228 1199949 1211818 1223870 1236649 1250298 1264428
53283A264428J4497J5266J6214J6803J7344J8691K0845K2801K4068K5374K7444
$$ 1264428 1278925 1294191 1310405 1327208 1344552 1363243 1384088 1406889 1430957 1456331 1483775
53272A483775K9878L1885L3481L5226L7176L8669L9017L8017L6088L4275L3670
$$ 1483775 1513653 1545538 1579019 1614245 1651421 1690090 1729107 1767124 1803212 1837487 1871157
53261A871157L4309L4932L4279L2295K9770K7220K4752K2492K0476J8345J5820
$$ 1871157 1905466 1940398 1974677 2006972 2036742 2063962 2088714 2111206 2131682 2150027 2165847
53250B165847J3280J1300R812Q265O330L888N90l738q524j2886j6626k0110k3417
$$ 2165847 2179127 2190427 2200239 2208504 2214834 2218722 2219312 2215574 2207050 2194164 2177538 2157428 2134011
53237B134011k6371k9229l2492l5999l9031m1419m3704m6073m7951m8957m9474
$$ 2134011 2107640 2078411 2045919 2009920 1970889 1929470 1885766 1839693 1791742 1742785 1693311
53226A693311m9925n0099m9678m8929m8268m7500m6072m3918m1663l9884l8537
$$ 1693311 1643386 1593287 1543609 1494680 1446412 1398912 1352840 1308922 1267259 1227375 1188838
53215A188838l7255l6003l5208l5107l5244l4957l4272l3752l3457l2649l0845
$$ 1188838 1151583 1115580 1080372 1045265 1010021 975064 940792 907040 873583 840934 810089
53204H10089k8623k6799k5340k3688k1842k0416j9718j9330j8610j7221j5345
$$ 810089 781466 754667 729327 705639 683797 663381 643663 624333 605723 588502 573157
53193E73157j3718j3163j3691j4310j4098j3143j2059j1050j0060r343r167r230
$$ 573157 559439 546276 532585 518275 504177 491034 478975 467925 457865 448522 439355 430125
53181D30125r055q659q193p339n862m357l586l337k844k078j706j860j949j633
$$ 430125 421070 412411 404218 396879 391017 386660 383074 379737 376893 374815 373109 371249 369300 367667
53167C67667j130n67J49Q35J174J235J134L24j797m663o912p963q392q825r315
$$ 367667 366537 365970 366119 366954 368128 369363 370497 370821 369024 364361 357449 349486 341094 332269 322954
53152C22954r837j0329j0305r338q025p470p782q038p768p358o982o316n474n069
$$ 322954 313117 302788 292483 283145 275120 267650 259868 251830 244062 236704 229722 223406 217932 212863
53138B12863n020m480l305k468k553k932k872k540k351k322k507l106l695l353
$$ 212863 207843 203363 200058 197590 195037 192105 189233 186693 184342 182020 179513 176407 172712 169359
53124A69359k064j022j006j457j705j964k421k402j485m78l27o98o35k6N26P45
$$ 169359 167295 166273 165267 163810 162105 160141 157720 155318 153833 153355 153028 152330 151695 151669 152195 152940
53108A52940P00K17q22j824k008j401p34m58m37l66j01K80M39R6m68o83o09r43
$$ 152940 153640 153857 153035 151211 149203 147802 147068 146610 146173 145807 145706 145986 146425 146521 146053 145370 144761 143818
53090A43818j799k244j592m56Q1j90o75r67j110j272j563j962k106j657r94r14
$$ 143818 142019 139775 138183 137727 137808 137618 136943 135976 134866 133594 132031 130069 127963 126306 125312 124398
53074A24398j398j488p87k00n50j331j599j362j248j363j402j402j488j252l10
$$ 124398 123000 121512 120725 120525 119975 118644 117045 115683 114435 113072 111670 110268 108780 107528 107218
53059A07218P84J040M00j54J25R67J572J508J035P69R39J078P01J67J97O18N41
$$ 107218 108002 109042 109442 109288 109413 110380 111952 113460 114495 115264 116203 117281 117982 118149 118346 118964 119505
53042A19505k8Q8J419K801L007K452K282K558K449J771J178J120J483K101K857
$$ 119505 119477 119565 120984 123785 126792 129244 131526 134084 136533 138304 139482 140602 142085 144186 147043
53027A47043L481L896M523N687O997P923Q521R023R133Q499P387O184M621K339
$$ 147043 150524 154420 158943 164630 171627 179550 188071 197094 206227 214726 222113 228297 232918 235257
53013B35257j70k036l127l895m422m496m371m581n120n543n757n956o020n701
$$ 235257 235087 233051 229924 226029 221607 217111 212740 208159 203039 197496 191739 185783 179763 174062
52999A74062n201m909m646m002l218l010l543m215m427m008l095k157j885k478
$$ 174062 168861 163952 159306 155304 152086 149076 145533 141318 136891 132883 129788 127631 125746 123268
52985A23268l219l371l099k939k775k196j458j205j400j485j400j512j739j642
$$ 123268 120049 116678 113579 110640 107865 105669 104211 103006 101606 100121 98721 97209 95470 93828
52971I3828j317j255j293p69K55Q51N35j15m22l90k54N1N61R95J074Q58O12N86
$$ 93828 92511 91256 89963 89194 89449 90300 90835 90720 90298 89908 89654 89705 90266 91261 92335 93193 93805 94391
52953I4391Q61J107P28k95j061q18KN46Q83J602K388K228J123K97M64R24Q71N08
$$ 94391 95252 96359 97087 96792 95731 94913 94915 95461 96344 97946 100334 102562 103685 103982 104446 105370 106241 106749
52935A06749L96M80M66M52N84N66J43l16k50L26R44J228J063M66l38r10r59n46
$$ 106749 107145 107625 108091 108543 109127 109693 109836 109520 109270 109596 110540 111768 112831 113297 112959 112049 111090 110544
52917A10544R7O82P80J26q41j201o15K06M24J59K40J042J989K218J604R77J323
$$ 110544 110641 111323 112103 112229 111388 110187 109572 109778 110202 110361 110601 111643 113632 115850 117454 118431 119754
52900A19754K774M479N522N691N307M667M059L861M066L895K577M62j257j971
$$ 119754 122528 127007 132529 138220 143527 148194 152253 156114 160180 164075 166652 167114 165857 163886
52886A63886k204k718l600m487n086n266n006m606m490m702m815m521l960l338
$$ 163886 161682 158964 155364 150877 145791 140525 135519 130913 126423 121721 116906 112385 108425 105087
52872A05087k662k071k002k625l392l571l073k495k341k542k657k373j703q86
$$ 105087 102425 100354 98352 95727 92335 88764 85691 83196 80855 78313 75656 73283 71580 70694
52858G0694j64L60O81Q12P17L44k23o63n63J30Q50Q66M2r94j472j119k61M88O33
$$ 70694 70530 70890 71571 72383 73100 73444 73221 72558 71995 72125 72975 73841 73883 72889 71417 70298 70037 70525 71158
52839G1158K58L3M87J306J728J498R84M31k29q05q40l68k1r5k10r7n9k44l05j34
$$ 71158 71416 71449 71936 73242 74970 76468 77452 77883 77654 76849 76009 75641 75620 75525 75315 75218 75159 74915 74610 74476
52819G4476k43q39j238p63L64J556K529K992K504J330N50N94M86n55j738j959
$$ 74476 74233 73394 72156 71393 71757 73313 75842 78834 81338 82668 83218 83812 84298 83743 82005 80046
52803H0046j560j552j753j253k68N4n15r98q38m53j82J33L22q1q27j029m72J24
$$ 80046 78486 76934 75181 73928 73660 73714 73199 72201 71363 70910 70728 70861 71183 71102 70275 69246 68774 68898
52785F8898L56O43J202J536J309R35Q84J062J129Q94K93m41o07K30J393J714J106
$$ 68898 69254 69897 71099 72635 73944 74879 75763 76825 77954 78848 79141 78700 78093 78323 79716 81430 82536
52768H2536O67J171K227L094L496L516L290L080L031K925K669K832L877N146N557
$$ 82536 83203 84374 86601 89695 93191 96707 99997 103077 106108 109033 111702 114534 118411 123557 129114
52753A29114N158M897M973M659L775L101K998K833K092J027j51j640l156l809
$$ 129114 134272 139169 144142 148801 152576 155677 158675 161508 163600 164627 164476 162836 159680 155871
52739A55871l420l072l744n184o541p307p180o016m482l791m233m651m087l071
$$ 155871 152451 149379 145635 140451 133910 126603 119423 113407 108925 105134 100901 96250 92163 89092
52725H9092k602k609k374j899j854k361k649k019p04K87J13j064k108k121j379
$$ 89092 86490 83881 81507 79608 77754 75393 72744 70725 70021 70308 70421 69357 67249 65128 63749
52710F3749p60n33l57k43m95q02m68L12N04j13m77J01Q37P03j35q38j142j308
$$ 63749 62989 62456 62099 61856 61361 60559 60091 60403 60907 60794 60317 60418 61255 61958 61823 60985 59843 58535
52692E8535j322q55J82J481K443K417J247k63j041r90q77r89q07k03J57l8j89
$$ 58535 57213 56358 56540 58021 60464 62881 64128 63865 62824 61834 60957 59968 59161 58958 59115 59077 58888
52675E8888R5K11m30j400j888j722j247p23l65l85o34o44l77k87n07o71o31n58
$$ 58888 58983 59194 58764 57364 55476 53754 52507 51784 51419 51034 50400 49756 49379 49092 48585 47914 47283 46725
52657D6725k61O16J551J522O45J85N43O74O1k97L15R38N59k02k95l2l10q93r47
$$ 46725 46464 47080 48631 50153 50798 50983 51526 52200 52261 51964 52279 53217 53776 53574 53279 53247 52937 52044 51097
52638E1097n79n00o62m91o0J42K48O47R23L24q35j387q20K30R91J255J196J078
$$ 51097 50518 50018 49356 48865 48805 48947 49195 49842 50765 51089 50254 48867 48047 48277 49268 50523 51719 52797
52620E2797J100J126Q23L55L60Q36Q87Q6o99n55J47N14M05Q2o04j599j948r38
$$ 52797 53897 55023 55846 56201 56561 57397 58284 58370 57671 57116 57263 57777 58182 58264 57660 56061 54113 53175
52602E3175N64J097N47N4K61P12P73K40p24j564j535o15K78N53P30J249J444P40
$$ 53175 53739 54836 55383 55437 55698 56410 57183 57423 56699 55135 53600 52985 53263 53816 54546 55795 57239 57979
52584E7979o7O0P16Q68N93O53Q80N92L5o7jm77r76m00Q48J244N64J11L82L29o36
$$ 57979 57912 57972 58688 59556 60149 60802 61682 62274 62309 62242 62241 61764 60788 60388 61236 62480 63044 63155 63537 63866 63230
52563F3230j553j403m15P28J717K272K021J220O13K72l38j013q23K10Q54N25J10
$$ 63230 61677 60274 59859 60587 62304 64576 66597 67817 68430 68702 68364 67351 66528 66738 67592 68117 68227
52546F8227L10N01J8n67m11K31N24L14Q6J93O94J492K118J921R81K15K16N15M53
$$ 68227 68537 69038 69056 68489 68078 68309 68833 69147 69233 69426 70120 71612 73730 75651 76632 76847 77063 77578 78031
52527G8031J00o6J20N69J156J546J262L07p66j538j968j839q27O85J674J774J698
$$ 78031 78131 78065 78185 78754 79910 81456 82718 83025 82259 80721 78753 76914 76087 76772 78446 80220 81918
52510H1918K011K332K226K025K170K431K464K529K943L338L200K698K371K298
$$ 81918 83929 86261 88487 90512 92682 95113 97577 100106 103049 106387 109587 112285 114656 116954
52496A16954K181J936J608J004j00j490k720l569l947l662k679j473o99n92r16
$$ 116954 119135 121071 122679 123683 123583 122093 119373 115804 111857 108195 105516 104043 103344 102752 101836
52481A01836j374j855k346k729k688j992j017o47j246j976j790q48j57o2k1J33
$$ 101836 100462 98607 96261 93532 90844 88852 87835 87188 85942 83966 82176 81328 81171 81109 81088 81221
52465H1221p6n36l11P82J500Q95k16n09j20k04r94j509j103k79K10K70J98J13
$$ 81221 81145 80609 80298 81080 82580 83475 83259 82750 82630 82426 81432 79923 78820 78541 78751 79021 79219 79332
52447G9332pn9R7M07O27N65L37L24P32J196J120M72o7P4O65R78N85k85j011j087
$$ 79332 79325 79266 79363 79770 80397 80962 81299 81623 82355 83551 84671 85143 85076 85150 85815 86793 87378 87093 86082 84995
52427H4995n52l9j07n45n84Q5Q54R53L46l38n56l49j90l84o65m26M19J138R94
$$ 84995 84443 84404 84297 83752 83168 83253 84107 85060 85406 85068 84512 84163 83973 83589 82924 82498 82917 84055 85049
52408H5049J59n32o13k33L00P48Q03L82j3J64O81R00P97Q16Q62M58r0J70J177
$$ 85049 85208 84676 84063 83830 84130 84878 85681 86063 86050 86214 86895 87795 88592 89408 90270 90728 90638 90808 91985
52389I1985J488K55j357j649n75M32M46q8k83J34P96J211J202R95R25R80Q78N49
$$ 91985 93473 93728 92371 90722 90147 90579 91025 90937 90654 90788 91584 92795 93997 94992 95917 96897 97775 98324
52371I8324K44Q9q5k94k56J42O28R89J361J865K340K625K694K460J845J181J092
$$ 98324 98568 98657 98572 98278 98022 98164 98792 99781 101142 103007 105347 107972 110666 113126 114971 116152 117244
52354A17244J702K463K884L009L042L033L067L251L370L105K663K565K788K834
$$ 117244 118946 121409 124293 127302 130344 133377 136444 139695 143065 146170 148833 151398 154186 157020
52340A57020K690K781K862K034L03r99r83l12J04M29R68R75l16k135k955k511
$$ 157020 159710 162491 165353 167387 167690 166691 165708 165396 165500 165929 166897 167872 167556 165421 162466 159955
52324A59955j874j712j644j250o72j09M60Q50P39K39j54k71l81n86o54m93k99
$$ 159955 158081 156369 154725 153475 152803 152694 153154 154004 154743 154982 154828 154557 154176 153590 152936 152443 152144
52307A52144j57M8L56P34J307K118K757K705K026J311R82J043J404J999K592K899
$$ 152144 151987 152035 152391 153125 154432 156550 159307 162012 164038 165349 166331 167374 168778 170777 173369 176268
52291A76268K881K694K370K002J946K444L105L294L014K939L505M400M992M975
$$ 176268 179149 181843 184213 186215 188161 190605 193710 197004 200018 202957 206462 210862 215854 220829
52277B20829M521M042L902M127M369M323M101M051M337M845N340N555N325M826
$$ 220829 225350 229392 233294 237421 241790 246113 250214 254265 258602 263447 268787 274342 279667 284493
52263B84493M385M012L402K694K543L153L705L427K762K742L463L947L493K345
$$ 284493 288878 292890 296292 298986 301529 304682 308387 311814 314576 317318 320781 324728 328221 330566
52249C30566J112J95r0L87J118J204L65o26q66l14L79P12P25P52J010J382J507
$$ 330566 331678 331873 331783 332170 333288 334492 334857 334231 333365 333051 333430 334142 334867 335619 336629 338011 339518
52232C39518J210Q33R37J641K499L062L292L360L340L311L500L998M443M248L293
$$ 339518 340728 341561 342498 344139 346638 349700 352992 356352 359692 363003 366503 370501 374944 379192 382485
52217C82485K109J283Q29M25Q2J75P22J114Q49K23k01m53r19j410j194r0J148
$$ 382485 384594 385877 386706 387131 387213 387388 388110 389224 390073 390296 390095 389642 388723 387313 386119 386029 387177
52200C87177J750J694J386J108J069J444K061K454K548K788L247L287K541J771
$$ 387177 388927 390621 392007 393115 394184 395628 397689 400143 402691 405479 408726 412013 414554 416325
52186D16325J999L133M109M191L595K987K919L645M921N974O111N392M480L850
$$ 416325 418324 421457 425566 429757 433352 436339 439258 442903 447824 453798 459909 465301 469781 473631
$$ [...]
##END NTUPLES=NMR SPECTRUM
##END=
