
##TITLE=AC1358_CPIAH12177_6945607_7a2jvQsBHC
##JCAMPDX= 6.0         $$ Bruker NMR JCAMP-DX V2.0
##DATA TYPE= NMR SPECTRUM
##DATA CLASS= NTUPLES
##ORIGIN= BRUKER
##OWNER= Administrator
$$ 1.72 TOPSPIN		Version 2.1
$$ 2012-10-18 13:47:17.132 -0700  Administrator@X
$$ Compression mode = diff/dup
##.OBSERVE FREQUENCY= 400.02188249412
##.OBSERVE NUCLEUS= ^1H
##.ACQUISITION MODE= SIMULTANEOUS (DQD)
##.ACQUISITION SCHEME= undefined
##.AVERAGES= 64
##.DIGITISER RES= 22
##SPECTROMETER/DATA SYSTEM= spect
##.PULSE SEQUENCE= noesygpps1d.comp
##.SOLVENT NAME= COFFEE_meoh
##.SHIFT REFERENCE= INTERNAL, COFFEE_meoh, 1, 14.96096
##AUDIT TRAIL= $$ (NUMBER, WHEN, WHO, WHERE, PROCESS, VERSION, WHAT)
$$ ##TITLE= Audit trail, TOPSPIN		Version 2.1
$$ ##JCAMPDX= 5.01
$$ ##ORIGIN= Bruker BioSpin GmbH
$$ ##OWNER= Administrator
$$ $$ C:\Bruker\TOPSPIN/data/COFFEE/nmr/AC1358_CPIAH12177_6945607_7a2jvQsBHC/12/pdata/1/auditp.txt
$$ ##AUDIT TRAIL=  $$ (NUMBER, WHEN, WHO, WHERE, PROCESS, VERSION, WHAT)
(   1,<2012-10-13 22:27:29.968 -0500>,<Administrator>,<TOPSPIN>,<go>,<TOPSPIN 2.1>,
      <created by zg
	started at 2012-10-13 22:15:59.609 -0500,
	POWCHK enabled, PULCHK disabled,
       configuration hash MD5:
       6B 1B 68 BB D9 2E 58 E2 7F 35 AD 54 07 DF 0E 41
       data hash MD5: 64K
       15 96 F1 31 6C 74 E1 3C 4D 00 90 0F 24 93 4D 72>)
(   2,<2012-10-13 22:27:32.734 -0500>,<Administrator>,<TOPSPIN>,<proc1d>,<TOPSPIN 2.1>,
      <Start of raw data processing
       efp LB = 0.3 FT_mod = 6 PKNL = 1 PHC0 = 0 PHC1 = 0 SI = 128K 
       data hash MD5: 128K
       3A 32 D0 6E CF 99 55 8D A7 7A 06 CA 37 2C 7E 67>)
(   3,<2012-10-13 22:27:33.953 -0500>,<Administrator>,<TOPSPIN>,<proc1d>,<TOPSPIN 2.1>,
      <pk PHC0 = 6.069946 PHC1 = 0 
       data hash MD5: 128K
       54 8E 49 BB D3 60 37 D4 35 74 FA E5 25 10 8E F1>)
(   4,<2012-10-13 22:27:34.218 -0500>,<Administrator>,<TOPSPIN>,<proc1d>,<TOPSPIN 2.1>,
      <abs ABSG = 1 
       data hash MD5: 128K
       45 65 BC 95 84 C9 46 44 D9 BF 0B 10 49 75 84 B7>)
(   5,<2012-10-13 22:27:34.296 -0500>,<Administrator>,<TOPSPIN>,<proc1d>,<TOPSPIN 2.1>,
      <abs ABSG = 2 
       data hash MD5: 128K
       FC 85 35 A5 5D E3 7D 43 A5 12 2A BB 00 FB 1F 10>)
(   6,<2012-10-13 22:27:34.375 -0500>,<Administrator>,<TOPSPIN>,<proc1d>,<TOPSPIN 2.1>,
      <abs ABSG = 3 
       data hash MD5: 128K
       88 C2 17 D0 24 92 59 C3 6F CA 74 46 B7 A8 B0 30>)
(   7,<2012-10-13 22:27:34.421 -0500>,<Administrator>,<TOPSPIN>,<proc1d>,<TOPSPIN 2.1>,
      <abs ABSG = 4 
       data hash MD5: 128K
       4D 32 B3 04 A2 D9 79 A9 1B 28 12 9E 20 F0 50 DD>)
(   8,<2012-10-13 22:27:34.500 -0500>,<Administrator>,<TOPSPIN>,<proc1d>,<TOPSPIN 2.1>,
      <abs ABSG = 5 
       data hash MD5: 128K
       3B D0 CB 2A AB 71 5C A4 FB 52 CA B2 EE 90 8A 8F>)
(   9,<2012-10-13 22:27:34.859 -0500>,<Administrator>,<TOPSPIN>,<audit>,<TOPSPIN 2.1>,
      <user comment:
       ICON-NMR User ID: COFFEE
       data hash MD5: 128K
$$ [...]
150 150 150 150 150 150 150 150
##$TP07= 0
##$TPNAME0= <>
##$TPNAME1= <>
##$TPNAME2= <>
##$TPNAME3= <>
##$TPNAME4= <>
##$TPNAME5= <>
##$TPNAME6= <>
##$TPNAME7= <>
##$TPOAL= (0..7)
0.5 0.5 0.5 0.5 0.5 0.5 0.5 0.5
##$TPOFFS= (0..7)
0 0 0 0 0 0 0 0
##$TUNHIN= 0
##$TUNHOUT= 0
##$TUNXOUT= 0
##$USERA1= <user>
##$USERA2= <user>
##$USERA3= <user>
##$USERA4= <user>
##$USERA5= <user>
##$V9= 5
##$VALIST= <valist>
##$VCLIST= <CCCCCCCCCCCCCCC>
##$VD= 0
##$VDLIST= <DDDDDDDDDDDDDDD>
##$VPLIST= <PPPPPPPPPPPPPPP>
##$VTLIST= <TTTTTTTTTTTTTTT>
##$WBST= 2048
##$WBSW= 25
##$XGAIN= (0..3)
0 0 0 0
##$XL= 0
##$YL= 0
##$YMAX_a= 12397659
##$YMIN_a= -8679905
##$ZGOPTNS= <>
##$ZL1= 120
##$ZL2= 120
##$ZL3= 120
##$ZL4= 120
##$ABSF1= 14.96096
##$ABSF2= -5.597221
##$ABSG= 5
##$ABSL= 3
##$ALPHA= 0
##$AQORDER= 0
##$ASSFAC= 0
##$ASSFACI= 0
##$ASSFACX= 0
##$ASSWID= 0
##$AUNMP= <proc_prof1d_extract.lims>
##$AXLEFT= 0
##$AXNAME= <>
##$AXNUC= <1H>
##$AXRIGHT= 0
##$AXTYPE= 0
##$AXUNIT= <>
##$AZFE= 0.1
##$AZFW= 0.1
##$BCFW= 0
##$BC_mod= 0
##$BYTORDP= 0
##$COROFFS= 0
##$CY= 15
##$DATMOD= 1
##$DC= 0
##$DFILT= <>
##$DTYPP= 0
##$F1P= 0
##$F2P= 0
##$FCOR= 0.5
##$FTSIZE= 131072
##$FT_mod= 6
##$GAMMA= 0
##$GB= 0
##$INTBC= 1
##$INTSCL= 1
##$ISEN= 128
##$LB= 0.3
##$LEV0= 0
##$LPBIN= 0
##$MAXI= 10000
##$MC2= 0
##$MEAN= 0
##$ME_mod= 0
##$MI= 0
##$NCOEF= 0
##$NC_proc= -2
##$NLEV= 6
##$NOISF1= 0
##$NOISF2= 0
##$NSP= 0
##$NTH_PI= 0
##$NZP= 0
##$OFFSET= 14.96096
##$PC= 1
##$PHC0= 6.069946
##$PHC1= 0
##$PH_mod= 1
##$PKNL= yes
##$PPARMOD= 0
##$PPDIAG= 0
##$PPIPTYP= 0
##$PPMPNUM= 2147483647
##$PPRESOL= 1
##$PSCAL= 4
##$PSIGN= 0
##$PYNMP= <proc.py>
##$REVERSE= no
##$SF= 400.02000965291
##$SI= 131072
##$SIGF1= 0
##$SIGF2= 0
##$SINO= 400
##$SIOLD= 131072
##$SPECTYP= <>
##$SREGLST= <1H.CDCl3>
##$SSB= 0
##$STSI= 131072
##$STSR= 0
##$SW_p= 8223.68421052631
##$SYMM= 0
##$S_DEV= 0
##$TDeff= 65536
##$TDoff= 0
##$TI= <>
##$TILT= no
##$TM1= 0
##$TM2= 0
##$TOPLEV= 0
##$USERP1= <user>
##$USERP2= <user>
##$USERP3= <user>
##$USERP4= <user>
##$USERP5= <user>
##$WDW= 1
##$XDIM= 131072
##$YMAX_p= 335380615
##$YMIN_p= -11846
##$CURPLOT= <Network HP LaserJet P1505>
##$CURPRIN= <$Network HP LaserJet P1505>
##$DFORMAT= <normdp>
##$LAYOUT= <+/1D_H.xwp>
##$LFORMAT= <normlp>
##$PFORMAT= <normpl>
##$SURQMSG= 1
$$ End of Bruker specific parameters
$$ ---------------------------------
##NTUPLES= NMR SPECTRUM
##VAR_NAME=  FREQUENCY,     SPECTRUM/REAL,   SPECTRUM/IMAG
##SYMBOL=    X,             R,               I
##VAR_TYPE=  INDEPENDENT,   DEPENDENT,       DEPENDENT
##VAR_FORM=  AFFN,          ASDF,            ASDF
##VAR_DIM=   131072,        131072,          131072
##UNITS=     HZ,            ARBITRARY UNITS, ARBITRARY UNITS
##FACTOR=    0.0627417313425164, 1,          1
##FIRST=     8223.62146879497, -2702,        -58779
##LAST=      0,             -1247,           -59674
##MIN=       0,             -11846,          0
##MAX=       8223.62146879497, 335380615,    0
$$ Real data points
##PAGE= N=1
##DATA TABLE= (X++(R..R)), XYDATA
$$ [...]
$$ plain form
64041 342345 349290 355765 361953 368114 374346 380509 386217 391037 394896 398178 401181 403595 404828 404843 404315
64026 404315 403895 403601 403049 401996 400491 398699 396861 395357 394495 394059 393186 391016 387533 383599 380005 376711
64010 376711 373280 369807 366882 364633 362452 359965 357778 356824 357267 358568 360360 362676 365399 368151 370880
63995 370880 374091 378211 383055 388183 393554 399553 406485 414294 422729 431586 440800 450527 461193 473314
63981 473314 487026 501788 516643 530890 544486 557832 571327 585186 599473 614080 628803
63970 628803 643742 659579 677146 696627 717466 739115 761574 785206 810376 837439 866696
63959 866696 898145 931627 967507 1006947 1051189 1100816 1156056 1217527 1286267 1363231 1449221
63948 1449221 1545225 1652385 1771509 1902814 2046082 2200710 2365661 2539585 2721000 2908129
$$ packed form
64041C42345O945O475O188O161O232O163N708M820L859L282L003K414J233J5n28
64026D04315m20k94n52j053j505j792j838j504q62m36q73k170l483l934l594l294
64010C76711l431l473k925k249k181k487k187r54M43J301J792K316K723K752K729
63995C70880L211M120M844N128N371N999O932P809Q435Q857R214R727J0666J2121
63981D73314J3712J4762J4855J4247J3596J3346J3495J3859J4287J4607J4723
63970F28803J4939J5837J7567J9481K0839K1649K2459K3632K5170K7063K9257
63959H66696L1449L3482L5880L9440M4242M9627N5240O1471O8740P6964Q5990
63948A449221R6004J07160J19124J31305J43268J54628J64951J73924J81415J87129
$$ plain form
63938 2908129 3098661 3289859 3478678 3661424 3833494 3990128 4127591 4243406 4335580 4402150
63928 4402150 4441603 4453220 4436661 4391644 4318467 4218766 4095498 3952265 3792808 3620962
63918 3620962 3440623 3255476 3068681 2882863 2700396 2523657 2354933 2196049 2048205
63909 2048205 1912156 1788362 1676783 1576731 1487182 1407243 1336160 1273063 1217014 1167304
63899 1167304 1123375 1084457 1049557 1017977 989526 964039 940786 918582 896544 874673 853609
63888 853609 833853 815331 797771 781343 766538 753376 741107 729019 717301 706799 698035 690855
63876 690855 684998 680670 678417 678531 680717 684322 688921 694578 701408 709016 716777 724664 733231 742529
63862 742529 751627 759634 766711 773450 779658 784483 787564 789291 789954 789319 787090 783212 777639 770413 762049
$$ packed form
63938B908129J90532J91198J88819J82746J72070J56634J37463J15815R2174O6570
63928D402150L9453J1617j6559m5017p3177r9701j23268j43233j59457j71846
63918C620962j80339j85147j86795j85818j82467j76739j68724j58884j47844
63909B048205j36049j23794j11579j00052q9549p9939p1083o3097n6049m9710
63899A167304m3929l8918l4900l1580k8451k5487k3253k2204k2038k1871k1064
63888H53609j9756j8522j7560j6428j4805j3162j2269j2088j1718j0502q764p180
63876F90855n857m328k253J14K186L605M599N657O830P608P761P887Q567R298
63862G42529R098Q007P077O739O208M825L081J727O63o35k229l878n573p226q364
$$ plain form
63847 762049 753202 743841 733284 721148 707668 693023 677116 660281 643342 626457 608643 589146
63835 589146 568849 549581 532298 516546 501477 486691 472159 458003 444542 432113 420691
63824 420691 409930 399617 389819 380587 371818 363460 355523 347834 340124 332552 325870 320785 317207 314370
63810 314370 311650 309081 307035 305608 304509 303348 301793 299528 296454 293038 290096 288028 286434 284634
63796 284634 282221 278981 274816 270244 266520 264524 263680 262621 260764 258546 256266 253674 250862 248551
63782 248551 246996 245422 243200 240950 239692 239358 238940 237916 236749 235987 235584 235248 234929 234643 234136 233090
63766 233090 231629 230446 230272 231127 232189 232585 232316 232137 232519 233051 232974 231980 230334 228551 227208 226753 227141
63749 227141 227792 228144 228145 228133 228513 229594 231320 232995 233783 233821 234359 236312 239040 241133 242091 242604 243361 244289
$$ packed form
63847G62049q847r361j0557j2136j3480j4645j5907j6835j6939j6885j7814j9497
63835E89146k0297j9268j7283j5752j5069j4786j4532j4156j3461j2429j1422
63824D20691j0761j0313r798r232q769q358p937p689p710p572o682n085l578k837
63810C14370k720k569k046j427j099j161j555k265l074l416k942k068j594j800
63796B84634k413l240m165m572l724j996q44j059j857k218k280k592k812k311
63782B48551j555j574k222k250j258l34m18j024j167p62m03l36l19k86n07j046
63766B33090j461j183j74Q55J062L96k69j79L82N32p7r94j646j783j343m55L88
63749B27141O51L52Jj2L80J081J726J675P88L8N38J953K728K093R58N13P57R28
$$ plain form
63731 244289 245071 245809 246858 248298 249821 251084 252144 253517 255700 258579 261595 264581 268073 272503 277387
63716 277387 281678 284675 286243 286471 285620 284206 282698 281184 279668 278400 277496 276473 274742 272419 270174
63701 270174 268433 267326 267127 267998 269352 270285 270818 271957 274273 277126 279620 281730 283972 286444 288768
63686 288768 290752 292591 294481 296322 297774 298370 297733 295980 293944 292734 292926 294156 295596 296871 298391
63671 298391 300534 302591 303087 301423 298764 296857 296354 296798 297752 299052 300131 300154 299044 297584 296240 294634
63655 294634 292469 290200 288338 286708 284902 282962 281171 279678 278764 278926 280143 281566 282513 283323 284582
63640 284582 285979 286727 286864 287335 288845 291318 294411 297842 301242 304402 307746 311961 317042 322321 327464
63625 327464 332859 338919 345627 352953 361029 369658 378328 387171 397275 409495 423333 437556 451564
$$ packed form
63731B44289P82P38J049J440J523J263J060J373K183K879L016K986L492M430M884
63716B77387M291K997J568K28q51j414j508j514j516j268r04j023j731k323k245
63701B70174j741j107j99Q71J354R33N33J139K316K853K494K110K242K472K324
63686B88768J984J839J890J841J452N96o37j753k036j210J92J230J440J275J520
63671B98391K143K057M96j664k659j907n03M44R54J300J079K3j110j460j344j606
63655B94634k165k269j862j630j806j940j791j493r14J62J217J423R47Q10J259
63640B84582J397P48J37M71J510K473L093L431L400L160L344M215N081N279N143
63625C27464N395O060O708P326Q076Q629Q670Q843J0104J2220J3838J4223J4008
$$ plain form
63612 451564 465699 480509 496404 513812 532964 553434 574356 595102 615258 633907 649547
63601 649547 661044 668390 672365 673805 673377 671675 669128 665919 662173 658016 653208 647001 638810 628988
63587 628988 618514 607783 596083 582547 567455 552292 538471 526229 514861 503841 493458
63576 493458 484320 476592 469973 464296 459776 456619 454719 453906 454248 455854 458544 462026 466316 471759 478590
63561 478590 486605 495177 503459 510816 517419 524399 533014 543646 555854 569383 584660 602142 621610
63548 621610 642401 664103 686701 710147 733871 756526 776117 790763 799696 803461 803093 799403
63536 799403 793261 786028 779090 772979 767358 761797 756162 750253 743482 735034 724139 710264 693383
63523 693383 674170 653684 632821 612141 592061 572823 554262 535971 517856 500371 484141
$$ packed form
63612D51564J4135J4810J5895J7408J9152K0470K0922K0746K0156J8649J5640
63601F49547J1497P346L975J440m28j702k547l209l746m157m808o207q191r822
63587F28988j0474j0731j1700j3536j5092j5163j3821j2242j1368j1020j0383
63576D93458r138p728o619n677m520l157j900q13L42J606K690L482M290N443O831
63561D78590Q015Q572Q282P357O603O980Q615J0632J2208J3529J5277J7482J9468
63548F21610K0791K1702K2598K3446K3724K2655J9591J4646Q933L765l68l690
63536G99403o142p233o938o111n621n561n635n909o771q448j0895j3875j6881
63523F93383j9213k0486k0863k0680k0080j9238j8561j8291j8115j7485j6230
$$ plain form
63512 484141 469520 456451 444578 433572 423560 415106 408415 402735 397044 391248 386125 382061 378511
63499 378511 374951 371693 369308 367699 366270 364672 362903 360970 359019 357606 357222 357556 357771 357566 357477 357992
63483 357992 358864 359625 360497 362360 365760 370134 374098 376585 377777 378857 380742 383083 384715 385023 384576
63468 384576 384266 384066 382999 380341 376574 372940 370127 367695 364912 361856 359388 358089 357702 357769 358439 360248
63452 360248 363290 367006 370819 374688 378996 384148 390348 397495 405220 413176 421462 430597 441002 452690
63438 452690 465486 479275 493875 508979 524595 541320 559630 578725 596501 610942 621442
63427 621442 628790 634319 639386 645261 652807 662162 673065 685591 700228 717207 736137 756456 777767
63414 777767 799468 820428 839497 856111 869997 880503 886779 888652 886863 882351 875757 867729 859233
$$ packed form
63512D84141j4621j3069j1873j1006j0012q454o691n680n691n796n123m064l550
63499C78511l560l258k385j609j429j598j769j933j951j413l84L34K15k05q9N15
63483C57992Q72P61Q72J863L400M374L964K487J192J080J885K341J632L08m47
63468C84576l10k00j067k658l767l634k813k432k783l056k468j299l87O7O70J809
63452C60248L042L716L813L869M308N152O200P147P725P956Q286R135J0405J1688
63438D52690J2796J3789J4600J5104J5616J6725J8310J9095J7776J4441J0500
63427F21442P348N529N067N875P546R355J0903J2526J4637J6979J8930K0319K1311
63414G77767K1701K0960J9069J6614J3886J0506O276J873j789m512o594q028q496
$$ plain form
63401 859233 851038 842994 834087 823276 810198 795137 778522 760509 741096 720541 699480 678486
63389 678486 657732 637386 618167 601034 586223 572959 560356 548331 537485 528402 521303 516158
63377 516158 512802 511020 510783 512340 515846 520899 526674 532556 538568 545171 552776 561575 571814 583995
63363 583995 598467 614741 631581 648186 665159 683896 705035 727871 751195 774155 796178
63352 796178 816669 835131 851142 863860 872022 875019 873719 869851 864703 858775 852267 845314 837823
63339 837823 829595 820490 810056 797232 781186 762431 742470 722228 701546 680411 659915 641424
63327 641424 625236 610625 596944 584189 572707 562874 555127 549775 546475 543923 540241 533895 524569
63314 524569 513317 501676 490511 479759 469204 459097 449793 441236 433149 425522 418481 411895 405611
$$ packed form
63401H59233q195q044q907j0811j3078j5061j6615j8013j9413k0555k1061k0994
63389F78486k0754k0346j9219j7133j4811j3264j2603j2025j0846r083p099n145
63377E16158l356j782k37J557L506N053N775N882O012O603P605Q799J0239J2181
63363E83995J4472J6274J6840J6605J6973J8737K1139K2836K3324K2960K2023
63352G96178K0491J8462J6011J2718Q162K997j300l868n148n928o508o953p491
63339H37823q228r105j0434j2824j6046j8755j9961k0242k0682k1135k0496j8491
63327F41424j6188j4611j3681j2755j1482r833p747n352l300k552l682o346r326
63314E24569j1252j1641j1165j0752j0555j0107r304q557q087p627p041o586o284
$$ plain form
63301 405611 399991 395637 392464 389522 386045 382338 379346 377505 376296 374861 372818 370467 368297 366380
63287 366380 364356 362059 359934 358476 357361 355663 353123 350705 349484 349329 349165 348258 346675 344622 342132
63272 342132 339611 338046 338102 339265 340287 340413 339967 339913 341014 343212 345620 347290 348268 349654 352358 355984
63256 355984 359363 361963 364258 366767 369395 371969 374914 378964 384379 390791 397661 404597 411335 417804
63242 417804 424330 431542 439823 448845 457835 466461 475471 486213 499334 514075 529036 543566 558158
63229 558158 573536 589696 605969 621751 636956 651924 667069 682607 698452 714297 729773
63218 729773 744554 758531 772045 785733 799806 813555 825849 836052 844020 849350 851245 849378
63206 849378 844356 836992 827485 815661 801657 785991 769240 752036 735127 719055 703916 689778
$$ packed form
63301D05611n620m354l173k942l477l707k992j841j209j435k043k351k170j917
63287C66380k024k297k125j458j115j698k540k418j221j55j64r07j583k053k490
63272C42132k521j565N6J163J022J26m46n4J101K198K408J670R78J386K704L626
63256C55984L379K600K295K509K628K574K945M050N415O412O870O936O738O469
63242D17804O526P212Q281R022Q990Q626R010J0742J3121J4741J4961J4530J4592
63229E58158J5378J6160J6273J5782J5205J4968J5145J5538J5845J5845J5476
63218G29773J4781J3977J3514J3688J4073J3749J2294J0203P968N330J895j867
63206H49378n022p364r507j1824j4004j5666j6751j7204j6909j6072j5139j4138
$$ plain form
63194 689778 677073 666207 657070 649399 643438 639637 637858 637472 638234 640444 644159 648870 654225 660573
63180 660573 668450 677828 688112 698612 708858 718749 728653 739068 749966 760711 770824 780450
63168 780450 789750 798117 804437 808037 809033 807839 804718 799830 793305 785119 775075 763035 749078 733438
63154 733438 716515 698971 681537 664522 647676 630765 614188 598772 584981 572630 561444
63143 561444 551593 543359 536434 529940 523266 516640 510785 506178 502753 500076 497652 495197 492816 490901
63129 490901 489815 489818 491197 494051 497764 501143 503518 505427 507785 510635 513281 515440 517544 519864 522069
63114 522069 523966 526044 528885 532411 536108 539640 542863 545543 547528 549080 550617 552206 553566 554481
63100 554481 554948 555089 555161 555524 556321 557322 558366 559704 561523 563363 564517 564986 565504 566564 567937 569306
$$ packed form
63194F89778j2705j0866r137p671n961l801j779l86P62K210L715M711N355O348
63180F60573P877R378J0284J0500J0246R891R904J0415J0898J0745J0113R626
63168G80450R300Q367O320L600R96j194l121m888o525q186j0044j2040j3957j5640
63154G33438j6923j7544j7434j7015j6846j6911j6577j5416j3791j2351j1186
63143E61444r851q234o925o494o674o626n855m607l425k677k424k455k381j915
63129D90901j086LJ379K854L713L379K375J909K358K850K646K159K104K320K205
63114E22069J897K078K841L526L697L532L223K680J985J552J537J589J360R15
63100E54481M67J41P2L63P97J001J044J338J819J840J154M69N18J060J373J369
$$ plain form
63084 569306 570889 573151 576232 579974 584158 588455 592418 595930 599557 604087 609774 616293 623343 630941
63070 630941 639128 647754 656765 666456 677218 689116 701803 714856 728124 741825 756409 772331
63058 772331 789937 809510 831316 855492 881916 910342 940599 972522 1005741 1039829 1074719
63047 1074719 1110735 1148049 1186350 1225158 1264203 1303177 1341408 1378272 1413893 1449033 1484229
63036 1484229 1519370 1554140 1588354 1621656 1653328 1682708 1709483 1733205 1752825 1767150 1775567
63025 1775567 1777833 1773324 1761115 1741015 1714105 1682026 1645977 1606595 1564585 1521203 1478042 1436386
63013 1436386 1396724 1358992 1323400 1290896 1262645 1239209 1220479 1206180 1195994 1189368 1185800 1185380
63001 1185380 1188510 1194994 1203960 1214819 1227614 1242117 1257348 1272613 1288408 1305503 1323496 1341171
$$ packed form
63084E69306J583K262L081L742M184M297L963L512L627M530N687O519P050P598
63070F30941Q187Q626R011R691J0762J1898J2687J3053J3268J3701J4584J5922
63058G72331J7606J9573K1806K4176K6424K8426L0257L1923L3219L4088L4890
63047A074719L6016L7314L8301L8808L9045L8974L8231L6864L5621L5140L5196
63036A484229L5141L4770L4214L3302L1672K9380K6775K3722J9620J4325Q417
63025A775567K266m509j2209k0100k6910l2079l6049l9382m2010m3382m3161m1656
63013A436386l9662l7732l5592l2504k8251k3436j8730j4299j0186o626l568m20
63001A185380L130O484Q966J0859J2795J4503J5231J5265J5795J7095J7993J7675
$$ plain form
62989 1341171 1358050 1374612 1390916 1405942 1418650 1428957 1437171 1442980 1445497 1443974 1437977 1427155
62977 1427155 1411313 1390701 1365933 1337695 1306679 1273626 1239128 1203500 1167071 1130498 1094572
62966 1094572 1059825 1026532 994985 965487 938094 912635 888927 866804 845955 825968 806608
62955 806608 787952 770319 754082 739405 725911 712754 699302 685730 672729 660642 649149
62944 649149 637740 626295 615175 604987 596225 588827 582032 574943 567327 559659 552419 545747 539846
62931 539846 535181 531903 529372 526689 523571 520387 517507 514986 512786 510869 509059 507160 505256 503559
62917 503559 501910 499816 497100 494163 491406 488777 486179 483972 482583 481750 480691 479033 477143 475389
62903 475389 473449 470640 466684 461976 457279 453422 450988 449893 449304 448347 447002 446024 445998 446753 447739 448531
$$ packed form
62989A341171J6879J6562J6304J5026J2708J0307Q214N809K517j523n997j0822
62977A427155j5842k0612k4768k8238l1016l3053l4498l5628l6429l6573l5926
62966A094572l4747l3293l1547k9498k7393k5459k3708k2123k0849j9987j9360
62955H06608j8656j7633j6237j4677j3494j3157j3452j3572j3001j2087j1493
62944F49149j1409j1445j1120j0188q762p398o795p089p616p668p240o672n901
62931E39846m665l278k531k683l118l184k880k521k200j917j810j899j904j697
62917E03559j649k094k716k937k757k629k598k207j389q33j059j658j890j754
62903D75389j940k809l956m708m697l857k434j095n89r57j345r78k6P55R86P92
$$ plain form
62887 448531 448755 448000 446311 444562 443782 444063 444538 444494 444118 443997 444246 444427 444132 443395 442554 441895 441407 440842
62869 440842 440065 439306 438927 438936 438949 438654 438073 437330 436454 435522 434733 434133 433523 432792 432123 431717 431567 431670 432173 433034
62849 433034 433850 434291 434488 434698 434925 435176 435751 436744 437574 437577 436936 436417 436320 436321 436302 436606 437353 438160 438772 439448 440440
62828 440440 441509 442261 442655 442996 443758 445468 448331 451796 454897 457232 459251 461526 464278 467734 472260
62813 472260 477759 483427 488633 493635 499063 505003 511030 516830 522477 528410 535381 543983 553867 563868
62799 563868 573287 582561 592274 602157 611749 621539 632582 645246 659130 674063 690434 708632 728905
62786 728905 751718 777566 806351 837579 871199 907724 947490 990365 1036185 1084865 1136026
62775 1136026 1189037 1243453 1298856 1354192 1407870 1458634 1505739 1548091 1583758 1610657 1627541
$$ packed form
62887D48531K24p55j689j749p80K81M75m4l76j21K49J81k95p37q41o59m88n65
62869D40842p77p59l79RJ3k95n81p43q76r32p89o00o10p31o69m06j50J03N03Q61
62849D33034Q16M41J97K10K27K51N75R93Q30Lo41n19r7Jj9L04P47Q07O12O76R92
62828D40440J069P52L94L41P62J710K863L465L101K335K019K275K752L456M526
62813D72260N499N668N206N002N428N940O027N800N647N933O971Q602R884J0001
62799E63868R419R274R713R883R592R790J1043J2664J3884J4933J6371J8198K0273
62786G28905K2813K5848K8785L1228L3620L6525L9766M2875M5820M8680N1161
62775A136026N3011N4416N5403N5336N3678N0764M7105M2352L5667K6899J6884
$$ plain form
62764 1627541 1634359 1632029 1621754 1604055 1578556 1545134 1505106 1460600 1412992 1362780 1310797 1258383
62752 1258383 1206228 1154242 1102986 1054070 1008478 965477 924043 884550 848165 815277 785522
62741 785522 758809 735196 714040 694304 675740 658919 644120 630993 619310 609252 600795 593448
62729 593448 586899 581473 577644 575410 574233 573400 572443 571450 570949 571269 572189 573470 575468 578735 583224 588429
62713 588429 594281 601346 610080 620375 631954 644777 658881 674183 690648 708482 728006 749538
62701 749538 773376 799673 828299 859019 891783 926684 963699 1002706 1043479 1085272 1126565
62690 1126565 1165806 1202390 1236362 1267101 1292926 1312265 1324658 1330226 1328673 1319482 1302910 1280142
62678 1280142 1252344 1220005 1183497 1143926 1102972 1061793 1020427 978540 936632 896100 858050
$$ packed form
62764A627541O818k330j0275j7699k5499l3422m0028m4506m7608n0212n1983n2414
62752A258383n2155n1986n1256m8916m5592m3001m1434l9493l6385l2888k9755
62741G85522k6713k3613k1156j9736j8564j6821j4799j3127j1683j0058q457p347
62729E93448o549n426l829k234j177q33r57r93n01L20R20J281J998L267M489N205
62713E88429N852P065Q734J0295J1579J2823J4104J5302J6465J7834J9524K1532
62701G49538K3838K6297K8626L0720L2764L4901L7015L9007M0773M1793M1293
62690A126565L9241L6584L3972L0739K5825J9339J2393N568j553r191j6572k2768
62678A280142k7798l2339l6508l9571m0954m1179m1366m1887m1908m0532l8050
$$ plain form
62667 858050 822451 788677 756548 726500 699006 674287 652439 633285 616113 600064 584916
62656 584916 571108 558906 547967 537843 528431 519618 510903 501828 492659 484253 477245 471592 466799
62643 466799 462359 457994 453745 449939 446996 445105 444079 443525 443170 443028 443211 443565 443637 443089 442053 440914
62627 440914 439842 438695 437381 436103 435257 435231 436199 437879 439592 440874 442044 443840 446513 449681 453104
62612 453104 457086 461798 466654 470868 474445 478199 482891 488709 495520 503159 511428 520224 529901 541247
62598 541247 554908 570932 589030 609055 631058 654954 680366 706763 733590 760262 786218
62587 786218 811007 834182 855066 872790 886691 896578 902480 904232 901441 893867 881710 865561
62575 865561 846239 824681 801808 778348 754757 731297 708063 685001 662054 639433 617697
$$ packed form
62667H58050l5599l3774l2129l0048k7494k4719k1848j9154j7172j6049j5148
62656E84916j3808j2202j0939j0124r412q813q715r075r169q406p008n653m793
62643D66799m440m365m249l806k943j891j026n54l55j42J83L54P2n48j036j139
62627D40914j072j147j314j278q46k6R68J680J713J282J170J796K673L168L423
62612D53104L982M712M856M214L577L754M692N818O811P639Q269Q796R677J1346
62598E41247J3661J6024J8098K0025K2003K3896K5412K6397K6827K6672K5956
62587G86218K4789K3175K0884J7724J3901R887N902J752k791p574j2157j6149
62575H65561j9322k1558k2873k3460k3591k3460k3234k3062k2947k2621k1736
$$ plain form
62564 617697 597527 579434 563555 549564 536790 524698 513359 503351 495129 488632 483431 479000
62552 479000 474830 470707 467042 464598 463573 463199 462609 461823 461473 461719 461981 461837 461715 462407 464126 466288
62536 466288 468135 469408 470396 471466 472659 473815 474973 476455 478575 481548 485724 491533 498921 507182
62522 507182 515773 525049 535745 547856 560676 574006 588798 606256 626589 648966 672460 696728
62510 696728 721833 747734 774137 800743 827393 853770 878967 901675 920920 936521 948706
62499 948706 957591 963257 966099 966665 965257 962073 957738 953329 949826 947820 947709 949863 954516 961869 972344
62484 972344 986423 1004159 1025052 1048447 1073735 1100174 1126869 1153058 1178004 1200454 1218589
62473 1218589 1230852 1236689 1236371 1230288 1218595 1201270 1178293 1149894 1116817 1080242 1041380 1001245
$$ packed form
62564F17697k0170j8093j5879j3991j2774j2092j1339j0008q222o497n201m431
62552D79000m170m123l665k444j025l74n90p86l50K46K62j44j22O92J719K162
62536D66288J847J273R88J070J193J156J158J482K120K973M176N809P388Q261
62522E07182Q591R276J0696J2111J2820J3330J4792J7458K0333K2377K3494K4268
62510F96728K5105K5901K6403K6606K6650K6377K5197K2708J9245J5601J2185
62499I48706Q885N666K842N66j408l184m335m409l503k006j11K154M653P353J0475
62484I72344J4079J7736K0893K3395K5288K6439K6695K6189K4946K2450J8135
62473A218589J2263N837l18o083j1693j7325k2977k8399l3077l6575l8862m0135
$$ plain form
62461 1001245 960768 920789 881769 843795 807112 772449 740664 712199 687048 665056 646079
62450 646079 629950 616462 605270 595750 587164 579137 571853 565735 561083 558084 556868 557374 559278 562126
62436 562126 565356 568272 570417 572100 574055 576304 577744 577237 574773 571135 566727 561311 554741 547366
62422 547366 539634 531763 523928 516372 509192 502281 495635 489461 483861 478621 473496 468581 464248 460795
62408 460795 458221 456307 454856 453856 453348 453062 452406 451051 449493 448669 448941 449729 450314 450725 451525 452941
62392 452941 454622 456283 458186 460774 464063 467717 471527 475512 479612 483664 487790 492459 497934 503906
62378 503906 509909 515971 522608 530320 539311 549537 560695 572182 583390 594108 604498 614780
62366 614780 625236 636392 648840 662901 678794 697058 718298 742430 768732 796848 827255
$$ packed form
62461A001245m0477l9979l9020l7974l6683l4663l1785k8465k5151k1992j8977
62450F46079j6129j3488j1192r520q586q027p284o118m652k999j216N06J904K848
62436E62126L230K916K145J683J955K249J440n07k464l638m408n416o570p375
62422E47366p732p871p835p556p180o911o646o174n600n240n125m915m333l453
62408D60795k574j914j451j000n08k86o56j355j558q24K72P88N85M11Q00J416
62392D52941J681J661J903K588L289L654L810L985M100M052M126M669N475N972
62378E03906O003O062O637P712Q991J0226J1158J1487J1208J0718J0390J0282
62366F14780J0456J1156J2448J4061J5893J8264K1240K4132K6302K8116L0407
$$ plain form
62355 827255 860329 895364 930980 966227 1000701 1033700 1063908 1090121 1111827 1128801 1140517
62344 1140517 1146495 1147161 1143839 1137572 1128173 1114759 1097100 1076045 1052621 1027282 1000343 972755
62332 972755 945921 920893 898137 877845 859909 843640 828130 813094 798961 786071 774196
62321 774196 762998 752451 742524 732730 722330 710909 698676 686414 675129 665470 657407 650620
62309 650620 645003 640447 636355 632040 627548 623436 619703 615724 611352 607227 603688 600213 596367 592496
62295 592496 588955 585450 581800 578610 576340 574405 572070 569728 568313 567926 568047 568718 570337 572504 574308
62280 574308 575752 577747 580565 583438 585958 588824 592735 597514 602814 608798 615550 622573 629613 637378
62266 637378 646751 657719 669740 682747 697140 713120 730774 750618 773307 798859 826782 857031
$$ packed form
62355H27255L3074L5035L5616L5247L4474L2999L0208K6213K1706J6974J1716
62344A140517N978O66l322o267r399j3414j7659k1055k3424k5339k6939k7588
62332I72755k6834k5028k2756k0292j7936j6269j5510j5036j4133j2890j1875
62321G74196j1198j0547r927r794j0400j1421j2233j2262j1285r659q063o787
62309F50620n617m556m092m315m492m112l733l979m372m125l539l475l846l871
62295E92496l541l505l650l190k270j935k335k342j415l87J21O71J619K167J804
62280E74308J444J995K818K873K520K866L911M779N300N984O752P023P040P765
62266F37378R373J0968J2021J3007J4393J5980J7654J9844K2689K5552K7923L0249
$$ plain form
62254 857031 890185 926431 964796 1003633 1041500 1077316 1109935 1138103 1160956 1178335 1190487
62243 1190487 1197590 1199726 1197143 1190229 1179090 1163432 1143015 1118086 1089255 1057262 1023121 988140
62231 988140 953341 918984 885142 852610 822679 795920 771699 749111 728022 708961 692319
62220 692319 677944 665392 654328 644676 636348 628868 621531 614177 607538 602351 598337 594617 591022
62207 591022 588298 586897 586280 585663 584891 584312 584327 585409 587999 591969 596632 601609 607228 613635 620055 625578
62191 625578 630382 635603 642188 650309 659555 669112 678003 685834 693317 701593 711107 721483 732145 742429
62177 742429 751368 758305 763849 769491 776057 783163 790436 798499 808318 820131 833643 848951 866673
62164 866673 887224 910382 935494 961748 988252 1014116 1038416 1059967 1077380 1089789 1097531 1101725
$$ packed form
62254H57031L3154L6246L8365L8837L7867L5816L2619K8168K2853J7379J2152
62243A190487P103K136k583o914j1139j5658k0417k4929k8831l1993l4141l4981
62231I88140l4799l4357l3842l2532k9931k6759k4221k2588k1089j9061j6642
62220F92319j4375j2552j1064r652q328p480p337p354o639n187m014l720l595
62207E91022k724j401o17o17p72n79J5J082K590L970M663M977N619O407O420N523
62191F25578M804N221O585Q121R246R557Q891P831P483Q276R514J0376J0662J0284
62177G42429Q939O937N544N642O566P106P273Q063R819J1813J3512J5308J7722
62164H66673K0551K3158K5112K6254K6504K5864K4300K1551J7413J2409P742M194
$$ plain form
62152 1101725 1103047 1101167 1095423 1085730 1072645 1056818 1038717 1018807 997608 975552 953011 930604
62140 930604 909255 889740 872247 856558 842531 830162 819202 809114 799699 791516 785298 780905
62128 780905 777202 773201 769146 766207 765154 765647 766828 768218 769739 771173 772149 772702 773303 774082 774368 773384
62112 773384 771260 768963 767295 766298 765592 764878 763914 762194 758910 753303 745217 735478 725576 716678 708936
62097 708936 701995 696027 691746 689308 687734 685815 683357 681220 680319 680914 682708 685258 688228 691511 695186
62082 695186 699325 703898 708946 714747 721633 729711 738882 749031 759996 771440 783006 794673 806763
62069 806763 819575 833159 847543 862994 879764 897565 915529 932909 949805 966923 984523
62058 984523 1001714 1016956 1029077 1037731 1043094 1045483 1045129 1041975 1035630 1025828 1012901 997466 979595
$$ packed form
62152A101725J322j880n744r693j3085j5827j8101j9910k1199k2056k2541k2407
62140I30604k1349j9515j7493j5689j4027j2369j0960j0088r415q183o218m393
62128G80905l703m001m055k939j053M93J181J390J521J434R76N53O01P79K86r84
62112G73384k124k297j668r97p06p14r64j720l284n607q086r739r902q898p742
62097G08936o941n968m281k438j574j919k458k137r01N95J794K550K970L283L675
62082F95186M139M573N048N801O886Q078R171J0149J0965J1444J1566J1667J2090
62069H06763J2812J3584J4384J5451J6770J7801J7964J7380J6896J7118J7600
62058I84523J7191J5242J2121Q654N363K389l54l154o345r802j2927j5435j7871
$$ plain form
62045 979595 958740 934680 908243 880867 853648 826937 800595 774465 748812 724466 702331
62034 702331 682551 664402 647107 630536 615046 601052 588890 578635 569724 561218 552810 545174
62022 545174 538918 533632 528589 523832 519736 515792 510896 504932 499044 494021 489298 484108 478874 474661
62008 474661 471639 468933 465923 463022 461022 460217 460387 461270 462704 464431 466060 467305 468161 468791 469313 469740
61992 469740 470139 470689 471477 472277 472602 471951 469920 466223 460848 454229 447152 440451 434769 430411 427133 424163
61976 424163 420815 417213 414151 412156 410938 409861 408636 407287 405731 403826 401845 400536 400526 401772 403631
61961 403631 405388 406686 407535 408053 408277 408265 408295 408783 409924 411595 413757 416770 420985 426013 430754 434395
61945 434395 437268 440462 444708 449918 455870 462853 471264 480775 490486 500033 510103 521526 534096
$$ packed form
62045I79595k0855k4060k6437k7376k7219k6711k6342k6130k5653k4346k2135
62034G02331j9780j8149j7295j6571j5490j3994j2162j0255q911q506q408p636
62022E45174o256n286n043m757m096l944m896n964n888n023m723n190n234m213
62008D74661l022k706l010k901k000q05J70Q83J434J727J629J245Q56O30N22M27
61992D69740L99N50P88Q00L25o51k031l697n375o619p077o701n682m358l278k970
61976D24163l348l602l062j995j218j077j225j349j556j905j981j309j0J246J859
61961D03631J757J298Q49N18K24j2L0M88J141J671K162L013M215N028M741L641
61945D34395K873L194M246N210N952O983Q411R511R711R547J0070J1423J2570
$$ plain form
61932 534096 546650 558218 568742 578681 588256 597244 605281 612160 617823 622156 624795 625300 623665 620605
61918 620605 617129 613852 610872 608207 605944 603980 602072 600452 600035 601704 605559 611130 618085 626308
61904 626308 635414 644669 653413 661250 667746 672347 674740 675021 673367 669883 664951 659344 653614 647537
61890 647537 640528 632530 624172 616146 608749 602000 595769 589712 583434 576959 570753 565091 559618 553709
61876 553709 547058 539801 532388 525605 520398 517141 515138 513289 511198 509229 507586 506000 504531 504032
61862 504032 505322 508234 512052 516669 522692 530403 539253 548685 559019 571035 584894 599961 615759
61849 615759 632625 651139 671160 691787 712189 732084 751337 769490 785912 800115 811656
61838 811656 820038 825119 827463 827779 826073 821873 815394 807943 800973 795131 790475 787159 785498 785670 787780
$$ packed form
61932E34096J2554J1568J0524R939R575Q988Q037O879N663M333K639N05j635l060
61918F20605l476l277k980k665k263j964j908j620m17J669L855N571O955Q223
61904F26308R106R255Q744P837O496M601K393K81j654l484m932n607n730o077
61890F47537p009p998q358q026p397o749o231o057o278o475o206n662n473n909
61876E53709o651p257p413o783n207l257k003j849k091j969j643j586j469m99
61862E04032J290K912L818M617O023P711Q850R432J0334J2016J3859J5067J5798
61849F15759J6866J8514K0021K0627K0402J9895J9253J8153J6422J4203J1541
61838H11656Q382N081K344L16j706m200o479p451o970n842m656l316j661J72K110
$$ plain form
61823 787780 791981 798053 805010 811574 817006 821159 823831 824493 822633 817954 810215 799292 785569 769911
61809 769911 753085 735451 717329 699375 682357 666721 652449 639157 626217 613095 599839
61798 599839 587175 575903 566292 558108 551040 544875 539406 534461 530056 526307 523161 520371 517755 515328
61784 515328 513089 510823 508302 505601 503073 500980 499303 497878 496486 494692 491918 488071 484010 481001
61770 481001 479577 479242 479257 479327 479361 479176 478851 478982 480028 481622 483082 484407 486155 488408 490568 492329 494139
61753 494139 496358 498526 499891 500306 500122 499495 498242 496261 493657 490573 487227 484049 481375 479044 476590
61738 476590 473846 471093 468615 466418 464426 462728 461566 461169 461602 462596 463671 464598 465659 467156 468757
61723 468757 469731 469898 469965 470768 472451 474591 476763 478715 480215 481098 481408 481260 480633 479560 478401 477592 477102
$$ packed form
61823G87780M201O072O957O564N432M153K672O62j860m679p739j0923j3723j5658
61809G69911j6826j7634j8122j7954j7018j5636j4272j3292j2940j3122j3256
61798E99839j2664j1272r611q184p068o165n469m945m405l749l146k790k616k427
61784E15328k239k266k521k701k528k093j677j425j392j794k774l847m061l009
61770D81001j424l35J5P0L4j85l25J31J046J594J460J325J748K253K160J761J810
61753D94139K219K168J365M15j84o27j253j981k604l084l346l178k674k331k454
61738D76590k744k753k478k197j992j698j162l97M33R94J075R27J061J497J601
61723D68757R74J67O7Q03J683K140K172J952J500Q83L10j48o27j073j159q09m90
$$ plain form
61706 477102 476415 475101 473194 471007 468869 467037 465535 463921 461575 458403 454981 451773 448563 445052
61692 445052 441728 439468 438303 437108 434720 431004 426665 422419 418614 415286 412182 408893 405296 401864
61678 401864 399270 397739 396874 395989 394517 392283 389667 387361 385818 385020 384891 385546 386770 387596 387038 385243
61662 385243 383418 382534 382552 382988 383709 384859 386367 387929 389302 390393 391172 391714 392207 392755 393305 393885 394777
61645 394777 396255 398290 400609 402935 405100 407054 408887 410656 412141 412964 413079 412866 412580 412024 411006
61630 411006 409774 408620 407258 405090 402044 398703 395604 392801 390214 387961 386152 384642 383205 381734
61616 381734 380097 378038 375461 372710 370305 368441 366929 365553 364207 362685 360652 358045 355310 352925
61602 352925 350718 348003 344528 340934 337990 335629 333244 330763 328776 327466 326146 324273 322277 320710
$$ packed form
61706D77102o87j314j907k187k138j832j502j614k346l172l422l208l210l511
61692D45052l324k260j165j195k388l716m339m246l805l328l104l289l597l432
61678D01864k594j531q65q85j472k234k616k306j543p98j29O55J224Q26n58j795
61662C85243j825q84J8M36P21J150J508J562J373J091P79N42M93N48N50N80Q92
61645C94777J478K035K319K326K165J954J833J769J485Q23J15k13k86n56j018
61630D11006j232j154j362k168l046l341l099k803k587k253j809j510j437j471
61616C81734j637k059k577k751k405j864j512j376j346j522k033k607k735k385
61602C52925k207k715l475l594k944k361k385k481j987j310j320j873j996j567
$$ plain form
61588 320710 319114 316666 313713 311576 310685 309913 308204 306026 304540 304030 303926 303867 303855 303622 302815 301757 301211
61571 301211 301244 301103 300416 299782 299831 300315 300567 300355 299900 299521 299679 300889 303014 305004 305972 306252 306819 307938
61553 307938 309090 310031 311044 312103 312644 312464 312104 311956 311672 310971 310448 310858 311947 312729 312804 312741 313153 314051
61535 314051 315230 316707 318483 320259 321715 322812 323556 323789 323479 322980 322596 322024 320651 318444 316163 314588
61519 314588 313872 313743 313991 314423 314666 314427 313885 313405 312923 312087 311066 310679 311379 312496 312914 312290 311146 309986
61501 309986 308902 308085 308104 309373 311602 314010 315931 317088 317573 317794 318276 319265 320479 321348 321532 321287 321409
61484 321409 322615 324778 326852 327825 327693 327214 326901 326745 326830 327498 328732 329920 330611 330984 331323 331495 331309
61467 331309 330918 330451 329688 328602 327757 327567 327548 326963 325904 325050 324605 324224 323846 323786 324052 324307 324537 324950 325182
$$ packed form
61588C20710j596k448k953k137q91p72j709k178j486n10j04n9j2k33q07j058n46
61571C01211L3j41o87o34M9M84K52k12m55l79J58J210K125J990R68K80N67J119
61553C07938J152R41J013J059N41j80l60j48k84p01n23M10J089P82P5o3M12Q98
61535C14051J179J477J776J776J456J097P44K33l10m99l84n72j373k207k281j575
61519C14588p16j29K48M32K43k39n42m80m82q36j021l87P00J117M18o24j144j160
61501C09986j084q17J9J269K229K408J921J157M85K21M82R89J214Q69J84k45J22
61484C21409J206K163K074R73j32m79l13j56Q5O68J234J188O91L73L39J72j86
61467C31309l91m67p63j086q45j90j9n85j059q54m45l81l78o0K66K55K30M13K32
$$ plain form
61448 325182 324458 322793 321255 320678 320811 321112 321661 322732 324105 325495 327244 329839 333045 336192 339203
61433 339203 342663 346820 351075 354595 357059 358676 359813 360785 361808 362997 364380 365887 367299 368421
61419 368421 369425 370838 372943 375348 377410 378945 380206 381263 381786 381524 380695 379781 379113 378713 378372 377736
61403 377736 376466 374532 372384 370754 370186 370703 371904 373361 374873 376314 377444 378099 378539 379340 380850
61388 380850 382910 385158 387349 389272 390593 391081 390894 390492 390331 390683 391586 392752 393664 393948 393662 393177 392871
61371 392871 392968 393447 393932 393877 393084 391898 390773 389864 389266 389374 390505 392267 393754 394516 395008 395993 397829
61354 397829 400461 403733 407391 411001 414311 417681 421815 426952 432517 437676 442045 445724 448876 451568
61340 451568 453998 456521 459341 462370 465482 468646 471665 474028 475390 476077 476768 477716 478580 479035 479138 479004
$$ packed form
61448C25182p24j665j538n77J33L01N49J071J373J390J749K595L206L147L011
61433C39203L460M157M255L520K464J617J137R72J023J189J383J507J412J122
61419C68421J004J413K105K405K062J535J261J057N23k62q29r14o68m00l41o36
61403C77736j270j934k148j630n68N17J201J457J512J441J130O55M40Q01J510
61388C80850K060K248K191J923J321M88j87m02j61L52R03J166R12K84k86m85l06
61371C92871R7M79M85n5p93j186j125r09n98J08J131J762J487P62M92R85J836
61354C97829K632L272L658L610L310L370M134N137N565N159M369L679L152K692
61340D51568K430K523K820L029L112L164L019K363J362O87O91R48Q64M55J03j34
$$ plain form
61324 479004 478475 477422 476166 475328 475327 476166 477605 479362 481198 483018 484912 487100 489776 493063 497048 501868
61308 501868 507749 514807 522708 530718 538364 545944 554032 562474 570285 576598 581295 584579 586442 586933
61294 586933 586566 585907 584876 582871 579571 575248 570346 565143 559898 554963 550487 546198 541656 536719 531703
61279 531703 527129 523361 520423 518135 516408 515357 515088 515498 516343 517473 518867 520438 521968 523251 524273
61264 524273 525202 526240 527566 529438 532248 536292 541382 546821 551927 556572 561096 565727 570199 573927
61250 573927 576470 577911 578818 579709 580458 580424 579319 577660 576085 574566 572780 571000 569930 569676 569498 568758
61234 568758 567565 566333 565274 564572 564527 565191 566278 567712 569850 572846 576222 579505 582831 586535 590478
61219 590478 594306 598103 602307 607146 612541 618371 624404 630199 635490 640553 645748 650877 655371 658969
$$ packed form
61324D79004n29j053j256q38jQ39J439J757J836J820J894K188K676L287L985M820
61308E01868N881P058P901Q010P646P580Q088Q442P811O313M697L284J863M91
61294E86933l67o59j031k005l300m323m902n203n245m935m476m289m542m937n016
61279E31703m574l768k938k288j727j051k69M10Q45J130J394J571J530J283J022
61264E24273R29J038J326J872K810M044N090N439N106M645M524M631M472L728
61250E73927K543J441R07Q91P49l4j105j659j575j519j786j780j070k54j78p40
61234E68758j193j232j059p02m5O64J087J434K138K996L376L283L326L704L943
61219E90478L828L797M204M839N395N830O033N795N291N063N195N129M494L598
$$ plain form
61205 658969 661827 664128 666119 668419 671764 676293 681433 686574 691709 697449 704545 713279 723119 733151
61191 733151 742955 752697 762152 770216 775922 779536 781999 783628 784140 783716 783042 782214 780470 777314 773211
61176 773211 768876 764418 759583 754292 748586 742390 735740 728919 722087 715045 707672 700314 693406 686911
61162 686911 680424 673706 666862 660112 653615 647488 641842 636843 632803 630050 628608 628138 628315 629165 630902
61147 630902 633463 636260 638410 639211 638474 636366 633068 628854 624525 621224 619427 618442 617450 616836 617873
61132 617873 621091 625637 630392 635095 640109 645659 651838 659049 667927 678811 691504 705488 720232
61119 720232 735448 751260 768011 785803 804403 823736 844214 866230 889436 912816 935549
61108 935549 957632 979569 1001623 1023523 1044860 1065483 1085277 1103738 1120174 1134433 1147052
$$ packed form
61205F58969K858K301J991K300L345M529N140N141N135N740P096Q734R840J0032
61191G33151R804R742R455Q064N706L614K463J629N12m24o74q28j744l156m103
61176G73211m335m458m835n291n706o196o650o821o832p042p373p358o908o495
61162F86911o487o718o844o750o497o127n646m999m040k753j442m70J77Q50J737
61147F30902K561K797K150Q01p37k108l298m214m329l301j797r85r92o14J037
61132F17873L218M546M755M703N014N550O179P211Q878J0884J2693J3984J4744
61119G20232J5216J5812J6751J7792J8600J9333K0478K2016K3206K3380K2733
61108I35549K2083K1937K2054K1900K1337K0623J9794J8461J6436J4259J2619
$$ plain form
61097 1147052 1158484 1168507 1176713 1183238 1188578 1192931 1196248 1198791 1201111 1203521 1206157 1209521 1214332
61084 1214332 1220683 1227938 1235675 1244231 1254045 1264972 1276579 1288625 1300812 1312476 1323089 1332817
61072 1332817 1342073 1350646 1357822 1363316 1367518 1370675 1372330 1371896 1369546 1366200 1362718 1359375 1356016 1352367
61058 1352367 1348079 1342856 1336936 1331332 1327211 1324971 1324256 1324907 1327441 1332388 1339591 1348586 1359352 1372222
61044 1372222 1387185 1403832 1422062 1442431 1465666 1492024 1521202 1552680 1586209 1622164 1661344
61033 1661344 1704217 1750368 1798924 1849385 1901834 1956470 2013255 2072066 2132912 2196101 2262335
61022 2262335 2332571 2407608 2487923 2574048 2666883 2767479 2876874 2996342 3127546 3272372
61012 3272372 3433377 3614915 3823313 4065571 4348782 4681541 5075092 5542097 6095025
$$ packed form
61097A147052J1432J0023Q206O525N340M353L317K543K320K410K636L364M811
61084A214332O351P255P737Q556R814J0927J1607J2046J2187J1664J0613R728
61072A332817R256Q573P176N494M202L157J655m34k350l346l482l343l359l649
61058A352367m288n223n920n604m121k240p15O51K534M947P203Q995J0766J2870
61044A372222J4963J6647J8230K0369K3235K6358K9178L1478L3529L5955L9180
61033A661344M2873M6151M8556N0461N2449N4636N6785N8811O0846O3189O6234
61022B262335P0236P5037Q0315Q6125R2835J00596J09395J19468J31204J44826
61012C272372J61005J81538K08398K42258K83211L32759L93551M67005N52928
$$ plain form
61003 6095025 6746464 7508989 8391611 9395511 10512073 11717400 12956737 14130961 15112521
60994 15112521 15798635 16167243 16287875 16278658 16249247 16270700 16371410 16531975 16673578 16667641
60984 16667641 16386032 15766167 14841067 13713569 12502484 11302543 10173259 9144083
60976 9144083 8222051 7400171 6667310 6015063 5438236 4932291 4492357 4113426 3789566
60967 3789566 3513095 3275517 3069164 2887752 2726380 2581909 2452723 2337248 2233200
60958 2233200 2138818 2053854 1978265 1910516 1848296 1790478 1737205 1688240 1642407 1598711 1557031
60947 1557031 1517413 1479407 1442483 1406694 1372621 1340791 1311163 1283109 1256011 1229885 1205113
60936 1205113 1181558 1158515 1135711 1113646 1092622 1072186 1052079 1033018 1015775 1000012 984755
$$ packed form
61003F095025O51439P62525Q82622J003900J116562J205327J239337J174224R81560
60994A5112521O86114L68608J20632r217k9411K1453J00710J60565J41603n937
60984A6667641k81609o19865r25100j127498j211085j199941j129284j029176
60976I144083r22032q21880p32861o52247n76827n05945m39934l78931l23860
60967C789566k76471k37578k06353j81412j61372j44471j29186j15475j04048
60958B233200r4382q4964p5589o7749o2220n7818n3273m8965m5833m3696m1680
60947A557031l9618l8006l6924l5789l4073l1830k9628k8054k7098k6126k4772
60936A205113k3555k3043k2804k2065k1024k0436k0107j9061j7243j5763j5257
$$ plain form
60925 984755 969585 954637 939853 925075 910555 896662 883347 870567 858777 848214 838104
60914 838104 827449 816360 805772 796127 787239 779113 771856 764905 757427 749523 742089 735403 728777
60901 728777 721693 714396 707198 700074 693154 686792 680890 674859 668507 662257 656274 650093 643381 636425
60887 636425 629578 622845 616257 610050 604121 597886 591013 583843 576849 570194 564069 558912 554888 551550
60873 551550 548397 545407 542727 540170 537445 534710 532579 531585 531679 532246 532688 533074 533992 535580 537058 537620
60857 537620 537383 536943 536396 535560 534932 535423 537073 538809 539675 539623 539061 538305 537617 537060 536176 534400 531901 529325
60839 529325 526722 523528 519654 515599 511274 505906 499596 493864 489785 486394 481925 476068 470018 464601
60825 464601 459358 453521 447136 441024 435987 432171 428970 425540 421509 417173 413070 409593 406926 404882
$$ packed form
60925I84755j5170j4948j4784j4778j4520j3893j3315j2780j1790j0563j0110
60914H38104j0655j1089j0588r645q888q126p257o951p478p904p434o686o626
60901G28777p084p297p198p124o920o362n902o031o352o250n983o181o712o956
60887F36425o847o733o588o207n929o235o873p170o994o655o125n157m024l338
60873E51550l153k990k680k557k725k735k131r94R4N67M42L86R18J588J478N62
60857E37620k37m40n47q36o28M91J650J736Q66n2n62p56o88n57q84j776k499k576
60839E29325k603l194l874m055m325n368o310n732m079l391m469n857o050n417
60825D64601n243n837o385o112n037l816l201l430m031m336m103l477k667k044
$$ plain form
60811 404882 402780 399956 396512 393105 390019 387110 384689 383548 383677 383826 382926 381324 379967 379006 378034
60796 378034 377262 377482 378880 380622 381715 381882 381614 381730 382795 384637 386446 387585 388134 388492 388758 388858
60780 388858 388949 389230 389492 389258 388289 386705 384776 382878 381388 380310 379173 377630 376008 374940 374622 374656
60764 374656 374472 373696 372299 370664 369343 368519 367886 367149 366323 365438 364327 362979 361662 360430 358958 357212
60748 357212 355831 355409 355819 356708 358169 360284 362320 363152 362409 360674 358628 356512 354321 351971 349299
60733 349299 346340 343620 341764 340819 340311 339872 339428 338896 338195 337592 337577 338266 339249 340078 340661 341164 341826 342858
60715 342858 344268 345766 347041 348100 349132 350161 351074 351929 352928 354114 355274 356112 356356 355835 354644 353113
60699 353113 351478 349741 347982 346520 345534 344817 344117 343415 342561 341111 338977 336890 335684 335341 335322 335508
$$ packed form
60811D04882k102k824l444l407l086k909k421j141J29J49r00j602j357r61r72
60796C78034p72K20J398J742J093J67k68J16J065J842J809J139N49L58K66J00
60780C88858R1K81K62k34r69j584j929j898j490j078j137j543j622j068l18L4
60764C74656j84p76j397j635j321q24o33p37q26q85j111j348j317j232j472j746
60748C57212j381m22M10Q89J461K115K036Q32p43j735k046k116k191k350k672
60733C49299k959k720j856r45n08m39m44n32p01o03j5O89R83Q29N83N03O62J032
60715C42858J410J498J275J059J032J029R13Q55R99J186J160Q38K44n21j191j531
60699C53113j635j737j759j462r86p17p00p02q54j450k134k087j206l43j9J86
$$ plain form
60683 335508 336115 336832 336914 336326 336087 337123 339150 340999 341749 341442 340992 341510 343401 345901 347688 348037 347299
60666 347299 346302 345611 345341 345332 345374 345387 345436 345450 345117 344318 343505 343233 343404 343465 343359 343761 345151 347125 348915 350286
60646 350286 351605 353163 354767 355932 356293 355790 354622 353143 351825 351121 351040 350814 349375 346453 343024 340386
60630 340386 338989 338400 338078 337725 337116 336288 335897 336709 338528 340105 340471 339959 339658 340149 341182 342299 343258
60613 343258 343831 343595 342281 340279 338582 338061 338735 339895 340917 341801 342816 343903 344670 344913 344835 344776 344926
60596 344926 345345 346059 347110 348568 350405 352291 353728 354561 355177 355945 356699 357163 357712 359134 361583 364265
60580 364265 366418 368222 370382 373079 375774 378064 380360 383457 387530 391870 395767 399435 403794 409386
60566 409386 415955 423146 431165 440267 449800 458211 464117 467288 468651 469452 470260 470627 469801 467828 465665
$$ packed form
60683C35508O07P17Q2n88k39J036K027J849P50l07m50N18J891K500J787L49p38
60666C47299r97o91k70rM2J3M9J4l33p99q13k72J71O1j06M02J390J974J790J371
60646C50286J319J558J604J165L61n03j168j479j318p04q1k26j439k922l429k638
60630C40386j397n89l22l53o09q28l91Q12J819J577L66n12l01M91J033J117R59
60613C43258N73k36j314k002j697n21O74J160J022Q84J015J087P67K43p8n9J50
60596C44926M19P14J051J458J837J886J437Q33O16P68P54M64N49J422K449K682
60580C64265K153J804K160K697K695K290K296L097M073M340L897L668M359N592
60566D09386O569P191Q019R102R533Q411N906L171J363Q01Q08L67q26j973k163
$$ plain form
60551 465665 464192 463579 463834 465362 468324 471883 474931 477557 481037 486292 493044 500711 509478 520000
60537 520000 532432 546232 560781 575754 590843 605411 618573 629595 638113 643960 646955 647073
60525 647073 644786 640940 636198 630872 625328 620117 615424 610866 606273 602282 599606 597991 596547 595033
60511 595033 594212 594906 597207 600642 604711 609263 614788 622369 632873 646156 661535 678987 699358
60498 699358 723322 750615 780345 811552 843400 875426 907736 940373 972243 1001190 1025328
60487 1025328 1043831 1056270 1061883 1059983 1050549 1033925 1010395 980622 946142 908856 870120 830808
60475 830808 791979 754885 720316 688401 659119 632633 609013 588006 569205 552305 537100
60464 537100 523394 511010 499782 489518 479996 471105 462974 455923 450193 445639 441781 438273 435211
$$ packed form
60551D65665j473o13K55J528K962L559L048K626L480N255O752P667Q767J0522
60537E20000J2432J3800J4549J4973J5089J4568J3162J1022Q518N847K995J18
60525F47073k287l846m742n326n544n211m693m558m593l991k676j615j444j514
60511E95033q21O94K301L435M069M552N525P581J0504J3283J5379J7452K0371
60498F99358K3964K7293K9730L1207L1848L2026L2310L2637L1870K8947K4138
60487A025328J8503J2439N613j900r434j6624k3530k9773l4480l7286l8736l9312
60475H30808l8829l7094l4569l1915k9282k6486k3620k1007j8801j6900j5205
60464E37100j3706j2384j1228j0264r522q891q131p051n730m554l858l508l062
$$ plain form
60451 435211 432806 430794 428431 425162 421136 417072 413671 411059 408648 405656 402012 398577 396183 394652
60437 394652 393192 391557 390160 389085 387778 386042 384613 384264 384793 385397 385666 385714 385684 385752 386373 387808 389379
60420 389379 389850 388746 386889 385415 384647 384219 383923 383971 384544 385509 386688 388080 389599 390874 391690 392524 394165
60403 394165 396654 398954 400053 400107 400086 400499 401002 401233 401434 402001 402904 403953 405328 407351 409829 412062 413597
60386 413597 414681 415766 416795 417301 417260 417501 418974 421707 424835 427613 429990 432129 433918 435312 436715
60371 436715 438485 440294 441539 442272 443216 444927 447349 450096 452629 454314 454930 455216 456298 458447 460921
60356 460921 463127 465318 467946 470943 474040 477314 480914 484593 487860 490350 491765 491811 490595 488919 487752
60341 487752 487461 487640 487552 486603 484657 482104 479511 477195 475329 474291 474324 474813 474537 473021 471129 469909
$$ packed form
60451D35211k405k012k363l269m026m064l401k612k411k992l644l435k394j531
60437C94652j460j635j397j075j307j736j429l49N29O04K69M8l0O8O21J435J571
60420C89379M71j104j857j474p68m28k96M8N73R65J179J392J519J275Q16Q34J641
60403C94165K489K300J099N4k1M13N03K31K01N67R03J049J375K023K478K233J535
60386D13597J084J085J029N06m1K41J473K733L128K778K377K139J789J394J403
60371D36715J770J809J245P33R44J711K422K747K533J685O16K86J082K149K474
60356D60921K206K191K628K997L097L274L600L679L267K490J415M6j216j676j167
60341D87752k91J79q8r49j946k553k593k316j866j038L3M89k76j516j892j220
$$ plain form
60325 469909 469262 468186 465990 462827 459367 456439 454768 454571 455453 456956 459005 461643 464744 468420 473275
60310 473275 479643 486774 493407 499090 504419 510078 516246 522915 530126 537658 544945 551500 557064 561152
60296 561152 562930 561888 558419 553359 547095 539444 530408 520772 511776 504272 498239 493105 488411 484151
60282 484151 480566 477807 475775 474113 472289 469834 466688 463339 460521 458732 457922 457540 456900 455613 453724
60267 453724 451515 449342 447638 446668 445982 444433 441241 436986 433173 430890 430205 430585 431240 431206 429893 427822
60251 427822 426219 425678 425785 426167 427138 428963 431175 433159 434838 436254 437077 437168 437170 437767 438654 438997 438749 438782
60233 438782 439741 441407 443246 445027 446781 448567 450448 452433 454415 456351 458388 460594 462793 465003
60219 465003 467772 471588 476121 480600 484851 489463 494843 500643 506256 511475 516457 521341 526118 530691
$$ packed form
60325D69909o47j076k196l163l460k928j671j97Q82J503K049K638L101L676M855
60310D73275O368P131O633N683N329N659O168O669P211P532P287O555N564M088
60296E61152J778j042l469n060o264p651r036r636q996p504o033n134m694m260
60282D84151l585k759k032j662j824k455l146l349k818j789q10l82o40j287j889
60267D53724k209k173j704r70o86j549l192m255l813k283o85L80O55l4j313k071
60251D27822j603n41J07L82R71J825K212J984J679J416Q23R1KN97Q87L43k48L3
60233D38782R59J666J839J781J754J786J881J985J982J936K037K206K199K210
60219D65003K769L816M533M479M251M612N380N800N613N219M982M884M777M573
$$ plain form
60205 530691 534926 538745 542250 545701 549421 553761 558928 564574 569726 573458 575688 577123 578466 579804
60191 579804 580648 580353 578615 575806 572750 569938 567051 563451 559011 554155 549250 544321 539389 534752 530772
60176 530772 527548 524898 522601 520614 519031 517751 516323 514344 511948 509599 507459 505361 503421 502052
60162 502052 501193 500195 498906 498284 499325 501753 504384 506472 508071 509340 510232 510826 511397 512083 512884 513959
60146 513959 515525 517516 519702 521990 524269 526209 527757 529663 532942 537796 543515 549390 555303 561459
60132 561459 567952 574549 580640 585592 589539 593512 598282 603353 607663 610968 613788 616227 617800 618436
60118 618436 618814 619489 620312 620882 620986 620542 619697 619056 619168 619681 619658 618779 617571 616427 615175 613744 612318
60101 612318 610565 607659 603533 599300 595898 593046 590120 587294 585084 583366 581673 580046 578850 578059
$$ packed form
60205E30691M235L819L505L451L720M340N167N646N152L732K230J435J343J338
60191E79804Q44k95j738k809l056k812k887l600m440m856m905m929m932m637l980
60176E30772l224k650k297j987j583j280j428j979k396k349k140k098j940j369
60162E02052q59r98j289o22J041K428K631K088J599J269Q92N94N71O86Q01J075
60146E13959J566J991K186K288K279J940J548J906L279M854N719N875N913O156
60132E61459O493O597O091M952L947L973M770N071M310L305K820K439J573O36
60118F18436L78O75Q23N70J04m44q45o41J12N13k3q79j208j144j252j431j426
60101F12318j753k906m126m233l402k852k926k826k210j718j693j627j196p91
$$ plain form
60087 578059 577463 577265 577716 578372 578496 578124 578030 578649 579607 580380 580772 580674 579952 578718 577247 575409 572593 568458
60069 568458 563409 558095 552702 547027 541055 535177 529851 525212 520997 516755 512180 507354 502707 498688
60055 498688 495424 492712 490291 488090 486232 484840 483976 483737 484293 485696 487728 490061 492518 495102 497847
60040 497847 500818 504188 508097 512410 516758 520822 524446 527493 529752 531011 531116 530033 528027 525716
60026 525716 523657 521758 519275 515496 510372 504454 498289 491919 484976 477286 469338 461989 455697 450358
60012 450358 445910 442617 440443 438612 436373 433972 432316 431769 431778 431645 431096 430096 428675 427099 425835 425178
59996 425178 425186 425895 427177 428535 429610 430878 433151 436271 439079 440954 442647 445072 447911 450131 451538
59981 451538 452996 455120 457381 458688 458511 457201 455418 453509 451501 449466 447646 446154 444943 444302 445035
$$ packed form
60087E78059n96j98M51O56J24l72r4O19R58P73L92r8p22j234j471j838k816m135
60069E68458n049n314n393n675n972n878n326m639m215m242m575m826m647m019
60055D98688l264k712k421k201j858j392q64k39N56J403K032K333K457K584K745
60040D97847K971L370L909M313M348M064L624L047K259J259J05j083k006k311
60026E25716k059j899k483l779n124n918o165o370o943p690p948p349o292n339
60012D50358m448l293k174j831k239k401j656n47Rj33n49j000j421j576j264o57
59996D25178QP09J282J358J075J268K273L120K808J875J693K425K839K220J407
59981D51538J458K124K261J307j77j310j783j909k008k035j820j492j211o41P33
$$ plain form
59966 445035 447592 451184 454350 456482 458226 460355 462855 465341 467746 470165 472472 474536 476524 478590
59952 478590 480442 481555 481685 480909 479339 477049 474262 471461 469301 468300 468384 468821 468970 469027 469623 470686
59936 470686 471256 470595 468987 467330 466453 466982 469219 472724 476481 479940 483538 487891 492857 497659 501474
59921 501474 503512 503079 500300 496520 493380 491517 490478 489683 489072 488977 489806 491733 494432 497266 499946 502765
59905 502765 505926 509043 511700 514119 516712 519224 520896 521418 521233 520965 520962 521293 521779 522090 522132 522257 522794
59888 522794 523562 524267 525206 527050 529997 533614 537465 541407 545239 548621 551573 554680 558501 562924 567244
59873 567244 570758 573208 574819 575985 576943 577789 578754 580192 582080 583786 584660 584751 584676 584914 585494 586252 586994
59856 586994 587473 587535 587437 587812 589231 591858 595397 599261 602942 606427 610114 614043 617341 618780 617949 615682
$$ packed form
59966D45035K557L592L166K132J744K129K500K486K405K419K307K064J988K066
59952D78590J852J113J30p76j570k290k787k801k160j001Q4M37J49N7N96J063
59936D70686N70o61j608j657q77N29K237L505L757L459L598M353M966M802L815
59921E01474K038m33k779l780l140j863j039p95o11r5Q29J927K699K834K680K819
59905E02765L161L117K657K419K593K512J672N22j85k68lL31M86L11M2J25N37
59888E22794P68P05R39J844K947L617L851L942L832L382K952L107L821M423M320
59873E67244L514K450J611J166R58Q46R65J438J888J706Q74R1p5K38N80P58P42
59856E86994M79O2r8L75J419K627L539L864L681L485L687L929L298J439q31k267
$$ plain form
59840 615682 613393 612174 612385 613649 614987 615180 613323 609282 603734 597755 592259 587668 584032 581304 579388
59825 579388 578058 577095 576390 575668 574290 571772 568442 565055 561727 557842 553188 548516 544623 541458 538603
59810 538603 536132 534397 533299 532371 531440 530738 530488 530710 531266 531736 531549 530607 529527 528877 528463 527798 526952
59793 526952 526396 526230 526111 525788 525135 523803 521429 518203 514801 511816 509582 508370 508150 508288 507986 507058
59777 507058 505867 504624 503258 501872 500741 499876 499165 498953 499901 502103 504824 507293 509342 511243 513354
59762 513354 516085 519714 524047 528575 533144 538139 543894 550265 556959 563928 571193 578515 585537 592202
59748 592202 598918 606218 614213 622316 629747 636395 642962 650104 657733 665351 672616 679119 684020 686596
59734 686596 687035 686162 684499 682143 679329 676399 673255 669560 665588 662200 659824 657995 656055 653705 650790
$$ packed form
59840F15682k289j219K11J264J338J93j857m041n548n979n496m591l636k728j916
59825E79388j330r63p05p22j378k518l330l387l328l885m654m672l893l165k855
59810E38603k471j735j098r28r31p02k50K22N56M70j87r42j080o50m14o65q46
59793E26952n56j66j19l23o53j332k374l226l402k985k234j212k20J38l02r28
59777E07058j191j243j366j386j131q65p11k12R48K202K721K469K049J901K111
59762E13354K731L629M333M528M569M995N755O371O694O969P265P322P022O665
59748E92202O716P300P995Q103P431O648O567P142P629P618P265O503M901K576
59734F86596M39q73j663k356k814k930l144l695l972l388k376j829j940k350k915
$$ plain form
59719 650790 647184 643205 639587 636724 634323 631974 629587 627066 624140 620938 618302 617095 617379 618527
59705 618527 619808 620694 621053 621445 622919 626029 630158 634097 637150 639488 641639 643965 646552 649296 652007
59690 652007 654474 656435 657566 657706 657092 656173 655180 654099 653007 652060 651065 649408 646607 642817 638732 635105
59674 635105 632193 629364 625421 619753 613168 607140 602294 598117 594088 590350 587083 583979 580822 578032
59660 578032 576150 575176 574817 574971 575503 575973 576205 576817 578516 580974 583067 584272 585255 586834 588811 590144
59644 590144 590011 588380 585671 582221 578256 574155 570370 566959 563444 559368 554905 550680 547059 543971
59630 543971 541351 539299 537570 535331 531858 527419 523187 520206 518522 517234 515336 512468 508934 505093
59616 505093 500969 496588 492417 489108 486882 485503 484787 484701 484961 485020 484689 484424 484752 485662 486794 487934 489053
$$ packed form
59719F50790l606l979l618k863k401k349k387k521k926l202k636j207K84J148
59705F18527J281Q86L59L92J474L110M129L939L053K338K151K326K587K744K711
59690F52007K467J961J131J40o14r19r93j081j092r47r95j657k801l790m085l627
59674F35105k912k829l943n668o585o028m846m177m029l738l267l104l157k790
59660E78032j882r74l59J54N32M70K32O12J699K458K093J205R83J579J977J333
59644E90144j33j631k709l450l965m101l785l411l515m076m463m225l621l088
59630E43971k620k052j729k239l473m439m232k981j684j288j898k868l534l841
59616E05093m124m381m171l309k226j379p16q6K60N9l31k65L28R10J132J140J119
$$ plain form
59599 489053 490054 490792 491305 491813 492511 493478 494711 496125 497558 498841 499835 500366 500225 499360 498049 496874
59583 496874 496411 496773 497431 497648 497227 496635 496263 495817 494664 492565 489782 486745 484049 482449 482293 482943 483280
59566 483280 482839 482053 481433 480952 480342 479518 478619 477977 478052 478978 480164 480749 480547 480173 480217 480754 481677 482974 484577
59547 484577 486427 488805 492108 496142 500178 503963 508187 513682 520630 528826 538286 549179 561316 573823
59533 573823 585043 592836 595659 593749 588946 583144 577258 571714 567187 564385 563472 564097 565672 567360
59519 567360 568300 568272 567867 567643 567390 566529 564875 562672 560143 557330 554081 550007 544858 539185 534184 530476
59503 530476 527480 524332 520936 517636 514367 510856 507385 504683 503094 502351 502072 502018 501975 501847 501876 502394 503374
59486 503374 504505 505612 506700 507696 508471 509075 509733 510718 512383 515079 518734 522743 526590 530423 534649
$$ packed form
59599D89053J001P38N13N08O98R67J233J414J433J283R94N31j41q65j311j175
59583D96874m63L62O58K17m21n92l72m46j153k099k783l037k696j600j56O50L37
59566D83280m41p86o20m81o10q24q99o42P5R26J186N85k02l74M4N37R23J297J603
59547D84577J850K378L303M034M036L785M224N495O948Q196R460J0893J2137J2507
59533E73823J1220P793K823j910m803n802n886n544m527k802r13O25J575J688
59519E67360R40k8m05k24k53q61j654k203k529k813l249m074n149n673n001l708
59503E30476k996l148l396l300l269l511l471k702j589p43k79n4m3j28K9N18R80
59486E03374J131J107J088R96P75O04O58R85J665K696L655M009L847L833M226
$$ plain form
59471 534649 539093 542942 545602 547327 548985 551268 554082 556614 558132 558780 559409 560574 562030 563261 564140
59456 564140 564906 565860 567382 569913 573549 577861 582416 587279 592745 598741 604666 609652 612985 614566 615019
59441 615019 614951 614126 611936 608754 605995 604457 603342 601511 599075 597072 596051 595737 595753 595932 596166 596564
59425 596564 597650 599861 603083 607207 612796 620513 630097 640625 651757 664061 678086 693718 710549
59412 710549 728425 747489 767750 788291 806617 819302 824175 822024 815914 809064 803660 800964 801405
59399 801405 804523 809606 816359 824167 830766 832731 827943 817158 802980 787809 772970 759053 746381
59386 746381 735202 725747 718045 711673 705980 700682 696005 692137 688794 685459 681847 678038 674317 670949
59372 670949 667999 665339 662879 660712 658973 657762 657291 657800 659136 660697 662125 663777 666176 669321 672890
$$ packed form
59471E34649M444L849K660J725J658K283K814K532J518O48O29J165J456J231Q79
59456E64140P66R54J522K531L636M312M555M863N466N996N925M986L333J581M53
59441F15019o8q25k190l182k759j538j115j831k436k003j021l14J6J79K34L98
59425E96564J086K211L222M124N589P717R584J0528J1132J2304J4025J5632J6831
59412G10549J7876J9064K0261K0541J8326J2685M873k151o110o850n404k696M41
59399H01405L118N083O753P808O599J965m788j0785j4178j5171j4839j3917j2672
59386G46381j1179r455p702o372n693n298m677l868l343l335l612l809l721l368
59372F70949k950k660k460k167j739j211m71N09J336J561J428J652K399L145L569
$$ plain form
59357 672890 676787 681011 685313 689576 694359 700502 708258 717248 727048 737352 747798 758257 769107
59344 769107 780624 792287 803309 813589 823416 832412 839707 845096 849116 851929 853023 852198 849872
59331 849872 846173 840618 833133 824495 815241 804896 792907 779734 766316 752990 739672 726736
59319 726736 714942 704615 695521 687484 680563 674633 669267 664163 659421 655350 652191 650038 648879 648714
59305 648714 649716 652140 655935 660651 665842 671354 676860 681285 683104 681400 676446 669141 660130 649786
59291 649786 638949 629047 620984 614162 607241 599970 593676 589711 588002 587601 588057 589560 592036 594979
59277 594979 598136 601649 605450 609181 612915 617436 623534 631358 640512 650388 660249 669375 677413 684440
59263 684440 690663 696228 701253 705674 709079 711095 711914 712069 711722 710605 708685 706434 704381 702767 701695
$$ packed form
59357F72890L897M224M302M263M783O143P756Q990R800J0304J0446J0459J0850
59344G69107J1517J1663J1022J0280R827Q996P295N389M020K813J094q25k326
59331H49872l699n555p485q638r254j0345j1989j3173j3418j3326j3318j2936
59319G26736j1794j0327r094q037o921n930n366n104m742m071l159k153j159j65
59305F48714J002K424L795M716N191N512N506M425J819j704m954p305r011j0344
59291F49786j0837r902q063o822o921p271o294l965j709m01M56J503K476K943
59277E94979L157L513L801L731L734M521O098P824R154R876R861R126Q038P027
59263F84440O223N565N025M421L405K016Q19J55l47j117j920k251k053j614j072
$$ plain form
59248 701695 701116 700620 699726 698547 697788 697941 698859 700184 701689 703056 703777 703618 702969 702529 702806 703908 705474
59231 705474 706740 706915 705563 702495 697601 691272 684693 678961 673863 668205 661396 653955 646355 638343
59217 638343 629860 621821 615211 609920 605192 600913 597676 595683 594224 592439 590224 588181 586839 586049
59203 586049 585190 583986 582956 582890 583963 585645 587408 589123 590821 592510 594396 596858 599993 603392 606509
59188 606509 608977 610600 611428 611916 612625 613682 614842 616101 617713 619517 620753 620868 620154 619392 619152 619520
59172 619520 620142 620406 620006 619486 619803 621177 622796 623830 624267 624473 624385 623594 621970 619862 617694 615501 612801
59155 612801 608985 604026 598633 593399 588053 582063 575735 570008 565212 560835 556535 552510 548743 544802
59141 544802 540762 537467 535375 533820 531908 529526 526979 524397 522070 520722 520720 521460 522163 522825 523759 524753
$$ packed form
59248G01695n79m96q94j179p59J53R18J325J505J367P21j59o49m40K77J102J566
59231G05474J266J75j352l068m894o329o579n732n098n658o809p441p600q012
59217F38343q483q039o610n291m728m279l237j993j459j785k215k043j342p90
59203E86049q59j204j030o6J073J682J763J715J698J689J886K462L135L399L117
59188F06509K468J623Q28M88P09J057J160J259J612J804J236J15p14p62k40L68
59172F19520O22K64m00n20L17J374J619J034M37K06q8p91j624k108k168k193k700
59155F12801l816m959n393n234n346n990o328n727m796m377m300m025l767l941
59141E44802m040l295k092j555j912k382k547k582k327j348kP40P03O62R34R94
$$ plain form
59125 524753 525488 526498 528839 532842 537819 542980 548130 553450 559004 564533 569578 573930 578069 582834
59111 582834 588529 594705 600997 607629 614795 622096 628973 635196 640552 644592 647195 648857 649917 650059
59097 650059 649175 648027 647304 646585 645089 643000 641112 639509 637674 635667 634114 633004 631519 629209 626487
59082 626487 623750 620824 617498 613840 609732 604769 598974 593058 587679 582938 578854 575703 573469 571425
59068 571425 568755 565380 561873 558787 556349 554547 553152 551774 550129 548210 546149 544121 542402 541187
59054 541187 540151 538582 536315 534308 533747 534607 535582 535567 534805 534233 534103 533845 533247 533109 534325 536688 539036
59037 539036 540419 540815 540853 541284 542676 545140 548265 551565 554998 558778 562879 567215 572206 578577 586509
59022 586509 595530 605305 615955 627442 639187 650515 660970 670002 676963 681672 684416 685159 683432
$$ packed form
59125E24753P35J010K341M003M977N161N150N320N554N529N045M352M139M765
59111E82834N695O176O292O632P166P301O877O223N356M040K603J662J060J42
59097F50059q84j148p23p19j496k089j888j603j835k007j553j110j485k310k722
59082F26487k737k926l326l658m108m963n795n916n379m741m084l151k234k044
59068E71425k670l375l507l086k438j802j395j378j645j919k061k028j719j215
59054E41187j036j569k267k007n61Q60R75j5p62n72j30k58n98j38J216K363K348
59037E39036J383L96L8M31J392K464L125L300L433L780M101M336M991O371P932
59022E86509R021R775J0650J1487J1745J1328J0455R032O961M709K744P43j727
$$ plain form
59009 683432 679426 674477 669905 665921 662208 659002 656859 655797 655462 655892 657370 659695 662243 664662 666883
58994 666883 668589 669336 669251 669007 669028 669131 669054 668869 668664 668148 666839 664668 662275 660609 660112 660380 660811 661420
58976 661420 662661 664660 667305 671068 676847 684644 693145 701106 708534 715970 723331 730227 736883 743836
58962 743836 750924 757371 762814 767573 771931 775649 778233 779309 778793 776884 773760 769170 762728 754789
58948 754789 746402 737997 728730 717772 705778 694428 684860 677141 670868 665525 660525 655630 651311
58935 651311 648202 646356 645392 644976 644755 644289 643645 643589 644556 645875 646626 646750 646572 645877 644457 643139 643120 644387
58917 644387 645758 646415 646516 646461 646498 646961 647931 648659 648222 646855 645888 646395 648618 652604 658415 665562 673108
58900 673108 680571 688155 696086 704329 712893 721716 730339 738422 746439 755053 764022 772673 781300 790938
$$ packed form
59009F83432m006m949m572l984l713l206k143j062l35M30J478K325K548K419K221
58994F66883J706P47q5k44K1J03p7j85k05n16j309k171k393j666m97K68M31O09
58976F61420J241J999K645L763N779P797Q501P961P428P436P361O896O656O953
58962G43836P088O447N443M759M358L718K584J076n16j909l124m590o442p939
58948G54789q387q405r267j0958j1994j1350r568p719o273n343n000m895m319
58935F51311l109j846r64m16k21m66o44n6R67J319P51J24j78o95j420j318j9J267
58917F44387J371O57J01n5L7M63R70P28m37j367r67N07K223L986N811P147P546
58900F73108P463P584P931Q243Q564Q823Q623Q083Q017Q614Q969Q651Q627R638
$$ plain form
58886 790938 801730 812671 823152 833611 844296 854503 863452 870963 876842 880531 881907 881589 879873
58873 879873 876231 870468 863587 856795 850279 843668 837192 831539 826865 822661 818506 814416 810530 806873
58859 806873 803445 800201 796885 792978 787924 781565 774476 767661 761666 756226 751000 746224 742128 738210
58845 738210 733871 729433 725556 721750 716517 709078 700097 690575 681012 671858 663804 657052 650945 644759
58831 644759 638398 632106 626157 621024 617175 614416 612071 610005 608748 608465 608672 609291 611041 614223 617908
58816 617908 620985 623353 625463 627281 628480 629216 629992 630966 631911 632688 633296 633648 633622 633204 632353 630975 629154
58799 629154 627141 624944 622291 619087 615474 611356 606384 600653 594937 589972 585859 582328 579197 576467
58785 576467 574353 573298 573467 574262 574925 575634 577313 580270 583730 586852 589380 591166 591921 591775 591202 590011
$$ packed form
58886G90938J0792J0941J0481J0459J0685J0207Q949P511N879L689J376l18j716
58873H79873l642n763o881o792o516o611o476n653m674m204m155m090l886l657
58859H06873l428l244l316l907n054o359p089o815n995n440n226m776m096l918
58845G38210m339m438l877l806n233p439q981r522r563r154q054o752o107o186
58831F44759o361o292n949n133l849k759k345k066j257k83K07O19J750L182L685
58816F17908L077K368K110J818J199P36P76R74R45P77O08L52k6m18q51j378j821
58799F29154k013k197k653l204l613m118m972n731n716m965m113l531l131k730
58785E76467k114j055J69P95O63P09J679K957L460L122K528J786P55j46n73j191
$$ plain form
58769 590011 587308 582969 578340 574811 572416 570441 568636 567008 565066 562312 559253 557079 556405 556934 558176
58754 558176 559858 561670 563156 564025 564384 564688 565573 567455 569971 572007 572608 571850 570709 570159 570497 571411
58738 571411 572606 574326 577112 580981 585204 589177 593091 597321 601571 605308 608669 612185 615861 619347
58724 619347 622727 626184 629114 630712 631388 632472 634453 636664 638832 641628 645348 649258 652790 656322
58710 656322 660236 664114 667411 670037 671824 672301 671432 669697 667049 662760 656633 649293 640890 630800
58696 630800 619208 607679 597283 587325 576908 566681 557945 550889 544829 539464 534841 530651 526567
58683 526567 522805 519577 516518 513383 510669 508799 507338 505707 503955 502144 499848 497159 495324 495391 496957
58668 496957 499190 502296 506849 512451 518291 524453 531443 538875 545776 551804 557008 560791 562347 561861
$$ packed form
58769E90011k703m339m629l529k395j975j805j628j942k754l059k174o74N29J242
58754E58176J682J812J486Q69L59L04Q85J882K516K036O01p58j141n50L38R14
58738E71411J195J720K786L869M223L973L914M230M250L737L361L516L676L486
58724F19347L380L457K930J598O76J084J981K211K168K796L720L910L532L532
58710F56322L914L878L297K626J787M77q69j735k648m289o127p340q403j0090
58696F30800j1592j1529j0396r958j0417j0227q736p056o060n365m623m190m084
58683E26567l762l228l059l135k714j870j461j631j752j811k296k689j835O7J566
58668D96957K233L106M553N602N840O162O990P432O901O028N204L783J556m86
$$ plain form
58654 561861 560161 557465 553555 549001 544933 541615 538242 534259 529998 525969 522323 519136 516626 514945
58640 514945 514164 514338 515279 516505 517777 519232 520688 521444 521267 520902 521022 521420 521861 522818 524430 525585 525197
58623 525197 523788 522669 522091 521388 520517 520196 520681 521520 522407 523394 524449 525681 527693 530900 534759 538484
58607 538484 542100 545919 549482 552028 553661 555073 556496 557928 559898 562818 565878 567788 568435 568776 569299
58592 569299 569692 569883 570294 571112 572242 573881 576334 579554 583682 589533 597427 606000 613418 619585 625905
58577 625905 633119 640679 648104 655556 662916 669588 675471 681186 687213 693740 701393 711018 722615 735358
58563 735358 748818 763366 779379 796841 815641 835371 854880 872835 888666 902194 912741
58552 912741 919642 923416 925308 925754 924382 921410 917916 914654 911581 908534 905346 901245 895152 886708
$$ packed form
58654E61861j700k696l910m554m068l318l373l983m261m029l646l187k510j681
58640E14945p81J74R41J226J272J455J456P56j77l65J20L98M41R57J612J155l88
58623E25197j409j119n78p03q71l21M85Q39Q87R87J055J232K012L207L859L725
58607E38484L616L819L563K546J633J412J423J432J970K920L060J910O47L41N23
58592E69299L93J91M11Q18J130J639K453L220M128N851P894Q573P418O167O320
58577F25905P214P560P425P452P360O672N883N715O027O527P653R625J1597J2743
58563G35358J3460J4548J6013J7462J8800J9730J9509J7955J5831J3528J0547
58552I12741O901L774J892M46j372k972l494l262l073l047l188m101o093q444
$$ plain form
58538 886708 876306 864194 850424 835548 820437 805494 790878 777215 765117 754169 743428
58527 743428 732833 723205 715058 708319 702881 698420 694009 689075 684437 681264 679293 677286 674885 672666
58513 672666 670688 668462 666210 664659 663573 661961 659751 657902 656766 655681 654297 652992 651856 650584
58499 650584 649511 649532 650807 652624 654564 656718 658880 660680 662380 664376 666234 667554 669420 673373 679167
58484 679167 685163 690741 696641 703194 710262 718820 730385 744443 758426 770726 781880 792403 801432
58471 801432 808180 812858 815351 814806 811382 806846 802469 797786 792236 786647 782209 779276 777916 778421 780539
58456 780539 783392 786801 791575 797964 805088 812319 819872 827482 833921 838399 841154 842146 840572 836273
58442 836273 830254 823306 815528 807698 801443 797265 793830 789974 786090 782896 780342 778506 778167 779576
$$ packed form
58538H86708j0402j2112j3770j4876j5111j4943j4616j3663j2098j0948j0741
58527G43428j0595r628q147o739n438m461m411m934m638l173j971k007k401k219
58513F72666j978k226k252j551j086j612k210j849j136j085j384j305j136j272
58499F50584j073K1J275J817J940K154K162J800J700J996J858J320J866L953N794
58484F79167N996N578N900O553P068Q558J1565J4058J3983J2300J1154J0523R029
58471H01432O748M678K493n45l424m536m377m683n550n589m438k933j360N05K118
58456G80539K853L409M774O389P124P231P553P610O439M478K755R92j574m299
58442H36273o019o948p778p830o255m178l435l856l884l194k554j836l39J409
$$ plain form
58428 779576 781883 784487 787733 791786 796210 801167 807461 814687 820915 824970 827562 829418 829919 828476
58414 828476 825742 822498 818694 814456 810606 807352 803880 800051 797003 795180 793311 790307 786781 783763
58400 783763 781373 779696 779500 780984 783120 785192 787713 791079 794732 798480 803057 808408 812942 815532
58386 815532 816906 818170 819427 820735 822877 826113 829640 833196 837745 843624 849578 854598 859286 864527
58372 864527 870323 876745 884372 892898 900964 908214 915792 924117 932172 939813 948529 958804 968960 977936
58358 977936 987027 997436 1008269 1018456 1028461 1038441 1046803 1052456 1056662 1060935 1064954 1068235 1071917
58345 1071917 1076993 1082523 1087465 1092670 1099313 1106963 1114901 1123722 1134076 1145478 1157803 1172059 1188162
58332 1188162 1204013 1218405 1232752 1248290 1263813 1278038 1291888 1306348 1320257 1332351 1343403
$$ packed form
58428G79576K307K604L246M053M424M957O294P226O228M055K592J856N01j443
58414H28476k734l244l804m238l850l254l472l829l048j823j869l004l526l018
58400G83763k390j677j96J484K136K072K521L366L653L748M577N351M534K590
58386H15532J374J264J257J308K142L236L527L556M549N879N954N020M688N241
58372H64527N796O422P627Q526Q066P250P578Q325Q055P641Q716J0275J0156Q976
58358I77936R091J0409J0833J0187J0005R980Q362N653M206M273M019L281L682
58345A071917N076N530M942N205O643P650P938Q821J0354J1402J2325J4256J6103
58332A188162J5851J4392J4347J5538J5523J4225J3850J4460J3909J2094J1052
$$ plain form
58321 1343403 1354240 1363902 1372016 1380714 1391775 1403937 1415410 1426893 1439638 1452754 1465168 1478245
58309 1478245 1493754 1511030 1528692 1547221 1567324 1587827 1607812 1628803 1652116 1676086 1698653
58298 1698653 1720656 1743852 1767849 1791817 1816986 1844511 1873054 1901418 1931268 1964136 1998146
58287 1998146 2030997 2063876 2099023 2135817 2172897 2211830 2254747 2300347 2346071 2392369 2441241
58276 2441241 2492547 2545421 2601217 2661268 2723824 2786959 2852337 2922401 2996275 3072439 3152879
58265 3152879 3240262 3333465 3430356 3532592 3643105 3761332 3885619 4017790 4160396 4311878
58255 4311878 4469612 4635301 4812240 4999665 5195140 5399933 5616406 5842661 6075722
58246 6075722 6317836 6573869 6844957 7130539 7433841 7758768 8103725 8464887 8842993
$$ packed form
58321A343403J0837R662Q114Q698J1061J2162J1473J1483J2745J3116J2414J3077
58309A478245J5509J7276J7662J8529K0103K0503J9985K0991K3313K3970K2567
58298A698653K2003K3196K3997K3968K5169K7525K8543K8364K9850L2868L4010
58287A998146L2851L2879L5147L6794L7080L8933M2917M5600M5724M6298M8872
58276B441241N1306N2874N5796O0051O2556O3135O5378P0064P3874P6164Q0440
58265C152879Q7383R3203R6891J02236J10513J18227J24287J32171J42606J51482
58255D311878J57734J65689J76939J87425J95475K04793K16473K26255K33061
58246F075722K42114K56033K71088K85582L03302L24927L44957L61162L78106
$$ plain form
58237 8842993 9240518 9655233 10083751 10528465 10993493 11476670 11973512 12486372 13021690
58228 13021690 13581294 14165084 14779314 15432925 16128094 16863332 17642821 18472930 19352476
58219 19352476 20276421 21246051 22265393 23331872 24442615 25606427 26837034 28138168
58211 28138168 29508657 30958685 32507493 34170139 35963003 37918811 40079833 42481021
58203 42481021 45158552 48170561 51590138 55485303 59932426 65048932 70993187 77944539
58195 77944539 86117463 95788715 107271077 120858708 136824078 155430618 176849056
58188 176849056 201006313 227492592 255455972 283281355 308229490 326688398 335380615
58181 335380615 332858183 320123328 299947850 275578372 249763501 224407303 200601423
$$ packed form
58237H842993L97525M14715M28518M44714M65028M83177M96842N12860N35318
58228A3021690N59604N83790O14230O53611O95169P35238P79489Q30109Q79546
58219A9352476R23945R69630J019342J066479J110743J163812J230607J301134
58211B8138168J370489J450028J548808J662646J792864J955808K161022K401188
58203D2481021K677531L012009L419577L895165M447123N116506N944255O951352
58195G7944539Q172924R671252J1482362J3587631J5965370J8606540K1418438
58188A76849056K4157257K6486279K7963380K7825383K4948135J8458908Q692217
58181C35380615k522432j2734855k0175478k4369478k5814871k5356198k3805880
$$ plain form
58174 200601423 178795882 159046067 141261404 125340736 111189545 98713045 87822194
58167 87822194 78417858 70360210 63474408 57588549 52550447 48216850 44456163 41167870
58159 41167870 38281857 35736932 33474743 31452139 29640301 28008922 26525089 25167658
58151 25167658 23927895 22794458 21750369 20785000 19895659 19075596 18311947 17596708 16928703
58142 16928703 16303388 15711148 15147002 14612165 14104759 13618286 13150415 12704152 12278879
58133 12278879 11868894 11472342 11093451 10734426 10392749 10067746 9762070 9474954 9201040
58124 9201040 8937604 8686566 8448136 8218943 7997699 7786370 7584374 7387615 7194629
58115 7194629 7008027 6828758 6654611 6485435 6324157 6171331 6024056 5881483 5746057
$$ packed form
58174B00601423k1805541j9749815j7784663j5920668j4151191j2476500j0890851
58167H7822194r404336q057648o885802n885859n038102m333597l760687l288293
58159D1167870k886013k544925k262189k022604j811838j631379j483833j357431
58151B5167658j239763j133437j044089r65369q89341q20063p63649p15239o68005
58142A6928703o25315n92240n64146n34837n07406m86473m67871m46263m25273
58133A2278879m09985l96552l78891l59025l41677l25003l05676k87116k73914
58124I201040k63436k51038k38430k29193k21244k11329k01996j96759j92986
58115G194629j86602j79269j74147j69176j61278j52826j47275j42573j35426
$$ plain form
58106 5746057 5618022 5493887 5371709 5252934 5137718 5023354 4908872 4796610 4687781
58097 4687781 4580833 4475509 4374215 4278011 4185323 4095782 4011229 3931712 3854522 3778435 3705095
58086 3705095 3635064 3566446 3498626 3433542 3371934 3311876 3252205 3193904 3136997 3079661 3021607
58075 3021607 2965040 2911030 2858099 2805337 2753721 2703520 2653618 2604243 2557065 2511800 2466096
58064 2466096 2419636 2374973 2333353 2293119 2253198 2214730 2178083 2141654 2104943 2069643 2036381
58053 2036381 2003436 1969936 1937313 1906410 1876094 1845931 1817236 1790280 1763284 1735470 1708247
58042 1708247 1682238 1655990 1628809 1602038 1576292 1550232 1523249 1496566 1470612 1444189 1417379
58031 1417379 1392211 1369143 1345929 1321351 1297079 1274300 1251623 1228065 1205174 1184262 1164271
$$ packed form
58106E746057j28035j24135j22178j18775j15216j14364j14482j12262j08829
58097D687781j06948j05324j01294r6204r2688q9541q4553p9517p7190p6087p3340
58086C705095p0031o8618o7820o5084o1608o0058n9671n8301n6907n7336n8054
58075C021607n6567n4010n2931n2762n1616n0201m9902m9375m7178m5265m5704
58064B466096m6460m4663m1620m0234l9921l8468l6647l6429l6711l5300l3262
58053B036381l2945l3500l2623l0903l0316l0163k8695k6956k6996k7814k7223
58042A708247k6009k6248k7181k6771k5746k6060k6983k6683k5954k6423k6810
58031A417379k5168k3068k3214k4578k4272k2779k2677k3558k2891k0912j9991
$$ plain form
58020 1164271 1144305 1125604 1108996 1092991 1076493 1060970 1047779 1035645 1022944 1010355 999038
58009 999038 988149 976340 963941 951626 938695 924736 911289 899813 889461 878665 867418
57998 867418 856202 844356 831390 818451 806588 794920 782246 769096 756464 743988 731208
57987 731208 719244 709361 700977 692801 684835 677641 670759 663501 656271 649639 643128 636244 629565 623440
57973 623440 616889 609186 601316 594415 588052 581531 575616 571312 568081 564880 561989 560215 559197 557931
57959 557931 556132 553804 550513 546353 542488 539385 535743 530542 524954 520562 516840 512120 506093 499685
57945 499685 493351 487214 482158 479079 477572 476752 476717 477820 479300 480169 480867 482564 485352 488509 491939
57930 491939 495890 499683 502068 502571 501399 498477 493646 487401 480362 472473 463584 454261 445176 436367
$$ packed form
58020A164271j9966j8701j6608j6005j6498j5523j3191j2134j2701j2589j1317
58009I99038j0889j1809j2399j2315j2931j3959j3447j1476j0352j0796j1247
57998H67418j1216j1846j2966j2939j1863j1668j2674j3150j2632j2476j2780
57987G31208j1964r883q384q176p966p194o882p258p230o632o511o884o679o125
57973F23440o551p703p870o901o363o521n915m304l231l201k891j774j018j266
57959E57931j799k328l291m160l865l103l642n201n588m392l722m720o027o408
57945D99685o334o137n056l079j507q20l5J103J480Q69O98J697K788L157L430
57930D91939L951L793K385N03j172k922m831o245p039p889q889r323r085q809
$$ plain form
57916 436367 427911 420492 414377 408685 402686 396965 392254 388083 383742 379715 376897 375063 373294 371279
57902 371279 369173 366894 364620 363185 362877 362562 361038 358517 355826 353082 350211 347784 346140 344592 342741
57887 342741 341639 342362 344212 345611 345965 345534 344448 343172 343007 344643 346960 348498 349268 349872 349930 348944
57871 348944 347709 347228 347070 346455 346051 346988 348861 350593 352527 355719 359749 363250 366242 369929 374376
57856 374376 378291 381005 382920 384118 384281 384011 384485 385634 386123 385221 383293 380530 376750 372517 368997
57841 368997 366467 364149 361514 358638 355487 352136 349452 348162 347429 345861 343711 342515 342671 343076 343278
57826 343278 344223 346525 349509 352413 355214 357808 359643 360632 361442 362517 363671 364728 365600 365689 364250 361427
57810 361427 357961 354014 349343 344431 340138 336259 331761 326475 321246 316368 311281 305981 301311 297535
$$ packed form
57916D36367q456p419o115n692n999n721m711m171m341m027k818j834j769k015
57902C71279k106k279k274j435l08l15j524k521k691k744k871k427j644j548j851
57887C42741j102P23J850J399L54m31j086j276j65J636K317J538P70O04N8r86
57871C48944j235m81j58o15m04R37J873J732J934L192M030L501K992L687M447
57856C74376L915K714J915J198J63k70M74J149M89r02j928k763l780m233l520
57841C68997k530k318k635k876l151l351k684j290p33j568k150j196J56M05K02
57826C43278R45K302K984K904K801K594J835R89Q10J075J154J057Q72Q9j439k823
57810C61427l466l947m671m912m293l879m498n286n229m878n087n300m670l776
$$ plain form
57796 297535 293933 290119 286604 283719 281153 278887 277421 276746 276164 275449 275161 275584 276356 277323 278696 280227
57780 280227 281406 282641 285017 288665 292546 296090 299749 303634 306948 309298 311316 313358 314744 314890
57766 314890 314193 313186 311753 309732 307386 304730 301258 296913 292554 288961 285992 283082 279867 276126
57752 276126 271955 268276 266317 266320 267503 269292 271609 273953 275533 276592 278338 281148 284101 286754 289995
57737 289995 294408 299075 302884 306014 309207 312478 315420 317986 320150 321486 321887 322027 322454 322838 322774 322555
57721 322555 322498 322202 321271 320029 318803 317169 314813 312517 311309 311022 310542 309234 307374 305359 303253 301041
57705 301041 298809 296607 294482 292528 290799 289391 288632 288793 289593 290547 291856 294223 297584 300805 303019
57690 303019 304545 306022 307437 308557 309682 311237 313044 314654 316111 317860 320166 323093 326797 331370
$$ packed form
57796B97535l602l814l515k885k566k266j466o75n82p15k88M23P72R67J373J531
57780B80227J179J235K376L648L881L544L659L885L314K350K018K042J386J46
57766C14890o97j007j433k021k346k656l472m345m359l593k969k910l215l741
57752B76126m171l679j959LJ183J789K317K344J580J059J746K810K953K653L241
57737B89995M413M667L809L130L193L271K942K566K164J336M01J40M27L84o4k19
57721C22555n7k96r31j242j226j634k356k296j208k87m80j308j860k015k106k212
57705C01041k232k202k125j954j729j408p59J61Q00R54J309K367L361L221K214
57690C03019J526J477J415J120J125J555J807J610J457J749K306K927L704M573
$$ plain form
57676 331370 336581 342087 347947 354869 364180 377388 395226 417000 441346 467686 496364 527120
57664 527120 557815 584744 603843 611907 607697 592485 569224 541025 510489 479950 451221 424938
57652 424938 400880 379093 360054 343763 329559 316997 306188 297194 289878 284322 280511 277567
57640 277567 274316 270683 267576 265351 263526 262064 261632 262266 262994 263174 263051 262665 261481 259546 257689 256117
57624 256117 254126 251717 250022 249355 248345 245977 243146 241113 239708 238214 236864 236151 235667 234922 234419
57609 234419 234656 234963 234604 234217 234760 235758 236017 235450 234720 233609 231273 227926 224878 222960 221964 221443 220968
57592 220968 219864 217789 215430 213659 212267 210502 208490 207022 206201 205440 204627 204126 203709 202609 200677
57577 200677 198564 196797 195539 195092 195637 196501 196673 196010 195074 193843 191647 188475 185323 183027 181518 180379
$$ packed form
57676C31370N211N506N860O922R311J3208J7838K1774K4346K6340K8678L0756
57664E27120L0695K6929J9099Q064m210j5212k3261k8199l0536l0539k8729k6283
57652D24938k4058k1787j9039j6291j4204j2562j0809q994p316n556l811k944
57640B77567l251l633l107k225j825j462m32O34P28J80j23l86j184j935j857j572
57624B56117j991k409j695o67j010k368k831k033j405j494j350p13m84p45n03
57609B34419K37L07l59l87N43R98K59n67p30j111k336l347l048j918r96n21m75
57592B20968j104k075k359j771j392j765k012j468q21p61q13n01m17j100j932
57577B00677k113j767j258m47N45Q64J72o63r36j231k196l172l152k296j509j139
$$ plain form
57561 180379 179426 178577 177840 177532 177923 178616 178895 178675 178480 178521 178499 178313 178330 178874 180036 181878 184204 186215
57543 186215 187103 187057 187041 187598 188480 189380 190382 191585 192873 194136 195248 195872 195743 195081 194259 193188 191598
57526 191598 189702 188031 186711 185568 184845 185115 186418 188046 189319 190174 190988 192106 193536 194860 195719
57511 195719 196482 197974 200232 202181 203071 203534 204487 205673 206228 206182 206286 206721 207047 207244 207725 208337 208361 207581
57493 207581 206558 205840 205575 205776 206205 206222 205538 204903 205179 206054 206659 207127 208269 209829 210430 209537 208282 207999
57475 207999 208893 210444 212126 213393 213832 213803 214171 215151 216087 216574 216961 217505 217860 217768 217501 217284 216920 216313
57457 216313 215750 215411 215139 214916 214981 215413 216097 217109 218475 219675 220223 220658 221948 223974 225705 227007 228961
57440 228961 232015 235111 237308 239164 241654 244653 247342 249410 250972 251939 252381 253075 254824 257399 259833
$$ packed form
57561A80379r53q49p37l08L91O93K79k20j95M1k2j86J7N44J162J842K326K011
57543A86215Q88m6j6N57Q82R00J002J203J288J263J112O24j29o62q22j071j590
57526A91598j896j671j320j143p23K70J303J628J273Q55Q14J118J430J324Q59
57511A95719P63J492K258J949Q90M63R53J186N55m6J04M35L26J97M81O12K4p80
57493B07581j023p18k65K01M29J7o84o35K76Q75O05M68J142J560O01q93j255k83
57475B07999Q94J551J682J267M39k9L68R80R36M87L87N44L55r2k67k17l64o07
57457B16313n63l39k72k23O5M32O84J012J366J200N48M35J290K026J731J302J954
57440B28961L054L096K197J856K490K999K689K068J562R67M42O94J749K575K434
$$ plain form
57425 259833 261583 262932 264474 266644 269525 272657 275235 276875 278080 279766 282481 286205 290548 294955
57411 294955 298994 302611 305913 308805 311251 313783 317082 320984 324586 327464 330117 332995 335820 338205
57397 338205 340306 342469 344798 347432 350764 354934 359509 363932 367949 371473 374536 377569 381142 385214
57383 385214 389218 393093 397560 403037 408916 414329 419113 423572 427762 431528 434927 438268 441920 446177
57369 446177 450974 455657 459545 462763 466055 469743 473536 477335 481413 485690 489701 493577 498189 503964
57355 503964 510328 516688 523117 529684 535945 541644 547173 552855 558493 564114 570246 576897 583067 588029
57341 588029 592395 597173 602428 607638 612734 617991 623357 628673 634130 639875 645616 651223 657212 663983
57327 663983 671096 677961 684667 691462 698049 704209 710533 717583 724889 731740 738531 746236 754837 763357
$$ packed form
57425B59833J750J349J542K170K881L132K578J640J205J686K715L724M343M407
57411B94955M039L617L302K892K446K532L299L902L602K878K653K878K825K385
57397C38205K101K163K329K634L332M170M575M423M017L524L063L033L573M072
57383C85214M004L875M467N477N879N413M784M459M190L766L399L341L652M257
57369D46177M797M683L888L218L292L688L793L799M078M277M011L876M612N775
57355E03964O364O360O429O567O261N699N529N682N638N621O132O651O170M962
57341E88029M366M778N255N210N096N257N366N316N457N745N741N607N989O771
57327F63983P113O865O706O795O587O160O324P050P306O851O791P705Q601Q520
$$ plain form
57313 763357 771328 779197 787335 795643 804223 813566 823808 834488 845173 855730 865937 875487 884596
57300 884596 894038 904301 915030 925493 935404 945256 955947 967969 980872 993707 1006045 1018090
57288 1018090 1029702 1040054 1048777 1056797 1065388 1074867 1084881 1095438 1106733 1118285 1129213 1139352
57276 1139352 1149377 1159887 1171037 1182967 1195865 1209640 1224154 1239761 1256994 1275780 1295611
57265 1295611 1316403 1338484 1361671 1385147 1408445 1431974 1456316 1481488 1507151 1533155 1559603
57254 1559603 1586521 1613631 1640348 1666111 1690898 1715360 1740241 1765834 1792206 1819581 1848106
57243 1848106 1877474 1907249 1937478 1968574 2000777 2034151 2068969 2105551 2143677 2182628 2221931
57232 2221931 2261843 2303057 2346067 2390867 2437146 2484854 2534508 2586732 2641583 2698714 2758092
$$ packed form
57313G63357P971P869Q138Q308Q580R343J0242J0680J0685J0557J0207R550R109
57300H84596R442J0263J0729J0463R911R852J0691J2022J2903J2835J2338J2045
57288A018090J1612J0352Q723Q020Q591R479J0014J0557J1295J1552J0928J0139
57276A139352J0025J0510J1150J1930J2898J3775J4514J5607J7233J8786J9831
57265A295611K0792K2081K3187K3476K3298K3529K4342K5172K5663K6004K6448
57254A559603K6918K7110K6717K5763K4787K4462K4881K5593K6372K7375K8525
57243A848106K9368K9775L0229L1096L2203L3374L4818L6582L8126L8951L9303
57232B221931L9912M1214M3010M4800M6279M7708M9654N2224N4851N7131N9378
$$ plain form
57221 2758092 2819926 2883817 2948709 3014004 3079986 3146750 3213466 3279287 3344307 3409030 3473559
57210 3473559 3538072 3603460 3670592 3739249 3808599 3878437 3949269 4021464 4094935 4169360 4244144
57199 4244144 4318638 4393060 4468744 4546802 4626983 4708502 4791327 4875736 4961160 5046570 5131593
57188 5131593 5216145 5299270 5379533 5456508 5530849 5602969 5672610 5739567 5803906 5865514 5924458
57177 5924458 5981776 6038995 6096888 6155517 6215348 6277334 6341918 6408900 6478311 6550524 6625516
57166 6625516 6702882 6782578 6864898 6949886 7037572 7128552 7223509 7322531 7425912 7535189 7652236
57155 7652236 7777780 7912153 8056966 8214101 8382956 8560466 8744135 8933462 9128051
57146 9128051 9325977 9524523 9721030 9912475 10095792 10269573 10434490 10591799 10742729
$$ packed form
57221B758092O1834O3891O4892O5295O5982O6764O6716O5821O5020O4723O4529
57210C473559O4513O5388O7132O8657O9350O9838P0832P2195P3471P4425P4784
57199D244144P4494P4422P5684P8058Q0181Q1519Q2825Q4409Q5424Q5410Q5023
57188E131593Q4552Q3125Q0263P6975P4341P2120O9641O6957O4339O1608N8944
57177E924458N7318N7219N7893N8629N9831O1986O4584O6982O9411P2213P4992
57166F625516P7366P9696Q2320Q4988Q7686R0980R4957R9022J03381J09277J17047
57155G652236J25544J34373J44813J57135J68855J77510J83669J89327J94589
57146I128051J97926J98546J96507J91445J83317J73781J64917J57309J50930
$$ plain form
57137 10742729 10889518 11034947 11179539 11320233 11452605 11573245 11679523 11768834 11839493 11891360
57127 11891360 11924585 11938711 11933880 11911881 11875201 11826107 11767404 11702610 11634096 11561811 11484502
57116 11484502 11400919 11309139 11206591 11092423 10968847 10838913 10703885 10563596 10417646 10264866
57106 10264866 10103414 9933634 9760118 9589560 9427786 9280297 9153935 9055696 8990901 8964700
57096 8964700 8984673 9060530 9202918 9424635 9741089 10166259 10708293 11370137 12152067 13051891
57086 13051891 14067181 15202146 16467741 17865679 19370537 20930544 22479643 23936289
57078 23936289 25194048 26139436 26703110 26894758 26778345 26414787 25835871 25065707 24145706
57069 24145706 23127870 22052631 20942658 19813380 18680829 17561349 16472154 15434347
$$ packed form
57137A0742729J46789J45429J44592J40694J32372J20640J06278Q9311P0659N1867
57127A1891360L3225J4126m831k1999l6680m9094n8703o4794o8514p2285p7309
57116A1484502q3583r1780j02548j14168j23576j29934j35028j40289j45950j52780
57106A0264866j61452j69780j73516j70558j61774j47489j26362r8239o4795k6201
57096H964700J9973P5857J42388K21717L16454M25170N42034O61844P81930Q99824
57086A3051891J015290J134965J265595J397938J504858J560007J549099J456646
57078B3936289J257759R45388N63674J91648j16413l63558n78916p70164r20001
57069B4145706j017836j075239j109973j129278j132551j119480j089195j037807
$$ plain form
57061 15434347 14471389 13602880 12841041 12191625 11654273 11221390 10879810 10615500 10416537
57052 10416537 10272832 10175784 10118903 10097046 10104435 10134550 10182171 10244230 10318629 10403730 10499295
57041 10499295 10606330 10724961 10852971 10986604 11121908 11255245 11383885 11506992 11625607
57032 11625607 11741341 11855495 11969159 12082909 12195920 12306236 12412368 12513918 12610568
57023 12610568 12701660 12787479 12870189 12952804 13037711 13126425 13219753 13317325 13417427 13517932 13617069
57012 13617069 13713117 13804345 13890175 13972002 14052217 14132758 14214947 14300025 14389034 14482505 14580762
57001 14580762 14683918 14790901 14898997 15005111 15107135 15203660 15293295 15375539 15452033 15525793
56991 15525793 15599166 15673244 15748864 15826909 15907428 15989418 16071794 16153884 16234730 16312617 16385727
$$ packed form
57061A5434347r62958q68509p61839o49416n37352m32883l41580k64310j98963
57052A0416537j43705r7048n6881k1857P389L0115M7621O2059P4399Q5101R5565
57041A0499295J07035J18631J28010J33633J35304J33337J28640J23107J18615
57032A1625607J15734J14154J13664J13750J13011J10316J06132J01550R6650
57023A2610568R1092Q5819Q2710Q2615Q4907Q8714R3328R7572J00102J00505R9137
57012A3617069R6048R1228Q5830Q1827Q0215Q0541Q2189Q5078Q9009R3471R8257
57001A4580762J03156J06983J08096J06114J02024R6525Q9635Q2244P6494P3760
56991A5525793P3373P4078P5620P8045Q0519Q1990Q2376Q2090Q0846P7887P3110
$$ plain form
56980 16385727 16452962 16514100 16569704 16621100 16670008 16717865 16765467 16813026 16860147 16905933 16949669
56969 16949669 16991553 17032467 17073099 17113536 17153410 17191921 17227950 17260804 17290918 17319420 17347064
56958 17347064 17373979 17400192 17425697 17449974 17471934 17490399 17504347 17513051 17516639 17516471 17514359 17511419
56946 17511419 17508081 17504942 17502937 17502638 17503893 17505958 17507499 17506727 17502226 17493441 17479727 17459339 17430416
56933 17430416 17392886 17348499 17298954 17244779 17185816 17121551 17050785 16972155 16885640 16793040 16696792
56922 16696792 16598901 16501005 16404547 16310494 16219474 16132289 16049619 15971325 15896823 15826065 15759181
56911 15759181 15695275 15632798 15571228 15511122 15452259 15393050 15332121 15269098 15203326 15133324 15058323
56900 15058323 14979058 14896055 14808421 14715423 14618189 14518561 14417217 14314335 14211434 14111015
$$ packed form
56980A6385727O7235O1138N5604N1396M8908M7857M7602M7559M7121M5786M3736
56969A6949669M1884M0914M0632M0437L9874L8511L6029L2854L0114K8502K7644
56958A7347064K6915K6213K5505K4277K1960J8465J3948Q704L588j68k112k940
56946A7511419l338l139k005k99J255K065J541p72m501q785j3714k0388k8923
56933A7430416l7530m4387m9545n4175n8963o4265p0766p8630q6515r2600r6248
56922A6696792r7891r7896r6458r4053r1020q7185q2670p8294p4502p0758o6884
56911A5759181o3906o2477o1570o0106n8863n9209o0929o3023o5772p0002p5001
56900A5058323p9265q3003q7634r2998r7234r9628j01344j02882j02901j00419
$$ plain form
56890 14111015 14014586 13922066 13832747 13745651 13659064 13570725 13478463 13380061 13273094 13156194 13030523
56879 13030523 12899245 12765560 12631836 12500081 12371956 12248020 12127681 12010137 11895049
56870 11895049 11782516 11673133 11568074 11468608 11375519 11289289 11210525 11139606 11076040 11018626
56860 11018626 10966079 10917040 10869634 10821236 10768401 10707059 10633952 10548905 10455235 10357095 10256743
56849 10256743 10154796 10052064 9949662 9847741 9745607 9643233 9541650 9441875 9344519 9250532
56839 9250532 9161178 9076977 8997584 8922964 8853827 8790563 8732264 8676630 8619683 8555261 8476193
56828 8476193 8377452 8258552 8123032 7976269 7823794 7670453 7519781 7373744 7233143 7098104
56818 7098104 6968226 6842979 6722549 6608157 6501225 6402367 6311415 6228129 6152513 6084469
$$ packed form
56890A4111015r6429r2520q9319q7096q6587q8339r2262r8402j06967j16900j25671
56879A3030523j31278j33685j33724j31755j28125j23936j20339j17544j15088
56870A1895049j12533j09383j05059r9466r3089q6230p8764p0919o3566n7414
56860A1018626n2547m9039m7406m8398n2835o1342p3107q5047r3670r8140j00352
56849A0256743j01947j02732j02402j01921j02134j02374j01583r9775r7356r3987
56839I250532q9354q4201p9393p4620o9137o3264n8299n5634n6947o4422p9068
56828H476193r8741j18900j35520j46763j52475j53341j50672j46037j40601j35039
56818G098104j29878j25247j20430j14392j06932r8858r0952q3286p5616o8044
$$ plain form
56808 6084469 6023382 5967927 5915845 5863559 5806075 5737758 5654102 5553599 5438350 5312948 5182615
56797 5182615 5051810 4923652 4799795 4680580 4565381 4453052 4342554 4233794 4127962
56788 4127962 4026597 3930200 3838226 3750556 3668287 3592598 3523429 3459754 3400503 3344293 3288469
56777 3288469 3229353 3163865 3090868 3011277 2927350 2841695 2756363 2672614 2591431 2513781 2440128
56766 2440128 2370169 2303574 2240626 2181726 2126593 2074428 2024487 1975960 1927686 1878731 1829154
56755 1829154 1779639 1730555 1681835 1633619 1586471 1541058 1497977 1457567 1419534 1383089 1347887
56744 1347887 1314395 1282832 1252310 1221697 1190943 1160845 1131924 1104270 1077997 1052925 1028138
56733 1028138 1002879 977676 953617 930685 907829 884614 861780 840051 819367 799455 780291
$$ packed form
56808F084469o1087n5455n2082n2286n7484o8317q3656j00503j15249j25402j30333
56797E182615j30805j28158j23857j19215j15199j12329j10498j08760j05832
56788D127962j01365r6397r1974q7670q2269p5689o9169o3675n9251n6210n5824
56777C288469n9116o5488p2997p9591q3927q5655q5332q3749q1183p7650p3653
56766B440128o9959o6595o2948n8900n5133n2165m9941m8527m8274m8955m9577
56755A829154m9515m9084m8720m8216m7148m5413m3081m0410l8033l6445l5202
56744A347887l3492l1563l0522l0613l0754l0098k8921k7654k6273k5072k4787
56733A028138k5259k5203k4059k2932k2856k3215k2834k1729k0684j9912j9164
$$ plain form
56722 780291 761832 744012 727194 711851 697735 684043 670560 657790 645759 633426 619655
56711 619655 604269 587978 571809 556657 542776 529514 516040 502382 489241 476912 465084
56700 465084 453794 443691 435095 427412 419814 412058 404456 397463 391404 386176 381189 375956 370632 365505
56686 365505 360236 354316 348087 342470 337674 332971 327770 322127 316170 309879 303649 298253 293920 290070
56672 290070 286135 282100 278202 274678 271796 269392 266472 262151 257048 252827 250202 248283 245997 243116
56658 243116 239706 235746 231803 229056 227893 227227 225797 223425 220488 216944 212667 208140 204052 200541
56644 200541 197430 194809 192794 191014 188926 186568 184550 183348 182807 182227 180907 178859 176924 175900 175595
56629 175595 175191 174333 173284 172164 170872 169729 169268 169212 168535 166837 164832 163190 161744 160256 159044 158278
$$ packed form
56722G80291j8459j7820j6818j5343j4116j3692j3483j2770j2031j2333j3771
56711F19655j5386j6291j6169j5152j3881j3262j3474j3658j3141j2329j1828
56700D65084j1290j0103q596p683p598p756p602o993o059n228m987n233n324n127
56686C65505n269n920o229n617m796m703n201n643n957o291o230n396m333l850
56672B90070l935m035l898l524k882k404k920m321n103m221k625j919k286k881
56658B43116l410l960l943k747j163o66j430k372k937l544m277m527m088l511
56644B00541l111k621k015j780k088k358k018j202n41n80j320k048j935j024l05
56629A75595m04q58j049j120j292j143m61n6o77j698k005j642j446j488j212p66
$$ plain form
56613 158278 157373 155793 153907 152431 151450 150563 149634 148866 148365 147993 147469 146402 144576 142409 140808 140354
56597 140354 140915 142053 143434 144798 145948 146805 147137 146530 145219 144547 145651 147844 149386 149767 150035 150783
56581 150783 151268 150965 150675 151285 152490 153488 154163 154845 155661 156772 158501 160639 162338 163291 164248 165747 167219
56564 167219 168127 169224 171749 175869 180729 185587 190181 194331 197897 200885 203126 204242 204271 203869 203475
56549 203475 202846 201762 200538 199374 197870 195742 193462 191691 190627 190217 190260 189949 188225 185224 182463
56534 182463 180953 179986 178562 177020 176225 175924 175130 173737 172653 172494 173015 173647 173929 173610 172890 172360 172287
56517 172287 172341 172347 172664 173307 173459 172558 171244 170486 170350 170346 170407 170659 170725 170117 169013 167943 167034 166195 165598 165362
56497 165362 165192 164903 164759 164773 164309 163076 161826 161301 161136 160613 159894 159623 159851 160304 161168 162626 164052 164664
$$ packed form
56613A58278r05j580j886j476r81q87r29p68n01l72n24j067j826k167j601m54
56597A40354N61J138J381J364J150Q57L32o07j311o72J104K193J542L81K68P48
56581A50783M85l03k90O10J205R98O75O82Q16J111J729K138J699R53R57J499J472
56564A67219R08J097K525M120M860M858M594M150L566K988K241J116K9m02l94
56549B03475o29j084j224j164j504k128k280j771j064m10M3l11j724l001k761
56534A82463j510r67j424j542p95l01p94j393j084j59N21O32K82l19p20n30p3
56517A72287N4OL17O43J52r01j314p58j36mO1K52O6o08j104j070r09q39n97k36
56497A65362j70k89j44J4m64j233j250n25j65n23p19k71K28M53Q64J458J426O12
$$ plain form
56479 164664 164650 164811 165367 165959 166471 167015 167434 167609 167850 168243 168029 166528 164338 162794 162514 163223 164566 166240
56461 166240 167670 168418 168674 168736 168406 167648 167306 168248 170195 172203 173878 175302 176162 176010 175075 174029 173152
56444 173152 172452 172231 172773 173824 175019 176364 177674 178153 177381 176082 175147 174531 173950 173839 174528 175230 175062
56427 175062 174474 174447 174881 175074 175274 176316 178112 179852 181463 183543 186053 188353 190327 192262 193826 194396
56411 194396 194261 194280 194527 194420 194015 193970 194425 195049 195952 197317 198454 198577 198328 199106 200953 202503 203093 203551
56393 203551 204772 206785 209355 212268 214868 216437 217260 218335 219955 221508 222606 223349 223628 223332 223128
56378 223128 223853 225136 225824 225666 225366 225089 224270 222939 221833 221088 220080 218777 218008 218261 219356 221300
56362 221300 224193 227191 229015 229689 230496 231958 233217 233685 233975 234732 235731 236605 237468 238378 239065 239482 239841
$$ packed form
56479A64664j4J61N56N92N12N44M19J75K41L93k14j501k190j544k80P09J343J674
56461A66240J430P48K56O2l30p58l42R42J947K008J675J424Q60j52r35j046q77
56444A73152p00k21N42J051J195J345J310M79p72j299r35o16n81j11O89P02j68
56427A75062n88k7M34J93K00J042J796J740J611K080K510K300J974J935J564N70
56411A94396j35J9K47j07m05m5M55O24R03J365J137J23k49P78J847J550N90M58
56393B03551J221K013K570K913K600J569Q23J075J620J553J098P43K79k96k04
56378B23128P25J283O88j58l00k77q19j331j106p45j008j303p69K53J095J944
56362B21300K893K998J824O74Q07J462J259M68K90P57R99Q74Q63R10O87M17L59
$$ plain form
56345 239841 240054 240071 240624 242450 244854 246325 246657 247135 248547 250379 252187 254340 256999 259654 262059 264515
56329 264515 266900 268630 269828 271359 273428 275333 276859 278732 281330 284105 286552 288633 290074 290468
56315 290468 290291 290600 291504 292165 292447 293192 294719 296528 298729 302220 307061 312095 316657 321254 326178 330907
56299 330907 335399 340519 346600 352860 358785 364765 370946 376822 382478 388809 395979 403055 409695 416771
56285 416771 424791 433192 441818 451533 462599 473892 484549 495086 506150 517523 529186 542007
56273 542007 556459 571807 587351 603341 619983 636839 653952 672318 692502 713978 736460
56262 736460 760587 786562 813564 841357 871208 904373 940928 980965 1025624 1075970 1131932
56251 1131932 1193158 1259837 1332006 1409314 1492127 1581503 1677244 1777266 1879620 1983686 2088578
$$ packed form
56345B39841K13J7N53J826K404J471L32M78J412J832J808K153K659K655K405K456
56329B64515K385J730J198J531K069J905J526J873K598K775K447K081J441L94
56315B90468j77L09R04O61K82P45J527J809K201L491M841N034M562M597M924M729
56299C30907M492N120O081O260N925N980O181N876N656O331P170P076O640P076
56285D16771Q020Q401Q626R715J1066J1293J0657J0537J1064J1373J1663J2821
56273E42007J4452J5348J5544J5990J6642J6856J7113J8366K0184K1476K2482
56262G36460K4127K5975K7002K7793K9851L3165L6555M0037M4659N0346N5962
56251A131932O1226O6679P2169P7308Q2813Q9376R5741J00022J02354J04066J04892
$$ plain form
56240 2088578 2191914 2291192 2385003 2471810 2548815 2613169 2663249 2697930 2715984 2717165 2702661
56229 2702661 2673563 2630203 2573843 2507428 2433530 2352977 2266626 2177030 2086929 1997293 1908166
56218 1908166 1820366 1735097 1652935 1574318 1500085 1430557 1365168 1303816 1247297 1195584 1147150
56207 1147150 1101058 1058213 1019425 983785 950244 919291 891601 866434 842870 821446 803019
56196 803019 787074 772507 759017 746532 734418 722556 712058 703652 696509 689802 684063 679730
56184 679730 675765 671163 666594 663134 660584 658398 657030 656936 657480 658089 659197 660811 661735 661603 662027 664177
56168 664177 666892 668934 671363 675681 681199 686503 692120 699421 708018 716597 725401 735601 746971 758407
56154 758407 770136 783320 797994 813380 829809 848452 869496 892331 917266 945588 978193
$$ packed form
56240B088578J03336R9278R3811Q6807P7005O4354N0080L4681J8054J181j4504
56229B702661k9098m3360n6360o6415p3898q0553q6351q9596r0101q9636q9127
56218A908166q7800q5269q2162p8617p4233o9528o5389o1352n6519n1713m8434
56207A147150m6092m2845l8788l5640l3541l0953k7690k5167k3564k1424j8427
56196H03019j5945j4567j3490j2485j2114j1862j0498q406p143o707n739m333
56184F79730l965m602m569l460k550k186j368r4N44O09J108J614R24j32M24K150
56168F64177K715K042K429M318N518N304N617P301Q597Q579Q804J0200J1370J1436
56154G58407J1729J3184J4674J5386J6429J8643K1044K2835K4935K8322L2605
$$ plain form
56143 978193 1015338 1057276 1104086 1155566 1212084 1274429 1341763 1410993 1479177 1545121 1607502
56132 1607502 1663428 1710863 1751041 1786675 1819060 1848551 1876077 1901754 1923133 1937065 1942711
56121 1942711 1941214 1933679 1921248 1905769 1888224 1867200 1840394 1806573 1764904 1714317 1655511 1592070
56109 1592070 1527699 1463928 1402104 1345321 1295880 1252611 1213283 1178038 1148012 1122394 1099645
56098 1099645 1080087 1064568 1052015 1041074 1032681 1028193 1026395 1025157 1024618 1025889 1028165 1030200 1033182
56085 1033182 1038827 1045872 1051771 1056785 1063105 1070992 1079061 1087496 1097636 1109043 1120148 1131185 1143573
56072 1143573 1157157 1170921 1185456 1201797 1218864 1235080 1251448 1269924 1289853 1309201 1328239
56061 1328239 1348734 1370520 1392159 1413992 1437243 1461106 1483922 1506236 1529540 1553193 1575905
$$ packed form
56143I78193L7145M1938M6810N1480N6518O2345O7334O9230O8184O5944O2381
56132A607502N5926M7435M0178L5634L2385K9491K7526K5677K1379J3932N646
56121A942711j497p535j2431j5479j7545k1024k6806l3821m1669n0587n8806o3441
56109A592070o4371o3771o1824n6783m9441m3269l9328l5245l0026k5618k2749
56098A099645j9558j5519j2553j0941q393m488j798j238n39J271K276K035K982
56085A033182N645P045N899N014O320P887Q069Q435J0140J1407J1105J1037J2388
56072A143573J3584J3764J4535J6341J7067J6216J6368J8476J9929J9348J9038
56061A328239K0495K1786K1639K1833K3251K3863K2816K2314K3304K3653K2712
$$ plain form
56050 1575905 1598870 1624063 1650701 1676873 1703247 1731668 1761621 1791792 1823454 1858517 1895829
56039 1895829 1933338 1972091 2014051 2057881 2101338 2145924 2194493 2246174 2298505 2352698 2411575
56028 2411575 2474150 2537744 2603873 2676384 2755177 2837443 2923754 3017115 3117330 3222330 3333872
56017 3333872 3455852 3588045 3727530 3875009 4033425 4201747 4376725 4559572 4754050
56008 4754050 4959171 5170887 5390007 5621294 5865897 6122147 6392632 6682386 6990704
55999 6990704 7312592 7647522 7998830 8365619 8743960 9135205 9544150 9969680 10406508
55990 10406508 10855675 11324077 11814549 12326297 12864211 13437107 14047169 14691648 15374069
55981 15374069 16102255 16875966 17688450 18539371 19433742 20369621 21341412 22355093 23425443
$$ packed form
56050A575905K2965K5193K6638K6172K6374K8421K9953L0171L1662L5063L7312
56039A895829L7509L8753M1960M3830M3457M4586M8569N1681N2331N4193N8877
56028B411575O2575O3594O6129P2511P8793Q2266Q6311R3361J00215J05000J11542
56017C333872J21980J32193J39485J47479J58416J68322J74978J82847J94478
56008D754050K05121K11716K19120K31287K44603K56250K70485K89754L08318
55999F990704L21888L34930L51308L66789L78341L91245M08945M25530M36828
55990A0406508M49167M68402M90472N11748N37914N72896O10062O44479O82421
55981A5374069P28186P73711Q12484Q50921Q94371R35879R71791J013681J070350
$$ plain form
55972 23425443 24558598 25753026 27017391 28370674 29825395 31390160 33090216 34966600
55964 34966600 37054961 39386914 42013098 45001410 48412249 52304054 56769217 61941120
55956 61941120 67969855 75028929 83349926 93209477 104872811 118585321 134602587 153132352
55948 153132352 174180957 197446716 222245178 247247861 270106848 287568713 296521950
55941 296521950 295445652 285102918 267950659 246898028 224382963 202090735 181020795
55934 181020795 161626804 144002844 128094722 113827326 101121156 89888109 80048988
55927 80048988 71526474 64208128 57941274 52571644 47966466 44001707 40558662 37544994
55919 37544994 34899845 32571293 30505392 28660113 27010149 25530718 24191184 22968804
$$ packed form
55972B3425443J133155J194428J264365J353283J454721J564765J700056J876384
55964C4966600K088361K331953K626184K988312L410839L891805M465163N171903
55956F1941120O028735P059074Q320997R859551J1663334J3712510J6017266J8529765
55948A53132352K1048605K3265759K4798462K5002683K2858987J7461865Q953237
55941B96521950j076298j0342734j7152259k1052631k2515065k2292228k1069940
55934A81020795j9393991j7623960j5908122j4267396j2706170j1233047r839121
55927H0048988q522514p318346o266854n369630m605178l964759l443045l013668
55919C7544994k645149k328552k065901j845279j649964j479431j339534j222380
$$ plain form
55911 22968804 21853716 20835388 19897148 19027694 18224860 17483656 16792074 16142049 15533261
55902 15533261 14962724 14421502 13905073 13416737 12957323 12520833 12103052 11705282 11326766
55893 11326766 10962333 10610539 10275954 9960760 9661631 9376824 9108387 8855324 8612399
55884 8612399 8377832 8154624 7942336 7735168 7530409 7331473 7140386 6954448 6772559
55875 6772559 6597745 6430933 6268771 6109972 5957453 5812065 5670626 5532397 5401135
55866 5401135 5278258 5160044 5044038 4932293 4825766 4721284 4616744 4513980 4413955
55857 4413955 4314428 4214921 4118876 4028358 3941419 3856937 3777074 3702466 3629807 3556811 3485118
55846 3485118 3416009 3347811 3279906 3214764 3153421 3093211 3032501 2973537 2918099 2864357 2810565
$$ packed form
55911B2968804j115088j018328r38240q69454q02834p41204o91582o50025o08788
55902A5533261n70537n41222n16429m88336m59414m36490m17781l97770l78516
55893A1326766l64433l51794l34585l15194k99129k84807k68437k53063k42925
55884H612399k34567k23208k12288k07168k04759j98936j91087j85938j81889
55875F772559j74814j66812j62162j58799j52519j45388j41439j38229j31262
55866E401135j22877j18214j16006j11745j06527j04482j04540j02764j00025
55857D413955r9527r9507r6045r0518q6939q4482p9863p4608p2659p2996p1693
55846C485118o9109o8198o7905o5142o1343o0210o0710n8964n5438n3742n3792
$$ plain form
55835 2810565 2758014 2707845 2658534 2608986 2560637 2514293 2468337 2422181 2378035 2337119 2297465
55824 2297465 2257466 2218224 2180390 2142222 2102888 2064355 2027927 1992152 1956117 1921448 1889032
55813 1889032 1857116 1824863 1794454 1767430 1742059 1716532 1691696 1668477 1645727 1622854 1601474
55802 1601474 1582156 1562572 1541307 1520550 1502414 1485367 1466895 1447123 1427208 1406562 1384340
55791 1384340 1361634 1339764 1318232 1296445 1275471 1256106 1237185 1217661 1198274 1179438 1159777
55780 1159777 1138651 1117872 1098990 1081123 1063449 1047525 1035056 1025461 1017757 1012711 1010907 1010525
55768 1010525 1009002 1005104 997684 984696 965656 943200 920178 896923 873077 849881 828517 808201
55756 808201 788081 769226 752645 737214 721682 706902 693931 681715 668871 656134 644844
$$ packed form
55835B810565n2551n0169m9311m9548m8349m6344m5956m6156m4146m0916l9654
55824B297465l9999l9242l7834l8168l9334l8533l6428l5775l6035l4669l2416
55813A889032l1916l2253l0409k7024k5371k5527k4836k3219k2750k2873k1380
55802A601474j9318j9584k1265k0757j8136j7047j8472j9772j9915k0646k2222
55791A384340k2706k1870k1532k1787k0974j9365j8921j9524j9387j8836j9661
55780A159777k1126k0779j8882j7867j7674j5924j2469r595p704n046j804l82
55768A010525j523l898p420j2988j9040k2456k3022k3255k3846k3196k1364k0316
55756H08201k0120j8855j6581j5431j5532j4780j2971j2216j2844j2737j1290
$$ plain form
55745 644844 634553 624176 613958 604278 594169 583163 572994 565234 558701 551340 543169 535185 526899
55732 526899 517382 507546 499022 491760 484743 478000 471817 465151 456948 448092 440004 432335 424067 415926
55718 415926 409566 405110 401438 398175 395620 393507 391567 390585 391262 392796 394010 394820 395136 393568 389087
55703 389087 382871 376670 370335 362787 354416 346485 338966 330895 322290 314023 306418 299489 293849 289817
55689 289817 286387 282495 278463 274871 271145 266843 263164 261384 260769 259786 258424 257525 256845 255648 254313
55674 254313 253460 252288 249720 246387 243571 240942 237335 233174 230092 228495 227317 225825 224052 221908
55660 221908 219466 217667 217261 217626 217958 218767 220607 222308 222363 221226 220326 219576 217904 215628 214109 213406
55644 213406 212331 210569 208815 206981 204201 200506 196804 193238 189146 184447 179631 174713 169686 165503
$$ packed form
55745F44844j0291j0377j0218r680j0109j1006j0169p760o533p361q171p984q286
55732E26899r517r836q524p262p017o743o183o666q203q856q088p669q268q141
55718D15926o360m456l672l263k555k113j940r82O77J534J214Q10L16j568m481
55703C89087o216o201o335p548q371p931p519q071q605q267p605o929n640m032
55689B89817l430l892m032l592l726m302l679j780o15r83j362q99o80j197j335
55674B54313q53j172k568l333k816k629l607m161l082j597j178j492j773k144
55660B21908k442j799m06L65L32Q09J840J701N5j137r00p50j672k276j519p03
55644B13406j075j762j754j834k780l695l702l566m092m699m816m918n027m183
$$ plain form
55630 165503 162915 160772 157263 152480 148059 144666 141701 139147 137727 137274 136735 135806 134938 133928 132174
55615 132174 130170 128944 128111 126287 123442 121091 120005 119433 118640 117612 116124 113778 111135 109313 108337
55600 108337 107296 106178 105971 106829 107691 107896 107767 107436 106481 104926 103309 101689 99836 98321 97998 98427
55584 98427 98250 97152 96096 95653 95578 95944 97167 98824 99950 100525 101221 101800 101440 100642 100994 102820 104786
55567 104786 106075 107230 108525 109272 109253 109154 109004 107750 105002 101801 99010 96306 93293 90318 87622 84957
55551 84957 82554 81168 80698 80087 79098 78797 79707 80840 81281 81435 81911 82404 82532 82738 83512 84543 85325 85781
55533 85781 85822 85224 84496 84822 86508 88347 89107 88804 88019 86946 85735 84883 84529 83992 82617 80569 78459
55516 78459 76751 75735 75318 74660 72886 70351 68344 67367 66708 65892 65354 65261 64835 63495 61801 60691 60587
$$ packed form
55630A65503k588k143l509m783m421l393k965k554j420m53n39r29q68j010j754
55615A32174k004j226q33j824k845k351j086n72p93j028j488k346k643j822r76
55600A08337j041j118k07Q58Q62K05j29l31r55j555j617j620j853j515l23M29
55584I8427j77j098j056m43p5L66J223J657J126N75O96N79l60p98L52J826J966
55567A04786J289J155J295P47j9r9j50j254k748l201k791k704l013k975k696k665
55551H4957k403j386m70o11r89l01R10J133M41J54M76M93J28K06P74J031P82M56
55533H5781M1n98p28L26J686J839P60l03p85j073j211q52l54n37j375k048k110
55516G8459j708j016m17o58j774k535k007r77o59q16n38r3m26j340j694j110j04
$$ plain form
55499 60587 61604 63734 66331 68294 69301 70149 71518 73169 74616 75731 76294 75905 74777 73858 73789 74436
55483 74436 75581 77151 78579 79010 78463 77839 77519 76981 76045 75277 74887 74415 73873 73903 74373 74179 73049 72137
55465 72137 72105 72025 71048 69806 69136 68730 68213 68297 69480 70628 70429 69540 69718 71290 72955 73793 74028 73897
55447 73897 73132 71863 70956 71013 71664 72167 72249 72166 72268 72690 73290 73820 74147 74241 74036 73586 73195 72967 72393 71030
55427 71030 69519 69159 70381 72343 74088 75276 75767 75540 75323 76202 78141 79780 80197 79906 79643 79220 78305
55410 78305 77410 77210 77524 77727 77602 77180 76383 75462 75052 75119 74555 72610 70073 68222 67223 66415 65629 65234
55392 65234 65180 64937 64321 63744 63742 64695 66732 69400 71731 73045 73437 73237 72528 71557 70964 71020 71152 70794 70219
55373 70219 69993 70132 70435 71166 72725 74926 77159 78932 79846 79552 78357 77409 77641 78756 79769 80186 80171
$$ packed form
55499F0587J017K130K597J963J007Q48J369J651J447J115N63l89j128r19o9O47
55483G4436J145J570J428M31n47o24l20n38r36p68l90m72n42L0M70j94j130r12
55465G2137l2q0r77j242o70m06n17Q4J183J148j99q89J78J572J665Q38K35j31
55447G3897p65j269r07N7O51N03Q2q3J02M22O00N30L27R4k05m50l91k28n74j363
55427G1030j511l60J222J962J745J188M91k27k17Q79J939J639M17k91k63m23r15
55410G8305q95k00L14K03j25m22p97r21m10O7n64j945k537j851r99q08p86l95
55392F5234n4k43o16n77kR53K037K668K331J314L92k00p09r71n93N6J32l58n75
55373G0219k26J39L03P31J559K201K233J773R14k94j195r48K32J115J013M17j5
$$ plain form
55356 80171 79920 79470 78851 77977 76659 75081 73889 73430 73296 72955 72375 71653 70585 69048 67357 65772 64184
55339 64184 62661 61781 61928 62726 63653 64665 65779 66585 66729 66386 65813 65024 64303 64372 65432 66628 67053 66753
55321 66753 66233 65631 64990 64670 64797 64847 64435 63962 63840 63730 63245 62804 63002 63714 64541 65554 66773 67505 67094
55302 67094 65903 64706 63596 62280 61053 60612 61292 63109 65982 69176 71325 71953 72289 73480 74697
55287 74697 74326 72489 70925 70652 71203 72047 73258 74616 75389 75417 75348 75490 75346 74591 73654 73041 72811 72931
55269 72931 73424 73963 73982 73406 72696 72108 71585 71413 72203 73976 75845 76823 76550 75192 73225 71349 70076
55252 70076 69284 68561 67882 67502 67364 67235 67242 67568 67780 67259 66240 65626 65728 65980 65970 65930 66000 65822 65252 64875
55232 64875 65422 67016 69148 71068 72122 72156 71653 71191 70835 70443 70307 70859 71848 72542 72686 72644 72589 72327 71987
$$ packed form
55356H0171k51m50o19q74j318j578j192m59j34l41n80p22j068j537j691j585j588
55339F4184j523q80J47P98R27J012J114Q06J44l43n73p89p21O9J060J196M25l00
55321F6753n20o02o41l20J27N0m12m73j22j10m85m41J98P12Q27J013J219P32m11
55302F7094j191j197j110j316j227m41O80J817K873L194K149O28L36J191J217
55287G4697l71j837j564k73N51Q44J211J358P73K8o9J42j44p55r37o13k30J20
55269G2931M93N39J9n76p10n88n23j72P90J773J869R78k73j358j967j876j273
55252G0076p92p23o79l80j38j29PL26K12n21j019o14J02K52j0m0P0j78n70l77
55232F4875N47J594K132J920J054L4n03m62l56l92j36N52R89O94J44m2n5k62l40
$$ plain form
55213 71987 72069 72581 72837 72425 71811 71658 72077 72804 73637 74377 74688 74338 73422 72181 70824 69552 68558 67975
55195 67975 67985 68769 70081 71189 71683 72046 72908 74073 74936 75590 76603 77818 78275 77475 75913 74260 72813
55178 72813 71899 72008 73097 74463 75620 76737 77924 78723 78765 78410 78322 78759 79572 80493 81152 81229 80923 80876 81397
55159 81397 82085 82468 82548 82472 82116 81416 80758 80543 80606 80454 79961 79451 79192 79111 79074 79155 79547 80261 81005 81379 81198
55138 81198 80654 80186 80276 81185 82623 83703 83669 82819 82264 82578 83130 83091 82547 82055 81632 80857 79750 78817 78335
55119 78335 78186 78247 78354 78023 76899 75410 74383 74046 74011 74097 74553 75462 76588 77795 78990 79696 79394 78340
55101 78340 77444 77233 77614 78574 80340 82650 84593 85525 85648 85493 85353 85401 85862 86807 88106 89617 91060
55084 91060 91883 91833 91576 92053 93221 94120 94178 93715 93103 92281 91308 90583 90231 89949 89673 89687 89880 89730 89268 89237
$$ packed form
55213G1987Q2N12K56m12o14j53M19P27Q33P40L11l50r16j241j357j272r94n83
55195F7975J0P84J312J108M94L63Q62J165Q63O54J013J215M57q00j562j653j447
55178G2813r14J09J089J366J157J117J187P99M2l55q8M37Q13R21O59P7l06m7N21
55159H1397O88L83Q0p6l56p00o58k15O3j52m93n10k59q1l7Q1L92P14P44L74j81
55138H1198n44m68R0R09J438J080l4q50n55L14N52l9n44m92m23p75j107r33m82
55119G8335j49O1J07l31j124j489j027l37l5Q6M56R09J126J207J195P06l02j054
55101G8340q96k11L81R60J766K310J943R32J23j55j40M8M61R45J299J511J443
55084I1060Q23n0k57M77J168Q99N8m63o12q22r73p25l52k82k76J4J93j50m62l1
$$ plain form
55064 89237 89909 90582 90645 90334 89924 89050 87513 86103 85833 86784 88295 89830 91065 91653 91602 91528 91878 92255
55046 92255 92079 91576 91397 91536 91407 90861 90391 90293 90219 89795 89187 88826 88847 89045 89283 89727 90536 91362 91450 90472
55026 90472 89089 88292 88261 88277 87703 86530 85032 83517 82590 82933 84415 85910 86382 85796 84718 83553 82589
55009 82589 82295 82960 84218 85393 86243 87024 87918 88641 88630 87612 86144 85449 86339 88280 89884 90280 89614
54992 89614 88332 86734 85303 84715 85154 86240 87790 89905 92057 93034 92417 91395 91457 92803 94654 96443
54976 96443 97931 98695 98480 97833 97603 97936 98422 99011 100028 101400 102612 103428 104053 104560 104797 104916 105390 106316
54958 106316 107114 107140 106322 105112 104097 103739 104188 105142 105995 106204 105535 104126 102438 101072 100460 100652 101321
54941 101321 101858 101671 100780 100068 100499 101952 103334 103884 103798 103406 102496 100986 99655 99521 100852 103332 106750
$$ packed form
55064H9237O72O73O3l11m10q74j537j410k70R51J511J535J235N88n1p4L50L77
55046I2255j76n03j79J39j29n46m70r8p4m24o08l61K1J98K38M44Q09Q26Q8r78
55026I0472j383p97l1J6n74j173j498j515r27L43J482J495M72n86j078j165r64
55009H2589k94O65J258J175Q50P81Q94P23j1j018j468o95Q90J941J604L96o66
54992H9614j282j598j431n88M39J086J550K115K152R77o17j022O2J346J851J789
54976I6443J488P64k15o47k30L33M86N89J017J372J212Q16O25N07K37J19M74R26
54958A06316P98K6q18j210j015l58M49R54Q53K09o69j409j688j366o12J92O69
54941A01321N37j87q91p12M31J453J382N50q6l92r10j510j331j34J331K480L418
$$ plain form
54924 106750 110790 114474 116754 117759 118758 120711 123374 125975 128272 130634 133369 136303 138965 141004
54910 141004 142352 143019 142883 141844 140076 137884 135413 132865 130829 129759 129050 127422 124534 121561 119703
54895 119703 118775 117865 116727 115695 114699 113384 112082 111718 112615 114124 115551 116813 118006 118997 119746 120563
54879 120563 121703 122994 124162 125310 126889 129313 132696 136761 140880 144363 146800 148047 147921 146191
54865 146191 142982 139013 135228 132128 129507 126827 123921 121247 119387 118334 117474 116278 114780 113280
54851 113280 111821 110185 108294 106410 104897 103813 102745 101167 99112 97284 96323 96083 95995 95901 96047 96375
54835 96375 96461 96207 95972 95888 95618 94984 94276 93744 93322 93074 93285 93891 94450 94942 95887 97328 98483 98925 99335
54816 99335 100395 101587 101879 101138 100079 99250 98811 98947 99672 100410 100550 100276 100229 100551 100892 101126 101386 101540
$$ packed form
54924A06750M040L684K280J005R99J953K663K601K297K362K735K934K662K039
54910A41004J348O67j36j039j768k192k471k548k036j070p09j628k888k973j858
54895A19703r28r10j138j032r96j315j302l64Q97J509J427J262J193R91P49Q17
54879A20563J140J291J168J148J579K424L383M065M119L483K437J247j26j730
54865A46191l209l969l785l100k621k680k906k674j860j053q60j196j498j500
54851A13280j459j636j891j884j513j084j068j578k055j828r61k40q8r4J46L28
54835I6375Q6k54k35q4k70o34p08n32m22k48K11O06N59M92R45J441J155M42M10
54816I9335J060J192K92p41j059q29m39J36P25P38J40k74m7L22L41K34K60J54
$$ plain form
54798 101540 101356 101066 101141 101584 102022 102375 102827 103292 103542 103773 104339 105006 105132 104607 103995 103716 103720 104054 105130
54779 105130 107105 109370 110940 111314 110963 111046 112462 114997 117658 119930 122238 124926 127484 129340 130813
54764 130813 132618 134887 137414 140375 143936 147507 150319 152456 154375 155719 155630 154124 152040 149697 146648
54749 146648 142884 139190 136074 133259 130547 128288 126721 125620 124933 124983 125720 126416 126411 125613 124099 121992
54733 121992 119888 118630 118284 118085 117707 117881 119305 121621 123977 126106 128384 131202 134615 138270 141486
54718 141486 143779 145423 147050 148683 149724 149901 149458 148384 146308 143386 140378 137560 134494 131218 128655
54703 128655 127214 125986 124128 122255 121536 122024 122739 122897 122229 120561 118048 115581 114122 113714 113752 113941
54687 113941 114282 114437 113910 112717 111180 109230 106668 104058 102420 101937 101702 101015 100292 100373 101417 102824
$$ packed form
54798A01540j84k90P5M43M38L53M52M65K50K31N66O67J26n25o12k79ML34J076
54779A05130J975K265J570L74l51Q3J416K535K661K272K308K688K558J856J473
54764A30813J805K269K527K961L561L571K812K137J919J344q9j506k084k343l049
54749A46648l764l694l116k815k712k259j567j101o87N0P37O96np98j514k107
54733A21992k104j258l46j99l78J74J424K316K356K129K278K818L413L655L216
54718A41486K293J644J627J633J041J77m43j074k076k922l008k818l066l276k563
54703A28655j441j228j858j873p19M88P15J58o68j668k513k467j459m08L8J89
54687A13941L41J55n27j193j537j950k562k610j638m83k35o87p23Q1J044J407
$$ plain form
54671 102824 103919 104380 104221 103690 103126 102764 102684 102903 103401 104047 104670 105218 105690 105904 105532 104516 103371 102920
54653 102920 103579 104947 106199 106908 107271 107493 107345 106695 106161 106579 107815 108720 108439 107304 106225 105711 105808
54636 105808 106527 107822 109320 110438 110759 110174 108859 107250 105808 104666 103710 103049 103065 103805 104690 105071 104857
54619 104857 104434 104222 104476 105187 105956 106233 105846 105137 104483 103988 103664 103518 103393 103190 103288 104162 105437 106018 105463
54600 105463 104613 104438 104906 105462 105992 106655 107275 107607 107909 108576 109438 109995 110119 109967 109543 108920 108622 109015 109540
54581 109540 109325 108536 108358 109490 111217 112139 111495 109761 108348 108584 110556 112960 114501 115209 115922 116772
54565 116772 117000 116233 115033 113968 112899 111601 110441 109926 109995 110290 110839 111961 113585 115149 116191 116758
54549 116758 117163 117531 117678 117390 116722 116069 115939 116677 118274 120259 121829 122358 121969 121408 121192 121078 120579 119721
$$ packed form
54671A02824J095M61j59n31n64l62q0K19M98O46O23N48M72K14l72j016j145m51
54653A02920O59J368J252P09L63K22j48o50n34M18J236R05k81j135j079n14R7
54636A05808P19J295J498J118L21n85j315j609j442j142r56o61J6P40Q85L81k14
54619A04857m23k12K54P11P69K77l87p09o54m95l24j46j25k03R8Q74J275N81n55
54600A05463q50j75M68N56N30O63O20L32L02O67Q62N57J24j52m24o23k98L93N25
54581A09540k15p89j78J132J727R22o44j734j413K36J972K404J541P08P13Q50
54565A16772K28p67j200j065j069j298j160n15O9K95N49J122J624J564J042N67
54549A16758M05L68J47k88o68o53j30P38J597J985J570N29l89n61k16j14m99q58
$$ plain form
54531 119721 118948 118464 118028 117361 116385 115161 113962 113383 113923 115329 116672 117221 117003 116430 115718 114910 114210
54514 114210 113917 114024 114128 113873 113428 113388 114151 115457 116653 117412 118023 118895 119974 120778 120976 120751 120575 120630
54496 120630 120514 119667 118144 116734 116057 115853 115639 115810 117307 120070 122626 123608 123106 122091 121135 120316 119846
54479 119846 119960 120391 120706 121045 121892 123189 124303 124927 125421 126149 126971 127487 127431 126778 125889 125571 126506 128463
54461 128463 130418 131570 131885 131616 130759 129275 127564 126401 126375 127369 128541 128953 128422 127611 127132 126793 126092
54444 126092 125124 124429 124082 123588 122765 122110 122107 122625 123219 123605 123621 123138 122280 121442 120863 120424 119999 119748 119873 120370
54424 120370 121164 122204 123261 123940 124091 123951 123657 122924 121541 119986 119168 119566 120756 121771 121861 121054 120136
54407 120136 119943 120566 121374 121926 122633 124246 126792 129337 130876 131282 131236 131398 131935 132846 134348 136552 138907
$$ packed form
54531A19721p73m84m36o67r76j224j199n79N40J406J343N49k18n73p12q08p00
54514A14210k93J07J04k55m45m0P63J306J196P59O11Q72J079Q04J98k25j76N5
54496A20630j16q47j523j410o77k04k14J71J497K763K556R82n02j015r56q19m70
54479A19846J14M31L15L39Q47J297J114O24M94P28Q22N16n6o53q89l18R35J957
54461A28463J955J152L15k69q57j484j711j163k6R94J172M12n31q11m79l39p01
54444A26092r68o95l47m94q23o55lN18N94L86J6m83q58q38n79m39m25k51J25M97
54424A20370P94J040J057O79J51j40k94p33j383j555q18L98J190J015R0q07r18
54407A20136j93O23Q08N52P07J613K546K545J539M06m6J62N37R11J502K204K355
$$ plain form
54390 138907 140486 140966 140934 141012 141090 140734 139987 139294 138902 138758 138787 138799 138368 137409 136689 137104 138506 139961 141167
54371 141167 142789 145162 147530 149049 149922 150980 152584 154529 156635 158755 160361 160766 159869 158333 156935
54356 156935 155979 155308 154598 153636 152467 151286 150143 148880 147453 146118 145104 144267 143260 141951 140510
54341 140510 139184 138127 137358 136724 136026 135269 134676 134367 134209 134097 134132 134346 134497 134388 134201 134221 134416 134534 134513
54322 134513 134500 134565 134666 134809 134980 135002 134756 134485 134611 135193 135807 135942 135332 134025 132407 131157 130802 131223 131864
54303 131864 132501 133458 134882 136202 136685 136326 135737 135226 134464 133231 132114 132072 133406 135446 137274 138530
54287 138530 139442 140311 141108 141514 141247 140382 139388 138733 138432 138127 137712 137651 138380 139483 139923 139251 138323 138462 139964
54268 139964 141716 142376 141698 140560 139945 140168 141041 142244 143365 143998 144251 144884 146351 147823 147846 146148 144141
$$ packed form
54390A38907J579M80l2P8P8l56p47o93l92j44K9J2m31r59p20M15J402J455J206
54371A41167J622K373K368J519Q73J058J604J945K106K120J606M05q97j536j398
54356A56935r56o71p10r62j169j181j143j263j427j335j014q37j007j309j441
54341A40510j326j057p69o34o98p57n93l09j58j12L5K14J51j09j87K0J95J18k1
54322A34513j3O5J01J43J71K2k46k71J26N82O14J35o10j307j618j250l55M21O41
54303A31864O37R57J424J320M83l59n89n11p62j233j117m2J334K040J828J256
54287A38530R12Q69P97M06k67q65r94o55l01l05m15o1P29J103M40o72r28J39J502
54268A39964J752O60o78j138o15K23Q73J203J121O33K53O33J467J472K3j698k007
$$ plain form
54251 144141 143290 143527 143787 143559 143222 143123 143163 143273 143585 143935 143803 143029 142146 141765 141974 142584 143534 144691 145543
54232 145543 145554 144753 143695 142866 142328 141916 141609 141625 142192 143216 144222 144735 144731 144548 144391 144132 143614 142908 142187
54213 142187 141575 141216 141217 141410 141416 141107 140826 140947 141391 141766 141842 141656 141243 140555 139693 138988 138758 139013 139446 139657
54193 139657 139386 138603 137459 136276 135514 135584 136492 137728 138668 139123 139379 139689 139917 139760 139262 138936 139280 140153
54175 140153 140808 140731 140343 140546 141570 142646 143044 142913 142776 142591 141882 140601 139221 138072 137155 136651 136970
54158 136970 138147 139629 140871 141741 142225 142188 141701 141233 141234 141730 142479 143224 143591 143095 141536 139286 137036 135402
54140 135402 134786 135280 136546 137988 139258 140466 141860 143512 145288 146832 147635 147482 146894 146682 147028 147401
54124 147401 147399 147177 146954 146782 147002 148273 150742 153694 156437 159022 161697 164208 166267 168229 170619 173313
$$ packed form
54251A44141q51K37K60k28l37r9M0J10L12L50j32p74q83l81K09O10R50J157Q52
54232A45543J1q01j058q29n38m12l07J6N67J024J006N13mj83j57k59n18p06p21
54213A42187o12l59JJ93Ol09k81J21M44L75P6j86m13o88q62p05k30K55M33K11
54193A39657k71p83j144j183p62P0R08J236R40M55K56L10K28j57m98l26L44Q73
54175A40153O55p7l88K03J024J076L98j31j37j85p09j281j380j149r17n04L19
54158A36970J177J482J242Q70M84l7m87m68JM96P49P45L67m96j559k250k250j634
54140A35402o16M94J266J442J270J208J394J652J776J544Q03j53n88k12L46L73
54124A47401kk22k23j72K20J271K469K952K743K585K675K511K059J962K390K694
$$ plain form
54108 173313 175827 178253 181182 184785 188497 191609 193680 194453 193843 192062 189411 186047 182259 178747 176085
54093 176085 174032 171885 169451 167136 165162 163334 161674 160640 160406 160404 159962 159115 158509 158642 159439 160449
54077 160449 161283 161884 162438 163077 163725 164279 164727 164952 164675 163851 162969 162638 162992 163758 164764 165935 166897 167130
54059 167130 166670 166350 167061 168879 171019 172548 173170 173442 174197 175745 177689 179516 181062 182288 183049 183445
54043 183445 184053 185365 187254 189440 192199 196037 200894 206324 212238 218716 225167 230580 234778 238569
54029 238569 242380 245550 247428 248503 249799 251665 253748 255767 257605 258883 259126 258379 257168 255773 253945
54014 253945 251393 248275 245069 242101 239255 236122 232489 228758 225636 223329 221219 218554 215258 211929
54000 211929 209238 207526 206736 206381 205798 204735 203592 202766 201947 200504 198524 196975 196616 197085 197272 196470
$$ packed form
54108A73313K514K426K929L603L712L112K071P73o10j781k651l364l788l512k662
54093A76085k053k147k434k315j974j828j660j034k34km42q47o06J33P97J010
54077A60449Q34O01N54O39O48N54M48K25k77q24q82l31L54P66J006J171R62K33
54059A67130m60l20P11J818K140J529O22K72P55J548J944J827J546J226P61L96
54043A83445O08J312J889K186K759L838M857N430N914O478O451N413M198L791
54029B38569L811L170J878J075J296J866K083K019J838J278K43p47j211j395j828
54014B53945k552l118l206k968k846l133l633l731l122k307k110k665l296l329
54000B11929k691j712p90l55n83j063j143q26q19j443j980j549l59M69J87q02
$$ plain form
53984 196470 194976 193694 193261 193573 194047 194320 194613 195383 196768 198604 200844 203676 207200 211279 215791 220687
53968 220687 225521 229219 230758 230078 228030 225375 222165 218221 213932 210234 207851 206769 206392 206049 205433
53953 205433 204831 204893 205937 207426 208444 208772 209197 210548 212703 214844 216497 217981 219928 222686 226145
53938 226145 229836 233159 235864 238395 241501 245379 249386 252709 255090 256833 258386 260114 262270 264922
53924 264922 267911 271073 274409 277898 281277 284246 286978 290237 294876 301188 308675 316281 322865 327675
53910 327675 330671 332502 334037 335719 337277 338096 337853 336787 335400 334004 332635 331238 329783 328206 326345
53895 326345 324013 321126 317734 313886 309427 304077 297862 291425 285583 280576 275967 271401 267103 263384
53881 263384 259959 256218 252061 248039 244602 241544 238346 234859 231488 228780 226897 225449 223793 221561
$$ packed form
53984A96470j494j282m33L12M74K73K93P70J385J836K240K832L524M079M512M896
53968B20687M834L698J539o80k048k655l210l944m289l698k383j082l77l43o16
53953B05433o02O2J044J489J018L28M25J351K155K141J653J484J947K758L459
53938B26145L691L323K705K531L106L878M007L323K381J743J553J728K156K652
53924B64922K989L162L336L489L379K969K732L259M639O312P487P606O584M810
53910C27675K996J831J535J682J558Q19k43j066j387j396j369j397j455j577j861
53895C26345k332k887l392l848m459n350o215o437n842n007m609m566m298l719
53881B63384l425l741m157m022l437l058l198l487l371k708j883j448j656k232
$$ plain form
53867 221561 218845 215942 213100 210602 208784 207687 206862 205847 204728 203858 203122 201875 199748 197181 195116
53852 195116 194291 194775 195830 196234 195202 193208 191588 191153 191440 191491 191017 190526 190556 191160 192106 193207 194367
53835 194367 195480 196414 197102 197616 198116 198734 199494 200331 201076 201381 200913 199811 198788 198555 199184 200184 201038
53818 201038 201419 201147 200378 199775 200038 201253 203029 205155 207617 210081 212024 213521 215293 217760 220678
53803 220678 223914 227879 232704 237643 241908 245576 248972 251648 252911 253202 254020 256309 259554 262623 264882
53788 264882 266252 266820 266825 266719 266832 267114 267365 267462 267122 265706 262691 258355 253747 249872 246907 244213 241046
53771 241046 237265 233391 230045 227416 225321 223608 222279 221215 220027 218310 216029 213564 211393 209746
53757 209746 208543 207577 206732 205963 205233 204635 204460 204854 205316 204944 203411 201443 200006 199249 198585 197727 197116
$$ packed form
53867B21561k716k903k842k498j818j097q25j015j119q70p36j247k127k567k065
53852A95116q25M84J055M04j032j994j620m35K87N1m74m91L0O04R46J101J160
53835A94367J113R34O88N14N00O18P60Q37P45L05m68j102j023k33O29J000Q54
53818B01038L81k72p69o03K63J215J776K126K462K464J943J497J772K467K918
53803B20678L236L965M825M939M265L668L396K676J263K91Q18K289L245L069K259
53788B64882J370N68Nj06J13K82K51R7l40j416l015m336m608l875k965k694l167
53771B41046l781l874l346k629k095j713j329j064j188j717k281k465k171j647
53757B09746j203r66q45p69p30n98j75L94M62l72j533j968j437p57o64q58o11
$$ plain form
53740 197116 197256 197993 198726 199130 199411 199909 200625 201234 201547 201814 202441 203444 204365 204847 205049 205342 205850 206538
53722 206538 207584 209266 211536 214019 216426 218636 220383 221268 221240 220820 220688 221261 222704 225091 228272 231801
53706 231801 235241 238423 241314 243765 245627 247023 248335 249923 251976 254572 257659 260929 263869 266097
53692 266097 267706 269247 271290 273912 276585 278584 279473 279277 278292 276889 275365 273889 272569 271651 271435
53677 271435 271827 272187 271975 271467 271403 271934 272422 272423 272336 272710 273362 273758 274008 274778 276202 277468 277739 277050 276072
53658 276072 275345 275055 275262 275848 276380 276446 276192 276178 276608 277033 277015 276797 276999 277792 278766 279683 281013 283395 286707
53639 286707 290020 292595 294716 297296 300700 304246 306986 308797 310401 312357 314426 316071 317301 318644
53625 318644 320419 322428 324369 326162 327737 328820 329256 329397 329910 331238 333380 336070 339011 342105 345673
$$ packed form
53740A97116J40P37P33M04K81M98P16O09L13K67O27J003R21M82K02K93N08O88
53722B06538J046J682K270K483K407K210J747Q85k8m20j32N73J443K387L181L529
53706B31801L440L182K891K451J862J396J312J588K053K596L087L270K940K228
53692B66097J609J541K043K622K673J999Q89j96r85j403j524j476j320r18k16
53677B71435L92L60k12n08o4N31M88Jq7L74O52L96K50P70J424J266K71o89r78
53658B76072p27k90K07N86N32O6k54j4M30M25j8k18K02P93R74R17J330K382L312
53639B86707L313K575K121K580L404L546K740J811J604J956K069J645J230J343
53625C18644J775K009J941J793J575J083M36J41N13J328K142K690K941L094L568
$$ plain form
53610 345673 350232 355683 360849 364368 366150 367498 369552 372033 373920 374972 375991 377569 379195 379876
53596 379876 379348 378355 377799 377875 378085 377948 377505 377061 376535 375347 373097 370192 367522 365598 364332 363613 363579
53579 363579 364067 364263 363395 361654 359954 358856 358125 357326 356300 354986 353356 351850 351372 352294 353750 354462
53563 354462 354164 353692 353759 354243 354773 355435 356534 358007 359429 360402 360751 360588 360456 361111 362841 365120 367199
53546 367199 368862 370323 371732 373250 375453 378995 383750 388797 393424 397760 402230 406848 411447 416267
53532 416267 421791 428111 434855 441714 448755 456269 464587 473951 484161 494360 503628 512027 520756 531035
53518 531035 543037 556055 569397 582836 596459 610577 625729 642301 659968 677806 695123
53507 695123 712036 729128 746790 765013 783591 802241 820589 838278 855141 871213 886585
$$ packed form
53610C45673M559N451N166L519J782J348K054K481J887J052J019J578J626O81
53596C79876n28r93n56P6K10j37m43m44n26j188k250k905k670j924j266p19l4
53579C63579M88J96q68j741j700j098p31p99j026j314j630j506m78R22J456P12
53563C54462k98m72O7M84N30O62J099J473J422R73L49j63j32O55J730K279K079
53546C67199J663J461J409J518K203L542M755N047M627M336M470M618M599M820
53532D16267N524O320O744O859P041P514Q318R364J0210J0199R268Q399Q729J0279
53518E31035J2002J3018J3342J3439J3623J4118J5152J6572J7667J7838J7317
53507F95123J6913J7092J7662J8223J8578J8650J8348J7689J6863J6072J5372
$$ plain form
53496 886585 901308 915381 928790 941605 954094 966588 979206 991828 1004443 1017308 1030581
53485 1030581 1043893 1056570 1068220 1079008 1089404 1099930 1111027 1122803 1134744 1145923 1155666
53474 1155666 1163935 1170974 1176758 1180937 1183209 1183609 1182461 1180181 1177085 1173215 1168293 1161905 1153879 1144550
53460 1144550 1134668 1124951 1115668 1106611 1097322 1087200 1075560 1062008 1047027 1031893 1017681 1004427
53448 1004427 991531 978822 966787 955808 945661 935971 926799 918545 911488 905649 900921 897104 893992
53435 893992 891608 890316 890442 891850 894045 896661 899733 903487 908039 913363 919497 926667 935081 944608
53421 944608 954829 965546 977110 990038 1004429 1020010 1036651 1054444 1073270 1092726 1112638
53410 1112638 1133348 1155278 1178504 1202906 1228354 1254523 1280851 1307156 1334129 1362848 1393763
$$ packed form
53496H86585J4723J4073J3409J2815J2489J2494J2618J2622J2615J2865J3273
53485A030581J3312J2677J1650J0788J0396J0526J1097J1776J1941J1179R743
53474A155666Q269P039N784M179K272M00j148k280l096l870m922o388q026r329
53460A144550r882r717r283r057r289j0122j1640j3552j4981j5134j4212j3254
53448A004427j2896j2709j2035j0979j0147r690r172q254p057n839m728l817l112
53435H93992k384j292J26J408K195K616L072L754M552N324O134P170Q414R527
53421I44608J0221J0717J1564J2928J4391J5581J6641J7793J8826J9456J9912
53410A112638K0710K1930K3226K4402K5448K6169K6328K6305K6973K8719L0915
$$ plain form
53399 1393763 1426398 1459947 1493959 1528537 1564121 1601028 1639061 1677604 1716222 1754940 1793739
53388 1793739 1832084 1869368 1905656 1941496 1976949 2011250 2043521 2073525 2101515 2127686 2151940
53377 2151940 2174014 2193596 2210423 2224426 2235715 2244254 2249608 2251150 2248510 2241699 2230787 2215699
53365 2215699 2196499 2173760 2148282 2120381 2089833 2056795 2022418 1987993 1953628 1918396 1881882
53354 1881882 1844903 1808460 1772676 1737306 1702707 1669534 1637727 1606627 1576064 1546596 1518487
53343 1518487 1491042 1463292 1434998 1406737 1379326 1353402 1329341 1307283 1287245 1269224 1253061
53332 1253061 1238219 1224031 1210270 1197307 1185576 1174989 1164957 1154855 1144429 1133894 1123711
53321 1123711 1114179 1105219 1096628 1088428 1080846 1074069 1068171 1063166 1058846 1054734 1050522 1046553 1043567 1041976
$$ packed form
53399A393763L2635L3549L4012L4578L5584L6907L8033L8543L8618L8718L8799
53388A793739L8345L7284L6288L5840L5453L4301L2271L0004K7990K6171K4254
53377B151940K2074J9582J6827J4003J1289Q539N354J542k640o811j0912j5088
53365B215699j9200k2739k5478k7901l0548l3038l4377l4425l4365l5232l6514
53354A881882l6979l6443l5784l5370l4599l3173l1807l1100l0563k9468k8109
53343A518487k7445k7750k8294k8261k7411k5924k4061k2058k0038j8021j6163
53332A253061j4842j4188j3761j2963j1731j0587j0032j0102j0426j0535j0183
53321A123711r532q960q591q200p582o777n898n005m320m112m212l969k986j591
$$ plain form
53307 1041976 1041656 1042361 1043992 1046510 1049985 1054682 1060702 1067550 1074548 1081694 1089698 1099108 1109958 1122336
53293 1122336 1136542 1152354 1168739 1184837 1200797 1217185 1233927 1250356 1265920 1280310 1293089
53282 1293089 1303836 1312597 1319770 1325659 1330488 1334605 1338048 1340033 1339487 1336108 1330462 1323081 1314054 1303492
53268 1303492 1291735 1278835 1264434 1248445 1231358 1213572 1194913 1175228 1155011 1134903 1114851
53257 1114851 1094276 1072895 1050903 1028538 1006029 983975 963097 943439 924254 904946 885751
53246 885751 867237 849467 832035 814673 797397 780084 762370 744159 726041 708978 693603
53235 693603 679847 667185 655190 643812 633209 623408 614249 605601 597450 589708 582097 574307 566173
53222 566173 557618 548615 539366 530303 521669 513179 504326 494961 485392 476003 466998 458447 450268 442199
$$ packed form
53307A041976l20P05J631K518L475M697O020O848O998P146Q004R410J0850J2378
53293A122336J4206J5812J6385J6098J5960J6388J6742J6429J5564J4390J2779
53282A293089J0747Q761P173N889M829M117L443J985n46l379n646p381r027j0562
53268A303492j1757j2900j4401j5989j7087j7786j8659j9685k0217k0108k0052
53257A114851k0575k1381k1992k2365k2509k2054k0878j9658j9185j9308j9195
53246H85751j8514j7770j7432j7362j7276j7313j7714j8211j8118j7063j5375
53235F93603j3756j2662j1995j1378j0603r801r159q648q151p742p611p790q134
53222E66173q555r003r249r063q634q490q853r365r569r389r005q551q179q069
$$ plain form
53208 442199 434105 426309 419291 413102 407361 401838 396583 391478 386191 380695 375295 369869 363747 356785
53194 356785 350081 344933 341347 338172 334521 330428 326239 322021 317716 313312 308721 303893 299196 295226
53180 295226 292080 289188 286063 282898 280236 278316 276939 275745 274424 272824 271008 269093 267025 264684
53166 264684 262207 259937 258032 256408 255117 254442 254494 254964 255383 255377 254653 253109 251137 249416 248166 246914
53150 246914 245274 243688 242949 243174 243596 243399 242482 241414 240823 240879 241247 241527 241686 241952 242358 242664 242780 242965
53132 242965 243388 243736 243539 242775 241921 241470 241533 241883 242205 242369 242513 242781 242949 242511 241329 240030 239511 240099
53114 240099 241363 242670 243688 244336 244501 244063 243192 242416 242175 242299 242145 241317 240029 238624 237095 235408
53098 235408 234022 233481 233557 233388 232564 231569 230974 230768 230697 230714 230683 230143 228936 227695 227145 227127 226928 226418 226163
$$ packed form
53208D42199q094p796p018o189n741n523n255n105n287n496n400n426o122o962
53194C56785o704n148l586l175l651m093m189m218m305m404m591m828m697l970
53180B95226l146k892l125l165k662j920j377j194j321j600j816j915k068k341
53166B64684k477k270j905j624j291o75N2M70M19op24j544j972j721j250j252
53150B46914j640j586p39K25M22j97r17j068n91N6L68K80J59K66M06L06J16J85
53132B42965M23L48j97p64q54m51O3L50L22J64J44K68J68m38j182j299n19N88
53114B40099J264J307J018O48J65m38q71p76k41J24j54q28j288j405j529j687
53098B35408j386n41P6j69q24r95n95k06p1J7l1n40j207j241n50j8j99n10k55
$$ plain form
53079 226163 226358 226379 225675 224598 223877 223570 223059 222006 220839 220125 219817 219461 218948 218626 218574 218215 217001 215241
53061 215241 213833 213201 212856 212083 210807 209689 209529 210585 212300 213775 214667 215454 216620 217894 218804 219607
53045 219607 220919 222479 223191 222586 221409 220447 219620 218690 218081 218259 218847 219050 218599 217639 216172 214319 212809
53028 212809 212394 212940 213716 214335 214797 214978 214901 215275 216754 218729 219825 219744 219668 220532 221799 222420 222265 222024
53010 222024 222176 222653 223225 223685 223866 223869 224162 225106 226476 227622 228039 227691 226921 226196 225769 225537 225342 225343 225817
52991 225817 226638 227326 227676 227972 228459 228999 229440 229925 230578 231196 231599 232024 232816 233844 234632 235093 235783 237230
52973 237230 239140 240538 240827 240553 240858 242147 243646 244417 244447 244363 244421 244328 243958 243633 243595 243678 243639 243414 242905 241842
52953 241842 240096 237958 235998 234748 234377 234472 234311 233689 233246 233522 233956 233540 232265 231100 230513 229980 229161
$$ packed form
53079B26163J95K1p04j077p21l07n11j053j167p14l08l56n13l22n2l59j214j760
53061B15241j408o32l45p73j276j118j60J056J715J475Q92P87J166J274R10Q03
53045B19607J312J560P12o05j177r62q27r30o09J78N88K03m51r60j467j853j510
53028B12809m15N46P76O19M62J81p7L74J479J975J096q1p6Q64J267O21j55k41
53010B22024J52M77N72M60J81LK93R44J370J146M17l48p70p25m27k32j95JM74
52991B25817Q21O88L50K96M87N40M41M85O53O18M03M25P92J028P88M61O90J447
52973B37230J910J398K89k74L05J289J499P71L0q4N8r3l70l25l8Q3l9k25n09j063
52953B41842j746k138j960j250l71R5j61o22m43K76M34m16j275j165n87n33q19
$$ plain form
52936 229161 228574 228597 228652 228041 226936 225867 224893 224041 223954 225137 226872 227923 228183 228683 229934 231182 231538
52919 231538 231085 230479 230030 229625 229175 228766 228530 228622 229103 229656 229677 228924 227974 227766 228666 230135 231311 231816 231875
52900 231875 231754 231316 230341 229081 228098 227582 227263 227126 227657 229057 230639 231584 231991 232595 233597 234401 234511
52883 234511 234111 233607 233098 232505 231820 230969 229786 228420 227542 227817 229210 230997 232424 233351 234301 235966 238528
52866 238528 241458 243962 245518 245926 245166 243579 242044 241426 241726 242078 241710 240621 239284 238060 237113 236471
52850 236471 235933 235095 233714 231833 229453 226428 222961 219897 218050 217394 217226 216993 216561 215844 214734 213496
52834 213496 212713 212538 212358 211541 210305 209459 209427 209900 210459 211081 211871 212649 213237 213902 215059 216492 217360 217180
52816 217180 216450 215969 215875 215767 215548 215561 215924 216359 216830 217698 218921 219680 219344 218395 217712 217240 216123 214093
$$ packed form
52936B29161n87K3N5o11j105j069r74q52q7J183J735J051K60N00J251J248L56
52919B31538m53o06m49m05m50m09k36R2M81N53K1p53r50k08R00J469J176N05N9
52900B31875j21m38r75j260r83n16l19j37N31J400J582R45M07O04J002Q04J10
52883B34511m00n04n09n93o85q51j183j366q78K75J393J787J427R27R50J665K562
52866B38528K930K504J556M08p60j587j535o18L00L52l68j089j337j224r47o42
52850B36471n38q38j381j881k380l025l467l064j847o56j68k33m32p17j110j238
52834B13496p83j75j80q17j236q46l2M73N59O22P90P78N88O65J157J433Q68j80
52816B17180p30m81r4j08k19J3L63M35M71Q68J223P59l36r49o83m72j117k030
$$ plain form
52798 214093 211907 210270 209070 207985 207171 206863 206824 206728 206670 206727 206440 205466 204498 204708 206249 208050 209176 209714
52780 209714 210129 210489 210705 210893 211034 210733 209863 209062 209023 209582 210023 210096 210113 210163 209847 208881 207501 206176 205283
52761 205283 205095 205728 206907 208051 208719 208846 208614 208331 208410 209101 210247 211545 213001 214814 216818 218465
52745 218465 219497 220271 221249 222411 223388 224022 224573 225436 226704 228002 228804 229002 229015 229173 229236 228830 228108 227605
52727 227605 227520 227614 227678 227640 227320 226658 226151 226322 226697 226103 224289 222497 221954 222371 222521 221824 220785 220179 220400
52708 220400 221368 222534 223117 222808 222205 222170 222900 223908 224679 224952 224570 223569 222361 221467 221073 221052 221248 221479
52690 221479 221501 221329 221384 221980 222903 223845 224915 226205 227167 227097 226176 225386 225350 225780 226078 226024 225775 225651 225978 226758
52670 226758 227514 227854 228067 228692 229612 230268 230756 231876 233859 235758 236586 236518 236495 237066 238101 239308 240502
$$ packed form
52798B14093k186j637j200j085q14l08l9r6n8N7k87r74r68K10J541J801J126N38
52780B09714M15L60K16J88J41l01q70q01l9N59M41P3J7N0l16r66j380j325q93
52761B05283j88O33J179J144O68J27k32k83P9O91J146J298J456J813K004J647
52745B18465J032P74R78J162R77O34N51Q63J268J298Q02J98J3J58O3m06p22n03
52727B27605q5R4O4l8l20o62n07J71L75n94j814j792n43M17J50o97j039o06K21
52708B20400R68J166N83l09o03l5P30J008P71K73l82j001j208q94l94k1J96K31
52690B21479K2j72N5N96R23R42J070J290R62p0r21p90l6M30K98n4k49j24L27P80
52670B26758P56L40K13O25R20O56M88J120J983J899Q28o8k3N71J035J207J194
$$ plain form
52653 240502 241548 242465 243490 244662 245498 245396 244285 242585 240640 238574 236655 235389 235029 235165 235037 234277
52637 234277 233304 232912 233456 234561 235668 236659 237713 238736 239331 239351 239099 238891 238778 238823 239287 240221 241149 241428
52619 241428 240852 239722 238508 237646 237405 237686 238007 237967 237681 237605 237964 238481 238686 238408 238003 238093 238957 240145 240859
52600 240859 240749 240171 239681 239485 239465 239515 239716 240354 241725 243704 245545 246542 246959 247775 249335 250803 251359 251368
52582 251368 251734 252494 252817 252280 251355 250565 249872 249131 248539 248266 248073 247749 247581 247998 248894 249709 250122 250288 250373
52563 250373 250176 249380 248004 246472 245250 244478 243971 243472 242879 242214 241527 240950 240759 241176 242022 242689 242570 241551
52545 241551 240128 239095 239069 240088 241619 242996 243923 244448 244600 244344 243936 243973 244728 245655 245885 245192 244143
52528 244143 243363 243018 243079 243674 244868 246359 247677 248569 249011 249022 248804 248870 249680 251150 252812 254400 255975
$$ packed form
52653B40502J046R17J025J172Q36j02j111j700j945k066j919j266l60J36j28p60
52637B34277r73l92N44J105J107R91J054J023N95K0k52k08j13M5M64R34R28K79
52619B41428n76j130j214q62k41K81L21m0k86p6L59N17K05k78m05R0Q64J188P14
52600B40859j10n78m90j96k0N0K01O38J371J979J841R97M17Q16J560J468N56R
52582B51368L66P60L23n37r25p90o93p41n92k73j93l24j68M17Q96Q15M13J66Q5
52563B50373j97p96j376j532j222p72n07m99n93o65o87n77j91M17Q46O67j19j019
52545B41551j423j033k6J019J531J377R27N25J52k56m08L7P55R27K30o93j049
52528B44143p80l45O1N95J194J491J318Q92M42J1k18O6Q10J470J662J588J575
$$ plain form
52511 255975 257537 258961 260365 262053 263941 265491 266504 267515 269007 270614 271573 271640 270989 269497 266940
52496 266940 263892 261647 260888 260969 260845 260239 259470 258590 257293 255579 253935 252767 252017 251433 250924 250537 250259
52479 250259 250034 249834 249596 249175 248502 247766 247365 247664 248803 250666 252895 254933 256265 256830 257184 258030 259562
52462 259562 261388 263134 264887 266864 268907 270562 271552 271874 271525 270487 268992 267503 266340 265533 265033
52447 265033 264759 264395 263513 262106 260728 259889 259500 259075 258274 257074 255659 254404 253733 253724 253992 254180 254374 254763
52429 254763 255185 255427 255787 256722 257946 258475 257833 256758 256398 257113 258423 259802 261091 262293 263463 264848
52413 264848 266714 268951 271208 273526 276511 280674 285908 291802 298096 304448 310041 313971 316005 316533
52399 316533 315781 313594 310136 306333 303247 301234 299898 298545 296521 293527 290118 287590 286806 287224 287532
$$ packed form
52511B55975J562J424J404J688J888J550J013J011J492J607R59O7o51j492k557
52496B66940l048k245p59Q1j24o06p69q80j297j714j644j168p50n84n09l87k78
52479B50259k25k00k38m21o73p36m01K99J139J863K229K038J332N65L54Q46J532
52462B59562J826J746J753J977K043J655R90L22l49j038j495j489j163q07n00
52447B65033k74l64q82j407j378q39l89m25q01j200j415j255o71rK68J88J94L89
52429B54763M22K42L60R35J224N29o42j075l60P15J310J379J289J202J170J385
52413B64848J866K237K257K318K985M163N234N894O294O352N593L930K034N28
52399C16533p52k187l458l803l086k013j336j353k024k994l409k528p84M18L08
$$ plain form
52384 287532 287208 286942 287574 289156 291202 293283 295100 296416 297344 298426 300104 302262 304544 306915 309558
52369 309558 312410 315219 318028 321205 324851 328477 331405 333314 334254 334386 333963 333485 333486 334074 334903 335794 337111
52352 337111 339226 341797 344093 346029 348304 351269 354215 356280 357663 359301 361556 363944 366160 368630
52338 368630 371840 375742 380204 385555 392188 399833 407643 414991 421991 429300 437491 446541 455905 465251
52324 465251 475075 486316 499358 513752 528788 543891 558437 571879 584345 596592 609065 621535
52312 621535 633934 646838 660498 674008 686164 696851 706798 716334 725329 734166 743688 753903
52300 753903 763593 771629 778085 783729 788989 793814 798023 801252 802879 802485 800231 796477 791326 784943
52286 784943 778088 771796 766583 762398 759263 757490 757132 757701 758725 760313 762861 766359 770351 774596 779452
$$ packed form
52384B87532l24k66O32J582K046K081J817J316R28J082J678K158K282K371K643
52369C09558K852K809K809L177L646L626K928J909R40J32m23m78JN88Q29Q91J317
52352C37111K115K571K296J936K275K965K946K065J383J638K255K388K216K470
52338C68630L210L902M462N351O633P645P810P348P000P309Q191R050R364R346
52324D65251R824J1241J3042J4394J5036J5103J4546J3442J2466J2247J2473J2470
52312F21535J2399J2904J3660J3510J2156J0687R947R536Q995Q837R522J0215
52300G53903R690Q036O456N644N260M825M209L229J627l94k254l754n151o383
52286G84943o855o292n213m185l135j773l58N69J024J588K548L498L992M245M856
$$ plain form
52271 779452 785401 792379 799799 807221 814739 822615 830751 838784 846615 854578 862954 871533 879850 887786
52257 887786 895678 903804 911961 919703 926846 933520 939774 945372 950045 953670 956058 956815 955699 953013
52243 953013 949308 944765 939140 932309 924542 916161 907245 897823 888115 878430 869018 860143 852069 844789
52229 844789 837960 831308 824948 819122 813774 808654 803743 799345 795734 792910 790747 789333 788994 789808 791128
52214 791128 791941 792060 792723 795441 800204 805368 809488 812700 815946 819414 822302 823918 824500 825036 826594
52199 826594 829640 833648 837496 840532 843094 845773 848497 850769 852480 853959 855420 856954 858919 861646
52185 861646 864689 866949 867772 867465 866589 865152 862752 859143 854460 849081 843464 837944 832623 827596 823236
$$ packed form
52271G79452N949O978P420P422P518P876Q136Q033P831P963Q376Q579Q317P936
52257H87786P892Q126Q157P742P143O674O254N598M673L625K388P57j116k686
52243I53013l705m543n625o831p767q381q916r422r708r685r412q875q074p280
52229H44789o829o652o360n826n348n120m911m398l611k824k163j414l39Q14J320
52214G91128Q13J19O63K718M763N164M120L212L246L468K888J616N82N36J558
52199H26594L046M008L848L036K562K679K724K272J711J479J461J534J965K727
52185H61646L043K260Q23l07q76j437k400l609m683n379n617n520n321n027m360
$$ [...]
##END NTUPLES=NMR SPECTRUM
##END=
