
##TITLE=AC1358_CPIAH12177_6648324_M7kmhNxXWp
##JCAMPDX= 6.0         $$ Bruker NMR JCAMP-DX V2.0
##DATA TYPE= NMR SPECTRUM
##DATA CLASS= NTUPLES
##ORIGIN= BRUKER
##OWNER= Administrator
$$ 1.72 TOPSPIN		Version 2.1
$$ 2012-08-10 18:48:16.953 -0500  Administrator@TOPSPIN
$$ Compression mode = diff/dup
##.OBSERVE FREQUENCY= 400.02188249412
##.OBSERVE NUCLEUS= ^1H
##.ACQUISITION MODE= SIMULTANEOUS (DQD)
##.ACQUISITION SCHEME= undefined
##.AVERAGES= 8
##.DIGITISER RES= 22
##SPECTROMETER/DATA SYSTEM= spect
##.PULSE SEQUENCE= zg30
##.SOLVENT NAME= COFFEE_meoh
##.SHIFT REFERENCE= INTERNAL, COFFEE_meoh, 1, 14.98509
##AUDIT TRAIL= $$ (NUMBER, WHEN, WHO, WHERE, PROCESS, VERSION, WHAT)
$$ ##TITLE= Audit trail, TOPSPIN		Version 2.1
$$ ##JCAMPDX= 5.01
$$ ##ORIGIN= Bruker BioSpin GmbH
$$ ##OWNER= Administrator
$$ $$ C:\Bruker\TOPSPIN/data/COFFEE/nmr/AC1358_CPIAH12177_6648324_M7kmhNxXWp/10/pdata/1/auditp.txt
$$ ##AUDIT TRAIL=  $$ (NUMBER, WHEN, WHO, WHERE, PROCESS, VERSION, WHAT)
(   1,<2012-08-10 18:48:09.328 -0500>,<Administrator>,<TOPSPIN>,<go>,<TOPSPIN 2.1>,
      <created by zg
	started at 2012-08-10 18:47:02.843 -0500,
	POWCHK enabled, PULCHK disabled,
       configuration hash MD5:
       6B 1B 68 BB D9 2E 58 E2 7F 35 AD 54 07 DF 0E 41
       data hash MD5: 64K
       03 50 9A 5A D4 0E D8 F7 53 43 61 63 20 81 4E 08>)
(   2,<2012-08-10 18:48:12.750 -0500>,<Administrator>,<TOPSPIN>,<proc1d>,<TOPSPIN 2.1>,
      <Start of raw data processing
       efp LB = 0 FT_mod = 6 PKNL = 1 PHC0 = 0 PHC1 = 0 SI = 32K 
       data hash MD5: 32K
       CD E6 0A 88 A9 9C E8 A2 C6 5E B8 72 79 AF 47 D6>)
(   3,<2012-08-10 18:48:13.062 -0500>,<Administrator>,<TOPSPIN>,<proc1d>,<TOPSPIN 2.1>,
      <pk PHC0 = 180.9613 PHC1 = 0 
       data hash MD5: 32K
       CF 06 64 B1 F2 E2 F9 88 AF 1A 1D 5B B1 F3 E8 F7>)
(   4,<2012-08-10 18:48:13.203 -0500>,<Administrator>,<TOPSPIN>,<proc1d>,<TOPSPIN 2.1>,
      <abs ABSG = 1 
       data hash MD5: 32K
       05 87 D2 66 6D 72 F3 D4 9D 5F 88 04 58 0D 57 BC>)
(   5,<2012-08-10 18:48:13.312 -0500>,<Administrator>,<TOPSPIN>,<proc1d>,<TOPSPIN 2.1>,
      <abs ABSG = 2 
       data hash MD5: 32K
       55 9F 4D 37 B4 FD 48 1D 63 3C 1F 76 29 17 1C 82>)
(   6,<2012-08-10 18:48:13.359 -0500>,<Administrator>,<TOPSPIN>,<proc1d>,<TOPSPIN 2.1>,
      <abs ABSG = 3 
       data hash MD5: 32K
       01 29 96 49 25 5A 5C 44 99 D3 66 7E D7 8E EB 6D>)
(   7,<2012-08-10 18:48:13.390 -0500>,<Administrator>,<TOPSPIN>,<proc1d>,<TOPSPIN 2.1>,
      <abs ABSG = 4 
       data hash MD5: 32K
       3A 19 A8 D1 30 5F 95 61 0C E4 08 17 6E 92 19 FE>)
(   8,<2012-08-10 18:48:13.421 -0500>,<Administrator>,<TOPSPIN>,<proc1d>,<TOPSPIN 2.1>,
      <abs ABSG = 5 
       data hash MD5: 32K
       2F F4 EF 1E 39 EC 8E 96 D8 63 CF 71 02 4D D1 A0>)
$$ ##END=
$$ 
$$ $$ hash MD5
$$ $$ AF E4 76 66 14 7B CA 5A 0B F7 83 0D D0 1C ED 91
##$RELAX= 
##$RELAX= 
##$RELAX= 
##$RELAX= 
##$RELAX= 
##$RELAX= 
##$RELAX= 
$$ Bruker specific parameters
$$ --------------------------
$$ [...]
##$TP= (0..7)
150 150 150 150 150 150 150 150
##$TP07= 0
##$TPNAME0= <>
##$TPNAME1= <>
##$TPNAME2= <>
##$TPNAME3= <>
##$TPNAME4= <>
##$TPNAME5= <>
##$TPNAME6= <>
##$TPNAME7= <>
##$TPOAL= (0..7)
0.5 0.5 0.5 0.5 0.5 0.5 0.5 0.5
##$TPOFFS= (0..7)
0 0 0 0 0 0 0 0
##$TUNHIN= 0
##$TUNHOUT= 0
##$TUNXOUT= 0
##$USERA1= <user>
##$USERA2= <user>
##$USERA3= <user>
##$USERA4= <user>
##$USERA5= <user>
##$V9= 5
##$VALIST= <valist>
##$VCLIST= <CCCCCCCCCCCCCCC>
##$VD= 0
##$VDLIST= <DDDDDDDDDDDDDDD>
##$VPLIST= <PPPPPPPPPPPPPPP>
##$VTLIST= <TTTTTTTTTTTTTTT>
##$WBST= 1024
##$WBSW= 4
##$XGAIN= (0..3)
0 0 0 0
##$XL= 0
##$YL= 0
##$YMAX_a= 457304
##$YMIN_a= -594963
##$ZGOPTNS= <>
##$ZL1= 120
##$ZL2= 120
##$ZL3= 120
##$ZL4= 120
##$ABSF1= 14.98509
##$ABSF2= -5.573092
##$ABSG= 5
##$ABSL= 3
##$ALPHA= 0
##$AQORDER= 0
##$ASSFAC= 0
##$ASSFACI= 0
##$ASSFACX= 0
##$ASSWID= 0
##$AUNMP= <proc_prof1d_extract_pilot.lims>
##$AXLEFT= 0
##$AXNAME= <>
##$AXNUC= <1H>
##$AXRIGHT= 0
##$AXTYPE= 0
##$AXUNIT= <>
##$AZFE= 0.1
##$AZFW= 0.1
##$BCFW= 0
##$BC_mod= 0
##$BYTORDP= 0
##$COROFFS= 0
##$CY= 15
##$DATMOD= 1
##$DC= 0
##$DFILT= <>
##$DTYPP= 0
##$F1P= 0
##$F2P= 0
##$FCOR= 0.5
##$FTSIZE= 32768
##$FT_mod= 6
##$GAMMA= 0
##$GB= 0
##$INTBC= 1
##$INTSCL= 1
##$ISEN= 128
##$LB= 0
##$LEV0= 0
##$LPBIN= 0
##$MAXI= 10000
##$MC2= 0
##$MEAN= 0
##$ME_mod= 0
##$MI= 0
##$NCOEF= 0
##$NC_proc= -8
##$NLEV= 6
##$NOISF1= 0
##$NOISF2= 0
##$NSP= 0
##$NTH_PI= 0
##$NZP= 0
##$OFFSET= 14.98509
##$PC= 1
##$PHC0= 180.9613
##$PHC1= 0
##$PH_mod= 1
##$PKNL= yes
##$PPARMOD= 0
##$PPDIAG= 0
##$PPIPTYP= 0
##$PPMPNUM= 2147483647
##$PPRESOL= 1
##$PSCAL= 4
##$PSIGN= 0
##$PYNMP= <proc.py>
##$REVERSE= no
##$SF= 400.02
##$SI= 32768
##$SIGF1= 0
##$SIGF2= 0
##$SINO= 400
##$SIOLD= 32768
##$SPECTYP= <>
##$SREGLST= <1H.CDCl3>
##$SSB= 0
##$STSI= 32768
##$STSR= 0
##$SW_p= 8223.68421052631
##$SYMM= 0
##$S_DEV= 0
##$TDeff= 65536
##$TDoff= 0
##$TI= <>
##$TILT= no
##$TM1= 0
##$TM2= 0
##$TOPLEV= 0
##$USERP1= <user>
##$USERP2= <user>
##$USERP3= <user>
##$USERP4= <user>
##$USERP5= <user>
##$WDW= 1
##$XDIM= 32768
##$YMAX_p= 457244172
##$YMIN_p= -669556
##$CURPLOT= <Network HP LaserJet P1505>
##$CURPRIN= <$Network HP LaserJet P1505>
##$DFORMAT= <normdp>
##$LAYOUT= <+/1D_H.xwp>
##$LFORMAT= <normlp>
##$PFORMAT= <normpl>
##$SURQMSG= 1
$$ End of Bruker specific parameters
$$ ---------------------------------
##NTUPLES= NMR SPECTRUM
##VAR_NAME=  FREQUENCY,     SPECTRUM/REAL,   SPECTRUM/IMAG
##SYMBOL=    X,             R,               I
##VAR_TYPE=  INDEPENDENT,   DEPENDENT,       DEPENDENT
##VAR_FORM=  AFFN,          ASDF,            ASDF
##VAR_DIM=   32768,         32768,           32768
##UNITS=     HZ,            ARBITRARY UNITS, ARBITRARY UNITS
##FACTOR=    0.250966925370066, 1,           1
##FIRST=     8223.43324360094, -19250,       112606
##LAST=      0,             -90291,          37291
##MIN=       0,             -669556,         0
##MAX=       8223.43324360094, 457244172,    0
$$ Real data points
##PAGE= N=1
##DATA TABLE= (X++(R..R)), XYDATA
$$ [...]
19488c38992A37040i0151j5064j06507A6226f7963a4616B10845l1669b08358j0625
19477b18983B12700a11452c0184C12887R464a50348F9834a30891G1300b49384
19466d42460J83010a3227A59384b1332o0680A74950E3858J30432a8291n89k89094
19455c07974J49490g6298J5954a0642M991j19842n4811k14995a48300q443B10699
19443a6660B07746f1619A1301c6342k15711h2233A25774A4348O0212c0453E8873
19431H320b6085B19146l7190c46914J54824G4478c17636D3728a15789I971a15645
19419e7678A01148a12949j39893C7851O3993d10736h224j16290J809m206F5644
19407h088r4519d380m88951A48991a87435b3816B17271a61889c2216A53546Q8664
$$ plain form
19488 -338992 137040 -90151 -105215 -211722 16226 -67963 -14616 210845 179176 -208358 -218983
19477 -218983 212700 -111452 -30184 312887 322351 -150348 69834 -130891 71300 -249384
19466 -442460 -259450 -13227 159384 -21332 -82012 174950 53858 184290 -18291 -18880 -307974
19455 -307974 -158484 -76298 -60344 -10642 -5651 -125493 -180304 -395299 -148300 -156743 210699
19443 -16660 207746 -61619 11301 -36342 -252053 -82233 125774 14348 74560 -30453 58873
19431 8320 -26085 219146 181956 -346914 -192090 74478 -317636 43728 -115789 9971 -115645
19419 -57678 101148 -112949 -252842 37851 101844 -410736 -8224 -124514 -122705 -126911 65644
19407 -8088 -102607 -4380 -493331 148991 -187435 -23816 217271 -161889 -32216 153546 242210
19396B42210a39985j10309J00540O8711c8338B0300c20092I0362d0586q1805l8530
19385a60921c842j81949f3545A50698J9480E8196b11021h0756j09541f3291m751
19374f8042A50374J0601b12802G966e8534j67063d093A08535j0417C212a87981
19362b2550k51051A97973a8578l40352f3519B8381c64944J53200J1119A29765
19351A07189k573b30379Q0826N8246c7114A53636b42033m9983i5237A8719L3277
19340E1996a38088n0114n1638A37692i7960A09242a15539J0548k90606i0736l08027
19329c98763c0290j79283A89586i4447b641n7995j81830a04756l53128K25647
19319b32237F7031a95369B20449a17071j20544A87481b3290m7939m7171B48837
$$ plain form
19396 242210 -139985 -250294 -149754 -81043 -38338 20300 -320092 90362 -40586 -122391 -160921
19385 -160921 -3842 -185791 -63545 150698 170178 58196 -211021 -80756 -190297 -63291 -68042
19374 -68042 150374 160975 -212802 7966 -58534 -225597 -4093 108535 98118 3212 -187981
19362 -22550 -273601 197973 -18578 -358930 -63519 28381 -364944 -211744 -200625 129765
19351 107189 104616 -230379 -149553 -91307 -37114 153636 -242033 -292016 -95237 18719 51996
19340 51996 -138088 -188202 -239840 137692 -97960 109242 -115539 -104991 -395597 -90736 -398763
19329 -398763 -30290 -209573 189586 -94447 -2641 -60636 -242466 -104756 -457884 -232237
19319 -232237 67031 -195369 220449 -117071 -237615 187481 -23290 -71229 -118400 248837
19308B2645a37423A67754d60679J36513A50468a03990I2787h028I5351a78970
19297b12949C5301f7050a5975k04958G362a10658c3748A03273a09231r9861K4618
19286a84474I8386a18771F6099b44694J21393B0070O3408h879C38735A2686Q1347
19275I4033a07434m170A9856c4814A20892a76680I8033J94694i9162L7401k3443
19264h5204A3859a67596B42047a39273B2328a9737j9776A2916a24703e4765j79276
19253b34041i0126j90683J16121a5417l21453B5552f9530H6014L8362b00845B69777
19241b60824L6345N6392n6021J02496H320Q095a94708F4490i2238c2032C53323
19229b34625j12697a64422A8107O1055a86316A76452E3042a29964j45661d3061
$$ plain form
19308 22645 -137423 167754 -460679 -324166 150468 -103990 92787 -8028 95351 -178970
19297 -212949 35301 -67050 -15975 -220933 7362 -110658 -33748 103273 -109231 -209092 -184474
19286 -184474 98386 -118771 66099 -244694 -123301 20070 83478 -8879 338735 12686 94033
19275 94033 -107434 -111604 19856 -34814 120892 -176680 98033 292727 -99162 -61761 -85204
19264 -85204 13859 -167596 242047 -139273 22328 -19737 -39513 12916 -124703 -54765 -234041
19253 -234041 -90126 -280809 -164688 -15417 -336870 25552 -69530 86014 124376 -200845 269777
19241 -260824 -224479 -168087 -224108 -121612 8320 16415 -194708 64490 -92238 -32032 353323
19229 -234625 -347322 -164422 18107 79162 -186316 176452 53042 -129964 -275625 -43061
19218b41159a1313j41794J3199j33428Q2753F1468J61280c10876i5244j20141
19208b15385R8237R363L0433B03047b61872B34298l7345j8939c08973e3429A24700
19196B9202a87878e4741k57041a38320O1661A1499b31828j32735a3624B65169
19185B77112g0538G5318c9691j71228F4710g2079C6567b12267Q4068K3295A05635
19173c46597G7814k1351J2322e0022q9699l980l8132j30466C3136d15164a10665
19161b23577B06104b40429P7982B985N1280e0181D08246a43402j9975l15997i558
19149c22005A7846K9384f8900A11831b41583H2614b42211a11232A98649o2364
19139A36285a70140A13443f6053G9777a25159b3520A73772a24980j65898C5570
$$ plain form
19218 -241159 -11313 -153107 -139908 -273336 -190583 61468 222748 -310876 -95244 -215385
19208 -215385 -117148 -107785 -77352 203047 -261872 234298 196953 178014 -308973 -53429 124700
19196 29202 -187878 -54741 -311782 -138320 -76659 11499 -231828 -364563 -13624 265169
19185 277112 -70538 75318 -39691 -210919 64710 -72079 36567 -212267 -128199 -104904 105635
19173 -346597 77814 56463 68785 -50022 -139721 -143701 -181833 -312299 33136 -415164 -110665
19161 -223577 206104 -240429 -162447 2985 54265 -50181 408246 -143402 -163377 -479374 -9558
19149 -322005 17846 47230 -68900 111831 -241583 82614 -242211 -111232 198649 136285
19139 136285 -170140 113443 -66053 79777 -125159 -23520 173772 -124980 -290878 35570
19128a39491C86916i84p1668B1805K17062k1419F4330g5528B6955J39542C8075
19116a0164k10198J07732o0358I0799b44464b5811l6305G166c41378A00803g6117
19104i5939B99416c4088C35809g2395k0076j803n3738b9433k3521m538H6387J4954
19092A01341h0573C31598p7638a28299m1762G2953g5476a2893A45810g5220j75249
19081b50469J12653j28198A46648m0799c6231q0927B30400G7467a47079B94207
19070G7548e6032j61485E3534A1765a31938k44740A44904o2124a60590j10495
19060b71085H2966M6752P776E928g9636N007l8350A23986B3244J16561d0994C46847
19047c11695l1819a34305a5139I1171b72333h043I6682a7904A52531d110B16327
$$ plain form
19128 -139491 386916 -984 -72652 21805 238867 217448 64330 -75528 26955 166497 38075
19116 -10164 -220362 -112630 -172988 90799 -244464 -25811 -62116 7166 -341378 100803 -76117
19104 -95939 299416 -34088 335809 -72395 -92471 -94274 -148012 -29433 -52954 -57492 86387 101341
19092 101341 -80573 331598 253960 -128299 -170061 72953 -75476 -12893 145810 -75220 -250469
19081 -250469 -137816 -266014 146648 105849 -36231 -117158 230400 77467 -147079 294207
19070 77548 -56032 -217517 53534 11765 -131938 -376678 144904 82780 -160590 -271085
19060 -271085 82966 129718 137494 5928 -79636 -74629 -112979 123986 23244 139805 -40994 346847
19047 -311695 -343514 -134305 -15139 91171 -272333 -8043 96682 -17904 152531 -4110 216327
19035i0995j06585n8493M0262P7800p7466a3143k8462J3041j10425k484b4354
19023I2482B0133J92651b14291G0474m250a51230B4560O053a74929B40653J5853
19012B56506b08584j73512J76567P6099c3665q3034a3607n3529o6911I0920a11965
19000a4155m4382F5109g6749j64324B37751a13171j23841A8077L8529c57598a55132
18988A16303M22371i9317G8110a21489L5022k39058a05217G4717b25397J9840
18978b05557i2231F5213a14810e0189j00049a2392E2315J88282L21519r4961j86568
18967B80587j36668C275K24017a51886f3579j47391A57283n2088a17052b8578
18956a01185j89601J0001A13940J35735L8538A22871a06751H071a19074n3189
$$ plain form
19035 -90995 -197580 -256073 -215811 -138011 -215477 -13143 -41605 -28564 -138989 -141473 -24354
19023 92482 20133 212784 -214291 70474 66224 -151230 24560 30613 -174929 240653 256506
19012 256506 -208584 -382096 -205529 -129430 -33665 -116699 -13607 -67136 -134047 90920 -111965
19000 -14155 -58537 65109 -76749 -241073 237751 -113171 -237012 18077 56606 -357598 -155132
18988 116303 538674 -99317 78110 -121489 -86467 -325525 -105217 74717 -225397 -205557
18978 -205557 -92231 65213 -114810 -50189 -150238 -12392 52315 240597 562116 467155 280587
18967 280587 143919 3275 227292 -151886 -63579 -210970 157283 105195 -117052 -28578
18956 -101185 -290786 -280785 113940 249675 288213 122871 -106751 8071 -119074 -172263
18946a72263p6213A00049c98275D654J23742B3324J48179b11584I9095c42747
18935A36141h2934k51603E9781c27824A3709N0804i9007A83674I1067a61183G7690
18923C1948a3818C3901b15187C01027c04160a217B88985c04211k56169a70113
18912i2857n735j97507D36847I9091K00000J96676k41173E5507O9752a93995A43542
18900i9867I7717b04992C0987Q3607d58082l4213G4879b2358p4412C0757d6471
18888F3068b05680C8423j6147c87023A14569a53196A08547D0829R0547b75715
18877c4364A95818B5265c46682a68720r2897d8105n8069j4926p1976A03049g5532
18865A41473c4474k53595L4616G5697a76016N3496B40264f2086q8701G9184H750
$$ plain form
18946 -172263 -248476 100049 -398275 4654 128396 23324 171503 -211584 99095 -342747
18935 136141 -82934 -334537 59781 -327824 13709 64513 -99007 183674 91067 -161183 77690
18923 31948 -13818 33901 -215187 301027 -304160 -1217 288985 -304211 -560380 -170113
18912 -92857 -98592 -296099 436847 99091 299091 495767 254594 55507 125259 -193995 143542
18900 -99867 97717 -204992 30987 114594 -458082 -492295 74879 -22358 -96770 30757 -46471
18888 63068 -205680 38423 22276 -387023 114569 -153196 108547 40829 131376 -275715
18877 -34364 195818 25265 -346682 -168720 -261617 -48105 -106174 -121100 -193076 103049 -75532
18865 141473 -34474 -288069 -253453 75697 -176016 -122520 240264 -62086 -150787 79184 8750
18853a71296b5683r7360a9940k14613o1593A85022B197R7434b75294A085g8521
18841e8802J7184J8926j3149A58732a59454H6513d9035j81865h6607j46131a1872
18829B44237B3330O1635b36411m6144P2456k7427N4770A7156J77380b48484a06154
18817c1991H983J78394O2050A9585b5323G6866e947D7087M1249a56173B97776
18805B93643c41053J19694B1464J50763F8432b41655l2788c282j67412B4352h6654
18793A44876J40346e5861A65527D3335K61750B1776d3568B34567a79244A42898
18782c94657H5411g3213m6690E3500j1765a68361b4090l44373A35224e0824B053
18770A83520B8257b02110i1163l516b5582h961k92148A58515a96697P0399B8503
$$ plain form
18853 -171296 -25683 -123043 -19940 -234553 -296146 185022 2197 99631 -275294 1085 -78521
18841 -58802 -41618 -22692 -35841 158732 -159454 86513 -49035 -230900 -86607 -232738 -11872
18829 244237 23330 84965 -236411 -282555 -210099 -237526 -182756 17156 194536 -248484 -106154
18817 -31991 8983 187377 249427 19585 -25323 76866 -5947 47087 88336 -156173 297776
18805 293643 -341053 -221359 21464 172227 68432 -241655 -274443 -3282 -170694 24352 -86654
18793 144876 285222 -55861 165527 43335 305085 21776 -43568 234567 -179244 142898
18782 -394657 85411 -73213 -119903 53500 41735 -168361 -24090 -368463 135224 -50824 2053
18770 183520 28257 -202110 -91163 -94679 -25582 -8961 -301109 158515 -196697 -126298 28503
18758B18667E441J25697b77221H4387J3611J24226d01880f4107l11655c6162F8281
18746a11912l9819q5575C05137c33673A64939F9733a29777M3073m6353R207H4257
18734a48117a8729D5175b794k65774j19451P0946i7392A44977m1900b26756J12626
18723a14130B8961f9802j35583N5936p3979g2242j98544b6403I2598C1174b67453
18711i9965E3937M6491a10779k77827B80730a8044n3375B40743a93852A63593
18700a0162p9106r0817J2424d6379k98618J01089E6295b3788B39082h4316j74259
18689b58575R9214j18187a06435A73652C0532a27411B10763a07213B28520r7939
18679A30581a8337G9199a01936A49740b23451H3550L8188K47936c9693j47566
$$ plain form
18758 218667 5441 131138 -277221 84387 97998 222224 -401880 -64107 -375762 -36162 68281
18746 -111912 -151731 -237306 305137 -333673 164939 69733 -129777 -86704 -133057 -123850 84257
18734 -148117 -18729 45175 -2794 -268568 -388019 -317073 -97392 144977 103077 -226756 -114130
18723 -114130 28961 -69802 -205385 -149449 -223428 -72242 -270786 -26403 92598 31174 -267453
18711 -99965 53937 100428 -110779 -388606 280730 -18044 -71419 240743 -193852 163593
18700 -10162 -89268 -180085 -167661 -46379 -344997 -243908 56295 -23788 239082 -84316 -258575
18689 -258575 -159361 -277548 -106435 173652 30532 -127411 210763 -107213 228520 130581
18679 130581 -18337 79199 -101936 149740 -223451 83550 121738 369674 -39693 -187259
18669a87259O058A10459J43998F3341i2779C39605A3253f109l36367A2010e457
18657B0778d93071D3485L67546A72373O102e2467j11153j4055l3462Q7964A52407
18645e3144C0066Q9859g9476k57259Q1534B20755b12856B4818d56938C2182b04801
18633i8838G8598b52270A81124F7909i8667D1650L0210a28467m9362e1743B4472
18621I9819P4958B588b22415H1945c6284m985p8617J6726H9032J6283J213b92583
18608I3010h428G7848k3210a0297C28305h0878L4369B70651a19952L5025B99271
18596a85974b6248j59701c7070q3558A57632a66774h3137k375C1486a72537a5947
18584C49502e6277k72841C0842M3194l4968O4975a6238k50525B47554C2116g303
$$ plain form
18669 -187259 -181201 110459 254457 63341 -92779 339605 13253 -6109 -342476 12010 -5457
18657 20778 -493071 43485 411031 172373 178475 -52467 -163620 -177675 -211137 -123173 152407
18645 -53144 30066 119925 -79476 -336735 -255201 220755 -212856 24818 -456938 32182 -204801
18633 -98838 78598 -252270 181124 67909 -98667 41650 71860 -128467 -177829 -51743 24472
18621 99819 174777 2588 -222415 81945 -36284 -41269 -119886 -103160 89032 105315 106528 -292583
18608 93010 -8428 77848 54638 -10297 328305 -80878 -46509 270651 -119952 -84927 299271
18596 -185974 -26248 -185949 -37070 -120628 157632 -166774 -83137 -85512 31486 -172537 -15947
18584 349502 -56277 -329118 30842 74036 39068 104043 -16238 -266763 247554 32116 -7303
18572e6848j19090F8866a80399c3395o2469B49422j673f3040A15685c45686e2710
18560E4947Q5265c51386j04341G0313f279C4506b76046J24376f0078J7731k75835
18549c18182E5422k1269A084b75112B8860P9226B4840a1940G0153Q4055a41305
18537C920a71645A84546l0050B8196c09455O0686c3115A33271N1693g5019A56138
18525i0910c3891b781j54664k97133A17238h7909c1908B30575a65179m9463A33864
18513a4940j34619M6736D14461a17684m6721G1829L5413a71034G2687j5384a54729
18501b47865i7805n9213G3593b51917B0321K0238K50729B8971b41928P8091P4197
18490h9640L4163p5609r0786c8525j90327o9053g43k73837j51014h6934k38705
$$ plain form
18572 -56848 -175938 68866 -180399 -33395 -95864 249422 247749 -63040 115685 -345686 -52710
18560 54947 140212 -351386 -455727 70313 -6279 34506 -276046 -151670 -60078 -42347 -318182
18549 -318182 55422 34153 1084 -275112 28860 108086 24840 -11940 70153 154208 -141305
18537 3920 -171645 184546 154496 28196 -309455 -248769 -33115 133271 184964 -75019 156138
18525 -90910 -33891 -2781 -157445 -454578 117238 -87909 -31908 230575 -165179 -214642 133864
18513 -14940 -149559 -102823 414461 -117684 -164405 71829 107242 -171034 72687 57303 -154729
18501 -247865 -97805 -157018 73593 -251917 20321 40559 291288 28971 -241928 -163837 -89640
18490 -89640 -55477 -131086 -221872 -38525 -228852 -297905 -743 -274580 -425594 -86934 -325639
18479c25639a25817j30456I1762a74377B85016H6012a84401a4298B764i9802k17736
18468c17538G0123L09488g0609j8453b0580I1291J294R2170A0428M3762i5221
18456A38236a77363D476J7449N3630b61212a05583B0388e924m4527l5281K9177
18445e6555k8762A45514a01500B0997a99527A9813K414h1325A33523g8390r0972
18434a69362B54288C9309J07900J08411A19559a8903j55100C3957a60733A78191
18423b31400N1808K4284a4902l47753A50920b72312I4723K5826a5965j3795j99293
18412b29053C0798b28263f7358A39761a30727B9866R0183b32279h3156K267G3835
18400A97941a94950j68907E602K1549f4653Q078a3127j21003A53252a58378A44990
$$ plain form
18479 -325639 -125817 -256273 91762 -174377 285016 86012 -184401 -14298 2764 -99802 -317538
18468 -317538 70123 379611 -70609 -89062 -20580 91291 92585 184755 10428 54190 -95221
18456 138236 -177363 4476 21925 75555 -261212 -105583 20388 -5924 -50451 -85732 -56555
18445 -56555 -85317 145514 -101500 20997 -199527 19813 22227 -81325 133523 -78390 -169362
18434 -169362 254288 39309 147209 255620 119559 -18903 -174003 33957 -160733 178191
18423 -231400 -179592 -155308 -14902 -362655 150920 -272312 94723 120549 -15965 -29760 -229053
18412 -229053 30798 -228263 -67358 139761 -130727 29866 120049 -232279 -83156 -80889 73835
18400 197941 -194950 -363857 5602 27151 -64653 -56575 -13127 -134130 153252 -158378 144990
18388F4184k1984J83429j02632a74332j7133r51L862F7935b95p8912I2365b40573
18375b10348f8189C2096R488b24649a249D7589J33953e9390E3099M27c3843I3401
18362b61666A05942l1477a48693B77852j19066L7832G2051b95167G5794A6738
18351b66318N079J04150e1236k11340o1195J07909f0088A26046c8562A30149b80585
18339b4610l6586j20371a5118j71369A36234c17915B62253b30085D7793f7858
18328A45169b14747D1394h1570a9518j76263O7157a9155j3458k86391D3154a30622
18316f6351B05871J02874i6219A03007L8819l9687l4219E387K26999c01202D6553
18304a22914G6289f6528k8113d5614j43332B33942F7479b34193k04219a5729A17463
$$ plain form
18388 64184 42200 225629 122997 -174332 -191465 -192416 -188554 67935 -295 -79207 92365 -240573
18375 -210348 -68189 32096 41584 -224649 -1249 47589 181542 -59390 53099 53526 -33843 93401
18362 -261666 105942 74465 -148693 277852 158786 196618 72051 -295167 75794 16738
18351 -266318 -261239 -157089 -51236 -262576 -323771 -215862 -60088 126046 -38562 130149 -280585
18339 -24610 -61196 -181567 -15118 -186487 136234 -317915 262253 -230085 47793 -67858
18328 145169 -214747 41394 -81570 -19518 -195781 -128624 -19155 -32613 -319004 43154 -130622
18316 -66351 205871 308745 -96219 103007 141826 102139 67920 5387 232386 -301202 46553
18304 -122914 76289 -66528 -94641 -45614 -188946 233942 67479 -234193 -438412 -15729 117463
18292B64913g0086k16891a18936L3220B28220b84666G3548R4242l7511a57331
18281B7704c7019j7666C04183A12779D6877K50034A48127c04261I5845b53561
18270b22317D1293N4263k0987a93351N0778G778Q548a47796k37142O0883J51256
18259a72799O8024B2709P2131a3298j5162j39318I8636b08813A34805e85749a98930
18247A50408J11170a90252e5358j03559A19825m0673B9786K3061a35816k2015
18237a57831A51429a40939N2016k7452c2603a5417A12580a72947M2808A74069
18226A95357J53715E8696a52702A75374b21195j3723d5587o1441r3182B52027
18215A07500d284j45272r131J8509c9098j46329B25653a45959l07359J41191J06619
$$ plain form
18292 264913 -70086 -286977 -118936 -85716 228220 -284666 73548 167790 130279 -157331
18281 27704 -37019 -54685 304183 112779 46877 296911 148127 -304261 95845 -253561
18270 -222317 41293 95556 74569 -193351 -142573 7778 16326 -147796 -384938 -324055 -172799
18259 -172799 -104775 22709 94840 -13298 -28460 -167778 98636 -208813 134805 -585749 -198930
18247 150408 261578 -190252 -55358 -158917 119825 79152 29786 52847 -135816 -157831
18237 -157831 151429 -140939 -88923 -116375 -32603 -15417 112580 -172947 -130139 174069
18226 195357 349072 58696 -152702 175374 -221195 -234918 -45587 -107028 -200210 252027
18215 107500 -4284 -149556 -158687 -140178 -39098 -185427 225653 -145959 -453318 -312127 -205508
18204b05508N1168R989f4860k21468A30107J92852G5154a80805A54518b23434
18193B53961j8334E3372L0475C7620a03901j9712f349B4967Q8097b42332C9346
18181a48278r032c2484D4961J6960h7453B32218j243b37252E9809L9429a40663
18169f0077a3002j34666O6084B18217b059j24770m3617O3649m2591G8299d5023
18157g8843c2344B38029m5154g6457F6946a00304B01654a67408N7714A4348f6610
18145A45006b12940G1297b28323b3134k32350A88583J10729f2389l3627H8292
18134f6463B07653e411p7830A60855F0123B4754b16814l06200a11726j66023H2078
18122C436a63035A27265a91781G3905b27811B82519b8865n2031A84990b0748n1770
$$ plain form
18204 -205508 -154340 -144351 -64860 -286328 130107 322959 75154 -180805 154518 -223434
18193 253961 235627 53372 83847 37620 -103901 -123613 -6349 24967 113064 -242332 39346
18181 -148278 -157310 -32484 44961 61921 -87453 232218 230975 -237252 59809 99238 -140663
18169 -60077 -13002 -147668 -81584 218217 -2059 -126829 -170446 -106797 -149388 78299 -45023
18157 -78843 -32344 238029 192875 -76457 66946 -100304 201654 -167408 -109694 14348 -66610
18145 145006 -212940 71297 -228323 -23134 -255484 188583 299312 -62389 -96016 88292
18134 -66463 207653 -5411 -83241 160855 60123 24754 -216814 -523014 -111726 -277749 82078
18122 3436 -163035 127265 -191781 73905 -227811 282519 -28865 -80896 184990 -20748 -72518
18111g2518K7949A20107d10190e1094A00755O7748K67559e7068j68415A07660
18100B13165J979d0878D58053G1661c22647a03815B60784j16551a33468A29392
18089D8162a65600A3196a7145p5105A53943E6907a31437A42920k7571j225O441
18078A20565e3869j03715A64816d321l6145n4469A47187b4589j06548n5253B2228
18066b2516j71655E5386a11421b1255C35685g2902E2486a7806E5513c2796B0249
18054A0918a94872A2380a56533E5645a48042l7819A8067a80175c2016k61431n8384
18043c51831J42874A4696E35a0769A18945A4142e5541B09474P306j5310o2925
18032A38545a54177A36354a21003p1950A89799C6271b19538C7759K9855J69001
$$ plain form
18111 -72518 -44569 120107 -410190 -51094 100755 168503 436062 -57068 -225483 107660
18100 213165 215144 -40878 458053 71661 -322647 -103815 260784 144233 -133468 129392
18089 48162 -165600 13196 -17145 -92250 153943 56907 -131437 142920 115349 114124 120565
18078 120565 -53869 -157584 164816 -4321 -40466 -94935 147187 -24589 -131137 -186390 22228
18066 -22516 -194171 55386 -111421 -21255 335685 -72902 52486 -17806 55513 -32796 20249
18054 10918 -194872 12380 -156533 55645 -148042 -185861 18067 -180175 -32016 -293447 -351831
18043 -351831 -208957 14696 535 -10769 118945 14142 -55541 209474 216780 201470 138545
18032 138545 -154177 136354 -121003 -192953 189799 36271 -219538 37759 67614 236615
18022B36615p5417a9820k91415H1261J06092b13860n9046b1467A50620C0305b6580
18010a21863p6198m3983q422c4773k21226e7372J425A9627L9376J93254c65710
17998G5006g1923H3755c42923B39767n6762b06139B07853m4217c02370I6358d5403
17986g8014k15233B47174a14682j68962i5329M580A12263a585j92946O9988C51
17974h2314A54217f3840I2433M1191n1649a12170B65342b0049l7016A05870j2419
17963I3451J68573A06673J06222A0640a67159A32715i9734b6055A89979a019B49393
17951D4340N912d5249o7439O325m8407I0513P7502F3711h5913H1670J17824h2299
17938i5613I4134a43194C1440c5199k1201j40876A65127B9680R8419K39311E9801
$$ plain form
18022 236615 161198 -19820 -311235 81261 187353 -213860 -272906 -21467 150620 30305 -26580
18010 -121863 -198061 -242044 -250466 -34773 -255999 -57372 -55947 19627 59003 252257 -365710
17998 75006 -71923 83755 -342923 239767 183005 -206139 207853 163636 -302370 96358 -45403
17986 -78014 -293247 247174 -114682 -283644 -95329 -90749 112263 -1585 -194531 -124543 351
17974 -82314 154217 -63840 92433 133624 81975 -112170 265342 -20049 -57065 105870 93451
17963 93451 262024 106673 212895 10640 -167159 132715 -99734 -26055 189979 -1019 249393
17951 44340 50252 -45249 -112688 -106363 -154770 90513 168015 63711 -85913 81670 199494 -82299
17938 -95613 94134 -143194 31440 -35199 -56400 -197276 165127 29680 128099 367410 59801
17926d7268A44017R8294b00728A39270J56091j34683a22994c9658A49900O1692
17916B11592a48668B00693J16210g6211A48348L8256a61437c2075C3208J93172
17906B26380G3124f3093C23126e5842q2283F9654L7587b30588J6817A0433a10914
17894e8662B39744a75719D1644A9207b84208P0244B18889D507K2914b07535H5393
17882A5619J78091g4827j6351k44893B91801a11382A98622M8217d1255a5345p4147
17871h9492J8105m8413a4105A62814a05911n6067n5486F8281L55522e16014A23401
17859A28898P9387j6801J7835C3224b0160F1216O6674J0363b5653A37197a62882
17847B02758J843F650j489a46063D484J10119D1042J00025L1170j8712L2293r2181
$$ plain form
17926 -47268 144017 242311 -200728 139270 295361 160678 -122994 -39658 149900 211592
17916 211592 -148668 200693 316903 -76211 148348 186604 -161437 -32075 33208 226380
17906 226380 73124 -63093 323126 -55842 -138125 69654 107241 -230588 -213771 10433 -110914
17894 -58662 239744 -175719 41644 19207 -284208 -213964 218889 4507 27421 -207535 85393
17882 15619 193710 -74827 -91178 -336071 291801 -111382 198622 246839 -41255 -15345 -89492
17871 -89492 -71387 -119800 -14105 162814 -105911 -161978 -217464 68281 423803 -516014 123401
17859 128898 208285 191484 209319 33224 -20160 61216 127890 138253 -25653 137197 -162882
17847 202758 204601 6650 5161 -146063 4484 114603 41042 141067 172237 153525 185818 93637
17835I3637J137a09216A58844d9326k64134C30877A11703m8635H004c1729D6034
17823F8773R5981E8054J61417e8986G8892l8150J55643a77475b1810l10770C32598
17811B5467J38317A1897J91425a90500B5386K94286H7509J46623A07162C6066
17800B4740b12417D77651c49626a5238E6894B5800J59081a86150g394C3185Q0130
17789A13315m8669d1290E0842B328P8159i3131B15071a15714m1069B99469A12811
17777b17060A30492D8318a0516A12622C6724P5939e9967j07891B526O5031J21635
17766A89192R2857A28311m1819N8679f7883C7324g5224J2431K0055H8761i0089
17754B46284E0631b59411p350J31180B14952A01365a06305e2255H1733K85033
$$ plain form
17835 93637 94774 -109216 158844 -49326 -313460 330877 111703 63068 8004 -31729 46034
17823 68773 164754 58054 219471 -58986 78892 40742 196385 -177475 -21810 -332580 332598
17811 25467 163784 11897 203322 -190500 25386 319672 87509 234132 107162 36066
17800 24740 -212417 477651 -349626 -15238 56894 25800 184881 -186150 -7394 33185 113315
17789 113315 64646 -41290 50842 2328 80487 -93131 215071 -115714 -156783 299469 112811
17777 -217060 130492 48318 -10516 112622 36724 112663 -59967 -167858 2526 67557 189192
17766 189192 282049 128311 86492 145171 -67883 37324 -75224 -62793 -42738 88761 -90089
17754 246284 50631 -259411 -266761 -135581 214952 101365 -106305 -52255 81733 366766
17744C66766E3575J27014M08887I4813D5442b49657F3904J59183b24913A14752
17733c7541C279e2074a3615C65684A02831P3997j977k7995e3053C71839g9540
17721A22598E0647a31370A30750L3486i2797B97149J73812e7647B54299h0456
17710a52189A70338b84505A13618K82784A19964M1656h1959F20252B63967A08099
17699b21979e7423B94450f9416B63489F8903B7759J4989j4963L9631K5851o614
17688H6653J10448a67978b3857A03167M84989A05555b21250A90500A130J79063
17678A80193M8695A2295J5387G03e8866i667B76929A33703J43768m8162b38405
17666b70699H7680k2972e262A37651a96258d9194F1917L14027C6229D218d3292
$$ plain form
17744 366766 53575 180589 589476 94813 45442 -249657 63904 223087 -224913 114752
17733 -37541 3279 -52074 -13615 365684 102831 176828 174851 146856 -53053 371839 -79540
17721 122598 50647 -131370 130750 164236 -92797 297149 470961 -57647 254299 -80456
17710 -152189 170338 -284505 113618 396402 119964 161620 -81959 620252 263967 108099
17699 -221979 -57423 294450 -69416 263489 68903 27759 42748 27785 67416 93267 86653
17688 86653 197101 -167978 -23857 103167 588156 105555 -221250 190500 1130 180193
17678 180193 228888 12295 27682 703 -58866 -9667 276929 133703 277471 229309 -238405
17666 -270699 87680 64708 -5262 137651 -196258 -49194 61917 375944 36229 4218 -43292
17654d0850a7272G7814M9185o1788J01210O915b3814p2764D00385f7901r9053
17643a66954J870j55404D12137A22211h5457j3036B14974q4098L9285J69682I548
17631a18480L7330B08784k261B8731b38894B45399r6380k8635L6621R1878A03368
17619A02063K64597q5284J2305i1353C14097A38628a62965A64940B2781L36462
17609C59243j39207m6355L2774l3569a61346B22042A2131L1870a24861k5230M0745
17598a09346A96165k8735a761D01900G7730f405j10243B76453g9096G9842O0834
17587A40676B2307J80721N4501o8184d3822n0292M3364F5291b11110A39143J1784
17576A50927M0401G3053A7556J22072a39000A41968K05681A47490c0745I7425
$$ plain form
17654 -40850 -17272 77814 126999 65211 166421 173336 -23814 -96578 400385 -67901 -166954
17643 -166954 -165084 -320488 412137 122211 -85457 -98493 214974 130876 170161 339843 9548
17631 -118480 -81150 208784 206523 28731 -238894 245399 149019 120384 157005 248883 103368
17619 102063 366660 281376 293681 -91353 314097 138628 -162965 164940 22781 359243
17609 359243 220036 173681 206455 172886 -161346 222042 12131 44001 -124861 -150091 -109346
17598 -109346 196165 167430 -1761 401900 77730 -6405 -116648 276453 -79096 79842 140676
17587 140676 22307 203028 257529 189345 -43822 -94114 -50750 65291 -211110 139143 150927
17576 150927 191328 73053 17556 139628 -139000 141968 347649 147490 -30745 97425
17565C85962A64308J14579o4357R1644C7895K88458j7053a71997H5145a62829
17554A88339B4505K23679q8429J02031E0935L37643j60111I3365J45862G3150
17543A33851L99657n601A73272a54902B41848M5998l2169J4751G8529K08460j21226
17532A65763g8665B48199Q6984n8311M35813Q0775n3925L7537L57749j68107L56435
17521A323149m59151L9067l79752C6153K40862K6954M03919J18892q4029k11678
17511E31073L44665j43100K87469K33620j34960E58407j26095J7776A86950K15142
17501D02092A44361N4513J64914N6728a21065A55255J06461l2402k8673J25200
17491C25841A18200J06281m1903a17045D61815A86882J88340J65040B25317m8405
$$ plain form
17565 385962 164308 278887 214530 306174 37895 326353 309300 -171997 85145 -162829
17554 188339 24505 248184 159755 261786 50935 388578 228467 93365 239227 73150
17543 133851 533508 527907 173272 -154902 241848 287846 255677 270428 78529 286989 165763
17532 165763 -78665 248199 335183 276872 712685 793460 739535 777072 1134821 966714 1323149
17521 1323149 863998 903065 523313 36153 277015 303969 707888 826780 742751 531073
17511 531073 875738 732638 1020107 1253727 1118767 558407 432312 450088 186950 402092
17501 402092 144361 198874 363788 420516 -121065 155255 261716 229314 200641 325841
17491 325841 118200 224481 182578 -117045 461815 186882 375222 540262 225317 176912
17481A76912N1267K43481A75259J02249L6060J55678A96531a66068D06817K8357
17471D35174A11963K67848N4068j70407l4540K53393a52026F4108K34280r0208
17461B08180J89245A66655o8129M36275A98715L85089B40004c7507D61227A38004
17450B58147q4515K79574B01704P2642j03889K88558o8122j2114A75025L8670
17440B13695J20676P1433A94584M35746B92260r5235r3349B9173L76719K24257
17430F30149j83724K68592k26440N752q7320I5712C4186M74636j81166F4892K75504
17419C40396Q8105O8132J6542P9370j84533J8123d672B87924N7773p2039F5103
17407C61794D7924K42151A10800J91454G4124a34454F2911J06784K00645f2547
$$ plain form
17481 176912 228179 471660 175259 277508 313568 469246 196531 -166068 406817 435174
17471 435174 111963 379811 433879 263472 228932 482325 -152026 64108 298388 208180
17461 208180 397425 166655 98526 534801 198715 583804 240004 -37507 461227 138004
17450 258147 173632 453206 201704 274346 170457 459015 390893 378779 175025 213695
17440 213695 334371 405804 194584 630330 292260 197025 103676 29173 405892 630149
17430 630149 446425 715017 488577 494329 407009 95712 34186 508822 327656 64892 340396
17419 340396 428501 496633 513175 592545 408012 426135 -4672 287924 345697 273658 65103
17407 361794 47924 290075 110800 302254 74124 -134454 62911 169695 370340 -62547
17396B14088R3927p7108n0119C0771H51K16479n135J23722n3726J12985N5133
17385D50309A1584K15890K43647A36467o879N9230k5623G5971O4134R687J97978
17374C47770A45229b06492F8996L73372G7755a13000D73661j46772f3921B9563
17363B31953J48386j42649C5876J62663N9994E8507N4359l7957K40829j32616
17353A83122G697Q2258J73474Q3006D4487J19659J38540J07779A95298R6293K491
17342B94082j23751C3888M09911k17566K55414r0499A36348J54457r3147K15285
17332D12943A50978E4021N23166p9369B05713P8405K56114k55391K36750k36327
17322B85264L18899B60099j4512L8915J08226a64954A61588K6197J16344K2866
$$ plain form
17396 214088 308015 230907 180788 30771 851 217330 212195 335917 282191 395176 450309
17385 450309 11584 227474 471121 136467 129588 188818 163195 75971 140105 149792 347770
17374 347770 145229 -206492 68996 442368 77755 -113000 473661 326889 -63921 29563
17363 231953 380339 237690 35876 198539 258533 58507 112866 74909 315738 183122
17353 183122 7697 89955 263429 346435 44487 164146 302686 410465 195298 291591 294082
17342 294082 170331 33888 443799 226233 481647 391148 136348 290805 197658 412943
17332 412943 150978 54021 577187 497818 205713 284118 540232 284841 521591 285264
17322 285264 604163 260099 245587 284502 392728 -164954 161588 187785 304129 326995
17312C26995P4168A72038A7554B116P6479i4618C17589A05769L06766k05058h9821
17300D55160j62157J37414B8323N25340A00468N9683K03685a92897E7235g9836
17289H5303L50732q0433k3025A20796K52777A29191M11139j05474j25662n4747
17279B54447O5223G7453K63362A26801J77178j322J51841C3363M95815A46836
17268B67100J80135D9603J08403J19580N7803P0443M236j21584J29666J42326
17258E60476A83641q2958K30700J49319K7560B04320K20946m0291a8137A6827
17247C35598B5197J38710J78185a3490o3134D80092J00235j71599K2556K20810
17237F52094C25279L6361j18388K1691M2600J18783L5681A14210J43990O8595
$$ plain form
17312 326995 401163 172038 17554 2116 78595 -94618 317589 105769 412535 207477 -89821
17300 455160 293003 430417 28323 553663 100468 160151 363836 -192897 57235 -79836
17289 85303 436035 355602 332577 120796 373573 129191 540330 434856 309194 254447
17279 254447 319670 77453 340815 126801 303979 302657 454498 33363 529178 146836
17268 267100 447235 49603 158006 277586 335389 405832 410068 288484 418150 560476
17258 560476 183641 100683 331383 480702 508262 204320 425266 384975 -18137 16827
17247 335598 25197 163907 342092 -13490 -76624 480092 580327 408728 431284 652094
17237 652094 325279 361640 243252 264943 307543 426326 462007 114210 258200 326795
17227C26795J39953J47131k24326J74029P4083k51299A17540N11550C0433P1274
17217A01707L9985J04815J23978J8032O253n2444j27286J78166j24799J99670
17207D68077N7685A16520J67876j25764p1523L58187j52024l2913K64715j68366
17197C56708j71493J89486L10781B63483L77154k93188p5226l111K81105k31824
17187C18393K1689K75058j77899J3176N996Q4870O1215j72686q4283N2455J30235
17176E28219J31179K9683N9870l34407j08636k1188O8243N04301m28055J37420
17166E66629r2295J89617A73939L40288K28096j52346j00265k05639N09971l32978
17156D61066l346K50958j67449j06149J40741k19279M22204C71626J37249M903
$$ plain form
17227 326795 466748 613879 389553 563582 637665 386366 117540 629090 30433 101707
17217 101707 141692 246507 370485 388517 394770 342326 215040 393206 268407 468077
17207 468077 525762 116520 284396 158632 87109 445296 293272 260359 525074 356708
17197 356708 185215 374701 685482 263483 640637 347449 272223 269112 550217 318393
17187 318393 340082 615140 437241 450417 456413 541283 602498 429812 345529 397984 528219
17176 528219 659398 689081 748951 414544 305908 284720 352963 857264 429209 566629
17166 566629 474334 663951 173939 514227 742323 589977 489712 284073 794044 461066
17156 461066 457720 708678 541229 435080 575821 356542 778746 371626 508875 513778
17146E13778D2641N21074B14515Q8520K80353B75485I0816N09537J12282k72369
17136D40266A60024L56522Q368B43490K07063A89119M37471o8574n3820J05883
17126F10079j33467k31097M68676k08274M91965C08680J67513O7196j59758o2369
17116C21262K78800R2015p2996j47121K14695j62726N2648j6307n165j68402K7010
17105D13713L5338K10597N1512l12865M09118l44211J17379L3000N3736J0999
17095F78316J02317j23628J79000k05315j6113k4798P9287k4751L43314l38443
17085F49186B97623O13393C01301J88171L3074L35864k12699j51379Q5391N1944
17075F31667M9716K97254j93750k55588N9378K77002J47887k15244q9980J4107
$$ plain form
17146 513778 42641 563715 214515 303035 583388 275485 90816 600353 712635 440266
17136 440266 160024 516546 524914 243490 450553 189119 626590 558016 504196 610079
17126 610079 476612 245515 714191 505917 997882 308680 476193 543389 383631 321262
17116 321262 600062 692077 619081 471960 686655 523929 576577 560270 555105 386703 413713
17105 413713 449051 659648 711160 398295 807413 463202 580581 613581 667317 678316
17095 678316 780633 657005 836005 630690 614577 589779 669066 644315 987629 649186
17085 649186 297623 911016 301301 489472 522546 858410 645711 494332 579723 631667
17075 631667 681383 978637 784887 529299 588677 865679 1013566 798322 708342 722449
17065G22449k00667M24781o9569J86461l16345K21390l19441Q342q569K98679
17055I47511j96298Q5797k85588M71305m78688O43654l12620n4758L0334j02686
17045G47963J23031j45402k14801L22264J90624j40120n6425J73413j31911n222
17035H63414K16583M103l39786J42406o1227j2335K9339K26198j53312K09259
17025A124642l59957K9737M01119l44540K75347m63953L58928j14850K54498m11760
17015G49211L71119M1139k16058R1815n1227m1342J62005j11675J0304J6417j90703
17004H31005N91016l33196N2899K1065J15521K17554m86427L54957k5100K313
16994A341607J32977o06321L60498L264j89430M14675n1592j67680k5500L68474
$$ plain form
17065 722449 521782 946563 876994 1063455 747110 968500 649059 657401 648832 947511
17055 947511 751213 837010 551422 1022727 544039 1187693 875073 820315 850649 747963
17045 747963 870994 725592 510791 833055 1023679 883559 827134 1000547 868636 863414
17035 863414 1079997 1084100 744314 886720 825493 813158 842497 1068695 915383 1124642
17025 1124642 764685 794422 1195541 851001 1126348 662395 1021323 906473 1160971 749211
17015 749211 1120330 1161469 945411 1037226 985999 944657 1106662 994987 1005291 1021708 831005
17004 831005 1422021 1088825 1141724 1162789 1278310 1495864 1009437 1364394 1339294 1341607
16994 1341607 1474584 868263 1228761 1232025 1042595 1457270 1405678 1237998 1212498 1580972
16984A580972m26654L21834m28010K88833j37010N5425k18738K99050J32107k84613
16974A183196K42222k88077L07123p9972j38247J49817K38433n1272j64698O7958
16964A466483K36273p5889j19539l8677K39121k56106J61155k11023K68405m523
16954A665680p5617J033m2484P3026K94113j60191j41935R9020K60960j97723
16944A775882l02709K30724p3934K58777J1340k09271K21581j41798P6871k5312
16934A822151J36824L2029k17412K79360j00799J80569N3421j61462j6573J047
16924B009155K55070k28960K36000j97444K45057l04308K80076o3798k71224L88053
16914B347677m4792p3208K60466J53109m43387J61608M2012R3003M92068p54986
$$ plain form
16984 1580972 1154318 1476152 1048142 1336975 1199965 1255390 1036652 1335702 1467809 1183196
16974 1183196 1425418 1137341 1444464 1364492 1226245 1376062 1614495 1563223 1398525 1466483
16964 1466483 1702756 1626867 1507328 1468651 1707772 1451666 1612821 1401798 1670203 1665680
16954 1665680 1590063 1591096 1548612 1621638 1915751 1755560 1613625 1712645 1973605 1775882
16944 1775882 1473173 1703897 1629963 1888740 1900080 1690809 1912390 1770592 1847463 1822151
16934 1822151 1958975 1991004 1773592 2052952 1952153 2132722 2186143 2024681 2008108 2009155
16924 2009155 2264225 2035265 2271265 2073821 2318878 2014570 2294646 2230848 1959624 2347677
16914 2347677 2302885 2229677 2490143 2643252 2199865 2361473 2403485 2496488 2988556 2233570
16904B233570N18008l59734J42628m4085p7392j9598J59125K52816k3066l89009
16894B393263N67172k44537P5606K48364l01366K56368J5132R9871j09183N2597
16884C053287K07060J2262j88372L99004k86726L45742j25810l6981K61111j80951
16874C459626M4016k7244J4313R3428R2787j9676L94153k41884L01392M2718j19508
16863D034121J59264j55732M6136L53341m31216O10176k06694K4290K71783l5450
16853D670019M0257k2424L20705j77629q090J65972K30471L03190k49003J48971
16843E422439p1995M1641L08810K00031j03187J30782J87005K3266J06221K332
16833F247345L19481Q7153j1876K59675K22726R310J18043m58628P40742j44602
$$ plain form
16904 2233570 2751578 2391844 2534472 2490387 2412995 2393397 2552522 2805338 2782272 2393263
16894 2393263 2960435 2715898 2791504 3039868 2738502 2994870 3010002 3109873 3000690 3053287
16884 3053287 3260347 3272609 3084237 3483241 3196515 3542257 3416447 3379466 3640577 3459626
16874 3459626 3503642 3476398 3490711 3584139 3676926 3657250 4051403 3809519 4110911 4153629 4034121
16863 4034121 4193385 4037653 4083789 4437130 4005914 4616090 4409396 4433686 4705469 4670019
16853 4670019 4710276 4687852 5008557 4830928 4822838 4988810 5219281 5522471 5273468 5422439
16843 5422439 5350444 5392085 5700895 5900926 5797739 5928521 6115526 6138792 6245013 6247345
16833 6247345 6566826 6653979 6642103 6901778 7124504 7133814 7251857 6793229 7533971 7389369
16823G389369o2440L92460M28084l05142K77004L8019L66138K62658k54319L01262
16813H833093J48487K74686L61808J11218k4885L36663K58131K38967N11915l1618
16803A1018465J22360K66109J99637N04152J14463J53642O97800M34234m28404
16794A3082458L87682L65079P05526K54341P4042R09315p9468O18242L81336O32639
16784A7331192J23434P04752M15628M49280M09108M66415P74696Q15295N43285
16775B2033085R03658K03106J008624L07959R25913L46285J529740P10009N23018
16766B8491397J016474Q77943J225464R25682J426118O21136J587244J076866
16758C7248324J402221J211471J314003J564713J895209J196299J528385K313373
$$ plain form
16823 7389369 7326929 7719389 8147473 7842331 8119335 8157354 8523492 8786150 8531831 8833093
16813 8833093 8981580 9256266 9618074 9729292 9704407 10041070 10299201 10538168 11050083 11018465
16803 11018465 11140825 11406934 11606571 12110723 12225186 12378828 13076628 13510862 13082458
16794 13082458 13470140 13835219 14540745 14795086 14869128 15778443 15698975 16317217 16698553 17331192
16784 17331192 17454626 18159378 18575006 19024286 19433394 19899809 20674505 21489800 22033085
16775 22033085 22936743 23139849 24148473 24456432 25382345 25728630 27258370 27968379 28491397
16766 28491397 29507871 30385814 31611278 32536960 33963078 34584214 36171458 37248324
16758 37248324 38650545 39862016 41176019 42740732 44635941 45832240 47360625 49673998
16750D9673998J385221K074677J968597J767135K426819K035731K153488K316775
16742F5802441K299861K791107K088716L069843K591650K395378K565252K638231
16734H6242479K829395K409980L035142K229423K135658K639143K043005J797237
16726A05361462J964452J376290J286882J384043Q86064K81413K18254k3350o24030
16717A12111480k10573j095844j477676j465814j258964k136795j947165k557945
16709I9960704k242209k373658k484110k832509k528659k802032k243395k814334
16701G9639798k615454k739224k539922k547427k412682k433969k239767k255720
16693E9855633k237137j890674k019656j704691k191784j676922j599962j738663
$$ plain form
16750 49673998 51059219 53133896 55102493 56869628 59296447 61332178 63485666 65802441
16742 65802441 68102302 70893409 72982125 76051968 78643618 81038996 83604248 86242479
16734 86242479 89071874 91481854 94516996 96746419 98882077 101521220 103564225 105361462
16726 105361462 107325914 108702204 109989086 111373129 112259193 112540606 112758860 112735510 112111480
16717 112111480 111900907 110805063 109327387 107861573 106602609 104465814 102518649 99960704
16709 99960704 97718495 95344837 92860727 90028218 87499559 84697527 82454132 79639798
16701 79639798 77024344 74285120 71745198 69197771 66785089 64351120 62111353 59855633
16693 59855633 57618496 55727822 53708166 52003475 49811691 48134769 46534807 44796144
16685D4796144j849790j086758j519103j860090j030737j160237j309000j121160
16677C3859269j375837p93730j098945j201198p19312p81550j045536n98654j119102
16668B5125405o03715p12671q30104p07187p65712l38759m05884r80721n35265
16659A9245387o78740l68428j49367o84011o66668j33806n28489l66278n88762
16650A5080838j93579m71820j99953n89131J75886q12117k01795j88439j96545
16641A2403345n76254j78454k67503J6400n21033q2335O4679n93135k30421m69750
16631I565539n9549P843J12208m53197m03775K08103k16569n60364L8408j00935
16621H137712k40569n4399l8757n32299J05895j84895l72502J86809j02420j97639
$$ plain form
16685 44796144 42946354 41859596 40340493 38480403 37449666 36289429 34980429 33859269
16677 33859269 32483432 31689702 30590757 29389559 28670247 27888697 26843161 26244507 25125405
16668 25125405 24521690 23809019 22978915 22271728 21506016 21167257 20761373 19780652 19245387
16659 19245387 18566647 18198219 18048852 17364841 16698173 16564367 16035878 15669600 15080838
16650 15080838 14887259 14415439 14215486 13626355 13802241 12990124 12788329 12599890 12403345
16641 12403345 11827091 11648637 11381134 11397534 10876501 10794166 10858845 10265710 10035289 9565539
16631 9565539 9505990 9513833 9626041 9172844 8769069 8977172 8760603 8200239 8238647 8137712
16621 8137712 7897143 7842744 7803987 7271688 7377583 7192688 6820186 7006995 6904575 6706936
16611F706936k86956j93346r3243L01093j03638l29510j28972j62618J13432k23523
16601E599655M7854l74332k1089J84136k89042p2803n2236k40027n3374o2348
16591D666394K1022j28535j23573L02158m33426N2157p691K60454p32475R5891
16581C972376K48519m13963j25700N6204L55497l44484k4160J27684k59326n9746
16571C532901j03192L38750o2174k95947L4383k47407J40466m26960J29026q6897
16561B952949K10477j04690j83484K77359j38381M5426j21891K61134k21303Q4309
16551C061905k03415l10938N0909J14871k03318K15613k94130J90522k01604L69884
16541B790299m12200Q0091L88496l19079r0289l18391L02022j77258J4960m1289
$$ plain form
16611 6706936 6419980 6226634 6133391 6434484 6330846 6001336 5872364 5709746 5823178 5599655
16601 5599655 5647509 5273177 5252088 5436224 5147182 5074379 5022143 4782116 4728742 4666394
16591 4666394 4687416 4558881 4435308 4737466 4304040 4356197 4348506 4608960 3876485 3972376
16581 3972376 4220895 3806932 3681232 3737436 4092933 3748449 3724289 3851973 3592647 3532901
16571 3532901 3429709 3768459 3706285 3410338 3444721 3197314 3337780 2910820 3039846 2952949
16561 2952949 3163426 3058736 2875252 3152611 3014230 3059656 2937765 3198899 2977596 3061905
16551 3061905 2858490 2547552 2598461 2713332 2510014 2725627 2431497 2622019 2420415 2790299
16541 2790299 2378099 2458190 2846686 2527607 2437318 2118927 2420949 2243691 2258651 2217362
16531B217362j73807K90967k13197J88374q6678l78972M64426n7238l25560j60378
16521A765299N39504J9517l96147R6037k59843R6688J03800k75867K90302l28278
16511A651012J09947L7162K09932p9311k54703k19752J56789J55515k04666J06383
16501A668308J30905j6910o00351K0716P79321k21788j94956j55802L27310n5745
16491A681008m5342o8396j4340k70575L83085k06919l22801N32291l03860J22940
16481A487091J27249n10905K74121l922N7673l82799K1750J52611K29371k20055
16471A232185K68849k52931J99113k79816N4594N22975l39655n17711M60999o6954
16461A281648K00134l76122J7901J39419l01228J98075P5759k00123O1841n124
$$ plain form
16531 2217362 2043555 2334522 2121325 2309699 2223021 1844049 2308475 2251237 1925677 1765299
16521 1765299 2304803 2324320 1928173 2024210 1764367 1861055 1964855 1688988 1979290 1651012
16511 1651012 1760959 1798121 2008053 1928742 1674039 1454287 1611076 1766591 1561925 1668308
16501 1668308 1799213 1782303 1181952 1202668 1981989 1760201 1565245 1409443 1736753 1681008
16491 1681008 1635666 1567270 1552930 1282355 1665440 1458521 1135720 1668011 1364151 1487091
16481 1487091 1614340 1103435 1377556 1373634 1431307 1048508 1070258 1222869 1452240 1232185
16471 1232185 1501034 1248103 1447216 1167400 1221994 1744969 1405314 887603 1348602 1281648
16461 1281648 1481782 1105660 1123561 1262980 961752 1159827 1235586 1035463 1097304 1092180
16451A092180J82672r15l69676K11281K06997k62264m891j79401K88098m08375
16441G55706L18403m67336O37102j46087K8778k87463L23899k51150N1847J76011
16431A139710k98232R4101q303L7523l18277J67074J33405j56953J49674J59505
16421A099227k20100k56144M00907j93672J38288k58200p374K25070k33016L31539
16411A026525j82055j87457K01109Q2835q3875P2671p2125m9425M0825n4818P0787
16400H64997j27607k1221p8792K99358M5022l72120r7880L35495j09052k00986
16390E37214J56272J70228k46557L8617C11462J34041K51455k14016L25771J83445
16380I92158D68732K76231R7170l35544P4556J09612k50021K59842L9410q5249
$$ plain form
16451 1092180 1274852 1273937 904261 1115542 1322539 1060275 1055384 875983 1164081 755706
16441 755706 1074109 606773 1243875 1097788 1126566 839103 1163002 911852 963699 1139710
16431 1139710 841478 935579 927276 964799 646522 813596 947001 790048 939722 1099227
16421 1099227 879127 622983 1023890 830218 968506 710306 702932 928002 694986 1026525
16411 1026525 844470 657013 858122 940957 857082 929753 857628 808203 849028 794210 864997
16400 864997 737390 716169 637377 936735 981757 609637 511757 847252 738200 537214
16390 537214 693486 863714 617157 655774 311462 445503 696958 482942 808713 992158
16380 992158 468732 744963 842133 506589 581145 690757 440736 700578 739988 654739
16370F54739R4221Q7214o3627j92302B27538K74957k478N5988J43877j28055k4131
16359E47696K4513J58903B13246O14821l84008L03289N4532C65141M2596P999
16349D15736M56807C71760J44240j32446A8630M87267K22208k16887P7704B84531
16338E40073l1972J27241B87098J43289J17812n3199J88277N8834k06733Q4169
16328F19547J6213B99997J77192K80815C69734K43876B54490N6230K49908q3192
16318D77436k21580J89740p4124M34979l70904Q0687n4692J72725j3391E4940
16307E96057q3517N7151j14201J3133J47903j99548A94397J71100K81841B54831
16296C48861I7164N04435j44099m3602j37740j04565J39002J9589K53391j76491
$$ plain form
16370 654739 748960 836174 772547 580245 227538 502495 500017 556005 699882 571827 547696
16359 547696 572209 731112 213246 828067 444059 747348 801880 365141 407737 415736
16349 415736 872543 371760 516000 383554 18630 505897 728105 511218 588922 284531
16338 540073 508101 635342 287098 430387 548199 495000 683277 742111 535378 619547
16328 619547 635760 299997 477189 758004 369734 613610 254490 310720 560628 477436
16318 477436 255856 445596 371472 806451 435547 516234 461542 634267 620876 54940
16307 596057 512540 569691 455490 468623 616526 416978 194397 365497 647338 254831
16296 348861 97164 601599 457500 413898 276158 171593 310595 330184 583575 407084
16286D07084r6316J62647j18756j06604L61727k27526j12084m1678J29172l1929
16276C25737J56929J59329k32418r9786K21006B59175R9359m6282l385A10500
16265C97593K22758k97721Q4612j38372J71702j31229m9728Q5185A40043L43228
16255D83271Q539A17379K4733K30100A22977g603C40024G4554J13607q6607L33688
16244D35242k11576K33000j76427b2509B42326O0415A04727J05142O8179L56190
16234F34238j10501k43065F677J82408L9762J6823A21415l70L78482k1975A38272
16222B21402K37016A43649K71394q3827q8800H9897B2498K2680J57390c9660A73330
16210H1771g5658D32523j91653L06562B26765J47703l4193R3135G0180l264M25946
$$ plain form
16286 407084 310768 473415 354659 248055 609782 382256 270172 228494 357666 325737
16276 325737 482666 641995 409577 309791 530797 259175 358534 312252 308867 110500
16265 397593 620351 322630 407242 268870 440572 309343 259615 344800 140043 483271
16255 483271 491810 117379 142112 372212 122977 -7603 340024 74554 188161 101554 435242
16244 435242 223666 456666 280239 -22509 242326 302741 104727 209869 278048 634238
16234 634238 523737 280672 6677 189085 228847 245670 121415 121045 499527 477552 138272
16222 221402 458418 143649 415043 331216 242416 89897 22498 45178 202568 -39660 173330
16210 81771 -75658 432523 240870 547432 226765 374468 340275 433410 70180 66916 492862
16199D92862j77405p4426j00191a77346A04835K0709J90267m4213K26834G7475
16188B05893G6813M76986A73411L27861a04365B00781J52840r4721A04627Q1283
16178A85910P0344j2651j04276J70699L7033F7688a629B90554D5937K39935p0713
16167B15159q2666R8393K26985d7324A10242J32613I5323c4249h904A48754O14482
16156G63236d4585B49737J25908K9128c52263A83481b62616A46142L7291H6528
16145a07652A82588b56514a2618p7740C06568C8079L14662A30356r997K00338
16135C20697d1109E42694B01547b338C33466a16295A82198a68101E7424J11445
16125A68869f9679C22986N5007h0534k3089C92588J15734A72N3222M5802R7380
$$ plain form
16199 492862 315457 241031 140840 -177346 104835 125544 315811 271598 498432 77475
16188 205893 76813 553799 173411 501272 -104365 200781 353621 258900 104627 185910
16178 185910 256254 243603 139327 310026 347059 67688 -1629 290554 45937 285872 215159
16167 215159 132493 230886 457871 -47324 110242 242855 95323 -34249 -8904 148754 763236
16156 763236 -44585 249737 375645 404773 -352263 183481 -262616 146142 183433 86528
16145 -107652 182588 -256514 -12618 -90358 306568 38079 352741 130356 120359 320697
16135 320697 -41109 542694 201547 -2338 333466 -116295 182198 -168101 57424 168869
16125 168869 -69679 322986 377993 -80534 -103623 392588 508322 172 53394 99196 196576
16114A96576g984C18762c61032D47781A07617P1453K9684b02676d7637j18006
16104a65643I5020N549e3342a6402A42550k7390l7142r025J54922a01174a0179
16092A73943H2811R2208O8492A17550d4640j146L50j86114i1156A07306m3456
16081F3850b7221I9613m046a0756A22854J06655a0169m02280J29796B02370m2851
16070A59519c01985C7739J10623k0919l6793a6869j07173B83554h6773a9370A3924
16058I7617m694a06199c2119A62197j3091J34421C9096M5434O2893K6305b73127
16046a06582H9146a82248f3274b4026A56392M9478a36414i438j38885D5244K07853
16035B53097C7247K9253B1974b27888B94199a24668I398K74041H0243b6286E21
$$ plain form
16114 196576 -7984 318762 -361032 447781 107617 179070 208754 -202676 -47637 -165643
16104 -165643 95020 100569 -53342 -16402 142550 115160 78018 68993 223915 -101174 -10179
16092 173943 82811 175019 243511 117550 -44640 -45786 -45436 -231550 -91156 107306 63850
16081 63850 -27221 99613 95567 -10756 122854 229509 -10169 -412449 -282653 202370 159519
16070 159519 -301985 37739 148362 127443 90650 -16869 -124042 283554 -86773 -19370 13924
16058 97617 92923 -106199 -32119 162197 149106 283527 39096 84530 147423 173728 -273127
16046 -106582 89146 -182248 -63274 -24026 156392 205870 -136414 -9438 -148323 45244 253097
16035 253097 37247 66500 21974 -227888 294199 -124668 9398 283439 80243 -26286 521
16023D29963c4148j3503D04992a015j21682c2336m4609A36065k302o0184a18121
16011G518a4454A05049D1304r105R5120O9176G6601K5388L3235b1711C4327N3890
15999H8217c5886A4962J43769E0974h9196A33633k0577a5805j36232C4219J21906
15988A56125M02305r8733J89395N25631p9505j587j09744k43288j01198j72026
15978D67375G3084J30493m1034K43221D0142L0398J30331g3406r9103O8117g450
15966B43031b74517C6648c10288f9459A81729B3928L28644a6533k4315A78188
15955b02365B62350A19006b12360A89244m4162J03447j05838F3566K44581A17050
15944C7689J64731c30678G1435c30111R1676B50640a01316o1640B10162h7419
$$ plain form
16023 429963 -34148 -47651 404992 -1015 -122697 -32336 -76945 136065 133763 73579 -118121
16011 7518 -14454 105049 41304 32199 127319 196495 76601 101989 135224 -21711 34327 88217
15999 88217 -35886 14962 158731 50974 -89196 133633 113056 -15805 -152037 34219 156125
15988 156125 558430 459697 649092 1174723 1095218 1093631 983887 740599 639401 467375
15978 467375 73084 203577 162543 405764 40142 70540 200871 -73406 -172509 -104392 -7450
15966 243031 -274517 36648 -310288 -69459 181729 23928 352572 -16533 -40848 178188
15955 -202365 262350 119006 -212360 189244 145082 248529 142691 63566 308147 117050
15944 37689 202420 -330678 71435 -330111 -238435 250640 -101316 -162956 210162 -87419
15933i2054B62093b04898f9629l0570j03662b4099j93602b1160E6502a15102A75446
15921a02804a8760j31130A09577a84536Q5356a4856A6497P4605d5843o5775H3242
15909E0263p856L5908C4883j4715M0478a80573A86135J92959D8211i687j10542
15898a20229D1158N7349a65177j46769J47739Q0906J0801q6230b8710n1240C00409
15886B46365A15410a21292D95970E4213B3495O5666l1M003d5168A18592h6337
15874b64791c4066D3701h791C12907f1405A04600R4753L0008l9121c35193J58353
15863a76840E8271k5665a37374K2133d911k66650B97823B3126b28188B79278b10903
15851c7355a2524B69017e2223A70699a32520F9839e04k91627A02993J64254a32044
$$ plain form
15933 -92054 262093 -204898 -69629 -100199 -203861 -24099 -217701 -21160 56502 -115102 175446
15921 -102804 -18760 -149890 109577 -184536 -99180 -14856 16497 91102 -45843 -111618 83242
15909 50263 42407 78315 34883 20168 60646 -180573 186135 379094 48211 -9687 -120229
15898 -120229 41158 98507 -165177 -311946 -164207 -83301 -72500 -158730 -28710 -79950 300409
15886 246365 115410 -121292 495970 54213 23495 89161 89130 93133 -45168 118592 -86337
15874 -264791 -34066 43701 -8791 312907 -61405 104600 199353 229361 190240 -335193 -176840
15863 -176840 58271 32606 -137374 -115241 -4911 -271561 297823 23126 -228188 279278 -210903
15851 -37355 -12524 269017 -52223 170699 -132520 69839 -504 -292131 102993 267247 -132044
15839d1280A2423L0053f7222j0403E3415d9144C1189R3573A0583J81359A4964
15827a07015G0391c42935A23724L1790f3368g290k71726B16000P3781b1034o8317
15816h9351H9256e5518l3442D8959O0670B2521a24704l84643a96028F7642b87475
15804e6359B43446a37276A23332J31661b01813A56735b06765c945j9892j42515
15794a66352A94531k4265a46112G3785a23401C72709a59803B06321O7707A11469
15783d9837A7551R6959b04570F8580a51367B06370o6744b0685j47596e1250a6401
15771e2589o9773L6397l0388j6538M4498A02120a83464A459J7034b7454a2553
15759a22751j78489F9719k8016J2521O2177J03411m057h3035o7258A92058b38016
$$ plain form
15839 -41280 12423 42476 -67222 -77625 53415 -49144 31189 124762 10583 191942 14964
15827 -107015 70391 -342935 123724 155514 -63368 -7290 -279016 216000 289781 -21034 -89351
15816 -89351 89256 -55518 -88960 48959 109629 22521 -124704 -509347 -196028 67642 -287475
15804 -56359 243446 -137276 123332 254993 -201813 156735 -206765 -3945 -23837 -166352
15794 -166352 194531 170266 -146112 73785 -123401 372709 -159803 206321 274028 111469
15783 -49837 17551 114510 -204570 68580 -151367 206370 139626 -20685 -168281 -51250 -16401
15771 -52589 -122362 -85965 -116353 -132891 -88393 102120 -183464 1459 18493 -27454 -12553
15759 -122751 -301240 69719 41703 54224 116401 219812 215755 -83035 -150293 192058 -238016
15747D2434O8024B4393L9633L7214J34388J1264A22498a33268o3114A4608L5786
15736E0394b87635J38685k2340f900j85906B12406a69551D1445a72963D04949
15725f7269k4574B7594a58810f9646A60915c2769G1651b1882p2041A0084i8589
15713c67k17163C44366M4991H6242a49997d6529A14237e3569A66515a86110A08185
15701b14949A12923i5366D66166b0456j35499D7399f1278B82530C2279a61079
15690C64608G0063B516J68597m8803c77910A44238d4465k37267e0726A9671K12339
15679B32010a89715k1406A85434m7793C0634J77765c47985B54804H8687J87868
15669B76555A28796J59023e9279j87165A11251a35236a2831h01l18638d4375H4760
$$ plain form
15747 42434 110458 24393 64026 101240 235628 246892 122498 -133268 -196382 14608 50394
15736 50394 -287635 -148950 -171290 -6900 -192806 212406 -169551 41445 -172963 404949
15725 -67269 -91843 27594 -158810 -69646 160915 -32769 71651 -21882 -93923 10084 -98589
15713 -367 -217530 344366 389357 86242 -149997 -46529 114237 -53569 166515 -186110 108185
15701 -214949 112923 -95366 466166 -20456 -155955 47399 -61278 282530 32279 -161079
15690 364608 70063 2516 171113 122310 -377910 144238 -44465 -281732 -50726 19671 232010
15679 232010 -189715 -211121 185434 137641 30634 208399 -347985 254804 88687 276555
15669 276555 128796 287819 -59279 -246444 111251 -135236 -12831 -801 -319439 -44375 84760
15657c9869j03337j60324E2248i9155D8954d2893a6902A90821c3362H4658C1212
15645A67336R3389a73195D62808a34858A57576c60026a10907B9966a05554I5562
15634H3862f3929C2333P0957J23632e7149k36217A05554L7024c06152H5722b1280
15622b06043j33794A14202a70498h2681A22364b58734c0854A87827a38844k64175
15612d03019A30015i1621C00541e143J744A19029E6681a94031A9293K4844a96580
15600F8392a76776d6155A03002b27140h5437A98323c32722E5260A9927e481j4980
15589b0461k45521b5974B03132j0675a62933B48388a33330G4057a2504j84006
15579a96510K700O6036K135K8121K6902o2746K4806B40644i9593n4432k9530a6739
$$ plain form
15657 -39869 -143206 -303530 52248 -99155 48954 -42893 -16902 190821 -33362 84658 31212
15645 167336 260725 -173195 462808 -134858 157576 -360026 -110907 29966 -105554 95562
15634 83862 -63929 32333 103290 226922 -57149 -293366 105554 142578 -306152 85722 -21280
15622 -206043 -339837 114202 -170498 -82681 122364 -258734 -30854 187827 -138844 -403019
15612 -403019 130015 -91621 300541 -5143 -3399 119029 56681 -194031 19293 44137 -196580
15600 68392 -176776 -46155 103002 -227140 -85437 198323 -332722 55260 19927 -5481 -20461
15589 -20461 -265982 -25974 203132 192457 -162933 248388 -133330 74057 -12504 -196510
15579 -196510 -193810 -127774 -125639 -97518 -70616 -133362 -108556 240644 -99593 -154025 -183555 -16739
15566I0566e2516n09k39026J18213C06604G9636b15851e9246A246J57009b55934
15554b71263c9853j77947D6572J26962a07133D49425A11378j980a00466G7069
15543A75407a68170M0557D3368i7557c7507A38587j8577a47212M5425o5872F9787
15531a48987d9158A72701j60J21286A10464P4957n6189M7687G6645K13103a21317
15519a57839g0028A59714o8940n033B2646a4815B30785j06900J53920I6317K35553
15508C31870j00829H2270N5221K7467C1405N95094B29511o2229b5037B72089A32336
15496b12465A78195e7521B06151D8202K62007c8634j07539j39191E63281D8308
15485b9188C37528b34615B78098j14940e1199A55276a20235H1942J43536l9426
$$ plain form
15566 90566 -52516 -53025 -292051 -173838 306604 79636 -215851 -59246 1246 158255 -255934
15554 -271263 -39853 -217800 46572 173534 -107133 449425 111378 109398 -100466 77069
15543 175407 -168170 -127613 43368 -97557 -37507 138587 120010 -147212 -101787 -167659 69787
15531 -148987 -49158 172701 172541 293827 110464 185421 129232 176919 76645 289748 -121317
15519 -157839 -70028 159714 90774 85741 22646 -14815 230785 123885 277805 96317 331870
15508 331870 231041 82270 137491 164958 31405 626499 229511 167282 -25037 272089 132336
15496 -212465 178195 -57521 206151 48202 310209 -38634 -146173 -285364 563281 48308
15485 -29188 337528 -234615 278098 163158 -51199 155276 -120235 81942 225478 186052
15475A86052J57606L33530J47218j25959o2622B97367q1304m3008b6486A59818
15464b3523k94250J37045k7611Q0605E0553G544J24695J54017a08356d3963A2268
15452f7463j38713d4130C780J83516M7166c3205j22738D9245J0870K36305L87307
15441F83727J72385L52651j18816j03680D72099A98046a68542b3937j1049D08261
15430A7296M1524J0053Q7591a09157F743J65117i6195B86453f4812A06623c1786
15418a78085C1385J72462a05462C95535A19799g256A48619d30679a95988C5640
15407A10629J20897i668D38780A87178c142A38920J64210E8078b87642f4797G3139
15395f8451B18731i7030G3122i037A51788b17297B15909r4833a62343C96325C3104
$$ plain form
15475 186052 343658 677188 824406 698447 635825 297367 216063 173055 -26486 159818
15464 -23523 -317773 -180728 -208339 -127734 50553 7544 132239 286256 -108356 -43963 12268
15452 -67463 -206176 -44130 3780 187296 234462 -33205 -155943 49245 60115 296420 683727
15441 683727 856112 1208763 1089947 986267 472099 198046 -168542 -23937 -34986 408261
15430 17296 58820 68873 156464 -109157 6743 171860 -96195 286453 -64812 106623 -31786
15418 -178085 31385 203847 -105462 395535 119799 -7256 148619 -430679 -195988 35640
15407 110629 231526 -9668 438780 187178 -3142 138920 303130 58078 -287642 -64797 73139
15395 -68451 218731 -97030 73122 -9037 151788 -217297 215909 121076 -162343 396325 33104
15383C75867i6194B5498c8755A97724a43332H1260J72471j20678E5632J86098
15373B41730r4473Q1970E302K32189o8381G2356a33924A06068P6948e8422D3668
15361A86526O425A0122J34182L36205B28466o6500m5494E4093a12859C80812m9446
15350C31366H3480J67761j11786R0891P1502o8993I9274K14936K80729j59333
15340D35606j56022n4264j6884O631A8973J22423J04848g6374B01795E1797L83683
15329D35480j79729N3475a37652B85686b4517H2596p473J00316D6732a6982j72824
15318a89806A45869F2755a71429A10812L69250B00681a2389A08781J0978J97146
15308C16905j1181E2574d244A06989M1252a05496r3401A2176M7237A3163K62249
$$ plain form
15383 375867 -96194 25498 -38755 197724 -143332 81260 253731 133053 55632 241730
15373 241730 147257 229227 5302 237491 169110 72356 -133924 106068 183016 -58422 43668
15361 186526 192951 10122 144304 480509 228466 161966 116472 54093 -112859 380812 331366
15350 331366 83480 251241 139455 230346 301848 232855 99274 314210 594939 435606
15340 435606 279584 225320 208436 215067 18973 141396 246244 -76374 201795 51797 435480
15329 435480 255751 309226 -137652 285686 -24517 82596 75123 175439 46732 -16982 -189806
15318 -189806 145869 62755 -171429 110812 480062 200681 -12389 108781 119759 316905
15308 316905 305724 52574 -4244 106989 148241 -105496 -198897 12176 59413 13163 275412
15297B75412C1482g7387C0220j644a11255J0427C53711a79103E0226Q178a71835
15285a24102B05507d90280A64169c3267D4568J41984F7655K44364j09129q1690
15275A21200b22226j229f4530A11550c7962k79294B06325M4301B7358J55685d0042
15263A81218q0063c34481F5902b02799B22195b14292B48238b85471i8755E8061
15252A3208h1909k61242B15611E4891f8085D9931K47419j5256g7559C16247N88746
15241I04993R02794M3597j21677J35268n54069C66256J763o3598F7773b69550
15230A1578d32541A01279B2357e4912j92159C10334A27363o007H149g016D1798
15218D8034a22836A51008o0263a55130a8446j52696A79699H2772M445c03347A65301
$$ plain form
15297 275412 31482 -77387 30220 28576 -111255 -100828 353711 -179103 50226 58404 -171835
15285 -124102 205507 -490280 164169 -33267 44568 186552 67655 312019 202890 121200
15275 121200 -222226 -223455 -64530 111550 -37962 -317256 206325 250626 27358 183043 -40042
15263 181218 101155 -334481 65902 -202799 222195 -214292 248238 -285471 -98755 58061
15252 13208 -81909 -343151 215611 54891 -68085 49931 297350 282094 -77559 316247 904993
15241 904993 1807787 1851384 1729707 1864975 1310906 366256 368019 304421 67773 -269550
15230 11578 -432541 101279 22357 -54912 -247071 310334 127363 121356 8149 -7016 41798
15218 48034 -122836 151008 90745 -155130 -18446 -171142 179699 82772 87217 -303347 165301
15206C60324A69250K09453j31248c3295J0734j08707A88105d2740a7724B51519
15195H7193D0499g028D3166N1277l0274b34067j7453A30714K09912g4311A07641
15183A06257J14060c69149d6276F1344e9526p1926A33980J17257m8521A2046a06773
15171A43581m9096K55178E1749l031J89042a47148A09919J77683F4887k9236a90210
15159b0797B1599d9804C5835J40912a97734C1183J84544A07166a7412A44142N6654
15148B00796a10219A8622O680a72378I4408K20302A55172f3912B01213j00590
15138A00623c2922o7251M0473D16207H0123J79543k340e4106A75954E465c9591
15126A46974L5285J89549H9386C6697d1710n8859C58017K7294J88981A95345K70186
$$ plain form
15206 360324 169250 378703 247455 -33295 -22561 -131268 188105 -42740 -17724 251519
15195 87193 40499 -7028 43166 94443 64169 -234067 -251520 130714 340626 -74311 107641
15183 106257 220317 -369149 -46276 61344 -59526 -131452 133980 251237 202716 12046 -106773
15171 143581 94485 349663 51749 48718 237760 -147148 109919 287602 64887 35651 -190210
15159 -20797 21599 -49804 35835 176747 -197734 31183 215727 107166 -17412 144142 200796
15148 200796 -110219 18622 25302 -172378 94408 314710 155172 -63912 201213 100623
15138 100623 -32922 -100173 -59700 416207 80123 259666 257326 -54106 175954 5465 -39591
15126 146974 182259 371808 89386 36697 -41710 -100569 358017 385311 574292 195345 465531
15115D65531G2254K45135E1294K12146C527L33866c3239m3226B26779b1139q7065
15104a08204A76754c4407A99612n6440A4856J57862j4345K92456A89995d5276
15093G5264O7686K28466C1871a4025D05872j39405D8095O3103L34944D3224J4927
15082E8151K39294A02812L4995B4820K16270O7924j18847L12346j63187B4258
15071e1795E698J26998d3981j1312j42497d2594B13220A4735K39374I6655K94744
15060C91399A47593M76043A80646J54328A32668J79066G0935J24878H3520J1011
15050I4531J90644J72168j96736j03849J12645L85189A99757J00296G8935J23511
15040B02446k093K55463q2677H4378K74936N5020o7644m3973m5620K72652q3382
$$ plain form
15115 465531 72254 317389 51294 263440 3527 337393 -33239 -76465 226779 -21139 -108204
15104 -108204 176754 -34407 199612 143172 14856 172718 158373 450829 189995 -45276
15093 75264 142950 371416 31871 -14025 405872 266467 48095 111198 446142 43224 58151
15082 58151 297445 102812 137807 24820 241090 309014 190167 502513 339326 24258
15071 -51795 5698 132696 -43981 -55293 -197790 -42594 213220 14735 254109 96655 391399
15060 391399 147593 623636 180646 334974 132668 311734 70935 195813 83520 94531
15050 94531 285175 457343 260607 156758 269403 654592 199757 300053 78935 202446
15040 202446 200353 455816 373139 84378 359314 414334 346690 302717 257097 529749 446367
15029D46367P4577N63107E39208K17327k04934A72614l6137K01597K6731K3539
15019C88344L30047l13086J97985L6259j40023k40467K14743q6685j61090L6425
15009B62452N636M42095B24183R1409P1689d7135C22845j31r8252J12540J4898
14998C51900K92918K5964C27682P6084O2702B26820K04879m6421p1527P5902M15046
14987H04699B89836J95920K56508j6484j62738J7412J45973J46410M362k58048
14977F19151l06058J20790j40351L42561A99875L16731J60943p2007J07377j06458
14967F06461j48660A26334K47515Q740Q0009j44715K93578j19692O187j90334
14957C07622c14532B77377m1027K44828A20636N7959n1376P8511P3135K23204
$$ plain form
15029 446367 520944 1084051 539208 756535 551601 172614 136477 338074 364805 388344
15019 388344 718391 405305 603290 639549 499526 259059 473802 387117 226027 262452
15009 262452 268088 710183 224183 315592 387281 -47135 322845 322714 224462 337002 351900
14998 351900 644818 670782 327682 403766 466468 226820 431699 385278 313751 389653 804699
14987 804699 289836 485756 742264 725780 563042 580454 726427 872837 877199 619151
14977 619151 313093 433883 293532 636093 199875 516606 677549 605542 712919 606461
14967 606461 457801 126334 373849 382589 462598 317883 611461 491769 497956 307622
14957 307622 -314532 277377 236350 481178 120636 178595 127219 205730 278865 502069
14947E02069k22453A30681L61828P4001L00681k14072l1922j64660N8271j16977
14937C97831K31658A66140J82712j57685M93295k34259M73287p4927K32582L57438
14927A438583j59683J48788L30529R6363k94803J1368k33712j98558N16230Q2915
14917A738020O54786J15466l63231q40195K60496m12834k38238L8640j99984o7116
14907F85810k77119J56162j76850J64239B26972J9759J87330A50161O8121M83837
14897G02119k76537k0369K02491o2833B21473J98789J11241j86652L9606n2668
14887C31789j61642N22846K88171m50286K74112j00086M7565j64901L83403m4725
14877I26246l11165N4906k52484K28028J06391l22234K19472j79430K20073k17902
$$ plain form
14947 502069 279616 130681 492509 566510 867191 653119 621197 456537 514808 397831
14937 397831 629489 166140 348852 191167 684462 450203 923490 848563 1081145 1438583
14927 1438583 1278900 1427688 1758217 1854580 1559777 1571145 1337433 1138875 1655105 1738020
14917 1738020 2392806 2508272 2145041 1304846 1565342 1152508 914270 952910 752926 685810
14907 685810 408691 564853 388003 552242 226972 246731 434061 150161 218282 702119
14897 702119 425582 405213 607704 544871 221473 420262 531503 344851 384457 331789
14887 331789 170147 692993 981164 530878 804990 704904 752469 587568 970971 926246
14877 926246 615081 669987 417503 645531 751922 429688 649160 469730 689803 471901
14867D71901K21618j8649k50360K86333J30918k35023L6746N3045H4372N2684
14857A37056K65957K4961r3823J31523A93610M26796j18514J60649j12380j41063
14847D09098K9461K06078J79373m4187J92034J56612j59216j67328L41491E61564
14836H66911l4486J25671k91080B09491Q6346L5503o2810n81L33499j87659K55213
14825F69002M2064j67280B49288L98543N2224N1266J95310C38902O09409l31259
14815F17052K65726C40232K68047k73315J54582L16310j97938k33384K9871L10150
14805G14555R9481J87874R4032l90016j83472B09071K34234k9785r511j15294
14795B88715J70478J62899j5699j28444j80941L11696B47852L00322k59584M04517
$$ plain form
14867 471901 693519 674870 424510 710843 841761 606738 643484 696529 84372 137056
14857 137056 403013 427974 334151 465674 193610 620406 501892 662541 550161 409098
14847 409098 438559 644637 824010 779823 971857 1128469 969253 801925 1143416 561564
14836 866911 832425 958096 667016 209491 295837 331340 268530 267949 601448 413789 669002
14825 669002 711066 543786 249288 647831 700055 751321 946631 338902 948311 617052
14815 617052 882778 340232 608279 334964 489546 805856 607918 374534 404405 714555
14805 714555 814036 1001910 1095942 705926 522454 209071 443305 413520 404009 288715
14795 288715 459193 622092 606393 477949 297008 608704 247852 548174 288590 693107
14785F93107o0358j1163N3002j69234k04776L43011O8381o1923k05213J43062
14775E87896M37429k04235j9493K97706k01821j23718m5719k9943B70056K20732
14765D90788L17723o2073k70229k28544M13858k3835n1795j21144o8898K03408
14755E99259J85249C92130Q8174M9697L1791j95408K60330N3065m5720k01977
14745D32082O589O8900j8500R3240j57909Q0370K09216K0037j03621M9572J60340
14734H40316j64836N5099J85997M40388k06883J57971L9224L80450L81879m97381
14724A612224j17411l64123k49531R8388k14532k09751M64398r7807M789j30375
14714G96269j39229J236J93672q6989L0261O2051J48932l7043j06430j05516K04561
$$ plain form
14785 693107 632749 621586 674588 505354 300578 643589 711970 650047 444834 587896
14775 587896 1025325 821090 801597 1099303 897482 773764 728045 698102 270056 490788
14765 490788 808511 746438 476209 247665 661523 637688 585893 464749 395851 599259
14755 599259 784508 392130 480304 530001 561792 366384 626714 679779 634059 432082
14745 432082 438671 507571 489071 582311 424402 504772 713988 734025 630404 679976 840316
14734 840316 675480 730579 916576 1356964 1150081 1308052 1347276 1727726 2109605 1612224
14724 1612224 1494813 1130690 881159 979547 765015 555264 1019662 921855 926644 796269
14714 796269 657040 658276 851948 764959 795220 857271 1006203 969160 862730 757214 961775
14703I61775K01755J09092N70037K00484j88366n66787J77813k87600l11370J7874
14693H84707L0610o2004k193o3848K39029l90372Q7773k56674J15517K79687j9946
14682H42286K26151K4444j78578j67506L5235K09706j11858o2397J27496C10848
14671A089298k67620K10665j57443j62071M6865K52139k06938L25285j68057j11141
14661H50982n8359K22817J35701j25240q0842j76340L69368j26691K6267J25922
14651A163585L1538j43685L11363l49317J26062k08650J19690k333j82997J54784
14641A020040L68990l74986K780J1026l77628P24906m22962Q9459J69488k23738
14631I87375J75054j40435L40849l85997J62535J89672n9n0721q5732j53540q0740
$$ plain form
14703 961775 1163530 1272622 1842659 2043143 1854777 1287990 1465803 1178203 866833 884707
14693 884707 915317 853313 851120 787272 1026301 635929 723702 467028 582545 862232 842286
14682 842286 1068437 1092881 914303 746797 782032 991738 879880 817483 944979 310848
14671 1089298 821678 1032343 874900 712829 759694 1011833 804895 1130180 962123 850982
14661 850982 792623 1015440 1151141 1025901 945059 768719 1138087 1011396 1037663 1163585
14651 1163585 1195123 1051438 1362801 1013484 1139546 930896 1050586 1048253 865256 1020040
14641 1020040 1389030 1014044 1016824 1027850 650222 1375128 952166 1041625 1211113 987375
14631 987375 1162429 1021994 1362843 976846 1139381 1329053 1328994 1278273 1192541 1039001 958261
14620I58261K24784J45224l15101K25678k1454J23590j7844K84714k07440L4616
14610A435028l24120J69909j06409n3379L29092k4750n364L88315m45030k79532
14600A083760K64598J25916O4817j98915K07736K41058m78428M43345n0932k40611
14590A462344m47787M74220j56070M04998Q950l71542J24493k26104K87333o3732
14580A497103P2606O5575L0963k44248K80879j05493j2177J77323K09529m21525
14570A550535p1527K72968K23918k34729N7208K4275M75291k66204M8852J04978
14560B185565M63031m28663m0676J78759J41696q8186P48431J91337r3143N07366
14550C765517N56980J134282L748446R062950J8084556Q222709B1973731H510569
$$ plain form
14620 958261 1183045 1328269 1013168 1238846 1217392 1340982 1323138 1607852 1400412 1435028
14610 1435028 1110908 1280817 1174408 1121029 1450121 1425371 1420007 1808322 1363292 1083760
14600 1083760 1348358 1474274 1539091 1340176 1547912 1788970 1310542 1753887 1702955 1462344
14590 1462344 1014557 1488777 1332707 1737705 1746655 1375113 1499606 1273502 1560835 1497103
14580 1497103 1569709 1635284 1666247 1421999 1702878 1597385 1585208 1762531 1972060 1550535
14570 1550535 1479008 1751976 1975894 1741165 1798373 1822648 2297939 2031735 2080587 2185565
14560 2185565 2648596 2219933 2179257 2358016 2499712 2411526 3159957 3351294 3258151 3765517
14550 3765517 4322497 5456779 9205225 18268175 36352731 44575440 21973731 8510569
14541C625738j037701q17815K74447M52456J472870J250348j964099j431068j49283
14532A675893K16461j78292k0995N26527l46177R6161k43924R2308M32699l03571
14522A947090M2054M5310m4932L18176k73279k3030j7102J83290K96837k67340
14512B207074R8121o592k55816K96995P8061J07218M74691l89329o7454j53943
14502B389026N54773k46782j6620j44214L80118l85750K43674R4159k78749L17079
14492B906714J91392l72021M97770m1072k94271O9499J06100l1693J3640J25908
14482C171966k5257j27088J28501K57886q1471p8648J81663r2290J51381j47646
14472C338997M38911k2197o4716K7981J31516k85510N2508J54887M98431n64565
$$ plain form
14541 3625738 2588037 1770222 2044669 2497125 3969995 5220343 3256244 1825176 1675893
14532 1675893 1892354 1714062 1693067 2219594 1873417 1969578 1725654 1817962 2250661 1947090
14522 1947090 1989144 2034454 1989522 2307698 2034419 2011389 1994287 2177577 2474414 2207074
14512 2207074 2305195 2298603 2042787 2339782 2417843 2525061 2999752 2610423 2542969 2389026
14502 2389026 2943799 2697017 2680397 2536183 2916301 2530551 2774225 2868384 2589635 2906714
14492 2906714 3098106 2726085 3223855 3182783 2888512 2958011 3064111 3032418 3046058 3171966
14482 3171966 3146709 3019621 3148122 3406008 3324537 3245889 3427552 3335262 3486643 3338997
14472 3338997 3777908 3755711 3690995 3718976 3850492 3564982 3617490 3772377 4270808 3706243
14462C706243k46681N12269K74071j87980K5178n4681P40236j97411m67037J74535
14452D278742J60596L10127J17173r9808Q4659q310k00875M89150k00353Q7860
14442E018961r7384K80347K45096l40057R3519Q1454M54701m34621K88539m44374
14432E146181J16874Q45263l57396J74436K55599l3387N45563k48536Q7426L3762
14422F565785J19520K34946P54186p2684j61418M9428l900J74395q8929k06487
14412G364842J97649K7735N62336J9544M72359k62796Q6415M00685J15525P444
14402H991738L16437m0230k76580j6564K08146J77318J90378K39574j65777P53862
14392A0378302j16780M68004Q3523j29202N05612k450M13716K9205L22874L85442
$$ plain form
14462 3706243 3459562 3971831 4245902 4057922 4083100 4028419 4768655 4571244 4104207 4278742
14452 4278742 4439338 4749465 4866638 4766830 4851489 4843179 4642304 5131454 4931101 5018961
14442 5018961 4921577 5201924 5447020 5106963 5200482 5281936 5736637 5302016 5590555 5146181
14432 5146181 5263055 6108318 5750922 5925358 6180957 6147570 6693133 6444597 6532023 6565785
14422 6565785 6685305 6920251 7674437 7601753 7440335 7489763 7485863 7660258 7571329 7364842
14412 7364842 7562491 7590226 8152562 8172106 8644465 8381669 8468084 8868769 8984294 8991738
14402 8991738 9308175 9267945 8991365 8974801 9182947 9360265 9550643 9790217 9624440 10378302
14392 10378302 10261522 10729526 10813049 10683847 11189459 11187009 11600725 11629930 11952804 12338246
14382A2338246J57753L19759o3809J87928N61467k44885N51459K13432q4715O22046
14372A4558681J44409K28350O21381P2095Q74311N0620p7394Q01685M46742k36777
14362A7484103N95854L42277K85612P58042L7317M11454O13401K93627M13427
14353B1235114P94610K99085N74876Q42749M40031O98991L26082P44556Q56158
14344B6812252P39524O18236P97207Q83385L57112J160063R94176J143748N58021
14335C4063724Q99864R22227J453536Q05509J092590J336427J558908J070602
14327D3203387J567353J292173J664459J421049J854839J807139J836066K016012
14319E6662477K708668J633482K133883K393899K404204K635226K859582K717614
$$ plain form
14382 12338246 12495999 12815758 12751949 12939877 13501344 13256459 13807918 14021350 13936635 14558681
14372 14558681 14703090 14931440 15552821 15624916 16499227 16549847 16472453 17274138 17720880 17484103
14362 17484103 18079957 18422234 18707846 19465888 19503205 19914659 20528060 20821687 21235114
14353 21235114 22029724 22328809 22903685 23746434 24186465 24885456 25211538 25956094 26812252
14344 26812252 27551776 28170012 28967219 29850604 30207716 31367779 32361955 33505703 34063724
14335 34063724 34963588 35885815 37339351 38144860 39237450 40573877 42132785 43203387
14327 43203387 44770740 46062913 47727372 49148421 51003260 52810399 54646465 56662477
14319 56662477 59371145 61004627 63138510 65532409 67936613 70571839 73431421 76149035
14311G6149035L152129L463486L303723M139236L726121M078473M937202M687047
14303A07636452M959743N302617N744923N775095O837921O801404P659996P656610
14295A58374761Q350749Q871241R446387J0119948J1036998J1184490J1916613
14288B29301187J2419818J3608108J3640781J4613633J4979827J5696620J5850345
14281C30110319J6343375J5864216J6321880J5431249J4806779J3779194J2387866
14274D35044878J0684088P466616M048590p7067k414773l436749j009146k757744
14266D47548693m634960q987391j1050999j3122873j4691125j5811011j5749971
14259C63500363j6511593j6415291j6055523j5803787j5241756j4669675j4158419
$$ plain form
14311 76149035 79301164 82764650 86068373 90207609 93933730 98012203 102949405 107636452
14303 107636452 112596195 117898812 123643735 129418830 136256751 143058155 150718151 158374761
14295 158374761 166725510 175596751 185043138 195163086 206200084 217384574 229301187
14288 229301187 241721005 255329113 268969894 283583527 298563354 314259974 330110319
14281 330110319 346453694 362317910 378639790 394071039 408877818 422657012 435044878
14274 435044878 445728966 453195582 457244172 457167105 454752332 451315583 450306437 447548693
14266 447548693 442913733 433926342 422875343 409752470 395061345 379250334 363500363
14259 363500363 346988770 330573479 314517956 298714169 283472413 268802738 254644319
14252B54644319j3450027j2796708j1790139j2004369j0625883q526289r059127
14245A76391777r260591p998034p811864p548341p118719o454788o231707n373204
14237A18594529n217648n399927m776997m647410m223301l798502l342418l743545
14229H3444781l413173l249000l042051k846998k566721k883157k202449k607214
14221F0634018j937489j918069j671514j882990k296158j450904j805795j185968
14213D6485131q31616j796642j601790j214562j402122j018441p48031p82462
14205C7089465j363891j414342q16789p22842m72075q91157j136838r52254r98861
14196B8320416l05764q40316o17968n42857n08408p08916n01832j211500m84454
$$ plain form
14252 254644319 241194292 228397584 216607445 204603076 193977193 185450904 176391777
14245 176391777 167131186 159133152 151321288 143772947 136654228 130199440 123967733 118594529
14237 118594529 113376881 107976954 103199957 98552547 94329246 90530744 87188326 83444781
14229 83444781 80031608 76782608 73740557 70893559 68326838 65443681 63241232 60634018
14221 60634018 58696529 56778460 55106946 53223956 50927798 49476894 47671099 46485131
14213 46485131 45653515 43856873 42255083 41040521 39638399 38619958 37871927 37089465
14205 37089465 35725574 34311232 33494443 32771601 32299526 31408369 30271531 29319277 28320416
14196 28320416 28014652 27174336 26556368 26013511 25505103 24796187 24294355 23082855 22598401
14187B2598401l57897l28116m55457p27948m97315o56236l40501k15428m76332
14178A8543171l70172r7128o93515l22813n86231J31810m86535m95567J1202l13144
14168A5321078n50272j92285l31478J15277m52481n07273r0917k96742j94280
14159A2820627l25960J07490m46109o1450l58326m53094n2517k59342J71899l77935
14149A0765283N3440k00764j95769m13727l7672l60067J88197k34506j80938n91353
14139H792124M73596l17537l01949J59485j40896m31919K86532j87246j87850
14130H144340l26648n7322j5874j85558L2945k01810k85424L4796j87430J69835
14120G121850j28505k24302J59816m92008M16770n49231J6630Q0767r2809o6461
$$ plain form
14187 22598401 22240504 21912388 21456931 20728983 20231668 19575432 19234931 19019503 18543171
14178 18543171 18172999 18075871 17382356 17059543 16473312 16605122 16118587 15623020 15634222 15321078
14168 15321078 14770806 14578521 14247043 14362320 13909839 13402566 13311649 13014907 12820627
14159 12820627 12494667 12602157 12156048 12094598 11736272 11283178 11230661 10971319 11143218 10765283
14149 10765283 10818723 10617959 10422190 10008463 9970791 9610724 9798921 9564415 9383477 8792124
14139 8792124 9265720 8948183 8646234 8805719 8664823 8232904 8519436 8332190 8144340
14130 8144340 7817692 7760370 7744496 7558938 7591883 7390073 7104649 7139445 6952015 7121850
14120 7121850 6993345 6769043 6928859 6436851 6853621 6304390 6321020 6401787 6308978 6242517
14110F242517k8604k94378K08062J04767l88628L4511m00983r179J38493j39016
14100E467562m038j09834k78085L22822m24572L25858j66287k94024K01160M686
14090E045248o30341O19545m93965M96032m58659K55751l64821O4708o4048k34002
14080D235448Q2668j46508l021J20104J41276m64166k08900K3060L82179l704
14070D158436l78961J23008k07963J8703R4934k16636R8101K7538L2883K7075
14060C777118l48965K48941J12584l32447M59480l60421k92645J79381J35469
14051C578495j54411p7583l45744R4728j53869J75180l79079O64180m01979j40563
14041B859355L55172o76983M14199j57632k55589K16766J67791R1572j37590k54042
$$ plain form
14110 6242517 6213913 5919535 6127597 6232364 5843736 5878247 5477264 5468085 5606578 5467562
14100 5467562 5463524 5353690 5075605 5398427 4973855 5299713 5133426 4839402 5040562 5045248
14090 5045248 4414907 5034452 4540487 5036519 4577860 4833611 4468790 4533498 4469450 4235448
14080 4235448 4318116 4171608 4168587 4288691 4429967 3965801 3756901 3779961 4162140 4158436
14070 4158436 3779475 3902483 3694520 3713223 3808157 3591521 3689622 3717160 3750043 3777118
14060 3777118 3428153 3677094 3789678 3457231 3916711 3556290 3263645 3443026 3578495
14051 3578495 3424084 3346501 3000757 3095485 2941616 3116796 2737717 3401897 2999918 2859355
14041 2859355 3214527 2537544 2951743 2794111 2538522 2755288 2923079 3014651 2877061 2623019
14031B623019J66322p6507l5800J64317l42570J85104q8724l04684M8327K15210
14021B554014O7727j77013L3664q6695o0813k43529J32626j20592M29117l10855
14011B217651n3043j09659n8479j51567M16836L7793l41211n1814J3893N7708
14001A978108J22583j34745j85686j03177j17165M48904k67430K03498K28023
13992B172913m97667M2078J93789O40185J917494O840394J7477806J6094804j5225959
13983B9655837A4034425o384716k511808r67309n28668n79261j76078q7036j9711
13974B779838p29974K07748J5771j44070K96939l64210o351K05690m63791K19234
13964B016824j68983K33804N702m5261L8119k26464P8051j88157K52541k81801
$$ plain form
14031 2623019 2789341 2712834 2677034 2841351 2498781 2683885 2595161 2290477 2338804 2554014
14021 2554014 2621741 2444728 2478392 2391697 2330884 2087355 2219981 2099389 2528506 2217651
14011 2217651 2164608 2054949 1996470 1844903 2261739 2299532 1958321 1906507 1920400 1978108
14001 1978108 2100691 1965946 1780260 1677083 1559918 2008822 1741392 1944890 2172913
13992 2172913 1675246 1717324 1911113 2551298 4468792 11309186 28786992 44881796 29655837
13983 29655837 14034425 7649709 5137901 4170592 3641924 3062663 2886585 2799549 2779838
13974 2779838 2049864 2257612 2273383 2129313 2426252 2062042 2055691 2261381 1797590 2016824
13964 2016824 1847841 2081645 2087347 2042086 2080205 1853741 1931792 1743635 1996176 1714375
13954A714375K60946j67465l27371K0253M73045J84903l62766l199N4662k55123
13944A592260j69100J97954k64952L31505p2415K652m68989M91594j28567m5347
13934A466595L32K27056j06869Q8944n57111J17238M93742j68644k74541k86915
13924I99827L44195J61758j24843J36994k89863q3281K59575J63579k94345j6751
13914A256845K12290j36004K17159k69464K23997l85714J96755J48523j4111p8855
13904A371421l26084L36016k48360J7589P1502J46613k66920n5170j90834N12393
13894A368166l00144j38974J32876K01990k08508q0194K15339j31056l2665k54985
13884G71845M66334j7285k41915M95049k71647k48238O3090j74894M1811K26112
$$ plain form
13954 1714375 1975321 1807856 1480485 1500738 1973783 2158686 1795920 1792721 1847383 1592260
13944 1592260 1423160 1621114 1356162 1687667 1615252 1617904 1148915 1640509 1511942 1466595
13934 1466595 1466927 1693983 1587114 1676058 1118947 1236185 1729927 1561283 1286742 999827
13924 999827 1344022 1505780 1380937 1517931 1228068 1144787 1404362 1567941 1273596 1256845
13914 1256845 1469135 1333131 1550290 1280826 1504823 1119109 1315864 1464387 1450276 1371421
13904 1371421 1045337 1381353 1132993 1150582 1222084 1368697 1101777 1046607 855773 1368166
13894 1368166 1068022 929048 1061924 1263914 1055406 975212 1190551 1059495 1026830 771845
13884 771845 1238179 1220894 978979 1474028 1202381 954143 1017233 842339 884150 1110262
13874A110262j74992R3548k6171P1733l28428J15488J75547j3825l78045M06458
13864A051575q942j73985L31780k07093p6589K01271n9605j38715m9405L01462
13854A171754k67308j25221p4956K82153J09563l6315J7359m29357L79688C91598
13843H73080k81501L8713L92532L21910l57636n589R9769j21616D38526M35297
13833H73823Q5334j59590k02861M33093k81672k7995R233l1295K3780k64451N99746
13822A057145m66727J67082K82298E12111L9515L61615j23434q8944J06203L7654
13812H44720k14899Q7604J63372j44108j2257q0352R8756R0289j76198J45219
13802H02146J34145k10241m2693J44776j8603r9808o5288n2747K06847k57410
$$ plain form
13874 1110262 935270 1028818 1002647 1074380 745952 861440 1036987 1023162 645117 1051575
13864 1051575 1042633 868648 1200428 993335 916746 1118017 1058412 919697 870292 1171754
13854 1171754 904446 779225 704269 986422 1095985 1059670 1077029 647672 1027360 391598
13843 873080 591579 630292 1022824 1344734 987098 981509 1081278 959662 438526 873823
13833 873823 959157 799567 596706 1029799 748127 720132 729365 698070 721850 457399 1057145
13822 1057145 590418 757500 1039798 512111 551626 913241 789807 700863 807066 844720
13812 844720 629821 717425 880797 736689 724432 644080 742836 833125 656927 802146
13802 802146 936291 726050 683357 828133 809530 709722 644434 591687 798534 541124
13792E41124M84631l35981B44553L87325j43577M01951k35210j25597j64163M4603
13782D09885M73939j11135J24405r0308k27220B66857K65527L00191A73619M73396
13772F47015j29827M8005j99108M44417C98099O8614J69341j37792o2774M31223
13762H66711C06165J83905j56144K27199j81117K23709j8513L73949D38050J66889
13752F04939K4021o856j61846P5665k18880M50129q5120o4672r5094K13448L7283
13741G73017k02335K3704J16807j69433j63178r430L5609J43460M7096J11192
13731G06509j08700J71378k98475J13914p5544P9634K05652k70831r7939J83573
13721F09171j84210K72177j05482k385L2714k37754j074K8409Q5226j1697k01816
$$ plain form
13792 541124 1025755 689774 244553 631878 488301 890252 655042 529445 365282 409885
13782 409885 883824 772689 897094 806786 579566 266857 532384 832575 173619 647015
13772 647015 517188 565193 366085 810502 398099 466713 636054 498262 435488 866711
13762 866711 306165 490070 333926 561125 380008 603717 585204 959153 438050 604939
13752 604939 628960 622104 460258 535923 317043 767172 682052 617380 522286 735734 773017
13741 773017 570682 594386 711193 541760 378582 369152 404761 548221 595317 706509
13731 706509 597809 769187 470712 584626 509082 588716 794368 523537 425598 609171
13721 609171 424961 697138 591656 589271 621985 384231 383157 411566 496792 485095 283279
13710B83279R1324L09305C34623M5259J60148k07724L2386j23294J37722j3166
13700C65954j75190L95694k08591M11704B62045A8326M04709J71537j42419k11184
13690B40969J15358J1424J94325L0847B17689M59465J0208j37465J18992J43572
13680H12461j80399p0784K66595k91373k33171p7051L44926j90189m7716j23023
13670B10276K59952Q5159A59267L60776N6395B03972K72958j79018R4625r1856
13660C00681O3502j6561J58725m6425A78192J2767M52469j12516j86351L00815
13650F45376B76216L80309G4656J21691a47784A72251J15371L40535B17919K60981
13640D78900j13705M7301p8346J75888j79398Q5683j95806c2725B12437K0576
$$ plain form
13710 283279 374603 683908 334623 379882 540030 332306 364692 241398 379120 365954
13700 365954 190764 586458 377867 789571 262045 18326 423035 594572 452153 240969
13690 240969 356327 367751 562076 592923 217689 677154 687362 549897 668889 812461
13680 812461 632062 561278 827873 536500 303329 226278 571204 381015 333299 210276
13670 210276 470228 555387 159267 520043 576438 203972 476930 297912 392537 300681
13660 300681 364183 347622 506347 459922 178192 190959 643428 530912 344561 645376
13650 645376 276216 656525 74656 196347 -147784 172251 287622 628157 217919 478900
13640 478900 365195 412496 334150 510038 330640 416323 220517 -32725 212437 233013
13630B33013K88123o8015j25553P364a3115C02165A38705K73230r3424k7047n573
13619B85891j04828l5280R8192J13400j69075O9904P7240K71228k21831j34795
13609B50046R0241l6420K02620A58270J44042a74754D55866p2564j06327Q30k4531
13598B53274h7262D35664A12059L07899j69957M42621q3948A45172P0289J73083
13588C88544J9091j13187J1034n0739k0545J05384P7240j37686m7992n4990q903
13577A67251P4942J13678j29830k7918o5529Q2423p7551L56561k03490J72478
13567D63015k01104P5332j37651l6445Q6461k4837K8765K02982A13977J43592
13557B57569K2052k2889J5296N05609b97194C59732H4792J53286o55K03073B03301
$$ plain form
13630 233013 521136 453121 327568 334932 -13115 302165 138705 411935 318511 291464 285891
13619 285891 181063 145783 243975 357375 188300 258204 335444 606672 384841 250046
13609 250046 340287 303867 506487 158270 302312 -174754 455866 383302 276975 277805 253274
13598 253274 -87262 435664 112059 419958 250001 692622 608674 145172 215461 388544
13588 388544 407635 294448 305482 254743 234198 339582 416822 279136 231144 176154 167251
13577 167251 242193 355871 226041 198123 132594 215017 137466 494027 290537 463015
13567 463015 261911 337243 199592 163147 249608 224771 253536 456518 113977 257569
13557 257569 279621 256732 272028 777637 -297194 359732 84792 238078 237423 440496 203301
13545C12824j28112c5030A96823p6614J99460J75660k37989P4766A16367K86211
13535D02578D1711M07662k15132A9189J14019L01357A48134m0088K58249K46286
13525F12581j07751k01500J94029k04186K39940A17358N9663J78012b62212C14492
13514A62651Q5114J56245Q8910A6572M44630A32557e1464B7442J91658L4230l5653
13503B17677J74323j57366A15894L62580j28143J47655A77245J48010A26394K57036
13493C83430A55050J92156J2672l5072J37021m2866l8691M4909I5994J55049B3113
13481b18226c8045o1802C32683p6612q1797J93241b96915B35307J1596F2433R2287
13470A54720b2646o7301D81432A77320c4862D13026G664O6863N49897B75395J21963
$$ plain form
13545 312824 184712 -35030 196823 120209 319669 495329 257340 332106 116367 402578
13535 402578 41711 449373 234241 19189 133208 434565 148134 108046 366295 612581
13525 612581 504830 303330 497359 293173 533113 117358 177021 355033 -262212 314492
13514 162651 247765 404010 492920 16572 461202 132557 -51464 27442 219100 253330 217677
13503 217677 392000 234634 115894 478474 350331 497986 177245 325255 126394 383430
13493 383430 155050 347206 359878 324806 461827 418961 380270 425179 95994 251043 23113
13481 -218226 -38045 -99847 332683 256071 174274 367515 -296915 235307 246903 62433 154720
13470 154720 -22646 -89947 481432 177320 -34862 413026 7664 74527 624424 275395 397358
13459C97358d68240A85399p2667J82087H6165J6430M9338A5415J22618K74306
13449D12339j78443O1552A41388A1017M22300m4071k3130A62339J81895D7675
13438I7026D1879K42233k3309k9558n5879N2041P0272L9440H7250J68738j1060
13427B44928H5893g2176C78719h012H4006K51185A16642J57798A11086o302J63633
13416B68417e6483B01764H8579l1092L94701H4464J7266M8284C5500i4300F7948
13404D16508B00252m098J15440D6706a41847A20483l7493J61666A13172R9052
13394B12224J10847N7559A56806J0321a24911B70034j19574A9195a76551d1072
13383C47852j37828E5112L35050G0947O1093K6081P7553a28879A35039C5487o73
$$ plain form
13459 397358 -468240 185399 112732 294819 86165 102595 151933 15415 138033 412339
13449 412339 233896 295448 141388 11017 433317 389246 366116 162339 344234 47675
13438 97026 41879 284112 260803 231245 175366 227407 297679 337119 87250 255988 244928
13427 244928 85893 -72176 378719 -8012 84006 335191 116642 274440 111086 104784 268417
13416 268417 -56483 201764 88579 57487 452188 84464 101730 150014 35500 -94300 67948
13404 416508 200252 196154 311594 46706 -141847 120483 82990 244656 113172 212224
13394 212224 323071 380630 156806 167127 -124911 270034 150460 19195 -176551 -41072
13383 347852 210024 55112 390162 70947 132040 158121 235674 -128879 135039 35487 34814
13372C4814Q5433L81155A34567K99316b499D6913J67745m3449J96945j13337K92432
13361E47249j53719A63575a25017D33655j2974j68985q7479Q3092C3595J97640
13351B31235p4390K68144j0136A12008K30588l7248q8249D5086J18921K07710
13341C71717K32473k48164J60483B39118l7127m9313K07806r463A27505K54409
13331C81914j74655a18072i23D53461A18092M75986B48444Q1290a82549Q9468
13321i3081A26600J18149M11126B16116K34416j63214j24613m6243K58804j84422
13311A90844a72783L7583B1577J12112K59362l688F2738K89930A69336M3319M9296
13300B61951n3061a4987F420O2328f353A2305K8750J52376B0166L18794q8752
$$ plain form
13372 34814 120247 501402 134567 433883 -2499 46913 214658 171209 368154 254817 547249
13361 547249 393530 163575 -125017 433655 420681 251696 164217 247309 33595 231235
13351 231235 156845 424989 414853 112008 342596 305348 217099 45086 164007 371717
13341 371717 604190 356026 516509 239118 201991 152678 360484 351021 127505 381914
13331 381914 207259 -118072 -923 453461 118092 594078 248444 329734 -182549 -93081
13321 -93081 126600 244749 655875 216116 450532 287318 162705 116462 375266 190844
13311 190844 -172783 -135200 21577 133689 393051 389363 62738 352668 169336 212655 261951
13300 261951 208890 -14987 6420 68748 -6353 12305 41055 193431 20166 338960 250208
13289B50208D0570J77463d1390I8815c5583A32989J79003a3699l12065e7771A2242
13277A10598J11704C2756j1850a35917H3628J19641n2377K30930C3659M3102L3403
13266A10164J03387k5632n1796a71374A59398m7756C7385F648J95615K24923A99067
13254c8655a3799j07347C34495C1261K27596B4118k801O8117L8259P0073o4700
13243A33066l388O7224A872h1122a4886E6275N1991J89683f9625a1336E332J28499
13231A33831e2236I7211J00886a4756A5323O6643Q340a75241A73772q0746O9257
13220A62283l7466J25364A18742N3701a67926F6513R0274a57230J0598H6505j8754
13209F7751r930K49252A19978r454g1291G1571J83179l2804a5692j36342E3638
$$ plain form
13289 250208 40570 218033 -41390 98815 -35583 132989 311992 -13699 -325764 -57771 12242
13277 110598 222302 32756 20906 -135917 83628 203269 150892 381822 33659 76761 110164
13266 110164 213551 187919 136123 -171374 159398 111642 37385 6648 202263 427186 199067
13254 -38655 -13799 -121146 334495 31261 258857 24118 21317 89434 127693 197766 133066
13243 133066 129678 196902 1872 -81122 -14886 56275 108266 297949 -69625 -11336 5332 133831
13231 133831 -52236 97211 198097 -14756 15323 81966 90306 -175241 173772 93026 162283
13220 162283 124817 250181 118742 172443 -167926 66513 156787 -157230 -146632 86505 67751
13209 67751 57821 307073 119978 110524 -71291 71571 254750 221946 -15692 -152034 53638
13197B80835j29929a79533d498j18559j70888M2982C04275J52412H7599e3053
13186b356A39566M5718A6543b1049j03984C4175a64898C98003A60342M1924a77682
13174f2953o5335J2030j61717f9341C44423d6071r828K4663m8487D12284A39053
13162B99754i2300C87838G8366P8343l8640C702J62570n593c02680D2866K3760
13151F6626M1572l6069O2194K3801F3058b6977G012J98503a3899l64925K2691
13140c56133A42698p0924J78647o6778k7116d5900C4197a70737i734l4715l9996
13129h4445B52352r2691r646a59501j8638D994J07899h6813D30617A4067L80246
13118C94313D6607J13214A9O3018c36412d7235A45651K12720r9604A20731M0462
$$ plain form
13197 280835 150906 -179533 -4498 -123057 -293945 -250963 304275 456687 87599 -53053
13186 -2356 139566 185284 16543 -21049 -125033 34175 -164898 398003 160342 202266 -177682
13174 -62953 -128288 -116258 -277975 -69341 344423 -46071 -55899 -31236 -79723 412284 139053
13162 299754 -92300 387838 78366 156709 118069 3702 166272 160679 -302680 42866 66626
13151 66626 108198 72129 134323 158124 63058 -26977 7012 205515 -13899 -378824 -356133
13140 -356133 142698 71774 250421 183643 156527 -45900 34197 -170737 -9734 -44449 -84445
13129 -84445 252352 159661 150015 -159501 -178139 4994 112893 -86813 430617 14067 394313
13118 394313 46607 159821 19 63037 -336412 -47235 145651 358371 258767 120731 161193
13107A61193p9452N3040b31860P7360b569A45839K79937I095L37044a17310B0102
13095f6569B6616J0660L2683a40938N8610B7998Q661J14168F1816a48399A63025
13083b52109B4093e2103D2236K35666F2356a80008k2921B89034H9900h2491A40197
13071A87394J05447K9962f6597B44081a13434M697I2009L02344a00977A20596
13060A6263O5960c96045G8965J08740n5982J06814J0316G3103b67324C97303b6949
13048f7651A01667l8764L84077b33695a625A52546A7548g5754H9913J11023E9126
13036A89435B0369M3175d6206I5859a45968E83636A09301e2085F6203M10684A56720
13024d0011C5905j3654M60329A81163J21414o9270a63408A15341a5503A22755
$$ plain form
13107 161193 81741 134781 -231860 -154500 -2569 145839 425776 9095 346139 -117310 20102
13095 -66569 26616 37276 69959 -140938 -82328 27998 36659 150827 61816 -148399 163025
13083 -252109 24093 -52103 42236 277902 62356 -180008 -202929 289034 89900 -82491 140197
13071 187394 292841 322803 -66597 244081 -113434 -108737 92009 394353 -100977 120596
13060 16263 82223 -396045 78965 187705 131723 238537 248853 73103 -267324 397303 -26949
13048 -67651 101667 62903 446980 -233695 -1625 152546 17548 -75754 89913 200936 59126
13036 189435 20369 63544 -46206 95859 -145968 583636 109301 -52085 66203 476887 156720
13024 -40011 35905 22251 482580 181163 302577 233307 -163408 115341 -15503 122755
13013C39569A28303f133A6527N85669b8611h282l00857F6159j3519K52288a62147
13001d2621E1912a06710e0432B60434h0259J5943a0023k19257i7110D6721J73172
12990B19893b3130b608D4741B1408J05907b85063E2669K03712d7432m8944A63635
12978B64646a07314A6812O7514J19824E8372b08426O9599N4374C18742b26279
12967g90C0546b8986A43301b38156A48505M9561l0126b13395A33207e964C3143
12955A09197d86602A1863J03159E3076J44543G9226f6400j10814m4862A32873
12944b3960D9709A3864J96781F5172J37694J48510b35482b4701j10492j6767B3312
12932a31794l7155B18261a64339D6247L2464f3205E0372K8740D660Q6737J09745
$$ plain form
13013 339569 128303 -6133 16527 602196 -28611 -8282 -309139 66159 52640 304928 -162147
13001 -42621 51912 -106710 -50432 260434 -80259 -64316 -10023 -229280 -97110 46721 219893
12990 219893 -23130 -2608 44741 21408 127315 -285063 52669 256381 -47432 -96376 163635
12978 264646 -107314 16812 84326 204150 58372 -208426 -138827 -84453 318742 -226279
12967 -790 30546 -28986 143301 -238156 148505 198066 167940 -213395 133207 -5964 33143
12955 109197 -486602 11863 115022 53076 197619 79226 -66400 -177214 -222076 132873
12944 -23960 49709 13864 210645 65172 202866 351376 -235482 -24701 -135193 -151960 23312
12932 -131794 -168949 218261 -164339 46247 78711 -63205 50372 79112 4660 91397 201142
12921B01142B7951L2027d4674r5115B21506I9118D6910g7965L7987m01436a54671
12909A31160b50299B94660a96985d476p2725c3685A23451g7975j97086B06179
12898a54184k02246f0023A52915J06311E015h7754B43598N2993b56436a4177k86326
12887c00503C3168d5776j01329a4287A61867a6795A75479p8832O3964c34848a55626
12875f8070j6740n4752A03371a39315n4172f7214B02795d461j28251D9972f4820
12863H860b31238C18375o7019a07166A5800J60442a24050L6641l7130D73311A82605
12851C00796A22160C9160L424K49186b07367e5440A57361Q8797K28081d8904G5714
12839f7760r4696A01439J93745D9512a28423A11527J66250c5005D7197L7131k5019
$$ plain form
12921 201142 27951 59978 -44674 -139789 221506 99118 46910 -77965 -39978 -441414 -154671
12909 131160 -250299 294660 -196985 -4476 -77201 -33685 123451 -77975 -275061 206179
12898 -154184 -356430 -60023 152915 259226 5015 -87754 243598 296591 -256436 -14177 -300503
12887 -300503 33168 -45776 -147105 -14287 161867 -16795 175479 96647 160611 -334848 -155626
12875 -68070 -84810 -139562 103371 -139315 -193487 -67214 202795 -4461 -132712 49972 -64820
12863 8860 -231238 318375 251356 -107166 15800 176242 -124050 -87409 -124539 473311 182605
12851 300796 122160 39160 42584 291770 -207367 -55440 157361 246158 474239 -48904 75714
12839 -67760 -162456 101439 295184 49512 -128423 111527 277777 -35005 47197 84328 59309
12828E9309j5912a6763l02877B77007I1704b65212A79760B6024b2340m9087J9712
12817e1715j33426b4197A11006c05929A35128b76190A09821L05818D8847J54511
12807B03358E8047d82124b38113e4466r364A55050a08034G8329d01749A08233
12796A45802o9297d9349r2627e757A94968a86902j23183J01765H6727b98729F2237
12784B66929a29269j41563J3728k0351h6442q7535O5756J895j00317A98125a41889
12772b2613B0292L0591J99435B0406l932N5322j2131J96932E0466c5498r1042
12761a26540D09449L9700B8906J45211b28480C15085d64108A52479c35937J08499
12751b27438a7918E80790a11575A48131D1188J9176a76094D8992b89959B47330
$$ plain form
12828 59309 43397 -16763 -319640 277007 91704 -265212 179760 26024 -22340 -71427 -51715
12817 -51715 -185141 -24197 111006 -305929 135128 -276190 109821 415639 48847 203358
12807 203358 58047 -482124 -238113 -54466 -63830 155050 -108034 78329 -401749 108233
12796 145802 76505 -49349 -141976 -5757 194968 -186902 -310085 -208320 86727 -298729 62237
12784 266929 -129269 -270832 -257104 -277455 -86442 -173977 -108221 -106326 -206643 198125 -141889
12772 -22613 20292 50883 250318 20406 16474 71796 59665 256597 50466 -35498 -126540
12761 -126540 409449 449149 28906 174117 -228480 315085 -464108 152479 -335937 -227438
12751 -227438 -17918 580790 -111575 148131 41188 60364 -176094 48992 -289959 247330
12740A95665n6381e8315A02104a26750F5786K8482J22001F9709i8936C3446b26314
12728D8951h330A45930J19940h0635B61459A10513i2500C727a21287N5933Q094
12717e7260K5677A97642e6708a4893E9997k702a06066A2747L28483A56765N9426
12706B16191l4702B5500a19721p145G2984P3803a09408A83096a3661k1360E0813
12694F2866K62680b61428A75500F1847a0914j755A98234e360o6405a8838m2482
12683f1320A08588a00888a7991D77591A50100n761J13182a85169E0465a74029
12672B19830D2659a35935M9193q8107L8075A72166a02645j11381B00461a14379
12661a95633M2199A05406A3294K4118J07145Q8101j10917e7255A08441L53139
$$ plain form
12740 195665 139284 -58315 102104 -126750 65786 94268 216269 69709 -98936 33446 -226314
12728 48951 -8330 145930 265870 -80635 261459 110513 -92500 3727 -121287 -65354 -57260
12717 -57260 -31583 197642 -56708 -14893 59997 57295 -106066 12747 341230 156765 216191
12706 216191 181489 25500 -119721 -126866 72984 146787 -109408 183096 -13661 -35021 50813
12694 62866 325546 -261428 175500 61847 -10914 -12669 198234 -5360 -71765 -18838 -61320
12683 -61320 108588 -100888 -17991 477591 150100 144339 257521 -185169 50465 -174029
12672 219830 42659 -135935 -86742 -174849 -136774 172166 -102645 -214026 200461 -114379
12661 -195633 -153434 105406 13294 37412 144557 232658 121741 -57255 108441 461580
12651D61580E5626K58341m1038q3904a4194F2764a16951a7084A97266h5144k8524
12640a13668A41835J33135d22032C0714O5699a42320j21572a2679A90263A8654
12629A13856a67885D25888a47227B88093d2353H6338I042L40684l5402j0452A02427
12617d4478B70276i0812o5189B7149a144j11921E43013g5340A88297k8803a33338
12605A76329C2071g9409B64371a12105m4349D42738D9280g6716J966j93069H7087
12593a43630K2300m0997O2275J0790b440k01383A52584F5208e4769A94457a22175
12581h0868l3696B9832b21892k73674K41909H1674e6389r7094A45020b72977A12885
12569c44188F4500a11846C484J26161F0953J2333R9576k6496D315i4880L5750
$$ plain form
12651 461580 55626 313967 272929 189025 -14194 62764 -116951 -17084 197266 -85144 -113668
12640 -113668 141835 274970 -422032 30714 96413 -142320 -263892 -12679 190263 18654
12629 113856 -167885 425888 -147227 288093 -42353 86338 9042 349726 314324 303872 102427
12617 -44478 270276 -90812 -156001 27149 -1144 -113065 543013 -75340 188297 159494 -133338
12605 176329 32071 -79409 264371 -112105 -156454 442738 49280 -76716 -74750 -267819 87087
12593 -143630 -121330 -162327 -100052 -89262 -2440 -203823 152584 65208 -54769 194457 -122175
12581 -80868 -114564 29832 -221892 -495566 -253657 81674 -56389 -153483 145020 -272977 112885
12569 -344188 64500 -111846 3484 129645 60953 73286 172862 146366 4315 -94880 -59130
12558e9130A47291B5169d5550j29888h6746d0505H4396e4365j53785B45124F0338
12546a90841c3902m51559a66683B14016B8212J42964o7422a83008q3549A40028
12535D9213j0448f2368k6228B0860K14563i6558G3829j1050a68755e2976r6518
12524a49494D07960f7635A27863K54123A55872P5567k4577e8662F7013a63331
12513a16571E4934c17796B03472a00773A92838e4724p3014A3472Q5799a17982
12502c92171A3275M84603F2835J22285o8547C9123R7895a65201P9840D29426a80364
12490i1301B43433n885a81876c8432p3862r5152e1566J9634B33593a7206B9498
12478C5479F606g9253H3423a84795J2432B2620L0289b38424i33D05883b56920
$$ plain form
12558 -59130 147291 25169 -45550 -175438 -86746 -40505 84396 -54365 -208150 245124 60338
12546 -190841 -33902 -485461 -166683 214016 28212 171176 103754 -183008 -266557 140028
12535 49213 38765 -62368 -88596 20860 235423 -96558 73829 62779 -168755 -52976 -149494
12524 -149494 407960 -67635 127863 381986 155872 231439 206862 -58662 67013 -163331
12513 -116571 54934 -317796 203472 -100773 192838 -54724 -127738 13472 99271 -117982
12502 -392171 13275 497878 62835 185120 116573 39123 137018 -165201 -85361 429426 -180364
12490 -91301 243433 237548 -181876 -38432 -112294 -207446 -51566 -31932 233593 -17206 29498
12478 35479 6606 -79253 83423 -184795 -172363 22620 52909 -238424 -933 405883 -256920
12466G1265K54854o084G7749c05035A91679n2570J24540e0837A22424M3111a0278
12454c0397j09776F7622e5170j06275A3789i9919D30K9936M58979A04172J93329
12443B97501b12885A79732h8587A17904p790B9614c3333j2437A23433f5185I9515
12431A76535h29B07600P9789i7917o8400P271B30649f8819B6920g0934q7847L8034
12419a20747k32915f357q9583k4155A35738i4126F8510J20353J21809c58028a22555
12407a97381E1062A608h5192E5265c6695l1754j9726b7089n286o1035j49764b4835
12394A58987c12253b8528B51711I5752f0144L318A04575e846D1933L4260b03338
12382a47115B52724H3547k1599K32121b00399P8485l0246A76325J2158b07204
$$ plain form
12466 71265 326119 320035 77749 -305035 191679 139109 263649 -50837 122424 165535 -10278
12454 -30397 -140173 67622 -55170 -161445 13789 -99919 430 30366 489345 104172 297501
12443 297501 -212885 179732 -88587 117904 110114 29614 -33333 -45770 123433 -65185 99515
12431 176535 -829 207600 287389 -97917 -166317 -159046 230649 -68819 26920 -70934 -158781 -120747
12419 -120747 -353662 -6357 -95940 -120095 135738 -94126 68510 188863 310672 -358028 -122555
12407 -197381 51062 1608 -85192 55265 -36695 -68449 -88175 -27089 -32375 -93410 -243174 -24835
12394 158987 -312253 -28528 251711 95752 -60144 -56826 104575 -5846 41933 76193 -203338
12382 -147115 252724 83547 61948 294069 -200399 -121914 -152160 176325 188483 -207204
12371d0995F6337K72697b58664A53437B3897a41677J6099c4848D5580L9911b17465
12359A97419h4364j41309J03827e035j15997m5185C68347B0312b58162A85007
12348h1448F7428P5959a40243O1773G4454k6089b4540C4919f7371K8066A34707
12336A43048E0063Q5628N2644B7351K39229J54025c7259j39739G6606C5657b46547
12324A46808Q8723R3430b43155A43258J57709Q6147h2872A09947L9980F4331N5150
12313A19481a15198B55358J39384p0521l7698I6150J91052a16824H7340b35308
12302e6530o539B87068c3719A02629m7974b32298A09775f4074I1933K8294m0151
12291H0076C8741K30660E4521K31016A31695j4933a02120A26811a12748D30299
$$ plain form
12371 -40995 66337 339034 -258664 153437 23897 -141677 -125578 -34848 45580 85491 -217465
12359 197419 -84364 -225673 -121846 -5035 -121032 -166217 368347 20312 -258162 185007
12348 -81448 67428 143387 -140243 -78470 74454 48365 -24540 34919 -67371 -39305 134707
12336 143048 50063 135691 188335 27351 266580 420605 -37259 -176998 76606 35657 -246547
12324 146808 235531 328961 -243155 143258 300967 387114 -82872 109947 149927 64331 119481
12313 119481 -115198 255358 394742 324221 286523 96150 287202 -116824 87340 -235308
12302 -56530 -63069 287068 -33719 102629 54655 -232298 109775 -64074 91933 120227 80076
12291 80076 38741 269401 54521 285537 131695 116762 -102120 126811 -112748 430299
12280D33269j86210q3366A1001P6271d9321B44205m8022o5084J00989a05535c3412
12268B51820n1404L5818L3865e0493D16485r7875n8278a2259l5887C07809p3584
12257B34225n9990E557P6451b39680c0068k26588C90046J8421A47666j6673N4172
12246A85165M8317O9585j07684a8001k06153h153A94070J36908a5038A83226q5259
12235I7967j7890a62988D18500A14342b9590A31710M730K61J6947E3916J5815
12224F9731K62089j34150N302l2466F3858K12614a30292A77723a06020c1816B82732
12212C92851A94885a70405A94678K44321a07655D5566J75281e474I074g0282p487
12201g7769A92131L7736N7818J52259A41153J03056m0916k8453G8268K22405D1522
$$ plain form
12280 433269 247059 163693 11001 87272 -49321 244205 196183 131099 232088 -105535 -33412
12268 251820 200416 236234 270099 -50493 416485 318610 260332 -12259 -48146 307809 234225
12257 234225 174235 5557 82008 -239680 -30068 -256656 390046 408467 147666 130993 185165
12246 185165 233482 303067 195383 -18001 -224154 -8153 194070 330978 -15038 183226 97967
12235 97967 80077 -162988 418500 114342 -29590 131710 136440 136701 153648 53916 69731
12224 69731 331820 197670 202972 170506 63858 276472 -130292 177723 -106020 -31816 282732
12212 392851 194885 -170405 194678 438999 -107655 45566 220847 -5474 9074 -70282 -77769
12201 -77769 192131 229867 287685 439944 141153 244209 203293 174840 78268 300673 41522
12189B07104r5882m2951O1246m4161Q2703G158L3965J39718R9118a75773c3061
12177C20302r7118a70820A79165n7011P6352r488n6950A7571J4897J79144I6520
12165C535M53526j34145K21618A33480k847J19386J36662D7964L30535j33298
12155B45201n0949a08577A52761e0078A5280c68301A57020E4584K35655e03B97786
12143A92279H8200K14454c24698g9969C29586E9041J595h6498A32883n5775F221
12131a84667K5133A0023L66466B7165J1072L0504b94370A07926J82634K460j26808
12120A66212D5904A1767N49863g9633q190B09540j02921J35480A6985O4313a27613
12108A33966a27225l8454A4020K02178b2323H7919Q9937b23413O9432C6333L3234
$$ plain form
12189 207104 111222 68271 129517 85356 168059 7158 41123 180841 279959 -175773 -33061
12177 320302 223184 -170820 179165 122154 198506 189018 132068 17571 32468 211612 96520
12165 3535 457061 322916 544534 133480 130633 250019 386681 47964 378499 245201
12155 245201 194252 -108577 152761 -50078 15280 -368301 157020 54584 290239 -503 297786
12143 192279 88200 302654 -324698 -79969 329586 59041 60636 -86498 132883 77108 6221
12131 -184667 -159534 10023 376489 27165 38237 68741 -294370 107926 290560 293020 166212
12120 166212 45904 11767 561630 -79633 -87823 209540 106619 242099 16985 81298 -127613
12108 133966 -127225 -165679 14020 216198 -22323 87919 177856 -223413 -153981 36333 69567
12097F9567K7095c7454m0276A24543E9600K31399c08894C69627a44841B51336
12086A9995K02811l5608c5146C19500j25848a4658o8655B22720j06869J41883
12076B57734A00567f076B01401N3759Q6813A25132L5193J37354A33978g2046B58252
12064A40923g4106E2068o386J73419A5065d8258A29044M9531q6925J48472a09263
12052C24201A02544g1108c4105j0861j25900A44195j663c704l0993j15237A21768
12040A71645a44382H5961a98359B13884A00758m8349b59416B12814j2703c1793
12029D5567g7899A01206a06963A07891J59082a45683M422A11477J52774D7557
12018a16822H862K33767E1928A618a85931m8533i3687C782c84146A5953K48641
$$ plain form
12097 69567 96662 -37454 -77730 124543 59600 290999 -308894 369627 -144841 251336
12086 19995 222806 187198 -35146 319500 193652 -14658 -83313 222720 115851 257734
12076 257734 100567 -6076 201401 255160 341973 125132 160325 297679 133978 -72046 258252
12064 140923 -74106 52068 45682 219101 15065 -48258 129044 178575 91650 240122 -109263
12052 324201 102544 -71108 -34105 -44966 -170866 144195 142532 -3704 -34697 -149934 121768
12040 171645 -144382 85961 -198359 213884 100758 52409 -259416 212814 200111 -31793
12029 45567 -77899 101206 -106963 107891 266973 -145683 -141261 111477 264251 47557
12018 -116822 8862 242629 51928 1618 -185931 -234464 -93687 3782 -384146 15953 264594
12007B64594H5178a13055M4792G9992a04516B63008B4673K31805A04269K7318
11997A31587b40436h5482d2376j55735p9965b5251k44884E7562g0462k90282B08303
11985I0403a90610f4914l9346k35404J07933l11957A8502F984a27608B09876G5680
11973b19360f6061j73047E51907B25907R884a15771d4370j79310A96979C3046
11962a43147b8718A48903c1991j44352F7936M2845A5477J72902D5769J48526a151
11950b00317i0974B26102c0290j9977i398B18274d66965f4906j45900D1978c68338
11938b4803l77556A60186l3106C8516f1452B38620b37589J06981A1663J38818
11928A50481a11661p922B93835c37801e320k31187b8221l95362b6836A78075F3369
$$ plain form
12007 264594 85178 -113055 -68263 79992 -104516 263008 24673 256478 104269 131587
11997 131587 -240436 -85482 -42376 -198111 -278076 -25251 -270135 57562 -70462 -360744 208303
11985 90403 -190610 -64914 -104260 -339664 -231731 -543688 18502 6984 -127608 209876 75680
11973 -219360 -66061 -239108 551907 225907 235791 -115771 -44370 -223680 196979 33046
11962 -143147 -28718 148903 -31991 -176343 67936 110781 15477 188379 45769 194295 -1151
11950 -200317 -90974 226102 -30290 -50267 -9398 218274 -466965 -64906 -210806 41978 -368338
11938 -24803 -402359 160186 127080 38516 -61452 238620 -237589 -130608 11663 150481
11928 150481 -111661 -119583 293835 -337801 -5320 -236507 -28221 -423583 -26836 178075 63369
11916A40009b24785k373N0005j4618K1069E17200a78398C20313c36241i4341j03026
11905a97367a1169j25016A74215o5095K94231a79440P7184r2951B04543b27421
11894a23002J1824A10142a75634n6362B27136j06257b06880D1385J88240N1957
11884B81582A25462K11704b7665m8556i09j4566A12619b7120n6568j90448J03999
11873a70137D59528b0083j64500L7949K3260F4374B641a13531A15031g0827l68669
11862d39496a99831P2058A05833h002j40955k57814K02243B7744f1227l7732j30533
11851b29492c2628j82524m9803D7733i3332L9180f140m0445k86330a33137A75209
11839a00156J6427B30109L0749H6411a61005r660k12243J02142A06590a059j87006
$$ plain form
11916 140009 -224785 -227158 -177153 -191771 -170702 517200 -178398 320313 -336241 -94341 -197367
11905 -197367 -11169 -136185 174215 109120 403351 -179440 -102256 -195207 204543 -227421
11894 -123002 -111178 110142 -175634 -231996 227136 120879 -206880 41385 229625 281582
11884 281582 125462 337166 -27665 -76221 -909 -15475 112619 -27120 -83688 -274136 -170137
11873 -170137 459528 -20083 -184583 -146634 -123374 64374 2641 -113531 115031 -70827 -439496
11862 -439496 -199831 -127773 105833 -8002 -148957 -406771 -204528 27744 -61227 -98959 -229492
11851 -229492 -32628 -215152 -264955 47733 -93332 -54152 -6140 -46585 -332915 -133137 175209
11839 -100156 -83729 230109 260858 86411 -161005 -170665 -382908 -280766 106590 -1059 -188065
11828a88065A5137J10887b09247C0418a16413K8399m3658A320K11757a00605n3117
11817a53722e6405A59763a49470a8521j2315r9292A14867K05622i1298A49214
11806H3878b25203B4325G03J70377a60393A45792A8779R709O3294b4969r9037
11795a24006r6004i5320J0270C29855a46139O6909k25593c9796A59918B141L4824
11784C6965c49221J70201e2421r9040A12525J73608f8979F1272J63666a88221
11773D5549n968b42377E9054b7325k63098I6831d643B48200b67515J02678j20363
11762b85200J05358B03753a98009A91523g4727j89547C11398b42869O8817G9300
11751I0313K10590C1082g8333H8657P337g0736j27820A23345a82292b2898j49666
$$ plain form
11828 -188065 15137 126024 -209247 30418 -116413 -88014 -131672 1320 213077 -100605 -153722
11817 -153722 -56405 159763 -149470 -18521 -30836 -130128 114867 320489 -91298 149214
11806 83878 -225203 24325 703 171080 -160393 145792 18779 28488 91782 -24969 -124006
11795 -124006 -220010 -95320 -85050 329855 -146139 -79230 -304823 -39796 159918 2141 36965
11784 36965 -349221 -179020 -52421 -151461 112525 286133 -68979 61272 224938 -188221
11773 45549 39581 -242377 59054 -27325 -290423 96831 -4643 248200 -267515 -164837 -285200
11762 -285200 -179842 203753 -198009 191523 -74727 -264274 311398 -242869 -174052 79300
11751 90313 300903 31082 -78333 88657 95994 -70736 -198556 123345 -182292 -22898 -172564
11740a72564D1749d6204j83613a04472A17890N9307O963F610b61066I1654a08058
11728c34725D9237b14796a3945k74941I5400a83577A08776i1907b7623l4987a8758
11716A73139b3448j23170M1262L7217K0146C9185K67354o1572k6075J03486c8761
11704a19725c0802A74519g6435k5598L2689A40784B6950L68172B3389J64192J66204
11693C53785j55553a8660A28954N5608a7022C42455a43250e7827j5702j9152A22362
11681F751M0006A0137i8935j82959r831B42861C7552J77124H8849C7386a82733
11669A64330i7237G1932b24504N558C33009h9975E1520K454h0904B77568E0463
11657E2346g2957R43k81401B54315d3580l10942A81433a77006L9338a1632B12201
$$ plain form
11740 -172564 41749 -46204 -229817 -104472 117890 177197 184160 6610 -261066 91654 -108058
11728 -334725 49237 -214796 -13945 -288886 95400 -183577 108776 -91907 -27623 -62610 -18758
11716 173139 -23448 -146618 -105356 -68139 -47993 39185 306539 244967 218892 322378 -38761
11704 -119725 -30802 174519 -76435 -102033 -69344 140784 26950 395122 23389 187581 353785
11693 353785 198232 -18660 128954 184562 -17022 342455 -143250 -57827 -73529 -92681 122362
11681 6751 46757 10137 -98935 -281894 -291725 242861 37552 214676 88849 37386 -182733
11669 164330 -97237 71932 -224504 -218946 333009 -89975 51520 53974 -80904 277568 50463
11657 52346 -72957 -72014 -353415 254315 -43580 -354522 181433 -177006 -137668 -11632 212201
11645B7705a52121A24756b23965B13287c4010q4973d0426B23185c32359G4627
11634A39162J36915i8164B3151J26593b1510I2476K92582a96409O6461C92793
11623C49060b07461B95016c0661C2914Q0162J43676a28107J1926B52825B5529
11612A33749a58472H61N6234i1123A81257F8218a70199B12226r7476b97600a01470
11600a36712A53573i1613J7161B31874J64222d3662A48097L36711A86722E2683
11589i5443M115A17255b35592H1543a09078r169p2537C81097A65523b64684e4824
11577C1192a5263k3950A8468J04968c16090a02380d0649D02253j64243D7750L4835
11566H2585d3316A5928f4767O259j84692B52620g7434A48855C4196J21041D6613
$$ plain form
11645 27705 -152121 124756 -223965 213287 -34010 -118983 -40426 223185 -332359 74627
11634 139162 276077 -98164 23151 149744 -21510 92476 385058 -196409 -129948 392793
11623 349060 -207461 295016 -30661 32914 113076 256752 -128107 -116181 252825 25529
11612 133749 -158472 861 57095 -91123 181257 68218 -170199 212226 114750 -297600 -101470
11600 -136712 153573 -91613 -74452 231874 396096 -43662 148097 484808 186722 52683
11589 -95443 -91328 117255 -235592 81543 -109078 -118247 -190784 381097 165523 -264684 -54824
11577 31192 -15263 -39213 18468 123436 -316090 -102380 -40649 402253 238010 47750 82585
11566 82585 -43316 15928 -64767 -58508 -243200 252620 -77434 148855 34196 155237 46613
11554B63547E9083d18439F3206k5161J8310f3257Q814F5563i0936B26708I731
11542a54422A20807O3523P4661a75284H0594k60j7720a56897A88254L6662c10986
11530B76090R286j20873o5862b39019A35970J10486B2967M4428R1867B1369b65441
11518A57423M2619i1474m5162H3769J9839K29189a74978A07134h8576G4217K31261
11507C05478l6012A26810b56056C52859f4137A6256K11193q6774F5781e4212k121
11496e6333l3639F8233c9292j09544b9346A16316R6101i6794B4634J91138a20351
11484E969e3172J8679A06307a26290C3249L66155H1501L65123j87767A25514m3282
11473H2232J92272a18137B24401q9697K8850b24331D85243j75141a61893B90101
$$ plain form
11554 263547 59083 -418439 63206 38045 56355 -63257 -54443 65563 -90936 226708 9731
11542 -154422 120807 184330 258991 -175284 80594 80334 62614 -156897 188254 224916 -310986
11530 276090 285376 164503 98641 -239019 135970 246456 22967 67395 159262 21369 -265441
11518 157423 200042 -91474 -136636 83769 103608 332797 -174978 107134 -88576 74217 305478
11507 305478 269466 126810 -256056 352859 -64137 16256 227449 140675 65781 -54212 -56333
11496 -56333 -89972 68233 -39292 -148836 -29346 116316 212417 -96794 24634 215772 -120351
11484 5969 -53172 -34493 106307 -126290 33249 399404 81501 446624 258857 125514 82232
11473 82232 274504 -118137 224401 134704 163554 -224331 485243 310102 -161893 290101
11462d3920I5531Q7178a85971P2503M1770p0080B57011h7827k02480G7944L2415
11451A10359j5482K79684A21672K47636H8630a73123a6030E1791M52057b5158
11440a47632A4025K2665K78292a00774K3514B50099a07799B437e1736A93651b588
11428D30267f0795k1765E8314J73465D8444J37363m2426a59526B59610b14935
11417B07644a52356B89285b9150C072M4071b52397A48455m626J09272a88737N9831
11406a28906r8426L9825h5023o8130e5711C4500a88412D042J03630a11980K535
11395a09445B4750M0202K01260A19278m6694N9658L06765b9003A533d4778k17032
11384b61810a16289k73267J6637a02336A96171A9290h0632H0038c0370m5548H6389
$$ plain form
11462 -43920 95531 182709 -185971 -113468 -71698 -141778 257011 -87827 -290307 77944 110359
11451 110359 94877 374561 121672 369308 88630 -173123 -16030 51791 503848 -25158
11440 -147632 14025 36690 314982 -100774 -77260 250099 -107799 2437 -51736 193651 -2588
11428 430267 -60795 -82560 58314 231779 48444 185807 143381 -159526 259610 -214935
11417 207644 -152356 289285 -29150 3072 47143 -252397 148455 143829 253101 -188737 -128906
11406 -128906 -227332 -187507 -85023 -153153 -55711 34500 -188412 4042 107672 -111980 -109445
11395 -109445 24750 64952 266212 119278 72584 132242 439007 -29003 1533 -44778 -261810
11384 -261810 -116289 -389556 -372919 -102336 196171 19290 -80632 80038 -30370 -75918 86389
11372a07155D8832a67016p0367A10187a46496d8773j03582J6562B25603a37007
11361E9453c5458q1974E1447a03133A82148n4895K4882a23527K3413j5812o5688
11350a81614A1582K2594b32629O0383I1704b32675B21324g8256B11397h6296m5103
11339a31399E3733a00732H7145f7313l9954j79472K0255C02673b365B35916D0557
11327B3693b55376r2950J71856P5685b4780j20733d885j90141M4863N6634p3698
11316a67227d5660p0016G1600c20067B1448N5406a08750c4054A56362c58815D0426
11304A04476b24691d1781I2036a29420n6141L8642A54748b43082a5490j91512
11294b07002A5231b12038g6277I1801a67996B5465K10593b02163A94829a28777
$$ plain form
11372 -107155 48832 -167016 -237383 110187 -146496 -48773 -152355 -135793 225603 -137007
11361 59453 -35458 -117432 51447 -103133 182148 127253 152135 -123527 -100114 -115926 -181614
11350 -181614 11582 34176 -232629 -172246 91704 -232675 221324 -78256 211397 -86296 -131399
11339 -131399 53733 -100732 87145 -67313 -107267 -286739 -266484 302673 -2365 235916 40557
11327 23693 -255376 -348326 -176470 -100785 -24780 -145513 -4885 -195026 -150163 -93529 -167227
11316 -167227 -45660 -115676 71600 -320067 21448 76854 -108750 -34054 156362 -358815 40426
11304 104476 -224691 -41781 92036 -129420 -185561 -146919 154748 -243082 -15490 -207002
11294 -207002 15231 -212038 -76277 91801 -167996 25465 236058 -202163 194829 -128777
11283a59584B72324H898b56500M2427q1392a1059p5550j67735j4381e2882k34391
11272b87273i3374j66697p0870a45080G8940K98784b53233o2054J56753o2860
11262b21394o4784A147K8023b0007j26975O1794A31020a21023F8101h9541b2805
11250B0946L24096h668B23954n0992j5125E1241Q4647a64103d2438A53088A3391
11238a51052k8886D6137j4543L3257j9063J4342P5648f8083o4264B67180c9016
11226a72823E5033i9888q1261P5412l56302e4996A16827a29971j6924A27764b02780
11214a62299g0486j33323d1032C6695a25892A43506e7517A77650a40538k46386
11204c86924J08079E4162a15750B39301a08814k92936g7418A47661m8481L1501
$$ plain form
11283 -159584 272324 8898 -256500 -214073 -295465 -11059 -86609 -254344 -268725 -52882 -287273
11272 -287273 -93374 -260071 -330941 -145080 78940 377724 -253233 -315287 -158534 -221394
11262 -221394 -286178 1147 29170 -20007 -146982 -85188 131020 -121023 68101 -89541 -22805
11250 20946 345042 -8668 223954 172962 157837 51241 135888 -164103 -42438 153088 13391
11238 -151052 -179938 46137 31594 64851 45788 60130 135778 -68083 -132347 267180 -39016
11226 -172823 55033 -99888 -181149 -105737 -462039 -54996 116827 -129971 -146895 127764 -202780
11214 -162299 -70486 -203809 -41032 36695 -125892 143506 -57517 177650 -140538 -386924
11204 -386924 -278845 54162 -115750 239301 -108814 -401750 -77418 147661 99180 130681
11194A30681l5916a90485H7964b80384a29293o4821B00392b9109d349j02223n215
11183a11787j50875F9977d8617j48114j78308a8902k25935d8583k09645B64940
11172B7259b44001A35522a86865E5416a79946A68781B0726a05302B69767b06447
11161A55011c92653I7531h5068I4684a40175a7841k87356O5012E5131K77894M4134
11150C77159b16962c6898a2215b80q4857l3584o3305A92467q7513k9361g6932
11138A65137a1432j47482l8529A8232b3944j72332B5206J37164b17038e1246c044
11126e9549p4419h642D6686h4724j06576D536a54381A37639Q952l6387J14266
11115B24470I5070g6132k3184D0413L7979c8358A34301j3543b12667D9908J62253
$$ plain form
11194 130681 94765 -190485 87964 -280384 -129293 -194114 200392 -29109 -4349 -106572 -111787
11183 -111787 -262662 69977 -48617 -196731 -375039 -18902 -244837 -48583 -258228 264940
11172 27259 -244001 135522 -186865 55416 -179946 168781 20726 -105302 269767 -206447
11161 155011 -392653 97531 -85068 94684 -140175 -17841 -305197 -240185 55131 333025 377159
11150 377159 -216962 -36898 -12215 -280 -85137 -118721 -182026 192467 104954 75593 -76932
11138 165137 -11432 -158914 -197443 18232 -23944 -196276 25206 162370 -217038 -51246 -3044
11126 -59549 -133968 -8642 46686 -84724 -191300 4536 -154381 137639 146591 110204 224470
11115 224470 95070 -76132 -99316 40413 78392 -38358 134301 120758 -212667 49908 212161
11104B12161j5715l850d6704A21302a61469E5240i0833A64344o1983L97640e8910
11092A07907A0049a42660B3070K07442B1056a2605E33535A87347i9845A15766
11081b0808p4989A80010R9890d9262A37748Q1490J18425a72864O0062A27987N4032
11070A82019h3482A11445l9382J72998p4268o342K63745j27601J62472A84295
11059B71415d5500B7411M22106k6789H5357K94585K90929j58366j94981M63811
11049G81335o1816k52682j57089M08128k43731M23283k55782k13388Q688j02416
11039C34530P5578K49434K13030r8622k18887L18662l30106J4984J3906J11603
11029F84112j61251j11960l2588F3554N79501J16332l48398K10688p1494j07488
$$ plain form
11104 212161 196446 192596 -46704 121302 -161469 55240 -90833 164344 102361 500001 -58910
11092 107907 10049 -142660 23070 230512 21056 -12605 533535 187347 -99845 115766
11081 -20808 -95797 180010 279900 -49262 137748 219238 337663 -172864 -112802 127987 182019
11070 182019 -83482 111445 72063 245061 170793 164451 428196 300595 463067 184295
11059 271415 -45500 27411 449517 422728 85357 379942 670871 512505 317524 781335
11049 781335 719519 466837 309748 717876 474145 897428 641646 428258 436946 334530
11039 334530 410108 659542 872572 773950 555063 873725 543619 558603 572509 684112
11029 684112 522861 410901 378313 63554 643055 759387 410989 621677 550183 442695
11019D42695J72007k70101M36830C41654O00695B61707K11669P6846K01684C22400
11008D58811K42381l29178R2971j66889J0446L78726B57440O0089L70720j76954
10998E11295J15823k40660j11136N72602B2515P27061l36833j77028r3018L00042
10988D42739K687J40248m82J70080j42339J96024p0932J69668l0267j28783o1449
10977F87194J76373q6815L37665o5242K28805K07924J47548R9688K05794J61191
10967B100125J06690j5856o2912l70790Q9887l81156J09748j31963l11259N7970
10957A190484J34260j17572n9413L86959Q0453p1632k38975j39596Q3412r2845
10947A155535l13843m1569j43081K7321A62235K73851j9785a30811A19934L40299
$$ plain form
11019 442695 614702 344601 781431 341654 942349 261707 473376 550222 751906 322400
11008 458811 701192 372014 464985 298096 308542 687268 257440 317529 688249 511295
10998 511295 627118 386458 275322 847924 22515 749576 412743 235715 142697 442739
10988 442739 445426 585674 585192 755272 612933 808957 738025 907693 877426 748643 687194
10977 687194 863567 776752 1114417 1049175 1277980 1485904 1633452 1733140 1938934 2100125
10967 2100125 2206815 2190959 2128047 1757257 1847144 1465988 1575736 1443773 1132514 1190484
10957 1190484 1324744 1207172 1147759 1534718 1615171 1543539 1304564 1164968 1248380 1155535
10947 1155535 841692 800123 657042 684363 162235 436086 416301 -130811 119934 460233
10937D60233b44279A67126K03815L7633a27899F3878d66739A80517J17667a63097
10926f5117G7316a7487H2954b43895f614j21341D39891a6208G866J10561b41678
10914b8131B4987e3757B6979e517I195L32874C0495d8605A83909h0620I595a07909
10901b12458Q4866C93072F7773i4930J6484k15528d7266q7658A57687r040f3769
10889A89331r1116m8769K44823a47931j1970k0097A3820a4794r5991J4585I4337
10877D0781M3427b47585G2614b27660N6139L2922B24484f8584q8378a9254o3937
10866h3191b2121r445G7190J03035p8377k2637b19719N6824k51128G2739e347
10854B04486b21746C14545A37737i8338k1533N7448C5990J82500q0726d69832
$$ plain form
10937 460233 -244279 167126 370941 408574 -127899 63878 -466739 180517 298184 -163097
10926 -65117 77316 -17487 82954 -243895 -6614 -127955 439891 -16208 7866 118427 -241678
10914 -28131 24987 -53757 26979 -5517 9195 342069 30495 -48605 183909 -80620 9595 -107909
10901 -212458 -127592 393072 67773 -94930 -78446 -293974 -47266 -134924 157687 148647 -63769
10889 189331 98215 49446 294269 -147931 -159901 -179998 13820 -14794 -110785 -96200 94337
10877 40781 84208 -247585 72614 -227660 -171521 -138599 224484 -68584 -156962 -19254 -83191
10866 -83191 -22121 -31566 77190 180225 101848 79211 -219719 -162895 -414023 72739 -5347
10854 204486 -221746 314545 137737 -98338 -119871 -62423 35990 218490 137764 -469832
10843f5345e943p6859D5850h9851g372o4818G0692J16924n4396c7935D116K45053
10831B49169f8200G575C308g4030B91120j18848b27026A87273e3914r8923G1750
10819d8423D5517a5096D34605D5920Q2634k0503c00641a19084o3086A31794c0763
10807A5114J49422a45092J4664e1914B1487a86960k72649H3002a62403C40256
10796b9810A26997J1898K7977E4059i063C5276N7536b3861I9318a59776j3569
10785a73345D2889a43901K1293j68137R4538P119A56350K4979l8450J12353D225
10773b15428O8699j1465E643a86156F2052J29827K8006b50715j27020J51473A26166
10761A4637K805a20347B21082a09904G1327N5040b13318o7362E208a20951L5567
$$ plain form
10843 -65345 -5943 -82802 45850 -89851 -7372 -72190 70692 187616 133220 -37935 4116 249169
10831 249169 -68200 7575 3308 -74030 291120 172272 -227026 187273 -53914 -152837 71750
10819 -48423 45517 -15096 434605 45920 128554 108051 -300641 -119084 -182170 131794 -30763
10807 15114 164536 -145092 -130428 -51914 21487 -186960 -459609 83002 -162403 340256
10796 -29810 126997 138895 166872 54059 -9063 35276 92812 -23861 99318 -159776 -173345
10785 -173345 42889 -143901 -122608 -290745 -196207 -189088 156350 181329 142879 255232 4225
10773 -215428 -146729 -158194 5643 -186156 62052 191879 219885 -250715 -377735 -226262 126166
10761 14637 17442 -120347 221082 -109904 71327 126367 -213318 -280680 5208 -120951 -85384
10750h5384k91892d8793q551B51043i4291I8376g3176q937p9757o2282a07998
10738a26931j26456D5507K7790a78564E9446K0652a79570M4169o864B75764E4407
10726B40900e4521l48178C2711Q7677l6527b21203A5203a67155j33611f0673m07934
10715d68607J15127A80092b72583O1122A75182c5986j78390j0328G0343b18914
10704a56139A2835J02484a26838G2225b02931Q0116L1577q662B55586b58497A39134
10692I583b5896k30790a18183o607c1083F5849O8074a79199B6720b21878D5064
10680g5025B8708b45795A7030b59593b789A03107b18391q323i8950A32882K2818
10669A55700d50120J72099B9163e7636H1974b66033H4416b89683Q6833e2372K0530
$$ plain form
10750 -85384 -377276 -48793 -57344 251043 -94291 98376 -73176 -82113 -161870 -224152 -107998
10738 -126931 -253387 45507 73297 -178564 59446 80098 -179570 -135401 -142265 275764 54407
10726 240900 -54521 -402699 32711 120388 83861 -221203 15203 -167155 -300766 -60673 -468607
10715 -468607 -353480 180092 -272583 -211461 175182 -35986 -214376 -224704 70343 -218914
10704 -156139 12835 115319 -126838 72225 -202931 -122815 -91238 -99900 255586 -258497 139134
10692 9583 -25896 -256686 -118183 -124790 -31083 65849 133923 -179199 26720 -221878 45064
10680 -75025 28708 -245795 17030 -259593 -2789 103107 -218391 -226714 -98950 132882 155700
10669 155700 -450120 -278021 29163 -57636 81974 -266033 84416 -289683 -202850 -52372 -31842
10658c1842G3502g1548j10613a853C9922a44359k10112J41183Q5953J3860j90665
10647c04140G0469b415j9847r4027l1137k8952L4061B28559i3010B5812i2566
10635F5205L3223k7468e3432p2286M6439B97589a36960k7811j7430A19395b90583
10623a40191j61165P6138a04418q8965F3249B410O426a63606p094k48937K08922
10612b10715G5788d80800A65103a0664j93070a00512j35704A56344j8797O5153
10602B02700d2161B06155b40556b7128O585B40201b2304G5360e7020k09855I2771
10590B3658a16304A23691a26468A4567b7683l01734A93355F706J43752b54668
10579a51861P2892o4465d1147k10411a22715l2565K5837G1764o990a0906A0659
$$ plain form
10658 -31842 73502 -71548 -182161 -1853 39922 -144359 -354471 -213288 -127335 -113475 -304140
10647 -304140 70469 -2415 -22262 -116289 -147426 -176378 -142317 228559 -93010 25812 -92566
10635 65205 98428 70960 -53432 -125718 -79279 297589 -136960 -164771 -182201 119395 -290583
10623 -140191 -301356 -225218 -104418 -193383 63249 2410 8836 -163606 -170700 -419637 -210715
10612 -210715 75788 -480800 165103 -10664 -203734 -100512 -236216 156344 137547 202700
10602 202700 -42161 206155 -240556 -27128 -20543 240201 -22304 75360 -57020 -266875 92771
10590 23658 -116304 123691 -126468 14567 -27683 -329417 193355 6706 150458 -254668
10579 -151861 -78969 -143434 -41147 -251558 -122715 -155280 -129443 71764 64774 -10906 10659
10567d83261c6904q2692A23371a47508o9289A7129a49868e3595J7482F5874b5779
10555A18609b39775B39127a5128j57082o5681i1932l32760c2651l08216H1473
10544C25300A7919c07363j68148D5990e4252A93459c7931k72518A31655a43952
10533a86048M1791k16489H3376b64463M4163c6093k18456O5427b5813l3340B89789
10521a98959E2582F797J06188J04028c4908k20458E0730a00356k3609k00937a55706
10509b56943a02593L6070j37348M0036Q0694j96033O4447h2145A04226h9536A38760
10497b0778C60022A11939K1626Q7367n2568a08982B95475d1845F3316A7657b7391
10485I99d40379I9758k3879K0541a22182A01150J18959D8509b31875E169M59390
$$ plain form
10567 -483261 -36904 -119596 123371 -147508 -216797 17129 -149868 -53595 -36113 65874 -25779
10555 118609 -239775 239127 -15128 -172210 -237891 -91932 -424692 -32651 -340867 81473
10544 325300 17919 -307363 -475511 45990 -54252 193459 -37931 -310449 131655 -143952
10533 -186048 -144257 -360746 83376 -264463 -220300 -36093 -254549 -189122 -25813 -59153 289789
10521 -198959 52582 6797 112985 217013 -34908 -255366 50730 -100356 -123965 -324902 -155706
10509 -256943 -102593 -66523 -203871 -163835 -83141 -279174 -214727 -82145 104226 -89536 138760
10497 -20778 360022 111939 133565 220932 168364 -108982 295475 -41845 63316 17657 -27391
10485 999 -440379 99758 75879 96420 -122182 101150 220109 48509 -231875 5169 464559
10474D64559p8679j9307j18099g373B24640a45661A02000D504a56643k98608A94859
10462A18377a4376r0218l3617A12841J55969e9736A25286A5039b17555P8150D1511
10450A49008b8649A5643N49245a2199j82471A51776b91695A69142d07281b8592
10439e1387A49490d8598q3350M1952j34863A85557l798F4267A6277J27273J175
10428A44725a0516j67967K7851m9510E315b62849f8857j76203A09014m4891a02920
10416a0913j98934R9708o6446b8355B44154I079N2611L82612f736k15402e4040
10404f8987l8864d5630k80639b7783r5188q3442G0723J34503q6471D0440j6588
10393B3852a60801C6894K36788m1457A14026B2721J37588p2283j656J03818a20554
$$ plain form
10474 464559 385880 366573 248474 -7373 224640 -145661 102000 4504 -156643 -455251 194859
10462 118377 -14376 -104594 -138211 112841 268810 -59736 125286 15039 -217555 -139405 41511
10450 149008 -28649 15643 564888 -12199 -194670 151776 -291695 169142 -407281 -28592
10439 -51387 149490 -48598 -131948 -89996 -224859 185557 181759 64267 16277 143550 144725
10428 144725 -10516 -178483 -150632 -200142 5315 -262849 -68857 -245060 109014 64123 -102920
10416 -10913 -209847 -110139 -176585 -28355 244154 9079 61690 444302 -6736 -222138 -54040
10404 -68987 -107851 -45630 -326269 -27783 -122971 -206413 70723 205226 118755 40440 23852
10393 23852 -160801 36894 273682 232225 114026 22721 160309 88026 86370 190188 -120554
10381A4705i2743C37288F1875L526L5729b5935C95143a53660G0379J90805A22506
10369C3075h6728B06640a34098A32631Q5815r9175N36971B05887J40897k3000
10359C23784o6490l4261I0193M67433a67912A27586J21923r2333Q7172K22083
10349D66431p9147j4786A79381K59056q2731D3400b75497A34660P162J32791D0924
10337B60268O729A14572C0744a44887B47148Q5868a85537P9476p9352F4454b634
10325B86391b22986C537a01781d7364F23980G0778a7633E5330F987d0735P340
10314c3395j1314H8492c07481E9631c797C96757b38496C52404c67378A09191a37506
10302A67021K3868d6031H2286a77809H0308c09210f4258j03649G8272a43031B93968
$$ plain form
10381 14705 -92743 337288 61875 65401 101130 -25935 395143 -153660 70379 261184 122506
10369 33075 -86728 206640 -134098 132631 218446 119271 656242 205887 346784 323784
10359 323784 257294 223033 90193 557626 -167912 127586 249509 157176 244348 466431
10349 466431 387284 372498 179381 438437 355706 43400 -275497 134660 141822 274613 40924
10337 260268 266997 114572 30744 -144887 247148 333016 -185537 -106061 -185413 64454 -2634
10325 286391 -222986 3537 -101781 -47364 623980 70778 -17633 55330 6987 -40735 -33395
10314 -33395 -44709 88492 -307481 59631 -3797 396757 -238496 352404 -367378 109191 -137506
10302 167021 190889 -46031 82286 -177809 80308 -309210 -64258 -167907 78272 -143031 293968
10290b1436j0425j65240j90296E1247f2723J9910q6392A84392b35331l3391g631
10278a65936q1316a18392j4469j80801a05427q1261H6926a13838A39346i9812
10267C3703K8417P923b5715m8322B51220a65032A00163b11400G0412J56216K76956
10256E03584B2261M9403L43963H0034M44759j61554a07870I1225b5862B27578
10245F4740J69873c78687I5265c42922h3471k26902D38425E6613a59104d7652
10234e1501B98643b06978K0757l5943F2014M3498i2579B3943J01730a91420o049
10223a97469e86I0458a9311k64439a2043l07680L9715A46569k2159a40563K2014
10212a18549C59861A05566M3219b66719E4997d9808A9653i7111C1181J10197f5027
$$ plain form
10290 -21436 -31861 -197101 -387397 51247 -62723 -42813 -129205 184392 -235331 -268722 -7631
10278 -165936 -247252 -118392 -132861 -313662 -105427 -186688 86926 -113838 139346 -99812
10267 33703 62120 70043 -25715 -74037 251220 -165032 100163 -211400 70412 226628 503584
10256 503584 22261 71664 415627 80034 524793 363239 -107870 91225 -25862 227578
10245 64740 234613 -378687 95265 -342922 -83471 -310373 438425 56613 -159104 -47652
10234 -51501 298643 -206978 -186221 -222164 62014 105512 -92579 23943 125673 -191420 -197469
10223 -197469 -586 90458 -19311 -283750 -12043 -319723 -280008 146569 124410 -140563 -118549
10212 -118549 359861 105566 148785 -266719 54997 -49808 19653 -97111 31181 141378 -65027
10200a18729B27515a60043A4555L21375A30063L6417j7217h7642j9036J4352A78484
10188B49813b39975g0822b9388C06351a67280N5512A32948N5498a53276K8457
10178a24819j32692l057M2428N7524p5733g8292L1078A20c55290B09068b75300
10166a45036j09871a16669j27541O4838h3882D4334b92210J5792B50683d1060
10155b35035K3990r1667A68855F8690l2700b22733A52083h9720E3322P34c61597
10143b31739n0835N7788a5239m0281Q256I7570i5984k6389C8994a1217j10528
10132a21745A07927n0835a74964l8259B31930L50471g3490b0023j12648b3165
10121A647c15581A35943b49587B06749a4359j83986k20232B63666A9207c02180
$$ plain form
10200 -118729 227515 -160043 14555 335930 130063 166480 149263 -87642 -106678 -92326 178484
10188 249813 -239975 -70822 -29388 306351 -167280 -111768 132948 188446 -153276 -124819
10178 -124819 -257511 -260568 -218140 -160616 -236349 -78292 -47214 120 -355290 209068 -275300
10166 -145036 -254907 -116669 -244210 -179372 -83882 44334 -292210 -276418 250683 -41060
10155 -235035 -211045 -302712 168855 68690 35990 -222733 152083 -89720 53322 54056 -361597
10143 -231739 -282574 -224786 -15239 -55520 -47264 97570 -95984 -122373 38994 -11217 -121745
10132 -121745 107927 57092 -174964 -213223 231930 582401 -73490 -20023 -132671 -23165
10121 1647 -315581 135943 -249587 206749 -14359 -198345 -418577 263666 19207 -302180
10110D5196a37879C887b19415j9620B11259o719C0126b22284b4808k42917H2924
10098A64994a89669A64118b46853A94774E116R5215J45952c55375F5903J40770
10088B06673O0444F4312c0390A00382J42056c4565j68270h7512A18106J0339j5943
10077A12502f5960I0387M5690b87194B59550A2373a22863B90431N8000h3519q5998
10066a69517J236G3999c73643a04A07616a61295O4681G7853c1375C5354e6962
10054B4609J39937b36759E390c4047G5412b16632N6604j37970J08951H8670c15126
10042C5867J63732d8750j76688a08673A04356b05347J01360l8694b6943l2294
10032e9237K0834A25323d45933R1832g8624j21244f6410j63427K4376A94336G2140
$$ plain form
10110 45196 -137879 3887 -219415 -239035 211259 204540 30126 -222284 -24808 -267725 82924
10098 164994 -189669 164118 -246853 194774 5116 100331 246283 -355375 65903 206673
10088 206673 267117 64312 -30390 100382 242438 -34565 -202835 -87512 118106 128445 112502
10077 112502 -65960 90387 136077 -287194 259550 12373 -122863 290431 348431 -83519 -169517
10066 -169517 -168281 73999 -373643 -104 107616 -161295 -96614 77853 -31375 35354 -56962
10054 24609 164546 -236759 5390 -34047 75412 -216632 -160028 -297998 -189047 88670 -315126
10042 35867 199599 -48750 -225438 -108673 104356 -205347 -103987 -142681 -26943 -59237
10032 -59237 -38403 125323 -445933 -354101 -78624 -199868 -66410 -229837 -205461 194336 72140
10020a05571p089A66477a34354L4641M9849n1364o0431j68324l636a07801j55773
10009b63574h3410L9560k19901b4392n4567A4187i6485j06417o8037J9450E1504
9997c95280B72829a9755r1071k42568a62809g7093j29243n1342D7733m653d27593
9985h2580J765q2623O9403G7522A525J93252a31548o9454j52276A8760i1462G4261
9972e418m2699j7717k52860J51438R910A0466a05917N944j40577A88436b60621
9960a94329F1052N7880E0750b62119m2459R2193b1382a473k18554H4497a9541
9948B33488B8551a31985C8803b11126F7168l562A2256b80119a08414G7921a50296
9936a6172G9956J3933a3608l20491J02556A47750R5664b5549A25117a05584o9200
$$ plain form
10020 -105571 -112660 166477 -134354 -99713 -49864 -101228 -161659 -329983 -333619 -107801 -263574
10009 -263574 -83410 -43850 -263751 -24392 -78959 14187 -96485 -202902 -270939 -251489 51504
9997 -395280 272829 -19755 -110826 -353394 -162809 -77093 -206336 -257678 47733 43080 -427593
9985 -82580 -80815 -163438 -94035 77522 1525 194777 -131548 -201002 -353278 18760 -91462 74261
9972 -5418 -48117 -65834 -318694 -167256 -157346 10466 -105917 -99973 -240550 188436 -260621
9960 -194329 61052 118932 50750 -262119 -304578 -212385 -21382 -1473 -220027 84497 -19541
9948 233488 28551 -131985 38803 -211126 67168 63606 12256 -280119 -108414 77921 -150296
9936 -16172 79956 93889 -13608 -334099 -231543 147750 243414 -25549 125117 -105584 -174784
9925a74784E6205J39374a5436I2525D1754e90502H4198a37520L6051j68104A01322
9913d99133d692A7376a14906M7754q0654j0284A49445d54168d8445j83008C5872
9901A09275h2786j58253F4532b13868j4641O9579d3364A46492E7410a78991h9452
9889e8455j84795a10603A9193N9944L607b12839B05982A5473h440B27592a78524
9877a28762E8439a30020j05679A24847A6113a74286B80373c08535d0553j33723
9867a74276M653Q2765B85051b02608P3763G2507A1992h4046p39o8924j98367A51893
9854a01066M0337p0654j4845E882b01468P5874k30613A46915a3248k38202B3653
9842a79926Q5201p8689L6274G8296a18791d6258A28536a86355O1006J9440D5043
$$ plain form
9925 -174784 56205 195579 -15436 92525 41754 -590502 84198 -137520 -101469 -269573 101322
9913 -499133 -4692 17376 -114906 -67152 -147806 -158090 149445 -454168 -48445 -231453 35872
9901 109275 -82786 -241039 64532 -213868 -228509 -158930 -43364 146492 57410 -178991 -89452
9889 -58455 -243250 -110603 19193 79137 82744 -212839 205982 15473 -8440 227592 -178524
9877 -128762 58439 -130020 -235699 124847 16113 -174286 280373 -308535 -40553 -174276
9867 -174276 -169623 -86858 285051 -202608 -128845 72507 11992 -84046 -84785 -153709 -352076 151893
9854 -101066 -60729 -131383 -146228 5882 -201468 -125594 -356207 146915 -13248 -251450 23653
9842 -179926 -94725 -173414 -137140 78296 -118791 -46258 128536 -186355 -125349 -105909 45043
9830B5908l441J10329D8294b04198A60933b55832a05306C18995r7501H6785b56803
9818B0400a82539G7289d70553A29880a63797j6338j32605B91532a49009k2794
9808a71803e3270i25m75275b5839I8218g4323n1640L4737m2710m4286J3556E2652
9795a69771A55028j5048o6455k8505b22139B0511a92982E6600a25059B17947F0544
9783i1576A0666c74202a63680N8571C0522a37895K3640j27410J4101B11273c5934
9771a32408E1466f1127E3891J70648a06775C22J38202B8341b23188C48112i3570
9759a80770d5197j36094M1332k16356C9385e03456b29850A15713n7062A817a06055
9747a50966A00683j4883I700b31352B90561f9102A32377b23048f4257k6697b5510
$$ plain form
9830 25908 22467 132796 48294 -204198 160933 -255832 -105306 318995 221494 86785 -256803
9818 20400 -182539 77289 -470553 129880 -163797 -180135 -312740 291532 -149009 -171803
9808 -171803 -53270 -925 -476200 -25839 98218 -74323 -125963 -91226 -133936 -178222 -164666 52652
9795 -169771 155028 139980 73525 45020 -222139 20511 -192982 56600 -125059 217947 60544
9783 -91576 10666 -374202 -163680 -105109 30522 -137895 -114255 -241665 -227564 211273 -35934
9771 -132408 51466 -61127 53891 224539 -106775 322 138524 28341 -223188 348112 -93570
9759 -180770 -45197 -181291 -139959 -356315 39385 -503456 -229850 115713 58651 1817 -106055
9747 -150966 100683 85800 9700 -231352 290561 -69102 132377 -223048 -64257 -90954 -25510
9735b38065a0764G2695b12355d8792j76595C5888c99126d6463G9461A5578d3053
9723A33984J51380b34300k7549G9371K05674a79900h6685j10905H8154K090b6917
9711c59831a33542k39999c8993B08913A5391a24458j38680A20340a61863Q492
9701a53371H5286a41931F4314R861B6724L26275j42107h0122A7021J89680a0157
9689b15478A33062C5813b63924g3080A22039a81542Q1404B52826a05258r6226
9679b01484B05007C8766c0751k87056A08104b78170E0287L46154a57682K3296
9669a34386j2813k1303G2482A3830b30845n129C43932H4343a92149B4593a50856
9657d1698D501J32901a60087b9767q5870J6247k3851A8382R616a14342A25672
$$ plain form
9735 -238065 -10764 72695 -212355 -48792 -225387 35888 -399126 -46463 79461 15578 -43053
9723 133984 285364 -234300 -261849 79371 285045 -179900 -86685 -197590 88154 90244 -26917
9711 -359831 -133542 -373541 -38993 208913 15391 -124458 -263138 120340 -161863 -153371
9701 -153371 85286 -141931 64314 74175 26724 352999 210892 -80122 17021 206701 -10157
9689 -215478 133062 35813 -263924 -73080 122039 -181542 -100138 252826 -105258 -201484
9679 -201484 205007 38766 -30751 -317807 108104 -278170 50287 396441 -157682 -134386
9669 -134386 -147199 -168502 72482 13830 -230845 -235974 343932 84343 -192149 24593 -150856
9657 -41698 4501 137402 -160087 -29767 -115637 -99390 -123241 18382 27998 -114342 125672
9645e1683j40380i0876j18386B1602J7021e4291A67065a67449f5167A53331i7442
9633i5971r0421P4290e2026F6209e1133a7472k24566b1954E3695j7047j0575a63939
9620A50713b14276A63402a54711B19344b54687a11945o9764J9074M2517M0874
9610g9244A54744K678b72638A3920b98918C55983j56433a36189K5779p8077A02014
9598a50228b3835l46131a08676n5125f3076A91624a61236d2229j52903P3414k6836
9587a48554A52686a9956j11429K3592j71579j77811J37816J40900j2303A75364
9576d13492a45491L5483k4070A77485n8085k538d87534a2421A28685a39044j41393
9565b80437h2699H8409a70727j32813J24248M8115f3319j7668A61308D151b52263
$$ plain form
9645 -51683 -192063 -90876 -209262 21602 38623 -54291 167065 -167449 -65167 153331 -97442
9633 -95971 -186392 -112102 -52026 66209 -51133 -17472 -242038 -21954 53695 36648 26073 -163939
9620 150713 -214276 163402 -154711 219344 -254687 -111945 -181709 -162635 -120118 -79244
9610 -79244 154744 157422 -272638 13920 -298918 355983 199550 -136189 -110410 -188487 102014
9598 -150228 -23835 -369966 -108676 -163801 -63076 191624 -161236 -42229 -195132 -121718 -148554
9587 -148554 152686 -19956 -131385 -107793 -279372 -457183 -319367 -178467 -190770 175364
9576 -413492 -145491 -110008 -134078 177485 119400 116862 -487534 -12421 128685 -139044 -280437
9565 -280437 -82699 88409 -170727 -303540 -179292 -131177 -63319 -80987 161308 4151 -252263
9553B84657b63242A0310c11572E4534b4866E4214b6498C1673J01210J67827G214
9541b09138B29641d34422J11918A20574b83641O8841d552A9943b09599R8372I5334
9529a0849j51477n4078a03105m2467O0462I8350K2196Q7155c0006A41570a50464
9517c73274a73739g7082c4813k32149R3329B2018c76775f4851j17575L2948H3568
9505g9343j90090B31118r7832a74803D3268a77337l17415B9556b05354B0977d5627
9493F9716K32780a64143o5414B46381f581j04140o3082c5550r1449m4671l7704
9482b09374B84674g6101D2399f5886c2712C5105J29092c46470I4318J38293b01244
9470C6746P5140b17284Q5925d7756o7465a2869j04414m3569p3955J0760a08713
$$ plain form
9553 284657 -263242 10310 -311572 54534 -24866 54214 -26498 31673 132883 300710 7214
9541 -209138 229641 -434422 -322504 120574 -283641 -214800 -4552 19943 -209599 -111227 95334
9529 -10849 -162326 -216404 -103105 -145572 -85110 98350 120546 207701 -30006 141570 -150464
9517 -373274 -173739 -77082 -34813 -266962 -173633 22018 -376775 -64851 -182426 -149478 83568
9505 -79343 -269433 231118 133286 -174803 43268 -177337 -494752 29556 -205354 20977 -45627
9493 69716 302496 -164143 -229557 246381 -6581 -110721 -173803 -35550 -126999 -171670 -209374
9482 -209374 284674 -76101 42399 -65886 -32712 35105 164197 -346470 94318 232611 -201244
9470 36746 111886 -217284 -131359 -47756 -115221 -12869 -117283 -160852 -234807 -224047 -108713
9458D5413f8705m4652N4688F9490d004l05467A34732a13963L5058f675j1396j1512
9446b9583G7299a7631r0006k4342L9521K0359o2369D55151E0612J21708e2397
9434A83470a86015A12612l7264I501L33607a56037e8930N616D8259c02291A31777
9422F4925e77364C18270C4684c29561J59216I0772a70024B68638b84094A29421
9411H5272C0195a31772k14356A76823a74121A76454E2555P2788e15049F2406c05230
9399b71515A52064d0228k60516A7070O1450a44309m9959B24e2324a2584A20829
9387A59296K0360H5508a7176j0300k46891J24601B78847b32131k81554a70243
9376b69180A20428b43092f6374j36513J2625Q5703i184m50706a13351l4289j93988
$$ plain form
9458 45413 -68705 -113357 -58669 69490 -4004 -309471 134732 -113963 -78905 -6675 -18071 -29583
9446 -29583 77299 -17631 -107637 -131979 -92458 -72099 -134468 455151 50612 172320 -52397
9434 183470 -186015 112612 75348 9501 343108 -156037 -58930 -53314 48259 -302291 131777
9422 64925 -577364 318270 34684 -329561 -170345 90772 -170024 268638 -284094 129421
9411 85272 30195 -131772 -346128 176823 -174121 176454 52555 125343 -515049 62406 -305230
9399 -271515 152064 -40228 -300744 17070 78520 -144309 -194268 224 -52324 -12584 120829
9387 159296 179656 85508 -17176 -27476 -274367 -149766 278847 -232131 -513685 -170243
9376 -269180 120428 -243092 -66374 -202887 -190262 -104559 -9184 -459890 -113351 -147640 -341628
9365c41628a1944A10096a92373i2250l9882C3351c8362m6300j3797j64876i2521
9353a34175o4161H028M3149a77372A48059a99949D7967b1578A18349J22478b85743
9341b30329B6006J77661o8362k3923i7883q414o8346I7766e2231r9325p9962d8076
9328A40418a29888A35542E1478b78955I4127a61375A30620b15262J2661D8619
9317a65085O174j02435b5142E2896J12840J63881a79594j7160B50750q6774B1425
9305A45748b16263L3107k17203q6643K11337B2075J09996d28033C16969a26619
9294a03423M3052K4014l156R125F2340a10705J5461J3836A65009a03934j3306
9283a17240A50270C4423a67770E227b86975J12989e8531D5072b40744K2996C0686
$$ plain form
9365 -341628 -11944 110096 -192373 -92250 -132132 33351 -38362 -84662 -98459 -263335 -92521
9353 -134175 -198336 8028 51177 -177372 148059 -199949 47967 -21578 118349 240827 -285743
9341 -230329 26006 203667 135305 111382 -97883 -106297 -174643 97766 -52231 -151556 -231518 -48076
9328 140418 -129888 135542 51478 -278955 94127 -161375 130620 -215262 -202601 48619
9317 -165085 -158911 -261346 -25142 52896 165736 329617 -179594 -196754 250750 163976 21425
9305 145748 -216263 -183156 -400359 -487002 -275665 22075 132071 -428033 316969 -126619
9294 -103423 -60371 -36357 -39513 -30388 62340 -110705 -95244 -81408 165009 -103934 -117240
9283 -117240 150270 34423 -167770 5227 -286975 -173986 -58531 45072 -240744 -217748 30686
9271d4683E4461Q9215k1875E40J2828i3513b9735I7229L8350K8550a97033l76073
9259e73106B12133g3365A63099J01323g9588k12217F2609f2054d739C8558a06965
9247A37500a36348j9358C73647a2273D4613L8506j1589a56755O2430b5694k90983
9236c16677A35076a42281E2365Q7747e24808a78608D0827J74988B1771J61522
9226A83293d9331A07400J24861f8742q1335J4501b1009l80274B57197A08911a63462
9214g4405j72268k88418G1235i613p1399l6256G0618l0416b5296F6043a71811
9202G339b93490h2395c9648g094k13279a08286b2740A28091a50159H6532B5301
9190i0326K823N505A39537Q1762b17963J02106j89325a46326M3116l86862A37401
$$ plain form
9271 -44683 54461 143676 121801 540 13368 -93513 -29735 97229 135579 164129 -197033 -573106
9259 -573106 212133 -73365 163099 264422 -79588 -291805 62609 -62054 -4739 38558 -106965
9247 137500 -136348 -155706 373647 -12273 44613 83119 71530 -156755 -94325 -25694 -316677
9236 -316677 135076 -142281 52365 140112 -524808 -178608 40827 215815 21771 183293
9226 183293 -49331 107400 232261 -68742 -150077 -135576 -21009 -401283 257197 108911 -163462
9214 -74405 -246673 -535091 71235 -9613 -81012 -117268 70618 40202 -25296 66043 -171811
9202 7339 -293490 -82395 -39648 -7094 -220373 -108286 -22740 128091 -150159 86532 25301
9190 -90326 -87503 -81998 139537 221299 -217963 -115857 -305182 -146326 -103210 -490072 137401
9178c44388h4172c1402N456A06450a45834L9475M5172B13005d33937A2364J54966
9167A67330d03452b8451r4301q2707g0824A20816E282a18482A59312B0513a9787
9155A43011N1398b57339g7827A99996E3482e95706A5836a3685J178B77963A00974
9143a00863l9700j52637C1314a84851D10949h9588h83k11467K3389j26659M3275
9132b72345M6198j86159a37647G543a35406M5985A19768K59670j14761b16700
9121a29462c8373A25531m3386a5572H2506d7394G9132J19372c0488j07471r6994
9110b34953l6825D22276d3038A13326K11796N5510A89617b86197E9112K14992
9100B74104l0095b17280j18931J51010P0142B24052a6454A12560B4629M1903c84262
$$ plain form
9178 -344388 -84172 -31402 -25946 106450 -145834 -106359 -61187 213005 -433937 12364 167330
9167 167330 -403452 -28451 -122752 -205459 -70824 120816 5282 -118482 159312 20513 -19787
9155 143011 194409 -257339 -77827 199996 53482 -595706 15836 -13685 -12507 277963 100974
9143 -100863 -140563 -293200 31314 -184851 410949 -89588 -883 -212350 -188961 -315620 -272345
9132 -272345 -226147 -412306 -137647 7543 -135406 -89421 119768 379438 264677 -216700
9121 -129462 -38373 125531 82145 -15572 82506 -47394 79132 198504 -30488 -137959 -234953
9110 -234953 -271778 422276 -43038 113326 325122 380632 189617 -286197 59112 274104
9100 274104 244009 -217280 -336211 -185201 -115059 224052 -16454 112560 24629 66532 -384262
9088b78026B4046J23311E6153d83840H5110J23221p4603R2564d28698K11495H8279
9076c66104a04386I505b76798J8247a00683l17209G5752B6255a94927a1295D4089
9064a783A9668b8322C76562b25761g9095o2574j8013j95836A94841a1587D4380
9052c87926i792j47334b6521A80321a1796k00718J109A94068J97698b25727G3190
9040F8313R0668b57997C23704a12954A04643j300D9709d5493G2605d21162a37716
9028a42955a1674A3138j09b28578e0122k51292a11844h847p0278m2389r5210Q9085
9016a27639l7152l96486K59290J29302c8834l0474B11791R5551a70662A04093
9005a88178n9614f2745k77328A68528a48159A67152a300j09551A03345d7751j51045
$$ plain form
9088 -278026 24046 147357 56153 -483840 85110 208331 133728 226292 -428698 -217203 88279
9076 -366104 -104386 9505 -276798 -258551 -100683 -417892 75752 26255 -194927 -11295 44089
9064 -1783 19668 -28322 376562 -225761 -79095 -141669 -159682 -355518 194841 -11587 44380
9052 -387926 -9792 -157126 -26521 180321 -11796 -212514 -211405 194068 391766 -225727 73190
9040 68313 158981 -257997 323704 -112954 104643 103343 49709 -45493 72605 -421162 -137716
9028 -142955 -11674 13138 13029 -228578 -50122 -301414 -111844 -8847 -79125 -121514 -216724 -127639
9016 -127639 -164791 -561277 -301987 -172685 -38834 -69308 211791 307342 -170662 104093
9005 -188178 -247792 -62745 -340073 168528 -148159 167152 -1300 -110851 103345 -47751 -198796
8994a98796K045Q8424G3133g4015m3920C10279b72330C997P9781A0826a28115
8982B88510g3141A90794b49538J15670I5381b3008j4019Q830B63423a66009K3387
8971a42622A2814L1684d7015A309L7975a89503h4012n0364l9494e4627E0845N2863
8959A03708K79088a24207B2121K16161c13690M2031c0899k28222B08239C6684
8948d3805a6460j06204k35557e5002j037G9936a17123A04617a34214j6445E4642
8936D1609b9124A77510B0281J95082N2850k2037B8375Q2985a54044f8349m9470
8925a17819A23267J25621O6534L07855O92512M038942O851641k278043B804762
8915H10826k57041A87918J96147B1053K04518B7115c13556J06805C52764j51492
$$ plain form
8994 -198796 -196751 -108327 73133 -74015 -117935 310279 -272330 3997 83778 10826 -128115
8982 288510 -73141 190794 -249538 -133868 95381 -23008 -37027 -28197 263423 -166009 -142622
8971 -142622 12814 44498 -47015 1309 39284 -189503 -84012 -134376 -173870 -54627 50845 103708
8959 103708 382796 -124207 22121 238282 -313690 -271659 -30899 -259121 208239 36684
8948 -43805 -16460 -122664 -358221 -55002 -56039 79936 -117123 104617 -134214 -150659 54642
8936 41609 -29124 177510 20281 215363 268213 246176 28375 111360 -154044 -68349 -117819
8925 -117819 123267 248888 315422 623277 1315789 5354731 12206372 9928329 2804762
8915 810826 553785 187918 384065 21053 225571 27115 -313556 -206751 352764 201272
8905B01272J48445b35547B50979c6268l11346i6557A99878c7435A98932J00634
8895B99566a88895Q1372M9858n2692A19983m6954J20890d73400A31835Q9040a88253
8883F1587A9475e3032I9276a42798A68884a49652J1472m0846N4052A60149G6870
8871b15964D2512f4999j2905A64419d01286a28695d1254k88091K6824B42273b28085
8859a47706B2157b66624A07010p792a18821l1053B39636a25728J8463D2581c1605
8847a45460B59622g6884A3019O0305N5073l3431J59315H6601F06a75744A23112
$$ plain form
8905 201272 349717 -235547 250979 -36268 -347614 -96557 199878 -37435 198932 299566
8895 299566 -188895 -107523 -57665 -110357 119983 73029 193919 -473400 131835 220875 -188253
8883 61587 19475 -53032 99276 -142798 168884 -149652 -138180 -179026 -124974 160149 76870
8871 -215964 42512 -64999 -77904 164419 -401286 -128695 -41254 -329345 -302521 242273 -228085
8859 -147706 22157 -266624 107010 99218 -118821 -149874 239636 -125728 -107265 42581 -31605
8847 -145460 259622 -76884 13019 73324 128397 94966 254281 86601 606 -175744 123112
$$ [...]
##END NTUPLES=NMR SPECTRUM
##END=
