
##TITLE=AC1358_CPIAH12177_6648324_M7kmhNxXWp
##JCAMPDX= 6.0         $$ Bruker NMR JCAMP-DX V2.0
##DATA TYPE= NMR SPECTRUM
##DATA CLASS= NTUPLES
##ORIGIN= BRUKER
##OWNER= Administrator
$$ 1.72 TOPSPIN		Version 2.1
$$ 2012-08-10 19:01:19.906 -0500  Administrator@TOPSPIN
$$ Compression mode = diff/dup
##.OBSERVE FREQUENCY= 400.02188249412
##.OBSERVE NUCLEUS= ^1H
##.ACQUISITION MODE= SIMULTANEOUS (DQD)
##.ACQUISITION SCHEME= undefined
##.AVERAGES= 64
##.DIGITISER RES= 22
##SPECTROMETER/DATA SYSTEM= spect
##.PULSE SEQUENCE= noesygpps1d.comp
##.SOLVENT NAME= COFFEE_meoh
##.SHIFT REFERENCE= INTERNAL, COFFEE_meoh, 1, 14.96261
##AUDIT TRAIL= $$ (NUMBER, WHEN, WHO, WHERE, PROCESS, VERSION, WHAT)
$$ ##TITLE= Audit trail, TOPSPIN		Version 2.1
$$ ##JCAMPDX= 5.01
$$ ##ORIGIN= Bruker BioSpin GmbH
$$ ##OWNER= Administrator
$$ $$ C:\Bruker\TOPSPIN/data/COFFEE/nmr/AC1358_CPIAH12177_6648324_M7kmhNxXWp/12/pdata/1/auditp.txt
$$ ##AUDIT TRAIL=  $$ (NUMBER, WHEN, WHO, WHERE, PROCESS, VERSION, WHAT)
(   1,<2012-08-10 19:01:14.781 -0500>,<Administrator>,<TOPSPIN>,<go>,<TOPSPIN 2.1>,
      <created by zg
	started at 2012-08-10 18:49:44.500 -0500,
	POWCHK enabled, PULCHK disabled,
       configuration hash MD5:
       6B 1B 68 BB D9 2E 58 E2 7F 35 AD 54 07 DF 0E 41
       data hash MD5: 64K
       E2 1C E4 DB 49 C7 31 62 01 60 71 C2 80 56 4A FF>)
(   2,<2012-08-10 19:01:17.656 -0500>,<Administrator>,<TOPSPIN>,<proc1d>,<TOPSPIN 2.1>,
      <Start of raw data processing
       efp LB = 0.3 FT_mod = 6 PKNL = 1 PHC0 = 0 PHC1 = 0 SI = 128K 
       data hash MD5: 128K
       D4 A2 5C F9 6A 4B 46 23 52 D5 77 2C 7E A4 00 9E>)
(   3,<2012-08-10 19:01:18.781 -0500>,<Administrator>,<TOPSPIN>,<proc1d>,<TOPSPIN 2.1>,
      <pk PHC0 = 3.312378 PHC1 = 0 
       data hash MD5: 128K
       5C 98 F9 B1 16 B9 E2 40 DB C6 75 93 12 95 C1 C8>)
(   4,<2012-08-10 19:01:19.546 -0500>,<Administrator>,<TOPSPIN>,<proc1d>,<TOPSPIN 2.1>,
      <abs ABSG = 1 
       data hash MD5: 128K
       B7 13 8E E7 F5 44 08 72 8B 3D 8F 22 13 D7 3A 83>)
(   5,<2012-08-10 19:01:19.640 -0500>,<Administrator>,<TOPSPIN>,<proc1d>,<TOPSPIN 2.1>,
      <abs ABSG = 2 
       data hash MD5: 128K
       4B B8 02 6F 89 6B 4E 81 42 BB DA 24 66 7A CD 00>)
(   6,<2012-08-10 19:01:19.703 -0500>,<Administrator>,<TOPSPIN>,<proc1d>,<TOPSPIN 2.1>,
      <abs ABSG = 3 
       data hash MD5: 128K
       B3 B6 F5 F2 43 49 BC CE 79 C5 60 3A 90 40 44 EC>)
(   7,<2012-08-10 19:01:19.781 -0500>,<Administrator>,<TOPSPIN>,<proc1d>,<TOPSPIN 2.1>,
      <abs ABSG = 4 
       data hash MD5: 128K
       6E 59 30 17 05 65 D4 A3 3B A8 E5 D1 3B 43 5A 93>)
(   8,<2012-08-10 19:01:19.828 -0500>,<Administrator>,<TOPSPIN>,<proc1d>,<TOPSPIN 2.1>,
      <abs ABSG = 5 
       data hash MD5: 128K
       1B 3F 6E 6E 86 23 CF 0A FE 01 8F 19 08 BD 96 68>)
$$ ##END=
$$ 
$$ $$ hash MD5
$$ $$ FE 6F BC 94 5B 44 DF FB 4E 0B 6B 74 C3 97 2C 86
##$RELAX= 
##$RELAX= 
##$RELAX= 
##$RELAX= 
##$RELAX= 
##$RELAX= 
##$RELAX= 
##$RELAX= 
$$ Bruker specific parameters
$$ [...]
150 150 150 150 150 150 150 150
##$TP07= 0
##$TPNAME0= <>
##$TPNAME1= <>
##$TPNAME2= <>
##$TPNAME3= <>
##$TPNAME4= <>
##$TPNAME5= <>
##$TPNAME6= <>
##$TPNAME7= <>
##$TPOAL= (0..7)
0.5 0.5 0.5 0.5 0.5 0.5 0.5 0.5
##$TPOFFS= (0..7)
0 0 0 0 0 0 0 0
##$TUNHIN= 0
##$TUNHOUT= 0
##$TUNXOUT= 0
##$USERA1= <user>
##$USERA2= <user>
##$USERA3= <user>
##$USERA4= <user>
##$USERA5= <user>
##$V9= 5
##$VALIST= <valist>
##$VCLIST= <CCCCCCCCCCCCCCC>
##$VD= 0
##$VDLIST= <DDDDDDDDDDDDDDD>
##$VPLIST= <PPPPPPPPPPPPPPP>
##$VTLIST= <TTTTTTTTTTTTTTT>
##$WBST= 1024
##$WBSW= 4
##$XGAIN= (0..3)
0 0 0 0
##$XL= 0
##$YL= 0
##$YMAX_a= 15335668
##$YMIN_a= -8350929
##$ZGOPTNS= <>
##$ZL1= 120
##$ZL2= 120
##$ZL3= 120
##$ZL4= 120
##$ABSF1= 14.96261
##$ABSF2= -5.595572
##$ABSG= 5
##$ABSL= 3
##$ALPHA= 0
##$AQORDER= 0
##$ASSFAC= 0
##$ASSFACI= 0
##$ASSFACX= 0
##$ASSWID= 0
##$AUNMP= <proc_prof1d_extract.lims>
##$AXLEFT= 0
##$AXNAME= <>
##$AXNUC= <1H>
##$AXRIGHT= 0
##$AXTYPE= 0
##$AXUNIT= <>
##$AZFE= 0.1
##$AZFW= 0.1
##$BCFW= 0
##$BC_mod= 0
##$BYTORDP= 0
##$COROFFS= 0
##$CY= 15
##$DATMOD= 1
##$DC= 0
##$DFILT= <>
##$DTYPP= 0
##$F1P= 0
##$F2P= 0
##$FCOR= 0.5
##$FTSIZE= 131072
##$FT_mod= 6
##$GAMMA= 0
##$GB= 0
##$INTBC= 1
##$INTSCL= 1
##$ISEN= 128
##$LB= 0.3
##$LEV0= 0
##$LPBIN= 0
##$MAXI= 10000
##$MC2= 0
##$MEAN= 0
##$ME_mod= 0
##$MI= 0
##$NCOEF= 0
##$NC_proc= -2
##$NLEV= 6
##$NOISF1= 0
##$NOISF2= 0
##$NSP= 0
##$NTH_PI= 0
##$NZP= 0
##$OFFSET= 14.96261
##$PC= 1
##$PHC0= 3.312378
##$PHC1= 0
##$PH_mod= 1
##$PKNL= yes
##$PPARMOD= 0
##$PPDIAG= 0
##$PPIPTYP= 0
##$PPMPNUM= 2147483647
##$PPRESOL= 1
##$PSCAL= 4
##$PSIGN= 0
##$PYNMP= <proc.py>
##$REVERSE= no
##$SF= 400.020008992161
##$SI= 131072
##$SIGF1= 0
##$SIGF2= 0
##$SINO= 400
##$SIOLD= 131072
##$SPECTYP= <>
##$SREGLST= <1H.CDCl3>
##$SSB= 0
##$STSI= 131072
##$STSR= 0
##$SW_p= 8223.68421052631
##$SYMM= 0
##$S_DEV= 0
##$TDeff= 65536
##$TDoff= 0
##$TI= <>
##$TILT= no
##$TM1= 0
##$TM2= 0
##$TOPLEV= 0
##$USERP1= <user>
##$USERP2= <user>
##$USERP3= <user>
##$USERP4= <user>
##$USERP5= <user>
##$WDW= 1
##$XDIM= 131072
##$YMAX_p= 420434997
##$YMIN_p= -11619
##$CURPLOT= <Network HP LaserJet P1505>
##$CURPRIN= <$Network HP LaserJet P1505>
##$DFORMAT= <normdp>
##$LAYOUT= <+/1D_H.xwp>
##$LFORMAT= <normlp>
##$PFORMAT= <normpl>
##$SURQMSG= 1
$$ End of Bruker specific parameters
$$ ---------------------------------
##NTUPLES= NMR SPECTRUM
##VAR_NAME=  FREQUENCY,     SPECTRUM/REAL,   SPECTRUM/IMAG
##SYMBOL=    X,             R,               I
##VAR_TYPE=  INDEPENDENT,   DEPENDENT,       DEPENDENT
##VAR_FORM=  AFFN,          ASDF,            ASDF
##VAR_DIM=   131072,        131072,          131072
##UNITS=     HZ,            ARBITRARY UNITS, ARBITRARY UNITS
##FACTOR=    0.0627417313425164, 1,          1
##FIRST=     8223.62146879497, 278,          -54424
##LAST=      0,             2711,            -54761
##MIN=       0,             -11619,          0
##MAX=       8223.62146879497, 420434997,    0
$$ Real data points
##PAGE= N=1
##DATA TABLE= (X++(R..R)), XYDATA
$$ [...]
63255C05043O47K49R5O73J812K922L607L838L778L715L850M156M628N528O859
63240C51400P897P991P719Q298R838J1265J2075J2989J4585J6311J7541J8494
63228D96403J9507K0274K0566K0829K1296K1308K0320J8862J7679J6722J5805
63217G09571J5486J6239J7387J7993J8167J8417J8278J6931J4727J2640J0439
63206H86275O923J970l115p495j1701j6143k0118k2925k4947k6769k8041k8054
63194G05860k6859k5100k3059k0602j7774j4824j1854q858o008l484j096J515
63182E47857M335O915Q853J0215J1394J2624J3674J4137J4068J4151J4982J6331
63170F89536J7452J7963J8000J7619J6641J5214J3954J3176J2361J0793Q408N606
$$ y = [305043, 305690, 305939, 306034, 306707, 308519, 311441, 315048, 318886, 322664, 326379, 330229, 334385, 339013, 344541, 351400, 359297, 367288, 375007, 383305, 393143, 404408, 416483, 429472, 444057, 460368, 477909, 496403, 515910, 536184, 556750, 577579, 598875, 620183, 640503, 659365, 677044, 693766, 709571, 725057, 741296, 758683, 776676, 794843, 813260, 831538, 848469, 863196, 875836, 886275, 893198, 895168, 892053, 884558, 872857, 856714, 836596, 813671, 788724, 761955, 733914, 705860, 679001, 653901, 630842, 610240, 592466, 577642, 565788, 556930, 550922, 547438, 546342, 547857, 552192, 559107, 567960, 578175, 589569, 602193, 615867, 630004, 644072, 658223, 673205, 689536, 706988, 724951, 742951, 760570, 777211, 792425, 806379, 819555, 831916, 842709, 851117, 856723]
63158H56723K519j066n062q899j2185j5121j7977k0412k1748k1924k1635k1415
63146F91798k0967j9812j8224j6964j6235j5505j4362j2950j1416r609p618o047
63134E22089n244m709l802k665j916j684j474r23j86M00O35N43M54Q76J946L084
63118E07424L572L407L192L305L579L803M091M615N256N619N384M622L853L655
63104E65377M150M973N776O396O556N922M723L782L468L101J884M4j524k345k468
63089F09815j930r52l52q16j729j739n87N05N57N7K0N71J130J451J790K294K898
63072F12983L757N128O754P823P865P426P521Q496R736J0628J1419J2776J4729
63059G27041J6556J7830J8960K0511K2429K4359K6314K8500L0860L3182L5437
$$ y = [856723, 859242, 858176, 853114, 844215, 832030, 816909, 798932, 778520, 756772, 734848, 713213, 691798, 670831, 651019, 632795, 615831, 599596, 584091, 569729, 556779, 545363, 535754, 528136, 522089, 516845, 512136, 508334, 505669, 503753, 502069, 500595, 499672, 499486, 499886, 500521, 501064, 501518, 502394, 504340, 507424, 510996, 514403, 517595, 520900, 524479, 528282, 532373, 536988, 542244, 547863, 553247, 557869, 561722, 565377, 569527, 574500, 580276, 586672, 593228, 599150, 603873, 607655, 611123, 614224, 616108, 616152, 614628, 612283, 609815, 607885, 606933, 606581, 605765, 604036, 602297, 601710, 602215, 602772, 602829, 602849, 603420, 604550, 606001, 607791, 610085, 612983, 616740, 621868, 628622, 636445, 644310, 651736, 659257, 667753, 677489, 688117, 699536, 712312, 727041, 743597, 761427, 780387, 800898, 823327, 847686, 874000, 902500, 933360, 966542, 1001979]
63048A001979L7514L8943L9476L9707M0463M1636M2268M1811M0768L9949L9582
63037A444096L9264L8511L7272L6223L6299L7580L8877L8947L7940L6909L5994
63026A857912L3959K9626K3022J4895N793l935j3818k3420l2528m0888m8027n3587
63014A749004n7443n9438n9394n7591n4781n1420m7300m2180l6429l0665k5115
63003A227248j9698j4419r343m437K26M372P974J1537J5469J9360K2345K4166
62991A284800K5336K6243K6615K6202K5527K5365K5567K5106K3470K1415J9746
62980A555392J7865J4385R097L273k172p817j4479k1711k8439l4377l9857m4700
62968A406460m8348n0798n2409n2862n1512m8743m5890m3600m1312l8533l5544
$$ y = [1001979, 1039493, 1078436, 1117912, 1157619, 1198082, 1239718, 1281986, 1323797, 1364565, 1404514, 1444096, 1483360, 1521871, 1559143, 1595366, 1631665, 1669245, 1708122, 1747069, 1785009, 1821918, 1857912, 1891871, 1921497, 1944519, 1959414, 1965207, 1961272, 1947454, 1924034, 1891506, 1850618, 1802591, 1749004, 1691561, 1632123, 1572729, 1515138, 1460357, 1408937, 1361637, 1319457, 1283028, 1252363, 1227248, 1207550, 1193131, 1183788, 1179351, 1179577, 1183949, 1191923, 1203460, 1218929, 1238289, 1260634, 1284800, 1310136, 1336379, 1362994, 1389196, 1414723, 1440088, 1465655, 1490761, 1514231, 1535646, 1555392, 1573257, 1587642, 1596739, 1600012, 1597840, 1590023, 1575544, 1553833, 1525394, 1491017, 1451160, 1406460, 1358112, 1307314, 1254905, 1202043, 1150531, 1101788, 1055898, 1012298, 970986, 932453, 896909]
62957H96909l2490k8925k4863k1283j8815j6790j4381j1965j0391r546q618p462
62945F91380o578o026n302m308l579l469l781m336n222o311p093p219o799o097
62931F15260n315m805m936n514n765n225m316l742l575l304k713k224k293k787
62917E58746l164l127k826k431j847j049m67o87j725k886l431l177k424j556q59
62902E27090m55j92K34Q12J073O43j42n43l22o5m45j457k555l396m070m661m898
62885E06651m524l803l377l608m201m543m225l260k015r63l27M4K83J48o19j601
62869D70060j862j039J40P17N50K61M44J191K080K388J647K66p71j064j163j474
62853D72371j535r86n75j198k365k733j991j165r87j010o22K5M97P78J000J029
$$ y = [896909, 864419, 835494, 810631, 789348, 770533, 753743, 739362, 727397, 717006, 707460, 698842, 691380, 684802, 678776, 673474, 669166, 665587, 662118, 658337, 654001, 648779, 642468, 635375, 628156, 621357, 615260, 609945, 605140, 600204, 594690, 588925, 583700, 579384, 575642, 572067, 568763, 566050, 563826, 561533, 558746, 555582, 552455, 549629, 547198, 545351, 544302, 543835, 543148, 541423, 538537, 535106, 531929, 529505, 527949, 527090, 526635, 526443, 526677, 527489, 528562, 529205, 529063, 528520, 528198, 528133, 527688, 526231, 523676, 520280, 516210, 511549, 506651, 502127, 498324, 494947, 491339, 487138, 482595, 478370, 475110, 473095, 472132, 471805, 471849, 472132, 472280, 471661, 470060, 468198, 467159, 467299, 468016, 468566, 468827, 469271, 470462, 472542, 474930, 476577, 476843, 476072, 475008, 473845, 472371, 470836, 469850, 469275, 468077, 465712, 462979, 460988, 459823, 458836, 457826, 457204, 457229, 457726, 458504, 459504, 460533]
62837D60533P76M48K07o9l17p2Q88J977K326J726Q35M37O52Q75N80L7r5Q1l48
62818D71477j608k461j833n58l08j144j504o34L43J73q70j666j594p26N51J565
62802D59203J798J725K395L809M696M447M205N181O862P919Q182Q538R429J0509
62788E38898J1569J2781J4053J5047J5856J6919J8365J9973K1785K4241K7698
62777G37185L2169L7289M2329M6589N0257N4450N9826O5506P0039P3029P5065
62766A343733P6311P6029P3483O8595O1626N2866M2787L1946K0532Q380m524j7771
62754A833993l0681m2482n2473o0404o6556p1185p4044p4833p3800p1541o8414
62743A147580o4695o0930n7531n4110m9939m5113m0661l7339l4774l2024k8645
$$ y = [460533, 461309, 461757, 461964, 461895, 461578, 461506, 462394, 464371, 466697, 468423, 469258, 469695, 470347, 471222, 471802, 471839, 471744, 471825, 471477, 469869, 467408, 465575, 465017, 464709, 463565, 462061, 461427, 461770, 461943, 461073, 459407, 457813, 457087, 457638, 459203, 461001, 462726, 465121, 468930, 473626, 478073, 482278, 487459, 494321, 502240, 510422, 518960, 528389, 538898, 550467, 563248, 577301, 592348, 608204, 625123, 643488, 663461, 685246, 709487, 737185, 769354, 806643, 848972, 895561, 945818, 1000268, 1060094, 1125600, 1195639, 1268668, 1343733, 1420044, 1496073, 1569556, 1638151, 1699777, 1752643, 1795430, 1827376, 1847908, 1856288, 1851764, 1833993, 1803312, 1760830, 1708357, 1647953, 1581397, 1510212, 1436168, 1361335, 1287535, 1215994, 1147580, 1082885, 1021955, 964424, 910314, 860375, 815262, 774601, 737262, 702488, 670464, 641819]
62732F41819k5031k1878j9463j7435j5351j3364j2112j1791j1709j1089r912q685
62720D63999p633o626n600m636l740k924k351k033j622q22K69J526L101M911O256
62705D42075O683O934Q244J0755J3304J4895J5778J6942J9046K2015K5347K8558
62693F30576L1547L4515L7556M0520M3408M6474M9551N1713N2144N1065M9228
62682A118297M6692M2806L7272L0492K2814J4152M555n375j4986k4053l2500l9830
62670A200336m5248m8384m9729n0240n0397m9824m8064m5571m3346m1673l9840
62659F88020l7311l4404l1455k8200k4609k1579j9899j9039j7861j6140j4458
62648D23065j2987j1435r931q929q265p360o378o159o833p454p272o584n940n399
$$ y = [641819, 616788, 594910, 575447, 558012, 542661, 529297, 517185, 505394, 493685, 482596, 472684, 463999, 456366, 449740, 444140, 439504, 435764, 432840, 430489, 428456, 426834, 426012, 426281, 427807, 430908, 435819, 442075, 448758, 455692, 463936, 474691, 487995, 502890, 518668, 535610, 554656, 576671, 602018, 630576, 662123, 696638, 734194, 774714, 818122, 864596, 914147, 965860, 1018004, 1069069, 1118297, 1164989, 1207795, 1245067, 1275559, 1298373, 1312525, 1317080, 1311705, 1296719, 1272666, 1240166, 1200336, 1155088, 1106704, 1056975, 1006735, 956338, 906514, 858450, 812879, 769533, 727860, 688020, 650709, 616305, 584850, 556650, 532041, 510462, 490563, 471524, 453663, 437523, 423065, 410078, 398643, 388712, 379783, 371518, 364158, 357780, 351621, 344788, 337334, 330062, 323478, 317538, 312139]
62634C12139m864m564m645m765m466l724k890k358k300k477k348j732j175j220
62620B68611j507j293n98j15lL40J136J773J719J207P49N93R08J825K991L668
62604B82004L608L399L717M663N979P319Q281Q782R536J1471J4439J7266J9258
62591C99722K0961K3097K5615K8211L0996L4004L6701L8560L9721M0473M0573
62580G58634L9507L7058L3160K7657K0768J3366O276m30o978j3179j8633k3240
62568H73966k7015k9723l1260l2050l2502l2398l1314k9482k7537k5709k3818
62557E51158k1932k0393j9174j7790j5996j4093j2490j1334j0608j0295j0242
62546C86811j0142r780r229q759q585q632q476p702o376n011l980l212k558k159
$$ y = [312139, 307275, 302711, 298066, 293301, 288835, 285111, 282221, 279863, 277563, 275086, 272738, 271006, 269831, 268611, 267104, 265811, 265213, 265098, 265095, 265435, 266571, 268344, 270063, 271270, 272019, 272612, 273520, 275345, 278336, 282004, 285612, 289011, 292728, 297391, 303370, 310689, 318970, 327752, 337288, 348759, 363198, 380464, 399722, 420683, 443780, 469395, 497606, 528602, 562606, 599307, 637867, 677588, 718061, 758634, 798141, 835199, 868359, 896016, 916784, 930150, 936426, 935996, 929018, 915839, 897206, 873966, 846951, 817228, 785968, 753918, 721416, 689018, 657704, 628222, 600685, 574976, 551158, 529226, 508833, 489659, 471869, 455873, 441780, 429290, 417956, 407348, 397053, 386811, 376669, 366889, 357660, 348901, 340316, 331684, 323208, 315506, 309130, 304119, 300139, 296927, 294369, 292210]
62532B92210k112k064j504m05P64J597K122K561K959L162L099L017L324M169N243
62517C18142O163O920P757Q748R790J0938J2374J4094J5987J8144K0695K3314
62505D73066K5415K6887K8186K9551L0591L0767K9763K7370K3535J8816J4160
62494G58107R895N471M56m724r442j3650j7519k0842k3327k5094k6304k6678k5954
62481E80395k4471k2755k0809j8465j6094j4281j2874j1138q832o569m981m084
62469D15042l540l057k414j491m25M79J049J305J316J307J656K466L307L825M365
62454D25190N417O614P064O754O737P616Q614Q644P763O883O440O039N296M244
62440E19315K829O98k234n382q041j0072j1763j3172j4044j4270j4129j3907j3510
$$ y = [292210, 290098, 288034, 286530, 286125, 286889, 288486, 290608, 293169, 296128, 299290, 302389, 305406, 308730, 312899, 318142, 324305, 331225, 338982, 347730, 357520, 368458, 380832, 394926, 410913, 429057, 449752, 473066, 498481, 525368, 553554, 583105, 613696, 644463, 674226, 701596, 725131, 743947, 758107, 768002, 773473, 773929, 769205, 759763, 746113, 728594, 707752, 684425, 659331, 633027, 606349, 580395, 555924, 533169, 512360, 493895, 477801, 463520, 450646, 439508, 430676, 424107, 419126, 415042, 411502, 408445, 406031, 404540, 404115, 404594, 405643, 406948, 408264, 409571, 411227, 413693, 417000, 420825, 425190, 430607, 437221, 444285, 451039, 457776, 465392, 474006, 482650, 490413, 497296, 503736, 509775, 515071, 519315, 522144, 522842, 520608, 515226, 507185, 497113, 485350, 472178, 458134, 443864, 429735, 415828, 402318]
62427D02318j2650j1306r840q679p967p507o897n735l818j397P89J912J784J217
62413C32224J416K814M676N929O323O463O932P667Q204Q219P781P293P179P381
62399D20501P275O446N330M565L918K588N94j089k006k826m055n087n381n586
62385D25187o481p372o841m815k747j733j441r54J81J846L595M941N939P382R842
62370D26529J2824J5557J8207K1300K4468K7054K9668L3517L8174M1759M3731
62359G32788M5737M8837N1579N2028N0391M8148M5466M1160L4752K7131J9235
62348A197252J1257L216m598j1934j8596k4168k8291l1229l3670l5905l7682l8722
62336I46930l8976l8447l7138l5123l2438k9102k5498k2463k0621j9792j9265
$$ y = [402318, 389668, 378362, 368522, 359843, 351876, 344369, 337472, 331737, 327919, 326522, 327311, 329223, 331007, 332224, 333640, 336454, 341130, 347059, 353382, 359845, 366777, 374444, 382648, 390867, 398648, 405941, 413120, 420501, 427776, 434222, 439552, 444117, 448035, 450623, 451217, 450128, 448122, 445296, 441241, 436154, 430773, 425187, 418706, 411334, 404493, 399678, 396931, 395198, 393757, 392803, 392984, 394830, 398425, 403366, 409305, 416687, 426529, 439353, 454910, 473117, 494417, 518885, 545939, 575607, 609124, 647298, 689057, 732788, 778525, 827362, 878941, 930969, 981360, 1029508, 1074974, 1116134, 1150886, 1178017, 1197252, 1208509, 1211725, 1207127, 1195193, 1176597, 1152429, 1124138, 1092909, 1059239, 1023334, 985652, 946930, 907954, 869507, 832369, 797246, 764808, 735706, 710208, 687745, 667124, 647332, 628067]
62325F28067j8447j7092j5315j3578j2287j1160r549p522o032n602n547m924l652
62312D97360k202r06r7k56j254k128k260k232k716l320l454l575m408n450n596
62297D57506m909m447m474m243l545l044k830j993j57J760K899L613M568N570
62283D46274O052O149O474P143P734P938P806P467P101P000P395Q188R091R919
62269E51731J0651J1388J2348J3698J5366J7233J9449K2236K5415K8629L2022
62258G60166L6110M0745M4825M7429M8694M9050M8074M4851L9369L2760K5973
62247A218046J8799J0634J742o785j4211k0669k6393l1060l4312l6578l8675m0668
62235I99870m1705m1148l9322l6955l4295l1167k7537k3684j9945j6544j3587
$$ y = [628067, 609620, 592528, 577213, 563635, 551348, 540188, 530639, 523117, 517085, 511483, 505936, 501012, 497360, 495158, 494252, 494155, 493899, 492645, 490517, 488257, 486025, 483309, 479989, 476535, 472960, 468552, 463102, 457506, 452597, 448150, 443676, 439433, 435888, 432844, 430014, 428021, 427864, 429624, 432523, 436136, 440704, 446274, 452326, 458475, 464949, 472092, 479826, 487764, 495570, 503037, 510138, 517138, 524533, 532721, 541812, 551731, 562382, 573770, 586118, 599816, 615182, 632415, 651864, 674100, 699515, 728144, 760166, 796276, 837021, 881846, 929275, 977969, 1027019, 1075093, 1119944, 1159313, 1192073, 1218046, 1236845, 1247479, 1249221, 1242436, 1228225, 1207556, 1181163, 1150103, 1115791, 1079213, 1040538, 999870, 958165, 917017, 877695, 840740, 806445, 775278, 747741, 724057, 704112, 687568, 673981]
62224F73981j0977q568o473m995m146l602l253l294l591l513k799k112k100k362
62210F12196j983q61J67N02M32N31R17J323J638K206L543N673P811R047R449J0085
62194F62676J1752J4139J6495J8572K0450K1987K3046K3926K4989K5986K6289
62183H90307K5520K3548K0304J6156J2144R131O969N036L383K641L102M552O871
62170A029664J0073J3857J7791K1887K6244L0307L3145L4456L4561L3499L0916
62159A316400K6881K2094J7059J1795O524J952j473m157o878j0021j3359j6295
62147A350522j8220j9021j9217j9315j9100j7978j5873j3333j0839q545o605n147
62135A177329l997k870j862j206o83J92J374K381L104M001N360P006Q748J0599
$$ y = [673981, 663004, 654436, 647963, 642968, 638822, 635220, 631967, 628673, 625082, 621569, 618770, 616658, 614558, 612196, 610213, 609352, 609519, 610021, 610453, 610984, 611901, 613224, 614862, 617068, 620611, 626284, 634095, 643142, 652591, 662676, 674428, 688567, 705062, 723634, 744084, 766071, 789117, 813043, 838032, 864018, 890307, 915827, 939375, 959679, 975835, 987979, 997110, 1004079, 1009115, 1012498, 1015139, 1018241, 1022793, 1029664, 1039737, 1053594, 1071385, 1093272, 1119516, 1149823, 1182968, 1217424, 1251985, 1285484, 1316400, 1343281, 1365375, 1382434, 1394229, 1400753, 1402705, 1401232, 1397075, 1390197, 1380176, 1366817, 1350522, 1332302, 1313281, 1294064, 1274749, 1255649, 1237671, 1221798, 1208465, 1197626, 1189081, 1182476, 1177329, 1173332, 1170462, 1168600, 1167394, 1166711, 1166903, 1168277, 1170658, 1173762, 1177763, 1183123, 1190129, 1198877, 1209476]
62121A209476J2434J3927J4954J5728J6488J7429J8793K0555K2156K3029K3260
62110A408229K3358K3602K4153K5361K7227K8871K9373K9021K8869K9292K9873
62099A707229L0523L1636L3144L4453L5475L6782L8628M0763M3211M6174M9051
62088B127069N0714N1044N1047N1156N0565M8805M6865M6083M6781M8532N0823
62077B669484N2831N3413N2085M9342M5557M0556L4871L0384K8742K9757L2205
62066C119227L5477L9486M3528M6458M7793M7910M7301M6234M4865M3049M0348
62055C601676L6675L2631K8786K5057K1287J7846J5037J2357R082N256J474j909
62043C805255m748o688p540p792q173q825r461r958j0319j0416j0350j0709j1815
$$ y = [1209476, 1221910, 1235837, 1250791, 1266519, 1283007, 1300436, 1319229, 1339784, 1361940, 1384969, 1408229, 1431587, 1455189, 1479342, 1504703, 1531930, 1560801, 1590174, 1619195, 1648064, 1677356, 1707229, 1737752, 1769388, 1802532, 1836985, 1872460, 1909242, 1947870, 1988633, 2031844, 2078018, 2127069, 2177783, 2228827, 2279874, 2331030, 2381595, 2430400, 2477265, 2523348, 2570129, 2618661, 2669484, 2722315, 2775728, 2827813, 2877155, 2922712, 2963268, 2998139, 3028523, 3057265, 3087022, 3119227, 3154704, 3194190, 3237718, 3284176, 3331969, 3379879, 3427180, 3473414, 3518279, 3561328, 3601676, 3638351, 3670982, 3699768, 3724825, 3746112, 3763958, 3778995, 3791352, 3800434, 3805690, 3807164, 3805255, 3800507, 3793819, 3786279, 3778487, 3770314, 3761489, 3752028, 3742070, 3731751, 3721335, 3710985, 3700276, 3688461]
62030C688461j3099j3838j4134j4502j4850j4774j4486j4570j4848j4446j3042
62019C531872j1304r957r062q343p597o581n012k947q74Q03K166L660N649Q060
62005C490533J0352J2038J3318J4872J6817J8385J8954J8831J8520J7688J5580
61994C665888J2121P845K959k754r203j5843k2251k8244l3454l7433m0197m2093
61982C457341m3140m3123m2371m1818m2005m2542m2679m2125m1153m0277l9806
61971B996302l9456l8480l6592l4572l3392l2874l1929l0173k8450k7508k6965
61960B635911k6028k4671k3416k2376k1251k0122j9440j9161j8437j6588j4059
61949B410362j2044j1171j0901j0234q782o996n451m248l095j801m92N53J239
$$ y = [3688461, 3675362, 3661524, 3647390, 3632888, 3618038, 3603264, 3588778, 3574208, 3559360, 3544914, 3531872, 3520568, 3510611, 3501549, 3493206, 3485609, 3479028, 3474016, 3471069, 3470195, 3470998, 3473164, 3476824, 3482473, 3490533, 3500885, 3512923, 3526241, 3541113, 3557930, 3576315, 3595269, 3614100, 3632620, 3650308, 3665888, 3678009, 3685854, 3688813, 3686059, 3676856, 3661013, 3638762, 3610518, 3577064, 3539631, 3499434, 3457341, 3414201, 3371078, 3328707, 3286889, 3244884, 3202342, 3159663, 3117538, 3076385, 3036108, 2996302, 2956846, 2918366, 2881774, 2847202, 2813810, 2780936, 2749007, 2718834, 2690384, 2662876, 2635911, 2609883, 2585212, 2561796, 2539420, 2518169, 2498047, 2478607, 2459446, 2441009, 2424421, 2410362, 2398318, 2387147, 2376246, 2366012, 2357230, 2350234, 2344783, 2340535, 2337440, 2335639, 2335147, 2335700, 2336939]
61936B336939J866K972M807O952Q681R765J0780J2459J4937J7779K0579K3323
61924B471839K6258K9598L3488L8126M3825N0819N9076O8496P9325R2075J06967
61913C099892J23808J42749J64766J90949K21580K56448K95878L40790L91807
61904E228667M48892N11676N79237O49222P17396P77833Q22881Q43296Q29791
61895A1408891P75401O76626N33495L50875J40679p8670k87137m68654o13378
61886A2438128p17037p79980q06393q02809p76385p34103o82321o25973n68204
61877E944923n11191m56925m06775l61009l19557k82778k50856k22992j98079
61868B934761j75840j56492j39716j24815j11590j00123q9910q0158p0834o2518
$$ y = [2336939, 2338805, 2341777, 2346584, 2353536, 2362217, 2371982, 2382762, 2395221, 2410158, 2427937, 2448516, 2471839, 2498097, 2527695, 2561183, 2599309, 2643134, 2693953, 2753029, 2821525, 2900850, 2992925, 3099892, 3223700, 3366449, 3531215, 3722164, 3943744, 4200192, 4496070, 4836860, 5228667, 5677559, 6189235, 6768472, 7417694, 8135090, 8912923, 9735804, 10579100, 11408891, 12184292, 12860918, 13394413, 13745288, 13885967, 13807297, 13520160, 13051506, 12438128, 11721091, 10941111, 10134718, 9331909, 8555524, 7821421, 7139100, 6513127, 5944923, 5433732, 4976807, 4570032, 4209023, 3889466, 3606688, 3355832, 3132840, 2934761, 2758921, 2602429, 2462713, 2337898, 2226308, 2126185, 2036275, 1956117, 1885283, 1822765]
61858A822765n5244m8337m1536l5412l0529k6750k3544k0426j7008j3204r505
61847A501270o610m765l737l309l326l451l426l430l663l819l537l134l075k946
61833A449042j845J86K021K898L211L621M174M638N048N451N558N099M198L141
61819A496441K027R73L67O62J932L796N709P387R028J1087J3719J6684J9855K3520
61805A613187K7856L2492L6964M1299M5691N0038N4368N9391O5799P3172Q0320
61794B180577Q6747R3125J00368J08895J18846J30363J43482J58231J74949J94147
61784C489730K16066K40867K69205L02072L40217L84309M35574M95517N64980
61775F738537O44156P33518Q33905R45111J064673J187628J306424J410422J486112
$$ y = [1822765, 1767521, 1719184, 1677648, 1642236, 1611707, 1584957, 1561413, 1540987, 1523979, 1510775, 1501270, 1494660, 1489895, 1486158, 1482849, 1479523, 1476072, 1472646, 1469216, 1465553, 1461734, 1458197, 1455063, 1451988, 1449042, 1447197, 1447383, 1449404, 1452302, 1455513, 1459134, 1463308, 1467946, 1472994, 1478445, 1484003, 1489102, 1493300, 1496441, 1498468, 1499441, 1499808, 1500470, 1502402, 1506198, 1511907, 1519294, 1528322, 1539409, 1553128, 1569812, 1589667, 1613187, 1641043, 1673535, 1710499, 1751798, 1797489, 1847527, 1901895, 1961286, 2027085, 2100257, 2180577, 2267324, 2360449, 2460817, 2569712, 2688558, 2818921, 2962403, 3120634, 3295583, 3489730, 3705796, 3946663, 4215868, 4517940, 4858157, 5242466, 5678040, 6173557, 6738537, 7382693, 8116211, 8950116, 9895227, 10959900, 12147528, 13453952, 14864374, 16350486]
61766A6350486J518451J492449J394865J217120R59280O32624K59117j31755n07584
61757B3185053q38762j104159j294096j409206j456992j448843j398075j318112
61749A2916808j220638j114673j006866r02169q04057p14303o33059n59726m94109
61740E467208m36556l86930l43870l05610k71320k41146k15072j92395j72325
61731B901984j54527j38772j24613j11597r9651q8979p9716p1774o4922n9040
61721A908393n4310n0895m8337m5674m2488l9416l7226l5716l4089l2066k9972
61710A458204k7946k5819k3647k1751k0275j9217j8722j8763j8778j8332j7905
61699A227049j8178j8811j8841j8170j7582j7294j6623j5325j4211j3929j4049
$$ y = [16350486, 17868937, 19361386, 20756251, 21973371, 22932651, 23565275, 23824392, 23692637, 23185053, 22346291, 21242132, 19948036, 18538830, 17081838, 15632995, 14234920, 12916808, 11696170, 10581497, 9574631, 8672462, 7868405, 7154102, 6521043, 5961317, 5467208, 5030652, 4643722, 4299852, 3994242, 3722922, 3481776, 3266704, 3074309, 2901984, 2747457, 2608685, 2484072, 2372475, 2272824, 2183845, 2104129, 2032355, 1967433, 1908393, 1854083, 1803188, 1754851, 1709177, 1666689, 1627273, 1590047, 1554331, 1520242, 1488176, 1458204, 1430258, 1404439, 1380792, 1359041, 1338766, 1319549, 1300827, 1282064, 1263286, 1244954, 1227049, 1208871, 1190060, 1171219, 1153049, 1135467, 1118173, 1101550, 1086225, 1072014, 1058085, 1044036]
61688A044036j3817j3067j2043j0981j0321j0492j1027j0661q880o704n382m924
61676I25737m594m233m213m401m188l483l009l310l908l861l019k422l143m871
61662H73082o098n934n194n165n837o142n673n088m839m512l742k899k497k479
61648H06983k478k288j848j256r01j046j266q87J1P64J246J966K945L539L612
61633H09096L872M691N569O151O805P698Q331Q501Q731R023Q325O130L693K505
61619H99121K219J238j057l664n303n578n017m656n338o803p786p596p088p435
61605H35257q517r338r583r692r715r230q303p592p312o929o050m967m086l367
61591G30576k583j700q15N7J052K390M114N822O936P421P935Q969J0313J1623
$$ y = [1044036, 1030219, 1017152, 1005109, 994128, 983807, 973315, 962288, 951627, 942747, 936043, 930661, 925737, 921143, 916910, 912697, 908296, 904108, 900625, 897616, 894306, 890398, 886537, 883518, 881096, 877953, 873082, 866984, 861050, 855856, 850691, 844854, 838712, 833039, 827951, 823112, 818600, 814858, 811959, 809462, 806983, 804505, 802217, 800369, 799113, 798212, 797166, 795900, 795013, 795024, 795788, 797034, 799000, 801945, 805484, 809096, 812968, 817659, 823228, 829379, 836184, 843882, 852213, 860714, 869445, 878468, 886793, 892923, 896616, 899121, 901340, 902578, 901521, 897857, 892554, 886976, 881959, 877303, 871965, 865162, 857376, 849780, 842692, 835257, 826740, 817402, 807819, 798127, 788412, 779182, 770879, 763287, 755975, 749046, 742996, 738029, 733943, 730576, 727993, 726293, 725478, 725535, 726587, 728977, 733091, 738913, 745849, 753270, 761205, 770174, 780487, 792110]
61577G92110J3075J4935J6961J8747K0341K1994K3727K5606K7994L0799L2900
61566A039189L3252L2325L1628L1847L2282L2040L0991K9440K7637K5861K4436
61555A370928K3377K2380K1302K0253J9182J7821J6121J4290J2281R692O334K568
61543A556529j126m606p942j1130j4109j6838j9143k0631k0982k0338j9260j8272
61531A382152j7390j6195j4435j2343j0224p921n082j892J002L468O253J0099
61519A317492J4840J9782K4589K9467L4752M0784M7981N6553O6100P5903Q5720
61508A813963R6224J08511J23176J39816J57635J76530J97160K19547K42029K62241
61498C536832K78787K90976K96995K93657K78449K51010K12422J64198J08828
$$ y = [792110, 805185, 820120, 837081, 855828, 876169, 898163, 921890, 947496, 975490, 1006289, 1039189, 1072441, 1104766, 1136394, 1168241, 1200523, 1232563, 1263554, 1292994, 1320631, 1346492, 1370928, 1394305, 1416685, 1437987, 1458240, 1477422, 1495243, 1511364, 1525654, 1537935, 1547627, 1553961, 1556529, 1555403, 1550797, 1542855, 1531725, 1517616, 1500778, 1481635, 1461004, 1440022, 1419684, 1400424, 1382152, 1364762, 1348567, 1334132, 1321789, 1311565, 1303644, 1298562, 1296670, 1297672, 1301140, 1307393, 1317492, 1332332, 1352114, 1376703, 1406170, 1440922, 1481706, 1529687, 1586240, 1652340, 1728243, 1813963, 1910187, 2018698, 2141874, 2281690, 2439325, 2615855, 2813015, 3032562, 3274591, 3536832, 3815619, 4106595, 4403590, 4697247, 4975696, 5226706, 5439128, 5603326, 5712154]
61489E712154N0313p017o0029j06700j45318j74719j94972k06983k11590k09620
61479D445519k02439j91615j78237j63087j47100j31059j14994r8631q2228o6412
61469C069717n1477l7435k4537j3048k632P397J7203K6172L3542L9028M3064M6553
61457C153547N0029N2845N3771N2619N0645M8952M7348M5360M3495M2619M2755
61446C683985M3427M4643M6613M8987N1275N3516N5563N6360N5093N2556N0110
61435D242128M7624M3782L8120L1359K3875J5406O286k489j0801j9552k8844l7232
61423D349662m3383m7393m9949n1226n1222n0257m8459m5423m1018l5943l0888
61412C854501k5763k0265j4620r270m359n5L056M428M074K231j033n490j0456
$$ y = [5712154, 5762467, 5755450, 5695421, 5588721, 5443403, 5268684, 5073712, 4866729, 4655139, 4445519, 4243080, 4051465, 3873228, 3710141, 3563041, 3431982, 3316988, 3218357, 3136129, 3069717, 3018240, 2980805, 2956268, 2943220, 2940588, 2947985, 2965188, 2991360, 3024902, 3063930, 3106994, 3153547, 3203576, 3256421, 3310192, 3362811, 3413456, 3462408, 3509756, 3555116, 3598611, 3641230, 3683985, 3727412, 3772055, 3818668, 3867655, 3918930, 3972446, 4028009, 4084369, 4139462, 4192018, 4242128, 4289752, 4333534, 4371654, 4403013, 4426888, 4442294, 4448580, 4446091, 4435290, 4415738, 4386894, 4349662, 4306279, 4258886, 4208937, 4157711, 4106489, 4056232, 4007773, 3962350, 3921332, 3885389, 3854501, 3828738, 3808473, 3793853, 3784583, 3780224, 3780169, 3783225, 3787653, 3791727, 3793958, 3792925, 3787435, 3776979]
61399C776979j5234j9578k3323k5878k6475k4795k1031j5405p824J997J4124K8107
61387C641664M3299N9681P8018R8824J21518J45133J69555J95239K21836K47917
61377E022684K72054K93249L10054L20132L21110L11504K90630K58343K15355
61368G615115J63588J06044M6458j1296o4277j11291j52334j87391k16338k39602
61358F948676k57957k71514k79821k82954k81669k76424k67310k55199k41732
61349D534096k27741k12749j96623j80564j65659j51359j36426j20768j05370
61340C036837r0878p7224o4248n1834l9589k7277j5413m770M618J3348K1665K9276
61328B734511L6039M2195M7797N2372N5320N6345N5579N3576N1150M8809M6384
$$ y = [3776979, 3761745, 3742167, 3718844, 3692966, 3666491, 3641696, 3620665, 3605260, 3597436, 3599433, 3613557, 3641664, 3684963, 3744644, 3822662, 3921486, 4043004, 4188137, 4357692, 4552931, 4774767, 5022684, 5294738, 5587987, 5898041, 6218173, 6539283, 6850787, 7141417, 7399760, 7615115, 7778703, 7884747, 7931205, 7919909, 7855632, 7744341, 7592007, 7404616, 7188278, 6948676, 6690719, 6419205, 6139384, 5856430, 5574761, 5298337, 5031027, 4775828, 4534096, 4306355, 4093606, 3896983, 3716419, 3550760, 3399401, 3262975, 3142207, 3036837, 2945959, 2868735, 2804487, 2752653, 2713064, 2685787, 2670374, 2665604, 2670222, 2683570, 2705235, 2734511, 2770550, 2812745, 2860542, 2912914, 2968234, 3024579, 3080158, 3133734, 3184884, 3233693, 3280077]
61317C280077M3391L9752L5864L2122K8734K5919K3898K2554K1424K0100J8467
61306C592302J6392J3403Q948L006l764j0653j7568k4827l2343l9356m5148m9776
61294C410616n3771n7410o0528o2799o3873o3467o1711n9216n6381n2842m8132
61283B770486m2524l6720l0934k4994j9186j4169j0121o731m096k808k976l945
61271B571282n214o969r448j2302j4852j6465j6647j5381j3399j1436r121n459
61259B434589m72M629R233J4289K1012K9496L9315N0526O3363P7454R2149J07116
61247B942699J21892J35310J45952J52804J54890J50708J38795J18640R0732N6231
61237D208653J7107k3870o3988j01122j33105j57431j72637j79637j80715j77372
$$ y = [3280077, 3323468, 3363220, 3399084, 3431206, 3459940, 3485859, 3509757, 3532311, 3553735, 3573835, 3592302, 3608694, 3622097, 3631045, 3634051, 3630287, 3619634, 3602066, 3577239, 3544896, 3505540, 3460392, 3410616, 3356845, 3299435, 3238907, 3176108, 3112235, 3048768, 2987057, 2927841, 2871460, 2818618, 2770486, 2727962, 2691242, 2660308, 2635314, 2616128, 2601959, 2591838, 2585107, 2581011, 2578203, 2575227, 2571282, 2566068, 2559099, 2549651, 2537349, 2522497, 2506032, 2489385, 2474004, 2460605, 2449169, 2440048, 2434589, 2434117, 2438746, 2447979, 2462268, 2483280, 2512776, 2552091, 2602617, 2665980, 2743434, 2835583, 2942699, 3064591, 3199901, 3345853, 3498657, 3653547, 3804255, 3943050, 4061690, 4152422, 4208653, 4225760, 4201890, 4137902, 4036780, 3903675, 3746244, 3573607, 3393970, 3213255, 3035883]
61227C035883j69994j59311j46996j34582j22650j11393j01204r2225q3881p5419
61217A838228o6793n8685n1763m6046m1008l6112l1226k6524k2118j7966j4065
61206A425922j0380o498j859L472Q602J2701J5838J8553K0949K2583K3094K2470
61194A555447K0815J8255J5052J1474P563L332p95m152o525q421j0499j2850j5076
61181A573620j6920j8553k0199k1698k2717k3217k3402k3248k2594k1791k1700
61170A337581k2703k4138k5085k5348k5267k5065k4952k5344k6313k7144k7203
61159A059019k6851k6645k6068k4193k1297j8648j6650j4550j2138j0444j0317
61148H51218j1429j3153j5406j8018k0180k1194k1152k0402j9019j7168j5256
$$ y = [3035883, 2865889, 2706578, 2559582, 2425000, 2302350, 2190957, 2089753, 1997528, 1913647, 1838228, 1771435, 1712750, 1660987, 1614941, 1573933, 1537821, 1506595, 1480071, 1457953, 1439987, 1425922, 1415542, 1409044, 1407185, 1410657, 1419259, 1431960, 1447798, 1466351, 1487300, 1509883, 1532977, 1555447, 1576262, 1594517, 1609569, 1621043, 1628606, 1631938, 1631143, 1626991, 1620466, 1612045, 1601546, 1588696, 1573620, 1556700, 1538147, 1517948, 1496250, 1473533, 1450316, 1426914, 1403666, 1381072, 1359281, 1337581, 1314878, 1290740, 1265655, 1240307, 1215040, 1189975, 1165023, 1139679, 1113366, 1086222, 1059019, 1032168, 1005523, 979455, 955262, 933965, 915317, 898667, 884117, 871979, 861535, 851218, 839789, 826636, 811230, 793212, 773032, 751838, 730686, 710284, 691265, 674097, 658841]
61137F58841j3376j1296r265p859o855n298l067j169l6J240L198M880N365N261
61123F20564N661O547P334Q057Q913R422R254R148R842J0813J1216J1377J2097
61110G40245J3163J3870J4383J5182J5650J4705J2498J0038P401L886k39l720
61098H57062o125q170j0065j1019j0748j0216j0269j0562j0418r942r692r940
61086G39896j0573j1245j1399j0647r362q374q005p897p739p561p352o973o517
61073F26252o115n434m005k027l70L34K17j30k3R16K257K969K604J880J544J240
61057F22109K56j166k176k538k543k194j440q28p94p65p0P37O96K35O60K162L705
61040F16046M755N653O426O708O908P789Q930R111Q402Q184Q849R203Q617Q011
$$ y = [658841, 645465, 634169, 624904, 617045, 610190, 604892, 601825, 600656, 600620, 601860, 605058, 609938, 615303, 620564, 626225, 632772, 640106, 648163, 657076, 666498, 675752, 684900, 694742, 705555, 716771, 728148, 740245, 753408, 767278, 781661, 796843, 812493, 827198, 839696, 849734, 857135, 861021, 860782, 857062, 850937, 842767, 832702, 821683, 810935, 800719, 790450, 779888, 769470, 759528, 749836, 739896, 729323, 718078, 706679, 696032, 686670, 678296, 670291, 662394, 654655, 647094, 639742, 632769, 626252, 620137, 614703, 610698, 608671, 608301, 608635, 608852, 608722, 608699, 609615, 611872, 614841, 617445, 619325, 620869, 622109, 622365, 621199, 619023, 616485, 613942, 611748, 610308, 609480, 608686, 607921, 607851, 608588, 609284, 609519, 610179, 612341, 616046, 620801, 626454, 632880, 639588, 646496, 654285, 663215, 672326, 680728, 688912, 697761, 706964, 715581, 723592]
61026G23592Q097Q247P857P475P709Q235Q617Q958R177Q827Q265Q706J0397J2077
61012H46236J2864J3425J4535J5814J6825J8073K0009K2150K4142K6593L0008
61001A060674L3927L7854M1935M6101M9812N3200N6979O0761O3348O5475O9994
60990A640060P8190Q8102R7942J08658J21206J33888J45131J56898J72500J93119
60980B935694K19613K55717L05537L69676M48502N48495O80871Q55102J078788
60971G697995J360789J702445K079674K440138K722797K872791K833098K542911
60963B6252638J982311J238099N07611J770j79936q9725J35764L61838M78411
60954C0688781L81806n025o63809j447036k143453k596353k769578k720085k530627
$$ y = [723592, 731689, 739936, 747793, 755268, 762977, 771212, 779829, 788787, 797964, 806791, 815056, 823762, 834159, 846236, 859100, 872525, 887060, 902874, 919699, 937772, 957781, 979931, 1004073, 1030666, 1060674, 1094601, 1132455, 1174390, 1220491, 1270303, 1323503, 1380482, 1441243, 1504591, 1570066, 1640060, 1718250, 1806352, 1904294, 2012952, 2134158, 2268046, 2413177, 2570075, 2742575, 2935694, 3155307, 3411024, 3716561, 4086237, 4534739, 5083234, 5764105, 6619207, 7697995, 9058784, 10761229, 12840903, 15281041, 18003838, 20876629, 23709727, 26252638, 28234949, 29473048, 29980659, 29982429, 29802493, 29712768, 29848532, 30210370, 30688781, 31070587, 31065562, 30401753, 28954717, 26811264, 24214911, 21445333, 18725248, 16194621]
60945A6194621k268833j981988j700587j439195j202042r92324q14373o68631
60937E126648n50277m54241l78206l20042k75792k41537k14789j93160j74023
60928B324581j56397j41117j28141j15581j02273q9516p9115p1228o5141o0709
60918A315363n7813n5572n3272n1225m9654m7606m4010l9217l4587l0935k8126
60907H23346k5696k3260k0670j8262j6601j5688j4919j3960j2980j1860j0155
60896F39295q115o718o160n315l381j055O16J620K367K768K868L493N044O358
60882F33685O068M615L586L494L384K485R64q12k621l967m377m195m259m780n381
60867F27889o035p002p900p964p246o586o283n846n124m629m494m149l280k191
$$ y = [16194621, 13925788, 11943800, 10243213, 8804018, 7601976, 6609652, 5795279, 5126648, 4576371, 4122130, 3743924, 3423882, 3148090, 2906553, 2691764, 2498604, 2324581, 2168184, 2027067, 1898926, 1783345, 1681072, 1591556, 1512441, 1441213, 1376072, 1315363, 1257550, 1201978, 1148706, 1097481, 1047827, 1000221, 956211, 916994, 882407, 851472, 823346, 797650, 774390, 753720, 735458, 718857, 703169, 688250, 674290, 661310, 649450, 639295, 631180, 624462, 618302, 612987, 609606, 608551, 609167, 610787, 613154, 615922, 618790, 622283, 627327, 633685, 639753, 644368, 647954, 651448, 654832, 657317, 658281, 657469, 654848, 650881, 646504, 642309, 638050, 633270, 627889, 621854, 614852, 606952, 598988, 591742, 585156, 578873, 573027, 567903, 563274, 558780, 554631, 551351, 549160]
60853E49160r65O65K398L436L836M710O508Q273R249J0112J1736J3747J5227J6051
60839F54143J6444J5996J4365J2404J1371J1242J0937J0057R229Q737P949O491
60827G89365N054M530M866N195M842L918L062K763K809K455J256l62j595k154
60813H26004k465l107m360o095p879r238j0083j0755j1513j2194j2543j2601j2518
60800G10653j2247j1661j0775r681q539p713p464p349o468m642k706j282N1J787
60786F21964L466M441N063O151P607Q644R169R885J1004J1912J2234J2353J2569
60773G36462J2565J2109J1614J1522J1647J1464J0763R705Q536P477O672O036
60761H56572N363M618L913L275K673K211K000J878J664J508J630J846J853J773
$$ y = [549160, 548195, 548860, 551258, 554694, 558530, 563240, 569748, 578021, 587270, 597382, 609118, 622865, 638092, 654143, 670587, 686583, 700948, 713352, 724723, 735965, 746902, 756959, 766188, 774925, 782874, 789365, 794419, 798949, 803815, 809010, 813852, 817770, 820832, 823595, 826404, 828859, 830115, 829753, 828158, 826004, 823539, 820432, 816072, 809977, 802098, 792860, 782777, 772022, 760509, 748315, 735772, 723171, 710653, 698406, 686745, 675970, 666289, 657750, 650037, 642573, 635224, 628756, 624114, 621408, 620126, 620177, 621964, 625430, 629871, 634934, 641085, 648692, 657336, 666505, 676390, 687394, 699306, 711540, 723893, 736462, 749027, 761136, 772750, 784272, 795919, 807383, 818146, 827851, 836387, 843864, 850536, 856572, 861935, 866553, 870466, 873741, 876414, 878625, 880625, 882503, 884167, 885675, 887305, 889151, 891004, 892777]
60747H92777J893J987J591R16O93R67Q88n3j359k455l547m901n948n972n393n466
60731H66618o689q123q571p934p140o965p271p260o246m242k030o83o51j222j123
60716G90468J1J094Q98m03j593k159k753l824m802n150n352o032o744o562n479
60701G41618m239l047j449N45K158K847K869K659K247J559P53m2r21k032l443
60686G42082n230p367r531j1312j2553j3241j3313j2887j2383j1947j1101r580
60674F11637q064p355p051o011l999j960o35J89R55J731K508L308L753L290K147
60659E94443J354J478J998K135J722J029L98K39P85J572J815J487J412K029K797
60644F16693L112L067K945K705K355K238K436K527K387K621L675N100O176O864
$$ y = [892777, 894670, 896657, 898248, 899164, 899857, 900824, 901712, 901659, 900300, 897845, 894298, 889397, 883449, 877477, 872084, 866618, 859929, 851806, 843235, 835301, 828161, 821196, 813925, 806665, 800419, 796177, 794147, 793464, 792813, 791591, 790468, 790479, 791573, 792471, 792068, 790475, 788316, 785563, 781739, 776937, 771787, 766435, 760403, 753659, 747097, 741618, 737379, 734332, 732883, 733428, 735586, 738433, 741302, 743961, 746208, 747767, 748520, 748478, 747557, 745525, 742082, 736852, 729485, 719954, 708642, 696089, 682848, 669535, 656648, 644265, 632318, 621217, 611637, 603573, 596218, 589167, 583156, 579157, 577197, 576562, 576751, 577706, 579437, 581945, 585253, 589006, 592296, 594443, 595797, 597275, 599273, 601408, 603130, 604159, 604557, 604796, 605581, 607153, 608968, 610455, 611867, 613896, 616693, 619805, 622872, 625817, 628522, 630877, 633115, 635551, 638078, 640465, 643086, 646761, 651861, 658037, 664901]
60630F64901P655Q793J0128J1403J2345J2872J3376J4375J5639J6256J5864J5169
60618H18776J4876J4684J3847J2218J0133P728M955K033o18k696m062m768n166
60605H81940n564n567m518k738j561j667k255k535l083m822p308r141r819j0066
60591H11296j0429j0521r807q396o785n312m042k860j616l83M77P34N96L08k70
60576G52990j351k664l603l826l369k424j293l05N54J686L184M413M732M431M369
60561G57524M771M949M249K821J348K91m18j099j882k563k907k916k584j626J62
60546G60120K307M006N138O373Q072R788J1255J3282J6966K2338K8315L3869L8769
60533I60598M3253M7301N0193N0602M7307M0043K9633J7338M362q116j9028k7745
$$ y = [664901, 672556, 681349, 691477, 702880, 715225, 728097, 741473, 755848, 771487, 787743, 803607, 818776, 833652, 848336, 862183, 874401, 884534, 892262, 897217, 899250, 898632, 895936, 891874, 887106, 881940, 876376, 870809, 866291, 863553, 861992, 860325, 858070, 855535, 852452, 847630, 840322, 831181, 821362, 811296, 800867, 790346, 780539, 772143, 765358, 760046, 756004, 753144, 751528, 751145, 751622, 752356, 752952, 753260, 752990, 751639, 748975, 745372, 741546, 738177, 735753, 734460, 734155, 734709, 736395, 739579, 743992, 748724, 753155, 757524, 762295, 767244, 771493, 774314, 775662, 775953, 775535, 774436, 772554, 769991, 767084, 764168, 761584, 759958, 760120, 762427, 766433, 771571, 777944, 786016, 795804, 807059, 820341, 837307, 859645, 887960, 921829, 960598, 1003851, 1051152, 1101345, 1151947, 1199254, 1239297, 1268930, 1286268, 1290630, 1282514, 1263486, 1235741]
60521A235741l3972l7288l7362l4720l0609k5795k0107j3454o621o24M090P415
60509A006694R210R748R921J0356J0736J0573J0193J0404J1622J3815J6933K0916
60497A151121K5695L1711L9794M9996O1122P2201Q3771R6874J11328J26153J41416
60486A991182J58507J78690K02586K31176K65965L07185L52150L95815M32358
60477D515614M55698M59002M35157L79210K91300J77621M8609q3959k08760l15653
60467F153839l96779m48186m70504m67880m46432m12981l73665l32565k91784
60458B513063k52870k17529j86745j60109j36774j16593r9844q6338p5376o6125
60448A114760n7741m9653m2212l6371l2251k8755k5119k1974k0177j9407j8796
$$ y = [1235741, 1201769, 1164481, 1127119, 1092399, 1061790, 1035995, 1015888, 1002434, 995813, 995189, 999279, 1006694, 1015904, 1025652, 1035573, 1045929, 1056665, 1067238, 1077431, 1087835, 1099457, 1113272, 1130205, 1151121, 1176816, 1208527, 1248321, 1298317, 1359439, 1431640, 1515411, 1612285, 1723613, 1849766, 1991182, 2149689, 2328379, 2530965, 2762141, 3028106, 3335291, 3687441, 4083256, 4515614, 4971312, 5430314, 5865471, 6244681, 6535981, 6713602, 6762211, 6678252, 6469492, 6153839, 5757060, 5308874, 4838370, 4370490, 3924058, 3511077, 3137412, 2804847, 2513063, 2260193, 2042664, 1855919, 1695810, 1559036, 1442443, 1342599, 1256261, 1180885, 1114760, 1057019, 1007366, 965154, 928783, 896532, 867777, 842658, 820684, 800507, 781100, 762304]
60437G62304j8221j7911j7474j6359j4887j3721j2742j1382r785q565p696o650
60425F06911n425m492l945l494l159l019k608j487j58M75M07K92K38j07m81j86
60409E79762O73J268J363J504J846J906J682J836K525L045L077L290M246N438
60395F13461O003N804N369N188N395N783N910N481M685L869K968J781O34L6k12
60380F72155r54k502m197n218n376n018m572m255l882l083j974j251j130p79M76
60365F28440J802J772L59j017j329q55k55K38N90Q25J298K314L419L870L838M182
60349F49491N033N604N618N840O777P842Q323Q362Q442Q500Q151P345O340N367
60335G47035M592M124L758L127K210J391J024J247K197L859N700P000P547P653
$$ y = [762304, 744083, 726172, 708698, 692339, 677452, 663731, 650989, 639607, 629822, 621257, 613561, 606911, 601486, 596994, 593049, 589555, 586396, 583377, 580769, 579282, 579124, 579599, 580006, 580298, 580536, 580429, 579948, 579762, 580435, 581703, 583066, 584570, 586416, 588322, 590004, 591840, 594365, 597410, 600487, 603777, 608023, 613461, 619464, 625268, 630637, 635825, 641220, 647003, 652913, 658394, 663079, 666948, 669916, 671697, 672331, 672367, 672155, 671201, 668699, 664502, 659284, 653908, 648890, 644318, 640063, 636181, 633098, 631124, 629873, 628743, 627964, 628440, 630242, 632014, 632373, 631356, 630027, 629172, 628917, 629155, 629745, 630570, 631868, 634182, 637601, 641471, 645309, 649491, 654524, 660128, 665746, 671586, 678363, 686205, 694528, 702890, 711332, 719832, 727983, 735328, 741668, 747035, 751627, 755751, 759509, 762636, 764846, 766237, 767261, 768508, 770705, 774564, 780264, 787264, 794811, 802464]
60321H02464P518P041O138M757K759K90k038l902n796q117j0100j0612r693q330
60307G72379o965n383l876l218l350l226k265r45J79J026J420J066M25N89J845
60292G49701L240L884L891L727L470L101K811K650K498K448K647K764K399J933
60278G91164K008K291J965J376J833L544N145N788O285P565R160J0114J0434J0801
60264H69473J1543J2599J3933J5482J7149J9196K1995K5254K8207L0697L3280
60253A098808L6216L9344M2986M7820N3665N9660O5820P2989Q1000Q8551R5490
60242A782349J03398J12946J22277J29282J34080J37761J39893J38921J34339
60233B935246J26980J17593J06410R3719P9748O4266M7217K9487J2197m274j9877
$$ y = [802464, 809982, 817023, 823161, 827918, 830677, 830967, 828929, 825027, 819231, 811114, 801014, 790402, 780709, 772379, 765414, 760031, 756155, 752937, 749587, 746361, 744096, 743151, 743330, 744356, 745776, 746842, 747267, 747856, 749701, 752941, 756825, 760716, 764443, 767913, 771014, 773825, 776475, 778973, 781421, 784068, 786832, 789231, 791164, 793172, 795463, 797428, 798804, 800637, 804181, 809326, 815114, 821399, 828964, 838124, 848238, 858672, 869473, 881016, 893615, 907548, 923030, 940179, 959375, 981370, 1006624, 1034831, 1065528, 1098808, 1135024, 1174368, 1217354, 1265174, 1318839, 1378499, 1444319, 1517308, 1598308, 1686859, 1782349, 1885747, 1998693, 2120970, 2250252, 2384332, 2522093, 2661986, 2800907, 2935246, 3062226, 3179819, 3286229, 3379948, 3459696, 3523962, 3571179, 3600666, 3612863, 3608589, 3588712]
60222C588712l3983m5707n4668o0778o3753o3553o0702n5591m8096l8527k8039
60211C035315j7225n196Q908K4262L9395N4188O9532Q5414J00692J14472J26527
60200C636284J36363J43031J45929J45006J40149J31215J18594J03033Q4894O4205
60190D848703M1442J7659o139k9254n1130p1272q9231j04264j15360j21931j24199
60179D195024j22568j17128j08136r6433q2772o7164m9479l0316j0794Q191K6093
60168C544518M2503N7282P0433Q1527Q9642R4144R4890R1551Q3621P1643N7527
60157D379281M2986K8281J3002k647j7876l1793m3246n0954n4432n4068m9986
60146D158548m1830l0156j6662k261J3800L2026N1237P0265Q9773J11011J33820
$$ y = [3588712, 3554729, 3509022, 3454354, 3393576, 3329823, 3266270, 3205568, 3149977, 3101881, 3063354, 3035315, 3018090, 3012894, 3021802, 3046064, 3085459, 3139647, 3209179, 3294593, 3395285, 3509757, 3636284, 3772647, 3915678, 4061607, 4206613, 4346762, 4477977, 4596571, 4699604, 4784498, 4848703, 4890145, 4907804, 4901665, 4872411, 4821281, 4750009, 4660778, 4556514, 4441154, 4319223, 4195024, 4072456, 3955328, 3847192, 3750759, 3667987, 3600823, 3551344, 3521028, 3510234, 3518425, 3544518, 3587021, 3644303, 3714736, 3796263, 3885905, 3980049, 4074939, 4166490, 4250111, 4321754, 4379281, 4422267, 4450548, 4463550, 4460903, 4443027, 4411234, 4367988, 4317034, 4262602, 4208534, 4158548, 4116718, 4086562, 4069900, 4067639, 4081439, 4113465, 4164702, 4234967, 4324740, 4435751, 4569571]
60135D569571J57450J82277K09050K37282K66030K95535L26139L56215L82992
60126F982541M05163M22840M35183M40082M36289M24193M04181L75853L39231
60117A0665556K95438K45747J90981J32146P0573P269n6991j20755j81948k38750
60107A1009266k89619l32584l65590l87582l98440l98170l87159l66991l39854
60098G743277l07206k70064k30122j89150j47460j04412o0550j7889K1955N8563
60088F496942R1475J19482J41479J56836J64676J64066J55180J39269J17271Q9593
60078G836269N7545K3665r797m1785p1656r8743j23043j45191j65160j81977j95022
60067F885105k04665k11213k14320k13873k10457k04396j95273j82950j68226
$$ y = [4569571, 4727021, 4909298, 5118348, 5355630, 5621660, 5917195, 6243334, 6599549, 6982541, 7387704, 7810544, 8245727, 8685809, 9122098, 9546291, 9950472, 10326325, 10665556, 10960994, 11206741, 11397722, 11529868, 11600441, 11607710, 11550719, 11429964, 11248016, 11009266, 10719647, 10387063, 10021473, 9633891, 9235451, 8837281, 8450122, 8083131, 7743277, 7436071, 7166007, 6935885, 6746735, 6599275, 6494863, 6434313, 6416424, 6438379, 6496942, 6588417, 6707899, 6849378, 7006214, 7170890, 7334956, 7490136, 7629405, 7746676, 7836269, 7893814, 7917479, 7907682, 7865897, 7794241, 7695498, 7572455, 7427264, 7262104, 7080127, 6885105, 6680440, 6469227, 6254907, 6041034, 5830577, 5626181, 5430908, 5247958, 5079732]
60058E079732j51915j34039j14437r3532p2020n0290k8453o462J5952L8882O1725
60047D545143Q3708J04679J24490J41738J54296J61236J63068J59988J51211J36385
60037E925942J16422R2469O5176L5445M734k5956n6332q5608j12127j34738j53298
60026E672129j67383j75793j78266j76319j71366j63097j50867j35746j19719
60017D233573j03530q6579o8501m9643l0247j0237J0283L1245N3054P6092R9858
60006D155368J23364J46094J67850J87787K04462K16688K23647K24333K17701
59997E867294K03560J82840J56914J27033R4335N9831K4257j1817m7601q1959
59987F574687j13588j41093j63139j78779j87662j89931j86114j77121j63942
$$ y = [5079732, 4927817, 4793778, 4679341, 4585809, 4513789, 4463499, 4435046, 4428584, 4444536, 4483418, 4545143, 4628851, 4733530, 4858020, 4999758, 5154054, 5315290, 5478358, 5638346, 5789557, 5925942, 6042364, 6134833, 6200009, 6235454, 6240188, 6214232, 6157900, 6072292, 5960165, 5825427, 5672129, 5504746, 5328953, 5150687, 4974368, 4803002, 4639905, 4489038, 4353292, 4233573, 4130043, 4043464, 3974963, 3925320, 3895073, 3884836, 3895119, 3926364, 3979418, 4055510, 4155368, 4278732, 4424826, 4592676, 4780463, 4984925, 5201613, 5425260, 5649593, 5867294, 6070854, 6253694, 6410608, 6537641, 6631976, 6691807, 6716064, 6704247, 6656646, 6574687, 6461099, 6320006, 6156867, 5978088, 5790426, 5600495, 5414381, 5237260, 5073318]
59978E073318j47134j26924j03974p9687n5437l1830q805J3774L5898N7223P6841
59967D703263R3535J06601J16272J23077J27144J28340J26716J22400J15238J04976
59957E867562R1837P6714O0780M4914K9431J4404L77j1366j9574k3943k4823k2109
59945F084204j4893k359J5426L7781O4105R4291J28713J67705K10704K55993L01821
59934G343491L47614L93314M37478M76843N07958N28370N35754N26794M97967
59925A1595583M47517L76345K87378J84721P3414m0544j50621k50712l36157m04167
59915A1782757m53503m84106m97198m95264m81248m57617m26361l89550l49238
59906G748672l06858k63193k18908j74634j30644q7013m4141k668L7193P5731
$$ y = [5073318, 4926184, 4799260, 4695286, 4615599, 4560162, 4528332, 4519527, 4533301, 4569199, 4626422, 4703263, 4796798, 4903399, 5019671, 5142748, 5269892, 5398232, 5524948, 5647348, 5762586, 5867562, 5959399, 6036113, 6096893, 6141807, 6171238, 6185642, 6186019, 6174653, 6155079, 6131136, 6106313, 6084204, 6069311, 6066952, 6082378, 6120159, 6184264, 6278555, 6407268, 6574973, 6785677, 7041670, 7343491, 7691105, 8084419, 8521897, 8998740, 9506698, 10035068, 10570822, 11097616, 11595583, 12043100, 12419445, 12706823, 12891544, 12964958, 12924414, 12773793, 12523081, 12186924, 11782757, 11329254, 10845148, 10347950, 9852686, 9371438, 8913821, 8487460, 8097910, 7748672, 7441814, 7178621, 6959713, 6785079, 6654435, 6567422, 6523281, 6520613, 6557806, 6633537]
59896F633537J13049J48578J81217K09515K31894K46983K53670K50460K35398
59887H504301K07273J66802J16034N7052p935p5512j41292k01509k53843k96891
59877H074480l29689l51866l63582l65271l57974l43682l24545l01872k76492
59868E059507k49646k22598j95689j69005j43696j21352j02212q5391p0844n9664
59858C639410n2202m7478m4797m4401m5819m7082m6473m4013m0323l5145k7940
59847C163737j9135r821q70O843J2026J3638J1590O262k096j2976k5133l7121
59835C106944m7909n6725o2877o6186o7046o5780o2482n7621n1914m5426l7674
59824B485304k8909k0235j2037l416O239J6223K5727L4994M4319N2834N9337O3782
$$ y = [6633537, 6746586, 6895164, 7076381, 7285896, 7517790, 7764773, 8018443, 8268903, 8504301, 8711574, 8878376, 8994410, 9051462, 9043527, 8968015, 8826723, 8625214, 8371371, 8074480, 7744791, 7392925, 7029343, 6664072, 6306098, 5962416, 5637871, 5335999, 5059507, 4809861, 4587263, 4391574, 4222569, 4078873, 3957521, 3855309, 3769918, 3699074, 3639410, 3587208, 3539730, 3494933, 3450532, 3404713, 3357631, 3311158, 3267145, 3226822, 3191677, 3163737, 3144602, 3134781, 3133911, 3140754, 3152780, 3166418, 3178008, 3184270, 3182174, 3169198, 3144065, 3106944, 3059035, 3002310, 2939433, 2873247, 2806201, 2740421, 2677939, 2620318, 2568404, 2522978, 2485304, 2456395, 2436160, 2424123, 2420707, 2426946, 2443169, 2468896, 2503890, 2548209, 2601043, 2660380, 2724162]
59812B724162O7064O9843P2321P4532P5936P5199P1169O3767N3441M0452K5454
59801C413340J0236l080j3423k0836k5491k7287k6155k2193j5624o831L779J6084
59789C282519L0105M5575O2307Q0923J02407J26937J54158J84776K20536K62115
59779D552358L08018L55901M03633M48070M83704N03410N00009M67220M01200
59770H423523L03273J81303M7817q3183j98639k88697l49147l81635l90818l81670
59760F882127l59245l28830k94436k57964k20878j85572j53806j25035r7872p2481
59750D786008m9894k9801j0764P796K5419M2136N8637P5191R1681J08552J26459
59739E231420J45367J65151J86648K10715K36734K63670K92283L24635L61361
$$ y = [2724162, 2791226, 2861069, 2933390, 3007922, 3083858, 3159057, 3230226, 3293993, 3347434, 3387886, 3413340, 3423576, 3420496, 3407073, 3386237, 3360746, 3333459, 3307304, 3285111, 3269487, 3262656, 3266435, 3282519, 3312624, 3358199, 3420506, 3501429, 3603836, 3730773, 3884931, 4069707, 4290243, 4552358, 4860376, 5216277, 5619910, 6067980, 6551684, 7055094, 7555103, 8022323, 8423523, 8726796, 8908099, 8955916, 8872733, 8674094, 8385397, 8036250, 7654615, 7263797, 6882127, 6522882, 6194052, 5899616, 5641652, 5420774, 5235202, 5081396, 4956361, 4858489, 4786008, 4736114, 4706313, 4695549, 4703345, 4728764, 4770900, 4829537, 4904728, 4996409, 5104961, 5231420, 5376787, 5541938, 5728586, 5939301, 6176035, 6439705, 6731988, 7056623, 7417984]
59730G417984M01075M42576M86018N31514N77866O23024O64568O99462P24502
59721A2568589P37517P37254P22261O91644O47645N96282N44563M97821M60021
59712A8203597M35161M26711M35908M61403N00259N48585O01324O52326O95114
59703B2960388P23685P32809P18236O77158O08946N15636M01789K73901J39820
59694B7752368Q073j13418k18529l02908l63056l96534m03317l86038l48126k92166
59684B4936349k20328j35140l8847O7358J82466L04712M32432N65082P01907Q39728
59674B7635719R72875J094716J197723J272202J306700J290416J215130J075814
59666C7061295Q71861O09288L01466l2654l71019o90506r69642j192304j350127
$$ y = [7417984, 7819059, 8261635, 8747653, 9279167, 9857033, 10480057, 11144625, 11844087, 12568589, 13306106, 14043360, 14765621, 15457265, 16104910, 16701192, 17245755, 17743576, 18203597, 18638758, 19065469, 19501377, 19962780, 20463039, 21011624, 21612948, 22265274, 22960388, 23684073, 24416882, 25135118, 25812276, 26421222, 26936858, 27338647, 27612548, 27752368, 27760441, 27647023, 27428494, 27125586, 26762530, 26365996, 25962679, 25576641, 25228515, 24936349, 24716021, 24580881, 24542034, 24609392, 24791858, 25096570, 25529002, 26094084, 26795991, 27635719, 28608594, 29703310, 30901033, 32173235, 33479935, 34770351, 35985481, 37061295, 37933156, 38542444, 38843910, 38811256, 38440237, 37749731, 36780089, 35587785, 34237658]
59657C4237658j442028j472071j447881j379916j280788j164377j044909r36027
59649B4069661q49601p94423p74841p89652q31797q89394r48035r94149j018533
59640A6179236j018220r95280r53870q98511q34198p66115o98070o31769n68172
59631H815031n08733m54663m05859l61568l21562k85856k53854k24688j98002
59622E800246j73714j51404j30682j11666r4495p8961o5271n4346m6547m0926
59612D852234l6742l5000l7232m3381n1994o1896p2386q2332r0536r6880j01885
59601D141970j05415j06831j06145j03791r9607r3281q5590p7810p0068o1568
59591C231864n2335m3392l5167k7102j8986j1401m595J936Q408J4276J9020K2624
$$ y = [34237658, 32795630, 31323559, 29875678, 28495762, 27214974, 26050597, 25005688, 24069661, 23220060, 22425637, 21650796, 20861144, 20029347, 19139953, 18191918, 17197769, 16179236, 15161016, 14165736, 13211866, 12313355, 11479157, 10713042, 10014972, 9383203, 8815031, 8306298, 7851635, 7445776, 7084208, 6762646, 6476790, 6222936, 5998248, 5800246, 5626532, 5475128, 5344446, 5232780, 5138285, 5059324, 4994053, 4939707, 4893160, 4852234, 4815492, 4780492, 4743260, 4699879, 4647885, 4585989, 4513603, 4431271, 4340735, 4243855, 4141970, 4036555, 3929724, 3823579, 3719788, 3620181, 3526900, 3441310, 3363500, 3293432, 3231864, 3179529, 3136137, 3100970, 3073868, 3054882, 3043481, 3038886, 3040822, 3049230, 3063506, 3082526, 3105150]
59579C105150K5137K6531K7036K6911K6041K4588K3633K4169K5687K7057K8581
59568C390521L1799L7212M3696N0393N7807O6610P6599Q7331R8851J11278J24574
59557D176671J39064J55337J73308J92152K11487K31712K52873K73986K93835
59548F100425L11709L27062L39136L47216L50777L49257L42366L30775L15790
59539I114513K98278K78547K57208K35361K13718J92164J70288J47949J25619
59530A1033645J05067Q9484Q1894Q3056R1393J04605J20571J36916J50784J59128
59520A2156543J58702J46201J19595P9335K7485l3969j02929j75836k48105l16037
59510A1810985l77195m29033m68801m95274n09438n13028n07272m93137m71758
$$ y = [3105150, 3130287, 3156818, 3183854, 3210765, 3236806, 3261394, 3285027, 3309196, 3334883, 3361940, 3390521, 3422320, 3459532, 3503228, 3553621, 3611428, 3678038, 3754637, 3841968, 3940819, 4052097, 4176671, 4315735, 4471072, 4644380, 4836532, 5048019, 5279731, 5532604, 5806590, 6100425, 6412134, 6739196, 7078332, 7425548, 7776325, 8125582, 8467948, 8798723, 9114513, 9412791, 9691338, 9948546, 10183907, 10397625, 10589789, 10760077, 10908026, 11033645, 11138712, 11228196, 11310090, 11393146, 11484539, 11589144, 11709715, 11846631, 11997415, 12156543, 12315245, 12461446, 12581041, 12660376, 12687861, 12653892, 12550963, 12375127, 12127022, 11810985, 11433790, 11004757, 10535956, 10040682, 9531244, 9018216, 8510944, 8017807, 7546049]
59501G546049m44290m12248l78065l44263l11792k80112k48992k19278j91833
59492D715176j66727j43664j22308j02093q2624o4257m7425l1540j5615L21J5651
59481C954895L0808M7059O4657Q2672J00782J19769J40077J61273J83200K06229
59471E091421K29929K52818K73761K92350L07549L17271L19740L14041K99002
59462G697882K72926K34982J85990J27710O2609n599p2745j36021j93894k44299
59452G929541k84593l13738l32904l43437l45743l40705l30334l16226k98825
59443E023036k78873k58067k37430k16618j95679j75957j58345j42163j26787
59434C233117j12884j00803q9300p7267o5522n5451m6882l8769l1048k4333j8372
$$ y = [7546049, 7101759, 6689511, 6311446, 5967183, 5655391, 5375279, 5126287, 4907009, 4715176, 4548449, 4404785, 4282477, 4180384, 4097760, 4033503, 3986078, 3954538, 3938923, 3939244, 3954895, 3985703, 4032762, 4097419, 4180091, 4280873, 4400642, 4540719, 4701992, 4885192, 5091421, 5321350, 5574168, 5847929, 6140279, 6447828, 6765099, 7084839, 7398880, 7697882, 7970808, 8205790, 8391780, 8519490, 8582099, 8576500, 8503755, 8367734, 8173840, 7929541, 7644948, 7331210, 6998306, 6654869, 6309126, 5968421, 5638087, 5321861, 5023036, 4744163, 4486096, 4248666, 4032048, 3836369, 3660412, 3502067, 3359904, 3233117, 3120233, 3019430, 2930130, 2852863, 2787341, 2731890, 2685008, 2646239, 2615191, 2590858, 2572486]
59423B572486j2234n698O07O111J0566J3847J6257J8630K1543K4890K8471L2291
59411B727767L5982L8783M0465M1255M0680L7826L3382L0041L0163L4137M1565
59400C132046N2391O5934Q0376R4582J09141J24389J38833J51149J62901J77528
59390D289270J97291K22569K53363K89799L31279L76522M24508M74443N24833
59381G383877N73272O16877O52450O76744O87438O83697O65535O33463N89273
59372A3162626N36468M79084M20431L63047L08881K58863K13014J71156J32493
59363A6046063R4301N2670N481m6478j01808j60205k20647k79456l31734l73971
59353A4684216m04199m21031m24385m16589m01354l82069l62035l45220l35083
$$ y = [2572486, 2560252, 2554554, 2555161, 2561272, 2571838, 2585685, 2601942, 2620572, 2642115, 2667005, 2695476, 2727767, 2763749, 2802532, 2842997, 2884252, 2924932, 2962758, 2996140, 3026181, 3056344, 3090481, 3132046, 3184437, 3250371, 3330747, 3425329, 3534470, 3658859, 3797692, 3948841, 4111742, 4289270, 4486561, 4709130, 4962493, 5252292, 5583571, 5960093, 6384601, 6859044, 7383877, 7957149, 8574026, 9226476, 9903220, 10590658, 11274355, 11939890, 12573353, 13162626, 13699094, 14178178, 14598609, 14961656, 15270537, 15529400, 15742414, 15913570, 16046063, 16140364, 16193034, 16198515, 16152037, 16050229, 15890024, 15669377, 15389921, 15058187, 14684216, 14280017, 13858986, 13434601, 13018012, 12616658, 12234589, 11872554, 11527334, 11192251]
59344A1192251l32729l37184l46913l60133l74408l87230l96765m01483l99927
59335G855479l91900l78947l62591l42782l19154k92861k65943k39598k14277
59326E047426j90673j69226j49240j29775j11024r3762p8076o3677n0767l9382
59316C971824k8614j7620o784L292J3223K3916L4976M5358N5016O4428P3082P9901
59304D311998Q4845Q8601R0957R0821Q7652Q1752P3355O2643N0453L7926K5660
59293E086663J3986L703m396j0237j3796j4347j1383n589K272J2682K6316M2307
59281E128181N8987P5813R3156J10610J26990J41639J54280J63736J68291J67285
59271F388968J61159J50028J33448J11647Q5850N7350K7100l878l4558o4108r1184
$$ y = [11192251, 10859522, 10522338, 10175425, 9815292, 9440884, 9053654, 8656889, 8255406, 7855479, 7463579, 7084632, 6722041, 6379259, 6060105, 5767244, 5501301, 5261703, 5047426, 4856753, 4687527, 4538287, 4408512, 4297488, 4203726, 4125650, 4061973, 4011206, 3971824, 3943210, 3925590, 3918806, 3922098, 3935321, 3959237, 3994213, 4039571, 4094587, 4159015, 4232097, 4311998, 4396843, 4485444, 4576401, 4667222, 4754874, 4836626, 4909981, 4972624, 5023077, 5061003, 5086663, 5100649, 5104352, 5099956, 5089719, 5075923, 5061576, 5050193, 5044604, 5046876, 5059558, 5085874, 5128181, 5187168, 5262981, 5356137, 5466747, 5593737, 5735376, 5889656, 6053392, 6221683, 6388968, 6550127, 6700155, 6833603, 6945250, 7031100, 7088450, 7115550, 7111672, 7077114, 7013006, 6921822]
59260F921822j13332j28067j34450j33116j25316j12771r7822q2566o8040n4752
59250E871590m3255l3576k5111j8129j4274j4278j6205j7366j7077j5995j3711
59239E642613q860r41R886K4341M3559O7337R4668J25722J61573K02069K45549
59228F607516K90536L35987L79880M18951M49799M69055M72935M58439M24930
59219A0308028L73214L03588K16739J16387Q967r9585k05087l03317l89240m58874
59209I870820n10527n43728n58455n56111n39940n13678m80484m43262m04796
59200E319839l66993l30694k96425k64658k35396k08516j84386j63365j44983
59191C124423j28595j14437j02880r3088q3826p5199o8061o2039n5844m9396m3849
$$ y = [6921822, 6808490, 6680423, 6545973, 6412857, 6287541, 6174770, 6076948, 5994382, 5926342, 5871590, 5828335, 5794759, 5769648, 5751519, 5737245, 5722967, 5706762, 5689396, 5672319, 5656324, 5642613, 5633753, 5632812, 5642698, 5667039, 5710598, 5777935, 5872603, 5998325, 6159898, 6361967, 6607516, 6898052, 7234039, 7613919, 8032870, 8482669, 8951724, 9424659, 9883098, 10308028, 10681242, 10984830, 11201569, 11317956, 11326923, 11227338, 11022251, 10718934, 10329694, 9870820, 9360293, 8816565, 8258110, 7701999, 7162059, 6648381, 6167897, 5724635, 5319839, 4952846, 4622152, 4325727, 4061069, 3825673, 3617157, 3432771, 3269406, 3124423, 2995828, 2881391, 2778511, 2685423, 2601597, 2526398, 2458337, 2396298, 2340454, 2291058, 2247209]
59180B247209l9450l5102l0288k5731k1758j7655j3076q635m622m68M043Q307
59168B062774J2174J6404K1316K6112L0100L3608L7289M1375M5963N1104N6339
59157B434558O0988O5173O9683P4783P9949Q4926Q9966R5065R9770J03798J06951
59146C365610J08521J07752J04680R9595R1998Q1300O8263N4415M0229K5279R962
59135D157604m439j7303k8760l8182m4232m6649m6405m3929l8627l0494k0745
59124C797839j0237J498J5150L0611M7365O5005Q3122J01604J21059J42082J64109
59113D559207J86067K07731K29393K50441K69646K86375K99938L07954L07193
59104F903945K96082K74802K43250K00980J49494R2687L4510k2259p4834j20133
$$ y = [2247209, 2207759, 2172657, 2142369, 2116638, 2094880, 2077225, 2064149, 2055514, 2050892, 2050424, 2054467, 2062774, 2074948, 2091352, 2112668, 2138780, 2168880, 2202488, 2239777, 2281152, 2327115, 2378219, 2434558, 2495546, 2560719, 2630402, 2705185, 2785134, 2870060, 2960026, 3055091, 3154861, 3258659, 3365610, 3474131, 3581883, 3686563, 3786158, 3878156, 3959456, 4027719, 4082134, 4122363, 4147642, 4157604, 4153165, 4135862, 4107102, 4068920, 4024688, 3978039, 3931634, 3887705, 3849078, 3818584, 3797839, 3787602, 3789100, 3804250, 3834861, 3882226, 3947231, 4030353, 4131957, 4253016, 4395098, 4559207, 4745274, 4953005, 5182398, 5432839, 5702485, 5988860, 6288798, 6596752, 6903945, 7200027, 7474829, 7718079, 7919059, 8068553, 8161240, 8195750, 8173491, 8098657, 7978524]
59094G978524j56471j84247k04484k18102k26826k32984k37705k40663k41971
59085F035071k42755k43398k42804k40120k35812k30479k24002k16340k07928
59076C951433j98763j88407j77169j66044j55207j44035j32725j22305j12827
59067B553951j03314r3785q5469p8519p1455o3558n5971m9571m3565l7204l1251
59056A840289k6612k2909j9499j6766j5360j5279j6447j9106k2882k6608k9688
59045A609133l2515l5044l6239l5578l3797l1531k8470k4516k0445j6750j2997
59034A301251q923m911r70L464Q150J1925J4452J6723J9346K1708K3223K3775
59022A429213K2522J8187J1350M621l49m363q290j1130j1685j0568r041p186m574
$$ y = [7978524, 7822053, 7637806, 7433322, 7215220, 6988394, 6755410, 6517705, 6277042, 6035071, 5792316, 5548918, 5306114, 5065994, 4830182, 4599703, 4375701, 4159361, 3951433, 3752670, 3564263, 3387094, 3221050, 3065843, 2921808, 2789083, 2666778, 2553951, 2450637, 2356852, 2271383, 2192864, 2121409, 2057851, 2001880, 1952309, 1908744, 1871540, 1840289, 1813677, 1790768, 1771269, 1754503, 1739143, 1723864, 1707417, 1688311, 1665429, 1638821, 1609133, 1576618, 1541574, 1505335, 1469757, 1435960, 1404429, 1375959, 1351443, 1330998, 1314248, 1301251, 1292328, 1287417, 1286447, 1289911, 1298061, 1309986, 1324438, 1341161, 1360507, 1382215, 1405438, 1429213, 1451735, 1469922, 1481272, 1485893, 1485544, 1481181, 1472891, 1461761, 1450076, 1439508, 1430467, 1423281, 1418707]
59009A418707j599J156L928O963R600J1082J1540J1300J0084P683M661J681j093
58996A495693l471n042n797o098n821m680l364k898k811j632O09K225K582K988
58982A462483M321N781O724P783R241J0224J0522J1363J3376J5495J6939J8568
58970A592820K1113K3801K5903K8032L0757L3458L5573L7521L9392M0330M0197
58959A948897M0093M0327L9604L7396L5266L4617L4908L5301L6367L8789M2065
58948B363630M5799N0659N6827O3140O9029P5620Q3621R1991R9928J08330J17886
58937C226460J27678J37239J48054J61285J75780J90166K05222K22426K41789
58928D836099K63023K87187L15273L46543L80155M17008M58217N03095N50469
$$ y = [1418707, 1417108, 1418264, 1422192, 1429155, 1438755, 1449837, 1461377, 1472677, 1482761, 1490444, 1495105, 1496786, 1495693, 1492222, 1487180, 1481383, 1475285, 1469464, 1464784, 1461420, 1458522, 1455711, 1454079, 1454688, 1456913, 1459495, 1462483, 1466804, 1472585, 1479309, 1487092, 1496333, 1506557, 1517079, 1528442, 1541818, 1557313, 1574252, 1592820, 1613933, 1637734, 1663637, 1691669, 1722426, 1755884, 1791457, 1828978, 1868370, 1908700, 1948897, 1988990, 2029317, 2068921, 2106317, 2141583, 2176200, 2211108, 2246409, 2282776, 2321565, 2363630, 2409429, 2460088, 2516915, 2580055, 2649084, 2724704, 2808325, 2900316, 3000244, 3108574, 3226460, 3354138, 3491377, 3639431, 3800716, 3976496, 4166662, 4371884, 4594310, 4836099, 5099122, 5386309, 5701582, 6048125, 6428280, 6845288, 7303505, 7806600, 8357069]
58919H357069O00571O53837P09000P63905Q16818Q65358R05424R32634R43256
58910A5547872R32596Q94732Q25940P26949O00439M48748K76330R2192r2978k70867
58900A9981953m34863n77822o93845p81366q41950q77169q88979q81564q59778
58891A3144617q26388p83147p33422o81135o28074n74703n22720m74293m29737
58882G490998l88395l51038l18987k91751k67996k47883k31988k18842k06165
58873D967953j93768j82673j72282j61051j49220j38083j27285j15671j04120
58864C623800r4621q6920p9027p0763o3860n8598n3283m7232m1522l6451l0796
58853B960727k4106j7472j1604o039m83M961J0877J7998K5580L2211L8132M4802
$$ y = [8357069, 8957640, 9611477, 10320477, 11084382, 11901200, 12766558, 13671982, 14604616, 15547872, 16480468, 17375200, 18201140, 18928089, 19528528, 19977276, 20253606, 20345798, 20252820, 19981953, 19547090, 18969268, 18275423, 17494057, 16652107, 15774938, 14885959, 14004395, 13144617, 12318229, 11535082, 10801660, 10120525, 9492451, 8917748, 8395028, 7920735, 7490998, 7102603, 6751565, 6432578, 6140827, 5872831, 5624948, 5392960, 5174118, 4967953, 4774185, 4591512, 4419230, 4258179, 4108959, 3970876, 3843591, 3727920, 3623800, 3529179, 3442259, 3363232, 3292469, 3228609, 3170011, 3116728, 3069496, 3027974, 2991523, 2960727, 2936621, 2919149, 2907545, 2901506, 2901023, 2905984, 2916861, 2934859, 2960439, 2992650, 3030782, 3075584]
58841C075584N2400N9795O6799P4356Q2541R0470R8257J07116J17421J28472J40142
58830D093353J52969J66801J81172J96742K14638K34616K55742K78476L04143
58821F078652L32862L64144L99100M39613M85447N34378N85210O38401O93627
58812A0551434P48707Q00915Q47165Q82888R02790R02934Q80428Q31571P52772
58803A8101604O43605N07255L48370J72796j0788j91823l61391n13350o42520
58794A8053758p44442q17635q63996q86344q87195q70096q39939q01046p56245
58785A0586820p08081o59277o11645n65765n22041m80853m41820m04406l69192
58776E823740l37314l08770k82669k58782k37540k18885k02575j88932j77817
$$ y = [3075584, 3127984, 3187779, 3254578, 3328934, 3411475, 3501945, 3600202, 3707318, 3824739, 3953211, 4093353, 4246322, 4413123, 4594295, 4791037, 5005675, 5240291, 5496033, 5774509, 6078652, 6411514, 6775658, 7174758, 7614371, 8099818, 8634196, 9219406, 9857807, 10551434, 11300141, 12101056, 12948221, 13831109, 14733899, 15636833, 16517261, 17348832, 18101604, 18745209, 19252464, 19600834, 19773630, 19762842, 19571019, 19209628, 18696278, 18053758, 17309316, 16491681, 15627685, 14741341, 13854146, 12984050, 12144111, 11343065, 10586820, 9878739, 9219462, 8607817, 8042052, 7520011, 7039158, 6597338, 6192932, 5823740, 5486426, 5177656, 4894987, 4636205, 4398665, 4179780, 3977205, 3788273, 3610456]
58767C610456j67558j56586j45411j35295j25944j16453j07425r9863r2772q4454
58757B378695p5535o8053o2134n6140m9809m4510m0497l6524l2250k8643k5991
58746A858609k3667k1762k0717j9631j7264j4445j3107j3227j3104j2402j2359
58735A676924j3241j4112j4956j6472j8055j8531j8581j9773k1609k2327k2267
58724A477000k3351k5502k6819k7249k8682l1166l2329l1145k9129k7253k4779
58713A169596k1786j9781j8972j7713j5430j3435j2302j1121r938j0085j1491
58702A007542j2355j2112j1967j2014j0834q530p219p599p933p211o442n993m675
58689H92658k469j268j784k495k639l516n750q001r479j0976j2412j2141r942
$$ y = [3610456, 3442898, 3286312, 3140901, 3005606, 2879662, 2763209, 2655784, 2555921, 2463149, 2378695, 2303160, 2235107, 2172973, 2116833, 2067024, 2022514, 1982017, 1945493, 1913243, 1884600, 1858609, 1834942, 1813180, 1792463, 1772832, 1755568, 1741123, 1728016, 1714789, 1701685, 1689283, 1676924, 1663683, 1649571, 1634615, 1618143, 1600088, 1581557, 1562976, 1543203, 1521594, 1499267, 1477000, 1453649, 1428147, 1401328, 1374079, 1345397, 1314231, 1281902, 1250757, 1221628, 1194375, 1169596, 1147810, 1128029, 1109057, 1091344, 1075914, 1062479, 1050177, 1039056, 1029118, 1019033, 1007542, 995187, 983075, 971108, 959094, 948260, 939730, 932511, 924912, 916979, 909768, 903326, 897333, 892658, 890189, 888921, 887137, 884642, 882003, 878487, 872737, 864736, 855257, 844281, 831869, 819728, 809786]
58676H09786p932p279o611m863l087k178j386m19m29j592k117j005N08J401K425
58661G75222M038N134N059M656M284L077J169K52Q66J480J256J313K223K760K225
58646H15014J779K448L981O331R849J3426J5188J5644J7368K0901K4067K6105
58634I72101K9062L3944L8874M2547M6328N1336N6515O1351O7542P6181Q5918
58623A561699R5670J06603J19927J35236J52408J72464J95093K17858K39137K59119
58613C255214K76818K89022K93476K89975K77061K51132K10706J58663R8868L3844
58603E434779l2641r4507j47271j90195k22949k43662k52374k52900k48618k39408
58593C510254k25051k08361j92304j76874j61382j46937j34144j21222j07124
$$ y = [809786, 801854, 794575, 787964, 783101, 780014, 777836, 776450, 776031, 775602, 774010, 771893, 770888, 771396, 772797, 775222, 779260, 784394, 789453, 794109, 798393, 801470, 802639, 802891, 803757, 805237, 806493, 807806, 810029, 812789, 815014, 816793, 819241, 823222, 829553, 839402, 852828, 868016, 883660, 901028, 921929, 945996, 972101, 1001163, 1035107, 1073981, 1116528, 1162856, 1214192, 1270707, 1332058, 1399600, 1475781, 1561699, 1657369, 1763972, 1883899, 2019135, 2171543, 2344007, 2539100, 2756958, 2996095, 3255214, 3532032, 3821054, 4114530, 4404505, 4681566, 4932698, 5143404, 5302067, 5400935, 5434779, 5402138, 5307631, 5160360, 4970165, 4747216, 4503554, 4251180, 3998280, 3749662, 3510254, 3285203, 3076842, 2884538, 2707664, 2546282, 2399345, 2265201, 2143979, 2036855]
58584B036855r3850q3054p3141o2348n1981m3830l6945k9929k3955k0737j9539
58573A497546j8869j9030k0604k2544k4065k6197k9225l1015l0098k8059k6710
58562A221130k5483k3755k2924k3732k4306k3340k2427k2761k2467j9966j7069
58551I72900j5772j4773j2231r328p896o999n050l012k427k485j983j881l030
58538H86033l679k264l98k14j028j575k977o354r827j1195j1438j2454j3543j3259
58524G95828j2641j3295j4264j3914j2992j2841j2604j1077r409r036q946p728
58512F57081o267n765n345m188l599m313m329k285k12j55p90l86p8j063j607k13
58496F16486J169O01j67R11K257J864J331K659L973K799Q24R92K368K326J470
$$ y = [2036855, 1943005, 1859951, 1786810, 1724462, 1672481, 1628651, 1591706, 1561777, 1537822, 1517085, 1497546, 1478677, 1459647, 1439043, 1416499, 1392434, 1366237, 1337012, 1305997, 1275899, 1247840, 1221130, 1195647, 1171892, 1148968, 1125236, 1100930, 1077590, 1055163, 1032402, 1009935, 989969, 972900, 957128, 942355, 930124, 920796, 912900, 905901, 900851, 897839, 895412, 892927, 890944, 889063, 886033, 882354, 880090, 879692, 879478, 878450, 876875, 873898, 867544, 857717, 846522, 835084, 822630, 809087, 795828, 783187, 769892, 755628, 741714, 728722, 715881, 703277, 692200, 682791, 673755, 664809, 657081, 650814, 645049, 639704, 635516, 631917, 627604, 623275, 620990, 620778, 620623, 619833, 619447, 619369, 618306, 616699, 616486, 617655, 618256, 618089, 619000, 621257, 623121, 624452, 627111, 631084, 633883, 634707, 635699, 638067, 640393, 641863]
58481F41863J911K922K700K433M144O521P160O959Q111R612R096P262O286N649
58467G22629L562O96j438l716p193r924r966r227j0295j1800j1125r257q602q479
58453F25865p203o175p266q609p594n640n314n330l282o99l19p91O63K827K979
58438E74112K339L562N213M402K630L153M712L806J304P46J790J374j72j15J038
58423F09894Q20K10J975M989O011N688P005R284R641Q900R990J1935J1498R442
58409G07282Q999R551Q006N122M136M403K777%p33k40j757m187l877j943k745
58394G34794n834o588m338k860l053k107J73J022O53J963M399M591K848K710M285
58379G32658M441L175L254M089K601k19l93J898K874K296L237N327N276L598L825
$$ y = [641863, 643774, 646696, 649396, 651829, 655973, 662494, 669654, 676613, 684724, 694336, 703432, 710694, 716980, 722629, 726191, 726887, 725449, 721733, 714540, 704616, 694650, 685423, 675128, 663328, 652203, 642946, 634344, 625865, 618662, 612487, 605221, 596612, 589018, 583378, 578064, 572734, 569452, 568753, 568434, 567643, 568306, 571133, 574112, 576451, 580013, 585226, 589628, 592258, 595411, 600123, 603929, 605233, 605979, 607769, 609143, 608971, 608856, 609894, 610714, 610924, 612899, 617888, 623899, 629587, 636592, 645876, 655517, 664417, 674407, 686342, 697840, 707282, 716281, 725832, 733838, 738960, 743096, 747499, 750276, 750276, 749543, 749303, 747546, 743359, 739482, 737539, 734794, 728960, 722372, 718034, 715174, 712121, 710014, 710187, 711209, 711862, 713825, 718224, 722815, 725663, 728373, 732658, 737099, 740274, 743528, 747617, 750218, 749999, 749606, 751504, 754378, 756674, 759911, 765238, 770514, 774112, 777937]
58364G77937N490M976K714K354L448K377j5N53L664M824L791M378O410N992L585
58349H32478L557N737N591K843J698K506J522r99q81J687K442J556L180O587O852
58334H76356M452M903Q512R917Q370Q806J1866J2584J0133R290J0976J0835Q472
58321I95472Q543J1296J1678R100Q584J0885J1323R550J0426J3899J4260J0853
58309A125869R296J0670J0012O949O891J0046J0324O987O251R418J0705Q950R792
58296A242160J4031J5605J3503J3878J7835J9210J6995J7575K1845K2848J9217
58285A434702J8056K1265K2078J8680J7948K1850K3527K0969K1091K6090K9226
58274A675482K8390L0198L6233L9197L7121L7255M1446M2160L7640L6024L9628
$$ y = [777937, 783427, 788403, 791117, 793471, 796919, 799296, 799281, 799834, 803498, 808322, 812113, 816491, 822901, 828893, 832478, 836035, 841772, 847363, 850206, 851904, 854410, 855932, 854933, 854052, 855739, 858181, 859737, 862917, 869504, 876356, 880808, 885711, 894223, 904140, 912510, 921316, 933182, 945766, 955899, 965189, 976165, 987000, 995472, 1004015, 1015311, 1026989, 1036089, 1044673, 1055558, 1066881, 1076431, 1086857, 1100756, 1115016, 1125869, 1135165, 1145835, 1155847, 1162796, 1169687, 1179733, 1190057, 1197044, 1203295, 1212713, 1223418, 1232368, 1242160, 1256191, 1271796, 1285299, 1299177, 1317012, 1336222, 1353217, 1370792, 1392637, 1415485, 1434702, 1452758, 1474023, 1496101, 1514781, 1532729, 1554579, 1578106, 1599075, 1620166, 1646256, 1675482, 1703872, 1734070, 1770303, 1809500, 1846621, 1883876, 1925322, 1967482, 2005122, 2041146, 2080774]
58263B080774M0438L6248L5542M1032M4366M2666M3955N0448N3344N0245N0542
58252B569600N7248O1118N9195O0956O9299P4266P2857P5636Q6021R2970R2327
58241C371493R4932J05060J11953J11643J15501J27683J36451J37611J43520J58605
58231D614452J70074J73573J82906K02930K19040K25718K38137K62553K83705
58222F573088K95460L14082L46282L75378L94998M23699M69389N13780N50227
58213A0256383O00149O72252P44702Q09285Q91714J004825J126379J249307J406153
58204A8761149J615209J854656K122907K469182K928478L487353M154698M999972
58196D2393604O079813P411539R081793J1296320J4249681J8026702K2668013
$$ y = [2080774, 2121212, 2157460, 2193002, 2234034, 2278400, 2321066, 2365021, 2415469, 2468813, 2519058, 2569600, 2626848, 2687966, 2747161, 2808117, 2877416, 2951682, 3024539, 3100175, 3186196, 3279166, 3371493, 3466425, 3571485, 3683438, 3795081, 3910582, 4038265, 4174716, 4312327, 4455847, 4614452, 4784526, 4958099, 5141005, 5343935, 5562975, 5788693, 6026830, 6289383, 6573088, 6868548, 7182630, 7528912, 7904290, 8299288, 8722987, 9192376, 9706156, 10256383, 10856532, 11528784, 12273486, 13082771, 13974485, 14979310, 16105689, 17354996, 18761149, 20376358, 22231014, 24353921, 26823103, 29751581, 33238934, 37393632, 42393604, 48473417, 55884956, 64966749, 76263069, 90512750, 108539452, 131207465]
58189A31207465K8130427L3983530L9254511M2777140M3603895M0892906L3682349
58182C93532223K1478566N424208j1447717k5618989l4945137l9283850l9731952
58175B69407352l7626175l4095588k9984206k5813946k1831466j8176918j4979180
58168H6899873j2297256j0084832q268742o804311n635486m675437l860573l172754
58160C2100482k590961k071420j586080j128860o73484j71271M05344J058682
58152B5342432J790865K572713L294152L805688L997856L776366K999231J580049
58144D9159352k96738k165302l567410m328659m544267m389967m014826l543227
58136B2308956l065784k613951k187887j804264j486750j230404j014009q34580
$$ y = [131207465, 159337892, 193321422, 232575933, 275353073, 318956968, 359849874, 393532223, 415010789, 420434997, 408987280, 383368291, 348423154, 309139304, 269407352, 231781177, 197685589, 167701383, 141887437, 120055971, 101879053, 86899873, 74602617, 64517785, 56249043, 49444732, 43809246, 39133809, 35273236, 32100482, 29509521, 27438101, 25852021, 24723161, 24049677, 23878406, 24283750, 25342432, 27133297, 29706010, 33000162, 36805850, 40803706, 44580072, 47579303, 49159352, 48862614, 46697312, 43129902, 38801243, 34256976, 29867009, 25852183, 22308956, 19243172, 16629221, 14441334, 12637070, 11150320, 9919916, 8905907, 8071327]
58128H071327o98267n92412m97894m16812l60355l21592k85805k55119k38545
58119D404526k29469k15965k01659j94771j88198j71420j50693j37196j26384
58110B788771j08785r0128q1109p7616p0209o3259o5955p3464p5169p3048p4635
58099A935394p6243p0286o1265n8035n7591n2179m4961m3324m3970l9756l4245
58088A353539l4672l7317l4366k8797k8214l0219k7826k3375k3405k5437k3068
58077A036843j8694j8366j9543j6509j2421j3449j6379j4408j0133j0436j3431
58066H73074j2651r451r376j0670q184m452n276q383p720n068o242r678r799q046
58052G58078r632j2862j2381r666r907j1657j0005o730p032r212p755l833k753
$$ y = [8071327, 7373060, 6780648, 6282754, 5865942, 5505587, 5183995, 4898190, 4643071, 4404526, 4175057, 3959092, 3757433, 3562662, 3374464, 3203044, 3052351, 2915155, 2788771, 2679986, 2589858, 2508749, 2431133, 2360924, 2297665, 2231710, 2158246, 2083077, 2010029, 1935394, 1859151, 1788865, 1727600, 1669565, 1611974, 1559795, 1514834, 1471510, 1427540, 1387784, 1353539, 1318867, 1281550, 1247184, 1218387, 1190173, 1159954, 1132128, 1108753, 1085348, 1059911, 1036843, 1018149, 999783, 980240, 963731, 951310, 937861, 921482, 907074, 896941, 886505, 873074, 860423, 850972, 841596, 830926, 822742, 818290, 813014, 804631, 796911, 791843, 785601, 775923, 766124, 758078, 748446, 735584, 723203, 713537, 703630, 691973, 681968, 675238, 668206, 658994, 651239, 647406, 644653]
58039F44653l793k311O41O00r81P43M562N515M230M851O156L936j21j033K67p77
58023F67138l178k608m49j577m915n302l041k841m780n003l883m888o789n537
58009F12347k553k768n592o135m181l664m413k842R9K8k448k607l54j55k638m124
57993E68000m220o083r226r669p419o531p559o961m128k163j551K70K965L439
57979E09164J978J948L437L442K143K651M685M743K544J152R35n40k828k991j405
57964E31058j181k049r82J554K153J023J698M325N495M650M387M423J689l257
57950E54986o187o003n614n677l688K41K724L081M186O623P656O782O671P717
57936E73498P074M093J479J01k262o115r127j0573j2255j4322j4876j4120j4311
$$ y = [644653, 640860, 638549, 639190, 639790, 638809, 639552, 644114, 649629, 653859, 658710, 664866, 668802, 668681, 667648, 667915, 667138, 663960, 661352, 660903, 659326, 654411, 649109, 646068, 643227, 638447, 633444, 629561, 624673, 617884, 612347, 609794, 607026, 601434, 595299, 591118, 587454, 583041, 580199, 580298, 580326, 577878, 575271, 574917, 574762, 572124, 568000, 563780, 557697, 548471, 538802, 531383, 524852, 517293, 510332, 506204, 504041, 502490, 502760, 505725, 509164, 511142, 513090, 516527, 519969, 522112, 524763, 529448, 534191, 536735, 537887, 538822, 538282, 535454, 532463, 531058, 529877, 527828, 526846, 528400, 530553, 531576, 533274, 537599, 543094, 547744, 552131, 556554, 558243, 554986, 548799, 542796, 537182, 531505, 527817, 528058, 530782, 533863, 538049, 544672, 552328, 559110, 565781, 573498, 580572, 584665, 586144, 586245, 583983, 577868, 568741, 558168, 545913, 531591, 516715, 502595, 488284]
57923D88284j5243j4476j2139j0717j0103p823m209k189j890n87J856K842K457
57910D16063L542O090P052O160O396Q143Q421O682N733O100M992J941K8L30L95
57895D88068o59p84J24o68l469n109m522m299n460n815m863n119p067p852o594
57880D25912n911o683o360m217l161m329m876l214j559j243k02K568M699M905
57866C96329N290P039Q154P721Q061J0215J1529J0121P791O237M415J897O80J192
57852D86671N67k549n325n504n059o349q190q590q208q375q518p975p555p314
57838C97727n721k868j395k300l127k219j338j939k421j468p98j998l631m021
57824C62483m100n164o425o992p695q924r271q242p608q249q440p047n547n148
$$ y = [488284, 473041, 458565, 446426, 435709, 425606, 417783, 413574, 411385, 409495, 408908, 410764, 413606, 416063, 419605, 425695, 432747, 438907, 445303, 453446, 461867, 468549, 474282, 480382, 485374, 487315, 487343, 487673, 488068, 487409, 486625, 486749, 486081, 482612, 477503, 472981, 468682, 463222, 457407, 452544, 447425, 440358, 432506, 425912, 420001, 413318, 406958, 402741, 399580, 395251, 390375, 387161, 385602, 384359, 384157, 386725, 391424, 396329, 401619, 408658, 416812, 424533, 432594, 442809, 454338, 464459, 472250, 478487, 482902, 484799, 485479, 486671, 487238, 484689, 479364, 473860, 468801, 462452, 454262, 445672, 437464, 429089, 420571, 412596, 405041, 397727, 392006, 389138, 387743, 385443, 382316, 380097, 378759, 376820, 374399, 372931, 372133, 370135, 366504, 362483, 358383, 353219, 346794, 339802, 332107, 323183, 313912, 305670, 298062, 289813, 281373, 274326, 268779, 263631]
57810B63631m834l994l949m992n093l515k539l489m229k848p78J58Q54K619M495
57795B31497N346O125P880R789J1172J2973J5410J6805J6472J6050J6267J5447
57783C81233J3062J1445J1758J1556Q817N284L158J468j483m843p172r141j1533
57770D13609j3008j2491j1514j1600j1697j0549r177q525p230m286j533p43o83
57757C10573M31J863K432L121M845N957M868L111K909L789M210M372M773M168
57743C61422J888P0O75K281K652K418L231M323M095L296L539M215L959L575M517
57728D06156N933O119N567N692N983N336M690N477O808P080O954P905R202R397
57714D98299R552J1777J5565J8547K0128K1530K3099K4338K5822K8443L1430L3599
$$ y = [263631, 258797, 254803, 250854, 245862, 240769, 237254, 234715, 231226, 226997, 224149, 223371, 223529, 224383, 227002, 231497, 236843, 242968, 250848, 260637, 271809, 284782, 300192, 316997, 333469, 349519, 365786, 381233, 394295, 405740, 417498, 429054, 437871, 443155, 446313, 447781, 446298, 441455, 434283, 425142, 413609, 400601, 388110, 376596, 364996, 353299, 342750, 333573, 325048, 317818, 313532, 311999, 311256, 310573, 311004, 312867, 315299, 318420, 323265, 329222, 334090, 337201, 340110, 343899, 348109, 352481, 357254, 361422, 363310, 363380, 364055, 366336, 368988, 371406, 374637, 378960, 383055, 386351, 389890, 394105, 398064, 401639, 406156, 412089, 418208, 423775, 429467, 435450, 440786, 445476, 450953, 457761, 464841, 471795, 479700, 488902, 498299, 507851, 519628, 535193, 553740, 573868, 595398, 618497, 642835, 668657, 697100, 728530, 762129]
57702G62129L5761L9488M4412M9192N4241O0958O9156P7768Q7248R8870J12438
57691A491661J27136J43686J63192J84654K06081K27208K48717K69430K86537
57682C348302K97668L00492K91456K67781K30264J82131J26227O5673N934m6847
57672E069081q9143j19549j36355j38743j29842j15740j01889r2852r4190j10369
57662C940409j39857j74752k05818k26624k34040k28231k12864j92964j71569
57653B153690j49513j27770j07843r0054p3623n8560m5750l5291k6346j8397j1224
57642A409319m083L507J0839J7445K4554L3354M2862N1545O0178P0828Q3811R7963
57630A902122J13188J30328J48920J67539J86030K05074K23779K39707K50862
$$ y = [762129, 797890, 837378, 881790, 930982, 985223, 1046181, 1115337, 1193105, 1280353, 1379223, 1491661, 1618797, 1762483, 1925675, 2110329, 2316410, 2543618, 2792335, 3061765, 3348302, 3645970, 3946462, 4237918, 4505699, 4735963, 4918094, 5044321, 5109994, 5115928, 5069081, 4979938, 4860389, 4724034, 4585291, 4455449, 4339709, 4237820, 4144968, 4050778, 3940409, 3800552, 3625800, 3419982, 3193358, 2959318, 2731087, 2518223, 2325259, 2153690, 2004177, 1876407, 1768564, 1678510, 1604887, 1546327, 1500577, 1465286, 1438940, 1420543, 1409319, 1405236, 1408743, 1419582, 1437027, 1461581, 1494935, 1537797, 1589342, 1649520, 1720348, 1804159, 1902122, 2015310, 2145638, 2294558, 2462097, 2648127, 2853201, 3076980, 3316687, 3567549]
57621C567549K55614K51204K34811K06062J66622J17854O1112qo0216j15349j62969
57610D522286k00825k27240k42886k50008k49868k42867k30690k16004k00140
57601B461758j83113j65788j49818j35593j22398j10410j00394r1615q2376p2671
57591A247582o4109n7241n1093m5360m0805l7281l3623k9756k6895k5316k3868
57580H12235k1962k0180j8619j6548j4016j2104j1177j0459r524q679p743o092
57568F55132m022k595j998j430n65K72J214K652M151N092O029P904J0304J2120
57554F94260J3428J5022J6663J7677J8767K1065K3852K5504K6397K8597L2796
57543I34028L7798M3016M9115N6106O3127P0430P9448R0519J02465J14687J27911
$$ y = [3567549, 3823163, 4074367, 4309178, 4515240, 4681862, 4799716, 4860828, 4860820, 4800604, 4685255, 4522286, 4321461, 4094221, 3851335, 3601327, 3351459, 3108592, 2877902, 2661898, 2461758, 2278645, 2112857, 1963039, 1827446, 1705048, 1594638, 1494244, 1402629, 1320253, 1247582, 1183473, 1126232, 1075139, 1029779, 988974, 951693, 918070, 888314, 861419, 836103, 812235, 790273, 770093, 751474, 734926, 720910, 708806, 697629, 687170, 677646, 668967, 661224, 655132, 651110, 648515, 646517, 645087, 644522, 644794, 646008, 648660, 652811, 657903, 663932, 671836, 682140, 694260, 707688, 722710, 739373, 757050, 775817, 796882, 820734, 846238, 872635, 901232, 934028, 971826, 1014842, 1063957, 1120063, 1183190, 1253620, 1333068, 1423587, 1526052, 1640739, 1768650]
57532A768650J42479J57668J72711J86779J97982K04166K04568J98823J84803
57523C418629J59787J23949Q0585L3020j6424o4515j07034j41399j67472j85408
57513C133718j94868j96625j92737j84593j72690j58554j44564j31460j18175
57504A639452j04545r1967q0953p0421o0092n1297m4540l8482l2235k6599k2095
57493A016226j7685j2637p771l820j24M030Q213J1935J5565J9388K3108K6911
57481A083339L1791L8194M5590N3702O2860P2941Q3463R4879J08196J23147J38420
57470A936522J53640J69126J83588J94155J99090J98201J90224J72347J43343
57461C540236J05218O0947J2567l7613q5903j28591j63113j87674k01677k07049
$$ y = [1768650, 1911129, 2068797, 2241508, 2428287, 2626269, 2830435, 3035003, 3233826, 3418629, 3578416, 3702365, 3782950, 3815970, 3799546, 3735031, 3627997, 3486598, 3319126, 3133718, 2938850, 2742225, 2549488, 2364895, 2192205, 2033651, 1889087, 1757627, 1639452, 1534907, 1442940, 1361987, 1291566, 1231474, 1180177, 1135637, 1097155, 1064920, 1038321, 1016226, 998541, 985904, 978133, 974313, 974189, 978219, 986432, 998367, 1013932, 1033320, 1056428, 1083339, 1115130, 1153324, 1198914, 1252616, 1315476, 1388417, 1471880, 1566759, 1674955, 1798102, 1936522, 2090162, 2259288, 2442876, 2637031, 2836121, 3034322, 3224546, 3396893, 3540236, 3645454, 3706401, 3718968, 3681355, 3595452, 3466861, 3303748, 3116074, 2914397, 2707348]
57451B707348k06971k02586j92963j78850j63766j50188j37131j23077j09081
57442A242735r7131q7267p8282o9967o2862n6778n1044m5524m0376l5648l1844
57431E86012k9665k8560k6761k3591k0359j8292j7017j5856j5059j4769j4145
57420C61938j2581j0645r075p934p305p436p723p049n660n057n538n678m801m033
57406B61423m146m312l890l522l501l022k022j717k258k048n59L92l22j130n35
57391B28831K47m36j624j364L2O55Pp98j109j217j167p73l33k19k37k56o88j546
57373B18005k005j730j486j698j707j292j402k384l015k392j329q01n61m52j263
57358A94488k959l828k994k040k480l309k907j727j070o22N51J800J862J114Q31
$$ y = [2707348, 2500377, 2297791, 2104828, 1925978, 1762212, 1612024, 1474893, 1351816, 1242735, 1145604, 1058337, 980055, 910088, 847226, 790448, 739404, 693880, 653504, 617856, 586012, 556347, 527787, 501026, 477435, 457076, 438784, 421767, 405911, 390852, 376083, 361938, 349357, 338712, 329637, 321703, 314398, 306962, 299239, 292190, 286530, 281473, 275935, 270257, 265456, 261423, 257277, 252965, 249075, 245553, 242052, 239030, 237008, 235291, 233033, 230985, 230426, 230818, 230496, 229366, 228831, 229078, 228642, 227018, 225654, 225686, 226341, 226348, 225550, 224441, 223224, 222057, 221284, 220951, 220732, 220495, 220239, 219551, 218005, 216000, 214270, 212784, 211086, 209379, 208087, 206685, 204301, 201286, 198894, 197565, 196764, 196203, 195751, 194488, 191529, 187701, 184707, 182667, 180187, 176878, 173971, 172244, 171174, 170552, 171103, 172903, 174765, 175879, 176710]
57343A76710J028R22P63J305K211K694L017L687M083L535K852K975L081J962L98
57328B11223R1Q74J160N84K66O92J315J928K701L061K344J302J379K591L592L721
57312B38824L547L621M027M934O292P291P357P275Q093R409J0026R819R650R903
57298C40068J0419J1370J2888J4312J5106J5962J7743J9970K1727K3337K5639
57287E28541K8255L0237L1813L3777L5702L6395L5745L4485L2521K9189K4769
57276H81429J9992J4404P000j673r883j7057k4077l1197l7429m2052m5183m6729
57264F67545m6363m4670m2855m0994l8027l3813k9782k7106k5388k3563k1150
57253B93834j8260j5255j2695j0936r612q110o468n200m433l933l660l549l057
$$ y = [176710, 177738, 178660, 179423, 180728, 182939, 185633, 188650, 192337, 196420, 199955, 202807, 205782, 208863, 210825, 211223, 211314, 212188, 213348, 213932, 214198, 214890, 216205, 218133, 220834, 223895, 226239, 227541, 228920, 231511, 235103, 238824, 242371, 245992, 250019, 254953, 261245, 268536, 275893, 283168, 291261, 300670, 310696, 320515, 330165, 340068, 350487, 361857, 374745, 389057, 404163, 420125, 437868, 457838, 479565, 502902, 528541, 556796, 587033, 618846, 652623, 688325, 724720, 760465, 794950, 827471, 856660, 881429, 901421, 915825, 922825, 921152, 911269, 894212, 870135, 838938, 801509, 759457, 714274, 667545, 621182, 576512, 533657, 492663, 454636, 420823, 391041, 363935, 338547, 314984, 293834, 275574, 260319, 247624, 236688, 227076, 218966, 212498, 207298, 202865, 198932, 195272, 191723, 188666]
57240A88666j868o71l54p26r01o36l36j28K10O33R78J348J609J091l65j709j956
57223A84885j509j174p17L97J506J532P26L19O99J229J568J914K215K237K195
57208A98022K414K687K856L399M533N467N645N833O736P470O911N777N644O526
57194B69920P064O746O234N849N331M947N316O310P332Q363R517J0163R854R524
57180C72470J0211J1244J1281J0605J0605J1431J2094J2471J3301J4329J4464
57169E04506J3756J3363J3508J3288J2620J2523J3254J3873J4049J4604J5933
57158F55277J7319J8268J9148K0111K0649K0562K0320K0194J9938J9456J8911
57147H70153J8224J7432J7233J8156J9522K0354K0920K2079K3574K4450K4804
$$ y = [188666, 186798, 186127, 185773, 185047, 184146, 183510, 183174, 183046, 183256, 183889, 184867, 186215, 187824, 188915, 188550, 186841, 184885, 183376, 182202, 181485, 181882, 183388, 184920, 185646, 185965, 186664, 187893, 189461, 191375, 193590, 195827, 198022, 200436, 203123, 205979, 209378, 213911, 219378, 225023, 230856, 237592, 245062, 251973, 257750, 263394, 269920, 276984, 283730, 289964, 295813, 301144, 306091, 311407, 317717, 325049, 333412, 342929, 353092, 362946, 372470, 382681, 393925, 405206, 415811, 426416, 437847, 449941, 462412, 475713, 490042, 504506, 518262, 531625, 545133, 558421, 571041, 583564, 596818, 610691, 624740, 639344, 655277, 672596, 690864, 710012, 730123, 750772, 771334, 791654, 811848, 831786, 851242, 870153, 888377, 905809, 923042, 941198, 960720, 981074, 1001994, 1024073, 1047647, 1072097, 1096901]
57136A096901K5567K6732K7373K7311K7264K7326K6807K5656K4707K4330K3980
57125A383954K3174K1997K0694J9619J9197J9144J8344J6472J4896J4787J5211
57114A587489J4627J3362J2966J3796J5021J6554J9226K3489K9627L9045N3842
57103A839044P5053J02094J33377J66887K01485K38933K83549L38770M05285M82980
57093D267457N72341O72611P81212Q96665J019020J145187J266821J375127J464517
57084A3460958J529522J563021J560751J521738J441400J316378J169188J058532
57076B4621488J039163J098135J139477J043475P45867K69772k98848q57363j326141
57067B7475025j670772j898960k034773k094004k081959k006078j881304j724275
$$ y = [1096901, 1122468, 1149200, 1176573, 1203884, 1231148, 1258474, 1285281, 1310937, 1335644, 1359974, 1383954, 1407128, 1429125, 1449819, 1469438, 1488635, 1507779, 1526123, 1542595, 1557491, 1572278, 1587489, 1602116, 1615478, 1628444, 1642240, 1657261, 1673815, 1693041, 1716530, 1746157, 1785202, 1839044, 1914097, 2016191, 2149568, 2316455, 2517940, 2756873, 3040422, 3379192, 3784477, 4267457, 4839798, 5512409, 6293621, 7190286, 8209306, 9354493, 10621314, 11996441, 13460958, 14990480, 16553501, 18114252, 19635990, 21077390, 22393768, 23562956, 24621488, 25660651, 26758786, 27898263, 28941738, 29687605, 29957377, 29658529, 28801166, 27475025, 25804253, 23905293, 21870520, 19776516, 17694557, 15688479, 13807175, 12082900]
57059A2082900j549022j368363j193603j031298q83525p51660o37147n39244m55601
57050C673437l85221l28243k83004k46013k14838j88824j67279j49162j34179
57041A576674j22110j11454j00673r0239q1511p4231o7030n9769n3387m8000m3008
57030G25262l8625l5467l3071l0397k7333k4370k1538j8953j7475j7331j7084
57019D43618j5456j3176j1564j0466r066p629o677n588l732j910r87j29J923M881
57005C64042P937J1575J6734K3274L0968M0909N4378P1508R2332J17353J45186
56994I76196J71285J90618J99320J91665J59075R7617J6538o4363j26935j63492
56984A647524j76026j71322j57150j39509j21351j04247r0485q1651p6076p0283
$$ y = [12082900, 10533878, 9165515, 7971912, 6940614, 6057089, 5305429, 4668282, 4129038, 3673437, 3288216, 2959973, 2676969, 2430956, 2216118, 2027294, 1860015, 1710853, 1576674, 1454564, 1343110, 1242437, 1152198, 1070687, 996456, 929426, 869657, 816270, 768270, 725262, 686637, 651170, 618099, 587702, 560369, 535999, 514461, 495508, 478033, 460702, 443618, 428162, 414986, 403422, 392956, 383890, 376261, 369584, 363996, 360264, 358354, 357367, 357238, 359161, 364042, 371979, 383554, 400288, 423562, 454530, 495439, 549817, 621325, 713657, 831010, 976196, 1147481, 1338099, 1537419, 1729084, 1888159, 1985776, 2002314, 1937951, 1811016, 1647524, 1471498, 1300176, 1143026, 1003517, 882166, 777919, 687434, 605783, 529707, 459424]
56974D59424o2880n5027m7476l9667l1615k4346j8177j2509p341l215K50L979
56962A61400P839J1122J4280J8255K2571K5953K8406L0416L0467K5845J6177M260
56950C96991o708j5043k0096k2057k2292k2030k0685j7185j2522q898o648m161
56938B18666p54K715O133J0625J6432K2250K7124L1132L3985L4708L2851K8274
56926D64141J9898O942q379k1601l0031l4269l5690l4612l1529k7907k4643k1233
56914B21087j7251j3362j0229p739n762m514l871l389l153l385l348k090j40J045
56900A43899J263J587K301K617K485K852L877M666N070N977P615R248J0910J3666
56886B18033J7572K0971K2231K0954J7097J0529J910p208j5442k1780k4990k4382
$$ y = [459424, 396544, 341517, 294041, 254374, 222759, 198413, 180236, 167727, 160386, 157171, 157421, 161400, 169239, 180361, 194641, 212896, 235467, 261420, 289826, 320242, 350709, 376554, 392731, 396991, 390283, 375240, 355144, 333087, 310795, 288765, 268080, 250895, 238373, 229475, 222827, 218666, 217912, 220627, 226760, 237385, 253817, 276067, 303191, 334323, 368308, 403016, 435867, 464141, 484039, 490981, 482602, 461001, 430970, 396701, 361011, 326399, 294870, 266963, 242320, 221087, 203836, 190474, 180245, 172506, 166744, 162230, 158359, 154970, 151817, 148432, 145084, 142994, 142854, 143899, 145162, 146749, 149050, 151667, 154152, 157004, 160881, 165547, 170617, 176594, 184209, 193457, 204367, 218033, 235605, 256576, 278807, 299761, 316858, 327387, 329297, 322089, 306647, 284867, 259877, 235495]
56874B35495k1144j7344j3566r012l696J260N592J0268J5763K1631K8028L5837
56862B89112M4980N4163O2431O9424P3882P3512O6465N1919L0019L331k2221m0573
56850G56444n0151n3574n3133m9117m2222l4384k6371j7251p074K469J0978K0506
56838D57120L2667M6863O2298P9219R6704J11353J19635J19639J09432Q6295N0002
56827A371227N750l7914p3549r6930j07091j06243r8655q7953p5712o2759n0265
56816E79906l8726k7366j5584l770Q037K0909L5412N0438O4349P6038Q4112Q6316
56804I20071Q0478O5172L9781O098k9680n9095p7134q4752q5430q1376p3822o4500
56792E55811n4762m4690l4502k5425j8008j1055l415M508J2179K0220K8949L7002
$$ y = [235495, 214351, 197007, 183441, 174429, 170733, 171993, 177585, 187853, 203616, 225247, 253275, 289112, 334092, 388255, 450686, 520110, 593992, 667504, 733969, 785888, 815907, 819238, 797017, 756444, 706293, 652719, 599586, 550469, 508247, 473863, 447492, 430241, 423167, 425636, 436614, 457120, 489787, 536650, 598948, 678167, 774871, 886224, 1005859, 1125498, 1234930, 1321225, 1371227, 1376977, 1339063, 1265514, 1168584, 1061493, 955250, 856595, 768642, 692930, 630171, 579906, 541180, 513814, 498230, 494460, 502497, 523406, 558818, 609256, 673605, 749643, 833755, 920071, 1000549, 1065721, 1105502, 1111600, 1081920, 1022825, 945691, 860939, 775509, 694133, 620311, 555811, 501049, 456359, 421857, 396432, 378424, 367369, 363954, 368462, 380641, 400861, 429810, 466812]
56780D66812M2661M5208M3874L6943K3532N465j3678l0491m2343m7927m8371m6511
56768D35174m3918l9949l4298k8648k4569k1542j8441j5432j3049j0881q551o702
56756A69194n704m696l116j825j499j394q40m63p17q36n16q70k252k949j752j20
56740A39645N9o05l80O37J030N54R6p9l35n62n45p26j321j556j029p51j516k361
56722A30255k095j231r49j216j382j563j929j745o26K90m3q04o53J61N09K67J5
56705A17261j81l48J7R19J251M40m71o18p53j528j952j166k39l68p50j60O68L27
56687A12349p24r64k78K50K28l6m73o59M16K553L684K707J442J791K708K290J245
56670A28529J499K636K594J126k05q66j548k082j677q72r26j571j610j226j505
$$ y = [466812, 509473, 554681, 598555, 635498, 659030, 664495, 650817, 620326, 577983, 530056, 481685, 435174, 391256, 351307, 317009, 288361, 263792, 242250, 223809, 208377, 195328, 184447, 175896, 169194, 163490, 158794, 155678, 153853, 152354, 150960, 150120, 149657, 148940, 148104, 147588, 146718, 144466, 141517, 139765, 139645, 139704, 139099, 138719, 139356, 140386, 140940, 141036, 140957, 140622, 140060, 139515, 138789, 137468, 135912, 134883, 134132, 132616, 130255, 128160, 126929, 125980, 124764, 123382, 121819, 119890, 118145, 117519, 117809, 117766, 116962, 116309, 116470, 116979, 117246, 117261, 117080, 116732, 116749, 117668, 118919, 119359, 118888, 118270, 117517, 115989, 114037, 112871, 112632, 112264, 111514, 111354, 112022, 112349, 111625, 110661, 110383, 110633, 110861, 110825, 110352, 109693, 110109, 112662, 116346, 119053, 120495, 122286, 124994, 127284, 128529, 130028, 132664, 135258, 136384, 136179, 135313, 133765, 131683, 130006, 129134, 128208, 126637, 125027, 123801, 122296]
56655A22296k172k099j613j930k702k451j143j30J47K31j30j536l052l123k086
56640I8507j601j890j840j418j541j853j134R9N2j256j869j056j78o8J16R44J810
56623H5824K432L270M038L719K494J858K389L145L501L864M249L953K951K120
56609A29807J795J613J726K606L642L647K713K027J874J559J098J196J650J553
56595A58506J006Q79R76L21q57j361j032p45n52J63Q85M84n30m87O99J359P80
56578A60494M7n5O0J51N05Q39O58O71J860L394L545K581K438L493M098L498K777
56561A91054K632K526K467L292M732N391N067M995N421N133L873K933K869K724
56547B45109K065J708J910J857J334J003O94n06k267l249l427l965m726m420l358
$$ y = [122296, 120124, 118025, 116412, 114482, 111780, 109329, 108186, 108056, 108203, 108434, 108304, 106768, 103716, 100593, 98507, 96906, 95016, 93176, 91758, 90217, 88364, 87230, 87329, 87381, 86125, 84256, 83200, 83022, 82954, 83070, 84014, 85824, 88256, 91526, 95564, 99283, 101777, 103635, 106024, 109169, 112670, 116534, 120783, 124736, 127687, 129807, 131602, 133215, 134941, 137547, 141189, 144836, 147549, 149576, 151450, 153009, 154107, 155303, 156953, 158506, 159512, 160391, 161367, 161688, 160831, 159470, 158438, 157693, 157141, 157304, 158189, 158673, 158143, 157656, 158355, 159714, 160494, 160541, 160486, 160546, 160697, 161202, 162041, 162699, 163370, 165230, 168624, 172169, 174750, 177188, 180681, 184779, 188277, 191054, 193686, 196212, 198679, 201971, 206703, 212094, 217161, 222156, 227577, 232710, 236583, 239516, 242385, 245109, 247174, 248882, 250792, 252649, 253983, 254986, 255680, 255174, 252907, 249658, 246231, 242266, 237540, 233120, 229762]
56532B29762l274m110l892k369j765k988m128l866l536m340n145m669l625l081
56518A78974k767k359k507l203l077j623l32l73r36j045j101j516j564q53k71
56503A55447l39k81K77M31k31p15l99o5l01n48m75n78q13m78M3m31j444j080P93
56484A48813J994J599J236J924K341J620J203K231L490L652L274L076K462J346
56470A80261J214K683M042L928L337L399L370K574K167L039L969L767L297L568
56456B24615L689K697J559J403J506R55N61J214J962J641R19Q46R75O47O06J438
56440B47233K015J321L32K73M82j80j212j547j403j419j340j021j277k275k695
56425B37287j955j489k285l136k951k790l640m175k924q65L58J039K021K363Q61
$$ y = [229762, 226488, 222378, 218486, 216117, 214352, 211364, 207236, 203370, 199834, 195494, 190349, 185680, 182055, 178974, 176207, 173848, 171341, 168138, 165061, 163438, 163106, 162733, 161797, 160752, 159651, 158135, 156571, 155718, 155447, 155108, 154827, 155104, 155535, 155304, 154589, 154190, 154125, 153824, 153276, 152801, 152223, 151410, 150932, 150975, 150544, 149100, 148020, 148813, 150807, 152406, 153642, 155566, 157907, 159527, 160730, 162961, 166451, 170103, 173377, 176453, 178915, 180261, 181475, 184158, 188200, 192128, 195465, 198864, 202234, 204808, 206975, 210014, 213983, 217750, 221047, 224615, 228304, 231001, 232560, 233963, 235469, 236424, 236985, 238199, 240161, 241802, 242721, 243567, 244542, 245189, 245795, 247233, 249248, 250569, 250901, 251174, 251656, 251476, 250264, 248717, 247314, 245895, 244555, 243534, 242257, 239982, 237287, 235332, 233843, 231558, 228422, 225471, 222681, 219041, 214866, 211942, 211077, 211435, 212474, 214495, 216858, 217719]
56410B17719j507k977l710m917o414p121p017o661n834m397l332l207k890j465
56396A56270p7q6q04q71m79l51L1J341K709L014K649K426K121J578J661K523K727
56379A76382J706J214K457L827L535K505K356K481J667P95J357K716L348L406
56365B09752L723L688K549J342J232J225n6j779k322j913j569r58M44J573J470
56350B18401J159J621J699M24n19O48K552K883K184K446L520L955M017M880O002
56335B55872O234O294P321Q299P780O777P012P710P172O161O472P492P444O877
56321C54917P523Q761Q628P383O865P056O579N711N674N703M097J500m4n65j607
56306D28181k974l264k846l174l786l234k198k461l458l164j711q48m78Q62K687
$$ y = [217719, 216212, 213235, 209525, 204608, 198194, 191073, 184056, 177395, 171561, 167164, 163832, 160625, 157735, 156270, 156193, 156107, 155303, 154432, 153953, 153602, 153633, 154974, 157683, 160697, 163346, 165772, 167893, 169471, 171132, 173655, 176382, 178088, 179302, 181759, 185586, 189121, 191626, 193982, 196463, 198130, 198925, 200282, 202998, 206346, 209752, 213475, 217163, 219712, 221054, 222286, 223511, 223455, 221676, 219354, 217441, 215872, 214914, 215358, 216931, 218401, 219560, 221181, 222880, 223304, 222785, 223433, 225985, 228868, 231052, 233498, 237018, 240973, 244990, 249870, 255872, 262106, 268400, 275721, 284020, 291800, 298577, 305589, 313299, 320471, 326632, 333104, 340596, 348040, 354917, 362440, 371201, 379829, 387212, 394077, 401133, 407712, 413423, 419097, 424800, 428897, 430397, 430353, 429788, 428181, 425207, 421943, 419097, 415923, 412137, 408903, 406705, 404244, 400786, 397622, 395911, 395063, 394585, 395447, 398134]
56291C98134L168K609L021M527N493N734O445P383P352P043Q186J0358J1756J2603
56277D93812J4548J7292J9139K0338K2502K5246K6825K7632K9664L2980L6134
56266G66112L9534M4873N1689N8066O4325P2402Q2059R1405J00691J11803J24198
56255A607157J35292J44626J53835J62643J68726J71531J72343J70550J63717
56246C050420J51578J36232J18346R6846P2489M8030K4640J700j9797l7334n0500
56235C592650o0974o8936p3110p4281p5050p6083p6177p5880p7154p9699q1554
56224B773752q3182q6866r2204r6350r8701j01085j03353j03329j01240r9760
56214A807682r9201r7114r2994q8949q5268p9876p2755o6497o1691n6169m9514
$$ y = [398134, 401302, 403911, 406932, 411459, 416952, 422686, 429131, 436514, 443866, 450909, 459095, 469453, 481209, 493812, 508360, 525652, 544791, 565129, 587631, 612877, 639702, 667334, 696998, 729978, 766112, 805646, 850519, 902208, 960274, 1024599, 1097001, 1179060, 1270465, 1371156, 1482959, 1607157, 1742449, 1887075, 2040910, 2203553, 2372279, 2543810, 2716153, 2886703, 3050420, 3201998, 3338230, 3456576, 3553422, 3625911, 3673941, 3698581, 3700281, 3680484, 3643150, 3592650, 3531676, 3462740, 3389630, 3315349, 3240299, 3164216, 3088039, 3012159, 2935005, 2855306, 2773752, 2690570, 2603704, 2511500, 2415150, 2316449, 2215364, 2112011, 2008682, 1907442, 1807682, 1708481, 1611367, 1518373, 1429424, 1344156, 1264280, 1191525, 1125028, 1063337, 1007168, 957654]
56203I57654m4015m0412l6851l2724k9448k6944k3563j9905j8372j8488j7157
56192F49775j3976j1658j0824r165o334m684m485l368j201n09j210k15K832M704
56178E89682M517N186P696R304Q961R169J0838J1449J0060R041R081P693M412
56165F97089K353K687K589O53p52m32n47j858j887J22J405R20J352L820N647N604
56149G18765O259Q894J1130J1962J4076J8725K3265K6202K9925L5987M2547M8743
56137I96480N6899O8123Q0474R3427J09047J26700J41704J51319J56883J58322
56127B139378J52371J38662J21981J06110R0877P7116O8122O3419N7179M5892
56117C061107L2090J8192L029j2798k4724l0956l5685m2630n1337o2340p9000
$$ y = [957654, 913639, 873227, 836376, 803652, 774204, 747260, 723697, 703792, 685420, 666932, 649775, 635799, 624141, 613317, 604152, 597818, 593134, 588649, 585281, 584080, 583571, 582361, 582146, 584978, 589682, 594199, 599385, 607081, 616385, 625346, 634515, 645353, 656802, 666862, 675903, 684984, 692677, 697089, 699442, 702129, 704718, 705371, 704619, 704187, 703640, 701782, 699895, 700017, 701422, 702342, 703694, 707514, 713161, 718765, 725024, 733918, 745048, 757010, 771086, 789811, 813076, 839278, 869203, 905190, 947737, 996480, 1053379, 1121502, 1201976, 1295403, 1404450, 1531150, 1672854, 1824173, 1981056, 2139378, 2291749, 2430411, 2552392, 2658502, 2749379, 2826495, 2894617, 2958036, 3015215, 3061107, 3093197, 3111389, 3114418, 3101620, 3076896, 3045940, 3010255, 2967625, 2916288, 2853948, 2774948]
56106B774948j00637j20370j33406j41395j45606j42979j32818j20421j09601
56097A627715r8059q4116p1427o2656n5006m6369l9535l6086l2593k7093k2782
56086A051993k1189j8618j3517j0199j0801j0845p394m181l861k861R65L421K109
56073I55022J671N221Q289P235N888P766R389P680O315Q350J0064Q534P648J0140
56059A059212J1663R328P964J1012J3597J1837J0489J3793J7192J6102J4440J6373
56047A213002J8068J5926J4470J7515K0097J7875J5838J8731K1687J9761J7806
56036A410776K1098K5077K4486K3807K8339L3644L4360L4622L9187M3199M1650
56025A760245L9767M2993M6027M3193M0006M2619M5747M3310M0876M4807M9250
$$ y = [2774948, 2674311, 2553941, 2420535, 2279140, 2133534, 1990555, 1857737, 1737316, 1627715, 1529656, 1445540, 1374113, 1311457, 1256451, 1210082, 1170547, 1134461, 1101868, 1074775, 1051993, 1030804, 1012186, 998669, 988470, 977669, 966824, 959430, 955249, 951388, 948527, 949492, 952913, 955022, 956693, 961914, 970203, 977438, 983326, 991092, 1000481, 1008161, 1014476, 1022826, 1032890, 1041424, 1049072, 1059212, 1070875, 1080203, 1088167, 1099179, 1112776, 1124613, 1135102, 1148895, 1166087, 1182189, 1196629, 1213002, 1231070, 1246996, 1261466, 1278981, 1299078, 1316953, 1332791, 1351522, 1373209, 1392970, 1410776, 1431874, 1456951, 1481437, 1505244, 1533583, 1567227, 1601587, 1636209, 1675396, 1718595, 1760245, 1800012, 1843005, 1889032, 1932225, 1972231, 2014850, 2060597, 2103907, 2144783, 2189590, 2238840]
56014B238840M7303M4719M8772N4020N3367N2639N9256O7191O8460O8768P6034
56003B879369Q4416Q6001Q6987R5441J04614J06004J06935J16877J28598J32044
55993C927286J34291J45722J59331J64706J69344J84092K01001K08559K15011
55984E509343K32543K52953K64214K76043L02123L32622L52898L73208M09838
55975H305785M53723M89851N29757N90364O59505P19670P86345Q82705R97265
55966A4414970J110516J241522J420406J638202J877580K169260K559795L049656
55958B9481907L628710M345435N269269O421528P838349R674641J2142122J5367195
55950I4169156J9401990K4276352K9796122L5256824L9563620M1682763M0771176
$$ y = [2238840, 2286143, 2330862, 2379634, 2433654, 2487021, 2539660, 2598916, 2666107, 2734567, 2803335, 2879369, 2963785, 3049786, 3136773, 3232214, 3336828, 3442832, 3549767, 3666644, 3795242, 3927286, 4061577, 4207299, 4366630, 4531336, 4700680, 4884772, 5085773, 5294332, 5509343, 5741886, 5994839, 6259053, 6535096, 6837219, 7169841, 7522739, 7895947, 8305785, 8759508, 9249359, 9779116, 10369480, 11028985, 11748655, 12535000, 13417705, 14414970, 15525486, 16767008, 18187414, 19825616, 21703196, 23872456, 26432251, 29481907, 33110617, 37456052, 42725321, 49146849, 56985198, 66659839, 78801961, 94169156, 113571146, 137847498, 167643620, 202900444, 242464064, 284146827, 324918003]
55943C24918003L5907672K6278921J2210876m042592j9039067l0001363l6047600
55936C10184850l7893168l6810850l3964159l0266526k6348741k2532919j8955028
55929A03413459j5733748j2975276j0686057q795432p251774o026986n057685
55922C6886501m261434l600421l070710k644759k279226j963983j711274j508077
55914A5846617j325076j160252j029801r26505q27622p33798o61624o06657n49901
55905H025381m92542m49876m18521l82226l43212l16478k99362k76533k49395
55896D797236k31960k22694k07748j87599j74528j67808j56261j41400j34120
55887C173118j32108j23651j10297j03514j02285r5722q4724p9842q0412p6391
$$ y = [324918003, 360825675, 387104596, 399315472, 395272880, 376233813, 346232450, 310184850, 272291682, 235480832, 201516673, 171250147, 144901406, 122368487, 103413459, 87679711, 74704435, 64018378, 55222946, 47971172, 41944186, 36886501, 32625067, 29024646, 25953936, 23309177, 21029951, 19065968, 17354694, 15846617, 14521541, 13361289, 12331488, 11404983, 10577361, 9843563, 9181939, 8575282, 8025381, 7532839, 7082963, 6664442, 6282216, 5939004, 5622526, 5323164, 5046631, 4797236, 4565276, 4342582, 4134834, 3947235, 3772707, 3604899, 3448638, 3307238, 3173118, 3041010, 2917359, 2807062, 2703548, 2601263, 2505541, 2420817, 2340975, 2260563, 2184172]
55877B184172o8304o5416o6488o2039n3477n0781n3049n0188m2467l9805m2717
55866A589441m1984l6695l5148l8049l7587l3222l2224l4437l2103k5024k0754
55855A222214j9646j4511n376j4O05L126P636O610j153q757j4044k1297k9579
55842A125814l2294k9333k7552k8312k6449k1963k0700k2815k2298j8756j8031
55831H57311k0524k0415j7234j6676j9098j8629j4745j3469j5800j6076j3200
55820F71445j2610j5448j6409j4068j3067j4241j2742p888n072n823n529k712
55808E45836j291j866k07L844N173K877J812L032J863k566n116m158m359p668
55794E37206j0141j0137j1114j3856j4199j1118r094r942j0028p938p093q341
$$ y = [2184172, 2115868, 2050452, 1983964, 1921925, 1868448, 1817667, 1764618, 1714430, 1671963, 1632158, 1589441, 1547457, 1510762, 1475614, 1437565, 1399978, 1366756, 1334532, 1300095, 1267992, 1242968, 1222214, 1202568, 1188057, 1182681, 1182667, 1183272, 1186398, 1194034, 1200644, 1199491, 1190734, 1176690, 1155393, 1125814, 1093520, 1064187, 1036635, 1008323, 981874, 959911, 939211, 916396, 894098, 875342, 857311, 836787, 816372, 799138, 782462, 763364, 744735, 729990, 716521, 700721, 684645, 671445, 658835, 643387, 626978, 612910, 599843, 585602, 572860, 564972, 559900, 554077, 548548, 545836, 544545, 542679, 542472, 546316, 551489, 554366, 556178, 559210, 561073, 558507, 553391, 549233, 544874, 537206, 527065, 516928, 505814, 491958, 477759, 466641, 457547, 447605, 437577, 429639, 422546, 414205]
55782D14205p755m265j948k252j423J823L500J771j29q52l574q945j2563j2340
55768C65253j1710j2779j2973j1044r781r990q462m582k479l844m996l841l324
55755B65448n157o454n664n688p990r464q258p102p794p898n887m185m263l869
55741A75775j934j020k212k694j030K02m94q34M66J284P91J406L663M343K123
55726A79835K1k18r52l448n104m448l828m513m238k199j346k914l750j924j11
55711A40863l91o36R49K441K414K970N412P318O938O276O948P106N328L413K668
55696B00017J514o34j445j28N44p93j606n39l03k597m724m422l627m256m549k876
55680A69576j178j233j405k16P01K25L42K084K873J076p30l01L96q15k298k013
$$ y = [414205, 406450, 402185, 400237, 397985, 396562, 398385, 401885, 403656, 403527, 402675, 399101, 390156, 377593, 365253, 353543, 340764, 327791, 316747, 306966, 296976, 288514, 283932, 281453, 277609, 272613, 268772, 265448, 260291, 253837, 248173, 242485, 234495, 225031, 216773, 209671, 201877, 193979, 188092, 183907, 179644, 175775, 173841, 172821, 170609, 167915, 166885, 167087, 166593, 165759, 166225, 167509, 168300, 169706, 173369, 177712, 179835, 179856, 179638, 178686, 175238, 170134, 165686, 161858, 157345, 153107, 150908, 149562, 146648, 142898, 140974, 140863, 140472, 139836, 140785, 143226, 145640, 148610, 154022, 161340, 168278, 174554, 181502, 188608, 193936, 197349, 200017, 201531, 200897, 199452, 199324, 199868, 199075, 197469, 196930, 196627, 194030, 189306, 184884, 181257, 177001, 172452, 169576, 168398, 167165, 165760, 165544, 166245, 166470, 166812, 168896, 171769, 172845, 172115, 171814, 172210, 171395, 169097, 167084]
55664A67084j240j485j256N65J743O19m56Q19K523K088Q36J217K395K288J407
55649A79147J201R39m81j953k383l028m890o331n919n018n050m941l825l240m093
55634A30135m527l397k645l576m201l130k561m183n601m371k269k027k781k492
55620H2374j953k662l330k266q24r05j447p95j38j102k258j586j77j22p98n73
55604F1438j18p44j481j014m24j034j680j074n29j329j842m39J185R40J06P83
55588E2744J921J409rm09k13o83j025k73J18j121k185j301k89j391k966k270k88
55571D1769L27p2L80Q60m35k091j476M09N19r59j338n36j013l023m121l345k204
55554B3651j484m01J111K221L083M271M974M229L146L269L749K936J561J444K177
$$ y = [167084, 165844, 164359, 163103, 163668, 165411, 166030, 165574, 166393, 168916, 171004, 171840, 173057, 175452, 177740, 179147, 180348, 181287, 180806, 178853, 176470, 173442, 168552, 162221, 156302, 151284, 146234, 141293, 137468, 134228, 130135, 125608, 122211, 119566, 115990, 111789, 108659, 106098, 101915, 96314, 91943, 89674, 87647, 84866, 82374, 80421, 77759, 74429, 72163, 71339, 70434, 68987, 68192, 68054, 66952, 64694, 63108, 62931, 62809, 62011, 61438, 61320, 60576, 59095, 58081, 57657, 56623, 54943, 53869, 53340, 52011, 50169, 49730, 50915, 51855, 51961, 52744, 54665, 56074, 56065, 55656, 55443, 54760, 53735, 53462, 53580, 52459, 50274, 48973, 48684, 47293, 44327, 42057, 41769, 42096, 42024, 42404, 43264, 42829, 40738, 39262, 39671, 40190, 39231, 37893, 37357, 36344, 33321, 29200, 25855, 23651, 22167, 21766, 22877, 25098, 28181, 32452, 37426, 41655, 44801, 48070, 51819, 54755, 56316, 57760, 59937]
55539E9937K093J457J621K125J671R47J409K316K029J117J153J555Q39k17N1Q79
55523H0982M72m22J20J360J153P8M98K144K516J231K75J83l92j470j730j537k577
55506H2884m386m687l214k024j916j684j018r90j470j103k8K71j17L60J570J707
55490F4155N20k99k40n99j713k364k323k836m172n173n621o559p946q358p366
55475I106C032b007l775k381j588j118m1J338J884J773K102a085A504J865J616
55460D985J712J264O57Q88J402R20j14l43l8l49p66j9J154R86j16k88M11L40m74
55441A2212n25M7k73j223j111j43r5p78k40J310J448j53r20L43J710J710J502
55424A4821K242L057K952K357J642L07j412k213j802j317j217q24k89o34j420
$$ y = [59937, 62030, 63487, 65108, 67233, 68904, 69851, 71260, 73576, 75605, 76722, 77875, 79430, 80269, 80052, 80103, 80982, 81454, 81032, 81152, 82512, 83665, 83743, 84241, 86385, 88901, 90132, 90407, 90590, 90198, 88728, 86998, 85461, 82884, 78498, 73811, 70597, 68573, 66657, 64973, 63955, 62965, 61495, 60392, 60364, 60635, 60518, 60878, 62448, 64155, 64675, 64376, 64136, 63537, 61824, 59460, 57137, 54301, 50129, 44956, 39335, 32776, 24830, 16472, 9106, 3032, -2007, -5782, -8163, -9751, -10869, -10910, -9572, -7688, -5915, -3813, -1085, 1504, 3369, 4985, 6697, 7961, 8618, 9506, 10908, 11828, 11714, 11371, 11333, 10984, 10218, 10199, 11353, 12339, 12223, 11935, 12346, 12686, 12212, 11687, 11734, 11461, 10238, 9127, 8984, 8889, 8111, 7871, 9181, 10629, 10476, 9556, 9899, 11609, 13319, 14821, 17063, 20120, 23072, 25429, 27071, 27378, 25966, 23753, 21951, 20634, 19417, 18593, 18304, 17670, 16250]
55409A6250q60J150K537K236J496J331J118N06M39J263J800J198J0j140k196k662
55393B4476j916p86q23j798j993j121o03p69k59J258K202J644N45j04l86k81N31
55376A9817J368J058K4l12j06p19j793j455K94J276P13K18N93N71l36o45L28J103
55358B1997O84Q0L2l37j357j642m58P66O65j81p26r71j019m50M42M97l88r37o27
55339A6070l67m82j61O31P62P5k57J8j29p34o16L2m20j855j986j09J533J238P8
55320A3321n99j168j896j723m56L03j25k16Q80J626R21J35O40J481J336P19M84
55303A5663J55n50n68N10J280R09O20J198J326J96n15O16K120J996Q48M15O27
55286B6846M09l4N3K04k75p13l47N2m38j100r36m98o48p93j19O73N82K4k61o67
$$ y = [16250, 15390, 16540, 19077, 21313, 22809, 24140, 25258, 25764, 26203, 27466, 29266, 30464, 30474, 29334, 27138, 24476, 22560, 21774, 20951, 19153, 17160, 16039, 15436, 14667, 14408, 15666, 17868, 19512, 20057, 19953, 19567, 19286, 19817, 21185, 22243, 22267, 21955, 21849, 21130, 19337, 17882, 18176, 19452, 20165, 20383, 20976, 21547, 21211, 20566, 20894, 21997, 22681, 22761, 22793, 22456, 21099, 19457, 18999, 19765, 20430, 20249, 19523, 18552, 17533, 17083, 17525, 18022, 17634, 16697, 16070, 15703, 15221, 15060, 15691, 16453, 16528, 16271, 16289, 16160, 15426, 14810, 14842, 14422, 12567, 10581, 10472, 12005, 13243, 13321, 12722, 11554, 9658, 7935, 7479, 7782, 7657, 7441, 8321, 9947, 10868, 11003, 11643, 13124, 14460, 15179, 15663, 15818, 15268, 14700, 15210, 16490, 17399, 18019, 19217, 20543, 20739, 20224, 20840, 22960, 24956, 25804, 26219, 26846, 27255, 27221, 27274, 27478, 27203, 26490, 26143, 26195, 25757, 24657, 23721, 23223, 22575, 21782, 21663, 22336, 22918, 22942, 22681, 22014]
55266B2014j419j359J47J519J122j51m77N8K22N0L27O92L68k7N27J459J521R27
55248B7520P12O81K7p16l93N43N22o63j694j867j722j629j301p56m72m47j31O74
55230A8888J580K169K190J564O75J66K8l33r21j020n83m44p03l85O59J144N05
55213B5179n3K78M63l12r55l91M97M94J90N86R93L55n39k14R64J471J081P93Q65
55194C1745P12L29J45p6p12j188q02k01n20j494j844j111M5J058J749J832J176
55177C0843K58m46r81j256p73K73P36J61m80m97n84j217j480p64j29n15r88m09
55159B1752N12N33rj41j29n63p57K1P44R7j125j172j60M10K92N36J237J339N46
55140B3963l29q65j296j436p81L92J285J668J761J497J009R83J544J618O53j35
$$ y = [22014, 20595, 19236, 19383, 20902, 22024, 21873, 21396, 21454, 21676, 21726, 22053, 22745, 23113, 23086, 23613, 25072, 26593, 27520, 28232, 28913, 28940, 28224, 27831, 28374, 28896, 28233, 26539, 24672, 22950, 21321, 20020, 19264, 18792, 18345, 18214, 18888, 20468, 22637, 24827, 26391, 27066, 27232, 27260, 26927, 26006, 24986, 24403, 23959, 23256, 22871, 23530, 24674, 25179, 25126, 25404, 25867, 25555, 24600, 24209, 24706, 25200, 25390, 25976, 26969, 27324, 26785, 26571, 27535, 29006, 30087, 30880, 31745, 32457, 32786, 32931, 32855, 32143, 30955, 30153, 29952, 29432, 27938, 26094, 24983, 25028, 26086, 27835, 29667, 30843, 31101, 30655, 29674, 28418, 27645, 27918, 28654, 28815, 28335, 27838, 27254, 26037, 24557, 23793, 23664, 23149, 22161, 21752, 22264, 22797, 22788, 22647, 22518, 21955, 21198, 21219, 21963, 22060, 20935, 19763, 19603, 20013, 20305, 20841, 22078, 23417, 23963, 23634, 22769, 21473, 20037, 19256, 19648, 20933, 22601, 24362, 25859, 26868, 27851, 29395, 31013, 31666, 31531]
55124C1531L80J324J428J252J959K929K737J657R98O96k58j442j478n59k51q84
55108D2019j242q29l96j19P41K072K612J767L15q87j576j507n90M35P45P05J083
55091D5348J440Q44k02l20M38O94J09j19O34J488J568J105N91J08k05n6L56M65
55073E4286J41k48m71m06K07J204J736J332N96K5q20j950k093o27Q14N52m94l35
55055E3449Q75J387R13O63Q04L41n64n87L65R13N68K73L52K2p45q67j06M42K76
55036E8774J74N33P08M37L24M99K77m34q81q58r39j071n01O30J165P55K94L09
55018F0195L75L76P60J241Q69k71r94r76j178j866j992j176n78r82j434q16L96
55001E1949R41M20o15j514j875j703j555j862k064j293P4O82J08o13n53J05Q02
$$ y = [31531, 31911, 33235, 34663, 35915, 37874, 40803, 43540, 45197, 46195, 46891, 46633, 45191, 43713, 43154, 42903, 42019, 40777, 39948, 39552, 39433, 40174, 42246, 44858, 46625, 46940, 46053, 44477, 42970, 42380, 42815, 43560, 44265, 45348, 46788, 47632, 47430, 47110, 47548, 48242, 48351, 48232, 48866, 50354, 51922, 53027, 53618, 53726, 53521, 53465, 53821, 54286, 54427, 54179, 53708, 53302, 53509, 54713, 56449, 57781, 58377, 58402, 57582, 55632, 53539, 52912, 53726, 54278, 53784, 53449, 54324, 55711, 56624, 57287, 58091, 58432, 57868, 57281, 57646, 58559, 59127, 59400, 59752, 59774, 59029, 58162, 58056, 58498, 58774, 58948, 59481, 60189, 60626, 60950, 61449, 61726, 61292, 60411, 59553, 58614, 57543, 57042, 57672, 58837, 59592, 59886, 60195, 60570, 60946, 61706, 62947, 63816, 63545, 62551, 61575, 60397, 58531, 56539, 55363, 54785, 53803, 52369, 51553, 51949, 52890, 53310, 52695, 51181, 49306, 47603, 46048, 44186, 42122, 40829, 40903, 41585, 41693, 41080, 40527, 40632, 41434]
54984D1434J320J503J277J009J088J145O59k4k59l21p32q17N00K651L858L575
54968E7866K876K445J922J321J291J706J691J370J868L302M422M692M960N655
54954I7387O063O055O775Q778J0952J2112J2368J2218J1532J0131Q291O051L094
54941B11807l10l427o271r409j2332j3613j3082j2215j1875j1305r913q420p393
54928I2242o270m683l353k764k300j510r38q81o41J58P31N48L62R40J911K708
54912G6260L561M702N677O303P268Q930J0503J1185J1168J0846J0010Q536O817
54899A81766M847J976j743n055p116q562j0158j1497j1868j1372j0396q933p203
54886I4686n992n542n015l810k531j965j990k147k331k355j804r25o21r47q21
$$ y = [41434, 42754, 44257, 45534, 46543, 47631, 48776, 49435, 49411, 49152, 48831, 48099, 47282, 47782, 50433, 54291, 57866, 60742, 63187, 65109, 66430, 67721, 69427, 71118, 72488, 74356, 77658, 82080, 86772, 91732, 97387, 103450, 109505, 116280, 125058, 136010, 148122, 160490, 172708, 184240, 194371, 202662, 208713, 211807, 211497, 208070, 201799, 192390, 180058, 166445, 153363, 141148, 129273, 117968, 108055, 99635, 92242, 85972, 81289, 77936, 75172, 72872, 71362, 70424, 69543, 68902, 69060, 69791, 70339, 70701, 71641, 73552, 76260, 79821, 84523, 90200, 96503, 103771, 112701, 123204, 134389, 145557, 156403, 166413, 174949, 181766, 186613, 188589, 186846, 181791, 174675, 166113, 155955, 144458, 132590, 121218, 110822, 101889, 94686, 88694, 83152, 78137, 74327, 71796, 69831, 67841, 65694, 63363, 61008, 59204, 58279, 57658, 56711, 55890]
54871E5890R9N91j92j246j289o18k51k10O9M33L40n6k06j54l44q67j520k117k239
54852D6113j405p2M43l24j238j248p99p57r01n81q0j38n79n55J26P65P37J35l93
54833C9249j32R86J984J745N05l38j25L12J72p9L31J170J622J382P38Q3j78K11
54815D9638Q99J228J147J210J538J687J594J671J813J495J017J421K843M270N122
54800G8593N857O611O820O678P366R208J1050J2134J3003J3768J3264J0915P919
54787B03186N335K504j335n209p661q697r155r213q818q523q569q159o821n516
54773A23349n055m568l088j499j223j763j409O5J246J351J077J173J563K012K589
54758A15820L345M295N617P266Q679R514J0316J1799J3801J5604J6751J6971J5871
$$ y = [55890, 55989, 56580, 56388, 55142, 53853, 53235, 52984, 52774, 52843, 53276, 53616, 53560, 53354, 53200, 52856, 51989, 50469, 48352, 46113, 44708, 44636, 45079, 44755, 43517, 42269, 41470, 40713, 39812, 39231, 39151, 39013, 38434, 37879, 38005, 38770, 39507, 39642, 39249, 39117, 40103, 42087, 43832, 44337, 43999, 43874, 44186, 44358, 44279, 44610, 45780, 47402, 48784, 49522, 49605, 49427, 49638, 50537, 51765, 52912, 54122, 55660, 57347, 58941, 60612, 62425, 63920, 64937, 66358, 69201, 73471, 78593, 84450, 91061, 97881, 104559, 111925, 121133, 132183, 144317, 157320, 171088, 184352, 195267, 203186, 208521, 211025, 209690, 204481, 196820, 188123, 178968, 169755, 160937, 152414, 143845, 135686, 128865, 123349, 118294, 113726, 110638, 109139, 107916, 106153, 104744, 104809, 106055, 107406, 108483, 109656, 111219, 113231, 115820, 119165, 123460, 129077, 136343, 145022, 154536, 164852, 176651, 190452, 206056, 222807, 239778, 255649]
54745B55649J3420J0237O827L026j300n653r491j2697j5022j5940j5554j4801
54733A98701j4156j3096j1386r811q901q119o971n864n120m315l437l306l991
54720A00228m142k981j635j270j355j054q91j413j622n45P92Q23k1k34J46o8q01
54703H3957q06O4O60N20L24L08n3o55n45M95J426J336M82l16n25j48L04J73m88
54684H6513q18l69J80J68O6N84J456K035K315K408J815M14o13q2J543K923L629
54667A04167L989L975L510L292L921M741M782M292M074M013L546K991K984L098
54653A57375K449J242M11J84K37O62J546K197K192K435L818N540O417P037Q797
54638B02539J1356J2992J3180J2890J2567J1618R820P430M056q21o169j0070j2135
$$ y = [255649, 269069, 279306, 286133, 289159, 287859, 282206, 272715, 260018, 244996, 229056, 213502, 198701, 184545, 171449, 160063, 150252, 141351, 133232, 126261, 120397, 115277, 110962, 107525, 104219, 100228, 96086, 93105, 91470, 90200, 88845, 87791, 86900, 85487, 83865, 83320, 84112, 84935, 84914, 84680, 84826, 84758, 83957, 83151, 83215, 83875, 84395, 84719, 85027, 84974, 84319, 83774, 84269, 85695, 87031, 87513, 87197, 86672, 86524, 86828, 87001, 86513, 85695, 85326, 85506, 85674, 85740, 86324, 87780, 89815, 92130, 94538, 96353, 96767, 96154, 96072, 97615, 100538, 104167, 108156, 112131, 115641, 118933, 122854, 127595, 132377, 136669, 140743, 144756, 148302, 151293, 154277, 157375, 159824, 161066, 161477, 161661, 161898, 162560, 164106, 166303, 168495, 170930, 174748, 180288, 186705, 193742, 202539, 213895, 226887, 240067, 252957, 265524, 277142, 286962, 294392, 298448, 297627, 291458, 281388, 269253]
54625B69253j3644j5204j5985j5484j4318j2963j1199r164p620o762n952m835
54613A36123l640k394r89N3K29K31J137K480K717J567L08k82o14q40m21M35O08
54596A36708k61j268j868k561l498l878l372k912l299m091m495m420m095l459
54582I3231k486j489p61m56q09j782k660k761k424k337k261j514m53j21n83q99
54566F9435p39o64q13p01m59q04j606j857j218m13J31O84J120Q77K39K88J165
54549F4665J725J306N81K60K35L82R68J766J908J226O69R57J750K525L206L666
54533H7795L606L349L707M762N676N988O081O167N883N161M463L780K473M11j666
54518A47636l193m325n259n914o381o802o778n901m777m440m793m824m253l722
$$ y = [269253, 255609, 240405, 224420, 208936, 194618, 181655, 170456, 161292, 153672, 146910, 140958, 136123, 132483, 130089, 129100, 129153, 129382, 129613, 130750, 133230, 135947, 137514, 137822, 137540, 136926, 136086, 135665, 136100, 136708, 136447, 135179, 133311, 130750, 127252, 123374, 120002, 117090, 113791, 109700, 105205, 100785, 96690, 93231, 90745, 89256, 88495, 88039, 87230, 85448, 82788, 80027, 77603, 75266, 73005, 71491, 71038, 70917, 70334, 69435, 68696, 68032, 67219, 66518, 66059, 65255, 63649, 61792, 60574, 60161, 60292, 60976, 62096, 62973, 63212, 63500, 64665, 66390, 67696, 68277, 68537, 68772, 69154, 70122, 71888, 73796, 75022, 75691, 76648, 78398, 80923, 84129, 87795, 91401, 94750, 98457, 103219, 108895, 114883, 120964, 127131, 133014, 138175, 142638, 146418, 148891, 149302, 147636, 144443, 140118, 134859, 128945, 122564, 115762, 108984, 103083, 98306, 93866, 89073, 84249, 79996, 76274]
54504G6274l369k639j551p43k70L49P92K61q47j170m79M5j56l32j45k56p92q33
54486F4139k4P98J123J372J540R18l18q09o1P69Q06O00O34L55m21o74K18J370
54468G2335J795J652J313O02k71l63M17Q10J22p06q54r63j627k022j315k34J15
54451G0806l6J64N95N56K9m77p59q42p06o28r88j383r64lJ98n95j090p16o21j470
54431F1070k022j098M97J328J307R98K84q80j565j079j36L38N28Q01P67L76O14
54414F2128J736K272J253O0L25J382J628J253J488K170K256K038K670L882M344
54399I0885L974L946M503M686M189L727L540L189K935L527M513M364K680Q25l5
54384A41448k49o25j202j687k157k778l421l902m173m137l717l109k621k352k308
$$ y = [76274, 72905, 70266, 68715, 67972, 67702, 68051, 68843, 69104, 68257, 67087, 66608, 66653, 66497, 66165, 66020, 65764, 64972, 64139, 64115, 64913, 66036, 67408, 68948, 69866, 69548, 68739, 68678, 69447, 70253, 70853, 71487, 71842, 71421, 70747, 70965, 72335, 74130, 75782, 77095, 77697, 77426, 77063, 77480, 78290, 78412, 77706, 76852, 75889, 74262, 72240, 70925, 70691, 70806, 70770, 70934, 71529, 72085, 72114, 71637, 70878, 70036, 69330, 68702, 67714, 66331, 65367, 65364, 65562, 64967, 63877, 63161, 62540, 61070, 59048, 57950, 58447, 59775, 61082, 62080, 62364, 61484, 59919, 58840, 58704, 59042, 59570, 60371, 61138, 61514, 62128, 63864, 66136, 67389, 67449, 67774, 69156, 70784, 72037, 73525, 75695, 77951, 79989, 82659, 86541, 90885, 94859, 98805, 103308, 107994, 112183, 115910, 119450, 122639, 125574, 129101, 133614, 137978, 140658, 141483, 141448, 141199, 140574, 139372, 137685, 135528, 132750, 129329, 125427, 121254, 117117, 113400, 110291, 107670, 105318, 103010]
54369A03010k492k518j823o79l20j265k382k443j858j695j784j156P4Q03O87M73
54353H4632O13Q12R65J401K019K168J632R50O87J026J999L361M361M416L921L716
54337A18679L942M078L891L568L111K418J737J260N40q83k496l392l576l818m391
54322A24668m875n093n238n225m811m313m285m519m209l209k225j767j667j687
54308G1545j838j969j816j501j380j391j233j122j522k128j992r53m8j31o96o03
54292E1222M30J580J960J477P35K60O2j37m65q73j368j852j863j037J53P55N27
54275E1566J84K91O34R13J202J421J129L59o9L55J076J337J092O06o0o22n01K11
54257F1124N13n7o48m69p6l07q21p65k58rn5N8K55K00J29M11O27J85n33o33j34
$$ y = [103010, 100518, 98000, 96177, 95498, 95178, 93913, 91531, 89088, 87230, 85535, 83751, 82595, 82669, 83472, 84159, 84632, 85245, 86057, 87022, 88423, 90442, 92610, 94242, 95192, 95879, 96905, 98904, 102265, 106626, 111042, 114963, 118679, 122621, 126699, 130590, 134158, 137269, 139687, 141424, 142684, 143224, 142341, 139845, 136453, 132877, 129059, 124668, 119793, 114700, 109462, 104237, 99426, 95113, 90828, 86309, 82100, 78891, 76666, 74899, 73232, 71545, 69707, 67738, 65922, 64421, 63041, 61650, 60417, 59295, 57773, 55645, 53653, 52700, 52652, 52521, 51825, 51222, 51652, 53232, 55192, 56669, 57404, 57664, 57726, 57589, 57124, 56251, 54883, 53031, 51168, 50131, 50284, 51039, 51566, 51750, 52041, 52675, 53588, 54790, 56211, 57340, 57699, 57630, 57985, 59061, 60398, 61490, 62096, 62036, 61414, 60913, 61124, 61637, 61580, 60932, 60463, 60387, 60080, 59259, 58494, 58236, 58227, 58172, 58230, 58485, 58685, 58814, 59225, 59852, 60037, 59504, 58871, 58737]
54236E8737J12k89r01j266j301j032o27m44n55n65l95o36j455j953j431n77l09
54219D5113k57M56J443J506N98k6M04J308J762J441N58l56o43j29M98N16M9l88
54201E3853o97r65q84k37M85O81M42J09k86n43o9J038J478M37j011j346o88k07
54183E1590j38J91Q44J228J258J232Q39l29j614j889j208n75k82K42J048J397
54167E3834R41J27n70r49p88j30M02L70K27M64O67L72J34N89J140Q85K10N7K32
54148E8214p1n87l98L48P14O34O90O99M4q60j097q94j114j473j029q4K37M5L71
54129E4389R99O95m21q69k95J03j73k47J29L8o99j018o09n33j229j705j426j152
54111D5977j262r96k10K2o38q87P7J155J202Q29J100J710J683R09q1r83j596j547
$$ y = [58737, 58849, 58560, 57659, 56393, 55092, 54060, 53433, 52989, 52434, 51869, 51474, 50838, 49383, 47430, 45999, 45422, 45113, 44856, 45312, 46755, 48261, 48859, 48833, 49237, 50545, 52307, 53748, 54306, 53950, 53307, 53178, 53676, 54192, 54241, 53853, 53156, 52191, 51307, 51070, 51555, 52236, 52678, 52787, 52501, 51958, 51889, 52927, 54405, 54842, 53831, 52485, 51797, 51590, 51452, 51643, 52487, 53715, 54973, 56205, 57044, 56715, 55101, 53212, 52004, 51429, 51147, 51389, 52437, 53834, 54775, 54902, 54332, 53383, 52595, 52465, 52867, 53237, 53464, 53928, 54595, 54967, 55101, 55690, 56830, 57715, 57925, 57982, 58214, 58143, 57556, 57158, 57506, 58220, 58854, 59544, 60243, 60287, 59427, 58330, 57436, 56322, 54849, 53820, 53736, 53973, 54018, 54389, 55388, 56083, 55662, 54793, 54498, 54601, 54428, 54181, 54310, 54348, 53649, 52631, 52022, 51489, 50260, 48555, 47129, 45977, 44715, 43719, 43509, 43531, 42893, 42006, 42083, 43238, 44440, 45269, 46369, 48079, 49762, 50671, 50590, 49607, 48011, 46464]
54093D6464r51m71k85O9M97K39n90p33K71J205R40j02r61j376j306m39R29J669
54075D5069J223K70n16j172j431m91J355K372J693O04N00Q45M46m47p02j16O84
54058E0186J404K025K135J455N17j0j73k26R3R09J600J552J071Q16R02J106J267
54041F6629J100L26n80n60O11J992K859L403L752L575L177L646N117O247O133
54026A07427N593N613N897N874N832N984N605M320L152L069L469L245K455J766
54012A69301J181M60K5K18N02L97L43O84P47M7p42j041j486k529l135k442j577
53995A60953k075l418l946l490l184l295l137k774k943l441l337k680k360k310
53981A18563j577k42L96j60r13j054j011j330j744j853j856k022k145j904j255
$$ y = [46464, 45513, 45042, 44757, 44826, 45323, 45562, 44972, 44239, 44510, 45715, 46655, 46553, 45592, 44216, 42910, 42471, 43400, 45069, 46292, 46562, 46046, 44874, 43443, 42952, 44307, 46679, 48372, 48976, 49476, 50321, 50767, 50320, 49618, 49502, 50186, 51590, 53615, 55750, 57205, 57722, 57712, 57539, 57313, 57406, 58315, 59915, 61467, 62538, 63354, 64256, 65362, 66629, 67729, 68055, 67475, 66915, 67526, 69518, 72377, 75780, 79532, 83107, 86284, 89930, 95047, 101294, 107427, 113020, 118633, 124530, 130404, 136236, 142220, 147825, 152145, 155297, 158366, 161835, 165080, 167535, 169301, 170482, 170942, 170967, 171185, 171687, 172084, 172427, 173111, 173858, 173905, 173163, 172122, 170636, 168107, 164972, 162530, 160953, 158878, 155460, 151514, 148024, 144840, 141545, 138408, 135634, 132691, 129250, 125913, 123233, 120873, 118563, 116986, 116744, 117140, 116980, 116067, 115013, 114002, 112672, 110928, 109075, 107219, 105197, 103052, 101148, 99893]
53966I9893l37N26P87K78l70m71k43l26o01m44J38N86Q28J279J845J972J715J783
53948A08838K373K843K772K547K650L039L410L511L130K336J828K393L831M998
53934A50499N097M425L743L300K712J614J90q77j117r08j031j602j886j432o72
53919A62055r9M32J103J519J490J769L136N090O373O478N920N298M898N044N937
53904B16443P128P765P450O436N153L920K957K234J425M08m66q78r78j065j237
53889B56695j601k275k935l015k719l052m345n593n885n667n841o399o837p104
53875A93427p226o695n243l663k844k554k191k038k673l646l984l723l645l835
53861A39467l677l175l044l510l985m019l671l008k063j273j158j576j962k142
$$ y = [99893, 99556, 100082, 100869, 101147, 100777, 100306, 100063, 99737, 99136, 98692, 98830, 99416, 100244, 101523, 103368, 105340, 107055, 108838, 111211, 114054, 116826, 119373, 122023, 125062, 128472, 131983, 135113, 137449, 139277, 141670, 145501, 150499, 155596, 160021, 163764, 167064, 169776, 171390, 171580, 170703, 169586, 168678, 167647, 166045, 164159, 162727, 162055, 161956, 162388, 163491, 165010, 166500, 168269, 171405, 176495, 182868, 189346, 195266, 200564, 205462, 210506, 216443, 223571, 231336, 238786, 245222, 250375, 254295, 257252, 259486, 260911, 261319, 260853, 259975, 258997, 257932, 256695, 255094, 252819, 249884, 246869, 244150, 241098, 236753, 231160, 225275, 219608, 213767, 207368, 200531, 193427, 186201, 179506, 174263, 170600, 167756, 165202, 163011, 160973, 158300, 154654, 150670, 146947, 143302, 139467, 135790, 132615, 129571, 126061, 122076, 118057, 114386, 111378, 109315, 108042, 106884, 105308, 103346, 101204]
53847A01204k302k337j999j448j020o85l31j95m19o03m72m49p84q78l05J92j39
53830H7030o01j04R48J222N77O4O9o2n26p18n05n23r48j124p33l00k35k93j70
53811H3068J74P49J340J238J35r06n02J121K404K655K696L250L987M437M669M692
53795A15207M246L552L309L560L556L047K772L251L951M132L775L316L063L176
53781A63913L577L706K966J543K19o27j178j485j487j583k203k880k835k451k863
53766A56332l996m435l622k732k730k905k286j383j320j977k236j712j144j057
53752A22797j066o08J88O97N98J72j08j54k11l18k17N4n7q68j879k367k274j942
53734A12437j449p92k92j37J31Q58J397R03k68r28o68r6L75R02J376J272O07R9
$$ y = [101204, 98902, 96565, 94566, 93118, 92098, 91413, 91082, 90887, 90468, 89865, 89393, 88944, 88160, 87282, 86977, 87169, 87030, 86429, 86325, 87273, 88495, 89072, 89136, 89205, 89143, 88617, 87899, 87394, 86871, 85923, 84799, 84066, 83766, 83531, 83238, 83068, 83242, 83991, 85331, 86569, 86704, 85798, 85296, 86417, 88821, 91476, 94172, 97422, 101409, 105846, 110515, 115207, 119453, 123005, 126314, 129874, 133430, 136477, 139249, 142500, 146451, 150583, 154358, 157674, 160737, 163913, 167490, 171196, 174162, 175705, 175924, 175297, 174119, 172634, 171147, 169564, 167361, 164481, 161646, 159195, 156332, 152336, 147901, 144279, 141547, 138817, 135912, 133626, 132243, 130923, 128946, 126710, 124998, 123854, 122797, 121731, 121123, 121311, 122008, 122606, 122778, 122670, 122516, 122305, 121987, 121770, 121824, 121767, 120899, 119020, 116653, 114379, 112437, 110988, 110196, 109904, 109767, 109898, 110756, 112153, 113056, 112788, 111860, 111192, 111096, 111471, 112373, 113749, 115021, 115628, 115727]
53716A15727J74M44L81j15q11j289j132m72p1k22q4J002K183K247J554J394J761
53699A22671J524O53N58J782L130L555L453L418L128K300J536J372J382J091R07
53684A52460J397K319L038L356L414L311L157L017K577J529M23K28R77J696J852
53669A84751J836J821J351L98l26n52q63j414j493r27p00j347j943j613r80j080
53653A76919j678j839j516j443j849k257k284j910j190l98q0m15p99o19q6K17
53637A58773J85J83M47R41J475J688J333P58O45J069J437J502J681K097K198J787
53621A78199J489J686J794J347R24J228J876K014J596J239J261J545K092K909
53607B01199L621L874L846L888L909L652L284L188L400L752M298N090N756N831
$$ y = [115727, 115901, 116345, 116726, 116611, 115800, 114511, 113379, 112907, 112836, 112614, 112530, 113532, 115715, 117962, 119516, 120910, 122671, 124195, 124848, 125406, 127188, 130318, 133873, 137326, 140744, 143872, 146172, 147708, 149080, 150462, 151553, 152460, 153857, 156176, 159214, 162570, 165984, 169295, 172452, 175469, 178046, 179575, 179998, 180226, 181203, 182899, 184751, 186587, 188408, 189759, 190157, 189831, 189279, 188416, 187002, 185509, 184582, 183882, 182535, 180592, 178979, 177999, 176919, 175241, 173402, 171886, 170443, 168594, 166337, 164053, 162143, 160953, 160555, 160475, 160060, 159261, 158642, 158556, 158773, 158958, 159141, 159588, 160529, 162004, 163692, 165025, 165783, 166428, 167497, 168934, 170436, 172117, 174214, 176412, 178199, 179688, 181374, 183168, 184515, 185439, 186667, 188543, 190557, 192153, 193392, 194653, 196198, 198290, 201199, 204820, 208694, 212540, 216428, 220337, 223989, 227273, 230461, 233861, 237613, 241911, 247001, 252757, 258588]
53593B58588N384M903M603M219L522K747K458K912L633L874L608L630M287M675
53579C13043L787K083R18O95O75M58M83Q64J020P49O61J047J342J141P81N41J69
53562C30457k82j82N00P73M8q00n87O47J945K629K583J891Q69O9j86O6P71J796
53544C43007K414J910P94M81J332K138J934J284J133J426J607J596J578J494J389
53529C65517J558J945K148K308L031M149M729M723N236O552P374O919O306O791
53515D29286P938Q723R280J0157J0960J1197J1554J2809J4246J4725J4650J5310
53503E70835J6675J7503J7426J7482J8427J9796K0781K1160K1230K1401K1933
53492G84649K2660K3196K3653K4495K5406K5301K4047K3075K3358K3891K3297
$$ y = [258588, 263972, 268875, 273478, 277697, 281219, 283966, 286424, 289336, 292969, 296843, 300451, 304081, 308368, 313043, 316830, 318913, 319831, 320526, 321201, 321659, 322142, 323006, 324026, 324775, 325436, 326483, 327825, 328966, 329747, 330288, 330457, 330175, 329993, 330493, 331266, 331314, 330514, 329927, 330574, 332519, 335148, 337731, 339622, 340491, 340560, 340374, 340440, 341211, 343007, 345421, 347331, 348125, 348606, 349938, 352076, 354010, 355294, 356427, 357853, 359460, 361056, 362634, 364128, 365517, 367075, 369020, 371168, 373476, 376507, 380656, 385385, 390108, 395344, 401896, 409270, 416189, 422495, 429286, 437224, 445947, 455227, 465384, 476344, 487541, 499095, 511904, 526150, 540875, 555525, 570835, 587510, 605013, 622439, 639921, 658348, 678144, 698925, 720085, 741315, 762716, 784649, 807309, 830505, 854158, 878653, 904059, 929360, 953407, 976482, 999840, 1023731, 1047028]
53481A047028K1926K1070K0948K0888K0800K1007K1182K0870K0570K0905K1198
53470A278392K0349J8687J7506J7072J6586J5810J5202J4588J3205J1049Q845
53459A447291O763M549K687J959J871R50j221l710o018q628j1574j3925j5180
53446A405814j5912j6616j7115j7487j8353j9796k1080k1905k2846k4079k4796
53435A185829k4474k3750k3333k2981k2258k1543k1414k1622k1343k0188j8417
53424I44506j6477j4766j3524j2631j1666j0404q995p610o212m733l138j327O54
53411H33677K303L093L277L776N145P045Q776J0055J1135J2466J4235J6130J7660
53398I48773J8894K0431K2484K4395K5568K6340K7440K8982L0589L2111L3545
$$ y = [1047028, 1068954, 1090024, 1110972, 1131860, 1152660, 1173667, 1194849, 1215719, 1236289, 1257194, 1278392, 1298741, 1317428, 1334934, 1352006, 1368592, 1384402, 1399604, 1414192, 1427397, 1438446, 1447291, 1454054, 1458603, 1461290, 1463249, 1465120, 1466070, 1464849, 1461139, 1455121, 1446493, 1434919, 1420994, 1405814, 1389902, 1373286, 1356171, 1338684, 1320331, 1300535, 1279455, 1257550, 1234704, 1210625, 1185829, 1161355, 1137605, 1114272, 1091291, 1069033, 1047490, 1026076, 1004454, 983111, 962923, 944506, 928029, 913263, 899739, 887108, 875442, 865038, 856043, 848433, 842221, 837488, 834350, 833023, 833677, 835980, 839073, 842350, 846126, 851271, 858316, 867092, 877147, 888282, 900748, 914983, 931113, 948773, 967667, 988098, 1010582, 1034977, 1060545, 1086885, 1114325, 1143307, 1173896, 1206007, 1239552]
53387A239552L4732L5774L7349L9864M2646M4696M5857M6572M7026M7345M8098
53376A709511M9604N1114N1661N1360N0908N0322M9242M8027M7183M6095M3760
53365B248787M0501L7520L4860L1366K6812K2404J8858J5389J1151O350J410l741
53353B491667q894j3266j6613j9744k3287k6847k9970l2982l6128l8820m0571
53342B204545m2068m4354m7274m9540n0167m9387m8195m7378m6927m6233m4919
53331A688103m3422m2409m1845m1062l9670l7898l6092l4461l3196l2218l0977
53320A274853k9091k7040k5469k4011k1795j8968j6643j5261j4128j2747j1558
53309A058142j0925j0449r799r370r407r285q333o803n391m200k807j072O52K048
$$ y = [1239552, 1274284, 1310058, 1347407, 1387271, 1429917, 1474613, 1520470, 1567042, 1614068, 1661413, 1709511, 1759115, 1810229, 1861890, 1913250, 1964158, 2014480, 2063722, 2111749, 2158932, 2205027, 2248787, 2289288, 2326808, 2361668, 2393034, 2419846, 2442250, 2461108, 2476497, 2487648, 2493998, 2495408, 2491667, 2482773, 2469507, 2452894, 2433150, 2409863, 2383016, 2353046, 2320064, 2283936, 2245116, 2204545, 2162477, 2118123, 2070849, 2021309, 1971142, 1921755, 1873560, 1826182, 1779255, 1733022, 1688103, 1644681, 1602272, 1560427, 1519365, 1479695, 1441797, 1405705, 1371244, 1338048, 1305830, 1274853, 1245762, 1218722, 1193253, 1169242, 1147447, 1128479, 1111836, 1096575, 1082447, 1069700, 1058142, 1047217, 1036768, 1026969, 1017599, 1008192, 998907, 990574, 983771, 978380, 974180, 971373, 970301, 970953, 973001]
53295I73001L186M325N538O606P290P785Q631R992J1387J2422J3398J4746J6322
53282A094629J7803J9341K1173K3009K4548K6016K7473K8143K7450K6204K5530
53271A361319K5110K3807K1725K0055J9033J7592J5264J2842J0911R046O876M662
53259A548242K509J84j946l145l786n206p694j0008j1447j2913j5101j7141j8092
53246A444456j8597j9851k1758k3242k3809k3844k3886k4310k5228k6127k6157
53235A187647k5275k4427k4114k3671k2439k0784j9313j7994j6824j6443j7168
53224I59195j8048j7858j6497j4727j3097j1863j1327j1384j1196j0187q882q088
53212H06041p752p312o755o518o655o924p343q046q818r355r732j0143j0495j0708
$$ y = [973001, 976187, 980512, 986050, 992656, 999946, 1007731, 1016362, 1026354, 1037741, 1050163, 1063561, 1078307, 1094629, 1112432, 1131773, 1152946, 1175955, 1200503, 1226519, 1253992, 1282135, 1309585, 1335789, 1361319, 1386429, 1410236, 1431961, 1452016, 1471049, 1488641, 1503905, 1516747, 1527658, 1536704, 1543580, 1548242, 1550751, 1550935, 1548989, 1545844, 1542058, 1536852, 1529158, 1519150, 1507703, 1494790, 1479689, 1462548, 1444456, 1425859, 1406008, 1384250, 1361008, 1337199, 1313355, 1289469, 1265159, 1239931, 1213804, 1187647, 1162372, 1137945, 1113831, 1090160, 1067721, 1046937, 1027624, 1009630, 992806, 976363, 959195, 941147, 923289, 906792, 892065, 878968, 867105, 855778, 844394, 833198, 823011, 814129, 806041, 798289, 790977, 784222, 777704, 771049, 764125, 756782, 748736, 739918, 730563, 720831, 710688, 700193, 689485]
53198F89485j1007j1466j1596j0991j0012r338r129r100r135r384r889j0499j1024
53185E56915j1350j1555j1967j2716j3373j3479j3286j3265j3124j2250j1030
53174D19520j0592j1090j1493j1266j0980j0865j0189q684p270o580o051n315
53162C09145n163o030o781o246n048m541m811m999m905m903m859m410l885l804
53148B38760l895l679l441l530l374k458j661k131l272l438k377j412j268j323
53134B01501j130j109j268p82N91J790J923J548J702K400K806K495J889J566J694
53119B17616K003K222K393K711L003K700J565R9j123k110k972l282k684j875k054
53104B18212l419m945n655n548n122m730m508m462m452m363m304m328m113l358
$$ y = [689485, 678478, 667012, 655416, 644425, 634413, 625075, 615946, 606846, 597711, 588327, 578438, 567939, 556915, 545565, 534010, 522043, 509327, 495954, 482475, 469189, 455924, 442800, 430550, 419520, 408928, 397838, 386345, 375079, 364099, 353234, 343045, 334361, 327091, 320511, 314460, 309145, 303982, 297952, 291171, 284925, 279877, 275336, 270525, 265526, 260621, 255718, 250859, 246449, 242564, 238760, 234865, 231186, 227745, 224215, 220841, 218383, 216722, 214591, 211319, 207881, 205504, 204092, 202824, 201501, 200371, 199262, 197994, 197212, 197803, 199593, 201516, 203064, 204766, 207166, 209972, 212467, 214356, 215922, 217616, 219619, 221841, 224234, 226945, 229948, 232648, 234213, 234312, 233189, 231079, 228107, 224825, 222141, 220266, 218212, 214793, 209848, 204193, 198645, 193523, 188793, 184285, 179823, 175371, 171008, 166704, 162376, 158263, 154905]
53090A54905k332j549j036n32k62q41k236l437l464k372j087m86p49j386j784
53075A31352j733j480j264j045p53m79l15k67m85j156k014k406k147j785j762
53060A12261j773j398q10l71K1N42Q80O11l8m40l21J35O72J009Q17J64l66l67
53042A11228j37q6q3R3J62j43l98o2N52O14p9r39j401j386j077p37o19o63n40
53023A04299k50k80p41r23l02N42P15K12l20o15p51n17K68J047J009J97o37j011
53005A01942r67n39K01P74P47M14L39M38K55o3O5O37J044R98P49M79J74M2L43
52986A08072Q98J383J919K673L181K914K320K329K960L386L381L598M295M834
52972A48143M716M257L908L668L472L411L258K486J080k54r73j255j442j602j847
$$ y = [154905, 152573, 151024, 149988, 149456, 149194, 148353, 146117, 142680, 139216, 136844, 135757, 135271, 134522, 133136, 131352, 129619, 128139, 126875, 125830, 125077, 124598, 124283, 124016, 123531, 122375, 120361, 117955, 115808, 114023, 112261, 110488, 109090, 108280, 107909, 107930, 108472, 109352, 109963, 109925, 109485, 109164, 109299, 109971, 110980, 111797, 111961, 111595, 111228, 111091, 111005, 110922, 111015, 111177, 111034, 110636, 110574, 111126, 111740, 111661, 110722, 109321, 107935, 106858, 106121, 105502, 104839, 104299, 104049, 103769, 103028, 102105, 101803, 102345, 103060, 103272, 102952, 102337, 101586, 101069, 101337, 102384, 103393, 103590, 102953, 101942, 100975, 100436, 100637, 101411, 102158, 102572, 102911, 103349, 103604, 103541, 103606, 104243, 105287, 106285, 107034, 107513, 107687, 107729, 108072, 108970, 110353, 112272, 114945, 118126, 121040, 123360, 125689, 128649, 132035, 135416, 139014, 143309, 148143, 152859, 157116, 161024, 164692, 168164, 171575, 174833, 177319, 178399, 178145, 177172, 175917, 174475, 172873, 171026]
52957A71026k437l213l517l052k367k067k057j960j851k069k514k619k054j139
52943A38110n47o28j069j271j071r14j160j538j574j324j213j323j286q81l58
52928A21953m7j2o2J1K50M49L85J50P5J89J69k7J6M70R10J007J045J356J654J523
52908A31464J103Q16Q14J102J675K083J565K05p63n42M9p1n04j93O63R14M40K96
52890A41116Q86J324R34K10j13j2K13N15R06J284J692K239K615K296J362N29K35
52873A58231K34K12K12L27M39M75N57P42R22R74Q54O80Q08J458K195K339K084
52856A73743K375L307L685K871K022K384L448M006M155M600M787L681J951J349
52842B18364J968K090J018Q0K46N51k03j588k400k396k254k527l303m316m981
$$ y = [171026, 168589, 165376, 161859, 158807, 156440, 154373, 152316, 150356, 148505, 146436, 143922, 141303, 139249, 138110, 137563, 136935, 135866, 134595, 133524, 132610, 131450, 129912, 128338, 127014, 125801, 124478, 123192, 122311, 121953, 121906, 121894, 121832, 121843, 122093, 122542, 122927, 123077, 123152, 123341, 123510, 123483, 123499, 123969, 124879, 125886, 126931, 128287, 129941, 131464, 132567, 133383, 134197, 135299, 136974, 139057, 140622, 140827, 140064, 139522, 139571, 139500, 138996, 138803, 139466, 140380, 140820, 141116, 142002, 143326, 144260, 144470, 144357, 144345, 144558, 145073, 145979, 147263, 148955, 151194, 153809, 156105, 157467, 157996, 158231, 158465, 158677, 158889, 159216, 159655, 160130, 160687, 161429, 162351, 163325, 164179, 164859, 165667, 167125, 169320, 171659, 173743, 176118, 179425, 183110, 185981, 188003, 190387, 193835, 197841, 201996, 206596, 211383, 215064, 217015, 218364, 220332, 222422, 223440, 223520, 223766, 224317, 224114, 222526, 220126, 217730, 215476, 212949, 209646, 205330, 200349]
52827B00349m859m278l894l650l031k250k026k198j829q81m93j171k050k403k586
52812A62750k863k628j600o55o18j113j406j494j594j366n85J69K82L2pM8l06
52795A47046j071j753j904j395n15j6m50j293j454q05l31n69r33q66o61o58o55
52778A31717o38j030j727j835j057l11l77q49j143j408j687j244K26J590J631
52763A21858O69j23l67m51m93m37p23j739k849k945j874n72O4j26p84j356j457
52746A06295j243j226j487j581j357j231j302j110o21n79j260j807j469o74j40
52731H9208J74M39K79m06p28qJ052J406J170J031Q39O7r20j285j066r11p92j93
52713H9356O68J037R18R79J271J119M62J96R60K333L520M097L985L330K553K064
$$ y = [200349, 195490, 191212, 187318, 183668, 180637, 178387, 176361, 174163, 172334, 171453, 170960, 169789, 167739, 165336, 162750, 159887, 157259, 155659, 155004, 154386, 153273, 151867, 150373, 148779, 147413, 146828, 146997, 147279, 147311, 147304, 147352, 147046, 145975, 144222, 142318, 140923, 140408, 140392, 139942, 138649, 137195, 136390, 136059, 135490, 134557, 133691, 133030, 132372, 131717, 131079, 130049, 128322, 126487, 125430, 125119, 124742, 123893, 122750, 121342, 119655, 118411, 118637, 120227, 121858, 122527, 122404, 122037, 121586, 121093, 120656, 119933, 118194, 115345, 112400, 110526, 109954, 110018, 109892, 109108, 107752, 106295, 105052, 103826, 102339, 100758, 99401, 98170, 96868, 95758, 95137, 94558, 93298, 91491, 90022, 89348, 89208, 89382, 89821, 90100, 89694, 88966, 88958, 90010, 91416, 92586, 93617, 94456, 94523, 93603, 92318, 91252, 90341, 89549, 89356, 90024, 91061, 91979, 92958, 94229, 95348, 95810, 96006, 96966, 99299, 102819, 106916, 110901, 114231, 116784, 118848]
52697A18848J857J718J662J664J324L65p83j553k116k917l624l479k609k074k440
52682A05843l053l030k393j904k086k640k750j954p89k94q17j646k007j876j563
52667G7041j116o60o64j267j727j340m63K4m3j83j69j74j76j8J22p5m78o44m92
52648F7498k74j32m1k8l8J51M79M91j4o68j189j716k048j457K7J046O23l00j71
52629F2239R28J641J447R58M43m96j638k001j325n74n23q17p97l97J67Q82J574
52612F1711J716J023j00r61j180p65MP30J192J507J718J539Q74L13M29Q57P61
52595G1368Q5l93j99L09N79L93k23r95j322q03J78Q47J017J110J353J569J682
52578G6555J821J879J592R95L87q5l57k19L49Q15P37M69O04R71R73O50N72Q40
$$ y = [118848, 120705, 122423, 124085, 125749, 127073, 127438, 126655, 125102, 122986, 120069, 116445, 112966, 110357, 108283, 105843, 102790, 99760, 97367, 95463, 93377, 90737, 87987, 86033, 85244, 84950, 84133, 82487, 80480, 78604, 77041, 75925, 75265, 74601, 73334, 71607, 70267, 69804, 69828, 69785, 69602, 69433, 69259, 69083, 69065, 69187, 69112, 68634, 67990, 67498, 67224, 67092, 67051, 67023, 66985, 67136, 67615, 68106, 68092, 67424, 66235, 64519, 62471, 61014, 61041, 62087, 62710, 62410, 62239, 63167, 64808, 66255, 67213, 67656, 67160, 65522, 63521, 62196, 61622, 61099, 60282, 59485, 59088, 59255, 60137, 61711, 63427, 64450, 64350, 63389, 62209, 61444, 61448, 62178, 63370, 64877, 66595, 68134, 69008, 69321, 69750, 70607, 71368, 71453, 71060, 70861, 71170, 71749, 72142, 71919, 70924, 69602, 68799, 68977, 69824, 70841, 71951, 73304, 74873, 76555, 78376, 80255, 81847, 82842, 83229, 83144, 82787, 82568, 82917, 83732, 84469, 84938, 85542, 86513, 87486, 88136, 88708, 89548]
52560H9548J024J079J350J748J746J308R65R15Q44O84P10Q46O71K68K25O19Q06
52543A05356M14k12p09j065j032o7J727L234L409K360R99Q5k44l23n84j091j398
52526A10859j195q05o97p19m74j53j90l01K03J134J576J297J058J223J176M52
52510A14444m87j092j463j725j469n43L29L89j28m78n14o64j046j219p80J48R97
52493A04699J207P13O2j48P7K92K88K09J03o8j4O10J486J816J369O67P1n50j005
52474A11884o00P85K158K571K269K038J987J626Q28Nn70r20r75n32K28P40P48
52457A24270O60R66J493J549Q52m4l80q0L58O56R61J267J255R60J001J657K259
52440A39660J995R81k6o04p85n22K25J074J486J387J083P38L90K11K79L43K64
$$ y = [89548, 90572, 91651, 93001, 94749, 96495, 97803, 98768, 99683, 100527, 101211, 101921, 102767, 103438, 103706, 103931, 104550, 105356, 105770, 105558, 104849, 103784, 102752, 102685, 104412, 107646, 111055, 113415, 114414, 114499, 114255, 113932, 113348, 112257, 110859, 109664, 108859, 108162, 107443, 106969, 106816, 106626, 106325, 106528, 107662, 109238, 110535, 111593, 112816, 113992, 114444, 113957, 112865, 111402, 109677, 108208, 107665, 107994, 108383, 108255, 107777, 107263, 106599, 105553, 104334, 103554, 103702, 104699, 105906, 106619, 106681, 106533, 106610, 106902, 107190, 107399, 107502, 107434, 107420, 108030, 109516, 111332, 112701, 113368, 113439, 112889, 111884, 111284, 112069, 114227, 116798, 119067, 121105, 123092, 124718, 125546, 125551, 124981, 124061, 123086, 122554, 122782, 123522, 124270, 124930, 125896, 127389, 128938, 129790, 129746, 129366, 129286, 129644, 130300, 131261, 132528, 133783, 134743, 135744, 137401, 139660, 141655, 142636, 142610, 142006, 141221, 140699, 140924, 141998, 143484, 144871, 145954, 146692, 147082, 147293, 147572, 147915, 148179]
52423A48179K50K76j55j009j300n12K83j12j057j027o0L00n93j684j978j670j237
52406A36894p30l48m98q90o71J94P80P50Q31J312J398O59o5J5M51N10L76N02O33
52387A42103L26j44k07J44N06O71N78J58k80j00Q05J769K278K441K307J620O17
52370A55592J77N51Q25L23l01j15O84J314J604J872K070J930J608J445J364J158
52354A72101R98J231J870K676L285L198K254J339J653K943L540K701J714J883
52340B03386K561K361J302M83K58J38N8L80Q83R92Q30J067J688K027J849J494
52324B21757J112O81O48J488K626K866K026J215J275J873K404K905L566M052L903
52309B54397L289K835K961L588M394N083N550N870O111O182O085O153O818Q066
$$ y = [148179, 148429, 148705, 148550, 147541, 146241, 145729, 146012, 145900, 144843, 143816, 143756, 144056, 143463, 141779, 139801, 138131, 136894, 136164, 135816, 135318, 134428, 133757, 133951, 134731, 135481, 136312, 137624, 139022, 139681, 139616, 139631, 140082, 140592, 140968, 141470, 142103, 142429, 142285, 142078, 142222, 142728, 143399, 143977, 144135, 143855, 143755, 144560, 146329, 148607, 151048, 153355, 154975, 155592, 155769, 156320, 157145, 157468, 157167, 157052, 157736, 159050, 160654, 162526, 164596, 166526, 168134, 169579, 170943, 172101, 173099, 174330, 176200, 178876, 182161, 185359, 187613, 188952, 190605, 193548, 197088, 199789, 201503, 203386, 205947, 208308, 209610, 210093, 210351, 210489, 210547, 210927, 211810, 212802, 213632, 214699, 216387, 218414, 220263, 221757, 222869, 223550, 224198, 225686, 228312, 231178, 233204, 234419, 235694, 237567, 239971, 242876, 246442, 250494, 254397, 257686, 260521, 263482, 267070, 271464, 276547, 282097, 287967, 294078, 300260, 306345, 312498, 319316, 327382]
52295C27382R375J0182J0315R990R604R519R998J1166J2734J3790J3357J1642
52283D59054J0288J0667J2214J3267J3349J3453J4079J4377J3701J2748J2344
52272E99541J2192J1697J1182J1176J1256J0644R430Q227P116N894M889M475M106
52259G11825K909J055m05r34r29q98j040j495k193k633k546k494l070l744l507
52244F89901k376j296o52M0J023J891K474L116L930M609N264O497Q349R897J0326
52229G42993R803R042Q570Q634R187R737R683R113Q694Q657Q419P479O153N070
52215H61234M453M098L709K872J204j169l486n020n689n872n915o043o526p613
52201H30237r249j0950j1989j1935j1131j0472j0434j0531j0011q883p884p466
$$ y = [327382, 336757, 346939, 357254, 367244, 376848, 386367, 396365, 407531, 420265, 434055, 447412, 459054, 469342, 480009, 492223, 505490, 518839, 532292, 546371, 560748, 574449, 587197, 599541, 611733, 623430, 634612, 645788, 657044, 667688, 677118, 685345, 692461, 698355, 703244, 707719, 711825, 714734, 715789, 715384, 714450, 713521, 712623, 711583, 710088, 707895, 705262, 702716, 700222, 697152, 693408, 689901, 687525, 686229, 685577, 685617, 686640, 688531, 691005, 694121, 698051, 702660, 707924, 714421, 722770, 732667, 742993, 752796, 761838, 770408, 779042, 788229, 797966, 807649, 816762, 825456, 834113, 842532, 850011, 856164, 861234, 865687, 869785, 873494, 876366, 877570, 876401, 872915, 867895, 862206, 856334, 850419, 844376, 837850, 830237, 820988, 810038, 798049, 786114, 774983, 764511, 754077, 743546, 733535, 724652, 716768, 709302]
52189G09302p268o666n469m048k966k486k306j877j169q85j673l255m646n082
52175F59506m522l460k505k034j995k142k427k869l028k387j370j181k175l165
52161F24246l081k419k207k285j818r55o65j081j326j041q35j068j285j195j196
52146F01789j574k013k249k458k647k462j986j962k689l442l460l014k853l104
52132E65876l261l028k627k383k370k442k398k231k162k265k244j905j663k011
52118E32886k623k678k101j726k012k354k017j113k49L18O40P59Q10J183K048
52103E21771L053L838M549N484O497P192P470P578P754Q189R165J0870J3070J5171
52089F31651J6635J7275J7329J7341J7755J8432J8761J8401J7702J7201J6927
$$ y = [709302, 702034, 695368, 689899, 685851, 682885, 680399, 678093, 676216, 675047, 674162, 672489, 669234, 664588, 659506, 654984, 651524, 649019, 646985, 644990, 642848, 640421, 637552, 634524, 632137, 630767, 629586, 627411, 624246, 621165, 618746, 616539, 614254, 612436, 611481, 610816, 609735, 608409, 607368, 606533, 605465, 604180, 602985, 601789, 600215, 598202, 595953, 593495, 590848, 588386, 586400, 584438, 581749, 578307, 574847, 571833, 568980, 565876, 562615, 559587, 556960, 554577, 552207, 549765, 547367, 545136, 542974, 540709, 538465, 536560, 534897, 532886, 530263, 527585, 525484, 523758, 521746, 519392, 517375, 516262, 516013, 516331, 516971, 517730, 518540, 519723, 521771, 524824, 528662, 533211, 538695, 545192, 552384, 559854, 567432, 575186, 583375, 592540, 603410, 616480, 631651, 648286, 665561, 682890, 700231, 717986, 736418, 755179, 773580, 791282, 808483, 825410]
52078H25410J6342J4982J2957J1013J0062J0426J1316J1358R846P366N046L350
52066I49474J930M62q50j729k393l257m241m835m958n289o365p683q284q067p910
52051H86005q328q775q528p661o647n533m182k986k578k845k850j939n06M26K72
52036H23345m88o73M90K494M070M634M792N188N593N561N371N508N654N106L948
$$ y = [825410, 841752, 856734, 869691, 880704, 890766, 901192, 912508, 923866, 933712, 941078, 946124, 949474, 951404, 951866, 951016, 949287, 946894, 943637, 939396, 934561, 929603, 924314, 917949, 910266, 901982, 893915, 886005, 877677, 868902, 860374, 852713, 846066, 840533, 836351, 833365, 830787, 827942, 825092, 823153, 822647, 823073, 823345, 822857, 822184, 822674, 825168, 829238, 833872, 838664, 843852, 849445, 855006, 860377, 865885, 871539, 876645, 880593]
$$ [...]
##END NTUPLES=NMR SPECTRUM
##END=
