
##TITLE=AC1358_CPIAH12177_6648324_M7kmhNxXWp
##JCAMPDX= 6.0         $$ Bruker NMR JCAMP-DX V2.0
##DATA TYPE= NMR SPECTRUM
##DATA CLASS= NTUPLES
##ORIGIN= BRUKER
##OWNER= Administrator
$$ 1.72 TOPSPIN		Version 2.1
$$ 2012-08-14 10:30:34.531 -0500  Administrator@TOPSPIN
$$ Compression mode = diff/dup
##.OBSERVE FREQUENCY= 400.02188249412
##.OBSERVE NUCLEUS= ^1H
##.ACQUISITION MODE= SIMULTANEOUS (DQD)
##.ACQUISITION SCHEME= undefined
##.AVERAGES= 64
##.DIGITISER RES= 22
##SPECTROMETER/DATA SYSTEM= spect
##.PULSE SEQUENCE= noesygpps1d.comp
##.SOLVENT NAME= COFFEE_meoh
##.SHIFT REFERENCE= INTERNAL, COFFEE_meoh, 1, 14.96261
##AUDIT TRAIL= $$ (NUMBER, WHEN, WHO, WHERE, PROCESS, VERSION, WHAT)
$$ ##TITLE= Audit trail, TOPSPIN		Version 2.1
$$ ##JCAMPDX= 5.01
$$ ##ORIGIN= Bruker BioSpin GmbH
$$ ##OWNER= Administrator
$$ $$ C:\Bruker\TOPSPIN/data/COFFEE/nmr/AC1358_CPIAH12177_6648324_M7kmhNxXWp/12/pdata/1/auditp.txt
$$ ##AUDIT TRAIL=  $$ (NUMBER, WHEN, WHO, WHERE, PROCESS, VERSION, WHAT)
(   1,<2012-08-10 19:01:14.781 -0500>,<Administrator>,<TOPSPIN>,<go>,<TOPSPIN 2.1>,
      <created by zg
	started at 2012-08-10 18:49:44.500 -0500,
	POWCHK enabled, PULCHK disabled,
       configuration hash MD5:
       6B 1B 68 BB D9 2E 58 E2 7F 35 AD 54 07 DF 0E 41
       data hash MD5: 64K
       E2 1C E4 DB 49 C7 31 62 01 60 71 C2 80 56 4A FF>)
(   2,<2012-08-10 19:01:21.734 -0500>,<Administrator>,<TOPSPIN>,<audit>,<TOPSPIN 2.1>,
      <user comment:
       ICON-NMR User ID: COFFEE
       data hash MD5: 64K
       E2 1C E4 DB 49 C7 31 62 01 60 71 C2 80 56 4A FF>)
(   3,<2012-08-14 10:30:29.312 -0500>,<Administrator>,<TOPSPIN>,<proc1d>,<TOPSPIN 2.1>,
      <Start of raw data processing
       efp LB = 0.3 FT_mod = 6 PKNL = 1 PHC0 = 0 PHC1 = 0 SI = 128K 
       data hash MD5: 128K
       D4 A2 5C F9 6A 4B 46 23 52 D5 77 2C 7E A4 00 9E>)
(   4,<2012-08-14 10:30:30.781 -0500>,<Administrator>,<TOPSPIN>,<proc1d>,<TOPSPIN 2.1>,
      <pk PHC0 = 3.306885 PHC1 = 0 
       data hash MD5: 128K
       78 EC 92 AB E3 66 93 70 4C F2 2B 0E 28 11 54 A5>)
(   5,<2012-08-14 10:30:32.062 -0500>,<Administrator>,<TOPSPIN>,<proc1d>,<TOPSPIN 2.1>,
      <abs ABSG = 1 
       data hash MD5: 128K
       37 DD EC B6 1D 40 5A FB 1A 1A 5E 8B 95 5D F8 2B>)
(   6,<2012-08-14 10:30:32.562 -0500>,<Administrator>,<TOPSPIN>,<proc1d>,<TOPSPIN 2.1>,
      <abs ABSG = 2 
       data hash MD5: 128K
       1B 58 44 1F 2B E7 85 F1 75 BA 54 E0 F2 56 22 97>)
(   7,<2012-08-14 10:30:33.031 -0500>,<Administrator>,<TOPSPIN>,<proc1d>,<TOPSPIN 2.1>,
      <abs ABSG = 3 
       data hash MD5: 128K
       F7 ED 2B 22 5D 47 B4 AF 7B 6F 3C 70 C1 D1 CD 4D>)
(   8,<2012-08-14 10:30:33.531 -0500>,<Administrator>,<TOPSPIN>,<proc1d>,<TOPSPIN 2.1>,
      <abs ABSG = 4 
       data hash MD5: 128K
       A7 0F 9A 41 5A 16 F9 70 6A 3D 38 5D 6C FA 6F 74>)
(   9,<2012-08-14 10:30:34.031 -0500>,<Administrator>,<TOPSPIN>,<proc1d>,<TOPSPIN 2.1>,
      <abs ABSG = 5 
       data hash MD5: 128K
$$ [...]
##$TEG= 300
##$TL= (0..7)
0 120 120 120 120 120 120 120
##$TP= (0..7)
150 150 150 150 150 150 150 150
##$TP07= 0
##$TPNAME0= <>
##$TPNAME1= <>
##$TPNAME2= <>
##$TPNAME3= <>
##$TPNAME4= <>
##$TPNAME5= <>
##$TPNAME6= <>
##$TPNAME7= <>
##$TPOAL= (0..7)
0.5 0.5 0.5 0.5 0.5 0.5 0.5 0.5
##$TPOFFS= (0..7)
0 0 0 0 0 0 0 0
##$TUNHIN= 0
##$TUNHOUT= 0
##$TUNXOUT= 0
##$USERA1= <user>
##$USERA2= <user>
##$USERA3= <user>
##$USERA4= <user>
##$USERA5= <user>
##$V9= 5
##$VALIST= <valist>
##$VCLIST= <CCCCCCCCCCCCCCC>
##$VD= 0
##$VDLIST= <DDDDDDDDDDDDDDD>
##$VPLIST= <PPPPPPPPPPPPPPP>
##$VTLIST= <TTTTTTTTTTTTTTT>
##$WBST= 1024
##$WBSW= 4
##$XGAIN= (0..3)
0 0 0 0
##$XL= 0
##$YL= 0
##$YMAX_a= 15335668
##$YMIN_a= -8350929
##$ZGOPTNS= <>
##$ZL1= 120
##$ZL2= 120
##$ZL3= 120
##$ZL4= 120
##$ABSF1= 14.96261
##$ABSF2= -5.595572
##$ABSG= 5
##$ABSL= 3
##$ALPHA= 0
##$AQORDER= 0
##$ASSFAC= 0
##$ASSFACI= 0
##$ASSFACX= 0
##$ASSWID= 0
##$AUNMP= <proc_prof1d_extract.lims>
##$AXLEFT= 0
##$AXNAME= <>
##$AXNUC= <1H>
##$AXRIGHT= 0
##$AXTYPE= 0
##$AXUNIT= <>
##$AZFE= 0.1
##$AZFW= 0.1
##$BCFW= 0
##$BC_mod= 0
##$BYTORDP= 0
##$COROFFS= 0
##$CY= 15
##$DATMOD= 1
##$DC= 0
##$DFILT= <>
##$DTYPP= 0
##$F1P= 0
##$F2P= 0
##$FCOR= 0.5
##$FTSIZE= 131072
##$FT_mod= 6
##$GAMMA= 0
##$GB= 0
##$INTBC= 1
##$INTSCL= 1
##$ISEN= 128
##$LB= 0.3
##$LEV0= 0
##$LPBIN= 0
##$MAXI= 10000
##$MC2= 0
##$MEAN= 0
##$ME_mod= 0
##$MI= 0
##$NCOEF= 0
##$NC_proc= -2
##$NLEV= 6
##$NOISF1= 0
##$NOISF2= 0
##$NSP= 0
##$NTH_PI= 0
##$NZP= 0
##$OFFSET= 14.96261
##$PC= 1
##$PHC0= 3.306885
##$PHC1= 0
##$PH_mod= 1
##$PKNL= yes
##$PPARMOD= 0
##$PPDIAG= 0
##$PPIPTYP= 0
##$PPMPNUM= 2147483647
##$PPRESOL= 1
##$PSCAL= 4
##$PSIGN= 0
##$PYNMP= <proc.py>
##$REVERSE= no
##$SF= 400.020008992161
##$SI= 131072
##$SIGF1= 0
##$SIGF2= 0
##$SINO= 400
##$SIOLD= 131072
##$SPECTYP= <>
##$SREGLST= <1H.CDCl3>
##$SSB= 0
##$STSI= 131072
##$STSR= 0
##$SW_p= 8223.68421052631
##$SYMM= 0
##$S_DEV= 0
##$TDeff= 65536
##$TDoff= 0
##$TI= <>
##$TILT= no
##$TM1= 0
##$TM2= 0
##$TOPLEV= 0
##$USERP1= <user>
##$USERP2= <user>
##$USERP3= <user>
##$USERP4= <user>
##$USERP5= <user>
##$WDW= 1
##$XDIM= 131072
##$YMAX_p= 420435043
##$YMIN_p= -11605
##$CURPLOT= <>
##$CURPRIN= <>
##$DFORMAT= <>
##$LAYOUT= <>
##$LFORMAT= <>
##$PFORMAT= <>
##$SURQMSG= 0
$$ End of Bruker specific parameters
$$ ---------------------------------
##NTUPLES= NMR SPECTRUM
##VAR_NAME=  FREQUENCY,     SPECTRUM/REAL,   SPECTRUM/IMAG
##SYMBOL=    X,             R,               I
##VAR_TYPE=  INDEPENDENT,   DEPENDENT,       DEPENDENT
##VAR_FORM=  AFFN,          ASDF,            ASDF
##VAR_DIM=   131072,        131072,          131072
##UNITS=     HZ,            ARBITRARY UNITS, ARBITRARY UNITS
##FACTOR=    0.0627417313425164, 1,          1
##FIRST=     8223.62146879497, 267,          -54425
##LAST=      0,             2722,            -54762
##MIN=       0,             -11605,          0
##MAX=       8223.62146879497, 420435043,    0
$$ Real data points
##PAGE= N=1
##DATA TABLE= (X++(R..R)), XYDATA
$$ [...]
63271B82905J577J861K387K690K225J307P93Q80R92Q64R08J291J538J327R96Q44
63255C05385O48K50R5O74J814K923L608L839L779L715L851M158M629N528O861
63240C51757P898P992P721Q299R839J1267J2076J2991J4585J6313J7541J8495
63228D96774J9506K0275K0566K0830K1296K1308K0319J8861J7678J6722J5804
63217G09939J5485J6240J7386J7992J8166J8416J8276J6929J4725J2638J0437
63206H86629O920J966l118p497j1704j6146k0120k2928k4949k6769k8042k8054
63194G06188k6859k5099k3058k0602j7772j4822j1852q857o006l482j094J516
63182E48201M337O917Q855J0216J1395J2625J3675J4137J4068J4152J4982J6331
$$ plain form
63271 282905 284482 286343 288730 291420 293645 294952 295745 296625 297617 298481 299389 300680 302218 303545 304541 305385
63255 305385 306033 306283 306378 307052 308866 311789 315397 319236 323015 326730 330581 334739 339368 344896 351757
63240 351757 359655 367647 375368 383667 393506 404773 416849 429840 444425 460738 478279 496774
63228 496774 516280 536555 557121 577951 599247 620555 640874 659735 677413 694135 709939
63217 709939 725424 741664 759050 777042 795208 813624 831900 848829 863554 876192 886629
63206 886629 893549 895515 892397 884900 873196 857050 836930 814002 789053 762284 734242 706188
63194 706188 679329 654230 631172 610570 592798 577976 566124 557267 551261 547779 546685 548201
63182 548201 552538 559455 568310 578526 589921 602546 616221 630358 644426 658578 673560 689891
63170F89891J7452J7964J7999J7619J6640J5212J3953J3175J2359J0792Q406N603
63158H57065K517j068n064q901j2188j5122j7979k0413k1750k1924k1635k1415
63146F92123k0967j9812j8223j6964j6235j5503j4361j2949j1414r608p616o046
63134E22425n242m708l803k663j916j682j473r22j85M01O36N44M55Q77J947L085
63118E07776L573L408L193L305L579L804M091M616N257N620N385M622L854L656
63104E65739M150M974N776O396O557N922M724L781L469L101J884M4j525k344k468
63089F10180j929r51l52q15j729j737n86N06N58N8K1N72J131J452J792K295K899
63072F13365L759N129O755P825P866P427P523Q497R738J0630J1420J2778J4731
$$ plain form
63170 689891 707343 725307 743306 760925 777565 792777 806730 819905 832264 843056 851462 857065
63158 857065 859582 858514 853450 844549 832361 817239 799260 778847 757097 735173 713538 692123
63146 692123 671156 651344 633121 616157 599922 584419 570058 557109 545695 536087 528471 522425
63134 522425 517183 512475 508672 506009 504093 502411 500938 500016 499831 500232 500868 501412 501867 502744 504691 507776
63118 507776 511349 514757 517950 521255 524834 528638 532729 537345 542602 548222 553607 558229 562083 565739
63104 565739 569889 574863 580639 587035 593592 599514 604238 608019 611488 614589 616473 616517 614992 612648 610180
63089 610180 608251 607300 606948 606133 604404 602667 602081 602587 603145 603203 603224 603796 604927 606379 608171 610466 613365
63072 613365 617124 622253 629008 636833 644699 652126 659649 668146 677884 688514 699934 712712 727443
63059G27443J6559J7831J8962K0513K2430K4362K6315K8502L0861L3184L5439
63048A002401L7514L8944L9477L9707M0462M1635M2268M1810M0766L9948L9579
63037A444511L9262L8509L7270L6221L6296L7578L8873L8943L7937L6905L5989
63026A858294L3954K9620K3016J4888N786l943j3824k3427l2534m0894m8032n3592
63014A749312n7446n9441n9396n7591n4781n1420m7298m2179l6428l0662k5112
63003A227558j9696j4416r340m435K28M375P976J1539J5471J9361K2347K4166
62991A285134K5336K6244K6615K6201K5525K5363K5566K5104K3468K1412J9743
62980A555711J7862J4380R093L269k177p822j4484k1716k8444l4381l9861m4704
$$ plain form
63059 727443 744002 761833 780795 801308 823738 848100 874415 902917 933778 966962 1002401
63048 1002401 1039915 1078859 1118336 1158043 1198505 1240140 1282408 1324218 1364984 1404932 1444511
63037 1444511 1483773 1522282 1559552 1595773 1632069 1669647 1708520 1747463 1785400 1822305 1858294
63026 1858294 1892248 1921868 1944884 1959772 1965558 1961615 1947791 1924364 1891830 1850936 1802904 1749312
63014 1749312 1691866 1632425 1573029 1515438 1460657 1409237 1361939 1319760 1283332 1252670 1227558
63003 1227558 1207862 1193446 1184106 1179671 1179899 1184274 1192250 1203789 1219260 1238621 1260968 1285134
62991 1285134 1310470 1336714 1363329 1389530 1415055 1440418 1465984 1491088 1514556 1535968 1555711
62980 1555711 1573573 1587953 1597046 1600315 1598138 1590316 1575832 1554116 1525672 1491291 1451430 1406726
62968A406726m8351n0800n2410n2864n1512m8743m5889m3599m1311l8532l5543
62957H97172l2488k8924k4861k1280j8814j6788j4379j1962j0391r543q618p461
62945F91663o576o025n301m307l578l467l781m335n222o309p093p218o798o096
62931F15557n314m804m935n513n765n224m314l742l574l303k713k223k292k787
62917E59054l163l126k826k430j846j049m66o86j725k885l431l176k424j554q58
62902E27409m54j91K34Q12J074O44j43n43l21o5m45j457k555l395m070m661m898
62885E06975m523l802l377l607m201m542m224l260k014r63l25M5K83J48o19j600
62869D70394j861j038J40P17N50K62M43J192K080K390J648K66p71j064j162j474
$$ plain form
62968 1406726 1358375 1307575 1255165 1202301 1150789 1102046 1056157 1012558 971247 932715 897172
62957 897172 864684 835760 810899 789619 770805 754017 739638 727676 717285 707742 699124 691663
62945 691663 685087 679062 673761 669454 665876 662409 658628 654293 649071 642762 635669 628451 621653 615557
62931 615557 610243 605439 600504 594991 589226 584002 579688 575946 572372 569069 566356 564133 561841 559054
62917 559054 555891 552765 549939 547509 545663 544614 544148 543462 541737 538852 535421 532245 529821 528267 527409
62902 527409 526955 526764 526998 527810 528884 529528 529385 528842 528521 528456 528011 526554 523999 520604 516534 511873 506975
62885 506975 502452 498650 495273 491666 487465 482923 478699 475439 473425 472462 472137 472182 472465 472613 471994 470394
62869 470394 468533 467495 467635 468352 468902 469164 469607 470799 472879 475269 476917 477183 476412 475348 474186 472712
62853D72712j534r86n74j198k364k733j990j164r86j009o22K6M97P79J000J030
62837D60884P76M49K08o9l16p1Q89J978K326J727Q35M38O52Q77N81L7r5Q2l48
62818D71840j608k459j833n57l07j143j504o32L43J74q70j664j594p25N53J566
62802D59580J800J726K396L811M697M449M206N183O863P921Q183Q540R431J0510
62788E39296J1571J2783J4054J5048J5858J6921J8367J9975K1787K4242K7701
62777G37603L2171L7291M2332M6590N0259N4451N9827O5507P0039P3026P5065
62766A344161P6308P6025P3479O8589O1619N2857M2779L1937K0523Q371m535j7780
62754A834333l0690m2491n2480o0411o6563p1189p4049p4835p3801p1542o8415
$$ plain form
62853 472712 471178 470192 469618 468420 466056 463323 461333 460169 459183 458174 457552 457578 458075 458854 459854 460884
62837 460884 461660 462109 462317 462248 461932 461861 462750 464728 467054 468781 469616 470054 470706 471583 472164 472201 472106 472188 471840
62818 471840 470232 467773 465940 465383 465076 463933 462429 461797 462140 462314 461444 459780 458186 457461 458014 459580
62802 459580 461380 463106 465502 469313 474010 478459 482665 487848 494711 502632 510815 519355 528786 539296
62788 539296 550867 563650 577704 592752 608610 625531 643898 663873 685660 709902 737603
62777 737603 769774 807065 849397 895987 946246 1000697 1060524 1126031 1196070 1269096 1344161
62766 1344161 1420469 1496494 1569973 1638562 1700181 1753038 1795817 1827754 1848277 1856648 1852113 1834333
62754 1834333 1803643 1761152 1708672 1648261 1581698 1510509 1436460 1361625 1287824 1216282 1147867
62743A147867o4695o0930n7530n4109m9936m5111m0659l7338l4771l2022k8643
62732F42123k5028k1877j9459j7433j5350j3361j2111j1788j1707j1087r910q681
62720D64331p632o623n598m634l738k922k349k031j621q19K71J529L102M913O258
62705D42437O685O936Q247J0757J3306J4897J5780J6944J9049K2017K5348K8560
62693F30963L1549L4517L7557M0520M3409M6476M9551N1712N2142N1062M9226
62682A118684M6688M2802L7267L0487K2808J4145M548n381j4992k4059l2506l9835
62670A200656m5252m8388m9731n0241n0399m9824m8065m5571m3345m1673l9840
62659F88327l7309l4403l1454k8197k4608k1577j9897j9038j7859j6139j4456
$$ plain form
62743 1147867 1083172 1022242 964712 910603 860667 815556 774897 737559 702788 670766 642123
62732 642123 617095 595218 575759 558326 542976 529615 517504 505716 494009 482922 473012 464331
62720 464331 456699 450076 444478 439844 436106 433184 430835 428804 427183 426364 426635 428164 431266 436179 442437
62705 442437 449122 456058 464305 475062 488368 503265 519045 535989 555038 577055 602403 630963
62693 630963 662512 697029 734586 775106 818515 864991 914542 966254 1018396 1069458 1118684
62682 1118684 1165372 1208174 1245441 1275928 1298736 1312881 1317429 1312048 1297056 1272997 1240491 1200656
62670 1200656 1155404 1107016 1057285 1007044 956645 906821 858756 813185 769840 728167 688327
62659 688327 651018 616615 585161 556964 532356 510779 490882 471844 453985 437846 423390
62648D23390j2985j1434r929q928q263p358o377o158o831p453p271o582n939n398
62634C12484m863m562m644m764m465l723k889k357k298k476k347j730j174j218
62620B68974j507j291n95j15jL42J137J775J720J208P50N94R09J827K992L670
62604B82389L609L401L718M665N981P320Q283Q783R538J1473J4441J7268J9259
62591D00128K0963K3099K5617K8213L0997L4005L6701L8560L9721M0472M0572
62580G59048L9504L7056L3157K7653K0763J3362O271m34o982j3183j8637k3243
62568H74335k7018k9725l1262l2051l2504l2399l1314k9482k7536k5709k3817
62557E51518k1931k0394j9172j7789j5996j4091j2489j1333j0607j0294j0241
$$ plain form
62648 423390 410405 398971 389042 380114 371851 364493 358116 351958 345127 337674 330403 323821 317882 312484
62634 312484 307621 303059 298415 293651 289186 285463 282574 280217 277919 275443 273096 271366 270192 268974
62620 268974 267467 266176 265581 265466 265465 265807 266944 268719 270439 271647 272397 272991 273900 275727 278719 282389
62604 282389 285998 289399 293117 297782 303763 311083 319366 328149 337687 349160 363601 380869 400128
62591 400128 421091 444190 469807 498020 529017 563022 599723 638283 678004 718476 759048
62580 759048 798552 835608 868765 896418 917181 930543 936814 936380 929398 916215 897578 874335
62568 874335 847317 817592 786330 754279 721775 689376 658062 628580 601044 575335 551518
62557 551518 529587 509193 490021 472232 456236 442145 429656 418323 407716 397422 387181
62546C87181j0141r779r229q757q584q630q475p700o375n009l979l210k557k157
62532B92599k111k063j502m03P65J598K123K563K960L163L102L017L326M171N244
62517C18552O164O922P759Q749R792J0939J2375J4097J5988J8145K0696K3316
62505D73494K5415K6888K8186K9551L0591L0765K9762K7369K3532J8814J4156
62494G58523R893N467M54m727r445j3652j7522k0844k3329k5095k6304k6680k5954
62481E80785k4471k2754k0809j8463j6093j4280j2873j1135q831o568m979m083
62469D15446l539l056k412j489m24M80J051J306J316J308J657K467L308L826M365
62454D25610N419O614P064O755O738P617Q614Q644P761O884O440O037N296M244
$$ plain form
62546 387181 377040 367261 358032 349275 340691 332061 323586 315886 309511 304502 300523 297313 294756 292599
62532 292599 290488 288425 286923 286520 287285 288883 291006 293569 296529 299692 302794 305811 309137 313308 318552
62517 318552 324716 331638 339397 348146 357938 368877 381252 395349 411337 429482 450178 473494
62505 473494 498909 525797 553983 583534 614125 644890 674652 702021 725553 744367 758523
62494 758523 768416 773883 774337 769610 760165 746513 728991 708147 684818 659723 633419 606739 580785
62481 580785 556314 533560 512751 494288 478195 463915 451042 439907 431076 424508 419529 415446
62469 415446 411907 408851 406439 404950 404526 405006 406057 407363 408679 409987 411644 414111 417419 421245 425610
62454 425610 431029 437643 444707 451462 458200 465817 474431 483075 490836 497720 504160 510197 515493 519737
62440E19737K827O97k234n383q042j0073j1763j3173j4042j4269j4129j3906j3509
62427D02738j2650j1304r839q678p966p505o896n733l817j395P90J914J785J219
62413C32663J416K816M677N930O324O464O934P667Q205Q220P782P293P180P382
62399D20953P275O446N331M566L918K587N95j090k005k826m055n087n379n586
62385D25643o481p370o840m813k746j731j439r52J82J848L597M944N941P384R844
62370D27011J2826J5560J8209K1303K4470K7056K9670L3519L8176M1760M3732
62359G33292M5737M8838N1578N2026N0389M8146M5464M1156L4746K7126J9230
62348A197728J1252L210m603j1939j8601k4172k8294l1233l3673l5907l7684l8723
$$ plain form
62440 519737 522564 523261 521027 515644 507602 497529 485766 472593 458551 444282 430153 416247 402738
62427 402738 390088 378784 368945 360267 352301 344796 337900 332167 328350 326955 327745 329659 331444 332663
62413 332663 334079 336895 341572 347502 353826 360290 367224 374891 383096 391316 399098 406391 413571 420953
62399 420953 428228 434674 440005 444571 448489 451076 451671 450581 448576 445750 441695 436608 431229 425643
62385 425643 419162 411792 404952 400139 397393 395662 394223 393271 393453 395301 398898 403842 409783 417167 427011
62370 427011 439837 455397 473606 494909 519379 546435 576105 609624 647800 689560 733292
62359 733292 779029 827867 879445 931471 981860 1030006 1075470 1116626 1151372 1178498 1197728
62348 1197728 1208980 1212190 1207587 1195648 1177047 1152875 1124581 1093348 1059675 1023768 986084 947361
62336I47361l8977l8447l7138l5123l2437k9101k5497k2461k0620j9790j9264
62325F28506j8445j7092j5313j3576j2285j1159r547p521o030n601n545m923l650
62312D97819k201r04r6k55j253k127k259k231k715l319l453l574m407n449n595
62297D57981m907m446m472m242l543l042k828j991j56J762K902L614M570N572
62283D46774O053O151O475P145P736P939P807P469P102P001P397Q189R093R920
62269E52251J0654J1390J2349J3700J5368J7235J9450K2239K5418K8631L2023
62258G60708L6112M0747M4825M7429M8693M9049M8073M4848L9365L2756K5969
62247A218574J8794J0629J737o790j4215k0673k6397l1063l4315l6580l8677m0669
$$ plain form
62336 947361 908384 869937 832799 797676 765239 736138 710641 688180 667560 647770 628506
62325 628506 610061 592969 577656 564080 551795 540636 531089 523568 517538 511937 506392 501469 497819
62312 497819 495618 494714 494618 494363 493110 490983 488724 486493 483778 480459 477006 473432 469025 463576 457981
62297 457981 453074 448628 444156 439914 436371 433329 430501 428510 428354 430116 433018 436632 441202 446774
62283 446774 452827 458978 465453 472598 480334 488273 496080 503549 510651 517652 525049 533238 542331 552251
62269 552251 562905 574295 586644 600344 615712 632947 652397 674636 700054 728685 760708
62258 760708 796820 837567 882392 929821 978514 1027563 1075636 1120484 1159849 1192605 1218574
62247 1218574 1237368 1247997 1249734 1242944 1228729 1208056 1181659 1150596 1116281 1079701 1041024 1000355
62235A000355m1706m1147l9322l6954l4293l1166k7534k3683j9941j6542j3585
62224F74482j0975q565o471m993m144l600l251l292l589l511k798k111k097k361
62210F12724j981q60J69N04M35N32R19J326J640K208L545N676P813R051R452J0087
62194F63240J1754J4142J6497J8574K0452K1989K3047K3928K4990K5988K6289
62183H90890K5520K3550K0304J6156J2143R131O968N037L382K643L103M553O872
62170A030252J0075J3859J7793K1889K6245L0309L3146L4456L4561L3498L0915
62159A316998K6880K2092J7057J1792O522J950j475m159o879j0022j3361j6296
62147A351099j8221j9022j9216j9315j9099j7976j5872j3332j0836q544o602n145
$$ plain form
62235 1000355 958649 917502 878180 841226 806933 775767 748233 724550 704609 688067 674482
62224 674482 663507 654942 648471 643478 639334 635734 632483 629191 625602 622091 619293 617182 615085 612724
62210 612724 610743 609883 610052 610556 610991 611523 612442 613768 615408 617616 621161 626837 634650 643701 653153 663240
62194 663240 674994 689136 705633 724207 744659 766648 789695 813623 838613 864601 890890
62183 890890 916410 939960 960264 976420 988563 997694 1004662 1009699 1013081 1015724 1018827 1023380 1030252
62170 1030252 1040327 1054186 1071979 1093868 1120113 1150422 1183568 1218024 1252585 1286083 1316998
62159 1316998 1343878 1365970 1383027 1394819 1401341 1403291 1401816 1397657 1390778 1380756 1367395 1351099
62147 1351099 1332878 1313856 1294640 1275325 1256226 1238250 1222378 1209046 1198210 1189666 1183064 1177919
62135A177919l994k869j858j204o80J93J377K383L107M003N363P009Q751J0602
62121A210102J2436J3930J4957J5731J6491J7432J8796K0557K2158K3032K3263
62110A408885K3359K3605K4155K5363K7230K8873K9375K9024K8871K9293K9876
62099A707909L0524L1638L3146L4454L5477L6784L8630M0765M3213M6176M9052
62088B127768N0716N1044N1047N1157N0564M8804M6865M6083M6781M8531N0824
62077B670184N2831N3411N2084M9339M5555M0554L4869L0382K8740K9756L2203
62066C119908L5477L9484M3527M6457M7791M7907M7298M6232M4861M3045M0344
62055C602331L6670L2627K8781K5052K1282J7841J5033J2351R077N252J469j914
$$ plain form
62135 1177919 1173925 1171056 1169198 1167994 1167314 1167507 1168884 1171267 1174374 1178377 1183740 1190749 1199500 1210102
62121 1210102 1222538 1236468 1251425 1267156 1283647 1301079 1319875 1340432 1362590 1385622 1408885
62110 1408885 1432244 1455849 1480004 1505367 1532597 1561470 1590845 1619869 1648740 1678033 1707909
62099 1707909 1738433 1770071 1803217 1837671 1873148 1909932 1948562 1989327 2032540 2078716 2127768
62088 2127768 2178484 2229528 2280575 2331732 2382296 2431100 2477965 2524048 2570829 2619360 2670184
62077 2670184 2723015 2776426 2828510 2877849 2923404 2963958 2998827 3029209 3057949 3087705 3119908
62066 3119908 3155385 3194869 3238396 3284853 3332644 3380551 3427849 3474081 3518942 3561987 3602331
62055 3602331 3639001 3671628 3700409 3725461 3746743 3764584 3779617 3791968 3801045 3806297 3807766 3805852
62043C805852m751o694p543p795q176q828r464r960j0322j0419j0353j0710j1818
62030C689019j3101j3840j4135j4504j4853j4775j4488j4571j4851j4447j3042
62019C532412j1304r959r062q344p597o581n012k947q74Q04K166L661N648Q060
62005C491071J0353J2037J3318J4871J6815J8384J8953J8829J8518J7685J5577
61994C666411J2118P840K955k758r208j5847k2256k8248l3458l7436m0200m2095
61982C457818m3142m3124m2372m1819m2006m2542m2680m2124m1152m0276l9805
61971B996776l9455l8479l6590l4570l3390l2872l1927l0171k8446k7507k6960
61960B636409k6025k4668k3413k2372k1248k0118j9437j9158j8433j6583j4055
$$ plain form
62043 3805852 3801101 3794407 3786864 3779069 3770893 3762065 3752601 3742641 3732319 3721900 3711547 3700837 3689019
62030 3689019 3675918 3662078 3647943 3633439 3618586 3603811 3589323 3574752 3559901 3545454 3532412
62019 3532412 3521108 3511149 3502087 3493743 3486146 3479565 3474553 3471606 3470732 3471536 3473702 3477363 3483011 3491071
62005 3491071 3501424 3513461 3526779 3541650 3558465 3576849 3595802 3614631 3633149 3650834 3666411
61994 3666411 3678529 3686369 3689324 3686566 3677358 3661511 3639255 3611007 3577549 3540113 3499913 3457818
61982 3457818 3414676 3371552 3329180 3287361 3245355 3202813 3160133 3118009 3076857 3036581 2996776
61971 2996776 2957321 2918842 2882252 2847682 2814292 2781420 2749493 2719322 2690876 2663369 2636409
61960 2636409 2610384 2585716 2562303 2539931 2518683 2498565 2479128 2459970 2441537 2424954 2410899
61949B410899j2038j1167j0896j0230q778o991n447m242l090j796m87N58J245
61936B337540J872K978M813O959Q687R772J0788J2467J4944J7788K0588K3332
61924B472528K6267K9609L3498L8137M3838N0831N9089O8510P9341R2091J06983
61913C100722J23827J42767J64785J90969K21601K56469K95899L40811L91827
61904E229677M48911N11692N79248O49229P17396P77823Q22858Q43261Q29739
61895A1409834P75332O76542N33398L50767J40565p8783k87246m68754o13466
61886A2438189p17110p80038q06437q02838p76404p34111o82322o25967n68193
61877E944769n11176m56909m06755l60990l19537k82757k50835k22973j98060
$$ plain form
61949 2410899 2398861 2387694 2376798 2366568 2357790 2350799 2345352 2341110 2338020 2336224 2335737 2336295 2337540
61936 2337540 2339412 2342390 2347203 2354162 2362849 2372621 2383409 2395876 2410820 2428608 2449196 2472528
61924 2472528 2498795 2528404 2561902 2600039 2643877 2694708 2753797 2822307 2901648 2993739 3100722
61913 3100722 3224549 3367316 3532101 3723070 3944671 4201140 4497039 4837850 5229677
61904 5229677 5678588 6190280 6769528 7418757 8136153 8913976 9736834 10580095 11409834
61895 11409834 12185166 12861708 13395106 13745873 13886438 13807655 13520409 13051655 12438189
61886 12438189 11721079 10941041 10134604 9331766 8555362 7821251 7138929 6512962 5944769
61877 5944769 5433593 4976684 4569929 4208939 3889402 3606645 3355810 3132837 2934777
61868B934777j75821j56473j39697j24798j11573j00106q9895q0143p0818o2504
61858A822949n5229m8325m1522l5401l0517k6737k3534k0415j6996j3194r495
61847A501584o601m756l728l302l318l443l418l422l656l811l530l127l067k939
61833A449466j837J95K028K905L218L628M182M645N056N458N566N106M205L149
61819A496970K035R80L75O71J941L806N717P398R038J1097J3730J6695J9867K3532
61805A613852K7868L2506L6976M1313M5704N0052N4383N9406O5815P3188Q0337
61794B181400Q6764R3142J00387J08915J18865J30385J43504J58253J74973J94172
61784C490760K16093K40895K69234L02102L40248L84342M35607M95552N65015
$$ plain form
61868 2934777 2758956 2602483 2462786 2337988 2226415 2126309 2036414 1956271 1885453 1822949
61858 1822949 1767720 1719395 1677873 1642472 1611955 1585218 1561684 1541269 1524273 1511079 1501584
61847 1501584 1494983 1490227 1486499 1483197 1479879 1476436 1473018 1469596 1465940 1462129 1458599 1455472 1452405 1449466
61833 1449466 1447629 1447824 1449852 1452757 1455975 1459603 1463785 1468430 1473486 1478944 1484510 1489616 1493821 1496970
61819 1496970 1499005 1499985 1500360 1501031 1502972 1506778 1512495 1519893 1528931 1540028 1553758 1570453 1590320 1613852
61805 1613852 1641720 1674226 1711202 1752515 1798219 1848271 1902654 1962060 2027875 2101063 2181400
61794 2181400 2268164 2361306 2461693 2570608 2689473 2819858 2963362 3121615 3296588 3490760
61784 3490760 3706853 3947748 4216982 4519084 4859332 5243674 5679281 6174833 6739848
61775F739848O44190P33551Q33934R45137J064689J187635J306419J410399J486067
61766A6351869J518381J492352J394738J216967R59100O32427K58909j31963n07784
61757B3184996q38946j104320j294231j409313j457074j448899j398110j318130
61749A2915973j220641j114665j006849r02146q04028p14273o33027n59693m94076
61740E466575m36523l86898l43839l05580k71292k41118k15045j92369j72302
61731B901609j54503j38752j24591j11577r9632q8959p9699p1758o4905n9026
61721A908207n4296n0881m8324m5662m2476l9405l7216l5705l4079l2057k9962
61710A458144k7938k5810k3638k1743k0267j9209j8715j8757j8771j8325j7900
$$ plain form
61775 6739848 7384038 8117589 8951523 9896660 10961349 12148984 13455403 14865802 16351869
61766 16351869 17870250 19362602 20757340 21974307 22933407 23565834 23824743 23692780 23184996
61757 23184996 22346050 21241730 19947499 18538186 17081112 15632213 14234103 12915973
61749 12915973 11695332 10580667 9573818 8671672 7867644 7153371 6520344 5960651 5466575
61740 5466575 5030052 4643154 4299315 3993735 3722443 3481325 3266280 3073911 2901609
61731 2901609 2747106 2608354 2483763 2372186 2272554 2183595 2103896 2032138 1967233 1908207
61721 1908207 1853911 1803030 1754706 1709044 1666568 1627163 1589947 1554242 1520163 1488106 1458144
61710 1458144 1430206 1404396 1380758 1359015 1338748 1319539 1300824 1282067 1263296 1244971 1227071
61699A227071j8171j8806j8834j8164j7576j7289j6617j5320j4205j3924j4044
61688A044121j3811j3064j2038j0976j0316j0488j1022j0657q875o698n379m919
61676I25878m590m230m209m397m184l479l005l306l905l857l017k419l139m868
61662H73273o095n931n191n162n833o139n670n085m836m509l738k896k495k475
61648H07218k476k284j845j253q97j044j263q84J4P67J249J969K948L541L616
61633H09376L875M693N573O153O808P700Q333Q503Q733R025Q326O132L694K506
61619H99430K220J239j056l662n302n576n016m655n336o800p784p595p085p434
61605H35588q514r336r583r688r714r228q299p590p309o925o047m965m082l364
$$ plain form
61699 1227071 1208900 1190094 1171260 1153096 1135520 1118231 1101614 1086294 1072089 1058165 1044121
61688 1044121 1030310 1017246 1005208 994232 983916 973428 962406 951749 942874 936176 930797 925878
61676 925878 921288 917058 912849 908452 904268 900789 897784 894478 890573 886716 883699 881280 878141 873273
61662 873273 867178 861247 856056 850894 845061 838922 833252 828167 823331 818822 815084 812188 809693 807218
61648 807218 804742 802458 800613 799360 798463 797419 796156 795272 795286 796053 797302 799271 802219 805760 809376
61633 809376 813251 817944 823517 829670 836478 844178 852511 861014 869747 878772 887098 893230 896924 899430
61619 899430 901650 902889 901833 898171 892869 887293 882277 877622 872286 865486 857702 850107 843022 835588
61605 835588 827074 817738 808155 798467 788753 779525 771226 763636 756327 749402 743355 738390 734308 730944
61591G30944k580j696q12O0J056K393M118N826O939P424P939Q973J0316J1627
61577G92527J3079J4939J6964J8751K0346K1997K3731K5609K7998L0802L2902
61566A039645L3254L2328L1629L1849L2283L2041L0992K9441K7638K5861K4438
61555A371399K3377K2381K1302K0253J9182J7821J6121J4290J2281R691O334K567
61543A556999j126m607p942j1130j4108j6838j9142k0629k0981k0334j9257j8270
61531A382635j7385j6191j4431j2338j0219p915n077j886J008L475O260J0106
61519A318042J4846J9790K4597K9476L4761M0792M7991N6563O6110P5913Q5730
61508A814611R6233J08522J23186J39826J57644J76540J97168K19553K42035K62242
$$ plain form
61591 730944 728364 726668 725856 725916 726972 729365 733483 739309 746248 753672 761611 770584 780900 792527
61577 792527 805606 820545 837509 856260 876606 898603 922334 947943 975941 1006743 1039645
61566 1039645 1072899 1105227 1136856 1168705 1200988 1233029 1264021 1293462 1321100 1346961 1371399
61555 1371399 1394776 1417157 1438459 1458712 1477894 1495715 1511836 1526126 1538407 1548098 1554432 1556999
61543 1556999 1555873 1551266 1543324 1532194 1518086 1501248 1482106 1461477 1440496 1420162 1400905 1382635
61531 1382635 1365250 1349059 1334628 1322290 1312071 1304156 1299079 1297193 1298201 1301676 1307936 1318042
61519 1318042 1332888 1352678 1377275 1406751 1441512 1482304 1530295 1586858 1652968 1728881 1814611
61508 1814611 1910844 2019366 2142552 2282378 2440022 2616562 2813730 3033283 3275318 3537560
61498C537560K78786K90972K96986K93643K78430K50987K12396J64168J08796
61489E712724N0280p050o0060j06729j45343j74740j94990k06998k11600k09627
61479D445867k02443j91616j78237j63084j47095j31054j14986r8624q2219o6404
61469C070105n1468l7427k4528j3038k624P405J7210K6179L3547L9034M3068M6558
61457C154021N0032N2849N3774N2621N0646M8952M7350M5360M3495M2619M2755
61446C684474M3426M4643M6613M8987N1274N3515N5561N6358N5090N2552N0106
61435D242599M7618M3776L8115L1353K3869J5398O280k496j0808j9559k8850l7238
61423D350057m3388m7396m9952n1229n1224n0257m8461m5422m1016l5942l0886
$$ plain form
61498 3537560 3816346 4107318 4404304 4697947 4976377 5227364 5439760 5603928 5712724
61489 5712724 5763004 5755954 5695894 5589165 5443822 5269082 5074092 4867094 4655494 4445867
61479 4445867 4243424 4051808 3873571 3710487 3563392 3432338 3317352 3218728 3136509 3070105
61469 3070105 3018637 2981210 2956682 2943644 2941020 2948425 2965635 2991814 3025361 3064395 3107463 3154021
61457 3154021 3204053 3256902 3310676 3363297 3413943 3462895 3510245 3555605 3599100 3641719 3684474
61446 3684474 3727900 3772543 3819156 3868143 3919417 3972932 4028493 4084851 4139941 4192493 4242599
61435 4242599 4290217 4333993 4372108 4403461 4427330 4442728 4449008 4446512 4435704 4416145 4387295 4350057
61423 4350057 4306669 4259273 4209321 4158092 4106868 4056611 4008150 3962728 3921712 3885770 3854884
61412C854884k5760k0262j4619r268m356n2L057M430M075K231j032n489j0454
61399C777385j5233j9576k3322k5875k6471k4790k1026j5397p817K005J4135K8117
61387C642135M3309N9693P8029R8836J21530J45144J69565J95249K21843K47922
61377E023255K72057K93248L10051L20122L21097L11484K90606K58314K15322
61368G615556J63551J06007M6417j1334o4315j11327j52367j87422k16366k39627
61358F948773k57978k71532k79836k82964k81677k76428k67313k55199k41730
61349D534116k27736k12743j96616j80555j65650j51348j36415j20757j05359
61340C036937r0866p7212o4237n1822l9577k7265j5401m760M628J3358K1674K9284
$$ plain form
61412 3854884 3829124 3808862 3794243 3784975 3780619 3780567 3783624 3788054 3792129 3794360 3793328 3787839 3777385
61399 3777385 3762152 3742576 3719254 3693379 3666908 3642118 3621092 3605695 3597878 3599883 3614018 3642135
61387 3642135 3685444 3745137 3823166 3922002 4043532 4188676 4358241 4553490 4775333 5023255
61377 5023255 5295312 5588560 5898611 6218733 6539830 6851314 7141920 7400234 7615556
61368 7615556 7779107 7885114 7931531 7920197 7855882 7744555 7592188 7404766 7188400 6948773
61358 6948773 6690795 6419263 6139427 5856463 5574786 5298358 5031045 4775846 4534116
61349 4534116 4306380 4093637 3897021 3716466 3550816 3399468 3263053 3142296 3036937
61340 3036937 2946071 2868859 2804622 2752800 2713223 2685958 2670557 2665797 2670425 2683783 2705457 2734741
61328B734741L6046M2202M7803N2377N5324N6349N5581N3578N1150M8810M6384
61317C280345M3390L9750L5863L2120K8731K5917K3895K2553K1420K0096J8464
61306C592544J6389J3399Q943L001l768j0660j7573k4830l2349l9360m5153m9779
61294C410804n3774n7412o0530o2800o3874o3466o1710n9215n6379n2840m8129
61283B770675m2520l6717l0929k4991j9182j4165j0118o728m094k806k974l943
61271B571508n212o968r446j2300j4852j6462j6646j5377j3396j1433r117n455
61259B434844m68M633R238J4296K1017K9503L9320N0532O3369P7460R2154J07120
61247B943018J21894J35310J45950J52801J54882J50699J38782J18623R0714N6211
$$ plain form
61328 2734741 2770787 2812989 2860792 2913169 2968493 3024842 3080423 3134001 3185151 3233961 3280345
61317 3280345 3323735 3363485 3399348 3431468 3460199 3486116 3510011 3532564 3553984 3574080 3592544
61306 3592544 3608933 3622332 3631275 3634276 3630508 3619848 3602275 3577445 3545096 3505736 3460583 3410804
61294 3410804 3357030 3299618 3239088 3176288 3112414 3048948 2987238 2928023 2871644 2818804 2770675
61283 2770675 2728155 2691438 2660509 2635518 2616336 2602171 2592053 2585325 2581231 2578425 2575451 2571508
61271 2571508 2566296 2559328 2549882 2537582 2522730 2506268 2489622 2474245 2460849 2449416 2440299 2434844
61259 2434844 2434376 2439009 2448247 2462543 2483560 2513063 2552383 2602915 2666284 2743744 2835898 2943018
61247 2943018 3064912 3200222 3346172 3498973 3653855 3804554 3943336 4061959 4152673 4208884
61237D208884J7085k3890o4009j01142j33123j57445j72649j79645j80721j77375
61227C035970j69995j59311j46993j34578j22646j11388j01199r2220q3874p5413
61217A838353o6787n8679n1756m6041m1001l6106l1220k6519k2112j7960j4060
61206A426112j0374o492j854L477Q606J2707J5842J8556K0952K2586K3096K2471
61194A555685K0816J8256J5051J1474P561L332p96m153o525q423j0499j2850j5077
61181A573852j6921j8552k0199k1699k2715k3218k3402k3246k2594k1790k1699
61170A337817k2702k4138k5084k5347k5265k5064k4951k5343k6312k7142k7202
61159A059267k6849k6642k6066k4190k1295j8644j6646j4547j2136j0441j0316
$$ plain form
61237 4208884 4225969 4202079 4138070 4036928 3903805 3746360 3573711 3394066 3213345 3035970
61227 3035970 2865975 2706664 2559671 2425093 2302447 2191059 2089860 1997640 1913766 1838353
61217 1838353 1771566 1712887 1661131 1615090 1574089 1537983 1506763 1480244 1458132 1440172 1426112
61206 1426112 1415738 1409246 1407392 1410869 1419475 1432182 1448024 1466580 1487532 1510118 1533214 1555685
61194 1555685 1576501 1594757 1609808 1621282 1628843 1632175 1631379 1627226 1620701 1612278 1601779 1588929 1573852
61181 1573852 1556931 1538379 1518180 1496481 1473766 1450548 1427146 1403900 1381306 1359516 1337817
61170 1337817 1315115 1290977 1265893 1240546 1215281 1190217 1165266 1139923 1113611 1086469 1059267
61159 1059267 1032418 1005776 979710 955520 934225 915581 898935 884388 872252 861811 851495
61148H51495j1427j3151j5403j8016k0178k1192k1149k0400j9015j7165j5253
61137F59146j3371j1294r261p856o852n293l063j166l2J244L201M884N368N263
61123F20918N665O550P336Q061Q916R424R256R150R845J0815J1218J1379J2099
61110G40632J3166J3871J4385J5183J5652J4707J2499J0038P402L886k39l721
61098H57461o124q168j0065j1017j0747j0215j0267j0560j0417r939r690r939
61086G40313j0570j1243j1397j0645r360q370q002p894p736p559p348o971o514
61073F26704o111n431m002k022l68L38K19j26k0R19K261K972K606J883J549J244
61057F22615K60j164k172k534k540k190j436q23p90p62o5P41P01K39O66K167L709
$$ plain form
61148 851495 840068 826917 811514 793498 773320 752128 730979 710579 691564 674399 659146
61137 659146 645775 634481 625220 617364 610512 605219 602156 600990 600958 602202 605403 610287 615655 620918
61123 620918 626583 633133 640469 648530 657446 666870 676126 685276 695121 705936 717154 728533 740632
61110 740632 753798 767669 782054 797237 812889 827596 840095 850133 857535 861421 861182 857461
61098 857461 851337 843169 833104 822087 811340 801125 790858 780298 769881 759942 750252 740313
61086 740313 729743 718500 707103 696458 687098 678728 670726 662832 655096 647537 640189 633218 626704
61073 626704 620593 615162 611160 609138 608770 609108 609327 609201 609181 610100 612361 615333 617939 619822 621371 622615
61057 622615 622875 621711 619539 617005 614465 612275 610839 610016 609226 608464 608399 609140 609841 610080 610746 612913 616622
61040F16622M760N659O430O714O913P795Q935R116Q407Q191Q854R208Q623Q016
61026G24243Q103Q253P864P481P715Q242Q624Q966R185Q834Q273Q713J0406J2087
61012H46989J2873J3436J4545J5824J6836J8084K0021K2162K4155K6606L0022
61001A061553L3941L7870M1951M6117M9829N3217N6997O0780O3369O5495P0016
60990A641135P8214Q8128R7968J08686J21236J33920J45164J56935J72540J93161
60980B937087K19659K55768L05595L69739M48570N48570O80952Q55191J078881
60971G700012J360882J702533K079743K440175K722789K872727K832969K542715
60963B6254545J982063J237826N07348J542j80120q9876J35625L61688M78231
$$ plain form
61040 616622 621382 627041 633471 640185 647098 654893 663828 672944 681351 689542 698396 707604 716227 724243
61026 724243 732346 740599 748463 755944 763659 771901 780525 789491 798676 807510 815783 824496 834902 846989
61012 846989 859862 873298 887843 903667 920503 938587 958608 980770 1004925 1031531 1061553
61001 1061553 1095494 1133364 1175315 1221432 1271261 1324478 1381475 1442255 1505624 1571119 1641135
60990 1641135 1719349 1807477 1905445 2014131 2135367 2269287 2414451 2571386 2743926 2937087
60980 2937087 3156746 3412514 3718109 4087848 4536418 5084988 5765940 6621131 7700012
60971 7700012 9060894 10763427 12843170 15283345 18006134 20878861 23711830 26254545
60963 26254545 28236608 29474434 29981782 29983324 29803204 29713328 29848953 30210641 30688872
60954C0688872L81584n291o64099j447319k143698k596537k769697k720145k530639
60945A6193031k268811j981940j700523j439121j201963r92245q14296o68559
60937E125573n50208m54178l78148l19989k75742k41493k14747j93123j73988
60928B323957j56364j41085j28111j15552j02247q9490p9091p1205o5120o0689
60918A315003n7793n5554n3255n1208m9639m7591m3994l9203l4573l0921k8113
60907H23159k5683k3247k0658j8252j6590j5676j4909j3951j2970j1851j0146
60896F39226q106o709o152n307l373j047O23J627K374K775K874L501N049O362
60882F33717O074M620L591L498L388K489R68q07k618l963m372m192m255m776n378
$$ plain form
60954 30688872 31070456 31065165 30401066 28953747 26810049 24213512 21443815 18723670 16193031
60945 16193031 13924220 11942280 10241757 8802636 7600673 6608428 5794132 5125573
60937 5125573 4575365 4121187 3743039 3423050 3147308 2905815 2691068 2497945 2323957
60928 2323957 2167593 2026508 1898397 1782845 1680598 1591108 1512017 1440812 1375692 1315003
60918 1315003 1257210 1201656 1148401 1097193 1047554 999963 955969 916766 882193 851272 823159
60907 823159 797476 774229 753571 735319 718729 703053 688144 674193 661223 649372 639226
60896 639226 631120 624411 618259 612952 609579 608532 609155 610782 613156 615931 618805 622306 627355 633717
60882 633717 639791 644411 648002 651500 654888 657377 658345 657538 654920 650957 646585 642393 638138 633362 627984
60867F27984o032o998p897p959p242o583o278n843n120m625m490m145l277k187
60853E49308r60O69K401L440L839M715O511Q276R252J0116J1739J3750J5230J6054
60839F54340J6445J6000J4366J2406J1372J1244J0939J0058R230Q739P950O493
60827G89582N055M532M867N196M843L919L063K763K811K455J257l61j594k154
60813H26234k464l107m359o094p878r238j0082j0754j1511j2194j2543j2599j2516
60800G10895j2246j1659j0773r678q538p710p463p347o466m638k703j279N3J789
60786F22237L470M443N067O153P608Q646R172R886J1006J1914J2236J2355J2570
60773G36763J2566J2110J1615J1523J1648J1465J0763R706Q536P478O672O035
$$ plain form
60867 627984 621952 614954 607057 599098 591856 585273 578995 573152 568032 563407 558917 554772 551495 549308
60853 549308 548348 549017 551418 554858 558697 563412 569923 578199 587451 597567 609306 623056 638286 654340
60839 654340 670785 686785 701151 713557 724929 736173 747112 757170 766400 775139 783089 789582
60827 789582 794637 799169 804036 809232 814075 817994 821057 823820 826631 829086 830343 829982 828388 826234
60813 826234 823770 820663 816304 810210 802332 793094 783012 772258 760747 748553 736010 723411 710895
60800 710895 698649 686990 676217 666539 658001 650291 642828 635481 629015 624377 621674 620395 620448 622237
60786 622237 625707 630150 635217 641370 648978 657624 666796 676682 687688 699602 711838 724193 736763
60773 736763 749329 761439 773054 784577 796225 807690 818453 828159 836695 844173 850845 856880
60761H56880N364M618L914L275K674K211K000J879J665J508J629J846J855J772
60747H93090J894J989J591R17O93R68Q88n3j358k455l548m900n948n972n393n466
60731H66937o688q123q570p934p139o964p270p259o245m240k029o81o51j221j122
60716G90801J2J095Q98m01j593k159k752l823m802n150n350o032o743o560n478
60701G41963m238l045j447N46K160K847K871K660K247J560P53m1r21k033l443
60686G42439n230p367r531j1311j2552j3241j3312j2886j2383j1945j1100r578
60674F12003q062p353p049o009l997j958o33J90R57J733K507L310L754L291K149
60659E94833J355J479J999K140J723J030L99K40P86J574J816J488J414K031K798
$$ plain form
60761 856880 862244 866862 870776 874051 876725 878936 880936 882815 884480 885988 887617 889463 891318 893090
60747 893090 894984 896973 898564 899481 900174 901142 902030 901977 900619 898164 894616 889716 883768 877796 872403 866937
60731 866937 860249 852126 843556 835622 828483 821519 814249 806990 800745 796505 794476 793795 793144 791923 790801
60716 790801 790813 791908 792806 792405 790812 788653 785901 782078 777276 772126 766776 760744 754001 747441 741963
60701 741963 737725 734680 733233 733779 735939 738786 741657 744317 746564 748124 748877 748836 747915 745882 742439
60686 742439 737209 729842 720311 709000 696448 683207 669895 657009 644626 632681 621581 612003
60674 612003 603941 596588 589539 583530 579533 577575 576942 577132 578089 579822 582329 585639 589393 592684 594833
60659 594833 596188 597667 599666 601806 603529 604559 604958 605198 605984 607558 609374 610862 612276 614307 617105
60644F17105L114L067K947K705K357K239K437K528K389K622L677N102O177O866
60630F65332P657Q794J0130J1405J2346J2874J3377J4376J5639J6257J5864J5169
60618H19220J4877J4684J3847J2218J0133P727M954K034o19k696m063m766n166
60605H82384n564n567m517k737j561j666k255k535l081m824p307r142r819j0065
60591H11744j0428j0520r805q395o784n310m040k859j614l81M78P35N97L09k69
60576G53458j350k663l602l824l366k423j291l03N57J687L186M415M733M433M370
60561G58017M772M951M250K822J350K91m15j098j881k561k907k913k581j624J64
60546G60637K310M009N140O376Q075R791J1257J3285J6968K2342K8318L3872L8772
$$ plain form
60644 617105 620219 623286 626233 628938 631295 633534 635971 638499 640888 643510 647187 652289 658466 665332
60630 665332 672989 681783 691913 703318 715664 728538 741915 756291 771930 788187 804051 819220
60618 819220 834097 848781 862628 874846 884979 892706 897660 899694 899075 896379 892316 887550 882384
60605 882384 876820 871253 866736 863999 862438 860772 858517 855982 852901 848077 840770 831628 821809 811744
60591 811744 801316 790796 780991 772596 765812 760502 756462 753603 751989 751608 752086 752821 753418 753727 753458
60576 753458 752108 749445 745843 742019 738653 736230 734939 734636 735193 736880 740066 744481 749214 753647 758017
60561 758017 762789 767740 771990 774812 776162 776453 776038 774940 773059 770498 767591 764678 762097 760473 760637
60546 760637 762947 766956 772096 778472 786547 796338 807595 820880 837848 860190 888508 922380 961152
60533I61152M3255M7302N0195N0602M7305M0041K9630J7334M359q118j9031k7747
60521A236279l3973l7288l7361l4718l0606k5791k0103j3450o616o20M095P419
60509A007267R213R752R926J0359J0740J0578J0197J0409J1627J3821J6940K0923
60497A151752K5702L1718L9803N0004O1132P2211Q3781R6883J11339J26163J41427
60486A991915J58516J78700K02595K31185K65975L07190L52154L95813M32350
60477D516393M55682M58976M35123L79164K91246J77561M8547q4022k08819l15706
60467F154145l96823m48220m70528m67896m46439m12984l73661l32558k91774
60458B513262k52859k17517j86733j60097j36761j16582r9833q6327p5365o6116
$$ plain form
60533 961152 1004407 1051709 1101904 1152506 1199811 1239852 1269482 1286816 1291175 1283057 1264026 1236279
60521 1236279 1202306 1165018 1127657 1092939 1062333 1036542 1016439 1002989 996373 995753 999848 1007267
60509 1007267 1016480 1026232 1036158 1046517 1057257 1067835 1078032 1088441 1100068 1113889 1130829 1151752
60497 1151752 1177454 1209172 1248975 1298979 1360111 1432322 1516103 1612986 1724325 1850488 1991915
60486 1991915 2150431 2329131 2531726 2762911 3028886 3336076 3688230 4084043 4516393
60477 4516393 4972075 5431051 5866174 6245338 6536584 6714145 6762692 6678670 6469851 6154145
60467 6154145 5757322 5309102 4838574 4370678 3924239 3511255 3137594 2805036 2513262
60458 2513262 2260403 2042886 1856153 1696056 1559295 1442713 1342880 1256553 1181188 1115072
60448A115072n7730m9644m2204l6364l2242k8748k5113k1968k0170j9401j8792
60437G62696j8216j7906j7469j6355j4882j3716j2738j1378r780q561p692o647
60425F07356n421m489l941l490l156l015k606j483j55M77M10K94K42j05m78j84
60409E80256O76J271J366J507J848J909J684J839K527L048L078L294M248N441
60395F13992O005N806N371N191N396N785N912N482M686L871K969J783O35L8k10
60380F72712r53k502m195n216n376n017m570m253l881l081j972j248j128p76M78
60365F29022J804J774L61j016j327q52k53K40N93Q27J300K317L421L872L840M184
60349F50107N036N606N620N842O779P845Q324Q363Q444Q502Q152P346O342N368
$$ plain form
60448 1115072 1057342 1007698 965494 929130 896888 868140 843027 821059 800889 781488 762696
60437 762696 744480 726574 709105 692750 677868 664152 651414 640036 630256 621695 614003 607356
60425 607356 601935 597446 593505 590015 586859 583844 581238 579755 579600 580077 580487 580781 581023 580918 580440 580256
60409 580256 580932 582203 583569 585076 586924 588833 590517 592356 594883 597931 601009 604303 608551 613992
60395 613992 619997 625803 631174 636365 641761 647546 653458 658940 663626 667497 670466 672249 672884 672922 672712
60380 672712 671759 669257 665062 659846 654470 649453 644883 640630 636749 633668 631696 630448 629320 628544 629022
60365 629022 630826 632600 632961 631945 630618 629766 629513 629753 630346 631173 632473 634790 638211 642083 645923 650107
60349 650107 655143 660749 666369 672211 678990 686835 695159 703522 711966 720468 728620 735966 742308 747676
60335G47676M594M124L759L129K210J393J026J248K201L861N702P002P548P655
60321H03128P519P042O140M757K760K93k038l899n795q116j0098j0610r692q327
60307G73064o962n381l873l216l347l223k263r41J81J029J423J069M27N91J848
60292G50426L243L886L894L730L473L105K813K654K500K452K650K767K402J937
60278G91932K011K294J970J380J837L548N150N791O289P569R165J0119J0439J0805
60264H70299J1549J2604J3938J5487J7155J9202K2000K5260K8213L0703L3286
60253A099696L6222L9351M2993M7827N3672N9668O5827P2996Q1006Q8558R5496
60242A783312J03404J12952J22281J29286J34082J37762J39893J38920J34335
$$ plain form
60335 747676 752270 756394 760153 763282 765492 766885 767911 769159 771360 775221 780923 787925 795473 803128
60321 803128 810647 817689 823829 828586 831346 831639 829601 825702 819907 811791 801693 791083 781391 773064
60307 773064 766102 760721 756848 753632 750285 747062 744799 743858 744039 745068 746491 747560 747987 748578 750426
60292 750426 753669 757555 761449 765179 768652 771757 774570 777224 779724 782176 784826 787593 789995 791932
60278 791932 793943 796237 798207 799587 801424 804972 810122 815913 822202 829771 838936 849055 859494 870299
60264 870299 881848 894452 908390 923877 941032 960234 982234 1007494 1035707 1066410 1099696
60253 1099696 1135918 1175269 1218262 1266089 1319761 1379429 1445256 1518252 1599258 1687816 1783312
60242 1783312 1886716 1999668 2121949 2251235 2385317 2523079 2662972 2801892 2936227
60233B936227J26975J17587J06403R3710P9739O4256M7208K9476J2188m284j9886
60222C589599l3991m5714n4672o0781o3755o3553o0701n5589m8092l8521k8033
60211C036197j7218n188Q916K4270L9404N4197O9540Q5421J00699J14478J26531
60200C637247J36366J43031J45928J45003J40145J31207J18585J03022Q4882O4192
60190D849608M1429J7644o151k9268n1142p1283q9241j04272j15366j21934j24200
60179D195824j22567j17125j08131r6427q2763o7156m9468l0305j0783Q203K6104
60168C545406M2513N7291P0442Q1534Q9648R4148R4893R1551Q3621P1641N7524
60157D380212M2986K8277J2999k650j7878l1794m3245n0953n4427n4063m9979
$$ plain form
60233 2936227 3063202 3180789 3287192 3380902 3460641 3524897 3572105 3601581 3613769 3609485 3589599
60222 3589599 3555608 3509894 3455222 3394441 3330686 3267133 3206432 3150843 3102751 3064230 3036197
60211 3036197 3018979 3013791 3022707 3046977 3086381 3140578 3210118 3295539 3396238 3510716 3637247
60200 3637247 3773613 3916644 4062572 4207575 4347720 4478927 4597512 4700534 4785416 4849608
60190 4849608 4891037 4908681 4902530 4873262 4822120 4750837 4661596 4557324 4441958 4320024 4195824
60179 4195824 4073257 3956132 3848001 3751574 3668811 3601655 3552187 3521882 3511099 3519302 3545406
60168 3545406 3587919 3645210 3715652 3797186 3886834 3980982 4075875 4167426 4251047 4322688 4380212
60157 4380212 4423198 4451475 4464474 4461824 4443946 4412152 4368907 4317954 4263527 4209464 4159485
60146D159485m1820l0145j6648k247J3814L2042N1253P0281Q9791J11028J33838
60135D570672J57469J82293K09068K37299K66045K95549L26150L56223L82998
60126F983766M05165M22837M35176M40071M36272M24170M04154L75820L39195
60117A0666626K95397K45703J90935J32097P0522P218n7040j20804j81994k38793
60107A1009867k89657l32618l65618l87604l98456l98180l87163l66991l39849
60098G743731l07196k70052k30106j89133j47441j04391o0531j7869K1971N8578
60088F497561R1489J19492J41487J56840J64676J64063J55172J39258J17258Q9577
60078G836873N7528K3646r817m1804p1676r8760j23060j45206j65173j81989j95031
$$ plain form
60146 4159485 4117665 4087520 4070872 4068625 4082439 4114481 4165734 4236015 4325806 4436834 4570672
60135 4570672 4728141 4910434 5119502 5356801 5622846 5918395 6244545 6600768 6983766
60126 6983766 7388931 7811768 8246944 8687015 9123287 9547457 9951611 10327431 10666626
60117 10666626 10962023 11207726 11398661 11530758 11601280 11608498 11551458 11430654 11248660 11009867
60107 11009867 10720210 10387592 10021974 9634370 9235914 8837734 8450571 8083580 7743731
60098 7743731 7436535 7166483 6936377 6747244 6599803 6495412 6434881 6417012 6438983 6497561
60088 6497561 6589050 6708542 6850029 7006869 7171545 7335608 7490780 7630038 7747296 7836873
60078 7836873 7894401 7918047 7908230 7866426 7794750 7695990 7572930 7427724 7262551 7080562 6885531
60067F885531k04672k11217k14322k13873k10454k04392j95266j82941j68215
60058E080179j51902j34026j14421r3516p2004n0273k8435o446J5969L8898O1740
60047D545763Q3723J04692J24501J41747J54302J61239J63069J59987J51205J36377
60037E926605J16411R2457O5162L5430M719k5971n6348q5621j12140j34747j53307
60026E672650j67388j75797j78266j76316j71362j63089j50858j35735j19704
60017D234135j03516q6565o8485m9626l0229j0221J0302L1261N3072P6110R9875
60006D156113J23378J46109J67863J87797K04471K16692K23649K24331K17696
59997E868099K03551J82828J56898J27017R4317N9812K4238j1838m7619q1978
$$ plain form
60067 6885531 6680859 6469642 6255320 6041447 5830993 5626601 5431335 5248394 5080179
60058 5080179 4928277 4794251 4679830 4586314 4514310 4464037 4435602 4429156 4445125 4484023 4545763
60047 4545763 4629486 4734178 4858679 5000426 5154728 5315967 5479036 5639023 5790228 5926605
60037 5926605 6043016 6135473 6200635 6236065 6240784 6214813 6158465 6072844 5960704 5825957 5672650
60026 5672650 5505262 5329465 5151199 4974883 4803521 4640432 4489574 4353839 4234135
60017 4234135 4130619 4044054 3975569 3925943 3895714 3885493 3895795 3927056 3980128 4056238 4156113
60006 4156113 4279491 4425600 4593463 4781260 4985731 5202423 5426072 5650403 5868099
59997 5868099 6071650 6254478 6411376 6538393 6632710 6692522 6716760 6704922 6657303 6575325
59987F575325j13603j41106j63150j78786j87665j89932j86111j77115j63933
59978E073924j47124j26911j03960p9671n5422l1813q790J3791L5915N7237P6856
59967D704032R3548J06614J16282J23085J27150J28345J26719J22402J15238J04974
59957E868389R1834P6712O0776M4911K9428J4402L75j1366j9573k3939k4818k2101
59945F085030j4883k347J5441L7796O4123R4310J28732J67725K10724K56012L01838
59934G344501L47628L93326M37485M76845N07954N28360N35734N26765M97930
59925A1596528M47471L76291K87319J84655P3348m0611j50685k50772l36211m04213
59915A1783120m53541m84138m97219m95278m81255m57618m26356l89539l49224
$$ plain form
59987 6575325 6461722 6320616 6157466 5978680 5791015 5601083 5414972 5237857 5073924
59978 5073924 4926800 4799889 4695929 4616258 4560836 4529023 4520233 4534024 4569939 4627176 4704032
59967 4704032 4797580 4904194 5020476 5143561 5270711 5399056 5525775 5648177 5763415 5868389
59957 5868389 5960223 6036935 6097711 6142622 6172050 6186452 6186827 6175461 6155888 6131949 6107131 6085030
59945 6085030 6070147 6067800 6083241 6121037 6185160 6279470 6408202 6575927 6786651 7042663 7344501
59934 7344501 7692129 8085455 8522940 8999785 9507739 10036099 10571833 11098598 11596528
59925 11596528 12043999 12420290 12707609 12892264 12965612 12925001 12774316 12523544 12187333 11783120
59915 11783120 11329579 10845441 10348222 9852944 9371689 8914071 8487715 8098176 7748952
59906G748952l06841k63174k18887j74611j30621q6989m4117k646L7215P5751
59896F634032J13066J48593J81229K09525K31898K46984K53663K50450K35381
59887H504821K07251J66774J16004N7018p970p5548j41327k01541k53872k96916
59877H074694l29710l51881l63592l65276l57975l43679l24537l01862k76479
59868E059703k49632k22582j95672j68989j43679j21334j02196q5375p0829n9650
59858C639765n2190m7465m4784m4391m5808m7071m6462m4002m0312l5134k7928
59847C164218j9124r810q59O853J2035J3646J1596O267k092j2972k5129l7117
59835C107512m7904n6719o2871o6178o7038o5770o2472n7610n1902m5414l7661
$$ plain form
59906 7748952 7442111 7178937 6960050 6785439 6654818 6567829 6523712 6521066 6558281 6634032
59896 6634032 6747098 6895691 7076920 7286445 7518343 7765327 8018990 8269440 8504821
59887 8504821 8712072 8878846 8994850 9051868 9043898 8968350 8827023 8625482 8371610 8074694
59877 8074694 7744984 7393103 7029511 6664235 6306260 5962581 5638044 5336182 5059703
59868 5059703 4810071 4587489 4391817 4222828 4079149 3957815 3855619 3770244 3699415 3639765
59858 3639765 3587575 3540110 3495326 3450935 3405127 3358056 3311594 3267592 3227280 3192146 3164218
59847 3164218 3145094 3135284 3134425 3141278 3153313 3166959 3178555 3184822 3182730 3169758 3144629 3107512
59835 3107512 3059608 3002889 2940018 2873840 2806802 2741032 2678560 2620950 2569048 2523634 2485973
59824B485973k8895k0221j2023l403O255J6238K5742L5007M4334N2848N9349O3794
59812B724998O7075O9853P2330P4542P5944P5206P1175O3771N3445M0455K5459
59801C414253J0239l075j3417k0828k5483k7277k6143k2180j5609o815L796J6102
59789C283563L0124M5595O2329Q0944J02430J26960J54182J84800K20559K62139
59779D553625L08039L55920M03648M48079M83707N03404M99993M67194M01164
59770H424773L03229J81252M7766q3231j98682k88731l49174l81651l90826l81670
59760F883055l59237l28818k94419k57944k20855j85546j53781j25007r7843p2452
59750D787153m9864k9771j0732P826K5451M2168N8670P5223R1714J08586J26494
$$ plain form
59824 2485973 2457078 2436857 2424834 2421431 2427686 2443924 2469666 2504673 2549007 2601855 2661204 2724998
59812 2724998 2792073 2861926 2934256 3008798 3084742 3159948 3231123 3294894 3348339 3388794 3414253
59801 3414253 3424492 3421417 3408000 3387172 3361689 3334412 3308269 3286089 3270480 3263665 3267461 3283563
59789 3283563 3313687 3359282 3421611 3502555 3604985 3731945 3886127 4070927 4291486 4553625
59779 4553625 4861664 5217584 5621232 6069311 6553018 7056422 7556415 8023609 8424773
59770 8424773 8728002 8909254 8957020 8873789 8675107 8386376 8037202 7655551 7264725 6883055
59760 6883055 6523818 6195000 5900581 5642637 5421782 5236236 5082455 4957448 4859605 4787153
59750 4787153 4737289 4707518 4696786 4704612 4730063 4772231 4830901 4906124 4997838 5106424 5232918
59739E232918J45401J65187J86684K10752K36771K63708K92320L24672L61400
59730G419813M01113M42613M86053N31549N77897O23051O64591O99480P24514
59721A2570674P37522P37253P22252O91631O47626N96259N44540M97797M60000
59712A8205554M35141M26692M35894M61391N00248N48573O01310O52307O95090
59703B2962200P23653P32766P18185O77097O08875N15556M01704K73812J39732
59694B7753580P987j13498k18602l02970l63109l96576m03346l86057l48132k92166
59684B4937111k20318j35124l8824O7384J82494L04741M32462N65108P01927Q39740
59674B7636701R72877J094705J197693J272154J306627J290318J215008J075665
$$ plain form
59739 5232918 5378319 5543506 5730190 5940942 6177713 6441421 6733741 7058413 7419813
59730 7419813 7820926 8263539 8749592 9281141 9859038 10482089 11146680 11846160 12570674
59721 12570674 13308196 14045449 14767701 15459332 16106958 16703217 17247757 17745554 18205554
59712 18205554 18640695 19067387 19503281 19964672 20464920 21013493 21614803 22267110 22962200
59703 22962200 23685853 24418619 25136804 25813901 26422776 26938332 27340036 27613848 27753580
59694 27753580 27761567 27648069 27429467 27126497 26763388 26366812 25963466 25577409 25229277 24937111
59684 24937111 24716793 24581669 24542845 24610229 24792723 25097464 25529926 26095034 26796961 27636701
59674 27636701 28609578 29704283 30901976 32174130 33480757 34771075 35986083 37061748
59666C7061748Q71690O09098L01264l2863l71224o90702r69822j192463j350262
59657C4236464j442139j472156j447945j379962j280819j164396j044922r36038
59649B4068087q49613p94438p74859p89674q31820q89417r48051r94160j018535
59640A6177520j018213r95264r53845q98480q34160p66074o98026o31721n68124
59631H813613n08686m54614m05812l61522l21518k85811k53812k24646j97962
59622E799230j73675j51366j30646j11632r4462p8931o5242n4319m6522m0902
59612D851533l6720l4980l7214m3364n1977o1881p2371q2318r0523r6865j01871
59601D141449j05399j06814j06128j03773r9589r3262q5570p7790p0049o1548
$$ plain form
59666 37061748 37933438 38542536 38843800 38810937 38439713 37749011 36779189 35586726 34236464
59657 34236464 32794325 31322169 29874224 28494262 27213443 26049047 25004125 24068087
59649 24068087 23218474 22424036 21649177 20859503 20027683 19138266 18190215 17196055 16177520
59640 16177520 15159307 14164043 13210198 12311718 11477558 10711484 10013458 9381737 8813613
59631 8813613 8304927 7850313 7444501 7082979 6761461 6475650 6221838 5997192 5799230
59622 5799230 5625555 5474189 5343543 5231911 5137449 5058518 4993276 4938957 4892435 4851533
59612 4851533 4814813 4779833 4742619 4699255 4647278 4585397 4513026 4430708 4340185 4243320 4141449
59601 4141449 4036050 3929236 3823108 3719335 3619746 3526484 3440914 3363124 3293075 3231527
59591C231527n2314m3372l5146k7082j8964j1383m575J955Q427J4295J9037K2641
59579C105046K5154K6548K7052K6926K6057K4605K3647K4185K5704K7072K8598
59568C390594L1815L7229M3714N0412N7825O6630P6618Q7350R8871J11298J24594
59557D176950J39084J55357J73327J92172K11506K31731K52889K74002K93848
59548F100866L11720L27071L39142L47218L50778L49252L42360L30766L15778
59539I114951K98264K78530K57190K35341K13698J92142J70265J47927J25596
59530A1033904J05045Q9465Q1875Q3038R1376J04588J20552J36898J50762J59105
59520A2156608J58673J46168J19558P9294K7440l4016j02978j75884k48152l16081
$$ plain form
59591 3231527 3179213 3135841 3100695 3073613 3054649 3043266 3038691 3040646 3049073 3063368 3082405 3105046
59579 3105046 3130200 3156748 3183800 3210726 3236783 3261388 3285035 3309220 3334924 3361996 3390594
59568 3390594 3422409 3459638 3503352 3553764 3611589 3678219 3754837 3842187 3941058 4052356 4176950
59557 4176950 4316034 4471391 4644718 4836890 5048396 5280127 5533016 5807018 6100866
59548 6100866 6412586 6739657 7078799 7426017 7776795 8126047 8468407 8799173 9114951
59539 9114951 9413215 9691745 9948935 10184276 10397974 10590116 10760381 10908308 11033904
59530 11033904 11138949 11228414 11310289 11393327 11484703 11589291 11709843 11846741 11997503 12156608
59520 12156608 12315281 12461449 12581007 12660301 12687741 12653725 12550747 12374863 12126711 11810630
59510A1810630l77235m29067m68830m95297n09453n13038n07275m93136m71752
59501G545547m44280m12233l78049l44243l11771k80089k48969k19253j91809
59492D714851j66702j43638j22285j02068q2599o4233m7401l1516j5590L44J5674
59481C954837L0831M7081O4680Q2693J00803J19788J40098J61290J83219K06246
59471E091566K29943K52829K73769K92356L07550L17267L19732L14027K98984
59462G698023K72903K34954J85958J27674O2572n637p2785j36057j93927k44328
59452G929350k84618l13757l32919l43448l45750l40707l30333l16221k98817
59443E022780k78863k58055k37416k16603j95662j75940j58328j42146j26769
$$ plain form
59510 11810630 11433395 11004328 10535498 10040201 9530748 9017710 8510435 8017299 7545547
59501 7545547 7101267 6689034 6310985 5966742 5654971 5374882 5125913 4906660 4714851
59492 4714851 4548149 4404511 4282226 4180158 4097559 4033326 3985925 3954409 3938819 3939163 3954837
59481 3954837 3985668 4032749 4097429 4180122 4280925 4400713 4540811 4702101 4885320 5091566
59471 5091566 5321509 5574338 5848107 6140463 6448013 6765280 7085012 7399039 7698023
59462 7698023 7970926 8205880 8391838 8519512 8582084 8576447 8503662 8367605 8173678 7929350
59452 7929350 7644732 7330975 6998056 6654608 6308858 5968151 5637818 5321597 5022780
59443 5022780 4743917 4485862 4248446 4031843 3836181 3660241 3501913 3359767 3232998
59434C232998j12865j00785q9282p7249o5506n5433m6865l8751l1032k4316j8355
59423B572559j2218n682O23O127J0580J3862J6272J8646K1558K4905K8485L2307
59411B728024L5996L8798M0479M1270M0693L7841L3397L0056L0179L4154M1584
59400C132471N2412O5954Q0397R4604J09162J24413J38855J51172J62925J77552
59390D289917J97316K22595K53389K89828L31306L76548M24534M74467N24853
59381G384753N73288O16888O52454O76741O87428O83679O65509O33429N89235
59372A3163404N36423M79036M20379L62992L08825K58806K12957J71098J32435
59363A6046355R4241N2611N420m6539j01868j60264k20706k79511l31784l74017
$$ plain form
59434 3232998 3120133 3019348 2930066 2852817 2787311 2731878 2685013 2646262 2615230 2590914 2572559
59423 2572559 2560341 2554659 2555282 2561409 2571989 2585851 2602123 2620769 2642327 2667232 2695717 2728024
59411 2728024 2764020 2802818 2843297 2884567 2925260 2963101 2996498 3026554 3056733 3090887 3132471
59400 3132471 3184883 3250837 3331234 3425838 3535000 3659413 3798268 3949440 4112365 4289917
59390 4289917 4487233 4709828 4963217 5253045 5584351 5960899 6385433 6859900 7384753
59381 7384753 7958041 8574929 9227383 9904124 10591552 11275231 11940740 12574169 13163404
59372 13163404 13699827 14178863 14599242 14962234 15271059 15529865 15742822 15913920 16046355
59363 16046355 16140596 16193207 16198627 16152088 16050220 15889956 15669250 15389739 15057955 14683938
59353A4683938m04239m21065m24414m16611m01374l82086l62049l45235l35095
59344A1191770l32743l37196l46925l60143l74417l87236l96770m01483l99925
59335G854932l91894l78939l62579l42768l19137k92843k65924k39577k14256
59326E047015j90651j69204j49218j29754j11002r3741p8055o3657n0747l9362
59316C971624k8596j7600o767L310J3240K3933L4991M5374N5030O4442P3094P9912
59304D311987Q4855Q8609R0965R0826Q7657Q1755P3357O2644N0452L7926K5661
59293E086694J3987L704m395j0235j3794j4341j1378n582K279J2692K6325M2317
59281E128273N8997P5823R3164J10619J26997J41646J54283J63737J68290J67281
$$ plain form
59353 14683938 14279699 13858634 13434220 13017609 12616235 12234149 11872100 11526865 11191770
59344 11191770 10859027 10521831 10174906 9814763 9440346 9053110 8656340 8254857 7854932
59335 7854932 7463038 7084099 6721520 6378752 6059615 5766772 5500848 5261271 5047015
59326 5047015 4856364 4687160 4537942 4408188 4297186 4203445 4125390 4061733 4010986 3971624
59316 3971624 3943028 3925428 3918661 3921971 3935211 3959144 3994135 4039509 4094539 4158981 4232075 4311987
59304 4311987 4396842 4485451 4576416 4667242 4754899 4836654 4910011 4972655 5023107 5061033 5086694
59293 5086694 5100681 5104385 5099990 5089755 5075961 5061620 5050242 5044660 5046939 5059631 5085956 5128273
59281 5128273 5187270 5263093 5356257 5466876 5593873 5735519 5889802 6053539 6221829 6389110
59271F389110J61153J50018J33437J11633Q5835N7334K7085l895l4575o4123r1197
59260F921815j13342j28076j34454j33119j25316j12769r7818q2561o8034n4745
59250E871581m3250l3570k5105j8124j4268j4273j6199j7360j7070j5989j3703
59239E642670q850r31R897K4355M3574O7351R4684J25739J61589K02085K45564
59228F607727K90549L35997L79886M18951M49793M69042M72914M58409M24892
59219A0308160L73168L03535K16680J16324Q902r9650k05150l03375l89294m58919
59209I870381n10565n43758n58476n56124n39946n13678m80479m43252m04784
59200E319319l66978l30678k96408k64639k35377k08497j84367j63346j44966
$$ plain form
59271 6389110 6550263 6700281 6833718 6945351 7031186 7088520 7115605 7111710 7077135 7013012 6921815
59260 6921815 6808473 6680397 6545943 6412824 6287508 6174739 6076921 5994360 5926326 5871581
59250 5871581 5828331 5794761 5769656 5751532 5737264 5722991 5706792 5689432 5672362 5656373 5642670
59239 5642670 5633820 5632889 5642786 5667141 5710715 5778066 5872750 5998489 6160078 6362163 6607727
59228 6607727 6898276 7234273 7614159 8033110 8482903 8951945 9424859 9883268 10308160
59219 10308160 10681328 10984863 11201543 11317867 11326769 11227119 11021969 10718594 10329300 9870381
59209 9870381 9359816 8816058 8257582 7701458 7161512 6647834 6167355 5724103 5319319
59200 5319319 4952341 4621663 4325255 4060616 3825239 3616742 3432375 3269029 3124063
59191C124063j28577j14420j02863r3071q3810p5182o8046o2024n5830m9381m3836
59180B247023l9435l5089l0274k5718k1745j7643j3063q621m611m55M054Q319
59168B062742J2187J6415K1326K6123L0111L3619L7299M1385M5972N1115N6349
59157B434643O0997O5181O9693P4792P9958Q4932Q9973R5072R9775J03803J06954
59146C365773J08524J07753J04679R9594R1995Q1296O8259N4410M0223K5274R957
59135D157737m443j7307k8764l8183m4234m6647m6402m3926l8622l0486k0738
59124C797985j0228J508J5162L0622M7375O5018Q3133J01617J21071J42092J64121
59113D559476J86076K07738K29399K50445K69647K86373K99932L07944L07179
$$ plain form
59191 3124063 2995486 2881066 2778203 2685132 2601322 2526140 2458094 2396070 2340240 2290859 2247023
59180 2247023 2207588 2172499 2142225 2116507 2094762 2077119 2064056 2055435 2050824 2050369 2054423 2062742
59168 2062742 2074929 2091344 2112670 2138793 2168904 2202523 2239822 2281207 2327179 2378294 2434643
59157 2434643 2495640 2560821 2630514 2705306 2785264 2870196 2960169 3055241 3155016 3258819 3365773
59146 3365773 3474297 3582050 3686729 3786323 3878318 3959614 4027873 4082283 4122506 4147780 4157737
59135 4157737 4153294 4135987 4107223 4069040 4024806 3978159 3931757 3887831 3849209 3818723 3797985
59124 3797985 3787757 3789265 3804427 3835049 3882424 3947442 4030575 4132192 4253263 4395355 4559476
59113 4559476 4745552 4953290 5182689 5433134 5702781 5989154 6289086 6597030 6904209
59104F904209K96062K74778K43222K00946J49458R2650L4471k2296p4872j20166
59094G978462j56502j84275k04509k18124k26843k33002k37719k40676k41979
59085F034833k42764k43405k42808k40125k35813k30479k24000k16337k07923
59076C951179j98758j88400j77161j66036j55197j44026j32716j22295j12816
59067B553774j03304r3775q5458p8509p1445o3547n5961m9561m3554l7193l1242
59056A840225k6603k2899j9491j6759j5353j5273j6441j9100k2877k6602k9683
59045A609144l2509l5039l6232l5571l3791l1523k8463k4509k0437j6743j2989
59034A301338q914m905r62L472Q157J1933J4459J6730J9353K1715K3228K3780
$$ plain form
59104 6904209 7200271 7475049 7718271 7919217 8068675 8161325 8195796 8173500 8098628 7978462
59094 7978462 7821960 7637685 7433176 7215052 6988209 6755207 6517488 6276812 6034833
59085 6034833 5792069 5548664 5305856 5065731 4829918 4599439 4375439 4159102 3951179
59076 3951179 3752421 3564021 3386860 3220824 3065627 2921601 2788885 2666590 2553774
59067 2553774 2450470 2356695 2271237 2192728 2121283 2057736 2001775 1952214 1908660 1871467 1840225
59056 1840225 1813622 1790723 1771232 1754473 1739120 1723847 1707406 1688306 1665429 1638827 1609144
59045 1609144 1576635 1541596 1505364 1469793 1436002 1404479 1376016 1351507 1331070 1314327 1301338
59034 1301338 1292424 1287519 1286557 1290029 1298186 1310119 1324578 1341308 1360661 1382376 1405604 1429384
59022A429384K2526J8191J1353M624l46m359q288j1125j1680j0563r036p180m570
59009A418931j593J163L932O969R606J1087J1545J1305J0087P687M666J683j088
58996A495980l467n036n792o092n815m674l359k892k805j626O16K232K589K994
58982A462853M328N788O732P790R249J0231J0529J1370J3384J5503J6948J8576
58970A593281K1121K3809K5912K8040L0766L3467L5583L7530L9400M0340M0204
58959A949453M0102M0336L9612L7406L5275L4626L4918L5311L6377L8801M2077
58948B364294M5812N0671N6842O3152O9044P5635Q3637R2007R9944J08346J17903
58937C227287J27696J37256J48074J61304J75801J90186K05243K22446K41811
$$ plain form
59022 1429384 1451910 1470101 1481454 1486078 1485732 1481373 1473085 1461960 1450280 1439717 1430681 1423501 1418931
59009 1418931 1417338 1418501 1422433 1429402 1439008 1450095 1461640 1472945 1483032 1490719 1495385 1497068 1495980
58996 1495980 1492513 1487477 1481685 1475593 1469778 1465104 1461745 1458853 1456048 1454422 1455038 1457270 1459859 1462853
58982 1462853 1467181 1472969 1479701 1487491 1496740 1506971 1517500 1528870 1542254 1557757 1574705 1593281
58970 1593281 1614402 1638211 1664123 1692163 1722929 1756396 1791979 1829509 1868909 1909249 1949453
58959 1949453 1989555 2029891 2069503 2106909 2142184 2176810 2211728 2247039 2283416 2322217 2364294
58948 2364294 2410106 2460777 2517619 2580771 2649815 2725450 2809087 2901094 3001038 3109384 3227287
58937 3227287 3354983 3492239 3640313 3801617 3977418 4167604 4372847 4595293 4837104
58928D837104K63044K87210L15295L46565L80177M17030M58238N03115N50487
58919H358265O00587O53849P09008P63907Q16815Q65344R05403R32602R43212
58910A5548992R32539Q94661Q25854P26852O00329M48630K76207R2065r3104k70989
58900A9982036m34979n77929o93939p81449q42019q77226q89024q81596q59800
58891A3144075q26401p83153p33421o81128o28063n74688n22703m74274m29718
58882G490526l88374l51017l18966k91731k67976k47863k31969k18823k06145
58873D967662j93749j82653j72263j61033j49200j38063j27266j15652j04101
58864C623682r4602q6901p9009p0745o3842n8580n3265m7214m1505l6433l0778
$$ plain form
58928 4837104 5100148 5387358 5702653 6049218 6429395 6846425 7304663 7807778 8358265
58919 8358265 8958852 9612701 10321709 11085616 11902431 12767775 13673178 14605780 15548992
58910 15548992 16481531 17376192 18202046 18928898 19529227 19977857 20254064 20346129 20253025 19982036
58900 19982036 19547057 18969128 18275189 17493740 16651721 15774495 14885471 14003875 13144075
58891 13144075 12317674 11534521 10801100 10119972 9491909 8917221 8394518 7920244 7490526
58882 7490526 7102152 6751135 6432169 6140438 5872462 5624599 5392630 5173807 4967662
58873 4967662 4773913 4591260 4418997 4257964 4108764 3970701 3843435 3727783 3623682
58864 3623682 3529080 3442179 3363170 3292425 3228583 3170003 3116738 3069524 3028019 2991586 2960808
58853B960808k4088j7455j1585o021m65M979J0894J8017K5597L2231L8151M4821
58841C075884N2419N9814O6818P4375Q2560R0489R8277J07136J17441J28491J40164
58830D093868J52988J66822J81194J96763K14660K34638K55764K78498L04165
58821F079360L32884L64166L99120M39634M85466N34395N85225O38414O93633
58812A0552297P48708Q00908Q47152Q82863R02755R02886Q80367Q31495P52684
58803A8102115O43505N07144L48251J72672j0913j91946l61509n13459o42620
58794A8053240p44529q17710q64059q86393q87233q70124q39957q01055p56250
58785A0585930p08077o59270o11634n65751n22025m80834m41802m04386l69171
$$ plain form
58853 2960808 2936720 2919265 2907680 2901659 2901194 2906173 2917067 2935084 2960681 2992912 3031063 3075884
58841 3075884 3128303 3188117 3254935 3329310 3411870 3502359 3600636 3707772 3825213 3953704 4093868
58830 4093868 4246856 4413678 4594872 4791635 5006295 5240933 5496697 5775195 6079360
58821 6079360 6412244 6776410 7175530 7615164 8100630 8635025 9220250 9858664 10552297
58812 10552297 11301005 12101913 12949065 13831928 14734683 15637569 16517936 17349431 18102115
58803 18102115 18745620 19252764 19601015 19773687 19762774 19570828 19209319 18695860 18053240
58794 18053240 17308711 16491001 15626942 14740549 13853316 12983192 12143235 11342180 10585930
58785 10585930 9877853 9218583 8606949 8041198 7519173 7038339 6596537 6192151 5822980
58776E822980l37294l08749k82648k58761k37520k18866k02556j88913j77800
58767C609873j67540j56568j45394j35278j25928j16437j07408r9848r2756q4439
58757B378277p5520o8038o2120n6126m9797m4497m0484l6512l2238k8633k5980
58746A858332k3658k1752k0707j9622j7256j4436j3099j3220j3096j2396j2352
58735A676738j3234j4107j4952j6466j8049j8526j8575j9769k1603k2323k2262
58724A476872k3346k5497k6815k7243k8677l1161l2324l1139k9124k7246k4774
58713A169526k1780j9774j8966j7708j5424j3429j2296j1116r932j0081j1487
58702A007533j2349j2107j1960j2010j0828q524p216p593p928p206o437n988m669
$$ plain form
58776 5822980 5485686 5176937 4894289 4635528 4398008 4179142 3976586 3787673 3609873
58767 3609873 3442333 3285765 3140371 3005093 2879165 2762728 2655320 2555472 2462716 2378277
58757 2378277 2302757 2234719 2172599 2116473 2066676 2022179 1981695 1945183 1912945 1884312 1858332
58746 1858332 1834674 1812922 1792215 1772593 1755337 1740901 1727802 1714582 1701486 1689090 1676738
58735 1676738 1663504 1649397 1634445 1617979 1599930 1581404 1562829 1543060 1521457 1499134 1476872
58724 1476872 1453526 1428029 1401214 1373971 1345294 1314133 1281809 1250670 1221546 1194300 1169526
58713 1169526 1147746 1127972 1109006 1091298 1075874 1062445 1050149 1039033 1029101 1019020 1007533
58702 1007533 995184 983077 971117 959107 948279 939755 932539 924946 917018 909812 903375 897387 892718
58689H92718k465j262j780k491k634l513n745p998r474j0973j2407j2136r937
58676H09903p928p274o607m858l082k172j382m13m24j587k112j001N13J406K430
58661G75412M042N140N064M660M289L082J173K57Q71J485J261J319K227K766K231
58646H15279J784K453L987O339R855J3433J5196J5651J7375K0907K4074K6112
58634I72445K9070L3953L8882M2556M6337N1344N6523O1360O7551P6191Q5928
58623A562140R5679J06612J19937J35246J52417J72472J95100K17865K39139K59121
58613C255728K76817K89017K93465K89961K77042K51107K10676J58630R8833L3807
58603E435083l2676r4542j47301j90222k22973k43680k52388k52910k48625k39412
$$ plain form
58689 892718 890253 888991 887211 884720 882086 878573 872828 864830 855356 844383 831976 819840 809903
58676 809903 801975 794701 788094 783236 780154 777982 776600 776187 775763 774176 772064 771063 771576 772982 775412
58661 775412 779454 784594 789658 794318 798607 801689 802862 803119 803990 805475 806736 808055 810282 813048 815279
58646 815279 817063 819516 823503 829842 839697 853130 868326 883977 901352 922259 946333 972445
58634 972445 1001515 1035468 1074350 1116906 1163243 1214587 1271110 1332470 1400021 1476212 1562140
58623 1562140 1657819 1764431 1884368 2019614 2172031 2344503 2539603 2757468 2996607 3255728
58613 3255728 3532545 3821562 4115027 4404988 4682030 4933137 5143813 5302443 5401276 5435083
58603 5435083 5402407 5307865 5160564 4970342 4747369 4503689 4251301 3998391 3749766 3510354
58593C510354k25051k08360j92300j76871j61376j46930j34137j21215j07116
58584B036998r3841q3047p3132o2340n1972m3823l6940k9922k3949k0731j9534
58573A497767j8865j9025k0600k2540k4061k6193k9221l1011l0094k8055k6706
58562A221396k5479k3750k2920k3729k4303k3335k2422k2756k2463j9961j7064
58551I73214j5768j4768j2227r323p892o994n045l008k421k482j979j877l027
58538H86403l675k260l95k11j025j571k975o351r825j1193j1434j2451j3539j3256
58524G96242j2639j3291j4260j3911j2988j2838j2600j1073r405r032q940p724
58512F57541o263n760n341m183l595m309m325k280k08j50p86l83p4j059j602k09
$$ plain form
58593 3510354 3285303 3076943 2884643 2707772 2546396 2399466 2265329 2144114 2036998
58584 2036998 1943157 1860110 1786978 1724638 1672666 1628843 1591903 1561981 1538032 1517301 1497767
58573 1497767 1478902 1459877 1439277 1416737 1392676 1366483 1337262 1306251 1276157 1248102 1221396
58562 1221396 1195917 1172167 1149247 1125518 1101215 1077880 1055458 1032702 1010239 990278 973214
58551 973214 957446 942678 930451 921128 913236 906242 901197 898189 895768 893286 891307 889430 886403
58538 886403 882728 880468 880073 879862 878837 877266 874291 867940 858115 846922 835488 823037 809498 796242
58524 796242 783603 770312 756052 742141 729153 716315 703715 692642 683237 674205 665265 657541
58512 657541 651278 645518 640177 635994 632399 628090 623765 621485 621277 621127 620341 619958 619884 618825 617223 617014
58496F17014J173O05j64R15K261J867J334K663L977K803Q28R97K372K329J474
58481F42448J916K925K704K438M147O526P163O964Q115R615R099P265O290N651
58467G23266L566O98j435l713p190r923r962r224j0291j1796j1121r252q598q474
58453F26551p199o170p262q604p589n635n310n325l276o94l14p86O69K832K984
58438E74872K345L568N217M407K635L157M717L812J308P51J795J380j67j10J044
58423F10731Q25K15J981M995O016N694P011R289R647Q905R996J1940J1503R446
58409G08194R004R556Q010N127M141M407K782Np28k35j751m181l872j938k738
58394G35783n829o582m331k854l046k100J79J029O60J969M407M597K855K717M292
$$ plain form
58496 617014 618187 618792 618628 619543 621804 623671 625005 627668 631645 634448 635276 636273 638645 640974 642448
58481 642448 644364 647289 649993 652431 656578 663104 670267 677231 685346 694961 704060 711325 717615 723266
58467 723266 726832 727530 726095 722382 715192 705269 695307 686083 675792 663996 652875 643623 635025 626551
58453 626551 619352 613182 605920 597316 589727 584092 578782 573457 570181 569487 569173 568387 569056 571888 574872
58438 574872 577217 580785 586002 590409 593044 596201 600918 604730 606038 606789 608584 609964 609797 609687 610731
58423 610731 611556 611771 613752 618747 624763 630457 637468 646757 656404 665309 675305 687245 698748 708194
58409 708194 717198 726754 734764 739891 744032 748439 751221 751226 750498 750263 748512 744331 740459 738521 735783
58394 735783 729954 723372 719041 716187 713141 711041 711220 712249 712909 714878 719285 723882 726737 729454 733746
58379G33746M448L181L261M095K609k12l86J905K882K304L245N335N284L606L832
58364G79135N498M984K722K362L456K385pN62L673M832L800M388O419O002L594
58349H33805L566N745N600K852J708K515J532r90q69J698K452J567L191O598O864
58334H77834M463M915Q523R929Q381Q818J1879J2596J0143R303J0989J0847Q485
58321I97105Q555J1310J1690R113Q598J0898J1337R565J0441J3914J4275J0866
58309A127667R311J0685J0029O965O906J0063J0340P003O269R435J0723Q969R810
58296A244175J4052J5624J3522J3899J7856J9229J7016J7597K1866K2870J9239
58285A436945J8080K1288K2101J8704J7973K1876K3553K0995K1117K6117K9254
$$ plain form
58379 733746 738194 741375 744636 748731 751340 751128 750742 752647 755529 757833 761078 766413 771697 775303 779135
58364 779135 784633 789617 792339 794701 798157 800542 800535 801097 804770 809602 813402 817790 824209 830211 833805
58349 833805 837371 843116 848716 851568 853276 855791 857323 856333 855464 857162 859614 861181 864372 870970 877834
58334 877834 882297 887212 895735 905664 914045 922863 934742 947338 957481 966784 977773 988620 997105
58321 997105 1005660 1016970 1028660 1037773 1046371 1057269 1068606 1078171 1088612 1102526 1116801 1127667
58309 1127667 1136978 1147663 1157692 1164657 1171563 1181626 1191966 1198969 1205238 1214673 1225396 1234365 1244175
58296 1244175 1258227 1273851 1287373 1301272 1319128 1338357 1355373 1372970 1394836 1417706 1436945
58285 1436945 1455025 1476313 1498414 1517118 1535091 1556967 1580520 1601515 1622632 1648749 1678003
58274A678003K8420L0227L6264L9227L7150L7287M1478M2192L7673L6057L9662
58263B083640M0473L6284L5579M1071M4404M2707M3997N0491N3387N0291N0587
58252B572911N7296O1167N9244O1007O9353P4320P2913P5694Q6081R3031R2391
58241C375408R4996J05128J12023J11715J15575J27761J36530J37694J43607J58694
58231D619131J70167J73669J83008K03035K19150K25831K38256K62678K83833
58222F578758K95594L14225L46431L75535L95161M23874M69573N13972N50432
58213A0263555O00367O72484P44947Q09546Q91993J005125J126700J249651J406527
58204A8770895J615615J855093K123385K469707K929052L487979M155384N000725
$$ plain form
58274 1678003 1706423 1736650 1772914 1812141 1849291 1886578 1928056 1970248 2007921 2043978 2083640
58263 2083640 2124113 2160397 2195976 2237047 2281451 2324158 2368155 2418646 2472033 2522324 2572911
58252 2572911 2630207 2691374 2750618 2811625 2880978 2955298 3028211 3103905 3189986 3283017 3375408
58241 3375408 3470404 3575532 3687555 3799270 3914845 4042606 4179136 4316830 4460437 4619131
58231 4619131 4789298 4962967 5145975 5349010 5568160 5793991 6032247 6294925 6578758
58222 6578758 6874352 7188577 7535008 7910543 8305704 8729578 9199151 9713123 10263555
58213 10263555 10863922 11536406 12281353 13090899 13982892 14988017 16114717 17364368 18770895
58204 18770895 20386510 22241603 24364988 26834695 29763747 33251726 37407110 42407835
58196D2407835O080637P412434R082769J1297378J4250801J8027838K2669081
58189A31228773K8131293L3983993L9254323M2776065M3601753M0889587L3677856
58182C93543643K1473116N418284j1453474k5624000l4949065l9286627l9733689
58175B69388188l7627056l4095814k9983964k5813379k1830692j8176025j4978240
58168H6883018j2296317j0083918q267873o803492n634718m674717l859897l172120
58160C2089966k590362k070854j585541j128345o72989j70793M05804J059115
58152B5336001J791260K573049L294404L805825L997862L776223K998942J579641
58144D9153207k97197k165730l567742m328868m544358m389959m014742l543092
$$ plain form
58196 42407835 48488472 55900906 64983675 76281053 90531854 108559692 131228773
58189 131228773 159360066 193344059 232598382 275374447 318976200 359865787 393543643
58182 393543643 415016759 420435043 408981569 383357569 348408504 309121877 269388188
58175 269388188 231761132 197665318 167681354 141867975 120037283 101861258 86883018
58168 86883018 74586701 64502783 56234910 49431418 43796700 39121983 35262086 32089966
58160 32089966 29499604 27428750 25843209 24714864 24041875 23871082 24276886 25336001
58152 25336001 27127261 29700310 32994714 36800539 40798401 44574624 47573566 49153207
58144 49153207 48856010 46690280 43122538 38793670 34249312 29859353 25844611 22301519
58136B2301519l065616k613760k187686j804063j486551j230213j013827q34407
58128H065396o98105n92260m97750m16678l60229l21473k85694k55013k38446
58119D399748k29374k15874k01571j94689j88117j71341j50617j37123j26313
58110B784729j08716r0062q1046p7556p0150o3204o5903p3412p5119p3000p4587
58099A931974p6197p0240o1221n7992n7548n2137m4920m3285m3931l9717l4209
58088A350577l4638l7282l4332k8764k8182l0187k7795k3345k3375k5408k3039
58077A034230j8667j8339j9515j6483j2396j3425j6354j4385j0109j0412j3408
58066H70737j2629r429r354j0650q164m431n257q363p701n049o225r660r781q029
$$ plain form
58136 22301519 19235903 16622143 14434457 12630394 11143843 9913630 8899803 8065396
58128 8065396 7367291 6775031 6277281 5860603 5500374 5178901 4893207 4638194 4399748
58119 4399748 4170374 3954500 3752929 3558240 3370123 3198782 3048165 2911042 2784729
58110 2784729 2676013 2585951 2504905 2427349 2357199 2293995 2228092 2154680 2079561 2006561 1931974
58099 1931974 1855777 1785537 1724316 1666324 1608776 1556639 1511719 1468434 1424503 1384786 1350577
58088 1350577 1315939 1278657 1244325 1215561 1187379 1157192 1129397 1106052 1082677 1057269 1034230
58077 1034230 1015563 997224 977709 961226 948830 935405 919051 904666 894557 884145 870737
58066 870737 858108 848679 839325 828675 820511 816080 810823 802460 794759 789710 783485 773825 764044 756015
58052G56015r615j2846j2363r650r891j1641r989o714p017r196p740l817k739
58039F42797l778k296O56O15r68P57M575N527M243M863O168L948j10j023K79p66
58023F65487l168k597m39j565m906n291l031k831m770m994l873m879o779n526
58009F10838k545k759n583o125m172l655m405k833J08L6k439k599l46j47k630
57994E70744m117m212o075r218r662p412o524p551o953m120k156j543K78K972
57980E04451L447J986J954L444L448K150K657M692M749K550J158R41n34k823k983
57965E31287j399j175k043r77J560K160J029J704M329N502M655M393M427J694
57951E57146l253o182n998n609n672l682K47K729L086M191O629P661O787O676
$$ plain form
58052 756015 746400 733554 721191 711541 701650 690009 680020 673306 666289 657093 649353 645536 642797
58039 642797 639019 636723 637379 637994 637026 637783 642358 647885 652128 656991 663159 667107 666997 665974 666253 665487
58023 665487 662319 659722 659283 657718 652812 647521 644490 641659 636889 631895 628022 623143 616364 610838
58009 610838 608293 605534 599951 593826 589654 585999 581594 578761 578869 578905 576466 573867 573521 573374 570744
57994 570744 566627 562415 556340 547122 537460 530048 523524 515973 509020 504900 502744 501201 501479 504451
57980 504451 507898 509884 511838 515282 518730 520880 523537 528229 532978 535528 536686 537627 537093 534270 531287
57965 531287 529888 528713 526670 525693 527253 529413 530442 532146 536475 541977 546632 551025 555452 557146
57951 557146 553893 547711 541713 536104 530432 526750 526997 529726 532812 537003 543632 551293 558080 564756
57937E64756P721P077M096J483J04k259o113r123j0569j2252j4318j4872j4116
57924E01615j4307j5238j4471j2134j0712j0098p818m203k185j884n82J861K847
57911D12691K462L547O093P057O164O400Q145Q425O686N737O103M995J944L1L34
57896D86814L98o57p81J29o65l466n106m518m296n457n812m859n116p064p849
57881D31695o590n908o680o356m214l156m325m873l210j556j239j98K572M704
57867C90666M909N293P043Q158P724Q064J0218J1532J0123P794O239M416J899
57854D84078O81J194N68k546n323n501n058o347q186q589q205q372q516p972p551
57839D04355p311n718k865j392k297l124k216j336j936k418j467p96j996l628
$$ plain form
57937 564756 572477 579554 583650 585133 585237 582978 576865 567742 557173 544921 530603 515731 501615
57924 501615 487308 472070 457599 445465 434753 424655 416837 412634 410449 408565 407983 409844 412691
57911 412691 415153 418700 424793 431850 438014 444414 452559 460984 467670 473407 479510 484505 486449 486480 486814
57896 486814 487212 486555 485774 485903 485238 481772 476666 472148 467852 462395 456583 451724 446608 439544 431695
57881 431695 425105 419197 412517 406161 401947 398791 394466 389593 386383 384827 383588 383390 385962 390666
57867 390666 395575 400868 407911 416069 423793 431857 442075 453607 463730 471524 477763 482179 484078
57854 484078 484759 485953 486521 483975 478652 473151 468093 461746 453560 444971 436766 428394 419878 411906 404355
57839 404355 397044 391326 388461 387069 384772 381648 379432 378096 376160 373742 372275 371479 369483 365855
57825C65855m019m098n160o423o990p693q921r268q239p605q247q436p044n544
57811B68168n145m830l991l947m989n089l512k536l486m226k845p74J62Q58K623
57796B26441M499N350O128P884R792J1176J2977J5414J6807J6476J6052J6270
57784C65266J5449J3063J1447J1760J1557Q818N284L158J469j481m843p170r140
57771D24637j1531j3006j2488j1512j1597j1694j0546r174q522p226m283j529
57759C11529p40o79M34J866K436L124M849N958M871L113K912L792M213M375M777
57744C56830M171J891P2O79K285K655K421L233M327M098L300L541M220L962L578
57729D01263M521N936O122N572N695N987N340M694N480O812P085O958P910R207
$$ plain form
57825 365855 361836 357738 352578 346155 339165 331472 322551 313283 305044 297439 289192 280756 273712 268168
57811 268168 263023 258193 254202 250255 245266 240177 236665 234129 230643 226417 223572 222798 222960 223818 226441
57796 226441 230940 236290 242418 250302 260094 271270 284247 299661 316468 332944 348996 365266
57784 365266 380715 393778 405225 416985 428542 437360 442644 445802 447271 445790 440947 433777 424637
57771 424637 413106 400100 387612 376100 364503 352809 342263 333089 324567 317341 313058 311529
57759 311529 310789 310110 310544 312410 314846 317970 322819 328777 333648 336761 339673 343465 347678 352053 356830
57744 356830 361001 362892 362964 363643 365928 368583 371004 374237 378564 382662 385962 389503 393723 397685 401263
57729 401263 405784 411720 417842 423414 429109 435096 440436 445130 450610 457422 464507 471465 479375 488582
57715D88582R403R557J1783J5570J8553K0134K1535K3106K4343K5829K8449L1438
57703G28282L3605L5766L9497M4419M9199N4249O0967O9165P7777Q7257R8881
57692A379064J12448J27147J43695J63201J84663K06087K27214K48720K69431
57683C061670K86535K97661L00480K91439K67760K30238J82100J26196O5641N901
57673E115621m6878q9170j19572j36375j38758j29856j15749j01899r2863r4203
57663D050298j10382j39871j74766k05828k26631k34043k28229k12860j92957
57654B324731j71561j49503j27761j07831r0042p3612n8548m5739l5280k6334
57644A438520j8386j1214m071L518J0849J7456K4564L3365M2872N1556O0188P0838
$$ plain form
57715 488582 497985 507542 519325 534895 553448 573582 595117 618223 642566 668395 696844 728282
57703 728282 761887 797653 837150 881569 930768 985017 1045984 1115149 1192926 1280183 1379064
57692 1379064 1491512 1618659 1762354 1925555 2110218 2316305 2543519 2792239 3061670
57683 3061670 3348205 3645866 3946346 4237785 4505545 4735783 4917883 5044079 5109720 5115621
57673 5115621 5068743 4979573 4860001 4723626 4584868 4455012 4339263 4237364 4144501 4050298
57663 4050298 3939916 3800045 3625279 3419451 3192820 2958777 2730548 2517688 2324731
57654 2324731 2153170 2003667 1875906 1768075 1678033 1604421 1545873 1500134 1464854 1438520
57644 1438520 1420134 1408920 1404849 1408367 1419216 1436672 1461236 1494601 1537473 1589029 1649217 1720055
57632A720055Q3821R7973J13198J30337J48927J67546J86036K05077K23780K39706
57622C316456K50855K55605K51190K34792K06039J66595J17823O1081m1o0249
57612D800146j15380j62996k00849k27259k42901k50019k49876k42872k30691
57603B877303k16004k00137j83108j65784j49811j35586j22391j10403j00387
57594A493692r1607q2367p2663o4101n7232n1086m5353m0797l7275l3616k9749
57583H87846k6889k5310k3862k1957k0173j8615j6542j4010j2099j1172j0453
57572F86764r519q674p739o086m016k590j993j425n59K77J220K656M157N097O034
57557F63604P909J0310J2125J3432J5028J6668J7682J8773K1070K3858K5510K6402
$$ plain form
57632 1720055 1803876 1901849 2015047 2145384 2294311 2461857 2647893 2852970 3076750 3316456
57622 3316456 3567311 3822916 4074106 4308898 4514937 4681532 4799355 4860436 4860395 4800146
57612 4800146 4684766 4521770 4320921 4093662 3850761 3600742 3350866 3107994 2877303
57603 2877303 2661299 2461162 2278054 2112270 1962459 1826873 1704482 1594079 1493692
57594 1493692 1402085 1319718 1247055 1182954 1125722 1074636 1029283 988486 951211 917595 887846
57583 887846 860957 835647 811785 789828 769655 751040 734498 720488 708389 697217 686764
57572 686764 677245 668571 660832 654746 650730 648140 646147 644722 644163 644440 645660 648316 652473 657570 663604
57557 663604 671513 681823 693948 707380 722408 739076 756758 775531 796601 820459 845969 872371
57545H72371K8604L2802L7805M3022M9122N6113O3135P0436P9455R0526J02471
57534A525862J14694J27916J42484J57670J72713J86778J97979K04161K04559
57525C034816J98810J84787J59767J23926Q0561L2993j6450o4540j07057j41420
57515C486193j67489j85420j94878j96632j92741j84594j72690j58552j44559
57506A888638j31455j18170j04539r1960q0945p0414o0085n1289m4532l8475l2227
57495A064547k6593k2088j7678j2630p763l813j16M037Q220J1942J5571J9395
57483A033031K3114K6918L1797L8201M5597N3710O2867P2947Q3470R4886J08202
57472A674740J23152J38425J53642J69128J83587J94151J99083J98191J90210
$$ plain form
57545 872371 900975 933777 971582 1014604 1063726 1119839 1182974 1253410 1332865 1423391 1525862
57534 1525862 1640556 1768472 1910956 2068626 2241339 2428117 2626096 2830257 3034816
57525 3034816 3233626 3418413 3578180 3702106 3782667 3815660 3799210 3734670 3627613 3486193
57515 3486193 3318704 3133284 2938406 2741774 2549033 2364439 2191749 2033197 1888638
57506 1888638 1757183 1639013 1534474 1442514 1361569 1291155 1231070 1179781 1135249 1096774 1064547
57495 1064547 1037954 1015866 998188 985558 977795 973982 973866 977903 986123 998065 1013636 1033031
57483 1033031 1056145 1083063 1114860 1153061 1198658 1252368 1315235 1388182 1471652 1566538 1674740
57472 1674740 1797892 1936317 2089959 2259087 2442674 2636825 2835908 3034099 3224309
57463C224309J72330J43322J05194O0921J2540l7640q5929j28614j63134j87690
57453C115609k01691k07059k06977k02590j92964j78849j63763j50184j37127
57444A474405j23072j09075r7125q7261p8276o9961o2855n6771n1038m5519m0370
57433F53082l5644l1838k9661k8554k6756k3587k0354j8287j7012j5853j5055
57422C90481j4764j4142j2577j0642r072p931p301p433p720p045n657n052n536
57409B75609n676m798m030m144m309l887l519l499l020k019j715k256k045n57
57395B30135L94l20j128n33K49m35j622j360L4O57Qp96j108j215j165p71l31k17
57377B20476k35k54o87j544k004j728j485j697j705j291j400k382l014k388j328
$$ plain form
57463 3224309 3396639 3539961 3645155 3706076 3718616 3680976 3595047 3466433 3303299 3115609
57453 3115609 2913918 2706859 2499882 2297292 2104328 1925479 1761716 1611532 1474405
57444 1474405 1351333 1242258 1145133 1057872 979596 909635 846780 790009 738971 693452 653082
57433 653082 617438 585600 555939 527385 500629 477042 456688 438401 421389 405536 390481
57422 390481 375717 361575 348998 338356 329284 321353 314052 306619 298899 291854 286197 281145 275609
57409 275609 269933 265135 261105 256961 252652 248765 245246 241747 238727 236708 234993 232737 230692 230135
57395 230135 230529 230209 229081 228548 228797 228362 226740 225380 225414 226071 226079 225283 224175 222960 221795 221024 220693 220476
57377 220476 220241 219987 219300 217756 215752 214024 212539 210842 209137 207846 206446 204064 201050 198662 197334
57362A97334q00n60m50j262k957l827k991k038k479l307k904j726j067o21N53
57347A70898J802J864J114Q33J030R24P65J307K214K695L018L688M085L537K856
57332B02630K976L082J963M00R2Q77J161N86K67O94J316J930K702L063K346J302
57316B27387J381K594L595L723L549L623M029M937O294P293P359P277Q094R412
57302C00547J0027R821R652R905J0421J1372J2888J4315J5107J5965J7745J9971
57290D57736K1729K3339K5641K8255L0240L1814L3777L5702L6395L5744L4484
57279G94856L2519K9187K4766J9988J4400O996j677r887j7062k4080l1200l7432
57267H01374m2055m5184m6729m6363m4668m2855m0991l8026l3810k9780k7103
$$ plain form
57362 197334 196534 195974 195524 194262 191305 187478 184487 182449 179970 176663 173759 172033 170966 170345 170898
57347 170898 172700 174564 175678 176511 177541 178465 179230 180537 182751 185446 188464 192152 196237 199774 202630
57332 202630 205606 208688 210651 211051 211143 212020 213181 213767 214034 214728 216044 217974 220676 223739 226085 227387
57316 227387 228768 231362 234957 238680 242229 245852 249881 254818 261112 268405 275764 283041 291135 300547
57302 300547 310574 320395 330047 339952 350373 361745 374633 388948 404055 420020 437765 457736
57290 457736 479465 502804 528445 556700 586940 618754 652531 688233 724628 760372 794856
57279 794856 827375 856562 881328 901316 915716 922712 921035 911148 894086 870006 838806 801374
57267 801374 759319 714135 667406 621043 576375 533520 492529 454503 420693 390913 363810
57256C63810k5385k3561k1145j8257j5252j2692j0932r610q107o466n198m429
57244B02776l931l658l547l053j865o68l52p24q98o33l34j27K12O36R81J350J611
57227A87776J093l63j707j953j508j172p14L98J509J534P30L22P02J231J571J917
57211A91366K218K239K198K417K689K859L402M536N470N648N836O738P473O913
57197B52002N779N646O529P068O748O239N851N334M950N319O313P336Q366R520
57183C43000J0166R858R527J0214J1248J1284J0607J0610J1435J2096J2474J3304
57171D75823J4334J4467J3759J3367J3512J3291J2623J2528J3257J3877J4053
57160F24891J4608J5937J7323J8272J9152K0115K0653K0566K0325K0198J9940
$$ plain form
57256 363810 338425 314864 293719 275462 260210 247518 236586 226976 218869 212403 207205 202776
57244 202776 198845 195187 191640 188587 186722 186054 185702 184978 184080 183447 183113 182986 183198 183834 184815 186165 187776
57227 187776 188869 188506 186799 184846 183338 182166 181452 181850 183359 184893 185623 185945 186647 187878 189449 191366
57211 191366 193584 195823 198021 200438 203127 205986 209388 213924 219394 225042 230878 237616 245089 252002
57197 252002 257781 263427 269956 277024 283772 290011 295862 301196 306146 311465 317778 325114 333480 343000
57183 343000 353166 363024 372551 382765 394013 405297 415904 426514 437949 450045 462519 475823
57171 475823 490157 504624 518383 531750 545262 558553 571176 583704 596961 610838 624891
57160 624891 639499 655436 672759 691031 710183 730298 750951 771517 791842 812040 831980
57149H31980J9460J8915J8228J7436J7238J8162J9527K0359K0925K2085K3578
57138A047893K4456K4809K5573K6738K7378K7317K7270K7331K6814K5662K4713
57127A335954K4335K3986K3182K2004K0701J9627J9206J9153J8353J6481J4907
57116A557889J4798J5223J4639J3375J2981J3812J5037J6573J9246K3511K9652
57105A746736L9071N3871P5086J02128J33414J66927K01527K38977K83597L38821
57095C380155M05336M83034N72396O72666P81265Q96717J019064J145225J266849
57086A0622707J375142J464517J529505J562985J560694J521663J441305J316268
57078B2394786J169065J058408J039035J097997J139312J043275P45630K69508
$$ plain form
57149 831980 851440 870355 888583 906019 923257 941419 960946 981305 1002230 1024315 1047893
57138 1047893 1072349 1097158 1122731 1149469 1176847 1204164 1231434 1258765 1285579 1311241 1335954
57127 1335954 1360289 1384275 1407457 1429461 1450162 1469789 1488995 1508148 1526501 1542982 1557889
57116 1557889 1572687 1587910 1602549 1615924 1628905 1642717 1657754 1674327 1693573 1717084 1746736
57105 1746736 1785807 1839678 1914764 2016892 2150306 2317233 2518760 2757737 3041334 3380155
57095 3380155 3785491 4268525 4840921 5513587 6294852 7191569 8210633 9355858 10622707
57086 10622707 11997849 13462366 14991871 16554856 18115550 19637213 21078518 22394786
57078 22394786 23563851 24622259 25661294 26759291 27898603 28941878 29687508 29957016
57070B9957016k99120q57626j326377j670975j899125k034904k094098k082018
57062A7692773k006108j881308j724256j548989j368316j193549j031239q83465
57054F055543p51600o37087n39188m55546l85169l28195k82958k45971k14799
57045B215030j88788j67244j49131j34149j22082j11426j00648r0214q1488p4208
57035I95652o7010n9748n3368m7981m2991l8609l5451l3055l0383k7318k4357
57024E35381k1523j8941j7463j7318j7073j5444j3165j1554j0455r056p618o668
57012C69103n578l722j901r78j20J931M891P947J1585J6744K3284L0979M0921
56999D95086N4389P1518R2343J17363J45194J71290J90619J99316J91655J59059
$$ plain form
57070 29957016 29657896 28800270 27473893 25802918 23903793 21868889 19774791 17692773
57062 17692773 15686665 13805357 12081101 10532112 9163796 7970247 6939008 6055543
57054 6055543 5303943 4666856 4127668 3672122 3286953 2958758 2675800 2429829 2215030
57045 2215030 2026242 1858998 1709867 1575718 1453636 1342210 1241562 1151348 1069860 995652
57035 995652 928642 868894 815526 767545 724554 685945 650494 617439 587056 559738 535381
57024 535381 513858 494917 477454 460136 443063 427619 414454 402900 392445 383389 375771 369103
57012 369103 363525 359803 357902 356924 356804 358735 363626 371573 383158 399902 423186 454165 495086
56999 495086 549475 620993 713336 830699 975893 1147183 1337802 1537118 1728773 1887832
56989A887832R7597J6514o4384j26953j63504j76033j71326j57149j39507j21346
56979H81741j04242r0479q1645p6070p0276o2873n5020m7469l9659l1607k4337
56968A98064j8172j2502p334l208K56L985P845J1128J4285J8259K2576K5957K8409
56955B89548L0419L0469K5846J6176M260o708j5043k0095k2055k2291k2027k0682
56943B67817j7182j2518q895o643m157p50K719O136J0628J6436K2254K7127L1135
56930C34107L3986L4710L2851K8273J9895O940q381k1605l0031l4270l5690l4611
56918C26174l1526k7905k4640k1230j7249j3358j0227p736n759m511l869l386
56906A54778l150l381l346k087j37J047J265J589K304K619K487K854L879M669
$$ plain form
56989 1887832 1985429 2001943 1937559 1810606 1647102 1471069 1299743 1142594 1003087 881741
56979 881741 777499 687020 605375 529305 459029 396156 341136 293667 254008 222401 198064
56968 198064 179892 167390 160056 156848 157104 161089 168934 180062 194347 212606 235182 261139 289548
56955 289548 319967 350436 376282 392458 396718 390010 374967 354872 332817 310526 288499 267817
56943 267817 250635 238117 229222 222579 218422 217672 220391 226527 237155 253591 275845 302972 334107
56930 334107 368093 402803 435654 463927 483822 490762 482381 460776 430745 396475 360785 326174
56918 326174 294648 266743 242103 220873 203624 190266 180039 172303 166544 162033 158164 154778
56906 154778 151628 148247 144901 142814 142677 143724 144989 146578 148882 151501 153988 156842 160721 165390
56892A65390N072N980P618R249J0912J3668J7575K0972K2233K0956J7096J0529
56880C27250J909p209j5442k1780k4989k4381k1141j7340j3563r007l692J265
56868A71880N596J0273J5765K1636K8033L5841M4986N4166O2434O9427P3882P3510
56856F67429O6461N1913L0012L324k2227m0577n0155n3575n3133m9115m2219l4380
56844D73758k6367j7247p068K474J0984K0512L2673M6869O2305P9224R6706J11355
56832H86178J19633J19634J09424Q6285M9988N736l7927p3560r6939j07095j06246
56821I55111r8654q7952p5709o2755n0260l8719k7361j5577l764Q042K0915L5418
56809E58735N0442O4353P6041Q4112Q6314Q0473O5165L9771O088k9690n9103p7140
$$ plain form
56892 165390 170462 176442 184060 193309 204221 217889 235464 256436 278669 299625 316721 327250
56880 327250 329159 321950 306508 284728 259739 235358 214217 196877 183314 174307 170615 171880
56868 171880 177476 187749 203514 225150 253183 289024 334010 388176 450610 520037 593919 667429
56856 667429 733890 785803 815815 819139 796912 756335 706180 652605 599472 550357 508138 473758
56844 473758 447391 430144 423076 425550 436534 457046 489719 536588 598893 678117 774823 886178
56832 886178 1005811 1125445 1234869 1321154 1371142 1376878 1338951 1265391 1168452 1061357 955111
56821 955111 856457 768505 692796 630041 579781 541062 513701 498124 494360 502402 523317 558735
56809 558735 609177 673530 749571 833683 919997 1000470 1065635 1105406 1111494 1081804 1022701 945561
56797I45561q4756q5433q1376p3818o4498n4758m4686l4498k5421j8003j1050
56786C67264l412M513J2183K0225K8952L7005M2662M5208M3873L6939K3528N460
56774F64400j3683l0496m2345m7929m8372m6510m3919l9946l4296k8646k4566
56763B63692k1539j8439j5429j3047j0878q549o699n702m694l114j823j497j391
56750A50891q39m62p15q35n16q68k250k948j750j19O0o03l79O39J031N55R7p8
56732A40911l33n61n45p25j320j556j028p50j515k360k094j229r48j214j382j562
56716A21789j927j744o25K91m2q03o51J61N12K68J5j78l48J6R21J251M42m70o17
56697A18261p52j525j952j165k37l67p49j60O70L28p24r61k78K51K30l7m72o58
$$ plain form
56797 945561 860805 775372 693996 620178 555680 500922 456236 421738 396317 378314 367264
56786 367264 363852 368365 380548 400773 429725 466730 509392 554600 598473 635412 658940 664400
56774 664400 650717 620221 577876 529947 481575 435065 391146 351200 316904 288258 263692
56763 263692 242153 223714 208285 195238 184360 175811 169112 163410 158716 155602 153779 152282 150891
56750 150891 150052 149590 148875 148040 147524 146656 144406 141458 139708 139589 139649 139046 138667 139306 140337 140892 140989 140911
56732 140911 140578 140017 139472 138747 137427 135871 134843 134093 132578 130218 128124 126895 125947 124733 123351 121789
56716 121789 119862 118118 117493 117784 117742 116939 116288 116449 116961 117229 117244 117066 116718 116734 117655 118906 119348 118878 118261
56697 118261 117509 115984 114032 112867 112630 112263 111514 111354 112024 112352 111628 110667 110389 110640 110870 110833 110361 109703
56679A09703M17K555L685K707J444J792K709K291J245J501K636K595J126k05q64
56664A35337j548k081j676q71r26j570j609j226j504k171k098j612j928k702k450
56649A09365j141j29J47K32j30j534l051l122k085j599j890j839j418j540j852
56634H8414j133J00N3j255j866j055j78o6J18R45J812K433L272M040L720K494
56618A01848J860K390L145L502L864M250L953K953K120J796J614J728K607L644
56604A41274L647K713K028J876J560J099J197J650J554J006Q80R76L22q57j360
56589A59565j032p44n51J65Q85M86n29m86P00J361P81M8n4O1J52N06Q39O59O72
56570A63484J860L396L545K582K439L494M099L498K780K632K527K468L293M734
$$ plain form
56679 109703 110120 112675 116360 119067 120511 122303 125012 127303 128548 130049 132685 135280 136406 136201 135337
56664 135337 133789 131708 130032 129161 128235 126665 125056 123830 122326 120155 118057 116445 114517 111815 109365
56649 109365 108224 108095 108242 108474 108344 106810 103759 100637 98552 96953 95063 93224 91806 90266 88414
56634 88414 87281 87381 87434 86179 84313 83258 83080 83014 83132 84077 85889 88322 91594 95634 99354 101848
56618 101848 103708 106098 109243 112745 116609 120859 124812 127765 129885 131681 133295 135023 137630 141274
56604 141274 144921 147634 149662 151538 153098 154197 155394 157044 158598 159604 160484 161460 161782 160925 159565
56589 159565 158533 157789 157238 157403 158288 158774 158245 157759 158459 159820 160601 160649 160595 160656 160808 161314 162153 162812 163484
56570 163484 165344 168740 172285 174867 177306 180800 184899 188397 191177 193809 196336 198804 202097 206831
56556B06831N391N068M996N421N133L873K934K870K725K066J707J911J857J335
56542B54118J002O95n05k266l248l426l965m725m419l358l273m110l891k369j763
56527B14497k988m127l865l536m339n144m668l624l080k766k355k506l202l075
56513A65222j622l31l72r36j043j100j515j563q52k70l37k80K77M32k30p13l98
56496A54369o3k99n47m74n77q11m77M4m30j443j078P94J996J600J237J926K341
56479A58108J621J204K232L491L655L275L077K464J347J216K685M043L928L338
56465A95684L400L371K575K169L040L970L768L298L569L689K699J560J405J507
56451B35704R56N63J215J963J642R19Q47R76O48O07J440K016J321L33K74M83j80
$$ plain form
56556 206831 212222 217290 222286 227707 232840 236713 239647 242517 245242 247308 249015 250926 252783 254118
56542 254118 255120 255815 255310 253044 249796 246370 242405 237680 233261 229903 226630 222520 218629 216260 214497
56527 214497 211509 207382 203517 199981 195642 190498 185830 182206 179126 176360 174005 171499 168297 165222
56513 165222 163600 163269 162897 161961 160918 159818 158303 156740 155888 155618 155281 155001 155278 155710 155480 154767 154369
56496 154369 154306 154007 153460 152986 152409 151598 151121 151165 150735 149292 148214 149008 151004 152604 153841 155767 158108
56479 158108 159729 160933 163165 166656 170311 173586 176663 179127 180474 181690 184375 188418 192346 195684
56465 195684 199084 202455 205030 207199 210239 214209 217977 221275 224844 228533 231232 232792 234197 235704
56451 235704 236660 237223 238438 240401 242043 242962 243809 244785 245433 246040 247480 249496 250817 251150 251424 251907 251727
56434B51727j211j545j402j418j339j020j275k274k694j954j488k284l135k949
56420B25739k789l640m173k922q64L60J041K022K364Q63j507k976l709m916o411
56405A98482p121p016o659n833m395l330l205k887j463p5q4q03q69m76l50L3J343
56388A55292K711L016K651K428K123J580J661K526K729J707J216K459L829L536
56374A89464K508K357K484J668P97J359K718L350L408L724L690K550J344J233
56360B22654J226n4j777k320j912j567r55M46J575J473J161J623J702M24n16O50
56344B23833K554K886K185K448L524L957M020M882O004O237O297P323Q302P783
56330B92235O779P014P712P174O164O473P494P446O880P523Q764Q630P386O866
$$ plain form
56434 251727 250516 248971 247569 246151 244812 243792 242517 240243 237549 235595 234107 231823 228688 225739
56420 225739 222950 219310 215137 212215 211351 211711 212752 214774 217138 218001 216494 213518 209809 204893 198482
56405 198482 191361 184345 177686 171853 167458 164128 160923 158036 156573 156498 156414 155611 154742 154266 153916 153949 155292
56388 155292 158003 161019 163670 166098 168221 169801 171462 173988 176717 178424 179640 182099 185928 189464
56374 189464 191972 194329 196813 198481 199278 200637 203355 206705 210113 213837 217527 220077 221421 222654
56360 222654 223880 223826 222049 219729 217817 216250 215295 215741 217316 218789 219950 221573 223275 223699 223183 223833
56344 223833 226387 229273 231458 233906 237430 241387 245407 250289 256293 262530 268827 276150 284452 292235
56330 292235 299014 306028 313740 320914 327078 333551 341045 348491 355371 362894 371658 380288 387674 394540
56316C94540P059O580N713N677N705M099J502m3n63j605k972l261k844l172l784
56301D12631l231k196k459l455l160j706q45m75Q66K691L172K614L024M531N498
56286D17500N738O449P387P357P048Q190J0361J1761J2608J4553J7298J9144K0345
56273E65739K2508K5252K6830K7639K9671L2985L6142L9540M4881N1696N8073
56262I60956O4333P2410Q2066R1410J00698J11810J24204J35297J44630J53838
56252B041652J62646J68726J71530J72339J70543J63709J51567J36220J18332
56243C457264R6831P2472M8014K4624J682j9814l7348n0513o0985o8946p3119
56232C390162p4288p5057p6088p6182p5886p7158p9704q1559q3186q6870r2206
$$ plain form
56316 394540 401599 408179 413892 419569 425274 429373 430875 430832 430269 428664 425692 422431 419587 416415 412631
56301 412631 409400 407204 404745 401290 398130 396424 395579 395104 395970 398661 401833 404447 407471 412002 417500
56286 417500 423238 429687 437074 444431 451479 459669 470030 481791 494399 508952 526250 545394 565739
56273 565739 588247 613499 640329 667968 697639 730624 766766 806306 851187 902883 960956
56262 960956 1025289 1097699 1179765 1271175 1371873 1483683 1607887 1743184 1887814 2041652
56252 2041652 2204298 2373024 2544554 2716893 2887436 3051145 3202712 3338932 3457264
56243 3457264 3554095 3626567 3674581 3699205 3700887 3681073 3643725 3593212 3532227 3463281 3390162
56232 3390162 3315874 3240817 3164729 3088547 3012661 2935503 2855799 2774240 2691054 2604184 2511978
56221B511978r6352r8703j01085j03355j03328j01239r9758r9198r7110r2990
56211A518860q8944q5262p9868p2748o6490o1683n6162m9507m4007m0404l6844
56200H36941l2716k9441k6938k3556j9898j8365j8482j7149j3968j1651j0817
56189F13960r157o327m677m479l360j195n02j203k09K839M711M523N192P703R310
56174F17129Q966R175J0844J1455J0066R047R086P699M419K358K693K594O60p46
56160G05445m27n40j852j882J30J412R28J359L827N656N612O268Q902J1139J1971
56145G57948J4086J8736K3275K6212K9934L5998M2559M8754N6910O8134Q0486
56134A203032R3439J09058J26710J41713J51325J56888J58325J52371J38660J21978
$$ plain form
56221 2511978 2415626 2316923 2215838 2112483 2009155 1907916 1808158 1708960 1611850 1518860
56211 1518860 1429916 1344654 1264786 1192038 1125548 1063865 1007703 958196 914189 873785 836941
56200 836941 804225 774784 747846 724290 704392 686027 667545 650396 636428 624777 613960
56189 613960 604803 598476 593799 589320 585960 584765 584263 583060 582851 585690 590401 594924 600116 607819 617129
56174 617129 626095 635270 646114 657569 667635 676682 685768 693467 697886 700244 702937 705531 706191 705445
56160 705445 705018 704478 702626 700744 700874 702286 703214 704573 708400 714056 719668 725936 734838 745977 757948
56145 757948 772034 790770 814045 840257 870191 906189 948748 997502 1054412 1122546 1203032
56134 1203032 1296471 1405529 1532239 1673952 1825277 1982165 2140490 2292861 2431521 2553499
56124B553499J06105R0875P7110O8118O3414N7174M5886L2082J8185L023j2805
56113C102666k4729l0960l5690m2635n1341o2344p9005j00640j20372j33406j41393
56102B280151j45600j42972j32809j20411j09589r8046q4104p1413o2642n4992
56092A257573m6356l9520l6073l2577k7079k2769k1176j8603j3503j0185j0787
56081I78945j0830p379m167l847k845R79L435K123J686N235Q305P249N904P781
56067I92574R405P694O330Q366J0080Q550P664J0157J1681R344P981J1029J3615
56054A114470J1855J0508J3811J7211J6121J4461J6392J8089J5946J4490J7536
56043A280890K0119J7896J5861J8754K1710J9786J7831K1121K5103K4511K3834
$$ plain form
56124 2553499 2659604 2750479 2827589 2895707 2959121 3016295 3062181 3094263 3112448 3115471 3102666
56113 3102666 3077937 3046977 3011287 2968652 2917311 2854967 2775962 2675322 2554950 2421544 2280151
56102 2280151 2134551 1991579 1858770 1738359 1628770 1530724 1446620 1375207 1312565 1257573
56092 1257573 1211217 1171697 1135624 1103047 1075968 1053199 1032023 1013420 999917 989732 978945
56081 978945 968115 960736 956569 952722 949877 950856 954291 956414 958100 963335 971640 978889 984793 992574
56067 992574 1001979 1009673 1016003 1024369 1034449 1042999 1050663 1060820 1072501 1081845 1089826 1100855 1114470
56054 1114470 1126325 1136833 1150644 1167855 1183976 1198437 1214829 1232918 1248864 1263354 1280890
56043 1280890 1301009 1318905 1334766 1353520 1375230 1395016 1412847 1433968 1459071 1483582 1507416
56032A507416K8366L3673L4388L4651L9216M3230M1680L9798M3024M6059M3225
56021A934726M0038M2654M5782M3345M0914M4844M9289M7343M4760M8814N4064
56010B436573N3413N2685N9304O7241O8510O8821P6088Q4471Q6058Q7046R5503
55999C235713J04678J06068J07003J16947J28671J32119J34368J45803J59415
55990D370785J64794J69434J84187K01098K08661K15117K32655K53069K64335
55981F264135K76171L02257L32764L53046L73364M10004M53899M90036N29953
55972I785629N90574O59728P19906P86599Q82977R97557J110827J241860J420774
55963A8196431J638600J878012K169730K560315L050223L629329M346115N270014
$$ plain form
56032 1507416 1535782 1569455 1603843 1638494 1677710 1720940 1762620 1802418 1845442 1891501 1934726
56021 1934726 1974764 2017418 2063200 2106545 2147459 2192303 2241592 2288935 2333695 2382509 2436573
56010 2436573 2489986 2542671 2601975 2669216 2737726 2806547 2882635 2967106 3053164 3140210 3235713
55999 3235713 3340391 3446459 3553462 3670409 3799080 3931199 4065567 4211370 4370785
55990 4370785 4535579 4705013 4889200 5090298 5298959 5514076 5746731 5999800 6264135
55981 6264135 6540306 6842563 7175327 7528373 7901737 8311741 8765640 9255676 9785629
55972 9785629 10376203 11035931 11755837 12542436 13425413 14422970 15533797 16775657 18196431
55963 18196431 19835031 21713043 23882773 26443088 29493311 33122640 37468755 42738769
55955D2738769O422342P839235R675606J2143159J5368272J9403044K4277282
55948A37867709K9796766L5256959L9563006M1681197M0768516L5903861K6274065
55941C87112079J2205335m048243j9044218l0005585l6050731l7895255l6812049
55934B35461333l3964658l0266509k6348363k2532298j8954256j5732904j2974413
55927G4687932j0685209q794620p251010o026277n057029m260826l599859l070192
55919B5942910k644283k278783j963574j710895j507725j324748j159946j029514
55911A2323442r26238q27372p33564o61404o06450n49705m92357m49701m18356
55902F658295l82069l43062l16337k99227k76405k49273k31843k22583k07640
$$ plain form
55955 42738769 49161111 57000346 66675952 78819111 94187383 113590427 137867709
55948 137867709 167664475 202921434 242484440 284165637 324934153 360838014 387112079
55941 387112079 399317414 395269171 376224953 346219368 310168637 272273382 235461333
55934 235461333 201496675 171230166 144881803 122349505 103395249 87662345 74687932
55927 74687932 64002723 55208103 47957093 41930816 36873787 32612961 29013102 25942910
55919 25942910 23298627 21019844 19056270 17345375 15837650 14512902 13352956 12323442
55911 12323442 11397204 10569832 9836268 9174864 8568414 8018709 7526352 7076651 6658295
55902 6658295 6276226 5933164 5616827 5317600 5041195 4791922 4560079 4337496 4129856
55893D129856j87495j74430j67712j56170j41314j34036j32027j23573j10222
55884B802877j03441j02215r5654q4659p9779q0352p6332o8248o5360o6435o1987
55873A918415n3424n0733n3001n0141m2421l9762m2675m1943l6654l5110l8010
55862A434541l7550l3185l2189l4402l2070k4990k0721j9615j4478n345J5O33
55850A180644L154P663O636j131q734j4022k1275k9558l2271k9312k7530k8291
55838A005973k6429k1941k0681k2795k2277j8737j8013k0505k0396j7216j6658
55827G80325j9080j8611j4728j3452j5784j6060j3184j2594j5434j6393j4053
55816F10952j3052j4227j2726p873n057n810n515k698j277j853j94L856N185K888
$$ plain form
55893 4129856 3942361 3767931 3600219 3444049 3302735 3168699 3036672 2913099 2802877
55884 2802877 2699436 2597221 2501567 2416908 2337129 2256777 2180445 2112197 2046837 1980402 1918415
55873 1918415 1864991 1814258 1761257 1711116 1668695 1628933 1586258 1544315 1507661 1472551 1434541
55862 1434541 1396991 1363806 1331617 1297215 1265145 1240155 1219434 1199819 1185341 1179996 1180011 1180644
55850 1180644 1183798 1191461 1198097 1196966 1188232 1174210 1152935 1123377 1091106 1061794 1034264 1005973
55838 1005973 979544 957603 936922 914127 891850 873113 855100 834595 814199 796983 780325
55827 780325 761245 742634 727906 714454 698670 682610 669426 656832 641398 625005 610952
55816 610952 597900 583673 570947 563074 558017 552207 546692 543994 542717 540864 540670 544526 549711 552599
55802E52599J824L043J874k556n107m147m348p658j0132j0128j1104j3846j4190
55789D76124j1108r085r930j0019p928p084q331p747m255j940k243j414J833L507
55775D00380J778j22q45l566q939j2556j2332j1703j2772j2964j1036r773r983
55762B95567q455m574k473l837m988l834l317n150o448n658n682p984r457q252
55748B15458p095p788p891n880m179m256l862j929j014k206k687j024K08m88q28
55733A64539M71J289P96J412L668M348K128K6k13r47l443n101m443l823m507m234
55717A51966k194j341k910l744j920j06l87o31R54K445K419K975N417P323O942
55702A67208O280O951P111N331L416K672J517o30j441j25N46p90j602n35l00k594
$$ plain form
55802 552599 554423 557466 559340 556784 551677 547530 543182 535524 525392 515264 504160 490314 476124
55789 476124 465016 455931 446001 435982 428054 420970 412639 404892 400637 398697 396454 395040 396873 400380
55775 400380 402158 402036 401191 397625 388686 376130 363798 352095 339323 326359 315323 305550 295567
55762 295567 287112 282538 280065 276228 271240 267406 264089 258939 252491 246833 241151 233167 223710 215458
55748 215458 208363 200575 192684 186804 182625 178369 174507 172578 171564 169358 166671 165647 165855 165367 164539
55733 164539 165010 166299 167095 168507 172175 176523 178651 178677 178464 177517 174074 168973 164530 160707 156200 151966
55717 151966 149772 148431 145521 141777 139857 139751 139364 138733 139687 142132 144551 147526 152943 160266 167208
55702 167208 173488 180439 187550 192881 196297 198969 200486 199856 198415 198290 198836 198046 196444 195909 195609 193015
55686A93015m721m417l623m254m545k872j174j229j402k13P05K30L45K088K875
55671A70808J078p27k98M00q12k295k010j237j482j252N68J747O22m54Q21K527
55655A68004K091Q38J219K398K289J410J204R41m79j950k383l025m886o329n916
55640A55426n017n047m939l823l238m090m524l395k642l575m198l128k559m180
55626A01071n600m368k265k024k779k489j951k660l327k263q22r03j445p92j36
55611F7247j099k257j584j74j20p95n70j17p40j480j011m22j032j677j072n27
55595E2570j327j840m37J188R41J07P85J923J412qm07k11o81j022k72J20j119
55578E1722k183j299k88j389k964k269k85L28p1L80Q63m33k089j475M11N22r57
$$ plain form
55686 193015 188294 183877 180254 176000 171455 168583 167409 166180 164778 164565 165270 165500 165845 167933 170808
55671 170808 171886 171159 170861 171261 170449 168154 166144 164907 163425 162173 162741 164488 165110 164656 165477 168004
55655 168004 170095 170933 172152 174550 176839 178249 179453 180394 179915 177965 175582 172557 167671 161342 155426
55640 155426 150409 145362 140423 136600 133362 129272 124748 121353 118711 115136 110938 107810 105251 101071
55626 101071 95471 91103 88838 86814 84035 81546 79595 76935 73608 71345 70523 69620 68175 67383 67247
55611 67247 66148 63891 62307 62133 62013 61218 60648 60531 59791 58311 57300 56878 55846 54169 53097 52570
55595 52570 51243 49403 48966 50154 51095 51202 51987 53910 55322 55314 54907 54696 54015 52993 52721 52841 51722
55578 51722 49539 48240 47952 46563 43599 41330 41045 41373 41302 41682 42545 42112 40023 38548 38959 39481 38524
55561C8524j336n35j011l022m119l343k202j481m00J113K223L083M274M976M230
55546D0974L148L270L750K938J563J446K178K095J459J622K126J673R48J410K317
55531G2917K031J118J154J557Q40k16N2Q81M73m20J22J361J154Q0M99K145K517
55514H8265J232K76J84l91j470j729j536k576m385m686l213k022j914j682j017
55499F3336r89j469j101k8K73j15L60J572J709N20k98k40n97j712k363k323k835
55482E3700m170n173n620o557p946q356p364B442b596l773k380j585j119l9J339
55467a0153J886J773K105a660I30J867J617J713J265O58Q90J402R21j13l41l7
55451A0772l48p65j8J155R87j15k87M12L41m72n23M7k72j221j111j41r5p77k38
$$ plain form
55561 38524 37188 36653 35642 32620 28501 25158 22956 21475 21075 22188 24411 27494 31768 36744 40974
55546 40974 44122 47392 51142 54080 55643 57089 59267 61362 62821 64443 66569 68242 69190 70600 72917
55531 72917 74948 76066 77220 78777 79617 79401 79453 80334 80807 80387 80509 81870 83024 83104 83603 85748 88265
55514 88265 89497 89773 89957 89566 88096 86367 84831 82255 77870 73184 69971 67949 66035 64353 63336
55499 63336 62347 60878 59777 59749 60022 59907 60267 61839 63548 64068 63770 63530 62933 61221 58858 56535 53700
55482 53700 49530 44357 38737 32180 24234 15878 8514 2442 -2596 -6369 -8749 -10334 -11453 -11492 -10153
55467 -10153 -8267 -6494 -4389 -1660 930 2797 4414 6127 7392 8050 8940 10342 11263 11150 10809 10772
55451 10772 10424 9659 9641 10796 11783 11668 11381 11793 12134 11662 11139 11186 10914 9693 8582 8441 8346 7569 7331
55432G331J311J449j53r19L44J712J711J502K244L059K953K357J643L08j411k214
55416B3227j800j316j217q22k88o33j421q59J152K537K238J496J332J120N07M41
55400B5694J264J800J198J1j140k195k661j915p85q23j797j993j119o03p69k58
55384A3909J258K205J645N45j03l86k80N32J368J060K4l11j05p19j792j454K95
55367A7691J277P14K19N94N73l37o43L28J104O85Q0L3l36j357j641m57P66O66
55349A9959j81p26r69j018m48M41M99l88r35o27l66m82j60O32P63P6k57J8j29
55330A5702p33o16L5m20j854j986j08J534J239P8n98j168j895j722m55L04j24
55313G213k15Q79J629R21J37O41J480J337P20M85J55n48n68N10J280R10O21J198
$$ plain form
55432 7331 8642 10091 9938 9019 9363 11075 12786 14288 16532 19591 22544 24901 26544 26852 25441 23227
55416 23227 21427 20111 18894 18072 17784 17151 15730 14871 16023 18560 20798 22294 23626 24746 25253 25694
55400 25694 26958 28758 29956 29967 28827 26632 23971 22056 21271 20448 18651 16658 15539 14936 14167 13909
55384 13909 15167 17372 19017 19562 19459 19073 18793 19325 20693 21753 21777 21466 21361 20642 18850 17396 17691
55367 17691 18968 19682 19901 20495 21068 20731 20088 20416 21520 22205 22285 22318 21982 20625 18984 18527 19293 19959
55349 19959 19778 19052 18083 17065 16617 17058 17557 17169 16234 15607 15241 14759 14599 15231 15994 16070 15813 15831 15702
55330 15702 14969 14353 14388 13968 12114 10128 10020 11554 12793 12871 12273 11105 9210 7488 7033 7337 7213
55313 7213 6998 7877 9506 10427 10564 11205 12685 14022 14742 15227 15382 14834 14266 14776 16056 16966 17587 18785
55295A8785J327J96n13O16K121J997Q49M15O28M09l3N5K04k74p13l47N3m38j099
55276B4238r35m97o48p92j18O72N82K5k61o67j418j357J48J519J123j51m77N9
55258B1045K23N0L28O94L69k8N27J460J521R27P13O82K7p15l92N43N23o63j694
55239B6140j866j721j628j300p55m72m48j30O75J580K170K190J564O78J66K8l33
55222B6538r20j020n82m42p03l85O60J143N05n2K78M64l11r56l89M97M96J90N86
55203B5597R93L56n38k13R65J471J080P94Q64P12L30J45p5p12j187q02k00n19
55185B9061j494j843j110M6J059J750J831J176K59m46r82j255p73K73P37J62m80
55168B7971m96n83j217j478p63j29n14r88m10N13N34rj42j28n63p56K1P45R7j124
$$ plain form
55295 18785 20112 20308 19795 20411 22532 24529 25378 25793 26421 26830 26797 26852 27056 26782 26069 25722 25775 25337 24238
55276 24238 23303 22806 22158 21366 21248 21920 22502 22527 22266 21599 20181 18824 18972 20491 21614 21463 20986 21045
55258 21045 21268 21318 21646 22340 22709 22681 23208 24668 26189 27116 27829 28511 28538 27823 27431 27974 28497 27834 26140
55239 26140 24274 22553 20925 19625 18870 18398 17950 17820 18495 20075 22245 24435 25999 26677 26843 26871 26538
55222 26538 25618 24598 24016 23574 22871 22486 23146 24289 24794 24742 25020 25484 25173 24217 23828 24325 24821 25011 25597
55203 25597 26590 26946 26408 26195 27160 28631 29711 30505 31369 32081 32411 32556 32481 31769 30582 29780 29580 29061
55185 29061 27567 25724 24614 24660 25719 27469 29300 30476 30735 30289 29307 28052 27279 27552 28289 28451 27971
55168 27971 27475 26892 25675 24197 23434 23305 22791 21803 21393 21906 22440 22431 22289 22161 21598 20842 20863 21608 21705 20581
55148B0581j170j59M10K94N36J237J339N46l28q65j296j436p79L92J286J670J760
55131B4018J498J008R86J545J619O52j34L79J325J429J252J959K930K737J656
55116D4859R99O96k58j441j479n57k49q84j242q28l96j19P41K073K613J766L16
55099D6610q87j577j506n89M35P45P07J083J440Q46k01l21M38O94J10j19O35J488
55081E0031J569J105N90J09k05n6L58M65J41k48m69m06K07J204J736J332N97K5
55063E8085q19j950k092o29Q16N52m92l34Q75J388R13O63Q04L42n64n87L65R13
55045E8249N68K74L52K2p45q66j05M41K78J74N33P08M37L25M99K78m34q81q57
55026E9250r40j071n00O30J165P56K94L09L75L77P59J241Q71k71r94r76j177j866
$$ plain form
55148 20581 19411 19252 19662 19956 20492 21729 23068 23614 23286 22421 21125 19689 18910 19302 20588 22258 24018
55131 24018 25516 26524 27510 29055 30674 31326 31192 31571 32896 34325 35577 37536 40466 43203 44859
55116 44859 45858 46554 46296 44855 43376 42819 42570 41686 40444 39616 39220 39101 39842 41915 44528 46294 46610
55099 46610 45723 44146 42640 42051 42486 43231 43938 45021 46461 47307 47106 46785 47223 47917 48027 47908 48543 50031
55081 50031 51600 52705 53295 53404 53199 53143 53501 53966 54107 53859 53390 52984 53191 54395 56131 57463 58060 58085
55063 58085 57266 55316 53224 52595 53411 53963 53471 53137 54012 55400 56313 56976 57780 58122 57558 56971 57336 58249
55045 58249 58817 59091 59443 59465 58720 57854 57749 58190 58468 58642 59175 59883 60320 60645 61144 61422 60988 60107 59250
55026 59250 58310 57239 56739 57369 58534 59290 59584 59893 60268 60645 61404 62645 63516 63245 62251 61275 60098 58232
55008E8232j992j175n77r83j432q16L96R41M20o14j515j875j703j553j861k063
54992D1830j294P5O83J09o14n50J05Q03J319J503J278J009J088J146O60k4k58
54975D8868l20p31q17N00K652L859L576K877K446J922J320J290J706J692J370
54960G2210J870L302M423M693M961N656O063O055O776Q779J0953J2112J2368J2217
54946A72438J1531J0129Q290O050L093l12l428o272r409j2333j3613j3082j2214
54933A40868j1875j1304r913q420p392o269m684l353k762k299j510r37q81o39
54919F8630J59P32N49L63R41J912K708L562M703N678O302P268Q930J0504J1185
54904A34126J1168J0846J0009Q537O817M847J974j744n056p117q563j0158j1498
$$ plain form
55008 58232 56240 55065 54488 53505 52073 51257 51653 52594 53014 52400 50885 49010 47307 45754 43893 41830
54992 41830 40536 40611 41294 41403 40789 40239 40344 41147 42466 43969 45247 46256 47344 48490 49150 49126 48868
54975 48868 48548 47817 47000 47500 50152 54011 57587 60464 62910 64832 66152 67442 69148 70840 72210
54960 72210 74080 77382 81805 86498 91459 97115 103178 109233 116009 124788 135741 147853 160221 172438
54946 172438 183969 194098 202388 208438 211531 211219 207791 201519 192110 179777 166164 153082 140868
54933 140868 128993 117689 107776 99356 91964 85695 81011 77658 74896 72597 71087 70150 69269 68630
54919 68630 68789 69521 70070 70433 71374 73286 75994 79556 84259 89937 96239 103507 112437 122941 134126
54904 134126 145294 156140 166149 174686 181503 186350 188324 186580 181524 174407 165844 155686 144188
54891A44188j1869j1372j0395q933p203n991n540n015l809k530j963j991k146
54878F5431k330k355j803r25o22r46q20R9N90j91j245j289o18k50k09O9M35L40
54860E3361n6k05j54l45q67j519k117k239j404p2M42l23j239j247p98p56r01n79
54842C8982q0j38n78n55J26P65P38J35l92j33R86J985J746N06l38j24L12J73p8
54823D4038L32J171J621J382P39Q4j78K11R00J228J147J212J538J687J595J672
54807F0379J813J496J018J420K845M270N123N858O611O820O679P366R207J1051
54793A31956J2135J3002J3768J3265J0914P918N335K501j336n210p662q698r155
54780A78733r213q819q523q568q159o820n516n054m568l086j499j222j763j408
$$ plain form
54891 144188 132319 120947 110552 101619 94416 88425 82885 77870 74061 71531 69568 67577 65431
54878 65431 63101 60746 58943 58018 57396 56450 55630 55729 56319 56128 54883 53594 52976 52726 52517 52586 53021 53361
54860 53361 53305 53100 52946 52601 51734 50215 48098 45859 44455 44383 44825 44502 43263 42016 41218 40462 39561 38982
54842 38982 38902 38764 38186 37631 37757 38522 39260 39395 39003 38870 39856 41841 43587 44093 43755 43631 43943 44116 44038
54823 44038 44370 45541 47162 48544 49283 49367 49189 49400 50300 51528 52675 53887 55425 57112 58707 60379
54807 60379 62192 63688 64706 66126 68971 73241 78364 84222 90833 97653 104332 111698 120905 131956
54793 131956 144091 157093 170861 184126 195040 202958 208293 210794 209458 204248 196586 187888 178733
54780 178733 169520 160701 152178 143610 135451 128631 123115 118061 113493 110407 108908 107686 105923 104515
54766A04515O6J247J351J078J173J564K013K590L345M296N618P267Q679R514J0317
54751A64633J1799J3802J5604J6751J6970J5870J3419J0236O827L024j302n656
54739B81977r493j2698j5023j5941j5554j4802j4156j3094j1387r810q901q118
54727A33000o970n864n117m315l437l305l992m141k980j635j271j353j054q91
54713H6675j411j623n44P93Q23k0k34J46o7q01q07O5O61N20L23L09n4o54n45M97
54693H4052J426J337M82l15n25j47L04J74m89q18l69J80J69O6N84J456K035K317
54675I1919K408J816M14o12q1J543K924L629L990L974L511L292L921M741M783
54660A32172M291M075M013L547K991K985L098K449J242M11J84K37O62J544K198
$$ plain form
54766 104515 104581 105828 107179 108257 109430 110994 113007 115597 118942 123238 128856 136123 144802 154316 164633
54751 164633 176432 190234 205838 222589 239559 255429 268848 279084 285911 288935 287633 281977
54739 281977 272484 259786 244763 228822 213268 198466 184310 171216 159829 150019 141118 133000
54727 133000 126030 120166 115049 110734 107297 103992 100000 95859 92879 91244 89973 88620 87566 86675
54713 86675 85264 83641 83097 83890 84713 84693 84459 84605 84538 83737 82930 82995 83656 84176 84499 84808 84754 84100 83555 84052
54693 84052 85478 86815 87297 86982 86457 86310 86614 86788 86299 85481 85112 85292 85461 85527 86111 87567 89602 91919
54675 91919 94327 96143 96557 95945 95864 97407 100331 103960 107950 111924 115435 118727 122648 127389 132172
54660 132172 136463 140538 144551 148098 151089 154074 157172 159621 160863 161274 161458 161695 162357 163901 166099
54645A66099K192K436L818N541O417P039Q798J1356J2993J3179J2890J2566J1617
54632B76941R818P429M053q24o172j0071j2136j3646j5204j5985j5483j4316j2963
54619A81441j1198r164p619o762n951m834l641k393r89N4K29K31J138K481K717
54604A35740J568L07k80o15q39m21M35O08k62j268j868k562l498l878l372k911
54588A16884l299m090m495m419m094l458k486j488p61m56q10j782k659k761k425
54573G7401k336k259j515m52j21n83q98p37o65q11p01m60q03j607j856j218m12
54556E9967J30O85J121Q78K39K88J166J725J308N80K61K35L81R68J766J909J227
54539G4834O69R57J751K525L207L665L607L349L707M762N678N988O080O167N883
$$ plain form
54645 166099 168291 170727 174545 180086 186503 193542 202340 213696 226689 239868 252758 265324 276941
54632 276941 286759 294188 298241 297417 291245 281174 269038 255392 240188 224203 208720 194404 181441
54619 181441 170243 161079 153460 146698 140747 135913 132272 129879 128890 128944 129173 129404 130542 133023 135740
54604 135740 137308 137615 137335 136720 135881 135460 135895 136503 136241 134973 133105 130543 127045 123167 119795 116884
54588 116884 113585 109495 105000 100581 96487 93029 90543 89055 88294 87838 87028 85246 82587 79826 77401
54573 77401 75065 72806 71291 70839 70718 70135 69237 68500 67835 67024 66323 65863 65060 63453 61597 60379 59967
54556 59967 60097 60782 61903 62781 63020 63308 64474 66199 67507 68087 68348 68583 68964 69932 71698 73607 74834
54539 74834 75503 76460 78211 80736 83943 87608 91215 94564 98271 103033 108711 114699 120779 126946 132829
54524A32829N161M462L779K474M10j667l195m325n259n914o382o802o777n900
54510A02894m778m440m793m823m253l722l367k638j550p45k68L48P92K62q47j170
54494F6902m78M5j55l32j45k55p92q32k4P98J124J371J541R18l18q09o1P70Q05
54475G0073O01O35L54m20o73K18J370J796J652J313O01k71l62M17Q10J20p07q53
54457G6674r62j626k021j315k34J16l5J65N95N56K8m77p59q41p08o27r88j383
54439F6158r63kJ99n95j090p16o20j470k022j097M97J329J307R97K84q80j565
54422E9751j078j35L40N28Q02P67L76O14J737K272J254N9L25J381J629J253J489
54405G3364K170K256K040K670L883M344L974L947M503M686M188L728L539L188
$$ plain form
54524 132829 137990 142452 146231 148705 149115 147448 144253 139928 134669 128755 122373 115571 108794 102894
54510 102894 98116 93676 88883 84060 79807 76085 72718 70080 68530 67785 67517 67865 68657 68919 68072 66902
54494 66902 66424 66469 66314 65982 65837 65582 64790 63958 63934 64732 65856 67227 68768 69686 69368 68559 68498 69268 70073
54475 70073 70674 71309 71663 71243 70570 70788 72158 73954 75606 76919 77520 77249 76887 77304 78114 78234 77527 76674
54457 76674 75712 74086 72065 70750 70516 70632 70597 70762 71357 71913 71941 71464 70705 69864 69156 68529 67541 66158
54439 66158 65195 65193 65392 64797 63707 62991 62371 60901 58879 57782 58279 59608 60915 61912 62196 61316 59751
54422 59751 58673 58538 58878 59406 60208 60975 61351 61965 63702 65974 67228 67287 67612 68993 70622 71875 73364
54405 73364 75534 77790 79830 82500 86383 90727 94701 98648 103151 107837 112025 115753 119292 122480
54391A22480K935L527M513M363K681Q24l4k49o26j202j687k158k778l421l902
54376A25266m174m139l717l109k620k352k307k492k517j822o80l19j265k382k443
54361H8928j857j695j783j157P3Q04O88M73O14Q12R66J402K020K168J633R50O87
54344I5726J027J998L360M362M416L920L716L942M078L891L569L110K417J738
54330A41270J260N40q84k496l393l577l819m390m876n093n238n225m811m313m285
54315I0670m518m209l208k224j767j666j687j839j969j816j500j380j391j233
54301F0263j121j522k127j992r53m8j29o94o03M28J581J959J478P36K60O2j38
54284E7440m65q73j368j851j863j037J54P57N26J84K91O35R13J203J422J129L58
$$ plain form
54391 122480 125415 128942 133455 137818 140499 141323 141289 141040 140414 139212 137525 135367 132589 129168 125266
54376 125266 121092 116953 113236 110127 107507 105155 102848 100356 97839 96017 95337 95018 93753 91371 88928
54361 88928 87071 85376 83593 82436 82509 83313 84001 84474 85088 85900 86866 88268 90288 92456 94089 95039 95726
54344 95726 96753 98751 102111 106473 110889 114809 118525 122467 126545 130436 134005 137115 139532 141270
54330 141270 142530 143070 142186 139690 136297 132720 128901 124511 119635 114542 109304 104079 99268 94955 90670
54315 90670 86152 81943 78735 76511 74744 73078 71391 69552 67583 65767 64267 62887 61496 60263
54301 60263 59142 57620 55493 53501 52548 52500 52371 51677 51074 51502 53083 55042 56520 57256 57516 57578 57440
54284 57440 56975 56102 54734 52883 51020 49983 50137 50894 51420 51604 51895 52530 53443 54646 56068 57197 57555
54267E7555o9L56J076J337J092O06o0o20n02K10N14n7o47m69p5l08q21p65k58
54248E8095rn4N7K56K00J29M11O27J86n33o32j34J12k89r01j267j300j033o26
54229E3295m44n55n64l95o37j455j951j431n76l09k57M57J443J506N97k6M05J308
54211E0411J762J441N58l58o42j28M99N16M9l88o97r65q83k37M84O82M42J09k85
54192E2370n44o9J039J480M37j011j346o88k06j38J91Q44J227J258J231Q40l31
54175E6584j613j889j206n75k81K42J048J398R41J27n70r49p88j30M01L71K26
54158E3337M64O68L73J34N89J141Q85K10N7K33p2n86l98L47P14O33O91O99M5q60
54138E9304j097q94j113j473j027q4K37M6L71R99O94m21q70k95J03j73k46J28
$$ plain form
54267 57555 57486 57842 58918 60255 61347 61953 61893 61273 60771 60981 61495 61438 60791 60322 60247 59939 59118 58353 58095
54248 58095 58086 58032 58089 58345 58545 58674 59085 59712 59898 59365 58733 58599 58711 58422 57521 56254 54954 53921 53295
54229 53295 52851 52296 51732 51337 50700 49245 47294 45863 45287 44978 44721 45178 46621 48127 48724 48698 49103 50411
54211 50411 52173 53614 54172 53814 53172 53044 53543 54059 54108 53720 53023 52058 51175 50938 51422 52104 52546 52655 52370
54192 52370 51826 51757 52796 54276 54713 53702 52356 51668 51462 51324 51515 52359 53586 54844 56075 56915 56584
54175 56584 54971 53082 51876 51301 51020 51262 52310 53708 54649 54776 54206 53257 52469 52339 52740 53111 53337
54158 53337 53801 54469 54842 54976 55565 56706 57591 57801 57858 58091 58019 57433 57035 57382 58096 58729 59420 60119 60164 59304
54138 59304 58207 57313 56200 54727 53700 53616 53853 53899 54270 55269 55963 55542 54672 54377 54480 54307 54061 54189
54120E4189L9o99j017o08n33j228j706j425j152j261r99k09K3o37q87P7J155J203
54102D4325Q29J101J710J684R08q0r84j595j547r51m73k84P0M97K39n89p33K71
54084D4398J206R41j02r61j376j305m40R29J669J224K69n16j171j431m90J355
54068D4199K373J693O05N00Q46M46m47p03j15O84J405K024K134J456N16rj73k26
54050E7208R4R10J600J552J072Q16R02J107J267J101L24n81n58O12J993K858L404
54033G5681L752L576L178L646N118O246O135N593N613N896N875N831N984N604
54019A47728M321L151L068L469L244K456J766J179M61K4K18N03L96L43O83P47
54003A73757M7p43j041j487k529l135k442j577k074l418l946l491l183l295l138
$$ plain form
54120 54189 54228 53529 52512 51904 51371 50143 48437 47012 45860 44599 43600 43391 43414 42777 41890 41967 43122 44325
54102 44325 45154 46255 47965 49649 50557 50477 49493 47898 46351 45400 44927 44643 44713 45210 45449 44860 44127 44398
54084 44398 45604 46545 46443 45482 44106 42801 42361 43290 44959 46183 46452 45936 44765 43334 42844 44199
54068 44199 46572 48265 48870 49370 50216 50662 50215 49512 49397 50081 51486 53510 55644 57100 57616 57607 57434 57208
54050 57208 57302 58212 59812 61364 62436 63252 64154 65261 66528 67629 67953 67372 66814 67426 69419 72277 75681
54033 75681 79433 83009 86187 89833 94951 101197 107332 112925 118538 124434 130309 136140 142124 147728
54019 147728 152049 155200 158268 161737 164981 167437 169203 170382 170843 170867 171085 171588 171984 172327 173010 173757
54003 173757 173804 173061 172020 170533 168004 164869 162427 160850 158776 155358 151412 147921 144738 141443 138305
53988A38305k774k943l441l336k680k360k309j577k43L99j60r13j052j011j330
53973A12575j744j852j857k022k145j904j254l36N26P87K79l70m70k43l25o00
53957I9045m44J38N86Q28J279J846J971J716J783K374K843K772K547K652L039
53942A24975L410L511L131K336J829K392L830M999N097M425L743L299K712J614
53928A71303J90q76j118r07j032j601j886j432o72r9M32J104J519J490J770L136
53912A71321N090O374O479N920N298M898N044N938P127P765P448O437N151L920
53898B54210K957K233J424M08m67q78r78j065j238j602k275k935l016k719l054
53883B41005m345n593n884n668n841o399o838p104p224o695n242l665k843k554
$$ plain form
53988 138305 135531 132588 129147 125811 123131 120771 118462 116885 116642 117041 116881 115968 114916 113905 112575
53973 112575 110831 108979 107122 105100 102955 101051 99797 99461 99987 100774 101053 100683 100213 99970 99645 99045
53957 99045 98601 98739 99325 100153 101432 103278 105249 106965 108748 111122 113965 116737 119284 121936 124975
53942 124975 128385 131896 135027 137363 139192 141584 145414 150413 155510 159935 163678 166977 169689 171303
53928 171303 171493 170617 169499 168592 167560 165959 164073 162641 161969 161870 162302 163406 164925 166415 168185 171321
53912 171321 176411 182785 189264 195184 200482 205380 210424 216362 223489 231254 238702 245139 250290 254210
53898 254210 257167 259400 260824 261232 260765 259887 258909 257844 256606 255004 252729 249794 246778 244059 241005
53883 241005 236660 231067 225183 219515 213674 207275 200437 193333 186109 179414 174172 170507 167664 165110
53869A65110k191k038k673l646l985l723l644l834l677l175l044l509l986m018
53855A17967l671l007k063j273j157j577j962k142k301k336k000j447j020o84
53841I1327l29j95m19o03m72m47p84q78l05J91j39o00j03R48J222N77O5P0o2n26
53821H8538p16n05n23r48j123p33l01k34k92j70J74P50J340J238J37r06n01J121
53803H6346K404K657K697L250L987M437M670M692M246L552L309L560L557L047
53789A36411K772L252L950M131L776L315L063L176L576L706K966J542K19o27j179
53774A74049j485j486j582k205k880k834k452k863l995m436l622k732k730k905
53760A35842k286j382j320j977k233j713j143j057j066o07J88O97N98J71j08j53
$$ plain form
53869 165110 162919 160881 158208 154562 150577 146854 143210 139376 135699 132524 129480 125971 121985 117967
53855 117967 114296 111289 109226 107953 106796 105219 103257 101115 98814 96478 94478 93031 92011 91327
53841 91327 90998 90803 90384 89781 89309 88862 88078 87200 86895 87086 86947 86347 86244 87192 88414 88991 89056 89126 89064 88538
53821 88538 87822 87317 86794 85846 84723 83990 83689 83455 83163 82993 83167 83917 85257 86495 86632 85726 85225 86346
53803 86346 88750 91407 94104 97354 101341 105778 110448 115140 119386 122938 126247 129807 133364 136411
53789 136411 139183 142435 146385 150516 154292 157607 160670 163846 167422 171128 174094 175636 175855 175228 174049
53774 174049 172564 171078 169496 167291 164411 161577 159125 156262 152267 147831 144209 141477 138747 135842
53760 135842 133556 132174 130854 128877 126644 124931 123788 122731 121665 121058 121246 121943 122541 122712 122604 122451
53744A22451k11l17k18N4n5q68j879k367k274j941j448p92k92j37J31Q59J397
53727A12093R03k68r26o67r7L76R03J376J273O06J00J74M44L80j15q10j289j132
53709A13324m70p1k22q4J004K183K247J554J393J762J523O54N58J782L130L556
53693A33823L454L417L128K300J537J373J382J091R08J397K319L039L355L414
53679A65937L311L158L018K575J529M23K28R77J698J852J836J821J352L97l25
53664A89787n53q64j413j492r28p00j347j943j613r78j080j678j839j515j443
53649A70401j849k257k284j909j189l98p9m15p99o19q5K19J85J83M48R42J475
53632A61970J688J335P57O44J071J437J502J682K097K199J787J490J686J794J347
$$ plain form
53744 122451 122240 121923 121705 121759 121704 120836 118957 116590 114316 112375 110927 110135 109843 109706 109837 110696 112093
53727 112093 112996 112728 111802 111135 111038 111414 112317 113693 114966 115572 115672 115846 116290 116670 116555 115745 114456 113324
53709 113324 112854 112783 112561 112477 113481 115664 117911 119465 120858 122620 124143 124797 125355 127137 130267 133823
53693 133823 137277 140694 143822 146122 147659 149032 150414 151505 152413 153810 156129 159168 162523 165937
53679 165937 169248 172406 175424 177999 179528 179951 180179 181156 182854 184706 186542 188363 189715 190112 189787
53664 189787 189234 188370 186957 185465 184537 183837 182490 180547 178934 177956 176876 175198 173359 171844 170401
53649 170401 168552 166295 164011 162102 160913 160515 160436 160021 159222 158603 158518 158737 158922 159105 159553 160495 161970
53632 161970 163658 164993 165750 166394 167465 168902 170404 172086 174183 176382 178169 179659 181345 183139 184486
53617A84486R25J229J876K015J594J240J261J545K094K909L622L874L846L890
53603B16406L910L651L285L190L400L751M298N090N756N831N385M903M603M219
53589B77678L522K748K459K912L633L876L608L629M287M674L787K083R18O95O75
53574C21184M58M83Q65J021P49O63J046J344J140P81N41J68k82j81N01P72M9p99
53556C30503n87O48J947K630K583J890Q70O8j85O4P73J796K415J910P95M81J333
53539C49934K138J936J285J133J426J607J597J579J494J389J559J946K149K309
53525C73481L032M150M731M724N239O551P375O920O307O794P939Q724R281J0157
53511D65405J0962J1197J1556J2810J4249J4726J4650J5311J6677J7503J7427
$$ plain form
53617 184486 185411 186640 188516 190531 192125 193365 194626 196171 198265 201174 204796 208670 212516 216406
53603 216406 220316 223967 227252 230442 233842 237593 241891 246981 252737 258568 263953 268856 273459 277678
53589 277678 281200 283948 286407 289319 292952 296828 300436 304065 308352 313026 316813 318896 319814 320509 321184
53574 321184 321642 322125 322990 324011 324760 325423 326469 327813 328953 329734 330275 330443 330161 329980 330481 331253 331302 330503
53556 330503 329916 330564 332511 335141 337724 339614 340484 340552 340367 340431 341204 343000 345415 347325 348120 348601 349934
53539 349934 352072 354008 355293 356426 357852 359459 361056 362635 364129 365518 367077 369023 371172 373481
53525 373481 376513 380663 385394 390118 395357 401908 409283 416203 422510 429304 437243 445967 455248 465405
53511 465405 476367 487564 499120 511930 526179 540905 555555 570866 587543 605046 622473
53500F22473J7483J8428J9797K0780K1161K1230K1401K1934K2661K3197K3653
53489H54198K4495K5406K5301K4047K3075K3357K3890K3297K1925K1068K0947
53478A111006K0887K0799K1007K1181K0869K0568K0903K1198K0347J8685J7504
53467A334954J7071J6584J5807J5199J4586J3202J1048Q841O761M547K683J957
53455A463240J869R48j224l714o020q631j1577j3927j5183j5913j6618j7117j7489
53442A338644j8355j9797k1082k1906k2846k4080k4796k4475k3750k3333k2980
53431A091244k2260k1541k1414k1621k1342k0188j8415j6476j4764j3522j2628
53420H87073j1665j0402q993p608o210m730l137j324O56K304L096L279L778N148
$$ plain form
53500 622473 639956 658384 678181 698961 720122 741352 762753 784687 807348 830545 854198
53489 854198 878693 904099 929400 953447 976522 999879 1023769 1047066 1068991 1090059 1111006
53478 1111006 1131893 1152692 1173699 1194880 1215749 1236317 1257220 1278418 1298765 1317450 1334954
53467 1334954 1352025 1368609 1384416 1399615 1414201 1427403 1438451 1447292 1454053 1458600 1461283 1463240
53455 1463240 1465109 1466057 1464833 1461119 1455099 1446468 1434891 1420964 1405781 1389868 1373250 1356133 1338644
53442 1338644 1320289 1300492 1279410 1257504 1234658 1210578 1185782 1161307 1137557 1114224 1091244
53431 1091244 1068984 1047443 1026029 1004408 983066 962878 944463 927987 913223 899701 887073
53420 887073 875408 865006 856013 848405 842195 837465 834328 833004 833660 835964 839060 842339 846117 851265
53406H51265P046Q780J0058J1137J2467J4238J6133J7663J8894K0434K2485K4397
53394A034997K5569K6341K7442K8983L0591L2112L3547L4734L5775L7351L9865
53383A387307M2647M4696M5857M6571M7025M7344M8097M9604N1112N1660N1358
53372A913278N0907N0319M9239M8024M7179M6091M3756M0495L7514L4855L1361
53361B393018K6806K2398J8852J5383J1144O344J404l747q900j3272j6620j9750
53349B433060k3294k6852k9976l2986l6133l8825m0576m2071m4358m7278m9540
53338B021171n0169m9389m8197m7379m6930m6233m4920m3422m2410m1845m1061
53327A519216l9671l7897l6091l4459l3194l2217l0975k9090k7040k5467k4009
$$ plain form
53406 851265 858311 867091 877149 888286 900753 914991 931124 948787 967681 988115 1010600 1034997
53394 1034997 1060566 1086907 1114349 1143332 1173923 1206035 1239582 1274316 1310091 1347442 1387307
53383 1387307 1429954 1474650 1520507 1567078 1614103 1661447 1709544 1759148 1810260 1861920 1913278
53372 1913278 1964185 2014504 2063743 2111767 2158946 2205037 2248793 2289288 2326802 2361657 2393018
53361 2393018 2419824 2442222 2461074 2476457 2487601 2493945 2495349 2491602 2482702 2469430 2452810 2433060
53349 2433060 2409766 2382914 2352938 2319952 2283819 2244994 2204418 2162347 2117989 2070711 2021171
53338 2021171 1971002 1921613 1873416 1826037 1779107 1732874 1687954 1644532 1602122 1560277 1519216
53327 1519216 1479545 1441648 1405557 1371098 1337904 1305687 1274712 1245622 1218582 1193115 1169106
53316A169106k1794j8966j6641j5260j4127j2744j1557j0922j0447r798r368r405
53304A008077r284q332o801n389m200k805j069O53K050L188M327N540O608P291
53290I99854P788Q632R992J1389J2424J3399J4745J6322J7804J9343K1173K3011
53278A175876K4549K6016K7473K8142K7451K6202K5529K5108K3805K1724K0053
53267A451928J9030J7589J5261J2840J0909R043O874M659K506J80j947l149l788
53254A541935n209p696j0011j1451j2916j5103j7143j8094j8599j9854k1760k3246
53242A360853k3810k3845k3887k4311k5229k6128k6158k5277k4426k4113k3672
53231A089997k2438k0784j9314j7994j6823j6444j7166j8049j7857j6496j4727
$$ plain form
53316 1169106 1147312 1128346 1111705 1096445 1082318 1069574 1058017 1047095 1036648 1026850 1017482 1008077
53304 1008077 998793 990461 983660 978271 974071 971266 970197 970850 972900 976088 980415 985955 992563 999854
53290 999854 1007642 1016274 1026266 1037655 1050079 1063478 1078223 1094545 1112349 1131692 1152865 1175876
53278 1175876 1200425 1226441 1253914 1282056 1309507 1335709 1361238 1386346 1410151 1431875 1451928
53267 1451928 1470958 1488547 1503808 1516648 1527557 1536600 1543474 1548133 1550639 1550819 1548872 1545723 1541935
53254 1541935 1536726 1529030 1519019 1507568 1494652 1479549 1462406 1444312 1425713 1405859 1384099 1360853
53242 1360853 1337043 1313198 1289311 1265000 1239771 1213643 1187485 1162208 1137782 1113669 1089997
53231 1089997 1067559 1046775 1027461 1009467 992644 976200 959034 940985 923128 906632 891905
53220H91905j3097j1861j1327j1383j1195j0187q882q088p752p311o755o517o655
53207G70895o924p343q046q818r354r733j0144j0496j0707j1007j1467j1596j0990
53194F44270j0012r338r128r100r135r384r888j0498j1025j1351j1555j1966j2717
53181E09173j3373j3478j3286j3265j3124j2247j1029j0591j1089j1492j1266
53170C74933j0979j0864j0189q683p270o578o050n315n162o029o780o245n046
53157B79743m540m810m999m904m903m859m409l885l803l894l679l440l529l372
53143B20717k456j660k131l272l437k377j412j268j321j130j108j267p81N92J790
53128A99479J926J548J702K401K807K496J886J567J694K004K222K393K711L003
$$ plain form
53220 891905 878808 866947 855620 844237 833042 822855 813973 805885 798133 790822 784067 777550 770895
53207 770895 763971 756628 748582 739764 730410 720677 710533 700037 689330 678323 666856 655260 644270
53194 644270 634258 624920 615792 606692 597557 588173 578285 567787 556762 545411 533856 521890 509173
53181 509173 495800 482322 469036 455771 442647 430400 419371 408780 397691 386199 374933
53170 374933 363954 353090 342901 334218 326948 320370 314320 309005 303843 297814 291034 284789 279743
53157 279743 275203 270393 265394 260490 255587 250728 246319 242434 238631 234737 231058 227618 224089 220717
53143 220717 218261 216601 214470 211198 207761 205384 203972 202704 201383 200253 199145 197878 197097 197689 199479
53128 199479 201405 202953 204655 207056 209863 212359 214245 215812 217506 219510 221732 224125 226836 229839
53114B29839K700J566R9j123k110k972l282k685j875k054l420m945n655n548n121
53099A93414m730m507m462m450m363m303m327m114l358k332j548j036n32k61q41
53084A48250k235l436l464k371j086m85p49j387j783j732j481j263j044p53m79
53069A24502l13k67m85j156k013k405k146j786j762j772j398q10l71K1N44Q81
53053A09264O11l8m39l21J36O73J008Q17J64l65l67j38q6q2R5J62j43l98o2N53
53033A11044O14q0r39j400j386j077p37o19o63n39k49k80p41r22l02N44P14K13
53015A03195l20o14p51n16K67J046J012J96o36j011r67n38K01P74P46M16L40M38
52997A03278K55o3O6O37J044R98P50M79J75M2L42Q98J384J920K674L181K915K320
$$ plain form
53114 229839 232539 234105 234204 233081 230971 227999 224717 222032 220157 218103 214683 209738 204083 198535 193414
53099 193414 188684 184177 179715 175265 170902 166599 162272 158158 154800 152468 150920 149884 149352 149091 148250
53084 148250 146015 142579 139115 136744 135658 135173 134424 133037 131254 129522 128041 126778 125734 124981 124502
53069 124502 124189 123922 123437 122281 120268 117863 115717 113931 112169 110397 108999 108189 107818 107839 108383 109264
53053 109264 109875 109837 109398 109077 109213 109886 110894 111711 111875 111510 111143 111005 110919 110837 110932 111094 110951 110553 110491 111044
53033 111044 111658 111578 110639 109239 107853 106776 106039 105420 104757 104218 103969 103689 102948 102026 101724 102268 102982 103195
53015 103195 102875 102261 101510 100994 101261 102307 103319 103515 102879 101868 100901 100363 100564 101338 102084 102500 102840 103278
52997 103278 103533 103470 103536 104173 105217 106215 106965 107444 107619 107661 108003 108901 110285 112205 114879 118060 120975 123295
52979A23295K330K959L386L381L599M296M833M715M257L908L668L473L411L258
52965A74769K486J080k54r75j255j442j602j848k437l214l516l052k368k066k057
52950A52249j958j852k070k514k620k054j138n47o28j070j270j070r13j161j535
52935A29849j574j324j212j324j285q81l57m8j2o2J2K50M49L85J51P7J89J69k6
52916A23426J6M69R11J006J045J356J654J524J103Q16Q15J104J675K083J565K05
52900A40773p64n42M8p0n05j92O63R14M41K97Q86J325R34K10j13j1K11N15R06
52881A45926J285J691K240K615K297J362N29K35K35K12K12L27M39M75N56P42R23
52864A62301R74Q52O82Q09J458K195K340K085K375L308L685K870K021K385L448
$$ plain form
52979 123295 125625 128584 131970 135351 138950 143246 148079 152794 157051 160959 164627 168100 171511 174769
52965 174769 177255 178335 178081 177106 175851 174409 172807 170959 168522 165308 161792 158740 156372 154306 152249
52950 152249 150291 148439 146369 143855 141235 139181 138043 137496 136868 135798 134528 133458 132545 131384 129849
52935 129849 128275 126951 125739 124415 123130 122249 121892 121844 121832 121770 121782 122032 122481 122866 123017 123094 123283 123452 123426
52916 123426 123442 123911 124822 125828 126873 128229 129883 131407 132510 133326 134141 135245 136920 139003 140568 140773
52900 140773 140009 139467 139515 139445 138940 138748 139411 140325 140766 141063 141949 143274 144208 144418 144305 144294 144505 145020 145926
52881 145926 147211 148902 151142 153757 156054 157416 157945 158180 158415 158627 158839 159166 159605 160080 160636 161378 162301
52864 162301 163275 164127 164809 165618 167076 169271 171611 173696 176071 179379 183064 185934 187955 190340 193788
52849A93788M005M157M600M786L681J951J348J969K090J018P8K45N51k04j588
52834B22475k400k396k255k527l303m316m981m859m278l895l649l031k250k026
52820A76309k199j828q80m93j171k050k403k586k862k629j599o55o18j113j405
52805A51818j495j594j366n85J69K82L3pM8l06j073j751j904j395n14j5m51j293
52787A38601j453q05l30n70r32q65o63o57o55o38j030j727j834j056l12l77q49
52770A23848j143j408j687j243K25J590J632O69j22l67m51m93m37p23j740k848
52754A15302k945j874n73O5j27p83j355j457j242j226j487j580j358j231j302
52739I6827j109o21n80j260j807j469o74j37J74M40K79m06p28rJ053J406J170
$$ plain form
52849 193788 197793 201950 206550 211336 215017 216968 218316 220285 222375 223393 223471 223716 224267 224063 222475
52834 222475 220075 217679 215424 212897 209594 205278 200297 195438 191160 187265 183616 180585 178335 176309
52820 176309 174110 172282 171402 170909 169738 167688 165285 162699 159837 157208 155609 154954 154336 153223 151818
52805 151818 150323 148729 147363 146778 146947 147229 147262 147255 147303 146997 145924 144173 142269 140874 140360 140345 139894 138601
52787 138601 137148 136343 136013 135443 134511 133646 132983 132326 131671 131033 130003 128276 126442 125386 125074 124697 123848
52770 123848 122705 121297 119610 118367 118592 120182 121814 122483 122361 121994 121543 121050 120613 119890 118150 115302
52754 115302 112357 110483 109910 109975 109848 109065 107710 106253 105011 103785 102298 100718 99360 98129 96827
52739 96827 95718 95097 94517 93257 91450 89981 89307 89170 89344 89784 90063 89657 88929 88920 89973 91379 92549
52722I2549J030Q39O7r19j285j065r10p91j93O68J037R18R78J272J119M61J97
52705I5972R60K334L522M097L986L329K553K065J856J717J661J664J323L64p83
52690A26620j553k116k917l624l478k608k075k439l053l030k394j905k086k640
52676I0702k749j954p87k95q17j645k006j876j562j117o59o65j268j727j339m64
52660F9772K5m3j82j69j73j77j7J23p5m78o45m92k74j32l9k8l7J50M80M91j4o67
52638F7399j189j716k047j458K7J046O23k99j71R28J642J447R58M45m97j637k001
52621F3500j326n73n23q17p97l96J68Q82J574J716J022j00r60j179p66MP30J193
52603F3352J506J719J539Q74L14M29Q57P61Q5l93j99L10N79L93k23r94j323q02
$$ plain form
52722 92549 93579 94418 94485 93566 92281 91216 90306 89515 89322 89990 91027 91945 92923 94195 95314 95775 95972
52705 95972 96932 99266 102788 106885 110871 114200 116753 118818 120674 122391 124052 125716 127039 127403 126620
52690 126620 125067 122951 120034 116410 112932 110324 108249 105810 102757 99727 97333 95428 93342 90702
52676 90702 87953 85999 85212 84917 84100 82455 80449 78573 77011 75894 75235 74570 73302 71575 70236 69772
52660 69772 69797 69754 69572 69403 69230 69053 69036 69159 69084 68606 67961 67469 67195 67063 67024 66996 66959 67109 67589 68080 68066 67399
52638 67399 66210 64494 62447 60989 61016 62062 62685 62386 62215 63143 64785 66232 67190 67635 67138 65501 63500
52621 63500 62174 61601 61078 60261 59464 59068 59236 60118 61692 63408 64430 64330 63370 62191 61425 61429 62159 63352
52603 63352 64858 66577 68116 68990 69304 69733 70590 71351 71436 71043 70844 71154 71733 72126 71903 70909 69586 68784
52585F8784J78Q48J017J109J354J569J683J820J879J593R95L86q3l58k18L49Q15
52568H3720P37M69O04R72R73O49N73Q40J024J080J351J747J746J308R65R15Q44
52551A00517O84P10Q45O72K69K26O20Q06M14k12p10j065j031o7J727L234L410
52534A11049K358R99Q5k42l23n84j091j399j196q05o96p19m74j53j92l00K02J135
52516A07654J578J298J057J223J176M51m87j092j463j724j469n43L29L89j26m78
52500A07773n14o63j046j218p80J47R97J207P14O1j48P7K93K88K09J05o8j4O11
52481A08031J486J815J369O67P0n50j004n99P86K157K572K270K039J988J625Q29
52465A25551Ln69r22r74n33K29P42P47O61R66J493J550Q52m4l80q0L57O56R62
$$ plain form
52585 68784 68962 69810 70827 71936 73290 74859 76542 78362 80241 81834 82829 83215 83132 82774 82556 82905 83720
52568 83720 84457 84926 85530 86502 87475 88124 88697 89537 90561 91641 92992 94739 96485 97793 98758 99673 100517
52551 100517 101201 101911 102756 103428 103697 103923 104543 105349 105763 105551 104841 103776 102745 102678 104405 107639 111049
52534 111049 113407 114406 114491 114249 113926 113342 112251 110852 109656 108851 108155 107436 106962 106809 106617 106317 106519 107654
52516 107654 109232 110530 111587 112810 113986 114437 113950 112858 111395 109671 108202 107659 107988 108377 108251 107773
52500 107773 107259 106596 105550 104332 103552 103699 104696 105903 106617 106678 106530 106607 106900 107188 107397 107502 107434 107420 108031
52481 108031 109517 111332 112701 113368 113438 112888 111884 111285 112071 114228 116800 119070 121109 123097 124722 125551
52465 125551 125554 124985 124063 123089 122556 122785 123527 124274 124935 125901 127394 128944 129796 129752 129372 129292 129649 130305 131267
52446A31267J266J257R60J000J657K259J995R82k6o04p85n22K24J074J486J388
52430A44878J083P38L91K11K79L42K65K50K77j55j010j301n12K84j11j058j027
52413A43824n9L00n93j684j977j670j237p30l48m98q89o71J95P80P51Q31J312
52396A37637J398O59o3J5M50N11L77N02O33L26j44k06J44N06O72N78J57k80r8
52377A43774Q04J770K279K440K308J620O17J77N52Q26L22l00j15O85J314J604
52361A60677J874K070J929J608J445J365J157R99J231J871K676L285L198K255
52347A87640J340J654K943L540K701J714J882K562K361J302M83K58J38N8L82Q84
52331B11842R91Q32J066J688K028J849J494J112O82O48J488K626K868K027J215
$$ plain form
52446 131267 132533 133790 134750 135750 137407 139666 141661 142643 142617 142013 141228 140706 140930 142004 143490 144878
52430 144878 145961 146699 147090 147301 147580 147922 148187 148437 148714 148559 147549 146248 145736 146020 145909 144851 143824
52413 143824 143765 144065 143472 141788 139811 138141 136904 136174 135826 135328 134439 133768 133963 134743 135494 136325 137637
52396 137637 139035 139694 139631 139646 140096 140607 140984 141486 142119 142445 142301 142095 142239 142745 143417 143995 144152 143872 143774
52377 143774 144578 146348 148627 151067 153375 154995 155612 155789 156341 157167 157489 157189 157074 157759 159073 160677
52361 160677 162551 164621 166550 168158 169603 170968 172125 173124 174355 176226 178902 182187 185385 187640
52347 187640 188980 190634 193577 197117 199818 201532 203414 205976 208337 209639 210122 210380 210518 210576 210958 211842
52331 211842 212833 213665 214731 216419 218447 220296 221790 222902 223584 224232 225720 228346 231214 233241 234456
52316B34456J276J874K403K906L568M052L904L288K837K960L589M395N084N551
52302B82143N871O112O183O084O154O819Q066R375J0183J0314R992R605R519R999
52288C96419J1167J2735J3790J3357J1642J0287J0667J2214J3267J3349J3452
52277E32346J4080J4377J3699J2747J2345J2191J1697J1181J1175J1254J0643
52266F67735R430Q225P115N893M888M474M105K909J054m06r34r30q99j042j496
52251G10121k193k635k545k495l070l744l507k376j295o53M0J023J892K473L116
52236F94152L929M611N263O500Q349R897J0326R803R043Q569Q634R186R736R681
52222H07679R112Q694Q656Q418P478O152N069M451M097L709K871J202j170l490
$$ plain form
52316 234456 235732 237606 240009 242915 246483 250535 254439 257727 260564 263524 267113 271508 276592 282143
52302 282143 288014 294126 300309 306393 312547 319366 327432 336807 346990 357304 367296 376901 386420 396419
52288 396419 407586 420321 434111 447468 459110 469397 480064 492278 505545 518894 532346
52277 532346 546426 560803 574502 587249 599594 611785 623482 634663 645838 657092 667735
52266 667735 677165 685390 692505 698398 703286 707760 711865 714774 715828 715422 714488 713558 712659 711617 710121
52251 710121 707928 705293 702748 700253 697183 693439 689932 687556 686261 685608 685648 686671 688563 691036 694152
52236 694152 698081 702692 707955 714455 722804 732701 743027 752830 761873 770442 779076 788262 797998 807679
52222 807679 816791 825485 834141 842559 850037 856189 861258 865709 869806 873515 876386 877588 876418 872928
52208H72928n021n690n873n916o044o528p614r250j0950j1990j1934j1132j0472
52195G64514j0435j0533j0010q883p885p465p269o665n469m048k966k486k304
52182F78096j877j169q86j673l255m647n081m522l460k505k034j995k142k427
52168F40423k868l028k387j369j183k175l165l080k419k207k286j817r55o64j081
52153F09739j325j042q34j068j286j194j197j574k013k249k458k647k462j986
52139E86404j961k689l442l460l013k854l104l261l028k627k381k370k442k397
52125E47375k232k161k264k243j905j663k011k623k677k101j725k012k354k015
52111E17389j114k47L18O42P59Q10J184K047L054L839M550N484O499P194P470
$$ plain form
52208 872928 867907 862217 856344 850428 844384 837856 830242 820992 810042 798052 786118 774986 764514
52195 764514 754079 743546 733536 724653 716768 709303 702034 695369 689900 685852 682886 680400 678096
52182 678096 676219 675050 674164 672491 669236 664589 659508 654986 651526 649021 646987 644992 642850 640423
52168 640423 637555 634527 632140 630771 629588 627413 624248 621168 618749 616542 614256 612439 611484 610820 609739
52153 609739 608414 607372 606538 605470 604184 602990 601793 600219 598206 595957 593499 590852 588390 586404
52139 586404 584443 581754 578312 574852 571839 568985 565881 562620 559592 556965 554584 552214 549772 547375
52125 547375 545143 542982 540718 538475 536570 534907 532896 530273 527596 525495 523770 521758 519404 517389
52111 517389 516275 516028 516346 516988 517747 518557 519741 521788 524842 528681 533231 538715 545214 552408 559878
52096E59878P579P755Q191R166J0870J3072J5170J6636J7275J7329J7341J7755
52084G18017J8432J8760J8402J7701J7200J6927J6342J4981J2956J1011J0061
52073H90790J0425J1314J1357R844P365N043L349J928M61q51j731k394l258m244
52059I39398m836m959n290o366p684q285q068p911q329q775q527p662o646n535
52045H40525m183k985k579k844k850j939n06M25K73m89o73M91K494M070M633M792
$$ plain form
52096 559878 567457 575212 583403 592569 603439 616511 631681 648317 665592 682921 700262 718017
52084 718017 736449 755209 773611 791312 808512 825439 841781 856762 869718 880729 890790
52073 890790 901215 912529 923886 933730 941095 946138 949487 951415 951876 951025 949294 946900 943642 939398
52059 939398 934562 929603 924313 917947 910263 901978 893910 885999 877670 868895 860368 852706 846060 840525
52045 840525 836342 833357 830778 827934 825084 823145 822639 823064 823337 822848 822175 822666 825160 829230 833863 838655
$$ [...]
##END NTUPLES=NMR SPECTRUM
##END=
