
##TITLE=AC1360_QARH12182_6945679_ntEdPbxQv1
##JCAMPDX= 6.0         $$ Bruker NMR JCAMP-DX V2.0
##DATA TYPE= NMR SPECTRUM
##DATA CLASS= NTUPLES
##ORIGIN= BRUKER
##OWNER= Administrator
$$ 1.72 TOPSPIN		Version 2.1
$$ 2012-10-18 13:47:31.335 -0700  Administrator@X
$$ Compression mode = diff/dup
##.OBSERVE FREQUENCY= 400.02188249412
##.OBSERVE NUCLEUS= ^1H
##.ACQUISITION MODE= SIMULTANEOUS (DQD)
##.ACQUISITION SCHEME= undefined
##.AVERAGES= 64
##.DIGITISER RES= 22
##SPECTROMETER/DATA SYSTEM= spect
##.PULSE SEQUENCE= noesygpps1d.comp
##.SOLVENT NAME= COFFEE_meoh
##.SHIFT REFERENCE= INTERNAL, COFFEE_meoh, 1, 14.96065
##AUDIT TRAIL= $$ (NUMBER, WHEN, WHO, WHERE, PROCESS, VERSION, WHAT)
$$ ##TITLE= Audit trail, TOPSPIN		Version 2.1
$$ ##JCAMPDX= 5.01
$$ ##ORIGIN= Bruker BioSpin GmbH
$$ ##OWNER= Administrator
$$ $$ C:\Bruker\TOPSPIN/data/COFFEE/nmr/AC1360_QARH12182_6945679_ntEdPbxQv1/12/pdata/1/auditp.txt
$$ ##AUDIT TRAIL=  $$ (NUMBER, WHEN, WHO, WHERE, PROCESS, VERSION, WHAT)
(   1,<2012-10-13 23:03:29.031 -0500>,<Administrator>,<TOPSPIN>,<go>,<TOPSPIN 2.1>,
      <created by zg
	started at 2012-10-13 22:51:58.812 -0500,
	POWCHK enabled, PULCHK disabled,
       configuration hash MD5:
       6B 1B 68 BB D9 2E 58 E2 7F 35 AD 54 07 DF 0E 41
       data hash MD5: 64K
       81 32 E3 D1 AD 50 C4 08 9C 9B 33 61 EA DB CB C4>)
(   2,<2012-10-13 23:03:31.765 -0500>,<Administrator>,<TOPSPIN>,<proc1d>,<TOPSPIN 2.1>,
      <Start of raw data processing
       efp LB = 0.3 FT_mod = 6 PKNL = 1 PHC0 = 0 PHC1 = 0 SI = 128K 
       data hash MD5: 128K
       6C E1 67 A0 06 19 F8 1E F1 AC 61 9C 78 F5 67 AC>)
(   3,<2012-10-13 23:03:32.937 -0500>,<Administrator>,<TOPSPIN>,<proc1d>,<TOPSPIN 2.1>,
      <pk PHC0 = 3.345337 PHC1 = 0 
       data hash MD5: 128K
       A6 7A 35 4F 57 7D 58 09 DB 08 9B A3 57 AE 13 11>)
(   4,<2012-10-13 23:03:33.187 -0500>,<Administrator>,<TOPSPIN>,<proc1d>,<TOPSPIN 2.1>,
      <abs ABSG = 1 
       data hash MD5: 128K
       32 2B 27 27 0A 3E 7D 07 FB 77 E4 38 53 3C D9 64>)
(   5,<2012-10-13 23:03:33.250 -0500>,<Administrator>,<TOPSPIN>,<proc1d>,<TOPSPIN 2.1>,
      <abs ABSG = 2 
       data hash MD5: 128K
       1C 80 98 9F C6 48 01 19 7D AA 71 07 FC 9E 47 17>)
(   6,<2012-10-13 23:03:33.359 -0500>,<Administrator>,<TOPSPIN>,<proc1d>,<TOPSPIN 2.1>,
      <abs ABSG = 3 
       data hash MD5: 128K
       FC 34 37 5B E4 33 A1 41 84 CA F4 7D CA 3B DF 3D>)
(   7,<2012-10-13 23:03:33.578 -0500>,<Administrator>,<TOPSPIN>,<proc1d>,<TOPSPIN 2.1>,
      <abs ABSG = 4 
       data hash MD5: 128K
       14 0A 19 14 A6 FF 5F 2C C0 14 41 CE ED 24 41 BF>)
(   8,<2012-10-13 23:03:33.640 -0500>,<Administrator>,<TOPSPIN>,<proc1d>,<TOPSPIN 2.1>,
      <abs ABSG = 5 
       data hash MD5: 128K
       56 88 5B F3 79 87 8F AF 9A 62 6D 87 94 B9 73 63>)
(   9,<2012-10-13 23:03:33.859 -0500>,<Administrator>,<TOPSPIN>,<audit>,<TOPSPIN 2.1>,
      <user comment:
       ICON-NMR User ID: COFFEE
       data hash MD5: 128K
$$ [...]
##$TP07= 0
##$TPNAME0= <>
##$TPNAME1= <>
##$TPNAME2= <>
##$TPNAME3= <>
##$TPNAME4= <>
##$TPNAME5= <>
##$TPNAME6= <>
##$TPNAME7= <>
##$TPOAL= (0..7)
0.5 0.5 0.5 0.5 0.5 0.5 0.5 0.5
##$TPOFFS= (0..7)
0 0 0 0 0 0 0 0
##$TUNHIN= 0
##$TUNHOUT= 0
##$TUNXOUT= 0
##$USERA1= <user>
##$USERA2= <user>
##$USERA3= <user>
##$USERA4= <user>
##$USERA5= <user>
##$V9= 5
##$VALIST= <valist>
##$VCLIST= <CCCCCCCCCCCCCCC>
##$VD= 0
##$VDLIST= <DDDDDDDDDDDDDDD>
##$VPLIST= <PPPPPPPPPPPPPPP>
##$VTLIST= <TTTTTTTTTTTTTTT>
##$WBST= 2048
##$WBSW= 25
##$XGAIN= (0..3)
0 0 0 0
##$XL= 0
##$YL= 0
##$YMAX_a= 12490976
##$YMIN_a= -9544363
##$ZGOPTNS= <>
##$ZL1= 120
##$ZL2= 120
##$ZL3= 120
##$ZL4= 120
##$ABSF1= 14.96065
##$ABSF2= -5.597531
##$ABSG= 5
##$ABSL= 3
##$ALPHA= 0
##$AQORDER= 0
##$ASSFAC= 0
##$ASSFACI= 0
##$ASSFACX= 0
##$ASSWID= 0
##$AUNMP= <proc_prof1d_extract.lims>
##$AXLEFT= 0
##$AXNAME= <>
##$AXNUC= <1H>
##$AXRIGHT= 0
##$AXTYPE= 0
##$AXUNIT= <>
##$AZFE= 0.1
##$AZFW= 0.1
##$BCFW= 0
##$BC_mod= 0
##$BYTORDP= 0
##$COROFFS= 0
##$CY= 15
##$DATMOD= 1
##$DC= 0
##$DFILT= <>
##$DTYPP= 0
##$F1P= 0
##$F2P= 0
##$FCOR= 0.5
##$FTSIZE= 131072
##$FT_mod= 6
##$GAMMA= 0
##$GB= 0
##$INTBC= 1
##$INTSCL= 1
##$ISEN= 128
##$LB= 0.3
##$LEV0= 0
##$LPBIN= 0
##$MAXI= 10000
##$MC2= 0
##$MEAN= 0
##$ME_mod= 0
##$MI= 0
##$NCOEF= 0
##$NC_proc= -2
##$NLEV= 6
##$NOISF1= 0
##$NOISF2= 0
##$NSP= 0
##$NTH_PI= 0
##$NZP= 0
##$OFFSET= 14.96065
##$PC= 1
##$PHC0= 3.345337
##$PHC1= 0
##$PH_mod= 1
##$PKNL= yes
##$PPARMOD= 0
##$PPDIAG= 0
##$PPIPTYP= 0
##$PPMPNUM= 2147483647
##$PPRESOL= 1
##$PSCAL= 4
##$PSIGN= 0
##$PYNMP= <proc.py>
##$REVERSE= no
##$SF= 400.020009775452
##$SI= 131072
##$SIGF1= 0
##$SIGF2= 0
##$SINO= 400
##$SIOLD= 131072
##$SPECTYP= <>
##$SREGLST= <1H.CDCl3>
##$SSB= 0
##$STSI= 131072
##$STSR= 0
##$SW_p= 8223.68421052631
##$SYMM= 0
##$S_DEV= 0
##$TDeff= 65536
##$TDoff= 0
##$TI= <>
##$TILT= no
##$TM1= 0
##$TM2= 0
##$TOPLEV= 0
##$USERP1= <user>
##$USERP2= <user>
##$USERP3= <user>
##$USERP4= <user>
##$USERP5= <user>
##$WDW= 1
##$XDIM= 131072
##$YMAX_p= 289957213
##$YMIN_p= -11163
##$CURPLOT= <Network HP LaserJet P1505>
##$CURPRIN= <$Network HP LaserJet P1505>
##$DFORMAT= <normdp>
##$LAYOUT= <+/1D_H.xwp>
##$LFORMAT= <normlp>
##$PFORMAT= <normpl>
##$SURQMSG= 1
$$ End of Bruker specific parameters
$$ ---------------------------------
##NTUPLES= NMR SPECTRUM
##VAR_NAME=  FREQUENCY,     SPECTRUM/REAL,   SPECTRUM/IMAG
##SYMBOL=    X,             R,               I
##VAR_TYPE=  INDEPENDENT,   DEPENDENT,       DEPENDENT
##VAR_FORM=  AFFN,          ASDF,            ASDF
##VAR_DIM=   131072,        131072,          131072
##UNITS=     HZ,            ARBITRARY UNITS, ARBITRARY UNITS
##FACTOR=    0.0627417313425164, 1,          1
##FIRST=     8223.62146879497, 3248,         -65259
##LAST=      0,             4861,            -65473
##MIN=       0,             -11163,          0
##MAX=       8223.62146879497, 289957213,    0
$$ Real data points
##PAGE= N=1
##DATA TABLE= (X++(R..R)), XYDATA
$$ [...]
64016C36172j357J6J408J753Q57l26q01o48p35j395j959j800j299j281j804k177
$$ 336172 334815 334831 336239 337992 338849 338523 337722 337074 336339 334944 332985 331185 329886 328605 326801 324624
64000C24624k011j584j091l15O83J206P76o1k85L91J285J608J332J155J818L286
$$ 324624 322613 321029 319938 319623 320306 321512 322288 322227 321942 322333 323618 325226 326558 327713 329531 332817
63984C32817M556M530L258K094K358M000N809O710O636O272O332P024P980Q718
$$ 332817 337373 341903 345161 347255 349613 353613 359422 366132 372768 379040 385372 392396 400376 409094
63970D09094R267J0111J1341J2169J1806J0654J0026J0608J1700J2268J2301J2725
$$ 409094 418361 428472 439813 451982 463788 474442 484468 495076 506776 519044 531345 544070
63958E44070J4128J6060J7643J8539J9233K0484K2672K5549K8498L1082L3428
$$ 544070 558198 574258 591901 610440 629673 650157 672829 698378 726876 757958 791386
63947G91386L6181L9971M4904N0534N6317O2083O7984P4110Q0217Q5933R1137
$$ 791386 827567 867538 912442 962976 1019293 1081376 1149360 1223470 1303687 1389620 1480757
63936A480757R5979J00459J04032J05866J05543J03355R9713R4486Q7187P7754
$$ 1480757 1576736 1677195 1781227 1887093 1992636 2095991 2195704 2290190 2377377 2455131
63926B455131O6736N4589M1253K6691J1531l282j7315l0755m3772n6196o7773
$$ 2455131 2521867 2576456 2617709 2644400 2655931 2652649 2635334 2604579 2560807 2504611 2436838
63915B436838p8230q6946r3114r6561r8120r8843r8950r7859r5066r0714q5317
$$ 2436838 2358608 2271662 2178548 2081987 1983867 1885024 1786074 1688215 1593149 1502435 1417118
63904A417118p9299p2888o6275n9634n3095m6762m0781l5353l0636k6650k3275
$$ 1417118 1337819 1264931 1198656 1139022 1085927 1039165 998384 963031 932395 905745 882470
63893H82470k0367j7826j5558j3506j1839j0921j0841j1054j0751r671q292p104
$$ 882470 862103 844277 828719 815213 803374 792453 781612 770558 759807 750136 741844 734740
63881G34740o043m790l370k065r04M11K040L803N551P424R574J1852J3926J5659
$$ 734740 728697 723907 720537 718472 717568 717979 720019 723822 729373 736797 746371 758223 772149 787808
63867G87808J7133J8377J9341K0146K1102K2272K3204K3343K2739K2013K1551
$$ 787808 804941 823318 842659 862805 883907 906179 929383 952726 975465 997478 1019029
63856A019029K0955J9583J7389J4974J2788J0683Q244N270J792k025n816r099
$$ 1019029 1039984 1059567 1076956 1091930 1104718 1115401 1123645 1128915 1130707 1128682 1122866 1113767
63844A113767j1786j4369j7246j9990k1835k2878k4142k6186k8219k9138k9011
$$ 1113767 1101981 1087612 1070366 1050376 1028541 1005663 981521 955335 927116 897978 868967
63833H68967k8843k8974k8601k7112k5127k3714k3040k2440k1560k0685k0009
$$ 868967 840124 811150 782549 755437 730310 706596 683556 661116 639556 618871 598862
63822E98862j9297j8476j7936j7915j7984j7595j6867j6376j6238j5817j4435
$$ 598862 579565 561089 543153 525238 507254 489659 472792 456416 440178 424361 409926
63811D09926j2183r877q309p566p084o365n558n248n641o220o225n374m130l357
$$ 409926 397743 387866 379557 371991 364907 358542 352984 347736 342095 335875 329650 324276 320146 316789
63797C16789l615m531m967m202k862k188k430k708k553k666l558m349l942k840
$$ 316789 313174 308643 303676 299474 296612 294424 291994 289286 286733 284067 280509 276160 272218 269378
63783B69378k583l471m091l389k074j403j443j365q95n99q30j225j310j107r91
$$ 269378 266795 263324 259233 255844 253770 252367 250924 249559 248664 248065 247235 246010 244700 243593 242602
63768B42602j181j562j743j382n83J6j16p43j056p09k93n55j312j585p93N06J278
$$ 242602 241421 239859 238116 236734 236151 236167 236051 235308 234252 233543 233250 232695 231383 229798 229005 229511 230789
63751B30789J125M72j98p79j258j447j258q76m82m0L97N86N45P87J567K251J963
$$ 230789 231914 232386 232188 231409 230151 228704 227446 226570 226088 226048 226445 227031 227576 228363 229930 232181 234144
63734B34144P76l33o69m41p9L78J038J702K052K032J822J610J528J678K075K682
$$ 234144 234920 234587 233918 233477 233398 233776 234814 236516 238568 240600 242422 244032 245560 247238 249313 251995
63718B51995L456M187M421L878K915K156J798J565J326J171R22J84r47j780j927
$$ 251995 255451 259638 264059 267937 270852 273008 274806 276371 277697 278868 279790 279974 279027 277247 275320
63703B75320j734j578j282o55q5n4l54l75R2O86J035J057Q63O50O16P42Q40R36
$$ 275320 273586 272008 270726 270071 269986 269932 269578 269203 269295 269981 271016 272073 272936 273586 274202 274944 275784 276720
63685B76720J293J906K295K243K251K863L785M208L791K915K118J699J693J834
$$ 276720 278013 279919 282214 284457 286708 289571 293356 297564 301355 304270 306388 308087 309780 311614
63671C11614J684J174P81Q14Q03J91p09j074p21j88K10O37R37N27o73j904k551
$$ 311614 313298 314472 315253 316067 316870 317061 316352 315278 314557 314369 314579 315216 316153 316680 316007 314103 311552
63654C11552k861l232l345k662j484q21j220k197k803k468j294J05R98J091Q09
$$ 311552 308691 305459 302114 299452 297968 297147 295927 293730 290927 288459 287165 287270 288268 289359 290168
63639B90168Q80J542K310K596K378K095K080K343K872L700M513M658L994L456
$$ 290168 291048 292590 294900 297496 299874 301969 304049 306392 309264 312964 317477 322135 326129 329585
63625C29585M156N913P339P495O853O334O162O174O622P789R159R862R891J0088
$$ 329585 333741 339654 346993 354488 361341 367675 373837 380011 386633 394422 403581 413443 423334 433422
63611D33422J0850J1626J1899J1997J2569J3725J5038J6135J6975J7785J8802
$$ 433422 444272 455898 467797 479794 492363 506088 521126 537261 554236 572021 590823
63600E90823J9939K0611K0193J8663J6471J3887J0908P734M791K139m64k868m443
$$ 590823 610762 631373 651566 670229 686700 700587 711495 719229 724020 726159 725695 722827 718384
63587G18384n061n449o204p075p744q697j0530j2821j4452j4974j4941j4859j4586
$$ 718384 713323 707874 701670 694595 686851 678154 667624 654803 640351 625377 610436 595577 580991
63574E80991j3853j2827j1815j0825r709q479p260o044m723l281j870o60L27J258
$$ 580991 567138 554311 542496 531671 521962 513483 506223 500179 495456 492175 490305 489645 489972 491230
63560D91230K342L554M623N307N698O136O919Q068R299J0234J0811J1458J2603
$$ 491230 493572 497126 501749 507056 512754 518890 525809 533877 543176 553410 564221 575679 588282
63547E88282J4098J5468J6695J8270K0287K2107K3275K4175K5196K5726K4624
$$ 588282 602380 617848 634543 652813 673100 695207 718482 742657 767853 793579 818203
63536H18203K1519J6980J1657O031Q51l079n791q014j0009j1172j1144j0576j0344
$$ 818203 839722 856702 868359 874390 875241 872162 866371 858357 848348 837176 826032 815456 805112
63523H05112j0630j1234j2289j3982j6021j7976j9851k1709k3073k3385k2849
$$ 805112 794482 783248 770959 756977 740956 722980 703129 681420 658347 634962 612113
63512F12113k2115k1248j9852j8155j6999j6490j5655j3929j2176j1502j1546
$$ 612113 589998 568750 548898 530743 513744 497254 481599 467670 455494 443992 432446
63501D32446j0950r225p266o029n516n262n099m992m690m084l579l574l721l221
$$ 432446 421496 412271 405005 398976 393460 388198 383099 378107 373417 369333 365754 362180 358459 355238
63487C55238j864l81M12M17J01j45k99m42n09l40J43Q72J682K411K989L391L547
$$ 355238 353374 352993 353405 353822 353923 353778 353479 353037 352528 352188 352331 353203 354885 357296 360285 363676 367223
63470C67223L353K813K092J401Q08K59k18m46l18q1k02q67j618j730j007j3N92
$$ 367223 370576 373389 375481 376882 377690 377949 377731 377285 376967 376886 376684 375817 374199 372469 371462 371449 372041
63453C72041P99J095J681K185K223J939J762J877K229K922M175N781O996P284
$$ 372041 372840 373935 375616 377801 380024 381963 383725 385602 387831 390753 394928 400709 407705 414989
63439D14989P002P032P777Q901J0059J1496J3581J6034J8067J9325K0351K1893
$$ 414989 421991 429023 436800 445701 455760 467256 480837 496871 514938 534263 554614 576507
63427E76507K3932K5529K5512K3252J9031J3885R120N678L773L073L209M095N780
$$ 576507 600439 625968 651480 674732 693763 707648 716768 722446 726219 729292 732501 736596 742376
63414G42376Q046J0275J1881J2950J4212J6158J8213J9205J8559J6724J4359J1538
$$ 742376 750422 760697 772578 785528 799740 815898 834111 853316 871875 888599 902958 914496
63402I14496Q074M184L95k930n627p490q469r033r851j1142j2656j4242j6021
$$ 914496 922570 926754 927149 924219 918592 911102 902633 893600 883749 872607 859951 845709 829688
63389H29688j7938j9700k1164k2370k3102k2913k1790k0323j8958j7529j5854
$$ 829688 811750 792050 770886 748516 725414 702501 680711 660388 641430 623901 608047
63378F08047j4283j3193j2248j0789q799o946n656m659l482k027m92R30K155L239
$$ 608047 593764 580571 568323 557534 548735 541789 536133 531474 527992 525965 525473 526403 528558 531797
63364E31797M394N875P673R495J1082J2441J3735J5068J6479J7932J9327K0504
$$ 531797 536191 542066 549739 559234 570316 582757 596492 611560 628039 645971 665298 685802
63352F85802K1430K2247K3067K3688K3640K2630K0921J9074J7195J4686J1015
$$ 685802 707232 729479 752546 776234 799874 822504 843425 862499 879694 894380 905395
63341I05395O612K544o77l409n903p687q429q798r741j1203j2406j3271j4648
$$ 905395 912007 914551 913874 910465 904562 896875 888446 879648 869907 858704 846298 833027 818379
63328H18379j6884j9097k0275k0542k0660k0784k0369j9133j7418j5607j3693
$$ 818379 801495 782398 762123 741581 720921 700137 679768 660635 643217 627610 613917
63317F13917j1543r231o946m904l510l364m846p727j1213j4344j6404j7193j7038
$$ 613917 602374 593143 586197 581293 577783 574419 569573 561846 550633 536289 519885 502692 485654
63304D85654j6410j5508j4251j2659j0996r505q179p006o197n950o006n734m816
$$ 485654 469244 453736 439485 426826 415830 406325 398146 391140 384943 378993 372987 367253 362437
63291C62437l658l009l189l829m311m276l770l060k455k176k196k196j825j075
$$ 362437 358779 355770 352581 348752 344441 340165 336395 333335 330880 328704 326508 324312 322487 321412
63277C21412l77k52q04j511j568n61J041K191K164J214J96l29n01o06n00K35J620
$$ 321412 321035 320783 319979 318468 316900 316339 317380 319571 321735 322949 323145 322816 322315 321709 321209 321444 323064
63260C23064L066L878L895L529L221L013K781K718L312M667O084O669O279N582
$$ 323064 326130 330008 333903 337432 340653 343666 346447 349165 352477 357144 363228 369897 376176 381758
63246C81758N210N193N312N570O082O765P467Q227R103R953J0641J1311J2123
$$ 381758 386968 392161 397473 403043 409125 415890 423357 431584 440687 450640 461281 472592 484715
63233D84715J2852J3148J3101J3106J3299J3542J3924J4674J5500J5681J5140
$$ 484715 497567 510715 523816 536922 550221 563763 577687 592361 607861 623542 638682
63222F38682J4767J5282J6203J6546J6140J5625J5367J5127J4697J4158J3416
$$ 638682 653449 668731 684934 701480 717620 733245 748612 763739 778436 792594 806010
63211H06010J2095J0095P706N038J880j625m754p056q923j0812j2377j2952j2608
$$ 806010 818105 828200 835906 840944 842824 841199 836445 829389 820466 809654 797277 784325 771717
63198G71717j2048j1582j0929r918q703p168m906k082L86K010L572O101R338J1983
$$ 771717 759669 748087 737158 727240 718537 711369 706463 704381 704767 706777 710349 716450 725788 737771
63184G37771J3427J4462J6125J8435K0606K2061K2796K3032K3025K3069K3254
$$ 737771 751198 765660 781785 800220 820826 842887 865683 888715 911740 934809 958063
63173I58063K3229K2565K1368K0134J8999J7572J5610J3401J1127Q295M293o80
$$ 958063 981292 1003857 1025225 1045359 1064358 1081930 1097540 1110941 1122068 1130363 1134656 1133976
63161A133976n748j0346j4639j8922k3085k6820k9957l2400l3976l4608l4494
$$ 1133976 1128228 1117882 1103243 1084321 1061236 1034416 1004459 972059 938083 903475 868981
63150H68981l3997l3380l2704l1738l0075k7577k4747k2286k0255j8157j5914
$$ 868981 834984 801604 768900 737162 707087 679510 654763 632477 612222 594065 578151
63139E78151j4134j3124j2216j0695q921p850p662p582p004o098n235m449l617
$$ 578151 564017 550893 538677 527982 519061 511211 503549 495967 488963 482865 477630 473181 469564
63126D69564k715j730p64k25m36r19p16L35J248J175N61M78J233K135K500K314
$$ 469564 466849 465119 464355 464130 463694 462775 462059 462394 463642 464817 465378 465856 467089 469224 471724 474038
63110D74038J999J961K376L106L714L870L709L581L576L529L395L296L180K801
$$ 474038 476037 477998 480374 483480 487194 491064 494773 498354 501930 505459 508854 512150 515330 518131
63096E18131K145J625J668K313L220M015M463M454L991L256K581K306K503K860
$$ 518131 520276 521901 523569 525882 529102 533117 537580 542034 546025 549281 551862 554168 556671 559531
63082E59531K976K762K476K345K390K676L437M653N724O000N660N660O635Q144
$$ 559531 562507 565269 567745 570090 572480 575156 578593 583246 588970 594970 600630 606290 612925 621069
63068F21069R227R538R639J0168J1107J2075J3030J4288J5822J7064J7716J8342
$$ 621069 630296 639834 649473 659641 670748 682823 695853 710141 725963 743027 760743 779085
63056G79085J9693K1609K3211K4134K4996K6392K8101K9647L1092L2704L4171
$$ 779085 798778 820387 843598 867732 892728 919120 947221 976868 1007960 1040664 1074835
63045A074835L4896L4993L5325L6358L7538L8010L7685L7238L7273L7742L8201
$$ 1074835 1109731 1144724 1180049 1216407 1253945 1291955 1329640 1366878 1404151 1441893 1480094
63034A480094L8414L8497L8410L7518L5058L1203K7137K3709K0291J5526R097
$$ 1480094 1518508 1557005 1595415 1632933 1667991 1699194 1726331 1750040 1770331 1785857 1794954
63023A794954K193l848q835j3456j8206k2882k6863k9543l0634l0321k9098k7285
$$ 1794954 1797147 1793299 1784464 1771008 1752802 1729920 1703057 1673514 1642880 1612559 1583461 1556176
63011A556176k4783k1405j7247j2630p804k896J981O789J1627J6543K1260K5312
$$ 1556176 1531393 1509988 1492741 1480111 1472307 1469411 1471392 1478181 1489808 1506351 1527611 1552923
62999A552923K8560L1417L4378L7363L9695M0863M1123M1133M1094M0628L9582
$$ 1552923 1581483 1612900 1647278 1684641 1724336 1765199 1806322 1847455 1888549 1929177 1968759
62988A968759L8433L7513L6201L3450K9047K3752J8138J1924M684l297j1447j9784
$$ 1968759 2007192 2044705 2080906 2114356 2143403 2167155 2185293 2197217 2201901 2198604 2187157 2167373
62976B167373k8733l8079m6728n3721n9112o3530o7124o9329o9668o8410o6274
$$ 2167373 2138640 2100561 2053833 2000112 1941000 1877470 1810346 1741017 1671349 1602939 1536665
62965A536665o3754o0951n7853n4487n0799m6761m2678l9054l6045l3337l0709
$$ 1536665 1472911 1411960 1354107 1299620 1248821 1202060 1159382 1120328 1084283 1050946 1020237
62954A020237k8361k6481k4812k3029k1309k0049j9252j8592j8012j7715j7595
$$ 1020237 991876 965395 940583 917554 896245 876196 856944 838352 820340 802625 785030
62943G85030j7233j6465j5535j4581j3504j2433j1831j1822j1849j1295j0140
$$ 785030 767797 751332 735797 721216 707712 695279 683448 671626 659777 648482 638342
62932F38342q839p822p326p332p444p186o626o299o309o039n162m316m171m303
$$ 638342 629503 621681 614355 607023 599579 592393 585767 579468 573159 567120 561958 557642 553471 549168
62918E49168l773k600j717j586j666j484j346j612j931j762j269j077j386j847
$$ 549168 545395 542795 541078 539492 537826 536342 534996 533384 531453 529691 528422 527345 525959 524112
62904E24112k208k597l101l502l554l298k949k662k566k749l025k898k070r95
$$ 524112 521904 519307 516206 512704 509150 505852 502903 500241 497675 494926 491901 489003 486933 485938
62890D85938n08q37j250r74j90K76O7l87o86r97j494j825j532p87j51J95N05P87
$$ 485938 485430 484593 483343 482369 482179 482455 482522 482135 481449 480452 478958 477133 475601 474814 474663 474858 475363 476150
62872D76150O45j8o70p88n52n03p61r78r91j172j846k686k933k260j185m66k70
$$ 476150 476795 476777 476107 475319 474767 474264 473503 472525 471534 470362 468516 465830 462897 460637 459452 458986 458716
62855D58716j47J84M43L05k3r4J10J93L6j1K66N23K99l32q22p42j03P99J628K140
$$ 458716 458569 458753 459196 459501 459478 459384 459494 459687 459723 459712 459978 460501 460800 460468 459646 458904 458801 459600 461228 463368
62835D63368K348K453K501K152J101l22j302j369q11j35M93J072J359J167Q65
$$ 463368 465716 468169 470670 472822 473923 473601 472299 470930 470119 469984 470477 471549 472908 474075 474940
62820D74940J079J834K464K531K400K662L316L876M036L905L706L625L859M508
$$ 474940 476019 477853 480317 482848 485248 487910 491226 495102 499138 503043 506749 510374 514233 518741
62806E18741N387O145O603O782O754O655O757P259Q024Q801R599J0537J1467J2144
$$ 518741 524128 530273 536876 543658 550412 557067 563824 571083 579107 587908 597507 608044 619511 631655
62792F31655J2677J3421J4354J5052J5352J5668J6535J8169K0545K3429K6255
$$ 631655 644332 657753 672107 687159 702511 718179 734714 752883 773428 796857 823112
62781H23112K8521L0493L3075L6647M0526M3865M6558M8815N0381N0846N0437
$$ 823112 851633 882126 915201 951848 992374 1036239 1082797 1131612 1181993 1232839 1283276
62770A283276M9781M8902M7056M3588L8512L2210K5022J7230R072O33q002j6424
$$ 1283276 1333057 1381959 1429015 1472603 1511115 1543325 1568347 1585577 1594649 1595282 1587280 1570856
62758A570856k3979l0308l5581m0068m3684m6092m7210m7516m7685m7852m7365
$$ 1570856 1546877 1516569 1480988 1440920 1397236 1351144 1303934 1256418 1208733 1160881 1113516
62747A113516m5531m2587l9536l7006l4704l2184k9586k7244k5001k2493j9779
$$ 1113516 1067985 1025398 985862 948856 914152 881968 852382 825138 800137 777644 757865
62736G57865j7223j4919j2778j0892r399q112o814n652m755l699k007J8J602K555
$$ 757865 740642 725723 712945 702053 692654 684542 677728 672076 667321 663622 661615 661633 663235 665790
62722F65790L276L894M211M440N209O651Q231R635J1088J2709J4250J5712J7426
$$ 665790 669066 672960 677171 681611 686820 693471 701702 711337 722425 735134 749384 765096 782522
62709G82522J9324K0984K2564K4850K7955L0957L3371L6070L9978M4695M9247
$$ 782522 801846 822830 845394 870244 898199 929156 962527 998597 1038575 1083270 1132517
62698A132517N3460N7604O1342O4182O6596O9445P2396P4097P3933P2468O9998
$$ 1132517 1185977 1243581 1304923 1369105 1435701 1505146 1577542 1651639 1725572 1798040 1868038
62687A868038O5763N9138N0668M1278L1097J9752P367n391j8057l0494m2281n2573
$$ 1868038 1933801 1992939 2043607 2084885 2115982 2135734 2143101 2137710 2119653 2089159 2046878 1994305
62675A994305o0796o7151p2177p5941p7915p7732p5815p3079p0121o6934o3410
$$ 1994305 1933509 1866358 1794181 1718240 1640325 1562593 1486778 1413699 1343578 1276644 1213234
62664A213234n9675n5871n1956m7987m4308m1057l7787l4015l0047k6824k4917
$$ 1213234 1153559 1097688 1045732 997745 953437 912380 874593 840578 810531 783707 758790
62653G58790k3938k2970k1355j9135j6896j5227j4132j3130j1931j0764r867r064
$$ 758790 734852 711882 690527 671392 654496 639269 625137 612007 600076 589312 579445 570381
62641E70381q192p508p247p073o574o016n937o149n867m845l706l004k580j991
$$ 570381 562189 554681 547434 540361 533787 527771 521834 515685 509818 504973 501267 498263 495683 493692
62627D93692j141k78K02j08j199k315k615k223k049k405k499j587OJ381K072K166
$$ 493692 492551 492273 492475 492367 491168 488853 486238 484015 481966 479561 477062 475475 475481 476862 478934 481100
62611D81100J958J867K293L138L850M211M606N226N704N954O706Q455J0529J2001
$$ 481100 483058 484925 487218 490356 494206 498417 503023 508249 513953 519907 526613 535068 545597 557598
62597E57598J3039J4348J5748J6492J6848J8066K0488K2836K3839K3696K3359
$$ 557598 570637 584985 600733 617225 634073 652139 672627 695463 719302 742998 766357
62586G66357K3113K2522K1241J9170J6202J2490Q693N297J881k326p227j1758
$$ 766357 789470 811992 833233 852403 868605 881095 889788 895085 896966 894640 887413 875655
62574H75655j5117j7521j9605k1490k2741k3083k2846k2612k2546k2171k0963
$$ 875655 860538 843017 823412 801922 779181 756098 733252 710640 688094 665923 644960
62563F44960j9082j7248j5846j4481j2753j1061j0087r682q890p218n329m201
$$ 644960 625878 608630 592784 578303 565550 554489 544402 534720 525830 518612 513283 509082
62551E09082m004m110l967l530k991k450j947j552j321j192q98j04J215K528L188
$$ 509082 505078 500968 497001 493471 490480 488030 486083 484531 483210 482018 481120 481016 482231 484759 487947
62536D87947L256L475M293N230N614N577N767O267O542O413O443P138Q380R940
$$ 487947 491203 494678 498971 504201 509815 515392 521159 527426 533968 540381 546824 553962 562342 572282
62522E72282J1959J4443J6766J8253J9089K0119K1936K4521K7595L0798L3593
$$ 572282 584241 598684 615450 633703 652792 672911 694847 719368 746963 777761 811354
62511H11354L5601L7034L8458M0002M1204M1582M0978L9310L6478L2660K8268
$$ 811354 846955 883989 922447 962449 1003653 1045235 1086213 1125523 1162001 1194661 1222929
62500A222929K3447J7908J1481M438k836j0019j6506k1474k4722k7018k9077l0504
$$ 1222929 1246376 1264284 1275765 1280203 1277367 1267348 1250842 1229368 1204646 1177628 1148551 1118047
62488A118047l0409k8839k6817k4986k2923k0033j6527j3087j0055p342m818k326
$$ 1118047 1087638 1058799 1031982 1006996 984073 964040 947513 934426 924371 917029 912211 909885
62476I09885M42L595O640Q869J0055J0483J0282R246P349N012K619J77k407n017
$$ 909885 910327 913922 920562 929431 939486 949969 960251 969497 976846 981858 984477 984654 982247 977230
62462I77230p647j0674j4389j8466k2157k4924k6537k6941k6509k6160k6530k7012
$$ 977230 969583 958909 944520 926054 903897 878973 852436 825495 798986 772826 746296 719284
62450G19284k6381k4364k1930j9824j7692j5100j2536j0739r527q219o778n724
$$ 719284 692903 668539 646609 626785 609093 593993 581457 570718 561191 552972 546194 540470
62438E40470n095m347l253k178j366o20J92Q98J388J679J599R24q7r32j683k899
$$ 540470 535375 531028 527775 525597 524231 523611 523803 524701 526089 527768 529367 530291 530204 529272 527589 524690
62422E24690m595n999o572o661o812p063p250p332p101o201m882m098m323m826
$$ 524690 520095 514096 507524 500863 494051 486988 479738 472406 465305 459104 454222 450124 445801 440975
62408D40975m689m023l461l049k441j818j683j909j813j164m29l0L2j50n05p37
$$ 440975 436286 432263 428802 425753 423312 421494 419811 417902 416089 414925 414496 414466 414498 414348 413843 413106
62392D13106n47p8L20O99J371K227K769K848K789K823K887K929K971K921K877
$$ 413106 412559 412481 412801 413500 414871 417098 419867 422715 425504 428327 431214 434143 437114 440035 442912
62377D42912L364M568N566N276M117L686M586N738O216O623P855R500J0448J0537
$$ 442912 446276 450844 456410 461686 465803 469489 474075 479813 486029 492652 500507 510007 520455 530992
62363E30992J0602J1182J2165J3502J5373J7627J9699K1263K2577K4098K6095
$$ 530992 541594 552776 564941 578443 593816 611443 631142 652405 674982 699080 725175
62352G25175K8530L1009L2949L4117L4847L5338L4997L2986K9340K5015K0814
$$ 725175 753705 784714 817663 851780 886627 921965 956962 989948 1019288 1044303 1065117
62341A065117J6716J2306P442K358k592p126j1184j4949j8564k1840k4427k6186
$$ 1065117 1081833 1094139 1101581 1103939 1101347 1094221 1083037 1068088 1049524 1027684 1003257 977071
62329I77071k7220k7620k7376k6473k4862k2502j9683j7134j5436j4450j3652
$$ 977071 949851 922231 894855 868382 843520 821018 801335 784201 768765 754315 740663
62318G40663j2918j2543j2614j2816j2898j2943j3063j3233j3430j3637j3676
$$ 740663 727745 715202 702588 689772 676874 663931 650868 637635 624205 610568 596892
62307E96892j3411j3065j2953j2878j2277j1049r727q681p724o711n991n768n534
$$ 596892 583481 570416 557463 544585 532308 521259 511532 502851 495127 488416 482425 476657 471123
62294D71123m634l131j678o88j50Pj00n0N14J233J255L48o58p19M04K166L916
$$ 471123 466489 463358 461680 460992 460842 460849 460749 460699 461213 462446 463701 464049 463391 462672 463076 465242 469158
62277D69158N233N805N463M444L426L071L530M419N216N659N784N765N894O558
$$ 469158 474391 480196 485659 490103 493529 496600 500130 504549 509765 515424 521208 526973 532867 539425
62263E39425P965R786J1402J2622J3907J5594J7286J8493J9693K2005K5687K9582
$$ 539425 547390 557176 568578 581200 595107 610701 627987 646480 666173 688178 713865 743447
62251G43447L2340L3790L4673L5483L6103L6259L5724L4113L1049K6613K1272
$$ 743447 775787 809577 844250 879733 915836 952095 987819 1021932 1052981 1079594 1100866
62240A100866J5370R095K901k605p353j1912j6681k1442k5825k9686l2743l4482
$$ 1100866 1116236 1125331 1128232 1125627 1118274 1106362 1089681 1068239 1042414 1012728 979985 945503
62228I45503l4874l4697l4582l4143l2802l1029k9775k8838k6852k3279j9418
$$ 945503 910629 875932 841350 807207 774405 743376 713601 684763 657911 634632 615214
62217F15214j6878j5633j4420j2604j0860r969r667r045p756o458n954o141o033
$$ 615214 598336 582703 568283 555679 544819 534850 525183 516138 508382 501924 495970 489829 483796
62204D83796m978l507k744l015l505l285k269j052j86J32O6Q5O70J818K950L583
$$ 483796 478818 475311 472567 469552 466047 462762 460493 459441 459255 459387 459453 459538 460208 462026 464976 468559
62188D68559L799L968M233M562M963N427N878O395P140P818P707O647N625N694
$$ 468559 472358 476326 480559 485121 490084 495511 501389 507784 514924 522742 530449 537096 542721 548415
62174E48415O627P278P153O842O926P229P471P926R019J0613J2242J3811J5714
$$ 548415 555042 562320 569473 576315 583241 590470 597941 605867 614886 625499 637741 651552 667266
62161F67266J8288K1310K4043K5741K6249K6119K5973K5629K4238K1320J7405
$$ 667266 685554 706864 730907 756648 782897 809016 834989 860618 884856 906176 923581
62150I23581J3420R750O185K601p17l504n964q559j1358j3878j5705j7058j8456
$$ 923581 937001 946751 952936 955537 954820 951316 945352 936793 925435 911557 895852 878794 860338
62137H60338j9736j9889j8170j5080j1870r219o891m581k485q40O13K334M328
$$ 860338 840602 820713 802543 787463 775593 766374 759483 754902 752417 751577 752190 754524 758852
62124G58852O100P200P634P775P947Q111P947P208N939M315K500P60n73j527k623
$$ 758852 764952 772152 779786 787561 795508 803619 811566 818774 824713 829028 831528 832288 831715 830188 827565
62109H27565m217n812o579o434o196o595p593q661r288r129q112o649n350m374
$$ 827565 823348 817536 810957 804523 798327 791732 784139 775478 766190 757061 748949 742300 736950 732576
62095G32576l330j900j77J653L473N049O082O707P379Q129Q452Q225Q212R145
$$ 732576 729246 727346 727169 728822 732295 737344 743426 750133 757512 765641 774093 782318 790530 799675
62081G99675J0717J1974J2442J2445J2559J3150J4234J5458J6391J7053J7834
$$ 799675 810392 822366 834808 847253 859812 872962 887196 902654 919045 936098 953932
62070I53932J8637J8673J7495J5830J4706J4170J3529J2605J1937J1858J2141
$$ 953932 972569 991242 1008737 1024567 1039273 1053443 1066972 1079577 1091514 1103372 1115513
62059A115513J2656J3568J4756J5630J5832J5643J5345J4609J2833R897O366L032
$$ 1115513 1128169 1141737 1156493 1172123 1187955 1203598 1218943 1233552 1246385 1256282 1262648 1265680
62047A265680L10k106n011q887j3314j7396k0758k3802k6978l0162l2827l4541
$$ 1265680 1265990 1263884 1258873 1249986 1236672 1219276 1198518 1174716 1147738 1117576 1084749 1050208
62035A050208l5226l5221l5064l4918l4237l2407k9780k7508k6193k5110k3144
$$ 1050208 1014982 979761 944697 909779 875542 843135 813355 785847 759654 734544 711400
62024G11400k0174j7176j5156j4318j4099j3763j2955j1865j0861j0008r139q302
$$ 711400 691226 674050 658894 644576 630477 616714 603759 591894 581033 571025 561886 553584
62012E53584p734p372o767n757m746m122l771l521l573m027m287l645k317j221
$$ 553584 545850 538478 531711 525954 521208 517086 513315 509794 506221 502194 497907 494262 491945 490724
61998D90724p55m19K25Q68J110J117J228J296R70L47k37p92j517k165k290k126
$$ 490724 489969 489550 489775 490643 491753 492870 494098 495394 496364 496711 496474 495682 494165 492000 489710 487584
61982D87584k516l653m642m707m344m550n360n846n491m774m332m170l952l518
$$ 487584 485068 481415 476773 472066 467722 463172 457812 451966 446475 441701 437369 433199 429247 425729
61968D25729k870k044j308j079j361j556j142l01M19P93R62J049J078J161J421
$$ 425729 422859 420815 419507 418428 417067 415511 414369 414068 414487 415280 416242 417291 418369 419530 420951
61953D20951J828K250K551K536K082J514J473K138K930L305L492L979M693N268
$$ 420951 422779 425029 427580 430116 432198 433712 435185 437323 440253 443558 447050 451029 455722 460990
61939D60990N761O438P107P405P630Q431R673J0404J0116R320Q639Q079P525P193
$$ 460990 466751 473189 480296 487701 495331 503762 513435 523839 533955 543275 551914 559993 567518 574711
61925E74711P121O804N869M663L612K520J077l46j077j188j403k067k827l356
$$ 574711 581832 588636 594505 599168 602780 605300 606377 606031 604954 603766 602363 600296 597469 594113
61911E94113l729l973l749k863j682o69K77J692L786O066P760Q445Q226P411O230
$$ 594113 590384 586411 582662 579799 578117 577448 577725 579417 583203 589269 597029 605474 613700 621111 627341
61896F27341M813L329J908N02j022k620m061n233o307p391q184q241p635p095
$$ 627341 632154 635483 637391 637893 636871 634251 630190 624957 618650 611259 603075 594834 587199 580104
61882E80104p251p823p871o944n682n035n142n374n312n113m868m351l692l617
$$ 580104 572853 565030 557159 550215 544533 539498 534356 528982 523670 518557 513689 509338 505646 502029
61868E02029m391n028m296k262j38J274K169K859L210L189L271L904N027O354
$$ 502029 497638 492610 488314 486052 485914 487188 489357 492216 495426 498615 501886 505790 510817 517171
61854E17171P640Q549Q811Q765R176J0260J1371J1969J2361J3074J4020J4738
$$ 517171 524811 533360 542171 550936 560112 570372 581743 593712 606073 619147 633167 647905
61842F47905J5021J4871J4204J3117J2008J0996R585P433N003K906R81j199l263
$$ 647905 662926 677797 692001 705118 717126 728122 737707 745140 750143 753049 754030 752831 749568
61829G49568m386m602m855n586o036n293l426j256N90J987L056L935M709N215
$$ 749568 745182 740580 735725 730139 724103 718810 715384 714128 714718 716705 719761 723696 728405 733620
61815G33620N064L979K116j33k548n160p964j0692j2941j4520j5518j6100j6321
$$ 733620 738684 742663 744779 744646 742098 736938 728974 718282 705341 690821 675303 659203 642882
61802F42882j6307j6325j6407j6088j4914j3240j1927j1272j0719r849r018q677
$$ 642882 626575 610250 593843 577755 562841 549601 537674 526402 515683 505834 496816 488139
61790D88139q578q123p062n542l882k691k614l429l895l185k010j629k208k936
$$ 488139 479561 471438 464376 458834 454952 452261 449647 446218 442323 439138 437128 435499 433291 430355
61776D30355l332l480l273k533j828k039k967l351k552j343p02o46o95o28l72
$$ 430355 427023 423543 420270 417737 415909 413870 410903 407552 405000 403657 402955 402309 401614 400986 400614
61761D00614K02Q80J077O95M24Q03J487J869J891J751J376P86N27J041J924K367
$$ 400614 400816 401696 402773 403468 403892 404695 406182 408051 409942 411693 413069 413855 414382 415423 417347 419714
61745D19714K115J568J148J019J113J068M36n52q52J57J644K211J612R00R52J585
$$ 419714 421829 423397 424545 425564 426677 427745 428181 427629 426777 426934 428578 430789 432401 433301 434253 435838
61729D35838K169K469K587K655K848L381M164M717M562L632K298J150O97R75J430
$$ 435838 438007 440476 443063 445718 448566 451947 456111 460828 465390 469022 471320 472470 473167 474142 475572
61714D75572J439J015P11Q28J023Q42K75l31p85j193j700k284k818l218l466l521
$$ 475572 477011 478026 478737 479565 480588 481430 481705 481374 480589 479396 477696 475412 472594 469376 465910 462389
61698D62389l281k716k006j466j299j554k217l090l638l355k420j691j741k183
$$ 462389 459108 456392 454386 452920 451621 450067 447850 444760 441122 437767 435347 433656 431915 429732
61684D29732k260j834j365j093p64k08K56J55o00j668k581l015k873k248j323
$$ 429732 427472 425638 424273 423180 422416 422208 422464 422619 422019 420351 417770 414755 411882 409634 408311
61669D08311l29M13O76O04O66J056J414J322Q72N34N36P84J125J373J180M08m10
$$ 408311 407982 408395 409071 409675 410341 411397 412811 414133 415005 415539 416075 416859 417984 419357 420537 420945 420535
61652D20535m71L13J217J637J741J914K076J921J507J160R43O93N31Q78J759K463
$$ 420535 420064 420377 421594 423231 424972 426886 428962 430883 432390 433550 434493 435186 435717 436595 438354 440817
61636D40817K234J205L64M62J194J607J209L50m34j041j624k104k326k410k571
$$ 440817 443051 444256 444620 445082 446276 447883 449092 449442 449008 447967 446343 444239 441913 439503 436932
61621D36932k672k406j891j610j678j598j031m33n71j597k874l630l523k765j942
$$ 436932 434260 431854 429963 428353 426675 425077 424046 423613 423042 421445 418571 414941 411418 408653 406711
61606D06711j640k000k597k963l065l191l418l569l584l557l361k692j655r75
$$ 406711 405071 403071 400474 397511 394446 391255 387837 384268 380684 377127 373766 371074 369419 368444
61592C68444j214k026k566k521k331k425k697k908l089l267l196k771k391k431
$$ 368444 367230 365204 362638 360117 357786 355361 352664 349756 346667 343400 340204 337433 335042 332611
61578C32611k560k128j167m33l91p68j189j649k106k221j903j621j736j910j708
$$ 332611 330051 327923 326756 326323 325932 325164 323975 322326 320220 317999 316096 314475 312739 310829 309121
61563C09121j286j017q04m33k51p01j410j521r45l80j35J97P07P58P1n53k69O31
$$ 309121 307835 306818 306014 305581 305330 304629 303219 301698 300753 300373 300238 300435 301142 301900 301971 301418 301149 301780
61545C01780J143Q05j6p80j164j035n63k21k78m55l94k26k47l25j27K33L22P3
$$ 301780 302923 303728 303712 302932 301768 300733 300170 299949 299671 299216 298822 298596 298349 298024 297897 298130 298452 298525
61527B98525j51q0K16M91L67n47k033l013k651j516r13j110j115m09J72k06j045
$$ 298525 298374 298294 298510 299001 299368 298821 296788 293775 291124 289608 288695 287585 286470 286061 286233 286027 284982
61510B84982j285q12l27j74j53l08q83j531j473o46N4O4r2J89M59j34j424k283
$$ 284982 283697 282885 282558 282384 282231 281923 281040 279509 278036 277390 277444 277508 277416 277605 278064 277930 276506 274223
61492B74223k112j476j102r12m86O3K13j15m61n01l67j95J35N91P69L98j89l96
$$ 274223 272111 270635 269533 268621 268135 268198 268411 268296 267835 267334 266967 266772 266907 267498 268267 268665 268476 268080
61474B68080m7N81J179J525J380P19M2o7L06N05K80N1N3j37q38j493j373p22m46
$$ 268080 268033 268614 269793 271318 272698 273417 273459 273392 273698 274203 274483 274534 274587 274450 273612 272119 270746 270024 269578
61455B69578p33p45J38J370J918J538R33Q51J348J871J830J114K21j84P0M49L03
$$ 269578 268845 268100 268238 269608 271526 273064 273997 274848 276196 278067 279897 281011 281232 281048 281118 281567 281870
61438B81870l99j074j110l78P59J699J963J514Q46N73Q22J121R75M90K96P65J489
$$ 281870 281471 280397 279287 278909 279668 281367 283330 284844 285690 286263 287085 288206 289181 289671 289967 290732 292221
61421B92221J652R96J50j09K47N91N53M25N70Q35Q75P77Q81J142J097O04Q5j29
$$ 292221 293873 294869 295019 294910 295157 295748 296301 296726 297296 298131 299006 299783 300664 301806 302903 303507 303592 303463
61403C03463k98o87q47j28J152J709Q00p73j652j554j315j447j430p32J84M28
$$ 303463 303165 302478 301631 301503 302655 304364 305164 304391 302739 301185 299870 298423 296993 296261 296445 296873
61387B96873j04o88q65q37q26o32j09M14O00O42R70J576K009J955J445O13l93
$$ 296873 296769 296081 295216 294379 293553 292921 292812 293226 293826 294468 295438 297014 299023 300978 302423 303036 302643
61370C02643j211j324n78N54J383J643J633J750K015K117J862J451J188J050Q13
$$ 302643 301432 300108 299530 300084 301467 303110 304743 306493 308508 310625 312487 313938 315126 316176 316989
61355C16989N69Q02J736K864L352K926K126J837K584M130N577O036N438M598M289
$$ 316989 317558 318360 320096 322960 326312 329238 331364 333201 335785 339915 345492 351528 356966 361564 365853
61340C65853M466M586M434M277M269M259M100L866L629L390L236L270L328L115
$$ 365853 370319 374905 379339 383616 387885 392144 396244 400110 403739 407129 410365 413635 416963 420078
61326D20078K649K269K104J870J360P52K85r0m57o27l78J76P28J195J729K390
$$ 420078 422727 424996 427100 428970 430330 431082 431367 431277 430820 430193 429815 429991 430719 431914 433643 436033
61310D36033L062L631M079M436M720M958N155N365N846O915Q469R787J0101R353
$$ 436033 439095 442726 446805 451241 455961 460919 466074 471439 477285 484200 492669 502456 512557 521910
61296E21910Q193P232O426N315L702J957N91l05j120k174l342m259m768m983n058
$$ 521910 530103 537335 543761 549076 552778 554735 555326 555021 553901 551727 548385 544126 539358 534375 529317
61281E29317n126n348n784o262o533o495o069n108l740k579k085j853j125O5R34
$$ 529317 524191 518843 513059 506797 500264 493769 487700 482592 478852 476273 474188 472335 471210 471275 472209
61266D72209J148J248J633J932J824J739K157K784L117L342L907M585M773M539
$$ 472209 473357 474605 476238 478170 479994 481733 483890 486674 489791 493133 497040 501625 506398 510937
61252E10937M510M818M947M725M612M808M772M045L035K555K826L270L122K168
$$ 510937 515447 520265 525212 529937 534549 539357 544129 548174 551209 553764 556590 559860 562982 565150
61238E65150J005N58J040J480P91p83j801j392k23N62P84J072J678K172K194J978
$$ 565150 566155 566713 567753 569233 570024 569241 567440 566048 565825 566387 567171 568243 569921 572093 574287 576265
61222E76265J984K401L105L899M622N185N576N865O137O418O621O584O282N888
$$ 576265 578249 580650 583755 587654 592276 597461 603037 608902 615039 621457 628078 634662 640944 646832
61208F46832N613N506N557N855O314O394N472L695K088J619K341L552M525M955
$$ 646832 652445 657951 663508 669363 675677 682071 687543 691238 693326 694945 697286 700838 705363 710318
61194G10318N003N200N967P024P506P025O338O539P661Q652Q664P888O974O103
$$ 710318 715321 720521 726488 733512 741018 748043 754381 760920 768581 777233 785897 793785 800759 806862
61180H06862N066L916L042K578K129J293K02o31r27q66p50p02p71j048j540k088
$$ 806862 811928 815844 818886 821464 823593 824886 825088 824457 823530 822664 821914 821212 820441 819393 817853 815765
61164H15765k578l127l856m644n304n912o683p602q430r069r545r712r325q534
$$ 815765 813187 810060 806204 801560 796256 790344 783661 776059 767629 758560 749015 739303 729978 721444
61150G21444p900p779p981q146q132p825p046n909m982m651m612m355l931l756
$$ 721444 713544 705765 697784 689638 681506 673681 666635 660726 655744 651093 646481 642126 638195 634439
61136F34439l860l873l667l466l223k514j258r1L48J54m9K25J153K756M809O722
$$ 634439 630579 626706 623039 619573 616350 613836 612578 612487 612835 612989 612940 613165 614318 617074 621883 628605
61120F28605P909Q344Q585R285J0756J2768J4611J5565J5701J6020J7357J9311
$$ 628605 636514 644858 653443 662728 673484 686252 700863 716428 732129 748149 765506 784817
61108G84817K0705K1048K0945K1043K1155K0762J9831J8706J7583J6514J5615
$$ 784817 805522 826570 847515 868558 889713 910475 930306 949012 966595 983109 998724
61097I98724J4751J3298J0809P782N233L531K093L01j839m029o208q521j0961
$$ 998724 1013475 1026773 1037582 1045364 1050597 1054128 1056221 1056522 1054683 1050654 1044446 1035925 1024964
61084A024964j3224j4781j5233j4878j4715j5435j6492j6810j6246j5652j5369
$$ 1024964 1011740 996959 981726 966848 952133 936698 920206 903396 887150 871498 856129
61073H56129j4633j2884j0836r494q694p443n409l277j739p64J11J292K957M939
$$ 856129 841496 828612 817776 808282 799588 792145 786736 783459 781720 780956 781067 782359 785316 790255
61059G90255O760Q063R029J0069J1262J2408J3471J4616J5889J7212J8579J9968
$$ 790255 797015 805078 814107 824176 835438 847846 861317 875933 891822 909034 927613 947581
61047I47581K1171K2052K2826K3792K4982K6424K8373L0836L3164L4769L6116
$$ 947581 968752 990804 1013630 1037422 1062404 1088828 1117201 1148037 1181201 1215970 1252086
61036A252086L8335M1797M5664M8916N1328N3345N5501N8049O0883O3628O6055
$$ 1252086 1290421 1332218 1377882 1426798 1478126 1531471 1586972 1645021 1705904 1769532 1835587
61025A835587O8357P0835P3530P6467P9959Q4335Q9568R5588J02626J10796J19757
$$ 1835587 1903944 1974779 2048309 2124776 2204735 2289070 2378638 2474226 2576852 2687648 2807405
61014B807405J29412J40571J54375J71539J92801K19366K51896K89738L32527
$$ 2807405 2936817 3077388 3231763 3403302 3596103 3815469 4067365 4357103 4689630
61005D689630L81974M40491N08387N83819O64690P48208Q29029R00384R55551
$$ 4689630 5071604 5512095 6020482 6604301 7268991 8017199 8846228 9746612 10702163
60996A0702163R82530R56838Q49984O57161M17547J98296N1440j4381k3117l545
$$ 10702163 11684693 12641531 13491515 14148676 14566223 14764519 14815959 14801578 14778461 14774916
60986A4774916J9680J4603n8985k23935m58174o99925q85704r85667j007550r76049
$$ 14774916 14794596 14809199 14750214 14526279 14068105 13368180 12482476 11496809 10489259 9513210
60976I513210r13875q37119p57237o80761o08699n39717m74052m13500l59028
$$ 9513210 8599335 7762216 7004979 6324218 5715519 5175802 4701750 4288250 3929222
60967C929222l10387k67628k31319k01340j76644j56156j39064j24534j11957
$$ 3929222 3618835 3351207 3119888 2918548 2741904 2585748 2446684 2322150 2210193
60958B210193j01292r2417q4493p6776o9637o3900n9518n5736n2184m8935m5881
$$ 2210193 2108901 2016484 1931991 1855215 1785578 1721678 1662160 1606424 1554240 1505305 1459424
60947A459424m3004m0840l9640l8450l6212l3388l1284l0008k8541k6622k5038
$$ 1459424 1416420 1375580 1335940 1297490 1261278 1227890 1196606 1166598 1138057 1111435 1086397
60936A086397k3966k2624k0921j9933k0117k0416j9893j9104j8934j9073j8614
$$ 1086397 1062431 1039807 1018886 998953 978836 958420 938527 919423 900489 881416 862802
60925H62802j7504j6460j5897j5723j5775j5840j5535j4663j3429j2058j0606
$$ 862802 845298 828838 812941 797218 781443 765603 750068 735405 721976 709918 699312
60914F99312r391q989r412r878r794r402r056q501p421o175n364n040m845m587
$$ 699312 689921 680932 671520 661642 651848 642446 633390 624889 617468 611293 605929 600889 596044 591457
60900E91457m200l511k524j676j395j617j981k198k107j745j530j832k273k121
$$ 591457 587257 583746 581222 579546 578151 576534 574553 572355 570248 568503 566973 565141 562868 560747
60886E60747j617j910l337m699m904m443m395m760m839m591m505m581m529m668
$$ 560747 559130 557220 553883 549184 544280 539837 535442 530682 525843 521252 516747 512166 507637 502969
60872E02969n429o208n944m754l865l707l347k170j007q91j525j790j269n28j45
$$ 502969 497540 491332 485388 480634 476769 473062 469715 467545 466538 465647 464122 462332 461063 460535 460390
60857D60390j10j69k55n08j007j560j684r79M11J829K675K843K576K123J630J194
$$ 460390 460280 460111 459856 459348 458341 456781 455097 454118 454529 456358 459033 461876 464452 466575 468205 469399
60841D69399Q24M32ll26l68k46l56r60j745k061j691j199j228j658j830j549j306
$$ 469399 470223 470655 470652 470326 469958 469712 469356 468396 466651 464590 462899 461700 460472 458814 456984 455435 454129
60824D54129j434j652j684j731j957k046j791j629j969k292j772p03m83j926m139
$$ 454129 452695 451043 449359 447628 445671 443625 441834 440205 438236 435944 434172 433469 432986 431060 426921
60809D26921n415m970l528k393k210k571k676k271j824j825k142k240j855j239
$$ 426921 421506 416536 413008 410615 408405 405834 403158 400887 399063 397238 395096 392856 391001 389762
60795C89762q14p07o14j02Q38J572J492Q21L70M15M17N0j30M85J599K446K813
$$ 389762 388948 388241 387627 387525 388363 389935 391427 392248 392618 393033 393450 393500 393370 393855 395454 397900 400713
60778D00713L067L439L825M105M154L756L026K628L051L916M526M785N032N265
$$ 400713 403780 407219 411044 415149 419303 423059 426085 428713 431764 435680 440206 444991 450023 455288
60764D55288N244N081N008M774M085L448L656M521N055M869M516M386M261M137
$$ 455288 460532 465613 470621 475395 479480 482928 486584 491105 496160 501029 505545 509931 514192 518329
60750E18329M452N124N333M733M042L881L886L526L136L298L799L935L578L237
$$ 518329 522781 527905 533238 537971 542013 545894 549780 553306 556442 559740 563539 567474 571052 574289
60736E74289L331L856M571N092N094M774M708N050N371N606O407P975R322R515
$$ 574289 577620 581476 586047 591139 596233 601007 605715 610765 616136 621742 628149 636124 645446 654961
60722F54961R037Q959R269R161Q665Q732R597J0298J0092R357Q672P899O762N570
$$ 654961 663998 672957 682226 691387 700052 708784 718381 728679 738771 748128 756800 764699 771461 777031
60708G77031M750M116L199J938N25j069k910m735o212p372q358r018r225r361
$$ 777031 781781 785897 789096 791034 791559 790490 787580 782845 776633 769261 760903 751885 742660 733299
60694G33299r959j0935j1683j1936j2028j2276j2584j2724j2638j2306j1658j0805
$$ 733299 723340 712405 700722 688786 676758 664482 651898 639174 626536 614230 602572 591767
60682E91767j0052r532r093q688q596q950r321r091q176p120o443o152n883n379
$$ 591767 581715 572183 563090 554402 545806 536856 527535 518444 510268 503148 496705 490553 484670 479291
60668D79291m753m351m366m580m590m256l803l457l181k922k779k799k812k720
$$ 479291 474538 470187 465821 461241 456651 452395 448592 445135 441954 439032 436253 433454 430642 427922
60654D27922k698k779k570j781q43m59o62q33n90r1N56J438K244K227J143k82
$$ 427922 425224 422445 419875 418094 417251 416792 416130 415297 414707 414616 415172 416610 418854 421081 422224 421942
60638D21942j202j488j419j089o07l89o16p62k88N04R37R89J142J369J130M18
$$ 421942 420740 419252 417833 416744 416137 415748 415132 414370 414082 414586 415523 416512 417654 419023 420153 420571
60622D20571k4K05N28J82q13j785k161j798r29j22%p04j722k445k741k832k808
$$ 420571 420547 420752 421280 421462 420649 418864 416703 414905 413976 413854 413854 413150 411428 408983 406242 403410 400602
60605D00602k502j791r00l57n76j390k102k161j715j284j067q78o58n64n94n33
$$ 400602 398100 396309 395409 395052 394476 393086 390984 388823 387108 385824 384757 383879 383221 382657 382063 381530
60589C81530l00j4L38Q48J233J000K35k16K05R79J125M71j81LJ072K465L602M217
$$ 381530 381230 381216 381554 382402 383635 384635 384870 384654 384859 385838 386963 387434 387253 387256 388328 390793 394395 398612
60571C98612M275L918L526L710M824O451P613P749P228O745O525O404O254N827
$$ 398612 402887 406805 410331 414041 418865 425316 432929 440678 447906 454651 461176 467580 473834 479661
60557D79661M531K128n45k302k968l255l339k626j147l7j7k51N05K208L811M753
$$ 479661 484192 486320 485775 483473 480505 477250 473911 471285 470138 470101 470084 469833 470338 472546 476357 481110
60541D81110N347N964O568O959O908O188M944L836L291K839J787K48j015j612
$$ 481110 486457 492421 498989 505948 512856 519044 523988 527824 531115 533954 535741 535989 534974 533362
60527E33362j698j300l29P07Q51n8r42p43K71Q96M56m44p08O3J219J903K065K394
$$ 533362 531664 530364 530035 530742 531593 531535 530593 529850 530121 531017 531473 531029 530321 530384 531603 533506 535571 537965
60509E37965L303M368N004N343N946O916P878Q728R851J1547J3702J6093J8621
$$ 537965 541268 545636 550640 555983 561929 568845 576723 585451 595302 606849 620551 636644 655265
60496F55265K1065K3014K4238K4874K5136K5025K4318K2557J9083J3492O219j602
$$ 655265 676330 699344 723582 748456 773592 798617 822935 845492 864575 878067 884286 882684
60484H82684q994j5562k1156k5539k8571l0347l0976l0504k9260k7801k6259k4080
$$ 882684 873690 858128 836972 811433 782862 752515 721539 691035 661775 633974 607715 583635
60472E83635k0962j7707j5553j4689j3964j2312r996q138p328p185p140p029o768
$$ 583635 562673 544966 529413 514724 500760 488448 478452 470314 462986 455801 448661 441632 434864
60459D34864o014m688l504l310l937m349m030l525l344l067k181j170r98j685
$$ 434864 428850 424162 420658 417348 413411 409062 405032 401507 398163 395096 392915 391745 390747 389062
60445C89062k286k220j895j898k218k483k454k073j438q70o52o15m52l79q87j725
$$ 389062 386776 384556 382661 380763 378545 376062 373608 371535 370097 369227 368575 367960 367508 367129 366242 364517
60429C64517j871q90L50P78L55k68p52j040q47j1Q37Q41J21l08R1Q20J252J407
$$ 364517 362646 361756 362106 362884 363239 362971 362219 361179 360332 360321 361158 361999 362120 361812 361903 362723 363975 365382
60411C65382J476J264O43R0J69O61P59J94l70j94O16J297J342R71O82O42O30N20
$$ 365382 366858 368122 368765 368855 369024 369685 370444 370638 370268 370074 370690 371987 373329 374300 374982 375624 376254 376774
60393C76774N31Q85J414J729J771J891K300K683K604K108J615J280Q62K84p9P0
$$ 376774 377305 378190 379604 381333 383104 384995 387295 389978 392582 394690 396305 397585 398447 398731 398652 398722
60377C98722M73P49J053J799K816L360L142K785K923L356L505L328L134K751J694
$$ 398722 399195 399944 400997 402796 405612 408972 412114 414899 417822 421178 424683 428011 431145 433896 435590
60362D35590K17n75j5J242K036J974J476R88P41J029J949K837K675J433M32R15
$$ 435590 435807 435232 435217 436459 438495 440469 441945 442933 443674 444703 446652 449489 452164 453597 454029 454944
60346D54944K547L912M318M435N030N664N196L290R82l78m06J43K47m11j316j860
$$ 454944 457491 461403 465721 470156 475186 480850 486046 489336 490318 489940 489534 489677 489924 489513 488197 486337
60330D86337k137k757l788m373l799k664k227k734l157k799k195k019j904j202
$$ 486337 484200 481443 477655 473282 469483 466819 464592 461858 458701 455902 453707 451688 449784 448582
60316D48582l03j10n06l94O79J915K558K860L416M256N116O033P077P904Q131
$$ 448582 448279 448169 447663 447269 447948 449863 452421 455281 458697 462953 468069 474102 481179 489083 497214
60301D97214P940P869Q128Q411Q221P131N006K251m38k724m768o447p058o223
$$ 497214 505154 513023 521151 529562 537783 544914 549920 552171 551733 549009 544241 537794 530736 524513
60287E24513m724l807l885m475n080n498n417m620l583l201l710m481m975n249
$$ 524513 519789 515982 512097 507622 502542 497044 491627 487007 483424 480223 476513 472032 467057 461808
60273D61808n332m902l922l044k786k831k622k245k120k168j981j627j576j844
$$ 461808 456476 451574 447652 444608 441822 438991 436369 434124 432004 429836 427855 426228 424652 422808
60259D22808j928j703j730k388l166l267k545j549q38n99p23r59j019q21n14j19
$$ 422808 420880 419177 417447 415059 411893 408626 406081 404532 403694 403095 402372 401413 400394 399573 399059 398940
60243C98940N67J447J863J328M23L12J311K470K751K138J286O04J49M9L82P81
$$ 398940 399507 400954 402817 404145 404568 404880 406191 408661 411412 413550 414836 415440 415589 415638 416020 416801
60227D16801P34L46K67P74J367J495J324J387J763J960J616J062R88J632K441
$$ 416801 417535 417881 418148 418922 420289 421784 423108 424495 426258 428218 429834 430896 431884 433516 435957
60212D35957K660K228J865K177K936L463L518L454L603L962M445N017N511N672
$$ 435957 438617 440845 442710 444887 447823 451286 454804 458258 461861 465823 470268 475285 480796 486468
60198D86468N501N243M940M406L745L425L635L956L892L408K710J903J143P32
$$ 486468 491969 497212 502152 506558 510303 513728 517363 521319 525211 528619 531329 533232 534375 535107
60184E35107O83N96J69m38j106k086l368m233m064l255k631k318j940j634j934
$$ 535107 535790 536386 536555 536117 535011 532925 529557 525324 521260 518005 515374 513056 511116 509482 507548
60169E07548k696l073k756k337k258k163j708j196r84q82o30m69o71r17p43k88
$$ 507548 504852 501779 499023 496686 494428 492265 490557 489361 488377 487495 486865 486396 485725 484808 484065 483777
60153D83777l5p2m1K45O31R01J030J154J492K068K454K197J587J477K053K438
$$ 483777 483742 483670 483629 483874 484505 485406 486436 487590 489082 491150 493604 495801 497388 498865 500918 503356
60137E03356K067J707K337L516L881L123K461K968M321N397N472M526K989J524
$$ 503356 505423 507130 509467 512983 516864 519987 522448 525416 529737 535134 540606 545132 548121 549645
60123E49645O53L12O7j79n4N70J247J505J316Q60K95j20p1L87Q36J059J175J147
$$ 549645 550298 550610 550677 550498 550444 551014 552261 553766 555082 555942 556237 556117 556046 556433 557269 558328 559503 560650
60105E60650P15mm32l66k46l35k27L13O70J83r08j938k761l441l518k586j365
$$ 560650 561365 561361 560929 560563 560317 559982 559755 560068 560738 560921 560013 558075 555314 551873 548355 545769 544404
60088E44404j112j958k704k394j319k45N14R68J064Q58N92L49P9P3P03J542J523
$$ 544404 543292 541334 538630 536236 534917 534672 535186 536154 537218 538076 538668 539017 539096 539169 539872 541414 542937
60071E42937M22n90n29j9l46j599k760l328l800m404m474l587k594k753m128n469
$$ 542937 543359 542769 542240 542221 541875 540276 537516 534188 530388 525984 521510 517923 515329 512576 508448 502979
60055E02979n727n148m704m743m677l980l030k564k581k331j423m10K2k2M6M15
$$ 502979 497252 492104 487400 482657 477980 474000 470970 468406 465825 463494 462071 461661 461683 461661 461707 462122
60039D62122P83R70J122J404J905K725L669L992L032J244N3L28J440K087J716
$$ 462122 462905 463875 464997 466401 468306 471031 474700 478692 481724 482968 483021 483349 484789 486876 488592
60024D88592Q11K2n33j147k000k903l473l587l589l945m704n494n989o150n916
$$ 488592 489403 489425 488892 487745 485745 482842 479369 475782 472193 468248 463544 458050 452061 445911 439995
60009D39995n086l700k292j413j045q29o79p92j093j127o07J76P25Q63P22M73
$$ 439995 434909 431209 428917 427504 426459 425630 424951 424159 423066 421939 421332 421508 422233 423096 423818 424291
59993D24291K98M96J231K191K755K643K158J703J324R71Q89J331J980K184J902
$$ 424291 424589 425085 426316 428507 431262 433905 436063 437766 439090 440061 440950 442281 444261 446445 448347
59978D48347J869K534L240K964J600m4j344k377l294l802l564k663j427j63P42
$$ 448347 450216 452750 455990 458954 460554 460510 459166 456789 453495 449693 446129 443466 442039 441876 442618
59963D42618Q60K17n10p42o12m72j38P54J825K181J620R22O79N48R6k74O6Q19
$$ 442618 443478 443695 443185 442443 441831 441359 441221 441975 443800 445981 447601 448523 449202 449750 449846 449572 449638 450457
59945D50457J001K92o17j032j011q93p25m96l86m22j72O10J399J340K65j192k294
$$ 450457 451458 451750 451133 450101 449090 448197 447472 446976 446590 446168 445996 446606 448005 449345 449610 448418 446124
59928D46124k627k047q65mk77j332j909j401n76m03p87r94p42k41N11J631K680
$$ 446124 443497 441450 440585 440581 440304 438972 437063 435662 435086 434683 433896 432902 432160 431919 432430 434061 436741
59911D36741K956K537K317K769L316L282K837K532K397K131J884K166K992L704
$$ 436741 439697 442234 444551 447320 450636 453918 456755 459287 461684 463815 465699 467865 470857 474561
59897D74561L788L417L014K646K175J739J740K360L263L897L928L461K876K483
$$ 474561 478349 481766 484780 487426 489601 491340 493080 495440 498703 502600 506528 509989 512865 515348
59883E15348K327K269K247K298K316K020J368Q34R32J484J851J863K048K609K738
$$ 515348 517675 519944 522191 524489 526805 528825 530193 531027 531959 533443 535294 537157 539205 541814 544552
59868E44552J593l61j783k126k122k457k822k682k260k075k025j668j140r96j246
$$ 544552 546145 545784 544001 541875 539753 537296 534474 531792 529532 527457 525432 523764 522624 521628 520382
59853E20382j254o89J20Q55J702K833L842M028L150J692M78K0J08J14j77l13J0
$$ 520382 519128 518439 518559 519414 521116 523949 527791 531819 534969 536661 537139 537159 537267 537381 537204 536891 536901
59836E36901K01n85k231l696m304m328m273m258m269m393m468m043l030j978j398
$$ 536901 537102 536517 534286 530590 526286 521958 517685 513427 509158 504765 500297 496254 493224 491246 489848
59821D89848j304j618k413l350l588k842k053k225l034l347k867k434k690l273
$$ 489848 488544 486926 484513 481163 477575 474733 472680 470455 467421 464074 461207 458773 456083 452810
59807D52810l486l181k668k210j846j483r90l41K90O48N93O1r11j903k203j601
$$ 452810 449324 446143 443475 441265 439419 437936 436946 436605 436895 437543 438136 438197 437286 435383 433180 431579
59791D31579q08o45r73j033o31l32m55o39n80n46q28j190j246r83o09k28l7m00
$$ 431579 430771 430126 429153 428120 427489 427157 426702 426063 425483 424937 424109 422919 421673 420690 420081 419853 419816 419416
59773D19416j317k027j676l38J062J805J988K060K096J786J036L55M41J359K353
$$ 419416 418099 416072 414396 414058 415120 416925 418913 420973 423069 424855 425891 426246 426687 428046 430399
59758D30399K654K334K035J992J854J523J577K435L638M452M858N328N832N792
$$ 430399 433053 435387 437422 439414 441268 442791 444368 446803 450441 454893 459751 465079 470911 476703
59744D76703N122M540M515M515L817K731K323K988L896M073L554L126L138L099
$$ 476703 481825 486365 490880 495395 499212 501943 504266 507254 511150 515223 518777 521903 525041 528140
59730E28140K389J050k74r84r76n70j79j2j5m5j24m40j093j897k483k559k079
$$ 528140 530529 531579 531305 530321 529345 528775 528596 528584 528569 528524 528400 527960 526867 524970 522487 519928 517849
59713E17849j210k82L41L90j62j009j567j288j75J091J783J797J504R96L5j170
$$ 517849 516639 516357 516698 517088 516926 515917 514350 513062 512887 513978 515761 517558 519062 520058 520093 518923
59697E18923j714j013L51J249J299J019Q96R02R51J140J412J439J064N14j5n89
$$ 518923 517209 516196 516547 517796 519095 520114 521010 521912 522863 524003 525415 526854 527918 528432 528417 527828
59681E27828j155j360j078q02j082j757k138j863j270q72q72j117j364j476j545
$$ 527828 526673 525313 524235 523433 522351 520594 518456 516593 515323 514451 513579 512462 511098 509622 508077
59666E08077j792k241k530k278j685j462k042k938l175k333j034k42k87p33j095
$$ 508077 506285 504044 501514 499236 497551 496089 494047 491109 487934 485601 484567 484325 484038 483305 482210
59651D82210j318j445j198m01M59O23J36p2N42J277J068n4j039j224j075j287
$$ 482210 480892 479447 478249 477848 478307 478930 479066 478994 479536 480813 481881 481827 480788 479564 478489 477202
59635D77202j738j805j421j153j261j227n72L32O91L73K1M0P1k94p36o84k71k03
$$ 477202 475464 473659 472238 471085 469824 468597 468025 468357 469048 469421 469442 469482 469553 469259 468523 467839 467568 467365
59617D67365o71j071r44o80q38j227j226q03o18r42j094l46Q90J294J51j690k596
$$ 467365 466694 465623 464679 463999 463161 461934 460708 459905 459287 458345 457251 456905 457795 459089 459240 457550 454954
59600D54954j751J38J639J825P80p24j842k080j505n91J68N38M62l3o89r69n23
$$ 454954 453203 453341 454980 456805 457585 456861 455019 452939 451434 450843 451011 451549 452011 451978 451289 450320 449797
59583D49797L00P33M21k39o44o10l69k23l94r78j791k325k110j202j87L04Q8m92
$$ 449797 450097 450830 451251 451012 450368 449758 449389 449166 448772 447794 446003 443678 441568 440366 440179 440483 440571 440079
59565D40079r04q61n15k58k83l56m6P47J559J690R56%k84L13J141J523J446J277
$$ 440079 439175 438314 437799 437541 437258 436902 436856 437603 439162 440852 441808 441808 441524 441837 442978 444501 445947 447224
59547D47224J201J278J719K590L374L502L227L373M157M956N459O262P772R307
$$ 447224 448425 449703 451422 454012 457386 460888 464115 467488 471645 476601 482060 488322 496094 505401
59533E05401J0015J0174J0558J0688Q958M863J92k735l495l525l956m329l604
$$ 505401 515416 525590 536148 546836 555794 560657 560849 558114 554619 551094 547138 542809 539205
59520E39205j759J42J214J573J937K742L744M250L627J776o42k572l376l345l307
$$ 539205 537446 537588 538802 540375 542312 545054 548798 553048 556675 558451 557809 555237 551861 548516 545209
59505E45209l768m580n277n548n368m902m364l824l210k551k153k258k529k272
$$ 545209 541441 536861 531584 526036 520668 515766 511402 507578 504368 501817 499664 497406 494877 492605
59491D92605j265j45K82n6m62l40J73M98M69O37J568K958L850L815L517L791M609
$$ 492605 491340 491195 491477 491421 490959 490619 490792 491290 491759 492396 493964 496922 500772 504587 508104 511895 516504
59474E16504N428O122O895P431P064N871M752M190L679K755J788J263R27L38k87
$$ 516504 521932 528054 534949 542380 549444 555315 560067 564257 567936 570691 572479 573742 574669 575007 574720
59459E74720m41j95Q0N48J660L315M908O165P232Q086Q470Q450Q445Q686R129
$$ 574720 574279 574084 574164 574712 576372 579687 584595 590760 597992 606078 614548 622998 631443 640129 649258
59444F49258R743J0354J0309R038O890M691K518k19l474o232p758q337q429p991
$$ 649258 659001 669355 679664 688702 695592 700283 702801 702582 699108 692876 685118 676781 668352 660361
59430F60361p086o364o248o328o162o085o464o715n945m194k242m19J547L715
$$ 660361 653275 646911 640663 634335 628173 622088 615624 608909 602964 598770 596528 596109 597656 601371
59416F01371N764P551R174J0592J1855J3466J5651J7469J7728J6684J5585J4331
$$ 601371 607135 614686 623860 634452 646307 659773 675424 692893 710621 727305 742890 757221
59404G57221J1069M918k102p014q990r333r078q027o067l966k407j370j077k612
$$ 757221 768290 773208 771106 764092 755102 745769 736691 728664 722597 718631 716224 714854 713777 711165
59390G11165o751j2463j7369j9646j9160j7010j4478j2330j0707r417q399p844
$$ 711165 704414 691951 674582 654936 635776 618766 604288 591958 581251 571834 563435 555591
59378E55591p778p716p114o023n021m426l892k887j410m2O74P39N61M25K55n4
$$ 555591 547813 540097 532983 526960 521939 517513 513621 510734 509324 509282 509956 510695 511256 511681 511936 511882
59362E11882l53m20k80lO61K006L658M680M660M285M454N219O030O696P449Q280
$$ 511882 511529 511109 510829 510826 511487 513493 517151 521831 526491 530776 535230 540449 546479 553175 560624 568904
59346E68904Q891R370J0146J1192J1866J1881J1783J2063J2290J1691J0285Q796
$$ 568904 577795 587165 597311 608503 620369 632250 644033 656096 668386 680077 690362 699158
59334F99158P601O353M750L105J928J201L49j131l123n041o446p452q419r340
$$ 699158 706759 713112 717862 720967 722895 724096 724445 723314 720191 715150 708704 701252 692833 683493
59320F83493r788r531q857q140p389o559n935n759n586m582k582m56P57Q84N88
$$ 683493 673705 664174 655317 647177 639788 633229 627294 621535 615949 611367 608785 608329 609086 609970 610558
59305F10558N95J164K201L550N035O305O878O458N154L231Q10j979m576o191o611
$$ 610558 611153 612317 614518 618068 623103 629408 636286 642744 647898 651129 651939 649960 645384 639193 632582
59290F32582o478o485o669o679o387n772m600k873j353q53j073r14m0P05P62Q24
$$ 632582 626104 619619 612950 606271 599884 594112 589512 586639 585286 584433 583360 582446 582406 583111 583873 584697
59274E84697J810L506M989N948O729P358P428P020O875P411Q218Q787R120R178
$$ 584697 586507 590013 595002 600950 607679 615037 622465 629485 636360 643771 651989 660776 669896 679074
59260F79074Q343O135L267J206N67M34m65k312m201n329n730n909o134o307o249
$$ 679074 687417 693552 696819 698025 698592 699026 698561 696249 692048 686719 680989 675080 668946 662639 656390
59245F56390n907n368m865m637m610m327l466k402j873k018k111j455k61P20J123
$$ 656390 650483 645115 640250 635613 631003 626676 623210 620808 618935 616917 614806 613351 613090 613810 614933
59230F14933J138R32M63j07l72k67k78q30j756k672l523m424n170n491n611o023
$$ 614933 616071 617003 617466 617359 616987 616720 616442 615612 613856 611184 607661 603237 598067 592576 586965 580942
59214E80942o707p004o527n675n038m665m234l686l303l233l346l502l682l825
$$ 580942 574235 567231 560704 555029 549991 545326 541092 537406 534103 530870 527524 524022 520340 516515
59200E16515l786l491k996k405j826j371r96m19N60J629K150J892J367J349K068
$$ 516515 512729 509238 506242 503837 502011 500640 499644 499225 499785 501414 503564 505456 506823 508172 510240
59185E10240L093L814M015L915L848L953M133M233M116L626K730J805J502K068
$$ 510240 513333 517147 521162 525077 528925 532878 537011 541244 545360 548986 551716 553521 555023 557091
59171E57091K953L353L137K880L072L591M030M247M398M699N281O106O859P069
$$ 557091 560044 563397 566534 569414 572486 576077 580107 584354 588752 593451 598732 604838 611697 618766
59157F18766O540N641M996M826M665L787K040J39j026j436j945l112m415n056
$$ 618766 625306 630947 635943 640769 645434 649221 651261 651400 650374 648938 646993 643881 639466 634410
59143F34410n154n517o380p068o917n946m502k959j959k191l474m563m439l370
$$ 634410 629256 623739 617359 610291 603374 597428 592926 589967 588008 585817 582343 577780 573341 569971
59129E69971k359j896j759j588j120j36J155K017K023J820K406L727M725M729
$$ 569971 567612 565716 563957 562369 561249 561113 562268 564285 566308 568128 570534 574261 578986 583715
59115E83715M209L958M176M596N026N473N907O217O241N827N040M288L995M083
$$ 583715 587924 591882 596058 600654 605680 611153 617060 623277 629518 635345 640385 644673 648668 652751
59101F52751M093L769L250K682K024J364J035J182J444J314O50l02j241j954k328
$$ 652751 656844 660613 663863 666545 668569 669933 670968 672150 673594 674908 675558 675256 674015 672061 669733
59086F69733k353k177k001j944k022k268k748l430m077m392m391m469m933n586
$$ 669733 667380 665203 663202 661258 659236 656968 654220 650790 646713 642321 637930 633461 628528 622942
59072F22942o042o283o480o407n663m621m295m921n416m910m103m136m654m193
$$ 622942 616900 610617 604137 597730 592067 587446 583151 578230 572814 567904 563801 559665 555011 550818
59058E50818k435q99j000k324l280k854j370N5M49k93j266j500j050q16j198j552
$$ 550818 548383 547484 546484 544160 540880 538026 536656 536711 537160 536867 535601 534101 533051 532235 531037 529485
59042E29485j225m57J01K42R3l06p85p14M03K087L150K860J636N76N13J431K606
$$ 529485 528260 527803 527904 528146 528239 527933 527148 526434 526837 528924 532074 534934 536570 537146 537659 539090 541696
59025E41696L329L594L952M752N762O613P187P458P301O809O480O691P213P549
$$ 541696 545025 548619 552571 557323 563085 569698 576885 584343 591644 598453 604933 611624 618837 626386
59011F26386P472O970N897M231K513J446R59K63r91k007j757m13O49M46m02m36
$$ 626386 633858 640828 646725 650956 653469 654915 655874 656137 655146 653139 651382 650969 651618 652064 651662 651226
58995F51226R11K769M089M732N029M881M013K821K121K014J810J169O21N65N81
$$ 651226 652137 654906 658995 663727 668756 673637 677650 680471 682592 684606 686416 687585 688206 688771 689352
58980F89352K07j81QN13N54P0j27M95J507K231K631L171M051N013N842O749Q028
$$ 689352 689559 689378 689386 689899 690453 690523 690396 690891 692398 694629 697260 700431 704482 709495 715337 722086 730114
58963G30114R493J0536J0858J0824J0863J0764R969Q481O997O032N314M187K295
$$ 730114 739607 750143 761001 771825 782688 793452 803421 811902 818899 824931 830245 834432 836727
58950H36727k54l026n394o842p431p767q410r452j0641j1560j1709j0862r506
$$ 836727 836473 833447 828053 821211 813780 806013 797603 788151 777510 765950 754241 743379 733873
58937G33873q498q018p384o176n014m760n325n766n429m491l509k783k231j625
$$ 733873 725375 717357 709973 703797 698783 694023 688698 682932 677503 673012 669503 666720 664489 662864
58923F62864q78j44M33R88J674K202K078J390Q16O91O30L56K75P37J275J182N91
$$ 662864 661986 661842 662275 663263 664937 667139 669217 670607 671423 672114 672744 673100 673375 674112 675387 676569 677160
58906F77160L36R07K050L280M378N421O540P671Q400Q367P939P981Q795R725J0127
$$ 677160 677496 678403 680453 683733 688111 693532 700072 707743 716143 724510 732449 740430 749225 758950 769077
58891G69077J0157J0147R924R353R065R795J1296J2712J3733J4614J5316J5409
$$ 769077 779234 789381 799305 808658 817723 827518 838814 851526 865259 879873 895189 910598
58879I10598J4762J3604J1990R902P763O009M255J681j674m870p314r248j0860
$$ 910598 925360 938964 950954 960856 968619 974628 978883 980564 978890 974020 966706 957458 946598
58866I46598j1843j2179j2487j3112j3489j2982j1861j0896j0327r750q848p867
$$ 946598 934755 922576 910089 896977 883488 870506 858645 847749 837422 827672 818824 810957
58854H10957p402p847q905r617r244q095p156o788o402n567m808m861n610o226
$$ 810957 803555 795708 786803 777186 767942 759847 752691 745903 739501 733934 729126 724265 718655 712429
58840G12429o204n737n285n141n370n785o019n817n316m862m613m480m354m259
$$ 712429 706225 700488 695203 690062 684692 678907 672888 667071 661755 656893 652280 647800 643446 639187
58826F39187m256m347m459m499m351l872k916j485R3J367K155K624K885K858K681
$$ 639187 634931 630584 626125 621626 617275 613403 610487 609002 609095 610462 612617 615241 618126 620984 623665
58811F23665K862L626M423M551M054L513L151K721K165J719J351P14j67p68q28
$$ 623665 626527 630153 634576 639127 643181 646694 649845 652566 654731 656450 657801 658515 658348 657580 656752
58796F56752p80j127j845k604l199l577l720l795m020m254m074l488l114l367
$$ 656752 655972 654845 653000 650396 647197 643620 639900 636105 632085 627831 623757 620269 617155 613788
58782F13788l804l677k906k070j605j403j122o26nN13O65K46p40k035l223l931
$$ 613788 609984 606307 603401 601331 599726 598323 597201 596575 596570 597083 597748 597994 597254 595219 591996 588065
58766E88065m035l721l300l021k976l044k886k228j290o50o12q48r19p51m26J37
$$ 588065 584030 580309 577009 573988 571012 567968 565082 562854 561564 560914 560302 559454 558535 557784 557358 557495
58750E57495R11J530J766J914K271K600K600K590K986L472L424K987K852L118
$$ 557495 558406 559936 561702 563616 565887 568487 571087 573677 576663 580135 583559 586546 589398 592516
58736E92516L236L078L081L307L250K915L073M002M796M495L360K493K589L421
$$ 592516 595752 598830 601911 605218 608468 611383 614456 618458 623254 627749 631109 633602 636191 639612
58722F39612M223M256L383K246J616J539J555J611K010K587K794K714K991L611
$$ 639612 643835 648091 651474 653720 655336 656875 658430 660041 662051 664638 667432 670146 673137 676748
58708F76748L802L418L249L525L332K249J276J172R56o50l112m779n187n360o159
$$ 676748 680550 683968 687217 690742 694074 696323 697599 698771 699727 699077 695965 691186 685999 680639 674480
58693F74480p474q895j0047j0396r725q749q312q212p681o816o399o397n879m558
$$ 674480 667006 658111 648064 637668 627943 619194 610882 602670 594989 588173 581774 575377 569498 564940
58679E64940l297k795k778k844l089l444l320k495j653j409j414r77j23N97R76
$$ 564940 561643 558848 556070 553226 550137 546693 543373 540878 539225 537816 536402 535425 535302 535899 536875
58664E36875J268J688K251K961L747M342M464M069L238K064P77k28p09p88o88
$$ 536875 538143 539831 542082 545043 548790 553132 557596 561665 564903 566967 567744 567516 566807 566019 565331
58649E65331n34m51o04r34j123j033q67p58m99j6K49j61r78j430j138m17L29J022
$$ 565331 564797 564346 563742 562808 561685 560652 559785 559027 558528 558512 558761 558600 557622 556192 555054 554637 554966 555988
58631E55988J625J813J359O70M48Q25J166R73N75O60J310J968K265K374K505K578
$$ 555988 557613 559426 560785 561455 561903 562728 563894 564867 565442 566102 567412 569380 571645 574019 576524 579102
58615E79102K552K691L115L537L725L964M575N239N341M814M219L916L629K948
$$ 579102 581654 584345 587460 590997 594722 598686 603261 608500 613841 618655 622874 626790 630419 633367
58601F33367J944J127R24J288J682J525P25k60r36j220j214q74j84N35Q78R01
$$ 633367 635311 636438 637362 638650 640332 641857 642582 642322 641386 640166 638952 638078 637894 638429 639307 640208
58585F40208J075J734K830M084N131N651N694N842O658P990R131R608R531R122
$$ 640208 641283 643017 645847 649931 655062 660713 666407 672249 678907 686897 696028 705636 715167 724289
58571G24289Q397P412O514O094O242O706P115P243P240P563Q496R805J1097J2294
$$ 724289 732686 740098 746612 752706 758948 765654 772769 780012 787252 794815 803311 813116 824213 836507
58557H36507J3446J4167J3844J2519J1067J0240R880R316Q189O546M408J827o53
$$ 836507 849953 864120 877964 890483 901550 911790 921670 930986 939175 945721 950129 951956 951303
58544I51303k234k740k954l686m767n408n457n687o654p805q306q338q899j0334
$$ 951303 949069 946329 943375 939689 934922 929514 924057 918370 911716 903911 895605 887267 878368 868034
58530H68034j1814j2437j2228j1705j1004r923q487o973n538m232l253k742k509
$$ 868034 856220 843783 831555 819850 808846 798923 790436 783463 777925 773693 770440 767698 765189
58517G65189k199j675j021m15j62n65j377j762j232l81j14l73l06L55Q59N71l0
$$ 765189 762990 761315 760294 759879 759717 759152 757775 756013 754781 754400 754286 753913 753607 753962 754821 755392 755362
58500G55362J6Q93J791J883J159K44l60o92r55j041o99q4K60J39O0N74J554K442
$$ 755362 755378 756271 758062 759945 761104 761348 760988 760296 759341 758300 757601 757517 757777 757916 757976 758550 760104 762546
58482G62546K962L253L486L683L840L982M163M587N581P124Q581R198Q841P968
$$ 762546 765508 768761 772247 775930 779770 783752 787915 792502 798083 805207 813788 822986 831827 839795
58468H39795O992N886M386K419L25j257j975k167k440k846k861k254j397n06O76
$$ 839795 846787 852673 857059 859478 859803 858546 856571 854404 851964 849118 846257 844003 842606 842100 842776
58453H42776K192L418L929M173M722N342N494N279N094M726L651J974L21j077
$$ 842776 844968 848386 852315 856488 861210 866552 872046 877325 882419 887145 890796 892770 893091 892014
58439H92014k403l505l925l640l057k358j547r85j074j398j075n2P64P85N20Q19
$$ 892014 889611 886106 882181 878541 875484 873126 871579 870594 869520 868122 867047 866995 867759 868544 869064 869883
58423H69883K043M017O180P687Q030P682P443P163N979L928K321K013K268J922
$$ 869883 871926 875943 882123 889810 897840 905522 912965 920128 926107 930035 932356 934369 936637 938559
58409I38559Q68k71j271k253k901k727j979j564j945k606k758k185j299n75j43
$$ 938559 939427 939156 937885 935632 932731 930004 928025 926461 924516 921910 919152 916967 915668 915093 914950
58394I14950J50M65Q02J132J483J826J980J857J668J703K015K446K896L297L575
$$ 914950 915100 915565 916367 917499 918982 920808 922788 924645 926313 928016 930031 932477 935373 938670 942245
58379I42245L841M357N058N457N390N465O222P189P487P113O923P329P840P982
$$ 942245 946086 950443 955501 960958 966348 971813 978035 985224 992711 999824 1006747 1014076 1021916 1029898
58365A029898P938Q073Q388Q771R330J0205J1273J2195J2595J2318J1700J1443
$$ 1029898 1037836 1045909 1054297 1063068 1072398 1082603 1093876 1106071 1118666 1130984 1142684 1154127
58353A154127J1906J2636J2934J2626J1891J0753R276P989P444P493P658P908
$$ 1154127 1166033 1178669 1191603 1204229 1216120 1226873 1236149 1244138 1251582 1259075 1266733 1274641
58341A274641Q456R082R462R942J1123J2784J4084J4768J5272J5770J6070J6434
$$ 1274641 1283097 1292179 1301641 1311583 1322706 1335490 1349574 1364342 1379614 1395384 1411454 1427888
58329A427888J7414J8695J9132J8312J7308J7392J8576J9798K0075J9262J8002
$$ 1427888 1445302 1463997 1483129 1501441 1518749 1536141 1554717 1574515 1594590 1613852 1631854
58318A631854J7113J6849J6884J7115J7909J9148J9828J9471J9042J9457J9995
$$ 1631854 1648967 1665816 1682700 1699815 1717724 1736872 1756700 1776171 1795213 1814670 1834665
58307A834665J9646J9292K0585K3101K4679K4715K5032K6908K9268L0687L1447
$$ 1834665 1854311 1873603 1894188 1917289 1941968 1966683 1991715 2018623 2047891 2078578 2110025
58296B110025L2520L3837L4795L5509L6541L8007L9685M1363M2735M3646M4716
$$ 2110025 2142545 2176382 2211177 2246686 2283227 2321234 2360919 2402282 2445017 2488663 2533379
58285B533379M6809M9708N2287N4256N6449N9190O1795O4044O6754P0281P3804
$$ 2533379 2580188 2629896 2682183 2736439 2792888 2852078 2913873 2977917 3044671 3114952 3188756
58274C188756P6801P9875Q3501Q7267R1041R5550J01027J06653J12188J18774
$$ 3188756 3265557 3345432 3428933 3516200 3607241 3702791 3803818 3910471 4022659 4141433
58264D141433J27221J36788J46595J56990J68492J80559J92466K04335K16316
$$ 4141433 4268654 4405442 4552037 4709027 4877519 5058078 5250544 5454879 5671195
58255E671195K27729K37924K47128K55701K63581K71050K78970K87615K96435
$$ 5671195 5898924 6136848 6383976 6639677 6903258 7174308 7453278 7740893 8037328
58246H037328L05478L15673L27063L38270L48347L57780L67175L76647L87059
$$ 8037328 8342806 8658479 8985542 9323812 9672159 10029939 10397114 10773761 11160820
58237A1160820L99922M15229M31292M47487M65094M84557N04259N23280N43200
$$ 11160820 11560742 11975971 12407263 12854750 13319844 13804401 14308660 14831940 15375140
58228A5375140N65947N92035O22134O57830O99218P44178P91688Q43492R00827
$$ 15375140 15941087 16533122 17155256 17813086 18512304 19256482 20048170 20891662 21792489
58219B1792489R62030J025175J090452J157969J225940J293405J362560J436637
$$ 21792489 22754519 23779694 24870146 26028115 27254055 28547460 29910020 31346657
58211C1346657J518330J612089J724656J861120K023565K215438K443091K710785
$$ 31346657 32864987 34477076 36201732 38062852 40086417 42301855 44744946 47455731
58203D7455731L019388L373789L787132M273952M843657N503876O263986P130823
$$ 47455731 50475119 53848908 57636040 61909992 66753649 72257525 78521511 85652334
58195H5652334Q108096R205680J0440664J1818232J3312646J4866650J6392964
$$ 85652334 93760430 102966110 113406774 125225006 138537652 153404302 169797266
58188A69797266J7762346J8798541J9289738J8977066J7514396J4510476R759883
$$ 169797266 187559612 206358153 225647891 244624957 262139353 276649829 286409712
58181B86409712L547501l275388r599209j4541142j7741919j9323200j9654030
$$ 286409712 289957213 286681825 277082616 262541474 244799555 225476355 205822325
58174B05822325j9141249j8123250j6837308j5427425j3976459j2538320j1151727
$$ 205822325 186681076 168557826 151720518 136293093 122316634 109778314 98626587
58167I8626587r843394q633662p539911o571551n725990m994006m366189l831958
$$ 98626587 88783193 80149531 72609620 66038069 60312079 55318073 50951884 47119926
58159D7119926l377652k990546k662140k384679k147850j942327j763717j609825
$$ 47119926 43742274 40751728 38089588 35704909 33557059 31614732 29851015 28241190
58151B8241190j476543j359089j254778j161783j077252r99134r27855q63996
$$ 28241190 26764647 25405558 24150780 22988997 21911745 20912611 19984756 19120760
58143A9120760q06213p53274p05915o64608o27572n93036n61413n33283n07247
$$ 19120760 18314547 17561273 16855358 16190750 15563178 14970142 14408729 13875446 13368199
58134A3368199m81961m58415m37928m19450m00949l82143l63869l46067l28289
$$ 13368199 12886238 12427823 11989895 11570445 11169496 10787353 10423484 10077417 9749128
58125I749128l11065k94920k79235k63686k49624k38322k28967k20052k11671
$$ 9749128 9438063 9143143 8863908 8600222 8350598 8112276 7883309 7663257 7451586
58116G451586k04818j99369j94377j89458j84380j78228j70648j63025j56891
$$ 7451586 7246768 7047399 6853022 6663564 6479184 6300956 6130308 5967283 5810392
58107E810392j51812j46344j40299j34651j29750j25129j20583j16215j11806
$$ 5810392 5658580 5512236 5371937 5237286 5107536 4982407 4861824 4745609 4633803
58098D633803j07300j03348j00318r7359r3588q9551q6330q3831q1158p8189p5499
$$ 4633803 4526503 4423155 4322837 4225478 4131890 4042339 3956009 3872178 3791020 3712831 3637332
58087C637332p3152p0822o8758o7474o6687o5640o4308o3266o2510o1421n9790
$$ 3637332 3564180 3493358 3424600 3357126 3290439 3224799 3160491 3097225 3034715 2973294 2913504
58076B913504n8027n6380n4737n3107n1730n0685m9845m9065m8076m6572m4730
$$ 2913504 2855477 2799097 2744360 2691253 2639523 2588838 2538993 2489928 2441852 2395280 2350550
58065B350550m3234m2350m1478m0119l8723l7965l7718l7256l6189l4648l3012
$$ 2350550 2307316 2264966 2223488 2183369 2144646 2106681 2068963 2031707 1995518 1960870 1927858
58054A927858l1831l1562l1939l2140l1843l1516l1294l0533k8991k7542k6982
$$ 1927858 1896027 1864465 1832526 1800386 1768543 1737027 1705733 1675200 1646209 1618667 1591685
58043A591685k6961k6847k6790k7065k7117k6309k5058k4190k3698k3079k2453
$$ 1591685 1564724 1537877 1511087 1484022 1456905 1430596 1405538 1381348 1357650 1334571 1312118
58032A312118k2354k2659k2731k2364k1812k1126k0236j9468j9220j9346j9410
$$ 1312118 1289764 1267105 1244374 1222010 1200198 1179072 1158836 1139368 1120148 1100802 1081392
58021A081392j9266j8829j7799j6261j5068j4812j4829j4132j2931j2314j2680
$$ 1081392 1062126 1043297 1025498 1009237 994169 979357 964528 950396 937465 925151 912471
58010I12471j3361j3696j3593j3214j2750j2511j2548j2400j1757j1066j0818
$$ 912471 899110 885414 871821 858607 845857 833346 820798 808398 796641 785575 774757
57999G74757j0624r837q780q412q863r212q740p672o627o040o175p033q081q581
$$ 774757 764133 754296 745516 737104 728241 719029 710289 702617 695990 689950 683775 676742 668661 660080
57985F60080q361p845p404p030o663o435o465o628o526n788m603l901m390n430
$$ 660080 651719 643874 636470 629440 622777 616342 609877 603249 596723 590935 586332 582431 578041 572611
57971E72611n642m751l910l819l766l147k740l263l808l192k098k181l440m237
$$ 572611 566969 562218 558308 554489 550723 547576 544836 541573 537765 534573 532475 530294 526854 522617
57957E22617l845l340l663m358m766n147n851o386o147n446n066n124n030m350
$$ 522617 518772 515432 511769 507411 502645 497498 491647 485261 479114 473668 468602 463478 458448 454098
57943D54098l298k496k410l005l764m129l859k999j798p71m20o01n80k0N51O38
$$ 454098 450800 448304 445894 442889 439125 434996 431137 428138 426340 425569 425149 424548 423968 423948 424499 425137
57927D25137M66L33m1p87j252r62o08j040j890k296k474l241m375m887m727m767
$$ 425137 425603 425936 425895 425108 423856 422894 422286 421246 419356 417060 414586 411345 406970 402083 397356 392589
57911C92589n073m755l736l187l748m592m793m436l961l440l067l321m089m541
$$ 392589 387516 382761 379025 375838 372090 367498 362705 358269 354308 350868 347801 344480 340391 335850
57897C35850m362m196m376m357l929l906m695n270m552l050k100k068k324k457
$$ 335850 331488 327292 322916 318559 314630 310724 306029 300759 296207 293157 291057 288989 286665 284208
57883B84208k519k346j667p47k20k76o25j108j752k355k525k119j315m36Q3j65
$$ 284208 281689 279343 277676 276929 276709 276433 275808 274700 272948 270593 268068 265949 264634 264198 264281 264116
57867B64116j082k059k681l041l086k336p68N84P43J57J73J242K417K660K079
$$ 264116 263034 260975 258294 255253 252167 249831 249063 249647 250390 250547 250720 251962 254379 257039 259118
57852B59118J674K230L558M660M659L662K592K135K186K406K805L339L490K811
$$ 259118 260792 263022 266580 271240 275899 279561 282153 284288 286474 288880 291685 295024 298514 301325
57838C01325J615O08O8j57j33Q8J13m38j277j738j735j840k360k841k738k144
$$ 301325 302940 303548 303616 303459 303326 303414 303527 303089 301812 300074 298339 296499 294139 291298 288560 286416
57822B86416j594j354j199p66m1N35N13J6k71P7N48J43j425l255m147l877l366
$$ 286416 284822 283468 282269 281503 281462 281997 282510 282526 282255 282332 282880 283023 281598 278343 274196 270319 266953
57805B66953l584m439m978m627l886l553l659l551k930k140j515r92n58m85q00
$$ 266953 263369 258930 253952 249325 245439 241886 238227 234676 231746 229606 228091 227099 226541 226056 225256
57790B25256r65n07L18Q81R59Q86J041J454J877K025J884J782J961K114J715Q17
$$ 225256 224291 223784 224102 224983 225942 226828 227869 229323 231200 233225 235109 236891 238852 240966 242681 243498
57774B43498J04J2L16O79J116J533J452O58k57n14r8L44L12j96q81j311j221r27
$$ 243498 243602 243614 243930 244609 245725 247258 248710 249368 249111 248597 248499 248843 249155 248959 248078 246767 245546 244619
57756B44619j151k048k836k802k268j960j837j275k39N64P18N88O71R82J305J534
$$ 244619 243468 241420 238584 235782 233514 231554 229717 228442 228203 228767 229485 230073 230744 231726 233031 234565
57740B34565J605J355P23q1o73p08j15P46J220R96M64K60N98J252J941K382K241
$$ 234565 236170 237525 238248 238167 237494 236786 236671 237417 238637 239633 240097 240357 240955 242207 244148 246530 248771
57723B48771J460N36N5N3J60J95J89M7l50p34p33m61m25q16j317j582j484r85
$$ 248771 250231 250767 250822 250875 251035 251230 251419 251466 251116 250382 249649 249188 248763 247947 246630 245048 243564 242579
57705B42579k84L8m04j114j183n50l5o7r9L49Q32P80N26Q30J631K038J524N37
$$ 242579 242295 242333 241929 240815 239632 239082 239047 238980 238881 239230 240062 240842 241368 242198 243829 245867 247391 247928
57687B47928k19n80p31o09M6J126K043K438K681L442M795O206P388Q712J0507
$$ 247928 247709 247129 246398 245789 245835 246961 249004 251442 254123 257565 262360 268566 275954 284666 295173
57672B95173J2453J4154J5933J8443K1565K4402K6356K7524K7797K6218K1698
$$ 295173 307626 321780 337713 356156 377721 402123 428479 456003 483800 510018 531716
57661E31716J4139M533n596j4580k0947k4137k4882k4472k3594k2150k0078j7828
$$ 531716 545855 550388 544792 530212 509265 485128 460246 435774 412180 390030 369952 352124
57649C52124j5853j4117j2429j0976j0040r333q146o321m591l638l177k443j359
$$ 352124 336271 322154 309725 298749 288709 279376 271230 264909 260318 256680 253503 251060 249701
57636B49701n48k39J19Q35J336J035L83L01Q05R21N8j151j646j181m63k34n03
$$ 249701 249153 248914 249033 249868 251204 252239 252622 252923 253728 254649 254707 253556 251910 250729 250266 250032 249529
57619B49529p21n90n04r85j835k284k067j851k232k774k611j682p73m55n86q03
$$ 249529 248808 248218 247714 246729 244894 242610 240543 238692 236460 233686 231075 229393 228620 228165 227579 226776
57603B26776r29q67o08m65p82j396j796j865j977k283k473k348k185k260k453
$$ 226776 225847 224980 224372 223907 223125 221729 219933 218068 216091 213808 211335 208987 206802 204542 202089
57588B02089k527k407k095j678j538k090l094l698l444k795k370k154j841j524
$$ 202089 199562 197155 195060 193382 191844 189754 186660 182962 179518 176723 174353 172199 170358 168834
57574A68834j480j563j265m28N17R64O57j61r24j164r04n29k76p8N6q0m50n65
$$ 168834 167354 165791 164526 164098 164615 165579 166236 166075 165151 163987 163083 162554 162278 162200 162256 162176 161726 161161
57556A61161o3P11J029N96j58n23j29P11J179P04m12j309j518j282r26m14K86
$$ 161161 161098 161809 162838 163434 163276 162753 162624 163335 164514 165218 164806 163497 161979 160697 159771 159357 159643
57539A59643Q55J055J152J533K099K356K019J252N17K78O11J000P62j12r25j168
$$ 159643 160498 161553 162705 164238 166337 168693 170712 171964 172481 172759 173370 174370 175132 175020 174095 172927
57523A72927r58m53N08J737K381J882Q53L00L31L61K47L86Q60J309J578J743J560
$$ 172927 171969 171516 172024 173761 176142 178024 178877 179177 179508 179869 180116 180502 181362 182671 184249 185992 187552
57506A87552O99l99p76k89J08k46q24q69o03p92j547k255k503k432k237j867j357
$$ 187552 188251 187852 187076 186787 186895 186649 185825 184956 184353 183561 182014 179759 177256 174824 172587 170720 169363
57489A69363j015j118j553j955k064j898j660j504j358r99l44L89Q99J110J163
$$ 169363 168348 167230 165677 163722 161658 159760 158100 156596 155238 154239 153895 154284 155183 156293 157456
57474A57456J159J035Q19P96J242J886J996J138k06j079j116q23q59j257j519
$$ 157456 158615 159650 160469 161265 162507 164393 166389 167527 167321 166242 165126 164303 163444 162187 160668
57459A60668j226l97N28R63O48l4m67m85m22m31k91PO0k14k33L45R50R22N90P14
$$ 160668 159442 159045 159573 160536 161184 161150 160683 160198 159776 159345 159054 159061 159121 158907 158674 159019 159969 160891 161481 162195
57439A62195J244J467J218J023J048Q82M59K83N02N65J82j17J65P15R48P57L25
$$ 162195 163439 164906 166124 167147 168195 169077 169536 169819 170321 170886 171068 170951 171116 171831 172779 173536 173861
57422A73861l01r01r23j78O59Q65O23O00R01J067Q97O83O59Q39J247J835K250
$$ 173861 173560 172659 171736 171558 172217 173082 173705 174305 175206 176273 177170 177853 178512 179351 180598 182433 184683
57405A84683K127J624J181R13P07P74J413K264K560K236K082K474K763K382J956
$$ 184683 186810 188434 189615 190528 191235 192009 193422 195686 198246 200482 202564 205038 207801 210183 212139
57390B12139K494L809M606M209L453L559M614N615N756N253M820M737M647M183
$$ 212139 214633 218442 223048 227257 230710 234269 238883 244498 250254 255507 260327 265064 269711 273894
57376B73894L504L133L306L703L826L516K975K435J997J754J822K069K058J514
$$ 273894 277398 280531 283837 287540 291366 294882 297857 300292 302289 304043 305865 307934 309992 311506
57362C11506Q12P11J514K684L465L698L815M126M410M287L860L752M500N869O910
$$ 311506 312318 313029 314543 317227 320692 324390 328205 332331 336741 341028 344888 348640 353140 359009 365919
57347C65919O782N605M349L858M082M395M420M331M462M863N280N375N005M439
$$ 365919 372701 378306 382655 386513 390595 394990 399410 403741 408203 413066 418346 423721 428726 433165
57333D33165M215M586N197N495N367N088M804M474M299M688N611O473O838O915
$$ 433165 437380 441966 447163 452658 458025 463113 467917 472391 476690 481378 486989 493462 500300 507215
57319E07215P058P213P176P116P355P866Q337Q672Q997R198Q982Q416Q058Q332
$$ 507215 514273 521486 528662 535778 543133 550999 559336 568008 577005 586203 595185 603601 611659 619991
57305F19991R044R646R822R669R383R066Q820Q868R328R896J0029R635R383R954
$$ 619991 629035 638681 648503 658172 667555 676621 685441 694309 703637 713533 723562 733197 742580 752534
57291G52534J1136J2034J2148J1765J1251J0659J0278J0825J2454J4022J4192
$$ 752534 763670 775704 787852 799617 810868 821527 831805 842630 855084 869106 883298
57280H83298J3054J1939J1762J2289J3086J4211J5668J6934J7638J8227J9371
$$ 883298 896352 908291 920053 932342 945428 959639 975307 992241 1009879 1028106 1047477
57269A047477K1052K2710K4097K5487K7160K9123L1273L3418L5160L6157L6519
$$ 1047477 1068529 1091239 1115336 1140823 1167983 1197106 1228379 1261797 1296957 1333114 1369633
57258A369633L6698L7063L7808L9112M0855M2313M2787M2751M3629M6022M8690
$$ 1369633 1406331 1443394 1481202 1520314 1561169 1603482 1646269 1689020 1732649 1778671 1827361
57247A827361M9983M9827M9547M9982N0673N1076N1614N2934N4788N6331N7231
$$ 1827361 1877344 1927171 1976718 2026700 2077373 2128449 2180063 2232997 2287785 2344116 2401347
57236B401347N7925N8885O0203O1816O3655O5511O7144O8588P0026P1434P2698
$$ 2401347 2459272 2518157 2578360 2640176 2703831 2769342 2836486 2905074 2975100 3046534 3119232
57225C119232P3994P5561P7115P8003P8107P8011P8130P8117P7460P6198P4764
$$ 3119232 3193226 3268787 3345902 3423905 3502012 3580023 3658153 3736270 3813730 3889928 3964692
57214C964692P3494P2601P2316P2579P2937P3010P2764P2033P0262O7354O4327
$$ 3964692 4038186 4110787 4183103 4255682 4328619 4401629 4474393 4546426 4616688 4684042 4748369
57203D748369O2416O1708O1334O0888O0831O1431O2116O2256O2011O2001O2431
$$ 4748369 4810785 4872493 4933827 4994715 5055546 5116977 5179093 5241349 5303360 5365361 5427792
57192E427792O2947O3085O2583O1434N9864N8238N6938N6333N6729N8037N9493
$$ 5427792 5490739 5553824 5616407 5677841 5737705 5795943 5852881 5909214 5965943 6023980 6083473
57181F083473O0218O0104N9850N9987O0294O0360O0286O0491O1192O2429O4333
$$ 6083473 6143691 6203795 6263645 6323632 6383926 6444286 6504572 6565063 6626255 6688684 6753017
57170F753017O6966P0077P3388P6941Q0744Q4227Q6608Q7949Q9405R2266R7061
$$ 6753017 6819983 6890060 6963448 7040389 7121133 7205360 7291968 7379917 7469322 7561588 7658649
57159G658649J03812J12677J23727J36195J48563J59648J69271J77514J83677
$$ 7658649 7762461 7875138 7998865 8135060 8283623 8443271 8612542 8790056 8973733
57150H973733J86483J85277J80454J72646J62059J49008J34669J20737J08344
$$ 8973733 9160216 9345493 9525947 9698593 9860652 10009660 10144329 10265066 10373410
57141A0373410R7538Q7587P7385O5768N2043L6489K0193M397r991k2515l3228
$$ 10373410 10470948 10558535 10635920 10701688 10753731 10790220 10810413 10814810 10804819 10782304 10749076
57130A0749076m2549n0782n7915o4193p0570p8005q6337r4308j00715j05043j07118
$$ 10749076 10706527 10655745 10597830 10533637 10463067 10385062 10298725 10204417 10103702 9998659 9891541
57119I891541j06839j04426j00458r5562r0431q6139q3758q3517q4925q7826r2597
$$ 9891541 9784702 9680276 9579818 9484256 9393825 9307686 9223928 9140411 9055486 8967660 8875063
57108H875063r9085j05974j11531j14388j13345j07238r5519p8438n6162k8299
$$ 8875063 8775978 8670004 8558473 8444085 8330740 8223502 8127983 8049545 7993383 7965084
57098G965084N426M4610Q8744J37532J90179K44977L00154L54270M05335M50857
$$ 7965084 7970510 8015120 8103864 8241396 8431575 8676552 8976706 9330976 9736311 10187168
57088A0187168M90211N26247N63143O02708O42974O78846P02868P07604O90917
$$ 10187168 10677379 11203626 11766769 12369477 13012451 13691297 14394165 15101769 15792686
57079A5792686O58423O16386N59953M71235L32697J43598p6074k95591m86828
$$ 15792686 16451109 17067495 17627448 18098683 18431380 18574978 18498904 18203313 17716485
57070A7716485o32693p29553p84717q09873q14189q01932p74995p35746o87218
$$ 17716485 17083792 16354239 15569522 14759649 13945460 13143528 12368533 11632787 10945569
57061A0945569o32037n72237n09595m45609l81553l18915k59422k04349j54183
$$ 10945569 10313532 9741295 9231700 8786091 8404538 8085623 7826201 7621852 7467669
57052G467669j09202o9905l6610q963J3808L2352M7227N9152O8957P7311Q4558
$$ 7467669 7358467 7288562 7251952 7242989 7256797 7289149 7336376 7395528 7464485 7541796 7626354
57041G626354R0767R5798R9556J02291J04506J06590J08575J10323J11786J13033
$$ 7626354 7717121 7812919 7912475 8014766 8119272 8225862 8334437 8444760 8556546 8669579
57031H669579J14077J14486J13290J09727J04339R8700R3356Q6526P6008O2397
$$ 8669579 8783656 8898142 9011432 9121159 9225498 9324198 9417554 9504080 9580088 9642485
57021I642485M9450M0830L7321L7431L9582M2812M6168M8790N0433N1028M9768
$$ 9642485 9691935 9732765 9770086 9807517 9847099 9889911 9936079 9984869 10035302 10086330 10136098
57010A0136098M5596L8759L1058K4344J9363J6190J4891J5213J6164J6683J6607
$$ 10136098 10181694 10220453 10251511 10275855 10295218 10311408 10326299 10341512 10357676 10374359 10390966
56999A0390966J6596J7343J9106K1754K4765K7403K9323L0921L2706L4519L5830
$$ 10390966 10407562 10424905 10444011 10465765 10490530 10517933 10547256 10578177 10610883 10645402 10681232
56988A0681232L6721L7872L9441M0640M0707L9877L8829L7523L5197L1481K7058
$$ 10681232 10717953 10755825 10795266 10835906 10876613 10916490 10955319 10992842 11028039 11059520 11086578
56977A1086578K3060K0214J8650J8193J8537J9310K0239K1301K2543K3757K4509
$$ 11086578 11109638 11129852 11148502 11166695 11185232 11204542 11224781 11246082 11268625 11292382 11316891
56966A1316891K4539K4024K3344K2612K1581K0103J8538J7462J6900J6141J4550
$$ 11316891 11341430 11365454 11388798 11411410 11432991 11453094 11471632 11489094 11505994 11522135 11536685
56955A1536685J2324J0127Q008N248J401k894o518q985j0665j2049j3282j4309
$$ 11536685 11549009 11559136 11567144 11572392 11573793 11570899 11564381 11555396 11544731 11532682 11519400 11505091
56943A1505091j5100j5652j6122j7109j9437k3365k8162l2589l5780l7565l8181
$$ 11505091 11489991 11474339 11458217 11441108 11421671 11398306 11370144 11337555 11301775 11264210 11226029
56932A1226029l8001l7428l6835l6497l6650l7564l9430m2203m5631m9348n2835
$$ 11226029 11188028 11150600 11113765 11077268 11040618 11003054 10963624 10921421 10875790 10826442 10773607
56921A0773607n5455n6856n7240n7006n5971n3463m9330m4636m0861l8517l6971
$$ 10773607 10718152 10661296 10604056 10547050 10491079 10437616 10388286 10343650 10302789 10264272 10227301
56910A0227301l5678l5030l5733l7778m0629m4186m8869n4564o0141o4436o7390
$$ 10227301 10191623 10156593 10120860 10083082 10042453 9998267 9949398 9894834 9834693 9770257 9702867
56899I702867o9708p1623p2589p2177p0753o9044o7433o5944o4556o3250o1838
$$ 9702867 9633159 9561536 9488947 9416770 9346017 9276973 9209540 9143596 9079040 9015790 8953952
56888H953952o0156n8425n7204n6986n7889n9703o2077o4684o7235o9343p0462
$$ 8953952 8893796 8835371 8778167 8721181 8663292 8603589 8541512 8476828 8409593 8340250 8269788
56877H269788p0168o8611o6473o4327o2270o0314n8850n8296n8367n8121n6917
$$ 8269788 8199620 8131009 8064536 8000209 7937939 7877625 7818775 7760479 7702112 7643991 7587074
56866G587074n5117n3640n2959n2641n1837n0235m8463m7522m7871m9288n1622
$$ 7587074 7531957 7478317 7425358 7372717 7320880 7270645 7222182 7174660 7126789 7077501 7025879
56855G025879n5267o0535o6806p2781p7481q0641q2232q2210q0785p8526p5900
$$ 7025879 6970612 6910077 6843271 6770490 6693009 6612368 6530136 6447926 6367141 6288615 6212715
56844F212715p3064p0128o7296o4580o1829n9170n6974n5088n2662m9235m5611
$$ 6212715 6139651 6069523 6002227 5937647 5875818 5816648 5759674 5704586 5651924 5602689 5557078
56833E557078m3165m2480m3321m5753n0559n8255o8114p8378q7295r3873r8017
$$ 5557078 5513913 5471433 5428112 5382359 5331800 5273545 5205431 5127053 5039758 4945885 4847868
56822D847868j00182j00951j00801j00188r9453r8506r6717r3499q8890q3389
$$ 4847868 4747686 4646735 4545934 4445746 4346293 4247787 4151070 4057571 3968681 3885292
56812C885292p7315p0781o4157n8198n3564n0460m8788m8481m9681n2756n7955
$$ 3885292 3807977 3737196 3673039 3614841 3561277 3510817 3462029 3413548 3363867 3311111 3253156
56801C253156o4772p1795p7677q2026q4992q6203q4968q1570p7447p3695p0022
$$ 3253156 3188384 3116589 3038912 2956886 2871894 2785691 2700723 2619153 2541706 2468011 2397989
56790B397989o5784o1377n7885n5716n4256n2820n1246m9566m7627m5217m2253
$$ 2397989 2332205 2270828 2212943 2157227 2102971 2050151 1998905 1949339 1901712 1856495 1814242
56779A814242l8932l5914l4282l4761l7000l9884m2567m4839m6549m7286m6828
$$ 1814242 1775310 1739396 1705114 1670353 1633353 1593469 1550902 1506063 1459514 1412228 1365400
56768A365400m5600m4404m3770m3539m2967m1326l8735l6261l4766l3837l2352
$$ 1365400 1319800 1275396 1231626 1188087 1145120 1103794 1065059 1028798 994032 960195 927843
56757I27843l0084k7948k6559k5441k4010k2597k1750k1221k0497j9834j9707
$$ 927843 897759 869811 843252 817811 793801 771204 749454 728233 707736 687902 668195
56746F68195j9568j8310j6070j4356j3994j4065j3455j2510j2159j2226j1776
$$ 668195 648627 630317 614247 599891 585897 571832 558377 545867 533708 521482 509706
56735E09706j0791j0259j0569j0926j0629r992r655r694r923j0367j0890j0915
$$ 509706 498915 488656 478087 467161 456532 446540 436885 427191 417268 406901 396011 385096
56723C85096j0137r130q673q755q839q785q849q951q661p916p178o829o881p207
$$ 385096 374959 365829 357156 348401 339562 330777 321928 312977 304316 296400 289222 282393 275512 268305
56709B68305p558p410o480n378n092n590n711m704l253k492k573k810k807k785
$$ 268305 260747 253337 246857 241479 236387 230797 225086 220382 217129 214637 212064 209254 206447 203662
56695B03662k932l019k682j836q25l01p23j765k492k389j863j509j344j216j414
$$ 203662 200730 197711 195029 193193 192368 192067 191344 189579 187087 184698 182835 181326 179982 178766 177352
56680A77352k143k758k479j709j711k776l668l329k288j728j771j570q33k86m80
$$ 177352 175209 172451 169972 168263 166552 163776 160108 156779 154491 152763 150992 149422 148589 148303 147823
56665A47823r01p57j53L6n93j398j507q86k62j78n17r06j176j231q74j14N85O75
$$ 147823 146922 146165 146012 146048 145455 144057 142550 141664 141402 141224 140707 139801 138625 137394 136520 136406 136991 137666
56647A37666R9p52j462j738j340l53N54P12L05J84P40J430J572J128M82j02m25
$$ 137666 137765 137013 135551 133813 132473 132120 132674 133386 133691 133875 134615 136045 137617 138745 139227 139125 138700
56630A38700j87O34J476J686J247O72L00Q6k8L6K74N54Q19J087J231J073O93L84
$$ 138700 138513 139147 140623 142309 143556 144228 144528 144614 144586 144622 144896 145450 146269 147356 148587 149660 150353 150737
56612A50737K38K6m19r47j314j402j206q50o64r09j301j226o08k18o91j567j776
$$ 150737 150975 151001 150582 149635 148321 146919 145713 144863 144199 143290 141989 140763 140155 139937 139246 137679 135903
56595A35903r97k7K62j67p18r48q07m54n7K63M25L54l3o06q89m77L55P99M60j57
$$ 135903 134906 134879 135141 134974 134256 133308 132501 132047 131990 132253 132678 133032 132999 132393 131504 131027 131382 132181 132641 132484
56575A32484l37J1M82Q34J124J402J657J936K149J961J270O51Q29J771K745L190
$$ 132484 132147 132158 132640 133474 134598 136000 137657 139593 141742 143703 144973 145624 146453 148224 150969 154159
56559A54159L115K749K433K691L713M697M476K977J335L26l96j199j552r98k37
$$ 154159 157274 160023 162456 165147 168860 173557 178033 181010 182345 182671 182275 181076 179524 178526 178289
56544A78289k62r48j393j353j256j108m86L04K40r20k079k220j665j302j280j109
$$ 178289 178027 177079 175686 174333 173077 171969 171483 171787 172027 171107 169028 166808 165143 163841 162561 161452
56528A61452p10n09o70q05n78j49J46K37L24N55Q66J068J003O53J41l83q33j196
$$ 161452 160742 160233 159563 158758 158180 158031 158177 158414 158738 159293 160159 161227 162230 162883 163024 162641 161808 160612
56510A60612j442j433j029l31K71M71L95M12N96O39M12J92K41L73L04J37J83M62
$$ 160612 159170 157737 156708 156377 156648 157119 157514 157926 158522 159161 159573 159765 160006 160379 160683 160820 161003 161465
56492A61465O35M13j30o14o22j53K03j56r57j275q03l34n58j006q60j93L13N03
$$ 161465 162100 162513 162383 161769 161147 160994 161197 161041 160084 158809 158006 157672 157114 156108 155248 155055 155368 155871
56474A55871O93P97M46j38l42j55o9m7L86R98R43K94K26J178J948J430K73j47
$$ 155871 156564 157361 157807 157669 157327 157172 157103 157056 157442 158440 159383 159677 159903 161081 163029 164459 164732 164585
56456A64585L17O97N43K96K94K90P3j89l57n00n87m54j71j5m5j0J93K64j50r10
$$ 164585 164902 165599 166142 166438 166732 167022 167095 166906 166549 166049 165462 165008 164837 164822 164777 164767 164960 165224 165074 164164
56436A64164j360r27J77J025J016O37P90J449J682J094M77O31J228J423J054N59
$$ 164164 162804 161877 162054 163079 164095 164732 165522 166971 168653 169747 170224 170855 172083 173506 174560 175119
56420A75119J26l45o26k50P91J895K430K208J541J050J202J663J559O70n8J91
$$ 175119 175245 174900 174274 174024 174815 176710 179140 181348 182889 183939 185141 186804 188363 189033 188975 189166
56404A89166Q54Q40K38J43Q54J364R25J74J19P28J139R42N68N62R03J118Q27J28
$$ 189166 190020 190860 191098 191241 192095 193459 194384 194558 194677 195405 196544 197486 198054 198616 199519 200637 201464 201592
56386B01592m99o49l30K33R58J808K384K146J158L06M01J190J592R27l00r61n05
$$ 201592 201093 200444 200114 200347 201305 203113 205497 207643 208801 209107 209508 210698 212290 213217 212917 211956 211451
56369B11451N65J401J693J684J554J224Q31Q19J388K040K111J563J002R63J367
$$ 211451 212016 213417 215110 216794 218348 219572 220403 221222 222610 224650 226761 228324 229326 230289 231656
56354B31656J613J179K21m14m4J002J734J773J725K134K658K747K547K548K638
$$ 231656 233269 234448 234669 234255 234211 235213 236947 238720 240445 242579 245237 247984 250531 253079 255717
56339B55717K321J729J674K573L830M454M004K854J801J491J980K776L352L490
$$ 255717 258038 259767 261441 264014 267844 272298 276302 279156 280957 282448 284428 287204 290556 294046
56325B94046L134K277J258P70J081J539J326M99j41j02M54J229K061K709K904
$$ 294046 297180 299457 300715 301485 302566 304105 305431 305930 305789 305687 306141 307370 309431 312140 315044
56310C15044K727K529K475K485K590K875L142L089K889L060L761M549M989N056
$$ 315044 317771 320300 322775 325260 327850 330725 333867 336956 339845 342905 346666 351215 356204 361260
56296C61260M905M672M609N005N794O516O856O962P157P540P953Q205Q325Q609
$$ 361260 366165 370837 375446 380451 386245 392761 399617 406579 413736 421276 429229 437434 445759 454368
56282D54368R262R907R857R091Q537Q939R817J0213J0095J0287J1196J2438J3697
$$ 454368 463630 473537 483394 492485 501022 509961 519778 529991 540086 550373 561569 574007 587704
56269E87704J5095J6595J7808J8656J9541K0667K1789K2809K3980K5289K6440
$$ 587704 602799 619394 637202 655858 675399 696066 717855 740664 764644 789933 816373
56258H16373K7688K9889L3166L6389L8685M0811M4142M8743N3533N8106O3289
$$ 816373 844061 873950 907116 943505 982190 1023001 1067143 1115886 1169419 1227525 1290814
56247A290814O9665P6515Q2768Q8342R3819R9191J03654J06781J09128J11281
$$ 1290814 1360479 1436994 1519762 1608104 1701923 1801114 1904768 2011549 2120677 2231958
56237B231958J12629J11564J06967R9104Q9018P7379O4159M9114L2328J4409l639
$$ 2231958 2344587 2456151 2563118 2662222 2751240 2828619 2892778 2941892 2974220 2988629 2984990
56226B984990k0825l6719n1497o5294p7631q7671r4933r9551j01985j02674j01933
$$ 2984990 2964165 2927446 2875949 2810655 2733024 2645353 2550420 2450869 2348884 2246210 2144277
56215B144277j00022r7334r4404r1434q7885q3044p7115p1227o6185o1782n7636
$$ 2144277 2044255 1946921 1852517 1761083 1673198 1590154 1513039 1441812 1375627 1313845 1256209
56204A256209n3880n0490m6697m1981l7077l3076k9941k6923k4060k2104k1047
$$ 1256209 1202329 1151839 1105142 1063161 1026084 993008 963067 936144 912084 889980 868933
56193H68933j9959j8434j7054j6197j5338j3997j2444j1020r618q243p390p206
$$ 868933 848974 830540 813486 797289 781951 767954 755510 744490 734872 726629 719239 712033
56181G12033o974o030m780m095m077l931l023j619o12p01j677k429j933l51J173
$$ 712033 705059 699029 694249 690154 686077 682146 679123 677504 676892 676191 674514 672085 670152 669801 670974
56166F70974J824J831J838K065K335K515K647K910L601M844O203O995P084P059
$$ 670974 672798 674629 676467 678532 680867 683382 686029 688939 692540 697384 703587 710582 717666 724725
56152G24725P395P966Q516R161J0115J1263J2355J3416J4712J6468J8711K1249
$$ 724725 732120 740086 748602 757763 767878 779141 791496 804912 819624 836092 854803 876052
56140H76052K3735K5974K8215L0929L4165L7374L9879M1391M2047M2117M1620
$$ 876052 899787 925761 953976 984905 1019070 1056444 1096323 1137714 1179761 1221878 1263498
56129A263498M0127L7190L3108K8965K5665K3235K1290J9604J7803J5078J1025
$$ 1263498 1303625 1340815 1373923 1402888 1428553 1451788 1473078 1492682 1510485 1525563 1536588
56118A536588O353J998j983n922r344j1472j2757j4768j8358k2790k6796k9684
$$ 1536588 1542941 1544939 1542956 1537034 1527690 1516218 1503461 1488693 1470335 1447545 1420749 1391065
56106A391065l1320l1790l1399l0452k8929k6679k3766k0209j5818j1013p153
$$ 1391065 1359745 1327955 1296556 1266104 1237175 1210496 1186730 1166521 1150703 1139690 1132537
56095A132537n135m075k516m63J047J934L073M525N411N713O505Q114R561J0302
$$ 1132537 1127402 1123327 1120811 1120348 1121395 1123329 1126402 1130927 1136338 1142051 1148556 1156670 1166231 1176533
56081A176533J1033J2205J3147J3368J3501J4208J5208J5997J6618J7129J7299
$$ 1176533 1187566 1199771 1212918 1226286 1239787 1253995 1269203 1285200 1301818 1318947 1336246
56070A336246J7260J7576J8227J8574J8629J9273K0777K2271K3128K3796K4735
$$ 1336246 1353506 1371082 1389309 1407883 1426512 1445785 1466562 1488833 1511961 1535757 1560492
56059A560492K5670K6446K7506K9007L0397L1366L2247L3177L3912L4709L6218
$$ 1560492 1586162 1612608 1640114 1669121 1699518 1730884 1763131 1796308 1830220 1864929 1901147
56048A901147L8243L9851M0947M2333M4102M5449M6373M7857M9976N1635N2661
$$ 1901147 1939390 1979241 2020188 2062521 2106623 2152072 2198445 2246302 2296278 2347913 2400574
56037B400574N4335N7224O0316O3012O6084O9910P3691P7238Q1642Q7136R2346
$$ 2400574 2454909 2512133 2572449 2635461 2701545 2771455 2845146 2922384 3004026 3091162 3183508
56026C183508R6733J01830J08800J16708J24559J33174J43433J54414J64814J74750
$$ 3183508 3280241 3382071 3490871 3607579 3732138 3865312 4008745 4163159 4327973 4502723
56016D502723J84773J94532K03662K12581K21222K28613K34758K41297K49308
$$ 4502723 4687496 4882028 5085690 5298271 5519493 5748106 5982864 6224161 6473469
56007F473469K58172K67437K77608K88238K97609L05521L13936L23771L33665
$$ 6473469 6731641 6999078 7276686 7564924 7862533 8168054 8481990 8805761 9139426
55998I139426L43115L53885L66777L80131L93255M08033M25170M42291M58145
$$ 9139426 9482541 9836426 10203203 10583334 10976589 11384622 11809792 12252083 12710228
55989A2710228M75316M96161N19485N44136N72404O06559O45232O86564P31724
$$ 12710228 13185544 13681705 14201190 14745326 15317730 15924289 16569521 17256085 17987809
55980A7987809P81910Q35056Q89086R45204J004384J064102J122470J182425J248201
$$ 17987809 18769719 19604775 20493861 21439065 22443449 23507551 24630021 25812446 27060647
55971B7060647J321459J404718J504316J625587J769412J937903K138341K376686
$$ 27060647 28382106 29786824 31291140 32916727 34686139 36624042 38762383 41139069
55963D1139069K653125K970357L340384L776335M283365M864373N527384O279401
$$ 41139069 43792194 46762551 50102935 53879270 58162635 63027008 68554392 74833793
55955G4833793P122026Q063819R127253J0327413J1645882J3030243J4400482
$$ 74833793 81955819 90019638 99146891 109474304 121120186 134150429 148550911
55948A48550911J5634309J6556757J6961669J6621009J5248219J2517742Q269795
$$ 148550911 164185220 180741977 197703646 214324655 229572874 242090616 250360411
55941B50360411K797814l096956q434032j2514676j5133764j6455057j6777762
$$ 250360411 253158225 250061269 241627237 229112561 213978797 197523740 180745978
55934A80745978j6401740j5587940j4534131j3361555j2138945j0917332r737315
$$ 180745978 164344238 148756298 134222167 120860612 108721667 97804335 88067020
55927H8067020q622070p585054o641894n805001n073113m436575l888232l421446
$$ 88067020 79444950 71859896 65218002 59413001 54339888 49903313 46015081 42593635
55919D2593635l023704k681460k387829k138820j926166j740647j578734j439691
$$ 42593635 39569931 36888471 34500642 32361822 30435656 28695009 27116275 25676584
55911B5676584j319362j212374j117257j034017r59576q90548q27589p72301p22675
$$ 25676584 24357222 23144848 22027591 20993574 20033998 19143450 18315861 17543560 16820885
55902A6820885o75982o33318n96721n64353n32971n02834m75991m52000m29334
$$ 16820885 16144903 15511585 14914864 14350511 13817540 13314706 12838715 12386715 11957381
55893A1957381m08829l91624l75736l58586l41040l25245l10314k94038k77174
$$ 11957381 11548552 11156928 10781192 10422606 10081566 9756321 9446007 9151969 8874795
55884H874795k62241k49464k37430k26445k17738k10605k03601j97389j93197
$$ 8874795 8612554 8363090 8125660 7899215 7681477 7470872 7267271 7069882 6876685
55875F876685j89698j84717j78782j73776j69136j62861j55370j49004j44199
$$ 6876685 6686987 6502270 6323488 6149712 5980576 5817715 5662345 5513341 5369142
55866E369142j39394j34262j29952j26290j21677j15833j10119j05148j00328
$$ 5369142 5229748 5095486 4965534 4839244 4717567 4601734 4491615 4386467 4286139
55857D286139r5644r1795q8645q5501q2561q0272p7892p4612p1491p0076o9710
$$ 4286139 4190495 4098700 4010055 3924554 3841993 3761721 3683829 3609217 3537726 3467650 3397940
55846C397940o8470o6270o4700o4125o3282o1735o0426n9692n8675n7009n5333
$$ 3397940 3329470 3263200 3198500 3134375 3071093 3009358 2948932 2889240 2830565 2773556 2718223
55835B718223n3925n2336n0542m9117m8185m7360m6533m5630m4106m1818l9861
$$ 2718223 2664298 2611962 2561420 2512303 2464118 2416758 2370225 2324595 2280489 2238671 2198810
55824B198810l9175l9027l8250l7245l7109l7494l7121l5906l4777l3787l2314
$$ 2198810 2159635 2120608 2082358 2045113 2008004 1970510 1933389 1897483 1862706 1828919 1796605
55813A796605l0719l0059l0237l0140k9403k8543k7640k6480k5650k5798k6104
$$ 1796605 1765886 1735827 1705590 1675450 1646047 1617504 1589864 1563384 1537734 1511936 1485832
55802A485832k5261k3652k2818k2999k2969k2185k1245k0348j9160j8130j8028
$$ 1485832 1460571 1436919 1414101 1391102 1368133 1345948 1324703 1304355 1285195 1267065 1249037
55791A249037j8148j6974j4765j3525j3997j4656j4207j3249j2756j2567j2286
$$ 1249037 1230889 1213915 1199150 1185625 1171628 1156972 1142765 1129516 1116760 1104193 1091907
55780A091907j2288j2947j3939j5032j6573j8515j9909j9975j8960j7553j6176
$$ 1091907 1079619 1066672 1052733 1037701 1021128 1002613 982704 962729 943769 926216 910040
55769I10040j5074j4323j3536j2381j1408j1556j2809j4225j5216j5806j5802
$$ 910040 894966 880643 867107 854726 843318 831762 818953 804728 789512 773706 757904
55758G57904j4866j3475j2570j2175j1553j0667j0217j0131r530q448q091q953
$$ 757904 743038 729563 716993 704818 693265 682598 672381 662250 652720 644272 636181 627228
55746F27228r953j0103r793r773r909r748r376r080q812q506q270p944p189o300
$$ 627228 617275 607172 597379 587606 577697 567949 558573 549493 540681 532175 523905 515961 508772 502472
55732E02472o111o792p514p690p682p972q415q662q614q162p278o515o604p270
$$ 502472 496361 489569 482055 474365 466683 458711 450296 441634 433020 424858 417580 411065 404461 397191
55718C97191p428o766o201o320o411n660m419l550l117k470j278P4Q63N84o53
$$ 397191 389763 382997 376796 370476 364065 358405 353986 350436 347319 344849 343571 343645 344508 345092 344439
55703C44439k099l075l674m404n297n936o198o291o197n822n496n521n473m901
$$ 344439 342340 339265 335591 331187 325890 319954 313756 307465 301268 295446 289950 284429 278956 274055
55689B74055m415m841n533m968l146j780j787k097j623r38j078j792k113j810
$$ 274055 269640 264799 259266 254298 251152 249372 247585 245488 243865 242927 241849 240057 237944 236134
55675B36134j356j044r28j143j651k129k504l017l450l118k039j257j418j888
$$ 236134 234778 233734 232806 231663 230012 227883 225379 222362 218912 215794 213755 212498 211080 209192
55661B09192j887j626j609j604j139m21O5K98L90P4p29j367j246p19n05o69q28
$$ 209192 207305 205679 204070 202466 201327 200906 200971 201269 201659 201733 201004 199637 198391 197672 197167 196498 195670
55644A95670r61j219j363j086o12l16r9K37L19l69j590k508k664k333k036k124
$$ 195670 194709 193490 192127 191041 190429 190113 190014 190251 190570 190201 188611 186103 183439 181106 179070 176946
55628A76946k652l286l520l267l000l003k927k471k023k159k750l112k803j984
$$ 176946 174294 171008 167488 164221 161221 158218 155291 152820 150797 148638 145888 142776 139973 137989
55614A37989j165q47j159j609j584j260j465k381l076k816k141j978k229k058
$$ 137989 136824 135977 134818 133209 131625 130365 128900 126519 123443 120627 118486 116508 114279 112221
55600A12221j273n46m17p10r93j059r21p32o31n48k44J65J37n16j112q60M2O30
$$ 112221 110948 110402 109985 109275 108282 107223 106302 105570 104939 104391 104147 104312 104449 103933 102821 101961 102003 102633
55582A02633L16n43j209j272q27k66J19L75P48J224J490J387J088Q25P25J010
$$ 102633 102949 102406 101197 99925 99098 98832 98951 99326 100074 101298 102788 104175 105263 106088 106813 107823
55566A07823J837K770K925J949M15r90k153l167l811l836l442k990k582k194j912
$$ 107823 109660 112430 115355 117304 117719 116729 114576 111409 107598 103762 100320 97330 94748 92554 90642
55551I0642j716j377q11k04L95J083J585J347M74j51o5J46r0l94k06J65J14j70
$$ 90642 88926 87549 86738 86534 86929 88012 89597 90944 91418 91267 91202 91348 91258 90864 90658 90823 90937 90767
55533I0767l5M97Q17P18N57N28M36J23l71r12j180p49K33Q97P00J92J05K05j75
$$ 90767 90732 91229 92046 92764 93321 93849 94285 94408 94037 93125 91945 91196 91429 92326 93026 93218 93323 93528 93353
55514I3353q55j080q22p89j207j515j359j025p58m46j28j04l67n23m61m95p14
$$ 93353 92498 91418 90596 89807 88600 87085 85726 84701 83943 83497 83369 83265 82898 82375 81914 81419 80705
55497H0705q23p43p27p36m31K6r0q96j402p29O04J267O79n01j271j185m34M98
$$ 80705 79882 79139 78412 77676 77245 77271 77181 76285 74883 74154 74758 76025 76704 76203 74932 73747 73313 73811
55479G3811J195J526J571J296N46n21j296j326q94o73p94p44k76M8l63j095j069
$$ 73811 75006 76532 78103 79399 79945 79424 78128 76802 75908 75235 74441 73697 73421 73469 73106 72011 70942
55462G0942j4J072J231Q04O86Q34M09o79j378r70q3L35K72J97j2p32j579j700
$$ 70942 70928 72000 73231 74035 74721 75555 75964 75285 73907 72937 72854 73189 73461 73658 73646 72914 71335 69635
55444F9635j065n59o49p84l98J65K50j02k78l4K39J88l0p1J04K80L76M89O04N65
$$ 69635 68570 68011 67362 66578 66180 66345 66595 66493 66215 66181 66420 66608 66578 66507 66611 66891 67267 67756 68360 68925
55424F8925M22M66O80N70r5o36k02R74J707J303L16k88j70L85R48J123P07jm28
$$ 68925 69347 69813 70493 71063 70968 70332 70130 71104 72811 74114 74430 74142 73972 74357 75305 76428 77135 77134 76706
55405G6706m61n36q69j158j252j410j618j367n80n6l65r51r89n55k07N9O03J204
$$ 76706 76245 75709 74840 73682 72430 71020 69402 68035 67455 67399 67034 66083 65094 64539 64332 64391 64994 66198
55387F6198J281P68J25l84o90n75l8K95n6m92j01Q61J238P08J55J98L28j14r10
$$ 66198 67479 68247 68372 67988 67298 66723 66685 66980 66924 66432 66331 67192 68430 69138 69293 69491 69819 69705 68795
55368F8795j418j445j208q28k51N06J289J809J794J316Q73P79O78J30n47p09m67
$$ 68795 67377 65932 64724 63896 63645 64151 65440 67249 69043 70359 71232 72011 72689 72819 72272 71563 71096
55351G1096n74j184j553j190o12n04p23o04N8P27P71J83l52j67N42Q68L49m14
$$ 71096 70522 69338 67785 66595 65983 65479 64756 64152 64210 64937 65708 65891 65539 65372 65914 66782 67131 66717
55333F6717o67n37n60o55l81O2P8k20j42L35M94J37j14k8j80p64r56j76R34J419
$$ 66717 66050 65513 64953 64298 63917 63979 64057 63837 63695 64030 64524 64661 64547 64519 64339 63575 62619 62443 63377 64796
55313F4796J246R02M49k52p85o13K6L51J19j89j63P1K57M10O70R77J032N89j69
$$ 64796 66042 66944 67393 67141 66356 65743 65769 66120 66239 66050 65887 65958 66215 66625 67295 68272 69304 69893 69724
55294F9724o46m86m7R7K0K75Q68J108N99k32q44j153j137n74L13O45o1j113j483
$$ 69724 69078 68592 68545 68642 68662 68937 69805 70913 71512 71280 70436 69283 68146 67572 67885 68530 68469 67356 65873
55275F5873j040l75J79O84J054J108R75Q89P28K74k43m07k95k93l89j80L96R53
$$ 65873 64833 64458 64637 65321 66375 67483 68458 69347 70075 70349 70106 69699 69404 69111 68722 68542 68938 69891
55257F9891J247J409J507J356Q98L53r1m44p02p42n51l30k62l35m49n12n25o23
$$ 69891 71138 72547 74054 75410 76308 76661 76570 76126 75424 74682 74131 73801 73539 73204 72755 72243 71718 71095
55239G1095r37j230r66OJ023J287Q79O12R11J302J067J42q65j270q74j31J99j85
$$ 71095 70158 68928 67962 67968 68991 70278 71157 71769 72680 73982 75049 75191 74326 73056 72182 72051 72250 72065
55221G2065p75q79n35m25q21j133p20J85Q29R18Q58J008J152R18M18J39K56L78
$$ 72065 71290 70411 69876 69451 68630 67497 66777 66962 67791 68709 69567 70575 71727 72645 73063 73202 73458 73836
55203G3836O1o23j164j103l53Q01J762J868R65k83j019j152j297j710j800j050
$$ 73836 73897 73274 72110 71007 70654 71455 73217 75085 76050 75767 74748 73596 72299 70589 68789 67739
55187F7739P2O43N21M07P18J038Q97N03L75N06M51J02j36j5J29j01m86m31K32
$$ 67739 67811 68454 68975 69382 70100 71138 72035 72538 72913 73419 73870 73972 73836 73821 73950 73849 73363 72932 73164
55168G3164J014J400J349J070O48J44j72o2K81M16J83j44k50j04J34K62J31k39
$$ 73164 74178 75578 76927 77997 78645 78789 78617 78555 78836 79252 79435 79291 79041 78937 79071 79333 79464 79225
55150G9225n45m14J74Q32J095P96J65l41m46l37l99n77l74K89O84K21n97q41n11
$$ 79225 78680 78266 78440 79272 80367 81163 81328 80987 80541 80204 79805 79228 78854 79143 79827 80048 79451 78610 78099
55131G8099m26q32r95m46K07J74l65n57k0P98J241J071N64Q0m24j301k413k689
$$ 78099 77673 76841 75846 75400 75607 75781 75416 74859 74839 75637 76878 77949 78513 78593 78169 76868 74455 71766
55113G1766j229J263K855K450Q59l98o58k37K51K58l50q37j27J649K890K454J156
$$ 71766 70537 71800 74655 77105 77964 77566 76908 76671 76922 77180 76830 75993 75866 77515 80405 82859 84015
55096H4015N47Q36J095R82J011J279J172N46R0J41R7n40j192q99M10J813K316
$$ 84015 84562 85398 86493 87475 88486 89765 90937 91483 91573 91714 91811 91271 90079 89180 89590 91403 93719
55079I3719J661M21n01o39l11j07j23o9O8k1l74o24n63l60j06L58R78J285R58
$$ 93719 95380 95801 95300 94661 94350 94243 94120 94051 94119 94098 93724 93100 92537 92177 92071 92429 93407 94692 95650
55060I5650K33l51m19P2P82J078O17j34m36l29n61j358j983j779j022l00L16R07
$$ 95650 95883 95532 95113 95185 95967 97045 97662 97528 97092 96763 96202 94844 92861 91082 90060 89760 90076 90983
55042I0983J108N73k69o43m57l07n40q94j003p41j52N34Q17L93l10n04k3N59P72
$$ 90983 92091 92664 92395 91752 91295 90988 90448 89554 88551 87810 87658 88192 89009 89402 89092 88588 88565 89124 89896
55023H9896O92M75Mo54r90o58n4J46j29l25m0N32R13Q69N57K91K04R1l16r14j193
$$ 89896 90588 91063 91067 90413 89423 88765 88711 88857 88728 88403 88363 88895 89808 90677 91234 91525 91729 91820 91504 90590 89397
55002H9397q00L8P21Q00K26p01j388j246k55Q55J290J010N90M55N49P22R36J079
$$ 89397 88597 88635 89356 90156 90382 89681 88293 87047 86792 87647 88937 89947 90537 90992 91541 92263 93199 94278
54984I4278R53N96K68K2l50q01r28o09l01l44m13j19J99q7q13j024k16R51J420
$$ 94278 95231 95827 96095 96117 95767 94966 94038 93429 93128 92784 92371 92252 92451 92364 91551 90527 90311 91262 92682
54965I2682R17J00k72q8J21r1m91l86M55J403J702J357R76R05R43P72K52n85j418
$$ 92682 93599 93699 93427 93339 93460 93369 92878 92492 92947 94350 96052 97409 98385 99290 100233 101005 101257 100672 99254
54946I9254j571o37P45J362P71k77r01r85q23m75O0M67M68K45J37J23L0n0L9J05
$$ 99254 97683 97046 97791 99153 99924 99647 98746 97761 96938 96463 96523 96990 97458 97703 97840 97963 97993 97943 97982 98087
54926I8087q8l10j29M00P80Q01P92J102J709K388K911L028K668K214K267K913
$$ 98087 97999 97689 97560 97960 98740 99541 100333 101435 103144 105532 108443 111471 114139 116353 118620 121533
54910A21533L573L744L612L602L644L250K259J041m7j038j996k677k859k748k651
$$ 121533 125106 128850 132462 136064 139708 142958 145217 146258 146211 145173 143177 140500 137641 134893 132242
54895A32242k440j844j169j088j583j785j274q08j140j718j453m39J45j30l51
$$ 132242 129802 127958 126789 125701 124118 122333 121059 120251 119111 117393 115940 115501 115646 115516 115165
54880A15165K43J086J172M55l12o08m86j68J81N09J043K058L236L772L435L070
$$ 115165 115408 116494 117666 118121 117809 117201 116715 116547 116728 117237 118280 120338 123574 127346 130781 133851
54864A33851L417L956L612K237O74m15j094j591k011k507l146l537l247k608k482
$$ 133851 137268 141224 144836 147073 147747 147332 146238 144647 142636 140129 136983 133446 130199 127591 125109
54849A25109l076l680l684l301k913k386j427k89L58J45p47j821k498k323j311
$$ 125109 122033 118353 114669 111368 108455 106069 104642 104353 104711 104856 104109 102288 99790 97467 96156
54834I6156j23M17M3p16j098q01j50L69O82J067J575J774J270L18l38k57L47R42
$$ 96156 96033 96450 96493 95777 94679 93878 93728 94097 94779 95846 97421 99195 100465 100783 100445 100188 100535 101477
54816A01477J187J056P01L05m0l70p49j147j441j440j001k40L39K31m16q52n45
$$ 101477 102664 103720 104421 104726 104686 104316 103567 102420 100979 99539 98538 98298 98637 98868 98452 97600 97055
54799I7055K49Q92J056Q13L96J13J53K47j54j034j548j032J03R96J489J964K366
$$ 97055 97304 98196 99252 100065 100461 100574 100727 100974 100820 99786 98238 97206 97309 98305 99794 101758 104124
54782A04124K192J427P06M28L65L29N19R45J074M13q07j774j729n09J226K332
$$ 104124 106316 107743 108449 108877 109242 109571 110090 111035 112109 112522 111715 109941 108212 107703 108929 111261
54766A11261K239J699J938L002L620K958J792J439K076K747K772K429K258K283
$$ 111261 113500 115199 117137 120139 123759 126717 128509 129948 132024 134771 137543 139972 142230 144513
54752A44513K111J548Q43L61J30j38o22j150j504j754k076k422k673k901l118
$$ 144513 146624 148172 149015 149376 149506 149368 148746 147596 146092 144338 142262 139840 137167 134266 131148
54737A31148k952k163j283j092j408j199j00Q97Q03rm13r0K60O8m17p11p33o30
$$ 131148 128196 126033 124750 123658 122250 121051 120951 121848 122651 122642 122229 122139 122399 122467 122050 121339 120606 119976
54719A19976k94N53J858L023L389K897K165J791J793J840J819J828J764J378P58
$$ 119976 119682 120235 122093 125116 128505 131402 133567 135358 137151 138991 140810 142638 144402 145780 146538
54704A46538K92O1l64j291k480l483m070m119l525k491j614j351j586j914k144
$$ 146538 146830 146891 146527 145236 142756 139273 135203 131084 127559 125068 123454 122103 120517 118603 116459
54689A16459k252k138j700j003j92N59Q63L08q70j655j262o3Q78J048Q01O33O96
$$ 116459 114207 112069 110369 109366 109174 109733 110596 110904 110034 108379 107117 107054 107932 108980 109781 110414 111110
54672A11110R15J105Q79m3j257j831j343m63j69o28j133j105o89l57k45j66p4
$$ 111110 112025 113130 114009 113966 112709 110878 109535 109072 108903 108275 107142 106037 105348 104991 104746 104580 104506
54655A04506j48l91m64j07M76Q78R52Q62P44N66K46k39q62j447j702j482r60l49
$$ 104506 104358 103967 103503 103396 103872 104750 105702 106564 107308 107874 108120 107881 107019 105572 103870 102388 101428 101079
54637A01079L42J009J174N39l40n21J35Q25R93R44J013Q19n6j085j337p82k94
$$ 101079 101421 102430 103604 104143 103803 103282 103417 104242 105235 106179 107192 108011 107955 106870 105533 104751 104457
54620A04457l59n11k65M6r2l64J9J043J699J226R9p01r36j066j215r78l13J77
$$ 104457 104098 103587 103322 103368 103276 102912 102931 103974 105673 106899 106998 106297 105361 104295 103080 102102 101789 101966
54602A01966J39N4M29R85J121Q01L90j6m46n85j40M85O10K48o0j60l04l58J09
$$ 101966 102105 102159 102588 103573 104694 105495 105885 105869 105423 104838 104698 105183 105793 106041 105981 105821 105517 105159 105268
54583A05268Q92J254J049Q49Q12M05m24q26l44K45J27l35k70L42Q08P76M10j46
$$ 105268 106160 107414 108463 109312 110124 110529 110105 109279 108935 109180 109307 108972 108702 109044 109852 110628 111038 110892
54565A10892p83j189j180j075j152j069l79N97J027O50M0j06L99J174J574J226
$$ 110892 110109 108920 107740 106665 105513 104444 104065 104662 105689 106339 106379 106273 106672 107846 109420 110646
54549A10646N78N23J213J698J160M1o44o83o54q78j097j028n54M19J656K326J775
$$ 110646 111224 111747 112960 114658 115818 115859 115215 114532 113878 113000 111903 110875 110321 110740 112396 114722 116497
54532A16497N19k81k59p9k40l65P0Q69J289P59o01j909k079r22M28O87n3n85k61
$$ 116497 117016 116735 116476 116397 116157 115792 115862 116731 118020 118779 118178 116269 114190 113268 113696 114383 114330 113745 113484
54513A13484L10M09J92J84L26J38m77j052j097o45j94k08n51n76J12J071J512
$$ 113484 113794 114203 114395 114579 114905 115043 114566 113514 112417 111772 111578 111370 110819 110243 110355 111426 112938
54496A12938J197N13j64o71p58k06O21R66N73l4k93k17l1K59O47Q90Q48P51Q11
$$ 112938 114135 114648 114484 113813 113055 112849 113470 114436 115009 114975 114682 114465 114434 114693 115340 116230 117078 117829 118640
54477A18640Q03M44l7j13L14P78R03Q23Q57R01N60j93p56n69J62P15P60O28O13
$$ 118640 119443 119887 119850 119737 120051 120829 121732 122555 123412 124313 124873 124680 123924 123355 123517 124232 124992 125620 126233
54458A26233M69q9q19j236j176p84k14K90K96k94q99q80l65J5M7L1J09J16N0J22
$$ 126233 126702 126613 125794 124558 123382 122598 122384 122674 122970 122676 121777 120897 120532 120547 120594 120625 120734 120850 120900 121022
54438A21022K52J10k72m12q2L64M56P7n72j116j073k70P81J292J064N26L4l49
$$ 121022 121274 121384 121112 120700 120618 120982 121438 121515 120943 119827 118754 118484 119265 120557 121621 122147 122181 121832
54420A21832m18J08R54J391J237J116J422J630J126J76n13q20j171j703j994j706
$$ 121832 121414 121522 122476 123867 125104 126220 127642 129272 130398 130574 130061 129241 128070 126367 124373 122667
54404A22667j041m65j87l4K63P40J157J338J352J260R50N05M75J274K359K633
$$ 122667 121626 121161 120974 120940 121203 121943 123100 124438 125790 127050 128000 128505 128980 130254 132613 135246
54388A35246J767N48k06n67j027j572j736j259m05L05M47rn87o17J43J261K042
$$ 135246 137013 137561 137355 136788 135761 134189 132453 131194 130789 131094 131541 131532 130945 130328 130471 131732 133774
54371A33774K079J422M86k51o30q09p97l20M50N73n11j790j706k78Q65P60K33
$$ 133774 135853 137275 137761 137510 136880 136071 135274 134954 135404 135977 135466 133676 131970 131692 132557 133317 133550
54354A33550L27P81Q40N62L60rp91j220l42J281J969J040l79q98l78L35M74j27
$$ 133550 133877 134658 135498 136060 136420 136411 135620 134400 134058 135339 137308 138348 137969 137071 136693 137028 137502 137375
54336A37375j044j483q99L56J355J601J422J262J083O53P4k72p8P06J788K520
$$ 137375 136331 134848 133949 134305 135660 137261 138683 139945 141028 141681 141755 141483 141405 142111 143899 146419
54320A46419K303J293M60O13J469K004J713J219J499K659L789L987L282K370J697
$$ 146419 148722 150015 150475 151088 152557 154561 156274 157493 158992 161651 165440 169427 172709 175079 176776
54305A76776J151N36j00p19j426k169k630k651k488k432k472k540k739l026k978
$$ 176776 177927 178463 178363 177644 176218 174049 171419 168768 166280 163848 161376 158836 156097 153071 150093
54290A50093k343j568j317j570j673j238m90J98P03R71Q67M00j65n41n88k67L38
$$ 150093 147750 146182 144865 143295 141622 140384 139894 140092 140795 141766 142633 143033 142868 142327 141739 141472 141810
54273A41810Q56Q80M80J77K55L62L4n54p54l11K71L38j30o04p22o44o02m96j57
$$ 141810 142666 143546 144026 144203 144458 144820 144854 144300 143546 143235 143506 143844 143714 143110 142388 141744 141142 140646 140489
54254A40489K28L27K39L82P74R35N89J28m8j21m50q52q46m81l19n28o00j77L17
$$ 140489 140717 141044 141283 141665 142439 143374 143963 144091 144043 143922 143472 142620 141774 141293 140974 140446 139846 139669 139986
54235A39986K85j04j33L31N32j61j292j855j463n88K11O93O14j98j183j223p4
$$ 139986 140271 140167 140034 140365 140897 140736 139444 137589 136126 135538 135749 136442 137056 136858 135675 134452 134378
54218A34378J087J170O82P68J279J054m8p50k99M75N41Q5j46n2Q4L40Q05J067
$$ 134378 135465 136635 137317 138085 139364 140418 140370 139620 139321 139796 140337 140422 140276 140224 140308 140648 141453 142520
54200A42520P88L50K10J18k86o58n48l61p21j284j220n94k34l01j17N00Q20L52
$$ 142520 143308 143658 143868 143986 143700 143042 142494 142133 141412 140128 138908 138314 138080 137779 137662 138162 138982 139334
54182A39334m55r88j167j104p53k45O4J64M58J035J419J276P91J79n01q83m30
$$ 139334 138879 137891 136724 135620 134867 134622 134686 134850 135308 136343 137762 139038 139829 140008 139507 138624 138194
54165A38194N79R99K45q88j358j150q29n14r7L2n40j328j454r12n17n70m96N3
$$ 138194 138773 139772 140017 139129 137771 136621 135792 135278 135181 135213 134673 133345 131891 130979 130462 129892 129396 129449
54147A29449N60N24L10O03J416K145K322J887R96on63l52J94K53l32q05m68M17
$$ 129449 130009 130533 130843 131446 132862 135007 137329 139216 140212 140206 139643 139291 139485 139738 139406 138601 138133 138550
54129A38550J023R98P14N45M51L37M07Q44J391J561J144L47m55r17q60m53q8O5
$$ 138550 139573 140571 141285 141830 142281 142618 143025 143869 145260 146821 147965 148312 147857 146940 146080 145627 145539 145604
54111A45604K15M62M98J28k30m4N39R46J073J269J468J119J78n97o61l91l14j80
$$ 145604 145819 146281 146779 146907 146677 146633 147172 148118 149191 150460 151928 153047 153225 152628 151967 151576 151262 151082
54093A51082M43J168J164M37j02M2L12P1l89l34K50O48M78K06M06R51J231R96
$$ 151082 151525 152693 153857 154294 154192 154234 154546 154617 154228 153894 154144 154792 155270 155476 155882 156833 158064 159060
54075A59060O14N22P23Q97Q08N10K65L35O86R11O22k3m10j34N90J315J821K080
$$ 159060 159674 160196 160919 161816 162624 163134 163399 163734 164420 165331 165953 165930 165520 165386 165976 167291 169112 171192
54057A71192K064J821J569J436J330J233J362J763K028J854J607J877K613L166
$$ 171192 173256 175077 176646 178082 179412 180645 182007 183770 185798 187652 189259 191136 193749 196915
54043A96915L146K772K439K446L015M089N010N042M283L597L527L833M208M781
$$ 196915 200061 202833 205272 207718 210733 214822 219832 224874 229157 232754 236281 240114 244322 249103
54029B49103N556N974N553M600L755L145K466J722J304J352J506J376R21L18l26
$$ 249103 254659 260633 266186 270786 274541 277686 280152 281874 283178 284530 286036 287412 288333 288651 288325
54014B88325j013j728k391k929l386l901m436m636m229l530l236l536l796l352
$$ 288325 287312 285584 283193 280264 276878 272977 268541 263905 259676 256146 252910 249374 245578 242226
54000B42226k404j765j899k474k856k767k407k072j825j515j117q79r35r58n23
$$ 242226 239822 238057 236158 233684 230828 228061 225654 223582 221757 220242 219125 218246 217311 216353 215830
53985B15830K05N67L61K27Q92K229L435L935L799L424L091K895K890L244M142
$$ 215830 216035 216602 216963 217190 218082 220311 223746 227681 231480 234904 237995 240890 243780 247024 251166
53970B51166N396O276O048M758L118J551k21k437m627o029o397o017n200m134
$$ 251166 256562 262838 268886 273644 276762 278313 278092 275655 271028 264999 258602 252585 247385 243251
53956B43251l064k216j613j235j119j091p26J04Q70J076R97J241J823K274K522
$$ 243251 240187 237971 236358 235123 234004 232913 232187 232291 233161 234237 235234 236475 238298 240572 243094
53941B43094K947L527L696L245K799L037L859M593M732M242L439K863K984L771
$$ 243094 246041 249568 253264 256509 259308 262345 266204 270797 275529 279771 283210 286073 289057 292828
53927B92828M677N161N122M735M203L810L865M396N077N610N963O131O055N872
$$ 292828 297505 302666 307788 312523 316726 320536 324401 328797 333874 339484 345447 351578 357633 363505
53913C63505N930O200O126N344M314L707L477L067K316J620J163O53j02r04j688
$$ 363505 369435 375635 381761 387105 391419 395126 398603 401670 403986 405606 406769 407422 407320 406416 404728
53898D04728k753m088m956m708l806l445m129n165n667n642n763o378p148p581
$$ 404728 401975 397887 392931 388223 384417 380972 376843 371678 366011 360369 354606 348228 341080 333499
53884C33499p533p159o607n990n492n256n187n024m648m224l936l728l390k912
$$ 333499 325966 318807 312200 306210 300718 295462 290275 285251 280603 276379 272443 268715 265325 262413
53870B62413k585k712l249l813m025l783l198k416j547p92m37o27j148j582j670
$$ 262413 259828 257116 253867 250054 246029 242246 239048 236632 235085 234293 233856 233229 232081 230499 228829
53855B28829j515j386j419j531j574j478j297j114r25o10j58J56j4n78r82q75
$$ 228829 227314 225928 224509 222978 221404 219926 218629 217515 216590 215980 215822 215978 215964 215386 214404 213529
53839B13529n79n56o29k09P19J357J074J88m95n57o6P83J637J902J266L13N4P96
$$ 213529 212950 212394 211765 211556 212275 213632 214706 214894 214399 213842 213776 214559 216196 218098 219364 219677 219731 220527
53821B20527J903K624K767K515K121J926K220K872L386L583L880M741O139P730
$$ 220527 222430 225054 227821 230336 232457 234383 236603 239475 242861 246444 250324 255065 261204 268934
53807B68934R206J0298J0755J0645J0409J0476J0954J1713J2386J2147J0122O389
$$ 268934 278140 288438 299193 309838 320247 330723 341677 353390 365776 377923 388045 394434
53795C94434K168j281l618n057n729n891o180o900p431p014n877m837m138l491
$$ 394434 396602 395321 391703 386646 380917 375026 368846 361946 354515 347501 341624 336787 332649 329158
53781C29158l068l457m547n359n283m733m395m420m685n176n717n809n195m217
$$ 329158 326090 322633 318086 312727 307444 302711 298316 293896 289211 284035 278318 272509 267314 263097
53767B63097l365k801k508k535k774k879k657k294k007j800j675j738j903j898
$$ 263097 259732 256931 254423 251888 249114 246235 243578 241284 239277 237477 235802 234064 232161 230263
53753B30263j713j631j641j324n90M0K37M34J085J875K191K111K248K850L520
$$ 230263 228550 226919 225278 223954 223364 223404 223641 224075 225160 227035 229226 231337 233585 236435 239955
53738B39955L784L454K573J416M82J06M2j91p15j266j616j639j182l26K77n5j126
$$ 239955 243739 247193 249766 251182 251664 251770 251812 251621 250906 249640 248024 246385 245203 244877 245154 245099 243973
53721B43973j946j890j343j029j102j231j197j023o44O1R24J548J797J962K222
$$ 243973 242027 240137 238794 237765 236663 235432 234235 233212 232568 232629 233553 235101 236898 238860 241082
53706B41082K239J620O08p1L4P49J682K502K817K358J518J109J293J277M86m72
$$ 241082 243321 244941 245549 245478 245512 246261 247943 250445 253262 255620 257138 258247 259540 260817 261303 260831
53690B60831o95k34K35N19Q16R30O13M13R87J689J197l21j107k95Q65Q82k7p48
$$ 260831 260136 259902 260137 260656 261472 262402 263015 263428 264415 266104 267301 266980 265873 265578 266443 267325 267298 266550
53672B66550r07p74m06P8Q2o58j405j426j048q46n45K40Q76N75k19m99l41n11
$$ 266550 265643 264869 264463 264541 264623 263965 262560 261134 260086 259240 258695 258935 259811 260386 260167 259668 259327 258816
53654B58816q70o16R8L24P6L76J321J667P95k83m77m2L17O60J296J929K099J915
$$ 258816 257946 257330 257428 257752 257828 258204 259525 261192 261987 261704 261227 261185 261502 262162 263458 265387 267486 269401
53636B69401J702J459J188J161J401J492J310J296J578J611J228J186J922K638
$$ 269401 271103 272562 273750 274911 276312 277804 279114 280410 281988 283599 284827 286013 287935 290573
53622B90573K484J957K004K409K262J676J672K427K960K825K858L686M453L950
$$ 290573 293057 295014 297018 299427 301689 303365 305037 307464 310424 313249 316107 319793 324246 328196
53608C28196K433J457J934L102L580K989K173K032K526K968K953K613K090J286
$$ 328196 330629 332086 334020 337122 340702 343691 345864 347896 350422 353390 356343 358956 361046 362332
53594C62332K84m76p16p34r36j252j371j301j257j215r95p00o40q41j056j193
$$ 362332 362616 362140 361424 360690 359754 358502 357131 355830 354573 353358 352363 351663 351023 350182 349126 347933
53578C47933j416j684j651j124l70J21P8l84q06o58J78J144J465R22J2o11o78
$$ 347933 346517 344833 343182 342058 341688 341809 341887 341503 340697 340039 340217 341361 342826 343748 343760 343149 342471
53561C42471k93K74O97Q06P98J038J578K106K414K579K607K336J981K279L626
$$ 342471 342178 342452 343149 343955 344753 345791 347369 349475 351889 354468 357075 359411 361392 363671 367297
53546C67297N297O108N800N141M764M559M433M794N807O758O974O987P896R684
$$ 367297 372594 378702 384502 389643 394407 398966 403399 408193 414000 420758 427732 434719 442615 452299
53532D52299J1098J1341J1024J1032J1227J0917J0068R347R162R349R692J0194
$$ 452299 463397 474738 485762 496794 508021 518938 529006 538353 547515 556864 566556 576750
53520E76750J0809J1361J1808J2295J2909J3613J4345J5033J5548J5930J6493
$$ 576750 587559 598920 610728 623023 635932 649545 663890 678923 694471 710401 726894
53509G26894J7469J8673J9727K0364K0305J9273J7558J6252J6247J7151J7815
$$ 726894 744363 763036 782763 803127 823432 842705 860263 876515 892762 909913 927728
53498I27728J7745J7408J7285J7396J7713J8197J8295J7249J5267J3663J3418
$$ 927728 945473 962881 980166 997562 1015275 1033472 1051767 1069016 1084283 1097946 1111364
53487A111364J4077J4458J4036J3193J2506J2202J2104J1816J1109J0148R129
$$ 1111364 1125441 1139899 1153935 1167128 1179634 1191836 1203940 1215756 1226865 1237013 1246142
53476A246142P822N985M124L064K676J856Q6j861l151m050n215o566p600q292
$$ 1246142 1253964 1259949 1264073 1267137 1269813 1271669 1271755 1269894 1266743 1262693 1257478 1250912 1243312 1235020
53462A235020q867r173r094r191j0046j1233j1800j1671j1724j2432j3233j3387
$$ 1235020 1226153 1216980 1207886 1198695 1188649 1177416 1165616 1153945 1142221 1129789 1116556 1103169
53450A103169j2800j1827j0818j0073r787r780r612r006p984o646n202m103l673
$$ 1103169 1090369 1078542 1067724 1057651 1047864 1038084 1028472 1019466 1011482 1004836 999634 995531 991858
53437I91858l598l170k068n75R08K092K671K597K503L270M935O581P507Q103R215
$$ 991858 988260 985090 983022 982447 983355 985447 988118 990715 993218 996488 1001423 1008004 1015511 1023614 1032829
53422A032829J1076J3155J4805J5734J6095J6384J7089J8206J9282K0087K1037
$$ 1032829 1043905 1057060 1071865 1087599 1103694 1120078 1137167 1155373 1174655 1194742 1215779
53411A215779K2610K4558K6096K6929K7682K9077L0948L2448L3205L3852L5168
$$ 1215779 1238389 1262947 1289043 1315972 1343654 1372731 1403679 1436127 1469332 1503184 1538352
53400A538352L7014L8570L9422L9896M0297M0511M0518M0688M1119M1204M0436
$$ 1538352 1575366 1613936 1653358 1693254 1733551 1774062 1814580 1855268 1896387 1937591 1978027
53389A978027L9250L8393L7833L6928L5474L3844L2106K9824K6861K3688K0675
$$ 1978027 2017277 2055670 2093503 2130431 2165905 2199749 2231855 2261679 2288540 2312228 2332903
53378B332903J7693J4643J1823R391O903L862L94k996o134r362j3096j7432k2017
$$ 2332903 2350596 2365239 2377062 2386453 2393356 2397218 2397612 2394616 2388482 2379120 2366024 2348592 2326575
53365B326575k6174k9323l1479l3141l4638l5767l6253l6230l6094l6027l5897
$$ 2326575 2300401 2271078 2239599 2206458 2171820 2136053 2099800 2063570 2027476 1991449 1955552
53354A955552l5505l4749l3680l2556l1747l1463l1606l1941l2244l2295l1928
$$ 1955552 1920047 1885298 1851618 1819062 1787315 1755852 1724246 1692305 1660061 1627766 1595838
53343A595838l1159l0167k9094k8010k6980k5969k4734k3136k1495k0273j9426
$$ 1595838 1564679 1534512 1505418 1477408 1450428 1424459 1399725 1376589 1355094 1334821 1315395
53332A315395j8477j7343j6469j5991j5376j4293j3334j3225j3651j3527j2407
$$ 1315395 1296918 1279575 1263106 1247115 1231739 1217446 1204112 1190887 1177236 1163709 1151302
53321A151302j0985j0078r676r179q273p198o278n494m524l137j492J4J114J936
$$ 1151302 1140317 1130239 1120563 1111384 1103111 1095913 1089635 1084141 1079617 1076480 1074988 1075002 1076116 1078052
53307A078052K799L890N109O207P027P734Q775J0407J2272J3689J4477J5129J6020
$$ 1078052 1080851 1084741 1089850 1096057 1103084 1110818 1119593 1130000 1142272 1155961 1170438 1185567 1201587
53294A201587J6827J7085J7014J7191J7556J7377J6344J5063J4163J3431J2307
$$ 1201587 1218414 1235499 1252513 1269704 1287260 1304637 1320981 1336044 1350207 1363638 1375945
53283A375945J0894R758Q840P343M856K049k18k010m002o259q066r005r626j0711
$$ 1375945 1386839 1396597 1405437 1412780 1417636 1419685 1419467 1417457 1413455 1407196 1399130 1390125 1380499 1369788
53269A369788j2284j3732j4660j5298j6144j7435j8930k0020k0241j9864j9754
$$ 1369788 1357504 1343772 1329112 1313814 1297670 1280235 1261305 1241285 1221044 1201180 1181426
53258A181426k0423k1431k2021k2069k1945k1671k0886j9667j8727j8574j8976
$$ 1181426 1161003 1139572 1117551 1095482 1073537 1051866 1030980 1011313 992586 974012 955036
53247I55036j9436j9757j9855j9553j8969j8709j9118j9596j9229j8004j6834
$$ 955036 935600 915843 895988 876435 857466 838757 819639 800043 780814 762810 745976
53236G45976j6334j6097j5396j4120j2731j1527j0444r502r071r410j0141j0519
$$ 745976 729642 713545 698149 684029 671298 659771 649327 639825 630754 621344 611203 600684
53224F00684j0237r727r598r959j0497j0985j1399j1694j1799j1771j1609j0944
$$ 600684 590447 580720 571122 561163 550666 539681 528282 516588 504789 493018 481409 470465
53212D70465r432p555o407o395o687o406n896o083o885p154o282n068m612m972
$$ 470465 461033 453478 447071 440676 433989 427583 421687 415604 408719 401565 395283 390215 385603 380631
53198C80631n408n555n720o147o534o387n552m319l227k765k989l355l200k515
$$ 380631 375223 369668 363948 357801 351267 344880 339328 335009 331782 329017 326028 322673 319473 316958
53184C16958j911j776j762j452j211j816l302m634m810l887k724j960j559j175
$$ 316958 315047 313271 311509 310057 308846 307030 303728 299094 294284 290397 287673 285713 284154 282979
53170B82979o14L6M56K90m77j316j545j005k12K15M4n35j186j585j486q94j72
$$ 282979 282365 282401 282857 283147 282670 281354 279809 278804 278592 278807 278851 278316 277130 275545 274059 273165 272993
53153B72993J09m02j414k079j715n86K89K42l40o72o36p26j118j351j083n60j10
$$ 272993 273102 272700 271286 269207 267492 266906 267195 267437 267097 266425 265789 265063 263945 262594 261511 260951 260841
53136B60841L64R56J199M90r51k067k071j241m89l15m90n99o14p43r59r69o73
$$ 260841 261205 262161 263360 263850 262899 260832 258761 257520 257031 256716 256226 255627 255013 254270 253311 252342 251669
53119B51669l70l39m71n13m85n21m22J06P74Q00q5j117j343p58k21l51r56j478
$$ 251669 251299 250960 250489 249976 249491 248970 248548 248654 249428 250228 250143 249026 247683 246925 246704 246353 245397 243919
53101B43919j683j679j534j192p73n97p62q84n66o2o7p53j436j465j053p94p04
$$ 243919 242236 240557 239023 237831 237058 236461 235699 234815 234249 234187 234120 233367 231931 230466 229413 228619 227915
53084B27915l62J34J21n70j190j004j74N91Q75O93K27k30l45j20j0k72n05j89
$$ 227915 227553 227687 227808 227238 226048 225044 224870 225461 226336 227029 227256 227026 226681 226561 226551 226279 225774 225585
53066B25585N58J155J304J105O23j72j049j546j409p49K09J249K030K201J772
$$ 225585 226143 227298 228602 229707 230330 230158 229109 227563 226154 225405 225614 226863 228893 231094 232866
53051B32866J157Q13Q84J147J168O91P8Q5Q96J612J261J40m42J38R98R18j97j396
$$ 232866 234023 234836 235720 236867 238035 238726 238804 238889 239785 241397 242658 242798 242356 242494 243492 244410 244213 242817
53033B42817j885j639j017l42M9j65r63j715j651o71M17O41j38j136j559j446
$$ 242817 240932 239293 238276 237934 237983 237818 236855 235140 233489 232818 233235 233876 233738 232602 231043 229597
53017B29597j367j561j693j443r49n03q4N00J146J436J156N64J2m38q80j097p33
$$ 229597 228230 226669 224976 223533 222584 222081 221997 222497 223643 225079 226235 226799 226811 226373 225493 224396 223663
53000B23663M6M59M8o13o16O6O43P09O45P14N82J52J26R82J941J823P01k63m48
$$ 223663 223709 224168 224216 223603 222987 223053 223696 224405 225050 225764 226346 226498 226624 227606 229547 231370 232071 231808 231360
52981B31360l03k05K05J104J784J537P01J76K30M84P55J235J839K077J735J230
$$ 231360 231057 230852 231057 232161 233945 235482 236183 236359 236589 237073 237828 239063 240902 242979 244714 245944
52965B45944J052J164J182R58O91O30Q10J058J124P99O0q42j509j648j273o30
$$ 245944 246996 248160 249342 250300 250991 251621 252431 253489 254613 255412 255472 254630 253121 251473 250200 249570
52949B49570lL81L55j14q09j340j477j281r39n72l68o28j375k049j926j001p6
$$ 249570 249567 249948 250303 250189 249380 248040 246563 245282 244343 243771 243403 242775 241400 239351 237425 236424 236348
52932B36348J35k49o14o76o00m62MQ59J518J239R9q90r13l33j81p50j253j006
$$ 236348 236483 236234 235620 234944 234344 233882 233886 234745 236263 237502 237601 236711 235798 235465 235284 234534 233281 232275
52914B32275l64r0k51l51k75l84p22q41n55k69l16m61l49j0L69P14Q26L69n04
$$ 232275 231911 231821 231570 231219 230944 230560 229838 228997 228442 228173 227857 227396 227047 227037 227406 228120 228946 229315 228811
52895B28811r77n08M02R01R27R54R09J78j261k464k568j679n17L70P59O66M07
$$ 228811 227834 227326 227728 228629 229556 230510 231419 231597 230336 227872 225304 223625 223108 223478 224237 224903 225310
52878B25310M08O33N47m1n43l36L52Q42Q91P33M30j24o16m43M36J288J503J209
$$ 225310 225718 226351 226898 226857 226314 225978 226330 227172 228063 228796 229226 229102 228486 228043 228479 229767 231270 232479
52860B32479P96L61r3l39k56j27j77j66J17K47k99j178j465q75j27Q6j54m38o74
$$ 232479 233275 233636 233543 233204 232948 232821 232644 232478 232595 232842 232543 231365 229900 229025 228898 228984 228830 228392 227718
52841B27718r49j210j437j767k125k092j529r66r53j250j188n40L40J092J542
$$ 227718 226769 225559 224122 222355 220230 218138 216609 215643 214690 213440 212252 211712 212052 213144 214686
52826B14686J499R36K79n7l16j043k044k386j662o38k95o64r96q03l04J9oj25
$$ 214686 216185 217121 217400 217343 217027 215984 213940 211554 209892 209254 208959 208295 207299 206496 206192 206211 206205 206080
52808B06080K4M97R57J153J293J650J937J606P96L54O75J093Q30P5m42n49p23
$$ 206080 206104 206601 207558 208711 210004 211654 213591 215197 215993 216347 217022 218115 218945 219020 218578 218029 217306
52791B17306j207j668j745j518j300j244j181p77J14J068J343P42p1l82k68k00
$$ 217306 216099 214431 212686 211168 209868 208624 207443 206666 206780 207848 209191 209933 209862 209480 209212 209012
52775B09012j67J72O29N67m9m28n4N60O29J75j76j78k10n94j063j043l46N26P98
$$ 209012 208845 209017 209646 210213 210164 209736 209682 210242 210871 211046 210870 210692 210482 209888 208825 207782 207436 207962 208760
52756B08760K65l88l16M55J090J082Q19P91P30J06q40j234p31J7K68O8k1L08R16
$$ 208760 209025 208637 208321 208776 209866 210948 211767 212558 213288 213394 212554 211320 210589 210606 210874 210942 210921 211229 212145
52737B12145J567K067K164J675P51j69p37q59n46J24Q31J094P37J26k67l75l94
$$ 212145 213712 215779 217943 219618 220369 220200 219463 218604 218058 218182 219013 220107 220844 220970 220703 220328 219934
52720B19934l08O7O03Q70P12M73M13K93j27n34m70j65k93r41j378j093n06k82
$$ 219934 219626 219693 220296 221166 221878 222351 222764 223057 222930 222396 221926 221761 221468 220527 219149 218056 217550 217268
52702B17268l35o7O04J054P92N8n40o64l40K75R44J318J191P46M00M04P02J137
$$ 217268 216933 216866 217470 218524 219316 219374 218834 218170 217830 218105 219049 220367 221558 222304 222704 223108 223810 224947
52684B24947J532J639J267O39L32O30J063R06J05o29o87k27K15M28N21M40j4o84
$$ 224947 226479 228118 229385 230024 230356 230986 232049 232955 233060 232431 231744 231517 231732 232160 232681 233121 233107 232423
52666B32423r83n57K26O31K93n30j280j465r05J28J018J271R58O13O46R46J150
$$ 232423 231440 230883 231109 231740 232033 231503 230223 228758 227853 227981 228999 230270 231228 231841 232487 233433 234583
52649B34583J119J027J060J128J055P94M57R3k93n26l68P2K05m24j491k093j664
$$ 234583 235702 236729 237789 238917 239972 240766 241223 241316 241023 240497 240129 240201 240406 239982 238491 236398 234734
52632B34734n14N17P78K49m52n29K64J296J678J272P95Q92J432J865J898J550
$$ 234734 234220 234737 235515 235764 235312 234783 235047 236343 238021 239293 240088 240980 242412 244277 246175 247725
52616B47725R09J79k43j71Mk66r62j477j327n92K84Q87J072R83Q62P34M84L14
$$ 247725 248634 248813 248570 248399 248403 248137 247175 245698 244371 243779 244063 244950 246022 247005 247867 248601 249085 249399
52598B49399O98J559J972J272J85KP85J260O18m33p67j90O80J346J613J409R40
$$ 249399 250097 251656 253628 254900 255085 255087 255872 257132 257750 257317 256550 256360 257040 258386 259999 261408 262348
52581B62348P03Q30Q20L51o7J19N31M35l0o4M56P42L09m03p98q65p77m60Q0M76
$$ 262348 263051 263881 264701 265052 264985 265104 265635 266070 266040 265976 266432 267174 267483 267080 266282 265417 264640 264180 264260 264736
52561B64736M57K91L98P84J147J245R59K36o50j133r32m57k72l98m26j72J52L41
$$ 264736 265193 265484 265882 266666 267813 269058 270017 270253 269603 268470 267538 267081 266809 266411 265985 265813 265965 266306
52543B66306M65O85J015J219R78K05p38j324j461j495j596j476r57l86j02Q0M65
$$ 266306 266771 267456 268471 269690 270668 270873 270135 268811 267350 265855 264259 262783 261826 261440 261338 261418 261883
52526B61883P96O19J51P1M86P25M09K2N7J51l36j231j649j213n49l62m40M1J370
$$ 261883 262679 263298 263449 263520 264006 264731 265140 265162 265219 265370 265034 263803 262154 260941 260392 260030 259590 259631 261001
52507B61001K850L547L233K429J701J212R11P68P03M64j36r98j820k335k310j609
$$ 261001 263851 267398 270631 273060 274761 275973 276884 277652 278355 278819 278683 277685 275865 273530 271220 269611
52491B69611n49M0m58j543j960j112K18Q65O32K52J45r2q45j560j267J39J563
$$ 269611 269062 269102 268644 267101 265141 264029 264247 265112 265744 265996 266141 266049 265204 263644 262377 262516 264079
52474B64079J866J078K25J14O33J155J345J348J450J750K121K312K112J513P49
$$ 264079 265945 267023 267248 267362 267995 269150 270495 271843 273293 275043 277164 279476 281588 283101 283850
52459B83850J73Q2N43J270J693J392N20l12o36n29l74n12j077j921k557k497j835
$$ 283850 284023 284105 284648 285918 287611 289003 289523 289211 288575 288046 287672 287160 286083 284162 281605 279108 277273
52442B77273j250j196j406j415j327j539j971k000j220P2J164J442P77l07r12
$$ 277273 276023 274827 273421 272006 270679 269140 267169 265169 263949 264021 265185 266627 267404 267097 266185
52427B66185n98J72O65Q19J049J332J113K63n62p12k23N70J534K507L075L038
$$ 266185 265587 265759 266424 267243 268292 269624 270737 271000 270438 269726 269503 270073 271607 274114 277189 280227
52411B80227K841L043L590M028M228M482N002N726O504P139P321O878O013M896
$$ 280227 283068 286111 289701 293729 297957 302439 307441 313167 319671 326810 334131 341009 347022 351918
52397C51918L225O34k436m820n753n577n115m745m326l699k912k047j165m03R8
$$ 351918 355143 355777 353341 348521 342768 337191 332076 327331 323005 319306 316394 314347 313182 312779 312877
52382C12877L91O43Q60Q24L97j51k62M15J688K993L882M291M371M231L991L865
$$ 312877 313268 313911 314771 315595 315992 315841 315579 315994 317682 320675 324557 328848 333219 337450 341441 345306
52366C45306L997M218M216L948L715L670L493K797J781J161J350J911K066J638
$$ 345306 349303 353521 357737 361685 365400 369070 372563 375360 377141 378302 379652 381563 383629 385267
52352C85267J219J362J910K360K624L039L678M145M204M246M739N497N938N983
$$ 385267 386486 387848 389758 392118 394742 397781 401459 405604 409808 414054 418793 424290 430228 436211
52338D36211O267P262Q617R596R993J0280J0915J1820J2596J3079J3497J4122
$$ 436211 442478 449740 458357 467953 477946 488226 499141 510961 523557 536636 550133 564255
52326E64255J4989J5979J7052J8230J9301J9867J9765J9319J8963J8695J8169
$$ 564255 579244 595223 612275 630505 649806 669673 689438 708757 727720 746415 764584
52315G64584J7275J6311J5506J4682J3615J2405J1238J0027Q675P558P181P340
$$ 764584 781859 798170 813676 828358 841973 854378 865616 875643 884318 891876 899057 906397
52303I06397P163O163M818L798L061K197J297Q98J101J347J126M42n27j685k784
$$ 906397 913560 919723 924541 928339 931400 933597 934894 935792 936893 938240 939366 939808 939281 937596 934812
52288I34812l399l480l528l807l769k698p74J079K341L340M516N714O559P181
$$ 934812 931413 927933 924405 920598 916829 914131 913357 914436 916777 920117 924633 930347 936906 944087
52274I44087Q200R882J1652J2573J2365J1751J1649J2178J2661J2569J2044J1449
$$ 944087 952287 962169 973821 986394 998759 1010510 1022159 1034337 1046998 1059567 1071611 1083060
52262A083060J0817J0050R303Q768Q303P592O559N351M136L210K916L094K905
$$ 1083060 1093877 1103927 1113230 1121998 1130301 1137893 1144452 1149803 1153939 1157149 1160065 1163159 1166064
52249A166064J833N09r8n9k58q90j218r38p86j279j818j705j410j893l054l671
$$ 1166064 1167897 1168406 1168308 1168249 1167991 1167101 1165883 1164945 1164159 1162880 1161062 1159357 1157947 1156054 1153000 1149329
52233A149329k912j274J05O37O58R02J697K720L515M040M468M642M330L933M226
$$ 1149329 1146417 1145143 1145248 1145885 1146543 1147445 1149142 1151862 1155377 1159417 1163885 1168527 1172857 1176790 1181016
52218A181016N185N882N867N853O420O932O600N930N987O647O814O212N785O200
$$ 1181016 1186201 1192083 1197950 1203803 1210223 1217155 1223755 1229685 1235672 1242319 1249133 1255345 1261130 1267330
52204A267330P020P616P860P662O748N409M555M533M584M074L428L197K964K105
$$ 1267330 1274350 1281966 1289826 1297488 1304236 1309645 1314200 1318733 1323317 1327391 1330819 1334016 1336980 1339085
52190A339085J084Q85J433J639J006K08j35l39r04j612j905j769j676j948k557
$$ 1339085 1340169 1341054 1342487 1344126 1345132 1345340 1345205 1344866 1343962 1342350 1340445 1338676 1337000 1335052 1332495
52175A332495l398m293m839m708m094l600l555l701l633l335l052k844k483j787
$$ 1332495 1329097 1324804 1319965 1315257 1311163 1307563 1304008 1300307 1296674 1293339 1290287 1287443 1284960 1283173
52161A283173q86j9P27J387J871J959J633J279J393K050K764K914K304J245J66
$$ 1283173 1282287 1282268 1282995 1284382 1286253 1288212 1289845 1291124 1292517 1294567 1297331 1300245 1302549 1303794 1303960
52146A303960p23j323j455j011l00J00J3jP27K086L223L539L348L469M344N765
$$ 1303960 1303237 1301914 1300459 1299448 1299148 1299248 1299261 1299260 1299987 1302073 1305296 1308835 1312183 1315652 1319996 1325761
$$ [...]
##END NTUPLES=NMR SPECTRUM
##END=
