
##TITLE=AC1360_QARH12182_7155250_VSlBu4yxFI
##JCAMPDX= 6.0         $$ Bruker NMR JCAMP-DX V2.0
##DATA TYPE= NMR SPECTRUM
##DATA CLASS= NTUPLES
##ORIGIN= BRUKER
##OWNER= Administrator
$$ 1.72 TOPSPIN		Version 2.1
$$ 2012-12-01 10:26:20.707 -0500  Administrator@X
$$ Compression mode = diff/dup
##.OBSERVE FREQUENCY= 400.02188249412
##.OBSERVE NUCLEUS= ^1H
##.ACQUISITION MODE= SIMULTANEOUS (DQD)
##.ACQUISITION SCHEME= undefined
##.AVERAGES= 8
##.DIGITISER RES= 22
##SPECTROMETER/DATA SYSTEM= spect
##.PULSE SEQUENCE= zg30
##.SOLVENT NAME= COFFEE_meoh
##.SHIFT REFERENCE= INTERNAL, COFFEE_meoh, 1, 14.98509
##AUDIT TRAIL= $$ (NUMBER, WHEN, WHO, WHERE, PROCESS, VERSION, WHAT)
$$ ##TITLE= Audit trail, TOPSPIN		Version 2.1
$$ ##JCAMPDX= 5.01
$$ ##ORIGIN= Bruker BioSpin GmbH
$$ ##OWNER= Administrator
$$ $$ E:\/data/COFFEE/nmr/AC1360_QARH12182_7155250_VSlBu4yxFI/10/pdata/1/auditp.txt
$$ ##AUDIT TRAIL=  $$ (NUMBER, WHEN, WHO, WHERE, PROCESS, VERSION, WHAT)
(   1,<2012-12-01 10:26:11.869 -0500>,<Administrator>,<X>,<go>,<TOPSPIN 2.1>,
      <created by zg
	started at 2012-12-01 10:25:07.205 -0500,
	POWCHK enabled, PULCHK disabled,
       configuration hash MD5:
       86 BA 57 50 F2 9D 5C 9B 26 00 A9 28 5F 66 2E 89
       data hash MD5: 64K
       51 2B 0C 97 E8 2A DF 84 72 71 A5 34 17 CD 80 46>)
(   2,<2012-12-01 10:26:15.253 -0500>,<Administrator>,<X>,<proc1d>,<TOPSPIN 2.1>,
      <Start of raw data processing
       efp LB = 0 FT_mod = 6 PKNL = 1 PHC0 = 0 PHC1 = 0 SI = 32K 
       data hash MD5: 32K
       1B EE B0 21 8A D8 12 D3 13 CC 7A F3 3A B4 EC 6D>)
(   3,<2012-12-01 10:26:15.775 -0500>,<Administrator>,<X>,<proc1d>,<TOPSPIN 2.1>,
      <pk PHC0 = 97.29492 PHC1 = 0 
       data hash MD5: 32K
       92 53 BF 57 89 82 45 61 E4 2A D0 32 31 85 10 00>)
(   4,<2012-12-01 10:26:16.078 -0500>,<Administrator>,<X>,<proc1d>,<TOPSPIN 2.1>,
      <abs ABSG = 1 
       data hash MD5: 32K
       3D C3 40 C1 66 AF 30 5E 17 1E A1 87 33 FC ED F0>)
(   5,<2012-12-01 10:26:16.246 -0500>,<Administrator>,<X>,<proc1d>,<TOPSPIN 2.1>,
      <abs ABSG = 2 
       data hash MD5: 32K
       48 16 C8 B3 3A A5 71 A8 D5 3A 47 91 6F 10 51 76>)
(   6,<2012-12-01 10:26:16.398 -0500>,<Administrator>,<X>,<proc1d>,<TOPSPIN 2.1>,
      <abs ABSG = 3 
       data hash MD5: 32K
       FC F4 1B 84 BF 21 E3 37 02 9E D6 8D 4F C9 A3 FF>)
(   7,<2012-12-01 10:26:16.583 -0500>,<Administrator>,<X>,<proc1d>,<TOPSPIN 2.1>,
      <abs ABSG = 4 
       data hash MD5: 32K
       97 67 E6 58 AC 25 9C 77 6C 02 62 CE D0 A0 A1 F7>)
(   8,<2012-12-01 10:26:16.734 -0500>,<Administrator>,<X>,<proc1d>,<TOPSPIN 2.1>,
      <abs ABSG = 5 
       data hash MD5: 32K
       F1 7C 21 43 2C 79 3A F8 3B 1E 19 F6 60 2D AA 18>)
$$ ##END=
$$ 
$$ $$ hash MD5
$$ $$ E7 4D 4D F8 8E 39 98 E5 FF DF 52 EC 9D 97 94 7B
##$RELAX= 
##$RELAX= 
##$RELAX= 
##$RELAX= 
##$RELAX= 
##$RELAX= 
##$RELAX= 
$$ Bruker specific parameters
$$ --------------------------
##$DU= <E:\>
##$EXPNO= 10
##$NAME= <AC1360_QARH12182_7155250_VSlBu4yxFI>
$$ [...]
150 150 150 150 150 150 150 150
##$TP07= 0
##$TPNAME0= <>
##$TPNAME1= <>
##$TPNAME2= <>
##$TPNAME3= <>
##$TPNAME4= <>
##$TPNAME5= <>
##$TPNAME6= <>
##$TPNAME7= <>
##$TPOAL= (0..7)
0.5 0.5 0.5 0.5 0.5 0.5 0.5 0.5
##$TPOFFS= (0..7)
0 0 0 0 0 0 0 0
##$TUNHIN= 0
##$TUNHOUT= 0
##$TUNXOUT= 0
##$USERA1= <user>
##$USERA2= <user>
##$USERA3= <user>
##$USERA4= <user>
##$USERA5= <user>
##$V9= 5
##$VALIST= <valist>
##$VCLIST= <CCCCCCCCCCCCCCC>
##$VD= 0
##$VDLIST= <DDDDDDDDDDDDDDD>
##$VPLIST= <PPPPPPPPPPPPPPP>
##$VTLIST= <TTTTTTTTTTTTTTT>
##$WBST= 1024
##$WBSW= 4
##$XGAIN= (0..3)
0 0 0 0
##$XL= 0
##$YL= 0
##$YMAX_a= 658213
##$YMIN_a= -553753
##$ZGOPTNS= <>
##$ZL1= 120
##$ZL2= 120
##$ZL3= 120
##$ZL4= 120
##$ABSF1= 14.98509
##$ABSF2= -5.573092
##$ABSG= 5
##$ABSL= 3
##$ALPHA= 0
##$AQORDER= 0
##$ASSFAC= 0
##$ASSFACI= 0
##$ASSFACX= 0
##$ASSWID= 0
##$AUNMP= <proc_prof1d_extract_pilot.lims>
##$AXLEFT= 0
##$AXNAME= <>
##$AXNUC= <1H>
##$AXRIGHT= 0
##$AXTYPE= 0
##$AXUNIT= <>
##$AZFE= 0.1
##$AZFW= 0.1
##$BCFW= 0
##$BC_mod= 0
##$BYTORDP= 0
##$COROFFS= 0
##$CY= 15
##$DATMOD= 1
##$DC= 0
##$DFILT= <>
##$DTYPP= 0
##$F1P= 0
##$F2P= 0
##$FCOR= 0.5
##$FTSIZE= 32768
##$FT_mod= 6
##$GAMMA= 0
##$GB= 0
##$INTBC= 1
##$INTSCL= 1
##$ISEN= 128
##$LB= 0
##$LEV0= 0
##$LPBIN= 0
##$MAXI= 10000
##$MC2= 0
##$MEAN= 0
##$ME_mod= 0
##$MI= 0
##$NCOEF= 0
##$NC_proc= -8
##$NLEV= 6
##$NOISF1= 0
##$NOISF2= 0
##$NSP= 0
##$NTH_PI= 0
##$NZP= 0
##$OFFSET= 14.98509
##$PC= 1
##$PHC0= 97.29492
##$PHC1= 0
##$PH_mod= 1
##$PKNL= yes
##$PPARMOD= 0
##$PPDIAG= 0
##$PPIPTYP= 0
##$PPMPNUM= 2147483647
##$PPRESOL= 1
##$PSCAL= 4
##$PSIGN= 0
##$PYNMP= <proc.py>
##$REVERSE= no
##$SF= 400.02
##$SI= 32768
##$SIGF1= 0
##$SIGF2= 0
##$SINO= 400
##$SIOLD= 32768
##$SPECTYP= <>
##$SREGLST= <1H.CDCl3>
##$SSB= 0
##$STSI= 32768
##$STSR= 0
##$SW_p= 8223.68421052631
##$SYMM= 0
##$S_DEV= 0
##$TDeff= 65536
##$TDoff= 0
##$TI= <>
##$TILT= no
##$TM1= 0
##$TM2= 0
##$TOPLEV= 0
##$USERP1= <user>
##$USERP2= <user>
##$USERP3= <user>
##$USERP4= <user>
##$USERP5= <user>
##$WDW= 1
##$XDIM= 32768
##$YMAX_p= 472806462
##$YMIN_p= -885814
##$CURPLOT= <Network HP LaserJet P1505>
##$CURPRIN= <$Network HP LaserJet P1505>
##$DFORMAT= <normdp>
##$LAYOUT= <+/1D_H.xwp>
##$LFORMAT= <normlp>
##$PFORMAT= <normpl>
##$SURQMSG= 1
$$ End of Bruker specific parameters
$$ ---------------------------------
##NTUPLES= NMR SPECTRUM
##VAR_NAME=  FREQUENCY,     SPECTRUM/REAL,   SPECTRUM/IMAG
##SYMBOL=    X,             R,               I
##VAR_TYPE=  INDEPENDENT,   DEPENDENT,       DEPENDENT
##VAR_FORM=  AFFN,          ASDF,            ASDF
##VAR_DIM=   32768,         32768,           32768
##UNITS=     HZ,            ARBITRARY UNITS, ARBITRARY UNITS
##FACTOR=    0.250966925370066, 1,           1
##FIRST=     8223.43324360094, -25925,       -288590
##LAST=      0,             204584,          -73829
##MIN=       0,             -885814,         0
##MAX=       8223.43324360094, 472806462,    0
$$ Real data points
##PAGE= N=1
##DATA TABLE= (X++(R..R)), XYDATA
$$ [...]
$$ plain form
19468 114827 162654 209178 -169471 -100692 32168 132418 -146904 -4056 -147783 -313277 -136492
19456 16277 89567 -196365 -123181 6262 -130839 -1668 -79513 211913 -156413 56644 -109733
19444 -44928 -2347 133143 -7661 -27257 111633 -31117 214918 -43835 286248 -72939 160156
19432 -86898 -178711 1078 -403344 -148161 -56654 -535655 -154989 76857 18730 53329 -50807
19420 -435343 24817 -80388 216813 -191027 -85790 38699 18464 183969 201229 -99093 105243
19408 155869 22868 -214441 -200221 71041 -250229 -250059 95811 8846 -239877 -170838 24857
19396 -277517 219064 94011 33371 -112721 136620 44945 53647 -304467 148624 -122587
19385 14223 -119874 -297752 126516 -490255 -66339 -168843 -147603 118044 255489 -243789
$$ packed form
19468A14827M7827M6524a69471O8779C2168J00250a46904d056j43727j65494a36492
19456A6277P3290a96365P3184F262a30839a668p7845B11913a56413E6644a09733
19444d4928b347A33143g661j9596A11633c1117B14918d3835B86248g2939A60156
19432h6898r1813A078d03344a48161e6654m79001a54989G6857A8730L4599e0807
19420d35343B4817h0388B16813a91027h5790C8699A8464J65505J7260i9093A05243
19408A55869B2868b14441J4220G1041b50229J70I5811H846b39877O9039B4857
19396b77517B19064I4011C3371a12721A36620D4945Q702c04467A48624a22587
19385A4223a19874j77878A26516d90255f6339j02504K1240A18044J37445b43789
$$ plain form
19374 76236 75254 -44978 256554 -142599 124314 -139122 -36746 83103 220364 -55970 -325531
19363 -325531 74880 273181 -45735 -233194 29360 10899 -277315 54297 -56473 -13103 -277558
19352 -277558 33662 -58872 -32768 3042 -263215 72094 -135832 -201947 255661 -454987 -369791
19341 -369791 183399 -94121 -175239 -44196 -113304 -461229 -201181 -224 -41459 18294 5320
19329 -45710 -195855 -237477 -355641 -130902 135421 75775 188804 -44261 -267745 119648
19318 12202 -75139 133281 7843 -25758 -234953 -184714 -59055 -250642 21876 -26931 -23736
19307 -23736 261338 -199679 -132861 -334372 -76588 -151056 53233 -364131 39797 -159341 88216
19295 -246655 -57899 125440 -35357 -144037 34251 -240615 -58077 -33722 -241221 -376859
$$ packed form
19374G6236r82d4978B56554a42599A24314a39122c6746H3103J37261e5970k69561
19363c25531G4880J98301d5735j87459B9360A0899b77315E4297e6473a3103k64455
19352b77558C3662e8872K6104C042b63215G2094a35832o6115B55661d54987Q5196
19341c69791A83399i4121q1118d4196o9108l47925b01181b24m1235A8294E320
19329d5710j50145m1622j18164a30902A35421n9646J13029d4261k23484A19648
19318A2202g5139A33281G843b5758k09195N0239e9055j91587B1876b6931L195
19307b3736B61338a99679O6818k01511g6588p4468E3233c64131C9797a59341H8216
19295b46655e7899A25440c5357j08680C4251b40615e8077K4355k07499j35638
$$ plain form
19285 -376859 -26798 -368428 -381917 -388848 -255493 -63700 38132 -152874 -64231 375638 -129489
19273 -305664 -242605 -135063 -384979 -108752 50942 48070 162954 231460 46839 -393514 18388
19261 74810 -239857 48240 -363427 330440 -137866 -53725 -53629 -283420 110962 -222918 321988
19249 -43691 44074 -247022 -13237 -479860 187307 206293 -54095 230272 -397695 36172 -400296
19237 93249 -111983 89737 168701 -195762 -81806 -414980 -38999 -256306 -146114 85444 -66893
19225 -60513 114042 -140210 -219485 -93740 16082 80306 -123045 281249 107317 -119598
19214 -257740 108327 74845 -227876 170046 -61247 -240241 -612939 -234489 -355419 82079
19203 -220400 182920 -140159 -194047 -79229 -169635 -258671 -157715 135483 162381 -44022 -100898
$$ packed form
19285c76859b6798l41630j3489o931J33355f3700C8132a52874f4231C75638a29489
19273c05664O3059J07542k49916a08752E0942k872J14884O8506D6839c93514A8388
19261G4810b39857D8240c63427C30440a37866e3725R6k29791A10962b22918C21988
19249d3691D4074b47022a3237m66623A87307J8986e4095B30272c97695C6172d00296
19237I3249a11983H9737P8964a95762h1806l33174c8999k17307J10192H5444f6893
19225f0513A14042a40210p9275i3740A6082O4224a23045B81249A07317a19598
19214b57740A08327l3482b27876A70046f1247j78994l72698b34489j20930H2079
19203b20400A82920a40159n3888g9229r0406q9036J00956A35483K6898d4022n6876
$$ plain form
19192 -100898 -161569 -90566 -107082 -83522 128953 13042 151809 -17140 -76444 -10379 -262650
19181 -262650 -29600 -180990 -238953 -220444 160898 78100 -282634 -266996 34005 15986 27503
19170 27503 196734 -245332 -147424 28640 -132091 -206475 -306165 -82105 -169738 -18076 323293
19158 -21748 72265 206245 -49842 164219 151609 22513 -230946 201959 -453077 -123395
19147 -216998 -292043 -127079 -63380 -115155 -196316 79059 -17333 -137149 -45813 41379 8428
19135 -66022 -50626 -13585 -8084 279270 -219918 -3187 -312927 282161 -55283 21827 -352892
19123 193817 240341 -32967 -141962 -71420 -4770 -54289 -239811 -429757 -131865 -147172 -97443
19112 -97443 -138996 -322979 -124721 -283751 352037 47328 -37536 -312989 -31676 -40818 279937
$$ packed form
19192a00898o0671P1003j6516K3560A28953A3042J38767a7140n9304a0379k52271
19181b62650b9600j51390n7963J8509A60898G8100b82634J5638C4005A5986J1517
19170B7503J69231b45332R7908B8640a32091p4384r9690h2105q7633a8076C23293
19158b1748G2265J33980d9842A64219j2610B2513b30946B01959d53077a23395
19147b16998p5045a27079f3380n1775q1161G9059a7333j19816d5813D1379H428
19135f6022J5396a3585N501B79270b19918c187l09740B82161e5283B1827c52892
19123A93817M6524c2967j08995P0542d770m9519j85522j89946a31865j5307M9729
19112i7443m1553j83983a24721j59030C52037D7328c7536k75453c1676r142B79937
$$ plain form
19100 134338 -259755 -196995 179755 173880 -52778 -258961 -57081 51078 -39486 103847 484
19088 -422703 158790 -402131 171868 -414381 16432 73521 -23769 -180931 60794 -4136 124739
19076 17668 196758 -121355 -156120 47734 17496 95613 -463205 -75163 -311666 -269357 -239997
19065 -239997 -111172 -175744 49517 34205 -122712 -14632 -70279 228340 -269121 -10426 -280557
19054 -280557 -432959 -215572 -96935 110856 13589 -324258 -287397 137805 166017 192739
19044 192739 -165306 895 133076 -26206 -99235 -259323 -55780 57649 -73354 -113408 -49636
19032 304733 -431145 -184313 -229909 -85050 48859 97619 24472 -302635 -249541 -208539 286116
19020 80492 -188312 106114 213994 -227334 120054 -37233 196986 26227 -48029 -46061 -89749
$$ packed form
19100A34338b59755O2760A79755n875e2778k06183e7081E1078c9486A03847D84
19088d22703A58790d02131A71868d14381A6432N7089b3769j57162F0794d136A24739
19076A7668J79090a21355l4765D7734A7496P8117d63205g5163k36503M2309K9360
19065b39997a11172o4572D9517j5312a22712a4632n5647B28340b69121a0426k70131
19054b80557j52402b15572i6935A10856A3589c24258L6861A37805K8212K6722
19044A92739a65306H95J32181b6206p3029j60088e5780E7649g3354m0054d9636
19032C04733d31145a84313m5596h5050D8859M8760B4472c02635N3094M1002B86116
19020H0492a88312A06114J07880b27334A20054c7233A96986B6227d8029J968m3688
$$ plain form
19009 -89749 135952 93516 -148087 -309435 20816 -152785 -146575 258179 -28936 -119951 31609
18997 100554 -159496 66723 -89483 -81814 13478 61325 -201722 9007 -180135 22910 -30031
18985 52325 -254880 -374199 -12427 87368 -171541 -134681 198275 76307 -160498 123206
18974 128016 435886 736495 569954 297734 168687 -6041 -89172 -208475 133328 -318409
18963 -103333 -12154 -144252 -48232 -67907 112243 112054 -185527 57981 64657 132363 -45289
18951 284596 -87452 -404509 -152726 133810 -51210 -39505 -213842 23982 -151566 -50122
18940 -160931 -34350 182262 190939 135310 129796 -173307 -57258 -158103 146715 47745 -53861
18928 25937 106466 -131369 13638 108612 17179 -65364 113703 165756 13342 66260 -99615
$$ packed form
19009h9749A35952m2436a48087j61348B0816a52785O210B58179b8936r1015C1609
18997A00554a59496F6723h9483P669A3478M7847b01722I007a80135B2910c0031
18985E2325b54880j19319a2427H7368a71541L6860A98275G6307a60498A23206
18974A28016L07870L00609j66541k72220j29047f041q3131j19303A33328c18409
18963a03333a2154j32098d8232j9675A12243j89a85527E7981O676O7706d5289
18951B84596h7452l17057a52726A33810e1210J1705j74337B3982a51566e0122
18940a60931c4350A82262Q677n5629n514a73307e7258j00845A46715D7745e3861
18928B5937Q0529a31369A3638R4974A7179f5364A13703N2053A3342N2918i9615
$$ plain form
18916 24506 -190943 160840 -188899 30037 213305 471281 345005 719477 131880 117179
18906 117179 -69830 65005 21952 7136 169316 201738 -150488 -110215 -259139 -398697 -152920
18894 -177126 141203 121141 157319 116654 236578 -307609 -28287 -122265 -105162 -65276 -101641
18883 -101641 -267605 117410 -362043 36501 -207135 238184 -488351 -90741 -148238 -316430
18873 -316430 -187067 43803 -94835 -155182 -291267 359000 124991 -231412 -149341 -144407 191366
18861 -260898 -82737 -71876 -12225 -47095 -117628 -340669 33005 -223152 76157 142888 -328310
18849 99834 -119344 -139286 -227597 241577 176916 -124381 -227911 -69108 -10854 -349988 332585
18837 -329 -39701 62656 -6123 24644 -65148 -108592 60479 -176501 -39549 46122 76648 -174223
$$ packed form
18916B4506a90943A60840a88899C0037J83268K57976j26276L74472A31880j4701
18906A17179f9830F5005B1952G136J62180L2422a50488M0273j48924j39558a52920
18894a77126A41203k0062L6178m0665J19924c07609b8287r3978J7103L9886l6365
18883a01641j65964A17410c62043C6501b07135B38184d88351i0741n7497j68192
18873c16430J29363D3803i4835o0347j36085C59000A24991b31412Q2071M934A91366
18861b60898h2737J0861a2225l4870p0533k23041C3005b23152G6157O6731c28310
18849I9834a19344j9942q8311B41577o4661a24381j03530f9108a0854l39134C32585
18837c29l9372F2656f123B4644f5148m3444F0479a76501c9549D6122L0526a74223
$$ plain form
18824 -314414 -74208 -222441 36098 -132343 84468 -262076 -244154 130091 115929 581912
18814 581912 127605 276504 89845 -268462 125744 -657 98154 32406 184786 64217 -139877
18802 196171 154687 -218151 -52560 294008 8097 -159105 137048 -244331 -329487 36412 -130268
18790 -200266 -25863 -198456 60511 -92043 -229647 152136 -294177 -143243 -46757 -235999
18780 -235999 -33691 41399 -17253 -17691 79235 -200011 -303725 198675 -31191 -176614 -208020
18769 -208020 -148754 -15949 -118949 -75908 -18440 -241134 -39045 -295869 -229774 36652 -38174
18757 -363591 -288404 -31191 -159428 108688 -180031 -283058 150414 -22975 -139782 -109980
18747 -109980 -110997 -56698 102387 78366 -91726 -1681 -39261 77682 -200550 -338135 -37632
$$ packed form
18824c14414g4208j48233C6098a32343H4468b62076J7922A30091j4162M65983
18814E81912A27605J48899H9845b68462A25744f57I8154C2406J52380F4217a39877
18802A96171m1484b18151e2560B94008H097a59105A37048b44331q5156C6412a30268
18790b00266b5863j72593F0511i2043j37604A52136b94177a43243d6757j89242
18780b35999c3691D1399a7253m38G9235b00011j03714A98675c1191j45423l1406
18769b08020N9266a5949j03000M3041a8440k22694c9045k56824O6095C6652c8174
18757c63591P5187c1191j28237A08688a80031j03027A50414b2975j16807K9802
18747a09980j017N4299A02387k4021i1726a681l7580G7682b00550j37585c7632
$$ plain form
18735 -242008 -35458 113418 121312 -29022 -288618 341438 182182 180971 -265605 -237009 -154366
18724 -154366 -137673 -265767 -77443 -27672 -241045 -115587 25434 -122240 -67805 -27064 -23217
18713 -23217 26714 6393 -204943 197544 351499 -427607 -207423 -145920 -98193 221995 -150151
18701 125158 -359070 95256 -254379 -16040 -214837 77548 -188265 -125475 -359279 -74970
18690 31795 -258858 -107866 -108685 34628 36139 -63897 89088 -140213 94711 -162930 -190882
18679 -190882 -2035 -298405 -151106 123604 -155379 -65985 96679 -213296 -93542 38497 355010
18668 355010 -30466 168354 -179932 12080 -15507 -281832 314500 -194668 -65421 -29896
18657 -58775 322090 231685 -75051 -81950 -62862 -292059 -49673 188395 15017 -309404 -174089
$$ packed form
18735b42008c5458A13418P894b9022k59596C41438j59256j211b65605K8596Q2643
18724a54366J6693j28094g7443b7672k13373a15587B5434a22240N4435b7064L847
18713b3217B6714F393b04943A97544J53955d27607b07423O1503M7727B21995a50151
18701A25158c59070I5256b54379a6040j98797G7548a88265O2790k33804g4970
18690C1795b58858a07866q19C4628J511f3897H9088a40213I4711a62930k7952
18679a90882b035k96370J47299A23604a55379f5985I6679b13296i3542C8497L16513
18668C55010c0466A68354a79932A2080a5507k66325C14500a94668f5421b9896
18657e8775C22090r0405g5051o899J9088k29197d9673A88395A5017c09404J35315
$$ plain form
18646 -174089 222541 -21729 -56081 78922 -26745 255585 -188348 -204280 75554 -110197 -236306
18635 -236306 169234 8889 -413403 -85800 -61569 104631 -7452 183287 -118301 -136386 -76600
18624 -76600 -27909 164637 106593 -299991 -331607 -325528 5857 140837 -65731 115429 350311
18613 350311 34264 16635 -316620 130943 -231858 -165397 71739 -176334 -237119 -96159 -43054
18601 -3558 -227373 15428 -249607 -187063 -143598 -282880 -239969 -181567 -229496 -212116 -79738
18589 -46860 -78162 169496 -225700 -65871 -325506 87408 37616 -126521 -159323 -74449 -333751
18578 -333751 192368 -56932 292025 -243974 -106528 289431 -217707 152067 -216085 127878
18567 -84473 371834 -274278 96024 -274298 -126525 -252062 -82268 -543664 43775 -86455
$$ packed form
18646a74089B22541b1729l4352G8922b6745B55585a88348j5932G5554a10197j26109
18635b36306A69234H889d13403h5800K4231A04631g452A83287a18301j8085N9786
18624g6600b7909A64637n8044b99991l1616O079E857J34980f5731A15429K34882
18613C50311C4264A6635c16620A30943b31858O6461G1739a76334o0785i6159d3054
18601c558k23815A5428b49607O2544M3465j39282M2911N8402m7929J7380g9738
18589d6860l1302A69496b25700f5871k59635H7408C7616a26521l2802g4449k59302
18578c33751A92368e6932B92025b43974a06528B89431b17707A52067b16085A27878
18567h4473C71834b74278I6024b74298a26525j25537h2268m61396D3775h6455
$$ plain form
18556 117570 -96837 47278 -105054 -31207 -9485 46467 -139602 290765 -174099 74367 95461
18545 95461 -55836 -450356 -162410 81795 -142617 92600 224169 -375656 -150848 -108331
18535 -108331 46264 -222080 -191728 119448 -88919 17029 -103627 365835 -142916 71607
18524 83043 -188336 -126103 -49917 121422 -84335 -4524 -124602 23883 -331441 -47702 43015
18512 3038 -189578 74644 -134160 66974 -71654 -54851 56604 416 -134448 -75368 166079
18500 -32775 -204574 -320025 68869 37431 -130171 71441 -126628 74448 14692 -150286 -349904
18489 -349904 46949 -289505 -216244 279710 36464 -129732 -310656 -328283 -189065 -18610
18478 -379968 136175 -231131 43025 212866 -283127 -57776 -3609 -271183 -212937 -55576 -8746
$$ packed form
18556A17570i6837D7278a05054c1207i485D6467a39602B90765a74099G4367K1094
18545I5461e5836l94520a62410H1795a42617I2600J31569c75656a50848M2517
18535a08331D6264b22080L0352A19448h8919A7029a03627C65835a42916G1607
18524H3043a88336O2233d9917A21422h4335d524j20078B3883c31441d7702D3015
18512C038a89578G4644a34160F6974g1654J6803E6604D16a34448N9080A66079
18500c2775j71799j15451F8869l1438a30171G1441a26628G4448A4692a50286j99618
18489c49904D6949b89505P3261B79710C6464a29732j80924j7627J39218a8610
18478c79968A36175b31131D3025J69841b83127e7776c609k67574N8246e5576h746
$$ plain form
18466 137235 -131815 282865 -362524 -153911 446855 47017 -78324 113313 164447 -135269
18455 176150 -281144 2147 206429 -245672 -38534 -118638 270461 47299 70408 180702 283509
18444 283509 -82754 147436 -186479 -225421 -288824 -113872 -23727 93106 110054 403107 62063
18432 -200643 177849 -429485 361542 336048 -126815 193892 -280348 -295798 -258302 -23873
18421 348181 -106960 9079 -127042 41493 202125 91975 -151347 557337 -242450 55828
18410 195278 -482531 181256 -85893 -36516 179114 -55508 102158 -173967 3813 -345032
18399 -98751 -37734 -157923 -218254 397608 282531 25570 229725 58521 104350 -275769 -143947
18388 -143947 -140626 -262643 185724 41880 -34999 -2684 67986 135924 117601 -54521 39371
$$ packed form
18466A37235a31815B82865c62524a53911D46855D7017g8324A13313N1134a35269
18455A76150b81144B147K04282b45672c8534q0104B70461D7299K3109J10294J02807
18444B83509h2754A47436a86479l8942o3403a13872b3727I3106J6948K93053F2063
18432b00643A77849d29485C61542k5494a26815A93892b80348j5450L7496b3873
18421C48181a06960I079a27042D1493J60632I1975a51347E57337b42450E5828
18410A95278d82531A81256h5893c6516A79114e5508A02158a73967C813c45032
18399i8751c7734j20189o0331C97608j15077B5570K04155E8521M5829b75769J31822
18388a43947L321j22017A85724D1880c4999b684F7986O7938j8323e4521C9371
$$ plain form
18376 -197744 -22107 -144094 -169525 83627 -152599 -40953 -263062 -119171 -99990 -142581 -151535
18365 -151535 -54478 -79296 -67585 -114944 21391 170750 4151 -500602 4787 -100297 -31519
18353 102956 -111071 28342 -112874 171748 -204096 -128880 276094 -149168 15279 -39485
18342 -144579 -447756 248262 -110547 7674 -119606 96535 -304439 -180671 55135 -236591
18331 -25273 -32738 -121669 8849 118943 -143727 -26261 -74484 56123 20886 -16353 -54265 13575
18318 122866 -169341 349207 -357914 -117350 5532 -61990 -260 -412037 44626 87999 -370542
18306 -199529 217364 -22571 202427 37829 42532 -239001 -109017 19381 -233242 133351
18295 -301823 81037 172003 74636 16677 -67280 66685 -125022 -201350 -199338 -224853 -159705
$$ packed form
18376a97744b2107j21987k5431H3627a52599d0953k22109a19171J9181m2591q954
18365a51535e4478k4818J1711m7359B1391J49359D151e00602D787a00297c1519
18353A02956a11071B8342a12874A71748b04096P5216B76094a49168A5279c9485
18342a44579l03177B48262a10547G674a19606I6535c04439J23768E5135b36591
18331b5273p465q8931H849J10094a43727b6261m8223E6123B0886a6353l7912A3575
18318A22866a69341C49207c57914a17350E532f1990b60m11777D4626M3373c70542
18306a99529B17364b2571B02427C7829M703b39001a09017A9381b33242A33351
18295c01823H1037R0966G4636A6677f7280F6685a25022p6328K012k5515O5148
$$ plain form
18284 -159705 -227583 38129 -86835 -13818 -98859 48960 82193 -135524 85883 345013 30459
18272 6172 38200 323150 -50819 -87356 384516 22475 705 -166511 376835 17085 41775
18261 41775 -152328 116879 32788 231699 523561 68784 -93740 -80332 -25829 307991 62968
18249 113983 -331364 -1827 -274925 11427 15308 -8374 -169045 -145742 -177226 175908 33039
18237 -227142 -9534 178499 -14072 7190 103852 45156 24563 -96361 91307 94744 -322239 -322435
18225 -322435 -24305 52563 -181604 23991 143466 -48062 -175399 271944 -137777 149873
18214 273651 102824 -306500 34625 -196652 238029 546831 78046 81971 -87254 -108778 -183510
18203 -183510 167248 -4078 -243707 179119 -221872 -335307 233973 -42230 128569 -121016
$$ packed form
18284a59705o7878C8129h6835a3818q5041D8960L3233a35524H5883K59130C0459
18272F172L2028K84950e0819l6537C84516B2475G05a66511C76835A7085K4690
18261D1775a52328A16879C2788J98911K91862F8784i3740J3408b5829C07991F2968
18249A13983c31364a827k73098A1427L881h374j60671K3303l1484A75908C3039
18237b27142i534A78499a4072G190R6662D5156k0593i6361I1307L437c22239j96
18225c22435b4305E2563a81604B3991J19475d8062j27337B71944a37777A49873
18214B73651A02824c06500C4625a96652B38029L08802G8046L925h7254k1524p4732
18203a83510A67248d078k39629A79119b21872j13435B33973d2230A28569a21016
$$ plain form
18192 -327453 74537 -123302 228284 -280848 5363 -109172 -131129 -317029 -100269 -62671
18182 -62671 -251081 -68558 -116480 9370 64749 133952 -194908 7185 216380 68957 321119
18171 321119 148578 216819 -71337 -156220 -258108 99510 99170 -45254 56894 -50797 196519
18159 -96439 265785 231037 180867 -52968 32368 -58221 70568 -43843 205632 51496 130942
18148 130942 -8158 63959 -5168 333143 246691 -207432 149029 198613 70033 149087 -77632
18136 -127179 -298929 -323273 -163611 -323417 -252701 -263218 -251964 -164945 166696 332319
18126 332319 -110806 77352 14644 156650 -244860 -151672 -12501 26215 62649 -37680 13350
18114 -216323 -126376 232220 179330 124916 78368 -73391 281575 -272802 -153697 -193569 -151502
$$ packed form
18192c27453G4537a23302B28284b80848E363a09172k1957j85900a00269L7598
18182f2671j88410f8558m7922I370N5379O9203a94908G185K09195F8957K52162
18171C21119A48578O8241g1337q4883j01888I9510l40d5254E6894e0797A96519
18159i6439B65785l4748n0170e2968C2368e8221G0568d3843B05632E1496P9446
18148A30942h158F3959e168C33143q6452b07432A49029M9584G0033P9054g7632
18136a27179j71750k4344J59662j59806P0716j0517J1254Q7019A66696J65623
18126C32319a10806G7352A4644J42006b44860R3188a2501B6215L6434c7680A3350
18114b16323Q9947B32220n2890n4414m6548g3391B81575b72802J19105l9872M2067
$$ plain form
18103 -151502 49599 -136378 -267749 -150834 -152968 -9876 172020 -7807 178021 -306891 -131631
18091 -49119 200777 166119 21682 -136328 255336 -122507 -112148 119379 55933 61026 -22556
18079 32752 -76085 75333 44042 126789 44422 -555 157709 61518 -273227 -39805 202839
18067 163481 -177378 160017 -238076 -172928 -33310 93752 15592 121634 143846 60423 151285
18056 151285 -289680 -217977 -108553 5643 -176810 -121655 122655 -55577 -53956 -39666 -14702
18044 30684 27152 88718 -93455 -126073 -168546 -305073 -185392 66644 81470 2183 91697 44486
18031 40286 44293 -102765 278061 83792 -33119 -158315 -155527 177440 92780 52544 66566
18020 66566 107950 -166984 -54829 335988 78545 46927 39940 80552 121007 94002 50952
$$ packed form
18103a51502D9599a36378j31371J16915k134i876A72020g807A78021c06891a31631
18091d9119B00777l4658B1682a36328B55336a22507J0359A19379E5933N093b2556
18079C2752g6085G5333l1291Q2747D4422e55A57709F1518b73227c9805B02839
18067A63481a77378A60017b38076O5148c3310I3752A5592J06042K2212F0423R0862
18056A51285b89680P1703a08553E643a76810N5155A22655e5577J621J4290a4702
18044C0684l532O1566i3455l2618m2473j36527J19681F6644J4826B183Q9514D4486
18031D0286M007a02765B78061H3792c3119j25196K788A77440q4660m0236J4022
18020F6566M1384a66984e4829C35988G8545l1618o987M0612M0455k7005m3050
$$ plain form
18009 50952 190806 184275 242596 -233314 226898 -157118 -131683 127390 -164129 -95586 200810
17997 -123836 -89582 -146522 113541 -129654 44010 -124897 207784 -63642 161783 405790
17987 405790 -46770 39005 202402 209746 -52810 -49469 -193776 -126063 -77258 153322 -469 133420
17974 37607 8594 -50475 93337 130804 -226165 60722 180916 41405 -221410 -283880 77356
17962 -201132 64738 313831 -231361 -63974 -401864 -22610 -231867 -102691 233136 -98840
17951 203227 153230 -51552 18071 -43279 60735 -30479 91918 -165255 -71318 244034 33723
17939 -23412 -97010 73112 233167 301432 -111773 236580 141335 322700 -171072 259388
17928 231855 60665 -358913 -108119 177271 -18270 105978 292315 -76878 11638 -85922
$$ packed form
18009E0952J39854o531N8321b33314B26898a57118K5435A27390a64129O8543B00810
17997a23836L4254n6940A13541a29654D4010a24897B07784f3642A61783K44007
17987D05790d6770C9005J63397P344e2810L341j44307O7713M8805A53322d69A33420
17974C7607H594e0475I3337L7467b26165F0722J20194D1405b21410o2470G7356
17962b01132F4738K49093b31361f3974l37890b2610k09257a02691B33136i8840
17951B03227m9997e1552A8071d3279F0735c0479I1918a65255g1318B44034C3723
17939b3412p3598G3112J60055O8265a11773B36580r5245J81365a71072B59388
17928B31855F0665c58913a08119A77271a8270A05978J86337g6878A1638h5922
$$ plain form
17917 40117 46248 -201869 112355 -249065 201408 -278677 499526 113770 338138 465632
17907 465632 -194296 47691 234042 -19379 95571 -162979 56427 -65184 187532 42057 98934
17896 98934 153110 27655 293468 334147 -92113 19006 173685 19490 -286216 69705 -152316
17884 -1397 -182315 136036 -8494 -187419 167775 242970 167801 157384 -163878 21781 31950
17873 31950 -101274 -39965 -50252 -165034 87251 -113685 95527 219259 -219615 -149 131500
17861 31116 -138805 251043 4439 178133 -124490 -55122 378793 88711 124630 -2249 141307
17849 -114370 60951 157457 216721 58634 213151 58506 -39755 -11846 262503 14738 287328
17838 287328 -168705 -87762 87822 93186 204237 -406365 325934 241834 -124547 31941 74906
$$ packed form
17917D0117O131b01869A12355b49065B01408b78677D99526A13770K24368J27494
17907D65632a94296D7691J86351a9379I5571a62979E6427f5184A87532D2057N6877
17896I8934N4176B7655K65813M0679i2113A9006J54679A9490b86216F9705a52316
17884a397j80918A36036h494j78925A67775P5195p5169j0417a63878B1781J0169
17873C1950a01274c9965j0287j14782H7251a13685I5527J23732b19615a49A31500
17861C1116a38805B51043D439J73694a24490e5122C78793H8711L5919b249A41307
17849a14370F0951R6506N9264E8634J54517E8506c9755a1846B62503A4738K72590
17838B87328a68705Q0943H7822N364J11051d06365C25934q4100a24547C1941M2965
$$ plain form
17827 74906 -389157 96076 -216303 151865 216992 230210 -260243 119841 169553 -103114
17816 218101 50740 332076 60164 -62391 -150780 184064 333483 40124 348826 13942 124286
17805 124286 -112712 -58060 25199 -147656 7460 -197055 -204420 216337 -68308 -263999 181489
17793 15371 -386010 295704 5944 225499 -88384 214895 368563 -93035 -153049 256183 -192730
17781 184942 -74929 -77601 124417 62691 389083 191485 -12237 -1256 359570 253588 143176
17770 143176 172511 213846 169992 -14442 42292 192935 -61791 43382 -151946 134203 207125
17759 207125 -46714 -106366 -39466 20342 -281157 -290804 108495 164478 230399 -35522 579227
17747 158686 10012 211266 216335 264709 9002 78201 -38477 -14361 104650 -186519 -196724
$$ packed form
17827G4906c89157I6076b16303A51865O5127J3218b60243A19841M9712a03114
17816B18101E0740K81336F0164f2391q8389A84064J49419D0124L08702A3942J10344
17805A24286a12712N4652B5199a47656G460a97055p365B16337f8308j95691A81489
17793A5371c86010B95704E944K19555h8384B14895J53668i3035o0014B56183a92730
17781A84942g4929k672A24417o1726L26392A91485a2237a256C59570j05982j10412
17770A43176K9335M1335m3854a4442D2292J50643f1791D3382a51946A34203P2922
17759B07125d6714n9652c9466B0342b81157r647A08495N5983O5921c5522E79227
17747A58686A0012K01254N069M8374I002O9199c8477a4361A04650a86519j0205
$$ plain form
17736 -196724 -82457 63258 -208029 104288 -49405 111083 156358 123807 -152830 70581 158732
17725 158732 262354 196241 198433 281836 124647 123709 -1761 -92948 -118592 24587 44142 -196231
17712 225344 147170 60627 66811 449643 474433 -214017 77009 29409 187793 375977 73331
17700 -1753 -225585 143349 140324 -221491 38305 162519 54842 16943 -225780 4349 -79003
17688 168469 110642 301086 -167089 18665 -3112 48323 204852 89073 148558 -15195 28466
17676 -223056 417976 244820 62066 151720 333594 81658 -93104 363221 188818 109842
17666 109842 -8678 -200670 327941 2980 -16124 120217 -36548 286188 131991 211288 -270367
17654 81419 28653 65956 288793 -272554 135711 23521 285232 17677 -223956 163064
$$ packed form
17736a96724h2457F3258b08029A04288d9405A11083M5275l2551a52830G0581Q8151
17725A58732J03622o6113K192Q3403A24647r38a761r1187k5644B4587J9555a96231
17712B25344p8174F0627O184L82832K4790b14017G7009B9409J58384J88184G3331
17700a753k23832A43349l025b21491C8305J24214E4842A6943b25780D349g9003
17688A68469n7827J90444a67089A8665c112D8323J56529H9073N9485a5195B8466
17676b23056D17976j73156F2066Q9654J81874H1658i3104C63221j74403p8976
17666A09842h678j91992C27941B980a6124A20217c6548B86188A31991P9297b70367
17654H1419B8653L7303K22837b72554A35711B3521K61711A7677b23956A63064
$$ plain form
17643 119218 -3349 136665 -240562 93788 227535 114658 1684 184910 84742 -88310 51100
17631 138106 -174822 58416 307353 -106598 -180202 272207 -29130 28546 -34528 476983
17620 21787 96838 -51358 335712 176235 37128 106140 239581 368991 388951 257882 168095
17609 168095 52286 226627 123043 250938 195801 -38472 149612 100670 59921 -38405 415408
17597 83765 229249 -5797 -100316 -60046 -158064 271653 306750 112358 -107196 -173668 -230968
17586 -230968 141459 633600 303416 227768 432793 361630 -54098 -76185 120501 181252
17576 181252 270493 344684 304892 16124 41866 140675 65350 249327 83805 -175843 425179
17564 58721 191704 231066 467344 145616 280563 274333 62669 -219691 263451 161099
$$ packed form
17643A19218c349A36665b40562I3788J33747j12877A684J83226H4742h8310E1100
17631A38106a74822E8416K48937a06598p3604B72207b9130B8546c4528D76983
17620B1787P5051e1358C35712j59477C7128O9012J33441J29410J9960j31069q9787
17609A68095E2286J74341j03584J27895n5137c8472A49612m8942m0749c8405D15408
17597H3765J45484e797r4519M0270r8018B71653L5097A12358a07196o6472n7300
17586b30968A41459M92141C03416p5648K05025p1163e4098k2087A20501O0751
17576A81252Q9241P4191l9792A6124K5742R8809F5350J83977H3805a75843D25179
17564E8721J32983L9362K36278A45616J34947o230F2669b19691B63451j02352
$$ plain form
17554 161099 262456 221444 119301 350053 247832 154891 254397 266890 539343 196063
17543 347316 394844 297737 448178 258938 249917 236980 450733 -41788 654355 180601 324403
17532 324403 267760 126815 241745 615174 382655 692390 1156597 1271235 1286735 655662
17522 655662 1366116 516463 572673 483621 703454 652894 154687 450265 404591 603831
17512 603831 1093365 1005464 1390054 1406828 971114 870986 776399 423808 237075 628418
17502 628418 552489 614195 87936 207576 540774 328324 517607 276209 85902 348565
17492 348565 207856 229688 -80282 126398 408630 299103 115112 250636 257848 -186341
17481 355593 470928 -69889 584519 499491 568349 88089 224120 420758 203132 589566
$$ packed form
17554A61099J01357m1012j02143K30752j02221r2941R9506J2493K72453A96063
17543C47316M7528r7107J50441j89240r021j2937K13753d1788F54355A80601J43802
17532C24403n6643A26815J14930L73429k32519L09735M64207J14638J5500o31073
17522F55662P10454E16463N6210q9052K19833n0560A54687K95578m5674J99240
17512F03831M89534q7901L84590J6774m35714j00128r4587l52591j86733L91343
17502F28418p5929O1706H7936J19640L33198k12450J89283k41398H5902K62663
17492C48565j40709K1832h0282A26398K82232j09527A15112J35524P212a86341
17481C55593J15335f9889E84519q5028O8858H8089J36031J96638B03132L86434
$$ plain form
17471 589566 94727 263483 166926 105783 265079 -49260 381531 129619 164889 338676
17461 338676 56046 171691 504391 285123 392987 218198 92204 289798 8479 238056
17451 238056 32065 305720 442087 170641 276600 366333 219161 -160158 270964 717277
17441 717277 550276 60661 380915 233800 579242 207574 512958 727528 196409 533623
17431 533623 168019 156070 -147437 448687 202981 292148 201404 401844 213812 309815
17421 309815 293710 226741 225616 660428 358458 278127 428590 212983 348364 232407
17411 232407 116359 515751 233262 88233 192197 476065 673047 178262 610078 344726
17401 344726 142374 228715 460266 627996 374676 444170 436508 598412 433341 36073
$$ packed form
17471E89566I4727J68756r6557o1143J59296d9260C81531A29619L5270J73787
17461C38676E6046J15645L32700k19268J07864j74789I2204J97594H479K29577
17451B38056C2065K73655J36367A70641J05959Q9733j47172a60158B70964M46313
17441G17277j67001F0661L20254j47115L45442B07574L05384K14570A96409L37214
17431E33623A68019j1949a47437D48687B02981Q9167r0744K00440j88032R6003
17421C09815j6105o6969j125M34812l01970q0331J50463B12983J35381j15957
17411B32407j16048L99392B33262H8233J03964K83868J96982A78262M31816k65352
17401C44726A42374Q6341K31551J67730k53320O9494p662J61904j65071C6073
$$ plain form
17390 329405 -130420 -23399 148812 344787 111813 199488 288755 325605 179918 201503
17380 201503 221603 135826 491594 368051 226718 24305 83311 162263 178626 97298 484598
17369 484598 512741 135115 195642 346621 187806 363308 -41185 21536 263537 254145 289385
17358 289385 164803 267129 231909 316648 489012 -1301 409157 304991 468231 297146
17348 297146 144622 99246 73566 473233 118326 226569 432290 229069 468970 413254
17338 413254 159375 53912 398214 577233 64654 319892 42396 306388 667834 70921
17327 183952 268236 301425 442490 177012 268261 132272 301037 390780 162104 323265
17317 323265 177144 453835 243333 453333 -163 166635 316148 356995 -1962 78588 214973
$$ packed form
17390C29405a30420b3399A48812J95975A11813Q7675Q9267L6850j45687K1585
17380B01503K0100q5777L55768j23543j41333B4305N9006P8952J6363q1328L87300
17369D84598K8143A35115O0527J50979j58815J75502d1185B1536K42001r392L5240
17358B89385j24582J02326l5220Q4739J72364a301D09157j04166J63240j71085
17348B97146A44622m5376k5680L99667A18326J08243K05721k03221K39901n5716
17338D13254A59375E3912L44302J79019F4654K55238D2396K63992L61446G0921
17327A83952Q4284L3189J41065A77012R1249A32272J68765Q9743A62104J61161
17317C23265j46121K76691k10502K10000a63A66635J49513M0847a962G8588J36385
$$ plain form
17306 214973 361749 178522 104780 87107 490462 297804 222566 297495 453381 190540
17295 458914 372594 107678 179920 183465 459815 182971 510261 178303 364978 411775
17285 411775 87994 339753 535946 240410 285754 301263 182925 431122 603220 280230
17274 305236 292373 239344 391651 554851 232398 387945 625215 333821 505576 623824
17264 623824 307716 643850 307161 416942 365483 624485 455238 504452 528257 653398
17254 653398 521362 119967 449172 208464 579701 225907 428699 366653 695509 490865
17244 490865 120781 499983 327106 284406 331361 192371 611202 93814 331870 512943
17234 512943 440659 709433 498870 467752 296092 234993 280720 663529 481287 240963
$$ packed form
17306B14973J46776A78522p3742j7673M03355j92658p5238P4929J55886A90540
17295D58914q6320A07678P2242L545K76350A82971L27290A78303J86675M6797
17285D11775H7994K51759J96193B40410M5344J5509j18338K48197J72098B80230
17274C05236j2863n3029J52307J63200B32398J55547K37270k91394J71755J18248
17264F23824C07716L36134C07161J09781n1459K59002j69247M9214K3805J25141
17254F53398j32036A19967L29205B08464L71237B25907K02792o2046L28856k04644
17244D90865A20781L79202j72877m2700M6955j38990M18831I3814K38056J81073
17234E12943p2284K68774k10563l1118j71660o1099M5727L82809j82242k40324
$$ plain form
17224 240963 459342 297600 561269 355126 529600 471716 540647 618838 467538 475364
17214 475364 665716 602901 238749 799424 -81599 377023 540007 562696 165908 374762
17204 374762 733006 409519 741334 834307 504572 609137 235577 168799 329494 527925
17194 527925 502636 570349 374717 534297 487497 164260 233635 402128 584942 413632
17184 413632 620769 567932 450202 627030 373380 461045 431852 580194 398263 712838
17174 712838 603398 497974 581726 581667 512706 854979 652051 590243 561029 537582 362931
17163 362931 333140 590464 704889 754819 500236 674586 479572 642426 720679 634809
17153 634809 454957 487553 896808 505680 447140 620289 724703 478096 753024 385620
$$ packed form
17224B40963K18379j61742K63669k06143J74474n7884O8931P8191j51300P826
17214D75364J90352o2815B38749N60675h1599C77023J62984K2689A65908K08854
17204C74762L58244l23487L31815R2973l29735J04565B35577o6778J60695J98431
17194E27925k5289O7713j95632J59580m6800A64260O9375J68493J82814j71310
17184D13632K07137n2837j17730J76828k53650Q7665k9193J48342j81931L14575
17174G12838j09440j05424Q3752n9o8961L42273k02928o1808k9214k3447j74651
17163C62931k9791K57324J14425M9930k54583J74350j95014J62854P8253q5870
17153F34809j79852L2596M09255l91128n8540J73149J04414k46607K74928l67404
$$ plain form
17143 385620 328933 546594 630461 704381 462990 505751 543401 714243 510502 519075 544171
17132 544171 730892 592303 677812 549331 888680 523005 868458 769467 689324 411284
17122 411284 696266 799493 645562 536899 885158 507628 535861 694836 601881 388545
17112 388545 862559 585325 765585 650032 678034 565523 1010684 645422 645472 804777
17102 804777 913099 585176 989858 673124 480226 491774 864043 633675 731236 501571
17092 501571 658784 705091 710205 436815 627760 744336 936952 380772 873066 558507
17082 558507 678360 733888 700072 818022 751831 772371 791162 498423 699546 1041774
17072 1041774 789713 1196028 867654 787486 998105 848660 1018012 972561 840952 768306
$$ packed form
17143C85620n6687K17661Q3867P3920k41391M2761L7650J70842k03741Q573K5096
17132E44171J86721j38589Q5509j28481L39349l65675L45453r8991q0143k78040
17122D11284K84982J03227j53931j08663L48259l77530K8233J58975r2955k13336
17112C88545M74014k77234J80260j15553K8002j12511M45161l65262N0J59305
17102H04777J08322l27923M04682l16734j92898J1548L72269k30368R7561k29665
17092E01571J57213M6307N114k73390J90945J16576J92616C80772M92294l14559
17082E58507J19853N5528l3816J17950o6191K0540J8791k92739K01123L42228
17072A041774k52061M06315l28374q0168K10619j49445J69352m5451j31609p2646
$$ plain form
17062 768306 646886 600542 897656 707356 975218 1291361 823644 928420 849559 909084
17052 909084 1013518 916607 826541 1017142 1007489 1038791 1047496 899063 1131254 1175768 1379418
17041 1379418 842600 1181231 1058073 913596 1011048 1172589 945874 961256 1122110 1118756
17031 1118756 1488230 993539 1186711 1169317 819786 998254 1189611 1107462 925935 1229835
17021 1229835 861588 1376299 1086751 1371948 1191891 1353284 1189892 1458851 1219767
17012 1219767 1186654 1416282 1125905 1142683 1454455 1128075 1398490 1643316 1387287 1389323
17002 1389323 1173067 991675 1374835 1392780 1338780 1434790 1302100 1406989 1634669 1576570
16992 1576570 1425190 1641486 1901009 1340301 1802890 1141764 1283281 1540178 1494666 1630754
$$ packed form
17062G68306j21420m6344K97114j90300K67862L16143m67717J04776p8861N9525
17052I09084J04434r6911r0066J90601r653L1302Q705j48433K32191M4514K03650
17041A379418n36818L38631j23158j44477R7452J61541k26715J5382J60854l354
17031A118756L69474m94691J93172j7394l49531J78468J91357q2149j81527L03900
17021A229835l68247N14711k89548K85197j80057J61393j63392K68959k39084
17012A219767l3113K29628k90377J6778L11772l26380K70415K44826k56029K036
17002A389323k16256j81392L83160J7945n4000R6010j32690J04889K27680n8099
16992A576570j51380K16296K59523n60708M62589o61126J41517K56897m5512J36088
$$ plain form
16982 1630754 1403530 1706727 1789868 1576159 1451312 1483822 1505375 1774408 1637534 1798787
16972 1798787 1967953 1586538 1414007 1889171 2012905 1787158 1954469 2121413 1636906
16963 1636906 1834715 2337005 2004627 2015933 1867389 1814488 1731120 2062330 2080576 2058358
16953 2058358 2116112 1891594 1693503 2418724 1792150 2194282 1912765 1899841 2336749 2010454
16943 2010454 2083893 2012885 2052825 1978619 1974740 2432760 2075703 2213249 2500452 2301757
16933 2301757 2238241 2336996 2721647 2394204 2882618 2705905 2581907 2325939 2721923 2890692
16923 2890692 2353074 2779816 2659601 2439029 2877161 2684419 2702570 3111933 2958619 2916778
16913 2916778 2614321 2751347 3113312 2794068 3377112 2934268 3096186 3197777 3051662
$$ packed form
16982A630754k27224L03197Q3141k13709j24847L2510K1553K69033j36874J61253
16972A798787J69166l81415j72531M75164J23734k25747J67311J66944m84507
16963A636906J97809N02290l32378J1306j48544n2901q3368L31210J8246k2218
16953B058358N7754k24518j98091P25221o26574M02132k81517j2924M36908l26295
16943B010454P3439p1008L9940p4206l879M58020l57057J37546K87203j98695
16933B301757o3516R8755L84651l27443M88414j76713j23998k55968L95984J68769
16923B890692n37618M26742j20215k20572M38132j92742J8151M09363j53314m1841
16913B916778l02457J37026L61965l19244N83044m42844J61918J01591j46115
$$ plain form
16904 3051662 3436126 2939563 2951235 3214449 3240354 3291852 3309927 3275253 3101968 3542088
16894 3542088 3506196 3320453 3309178 3579955 3527346 3428868 3830639 3765794 3860438 3953257 3810143
16883 3810143 4073872 3859082 3934434 4072287 4251978 4127645 4206822 3858205 4313830 4509623
16873 4509623 4313976 4547570 4453771 4523036 4634660 4614403 4775025 5023469 4734826 4766853
16863 4766853 5162026 5130742 4998699 5334055 5104491 5654704 5317415 5427022 5639854 5547860
16853 5547860 5992900 5711884 6029253 5859171 6231037 5936478 6481025 6393629 6910777 6741350
16843 6741350 6578617 6657460 7337859 6847565 7252468 7232903 7389654 7451396 7695351 7629727
16833 7629727 7712897 8336930 8174304 8418417 8646196 8867503 8953958 9052656 8888185 9147085
$$ packed form
16904C051662L84464m96563J1672K63214K5905N1498J8075l4674j73285M40120
16894C542088l5892j85743j1275K70777n2609r8478M01771o4845R4644R2819j43114
16883C810143K63729k14790P5352J37853J79691j24333P9177l48617M55625J95793
16873D509623j95647K33594r3799O9265J11624k0257J60622K48444k88643L2027
16863D766853L95173l1284j32043L35356k29564N50213l37289J09607K12832r1994
16853E547860M45040k81016L17369j70082L71866k94559N44547q7396N17148j69427
16843F741350j62733P8843O80399m90294M04903j9565J56751O1742K43955o5624
16833G629727Q3170O24033j62626K44113K27779K21307Q6455R8698j64471K58900
$$ plain form
16823 9147085 9510726 9966570 10177760 10043408 10293658 10209965 10644022 11006837 10750047 11184753
16813 11184753 11523170 11348708 11718941 12140843 12217137 12519814 12939840 13626595 13690244 13757511
16803 13757511 14120293 14142074 14787248 15122169 15437876 15821961 16094083 16766342 16766123 17110928
16793 17110928 17500943 17759432 18517447 19312313 19823065 19944770 20773205 20678699 21459205
16784 21459205 21955803 22544857 23207163 23828033 24307973 25231417 25761517 26960773 27114592
16775 27114592 27935041 28614532 29603281 30479719 31545752 32093586 33450477 34169316 35540124
16766 35540124 36547579 37652215 39014044 40123391 41373292 43251918 44358154 45557300
16758 45557300 47180207 48730269 49890401 51820828 53473254 55044566 57157020 59046893
$$ packed form
16823I147085L63641M55844K11190j34352K50250q3693M34057L62815k56790M34706
16813A1184753L38417j74462L70233M21902P6294L02677M20026O86755O3649O7267
16803A3757511L62782K1781O45174L34921L15707L84085K72122O72259k19L44805
16793A7110928L90015K58489P58015P94866N10752J21705Q28435r4506P80506
16784B1459205M96598N89054O62306O20870M79940R23444N30100J199256J53819
16775B7114592Q20449O79491R88749Q76438J066033N47834J356891P18839J370808
16766C5540124J007455J104636J361829J109347J249901J878626J106236J199146
16758D5557300J622907J550062J160132J930427J652426J571312K112454J889873
$$ plain form
16750 59046893 61047180 62766752 64719283 67178020 69458436 71525332 74171871 76214110
16742 76214110 78657602 80749510 83283948 85709317 87952033 90195379 92619834 94920847
16734 94920847 96986299 99043587 101205027 103026859 104667613 106436949 108153853 108684694
16726 108684694 109758700 110498387 111192974 111574773 111443753 111565480 111249477 110422232 109641893
16717 109641893 108459297 107077969 105824332 104155221 102337762 100349491 98130536 95837555
16709 95837555 93788035 91450580 89119817 86900992 84397665 82081468 79372762 77145795
16701 77145795 74453291 72272401 70195975 67795549 65781454 63555848 61576883 59721494
16693 59721494 57740937 55559725 53828826 52200605 50474472 48618118 47325464 45689735
$$ packed form
16750E9046893K000287J719572J952531K458737K280416K066896K646539K042239
16742G6214110K443492K091908K534438K425369K242716K243346K424455K301013
16734I4920847K065452K057288K161440J821832J640754J769336J716904N30841
16726A08684694J074006P39687O94587L81799j31020J21727l16003q27245p80339
16717A09641893j182596j381328j253637j669111j817459j988271k218955k292981
16709I5837555k049520k337455k330763k218825k503327k316197k708706k226967
16701G7145795k692504k180890k076426k400426k014095k225606j978965j855389
16693E9721494j980557k181212j730899j628221j726133j856354j292654j635729
$$ plain form
16685 45689735 43960301 43027342 41338130 39878761 38611862 37670220 36468261 34914117
16677 34914117 33948140 33257151 32012569 31112516 30273589 29314014 28524008 27695547 26934904
16668 26934904 25815057 25398708 24859729 23688845 23569779 22506344 22159460 21236180 21014972
16659 21014972 20325908 20352217 19327377 18990868 18230747 18291269 17211097 17330281 16909613
16650 16909613 16109243 15716212 15201800 15074830 14879212 14672331 14163062 13780254 13644943
16641 13644943 13387868 12957829 12828776 12345736 12003484 11752199 11628433 11540725 11236450
16632 11236450 10604968 10832547 10575093 10309269 9967032 9875554 9706602 9869457 9243588
16623 9243588 8996038 8891531 8572295 8611312 8288201 8269643 8157562 7782593 7951454 7719007
$$ packed form
16685D5689735j729434r32959j689212j459369j266899r41642j201959j554144
16677C4914117r65977o90989j244582r00053q38927r59575p90006q28461p60643
16668B6934904j119847m16349n38979j170884j19066j063435l46884r23280k21208
16659B1014972o89064K6309j024840l36509p60121O0522j080172J19184m20668
16650A6909613q00370l93031n14412j26970j95618k06881n09269l82808j35311
16641A3644943k57075m30039j29053m83040l42252k51285j23766q7708l04275
16632A1236450o31482K27579k57454k65824l42237r1478j68952J62855o25869
16623I243588k47550j04507l19236L9017l23111j8558j12081l74969J68861k32447
$$ plain form
16613 7719007 7611521 7331796 7392923 7132809 7312742 7049131 6443297 6623288 6708455 6766810
16603 6766810 6349081 6301322 6284697 6027904 5936109 5684621 5916854 5687794 5819684 5750087
16593 5750087 5405594 5133574 5007576 5591517 4946874 4925586 5247054 4758291 4666670 4881766
16583 4881766 5017727 4818090 4664091 4933422 4675153 4237565 4611838 4419811 4297686
16574 4297686 4381502 4265173 3946966 4472493 3981303 3807910 4028538 3967855 3818599 3976795
16564 3976795 3357305 3644454 3750249 3834528 3190283 3437589 3697131 3320450 3466279 3386484
16554 3386484 3383474 3467126 3221983 3248661 3009954 3015941 3325530 3035412 2873937 2920342 3111460
16543 3111460 2674924 2891370 2664164 3025295 3194316 2624019 2764234 2911665 2524393
$$ packed form
16613G719007j07486k79725O1127k60114J79933k63611o05834J79991Q5167N8355
16603F766810m17729m7759j6625k56793r1795k51488K32233k29060J31890o9597
16593E750087l44493k72020j25998N83941o44643k1288L21468m88763r1621K15096
16583D881766J35961j99637j53999K69331k58269m37588L74273j92027j22125
16574D297686Q3816j16329l18207N25527m91190j73393K20628o0683j49256J58196
16564C976795o19490K87149J05795Q4279o44245K47306K59542l76681J45829p9795
16554C386484l010Q3652k45143K6678k38707N987L09589k90118j61475M6405J91118
16543C111460m36536K16446k27206L61131J69021n70297J40215J47431l87272
$$ plain form
16534 2524393 2602568 2649525 2707959 2291216 2497534 2557934 2333439 2340811 2581039 1941216
16524 1941216 2501746 2267080 2636376 2434435 2437219 2426153 2332735 2323347 1828929 2113371
16514 2113371 2145873 1725516 2367568 2066866 2069554 2024030 2060982 1824046 1898820 2086058
16504 2086058 1762491 1535804 1857394 1903026 2058706 1716401 1944763 1798703 1824461 1828718
16494 1828718 1623790 1590995 1773578 2003856 1555785 1696633 1747762 1799404 1735899 1897422
16484 1897422 1471571 1253517 1686398 1660488 1550545 1572745 1434418 1317678 1407423 1381944
16474 1381944 1490738 1620384 1283291 1588239 1466846 1370506 1405800 1584820 1496714 1326825
16464 1326825 1432599 1279907 1333499 1286511 1450064 1295699 1281058 1301059 1358117 1461804
$$ packed form
16534B524393P8175M6957N8434m16743K06318O0400k24495P372K40228o39823
16524A941216N60530k34666L69296k01941K784j1066r3418r388m94418K84442
16514B113371L2502m20357O42052l00702K688m5524L6952k36936P4774J87238
16504B086058l23567k26687L21590M5632J55680l42305K28362j46060K5758M257
16494A828718k04928l2795J82583K30278m48071J40848N1129N1642o3505J61523
16484A897422m25851k18054M32881k5910j09943K2200j38327j16740Q9745k5479
16474A381944J08794J29646l37093L04948j21393r6340L5294J79020q8106j69889
16464A326825J05774j52692N3592m6988J63553j54365j4641K0001N7058J03687
$$ plain form
16454 1461804 1150567 1510053 1620518 945686 1114694 1239693 1437138 1385633 1017194 1184604
16444 1184604 1043646 1174235 1420693 1056567 1268677 1104428 1439766 1025142 1102719 1293304
16434 1293304 1104143 1311599 1146205 978288 1073191 1016054 1042582 877299 1002706 767707
16424 767707 698821 986374 1099572 1021836 1120213 895928 872687 992361 953240 794764
16414 794764 894206 686614 925659 1096142 876952 414445 589538 855433 773578 751020
16404 751020 851613 1033689 767584 823694 714232 752429 540691 846237 641424 1156427
16394 1156427 900769 985503 644742 995385 483153 996340 1060068 922992 501069 380997
16384 380997 1030637 825221 599423 736144 637975 748880 725329 962836 735667 781287
$$ packed form
16454A461804l11237L59486J10465o74832J69008J24999J97445n1505l68439J67410
16444A184604j40958J30589K46458l64126K12110j64249L35338m14624P7577J90585
16434A293304j89161K07456j65394j67917R4903n7137K6528j65283J25407k34999
16424G67707o8886K87553J13198p7736R8377k24285k3241J19674l9121j58476
16414G94764R9442k07592K39045J70483k19190D14445J75093K65895q1855k2558
16404G51020J00593J82076k66105N6110j09462L8197k11738L05546k04813N15003
16394A156427k55658Q4734l40761L50643D83153N13187O3728j37076m21923j20072
16384C80997O49640k05416k25798J36721r8169J10905k3551K37507k27169M5620
$$ plain form
16374 781287 428743 680468 900967 932503 680889 773634 649301 718412 808962 726565
16364 726565 616739 686340 690226 785101 778534 509639 795118 468747 436455 462402 987202
16353 987202 462937 421108 325517 603962 553111 635948 834638 793141 407559 584266
16343 584266 682946 450771 699308 691824 637414 232897 609631 507732 676585 595438
16333 595438 416061 354793 320117 462082 727571 394892 412559 447613 514190 404319
16323 404319 534516 697188 321283 423886 509534 192382 362672 676574 368651 592419
16313 592419 799210 500257 470042 409940 597369 745861 517844 462221 466313 363823
16303 363823 380234 436276 291991 653597 504349 349176 577082 638938 295285 573865
$$ packed form
16374G81287l52544K51725K20499L1536k51614R2745j24333O9111R0550q2397
16364G26565j09826O9601L886R4875o567k68895K85479l26371l2292K5947N24800
16353I87202D62937m1829r5591K78445n0851Q2837J98690m1497l85582J76707
16343E84266R8680k32175K48537p484n4410B32897L76734j01899J68853q1147
16333E95438j79377o1268l4676J41965K65489l32679J7667L5054O6577j09871
16323D04319J30197J62672C21283J02603Q5648A92382J70290L13902l07923K23768
16313E92419K06791k98953l0215o0102J87429J48492k28017n5623M092j02490
16303C63823J6411N6042j44285L61606j49248j55173K27906O1856B95285K78580
$$ plain form
16293 573865 22396 388545 366804 107057 389938 615279 376347 461467 354008 444518
16283 444518 460187 542128 226203 636937 283115 489798 740645 517889 766401 387163
16273 387163 460352 423136 68373 56741 513280 68215 391726 228169 297686 184436 257308
16262 257308 337854 485370 353771 223017 259716 483466 327316 438681 305449 24440
16251 188875 265447 198251 149100 328449 395359 114527 569241 377668 280837 587164
16241 587164 256742 285782 591129 111442 267643 75208 400248 381317 168724 287699
16231 287699 369567 354035 68025 218096 392042 358784 263122 106892 425323 -207469
16220 313623 580685 253833 318044 50801 166512 401187 80772 170886 239710 95921 133025
$$ packed form
16293E73865B2396L66149k1741A07057K82881K25341k38932Q5120j07459R0510
16283D44518J5669Q1941B26203M10734B83115K06683K50847k22756K48512l79238
16273C87163P3189l7216F8373j1632M56539F8215L23511j63557O9517j13250P2872
16262B57308Q0546J47516j31599j30754L6699K23750j56150J11365j33232B4440
16251A88875P6572o7196m9151J79349O6910A14527M54714j91573r6831L06327
16241E87164B56742K9040L05347A11442J56201G5208L25040j8931A68724J18975
16231B87699Q1868j5532F8025J50071J73946l3258r5662A06892L18431b07469
16220C13623K67062B53833O4211E0801J15711K34675H0772R0114O8824I5921L7104
$$ plain form
16209 133025 401083 424625 524418 176441 52359 411998 277308 -146868 68597 297809
16199 297809 182354 549293 385771 -80773 190325 273020 -164559 128465 -46890 67762
16188 350387 237487 -68825 208508 421926 483512 31794 327055 17367 308671 -139322
16177 45689 300855 126404 91072 225504 319615 -168208 168166 363590 -7102 -151879
16167 -151879 132298 189017 72301 173715 -57776 320071 262434 169000 203170 -85816 240739
16155 13444 253283 279915 278782 265553 247964 190287 209963 87844 179894 324910 57760
16143 -200394 243891 297076 80002 115278 215757 427394 377294 404075 15047 307554 371229
16132 371229 224984 282367 228799 24956 366486 243628 -196111 81242 284950 103267
$$ packed form
16209A33025K68058K3542R9793A76441E2359L59639j34690a46868F8597K29212
16199B97809j15455L66939j63522h0773A90325Q2695a64559A28465d6890F7762
16188C50387j12900f8825B08508K13418O1586C1794K95261A7367K91304a39322
16177D5689K55166A26404l5332J34432R4111a68208A68166J95424g102j44777
16167a51879A32298N6719G2301J01414e7776C20071n7637r3434L4170h5816B40739
16155A3444K39839K6632j133j3229j7589n7677J9676H7844R2050J45016E7760
16143b00394B43891N3185H0002L5276J00479K11637n0100K6781A5047K92507O3675
16132C71229j46245N7383n3568B4956L41530j22858a96111H1242K03708A03267
$$ plain form
16121 238939 49656 -177278 -41836 366740 550760 92036 -186141 379537 60100 317196
16111 317196 -13425 65213 261067 115061 212490 177045 332884 345505 53106 49940 203278
16100 203278 100469 296425 229381 267156 153976 -61456 -73325 -160694 333647 -83939 184199
16088 147294 91893 149675 143678 -247507 291977 -74760 -39199 452434 95216 -179660 -131549
16077 -131549 14363 303553 98141 202743 -80555 -272031 285282 50762 -93139 410658
16066 -174078 401304 29604 213965 41229 111181 -279994 -207210 8276 -35123 461506 173517
16054 50631 170984 230394 -14221 193288 176505 -45148 160457 44972 -277847 42578 51367
16043 51367 -240594 222681 481938 -8755 -49574 49189 -96441 421566 196439 289323 20741
$$ packed form
16121B38939D9656a77278d1836C66740J84020I2036a86141C79537F0100K57096
16111C17196a3425F5213J95854A15061R7429l5445J55839J2621E3106l166J53338
16100B03278A00469J95956o7044L7775j13180f1456j1869q7369C33647h3939A84199
16088A47294n5401N7782n997b47507B91977g4760L5561D52434I5216a79660M8111
16077a31549A4363K89190I8141J04602h0555j91476B85282E0762i3139D10658
16066a74078D01304B9604J84361D1229O9952b79994P2784H276c5123D61506A73517
16054E0631J20353N9410a4221A93288j6783d5148A60457D4972b77847D2578Q789
16043E1367b40594B22681K59257h755m0819D9189i6441D21566A96439R2884B0741
$$ plain form
16031 -110391 27218 -84147 -147943 -181604 157543 138288 35143 -122217 -29150 54959 -199945
16019 17437 109875 -271114 364563 -5997 207347 -103308 -196473 -16030 156646 -23764 214090
16007 -356199 385199 -173720 -44298 161387 384410 52672 338887 207411 -96915 18631
15996 -366971 208500 24952 163901 138243 -41924 96442 555863 236835 481725 624013
15986 624013 727002 1416162 1153337 1560813 963513 761505 433094 246803 312945 -278342
15975 220533 -90127 -137045 -106273 246168 -175729 273366 -87225 -22795 -74184 -212180 -21984
15963 -279844 12772 -256140 60711 257959 -495268 184557 139380 136811 90334 250234 -102061
15951 -63315 109577 3580 -133702 122395 -220540 -144733 -167830 -38788 69822 -162960 108085
$$ packed form
16031a10391B7218h4147o3796l3661A57543j9255C5143a22217b9150E4959a99945
16019A7437R2438b71114C64563e997B07347a03308r3165a6030A56646b3764B14090
16007c56199C85199a73720d4298A61387K23023E2672K86215j31476i6915A8631
15996c66971B08500B4952J38949k5658d1924I6442M59421B36835K44890J42288
15986F24013J02989O89160k62825M07476n97300k02008l28411j86291O6142b78342
15975B20533i0127m6918L0772B46168a75729B73366h7225b2795n1389j37996b1984
15963b79844A2772b56140F0711J97248d95268A84557m5177k569m6477J59900a02061
15951f3315A09577C580a33702A22395b20540P5807k3097c8788F9822a62960A08085
$$ plain form
15939 -151365 -166586 162395 20107 -189135 131654 -60970 -191672 -7535 31204 115261 38811
15927 -551045 -10596 78200 28257 135044 294491 126097 -14396 22116 109757 1935 -79584
15915 256240 103437 36821 -48640 -120367 -178025 215945 -337029 -188963 -18754 -104792 161679
15903 350261 -410579 -234369 -38803 219079 -167902 20783 -46491 201245 148122 140349 18532
15891 20850 -337647 17104 19207 123094 116466 -413353 399155 -94172 -178102 144746 -27316
15879 229754 -258310 -238362 214151 -166921 3091 111925 27934 -8332 410585 72136 -156157
15867 -71446 -411023 217585 -212965 218101 133817 41382 147056 -227660 178356 144370
15857 144370 -60462 -54751 257235 -241638 139765 -26496 50348 47290 -19086 11418 90667
$$ packed form
15939a51365j5221A62395B0107a89135A31654f0970j30702g535C1204Q4057C8811
15927e51045a0596G8200B8257J06787J59447A26097a4396B2116Q7641A935g9584
15915B56240A03437C6821d8640p1727n7658B15945c37029J48066a8754q6038A61679
15903C50261d10579J76210c8803B19079a67902B0783d6491B01245n3123p773A8532
15891B0850c37647A7104K103J03887o628d13353C99155i4172q3930A44746b7316
15879B29754b58310J9948B14151a66921C091J08834B7934h332D10585G2136a56157
15867g1446l39577B17585b12965B18101q4284D1382J05674b27660A78356l3986
15857A44370f0462N711B57235b41638A39765b6496E0348l058a9086A1418P9249
$$ plain form
15846 90667 -19314 87123 -258898 756 -20564 250697 77179 247011 488180 -235095 12874
15834 -4110 -48978 194531 -29273 -329207 192083 -216703 -91949 -207467 33317 -65665 93908
15822 18572 -106979 68014 -2417 194068 -166278 -368461 319639 -167588 -325979 -59099
15811 34195 16545 109695 -72892 -130842 28764 -242041 280839 96264 227398 -136321 -59233
15799 400294 45150 -281856 39053 -58701 -126697 -32139 93617 -300409 83279 -376559 123485
15787 76102 231419 334866 -197153 276745 -133329 -279919 320407 73600 37808 -150198
15776 -183225 77676 6326 -54268 200181 271103 54800 -257068 198838 73890 373245 -60357
15764 -261934 338132 -85631 232920 -81294 76906 74939 -91356 95486 384578 388719 124554
$$ packed form
15846I0667a9314H7123b58898G56b0564B50697G7179J69832K41169b35095A2874
15834d110m4868A94531b9273k99934A92083b16703i1949j15518C3317f5665I3908
15822A8572a06979F8014b417A94068a66278k02183C19639a67588j58391e9099
15811C4195A6545R3150g2892n7950B8764b42041B80839I6264J31134a36321e9233
15799D00294D5150b81856C9053e8701o7996c2139I3617c00409H3279c76559A23485
15787G6102J55317J03447a97153B76745a33329j46590C20407G3600l5792a50198
15776a83225G7676F326e4268B00181P0922E4800b57068A98838G3890K99355f0357
15764b61934C38132h5631B32920h1294G6906j967i1356I5486K89092M141A24554
$$ plain form
15752 -202026 47519 306314 -199285 28264 -72436 162325 -147365 208394 170975 139284
15742 139284 205704 -52861 57254 31041 104254 193209 -69911 75707 156173 -57958 -268724
15731 -268724 49769 156051 192189 -59920 -137610 -260021 -136073 283868 -153837 71882
15720 -207092 -159616 -238390 254852 98942 44885 181847 25555 -108160 340233 275853 78768
15708 -36702 -40530 93676 3791 301378 84564 -353881 -297170 -21565 -113567 105457 221557
15697 221557 -26083 -294646 115724 78602 234905 -41192 -418516 157157 216387 177704
15687 177704 -81614 -123831 -230199 227864 -174612 126008 -59124 34226 104987 66344 146023
15676 146023 -85362 89309 -33662 225223 -49351 97943 154565 190490 -268109 160444 -93945
$$ packed form
15752b02026D7519K58795a99285B8264g2436A62325a47365B08394l7419l1691
15742A39284O6420e2861E7254k6213P3213Q8955f9911G5707Q0466e7958k10766
15731b68724D9769J06282L6138e9920p7690j22411J23948B83868a53837G1882
15720b07092M7476p8774B54852I8942D4885J36962B5555a08160C40233o4380G8768
15708c6702l828I3676C791K97587H4564c53881N6711b1565r2002A05457J16100
15697B21557b6083k68563A15724l7122J56303d1192l77324A57157N9230l8683
15687A77704h1614m2217j06368B27864a74612A26008e9124C4226P0761l8643P9679
15676A46023h5362H9309c3662B25223d9351I7943N6622L5925b68109A60444i3945
$$ plain form
15664 -193391 71034 129923 66979 -44013 -177752 233452 -297 89184 -97994 133108 -24000
15652 -11020 189960 -74448 -230977 128835 -318732 -104242 89631 69348 -171950 -47319
15641 -156176 -96254 -105541 -115839 181030 25511 -112003 -117878 -279813 -2358 39981 131276
15630 131276 65566 -193448 -64907 -36377 41699 33737 18143 -114303 55895 170178 -148888
15618 -424692 79712 -6918 241360 -17248 -40190 133605 51965 -228646 -38946 194285 -21692
15606 -197080 161288 -129722 94780 -338854 -196640 -86518 -123830 26199 56128 -29346 -190574
15595 -190574 38464 -164543 -230322 -178670 -340823 -62868 -65778 81027 -85389 130874 -23497
15583 -53680 19864 -168143 -61254 121129 -278075 231351 284855 -323957 87604 9959 -128428
$$ packed form
15664a93391G1034N8889o2944d4013j33739B33452b97H9184i7994A33108b4000
15652a1020A89960g4448j56529A28835c18732a04242H9631k0283a71950d7319
15641a56176N9922r287j0298A81030B5511a12003n875j61935b358C9981R1295
15630A31276F5566a93448f4907K8530D1699p962j5594a14303E5895J14283a48888
15618d24692G9712f918B41360a7248k2942A33605E1965b28646c8946A94285b1692
15606a97080A61288a29722I4780c38854J42214h6518l7312B6199K9929b9346j61228
15595a90574C8464a64543o5779N1652j62153f2868k910H1027h5389A30874b3497
15583e3680A9864a68143f1254A21129b78075B31351N3504c23957H7604I959a28428
$$ plain form
15571 -75237 137397 -63244 4490 68177 118011 -104547 -243498 280136 -211461 411069 -104516
15559 246431 56100 -103881 92993 -337316 127016 38006 -38608 140689 -100152 -126989
15549 -126989 -118152 58916 -175306 -62936 59611 110186 -34916 -187192 -235831 118372 176073
15538 176073 6518 -212025 15347 -15756 -133303 -203207 -18893 153125 -338729 295014 11249
15526 -16915 347972 276996 -84980 -166509 175615 -85584 366555 -48688 188102 -25115 170440
15514 113495 79411 -133193 213757 328751 44585 267703 102386 33314 269786 415892
15504 415892 28821 -226399 63067 115370 532055 298361 170329 -246410 71797 185410
15494 185410 142852 74298 139831 260460 113265 107787 -117012 431009 7126 180200 183634
$$ packed form
15571g5237A37397f3244D490O3687M9834a04547j38951B80136b11461D11069a04516
15559B46431E6100a03881I2993c37316A27016C8006c8608A40689a00152k6837
15549a26989Q837E8916a75306f2936E9611N0575c4916j52276m8639A18372N7701
15538A76073F518b12025A5347a5756j17547o9904a8893A53125c38729B95014A1249
15526a6915C47972p0976h4980q1529A75615h5584C66555d8688A88102b5115A70440
15514A13495l4084a33193B13757J14994D4585K23118A02386C3314K36472J46106
15504D15892B8821b26399F3067N2303M16685k33694j28032b46410G1797J13613
15494A85410m2558o8554O5533J20629A13265n478a17012D31009G126J73074L434
$$ plain form
15483 183634 281628 198586 -35428 347204 -381624 -32897 152039 367622 370675 670712 868589
15472 868589 1070874 455148 289613 -140371 245759 58535 -262962 180369 26982 345990
15462 345990 -171677 306409 50226 -16325 -263412 154453 -208696 -158791 -68308 375901
15451 -35775 -206581 79079 -118395 203383 76821 -156327 298017 136604 653138 643320
15441 643320 1324565 1493388 1268277 682102 249547 95533 290780 294828 192404 192969 -123539
15429 -64126 -139307 489217 -38138 213972 118460 -200452 -3822 87246 129573 -442339 19485
15417 191887 -236914 123617 -16933 -55797 41110 29686 -77467 -35867 198669 -31365 -59058
15406 -59058 165698 -75768 -118587 -26357 102675 -85558 -80762 204720 -46052 -102998 -214662
$$ packed form
15483A83634R7994q3042c5428C47204c81624c2897A52039K15583L053L00037J97877
15472H68589K02285D55148j65535a40371B45759E8535b62962A80369B6982L19008
15462C45990a71677C06409E0226a6325k47087A54453b08696M9905f8308C75901
15451c5775j70806G9079a18395B03383G6821a56327B98017A36604N16534r818
15441F43320O81245J68823k25111n86175B49547I5533J95247M048j02424N65a23539
15429f4126p5181D89217c8138B13972r5512b00452c822H7246M2327d42339A9485
15417A91887b36914A23617a6933l8864D1110j1424g7467c5867A98669c1365k7693
15406e9058A65698g5768m2819b6357A02675h5558M796B04720d6052n6946j11664
$$ plain form
15395 -214662 -52017 52512 58710 -202313 44685 131891 98717 69214 -61816 -50956 83053
15383 73078 7421 64992 107534 136711 227370 103433 133543 95875 250197 66903 250482
15372 250482 589198 496114 391990 -49660 110734 312538 131513 81492 357862 201518
15362 201518 -61868 199181 379373 762603 198162 56795 -237207 -24020 323700 117844
15351 244601 287835 104338 -86617 178477 144825 265142 200278 3319 294011 391139 477266
15340 477266 468018 524730 112670 320355 328104 211449 -75238 337977 25616 206340 -11249
15328 5097 -168668 91102 -40216 -13427 3206 300968 -86003 214994 334126 132343 -4371
15316 238563 350271 -163833 240396 28984 -61089 143521 267675 158543 407520 121582
$$ packed form
15395b14662e2017E2512O198b02313D4685Q7206l3174k9503f1816J0860H3053
15383G3078G421N7571M2542K9177R0659A03433L0110l7668J54322F6903J83579
15372B50482L38716r3084j04124d9660A10734K01804A31513n0021K76370j56344
15362B01518f1868A99181J80192L83230A98162E6795b37207b4020C23700A17844
15351B44601M3234A04338h6617A78477l3652J20317o4864C319K90692R7128Q6127
15340D77266r248N6712A12670K07685P749j16655g5238C37977B5616J80724a1249
15328E097a68668I1102d0216a3427C206K97762h6003B14994J19132A32343d371
15316B38563J11708a63833B40396B8984f1089A43521J24154j09132K48977A21582
$$ plain form
15305 98187 124016 -298811 -148603 -148264 -185120 -254950 -98590 235487 -189145 -156021 -310759
15294 -310759 -73947 424697 -7082 29989 195350 76367 -32825 72202 36835 -32466 140028
15282 -170020 -18091 -240876 -18432 -120142 277162 522322 104174 139725 1966 205054
15272 205054 179225 262181 321445 98225 187837 36820 -61308 -19462 -240676 129856 74133
15261 74133 219172 -285981 158578 -188844 171372 165268 31510 216497 319621 239443
15251 239443 -79519 205731 -101273 123350 33072 120608 382442 367112 292654 944435
15241 944435 1839408 1802251 1379240 1953589 717935 404727 535730 231330 461841 -315310
15230 -74985 145768 -51015 10891 -158454 -460163 277566 56133 153352 73355 -123910 -492
$$ packed form
15305I8187K5829b98811a48603L39l6856o9830i8590B35487a89145L3124j54738
15294c10759g3947D24697g082B9989J65361G6367c2825G2202l5367c2466A40028
15282a70020a8091k22785a8432j01710B77162K45160A04174L5551A966K03088
15272B05054k5829Q2956N9264I8225Q9612C6820f1308a9462k21214A29856n5723
15261G4133J45039b85981A58578a88844A71372o104C1510J84987J03124q0178
15251B39443g9519B05731a01273A23350C3072Q7536K61834j5330p4458O51781
15241I44435Q94973l7157m23011N74349G17935l13208J31003B31330K30511c15310
15230g4985A45768e1015A0891a58454l01709B77566E6133R7219G3355a23910d92
$$ plain form
15218 69086 239016 186869 -15882 -67092 301683 137942 -170786 -108086 273183 123819
15207 78590 441127 177374 -13077 -26004 103466 5016 -293420 128403 -273494 20796 175464
15196 175464 225575 -74842 128122 140895 63871 194511 208409 159143 342698 -246133 -187972
15185 -187972 -50167 -51310 118463 -88628 33562 -31839 60563 -196477 1708 147196 -464992
15173 240484 -10403 322726 -167335 -28546 59615 -37777 401919 292668 113687 20517
15162 188715 30103 -37650 53234 240339 -319066 -58507 -41225 -9172 157995 54630 145680
15151 145680 51095 133400 -27207 249729 60403 207993 335753 79097 1567 36963 244688
15140 244688 372514 311287 -181698 322374 22872 68345 -34561 150263 129388 -211863
$$ packed form
15218F9086J69930n2147a5882n1210C01683A37942a70786O2700B73183A23819
15207G8590L62537A77374a3077j2927A03466E016b93420A28403b73494B0796J54668
15196A75464N0111g4842A28122J2773F3871J30640J3898m9266J83555b46133N8161
15185a87972e0167j143A18463h8628C3562c1839F0563a96477A708J45488d64992
15173B40484a0403C22726a67335b8546E9615c7777D01919j09251A13687B0517
15162A88715C0103c7650E3234J87105c19066e8507J7282i172A57995E4630R1050
15151A45680E1095Q2305b7207B49729F0403J47590J27760G9097A567L5396K07725
15140B44688J27826o1227a81698C22374B2872M5473c4561A50263k0875b11863
$$ plain form
15129 498515 -33684 25857 245867 45590 -1391 107770 21230 142838 773406 278747 599580
15118 599580 214544 196473 148195 -118910 140902 318074 -87881 -14603 -4494 -83471 154098
15106 401910 176224 230550 200774 411193 169915 292142 51729 718 237171 296785 81739
15094 -124828 -143618 238129 60819 196211 158984 -132173 364807 147398 347941 -29106
15083 85392 195198 -137880 -172864 169511 45450 -31832 201077 -13445 131637 166778 226073
15072 226073 92749 -27044 175383 136772 135993 254206 104121 -12651 79394 268056 114604
15060 405021 232958 156863 369611 296074 85738 361057 413339 404821 474818 92081 267213
15049 267213 454107 282933 125395 439349 103979 346161 189002 220040 488052 325605
$$ packed form
15129D98515c3684B5857K20010D5590a391A07770B1230J21608O30568B78747L20833
15118E99580B14544j8071m8278a18910A40902J77172h7881a4603d494p8977A54098
15106D01910A76224N4326k9776K10419A69915J22227E1729G18K36453N9614H1739
15094a24828j8790B38129F0819J35392l7227a32173C64807A47398K00543b9106
15083H5392J09806a37880l4984A69511D5450c1832B01077a3445A31637L5141N9295
15072B26073I2749b7044A75383l8611p79J18213A04121a2651G9394J88662A14604
15060D05021j72063p6095K12748p3537H5738K75319N2282q518O9997I2081J75132
15049B67213J86894j71174A25395L13954A03979K42182j57159L1038K68012j62447
$$ plain form
15039 325605 207673 659869 338187 88477 452295 82597 792159 568008 918808 572651
15029 572651 1056553 590902 676645 559757 688309 549926 590403 502959 654073 645198
15019 645198 504751 682922 398702 539464 695133 652213 499179 170530 297054 607635
15009 607635 579847 784516 409044 573419 340487 296003 505623 768245 395655 665173
14999 665173 363758 715837 511820 617955 551254 150963 686450 596883 744469 620196
14989 620196 607419 500045 557488 354285 262451 820012 592895 671199 894694 1275863
14979 1275863 909506 910241 578204 335399 344326 354842 684465 642256 836745 515795 651141
14968 651141 399204 279969 452359 483139 491861 762811 335691 254973 212148 381544
$$ packed form
15039C25605j17932M52196l21682H8477L63818H2597P09562k24151L50800l46157
15029E72651M83902m65651Q5743j16888J28552j38383M0477q7444J51114q875
15019F45198j40447J78171k84220J40762J55669m2920j53034A70530J26524L10581
15009F07635k7788K04669l75472J64375k32932m4484K09620K62622l72590K69518
14999F65173l01415L52079k04017J06135o6701A50963N35487q9567J47586j24273
14989F20196j2777j07374N7443k03203r1834N57561k27117P8304K23495L81169
14979A275863l66357P35l32037k42805Q927J0516L29623m2209J94489l20950J35346
14968F51141k51937j19235J72390L0780Q722K70950C35691q0718m2825J69396
$$ plain form
14958 381544 308474 238986 283771 405820 546293 76683 703036 316030 566345 410197
14948 410197 344340 349724 335609 667093 505030 798186 599044 311319 550541 625452
14938 625452 421377 559664 483132 297011 238809 854150 614103 1117205 1466627 1246149
14928 1246149 1114757 1511957 1744571 1974661 2114434 2006942 1607311 1815378 1622800
14919 1622800 2128406 2593199 2663852 2852452 2164208 1816749 1218854 1546084 1169923 620660
14909 620660 456193 622073 417799 425771 405401 656884 388696 529914 456307 335065
14899 335065 286768 292550 91856 826355 595415 424093 635004 125273 486648 508455
14889 508455 321311 688086 466677 559776 605962 770652 776044 1269179 1229608 1167561 1311556
$$ packed form
14958C81544p3070o9488M4785J22049J40473G6683O26353C16030K50315j56148
14948D10197o5857N384j4115L31484j62063K93156j99142k87725K39222P4911
14938F25452k04075J38287p6532j86121n8202O15341k40047N03102L49422k20478
14928A246149j31392L97200K32614K30090J39773j07492l99631K08067j92578
14919A622800N05606M64793P0653J88600o88244l47459n97895L27230l76161n49263
14909F20660j64467J65880k04274P972k0370K51483k68188J41218p3607j21242
14899C35065m8297N782I1856P34499k30940j71322K10911A25273L61375K1807
14889E08455j87144L66775k21409R3099M6186J64690N392M93135l9571o2047J43995
$$ plain form
14878 1311556 843250 824357 491358 628767 231824 665452 273860 176203 297917 622340
14868 622340 590392 888550 555590 815917 888267 608953 540968 469536 280280 437506
14858 437506 601473 216221 517338 769288 551052 328531 417367 674749 703985 838824
14848 838824 466862 651550 873607 767674 1045172 1251203 1159275 1353380 906012 986611
14838 986611 793601 1138732 963822 1075485 525913 440208 482181 356004 376870 693235
14828 693235 584766 669366 361340 414527 561180 652393 749005 700369 897856 555365
14818 555365 1174489 649754 702593 553367 725879 755126 608624 452357 625686 628909
14808 628909 1169005 992027 1137175 1106974 1132150 984361 781252 538917 696124 419765
$$ packed form
14878A311556m68306j8893l32999J37409B31824M33628B73860r7657J21714L24423
14868F22340l1948K98158l32960K60327P2350k79314o7985p1432j89256J57226
14858D37506J63967B16221L01117K51950k18236k22521Q8836K57382K9236J34839
14848H38824l71962J84688K22057j05933K77498K06031r1928J94105m47368Q0599
14838I86611j93010L45131j74910J11663E25913q5705M1973j26177K0866L16365
14828F93235j08469Q4600l08026N3187J46653R1213R6612m8636J97487l42491
14818E55365O19124n24735N2839j49226J72512K9247j46502j56267J73329L223
14808F28909N40096j76978J45148l0201K5176j47789k03109k42335J57207k76359
$$ plain form
14798 419765 512371 263396 473519 418929 522079 511801 785575 674579 383345 654406
14788 654406 342331 625765 683172 655297 627991 372241 620748 634111 544105 638443 1042797
14777 1042797 983609 865638 818672 858286 873474 543110 439491 631026 735614 725694
14767 725694 867311 735782 817868 603109 711192 292660 724912 342157 495246 656423
14757 656423 761747 723090 467988 454000 261780 733903 719178 709579 727910 729698 600237
14746 600237 389054 899642 572871 517815 931578 502052 703913 682470 949042 967116
14736 967116 1089700 813613 1297601 1059925 871639 1243573 1479786 1919135 1754374 1911101
14726 1911101 1581423 1558999 1018010 1059904 1107018 726222 1022210 815798 970213 576243
$$ packed form
14798D19765R2606k48975K10123n4590J03150j0278K73774j10996k91234K71061
14788F54406l12075K83434N7407k7875k7306k55750K48507J3363r0006R4338M04354
14777A042797n9188j17971m6966L9614J5188l30364j03619J91535J04588r920
14767G25694J41617j31529Q2086k14759J08083B92660M32252C42157J53089J61177
14757F56423J05324l8657k55102j3988j92220M72123j4725r599J8331J788j29461
14746F00237k11183N10588l26771n5056M13763m29526K01861k1443K66572J8074
14736I67116J22584k76087M83988k37676j88286L71934K36213M39349j64761J56727
14726A911101l29678k2424n40989M1894M7114l80796K95988k06412J54415l93970
$$ plain form
14716 576243 831286 714806 970840 1292024 866881 1106453 465104 1123543 973298 1022624
14706 1022624 1308814 1387612 1878985 1793852 1893947 2483117 1778623 1525778 1453824 1093870
14696 1093870 1175128 695652 1257621 978382 681519 847011 815833 692174 898128 1208785
14686 1208785 835896 1038389 965891 900352 903446 1022280 1181107 697617 1107578 713170
14676 713170 877445 933392 1237361 807725 917320 801502 1022508 750036 1263459 768793
14666 768793 816814 873721 754448 1181208 941217 1074012 1307602 839136 1308006 1081112
14656 1081112 1293108 1304112 1348134 1718891 1539065 1319380 1368763 986039 1186745 1164879
14646 1164879 1165620 1048629 1049746 1357726 1148763 1361022 943698 1376148 1046389 1303189
$$ packed form
14716E76243K55043j16480K56034L21184m25143K39572D65104O58439j50245M9326
14706A022624K86190P8798M91373q5133J00095N89170p04494k52845p1954l59954
14696A093870Q1258m79476N61969k79239k96863J65492l1178j23659K05954L10657
14686A208785l72889K02493p2498o5539L094J18834J58827m83490M09961l94408
14676G13170J64275N5947L03969m29636J09595j15818K21006k72472N13423m94666
14666G68793M8021N6907j19273M26760k39991J32795K33590m68466M68870k26894
14656A081112K11996J1004M4022L70757j79826k19685M9383l82724K00706k1866
14646A164879P41j16991J117L07980k08963K12259m17324M32450l29759K56800
$$ plain form
14636 1303189 1424632 1218910 1249615 1171794 1475031 1310712 918375 1233558 1304776 1273030
14626 1273030 1408831 1164841 978268 1443957 1568368 1306659 1221213 1414164 1104327 1488824
14616 1488824 1626384 1730929 1360668 1311412 1484087 1229654 1574427 1245113 1599529 1564982
14606 1564982 1500549 1372937 1699512 1393142 1637638 1419425 1685810 1724958 1524410 1450026
14596 1450026 1569043 1336612 1686473 1535857 1802904 1712062 1564911 1762697 1453122 1748223
14586 1748223 1634449 1902553 1746594 1896740 1551946 1793075 1792561 1880634 1610330 2059395
14576 2059395 2038136 1885844 1719231 2107790 1872982 1816616 1831662 2225676 1944215 2270600
14566 2270600 1955833 2217710 2444969 2426204 2162715 2333630 2395717 2162981 2749576 2766371
$$ packed form
14636A303189J21443k05722L0705p7821L03237j64319l92337L15183P1218l1746
14626A273030J35801k43990j86573M65689J24411k61709q5446J92951l09837L84497
14616A488824J37560J04545l70261m9256J72675k54433L44773l29314L54416l4547
14606A564982o4433j27612L26575l06370K44496k18213K66385L9148k00548p4384
14596A450026J19017k32431L49861j50616K67047r0842j47151J97786l09575K95101
14586A748223j13774K68104j55959J50146l44794K41129n14Q8073k70304M49065
14576B059395k1259j52292j66613L88559k34808n6366J5046L94014k81461L26385
14566B270600l14767K61877K27259j8765k63489J70915O2087k32736N86595J6795
$$ plain form
14556 2766371 3167266 2819901 3083151 3744018 3791182 4240746 4709018 6162556 10309455
14547 10309455 18237120 34831269 50967442 24538482 9307933 4487326 3139207 2551332
14539 2551332 2203893 2850233 4245390 4812075 2768986 2161519 2170672 2017821 2219271
14530 2219271 1836677 2124775 2208958 2379028 2145153 2465983 2026328 2173791 2376449 2607647
14520 2607647 2563668 2401428 2694674 2330895 2325922 2463641 2381719 2707899 2514414 2836462
14510 2836462 2784978 2645664 2652746 2699241 2833232 2878591 3027050 2970792 2879976 2634616 3310575
14499 3310575 2975246 3158478 2902756 2852141 3286165 3327353 3202283 3060484 3374445 3542220
14489 3542220 3526072 3229151 3508886 3121668 3470679 3740024 3826375 3758522 3691785 3144546
$$ packed form
14556B766371M00895l47365K63250O60867M7164M49564M68272J453538M146899
14547A0309455P927665J6594149J6136173B4538482I307933D487326j348119n87875
14539B551332l47439O46340J395157N66685k043089o07467R153j52851K01450
14530B219271l82594K88098Q4183J70070k33875L20830m39655J47463K02658K31198
14520B607647m3979j62240K93246l63779m973J37719q1922L26180j93485L22048
14510B836462n1484j39314P082M6495J33991M5359J48459n6258r0816k45360O75959
14499C310575l35329J83232k55722n0615M34024M1188j25070j41799L13961J67775
14489C542220j6148k96921K79735l87218L49011K69345Q6351o7853o6737n47239
$$ plain form
14479 3144546 3659432 3867082 3937878 3572866 3665543 3661690 3714802 4570039 4207245 3833236
14469 3833236 3900201 4299188 4367373 4456495 4537706 4716133 4745230 4645376 4743294 4813995 4989696
14458 4989696 4751779 5088057 5111623 4883228 4541457 4816391 5170043 5208167 5348802 5379078
14448 5379078 5194101 5344084 5354322 5455065 5353843 5524950 5869864 5449688 5928990 6100185
14438 6100185 6252787 6030760 6026130 6069163 6695297 6305849 6687701 6484686 6476293 6934323
14428 6934323 6767665 7047340 7398308 7120226 7395506 7731729 7847876 7941903 8204081 8238883
14418 8238883 7999625 8219179 8192527 8455072 8333366 8481699 8431520 8831882 8853921 8975540
14408 8975540 9335724 9617962 9793161 9704245 10057817 10234076 9878180 9847345 10168152 10336204
$$ packed form
14479C144546N14886K07650P0796l65012R2677l853N3112Q55237l62794l74009
14469C833236O6965L98987O8185Q9122Q1211J78427K9097r9854R7918P0701J75701
14458D989696k37917L36278K3566k28395l41771K74934L53652L8124J40635L0276
14448E379078j84977J49983J0238J00743j01222J71107L44914m20176M79302J71195
14438F100185J52602k22027m630M3033O26134l89448L81852k03015q393M58030
14428F934323j66658K79675L50968k78082K75280L36223J16147R4027K62178L4802
14418H238883k39258K19554k6652K62545j21706J48333n0179M00362K2039J21619
14408H975540L60184K82238J75199q8916L53572J76259l55896l0835L20807J68052
$$ plain form
14398 10336204 10715200 10627024 10754249 10966644 11298706 11264003 11965575 12221668 11992040 12167870
14388 12167870 12596993 12844160 13007668 13187129 13586604 13846413 14565359 14702296 14434649
14379 14434649 14806726 15017631 15301594 15490984 15761171 16144997 16386615 16844678 17207146
14370 17207146 17291930 17877212 18414244 18803752 19265099 19493361 19758368 20333156 20668117
14361 20668117 20844214 21520116 22184729 22567201 22742072 23551005 24142156 24632741 25126411
14352 25126411 25648925 26276878 26912765 27536175 27730979 28727105 29391041 30473370 31543612
14343 31543612 32226381 32821753 33619078 34879334 35612096 36161746 37921070 38737981 39693005
14334 39693005 40930986 42281240 43646633 45023343 46346599 47539873 49277471 50692263
$$ packed form
14398A0336204L78996q8176J27225K12395L32062l4703P01572K56093k29628J75830
14388A2167870M29123K47167J63508J79461L99475K59809P18946J36937k67647
14379A4434649L72077K10905K83963J89390K70187L83826K41618M58063L62468
14370A7207146Q4784N85282N37032L89508M61347K28262K65007N74788L34961
14361B0668117J76097O75902O64613L82472J74871Q08933N91151M90585M93670
14352B5126411N22514O27953O35887O23410J94804R96126O63936J082329J070242
14343C1543612O82769N95372P97325J260256P32762N49650J759324Q16911R55024
14334C9693005J237981J350254J365393J376710J323256J193274J737598J414792
$$ plain form
14326 50692263 52143661 53946881 56167336 57832426 60319826 61854588 64401022 66652836
14318 66652836 69220726 71645120 74281851 76652877 79879113 82930659 86242045 89694548
14310 89694548 93401014 97561155 101773946 106108406 110768039 115842486 120883291 126462297
14302 126462297 132512487 138885958 145521300 152405757 160065028 168528655 176820683 186022076
14294 186022076 195772204 205806451 216701509 228161255 240398989 253080240 266483042
14287 266483042 280120776 294515933 309571707 324600354 340447629 356473836 372247986
14280 372247986 387952366 403352433 417977038 431742923 444160529 455193958 464434140
14273 464434140 470664850 472806462 471172483 468644234 469473299 465589256 461201252 453663513
$$ packed form
14326E0692263J451398J803220K220455J665090K487400J534762K546434K251814
14318F6652836K567890K424394K636731K371026L226236L051546L311386L452503
14310H9694548L706466M160141M212791M334460M659633N074447N040805N579006
14302A26462297O050190O373471O635342O884457P659271Q463627Q292028R201393
14294A86022076R750128J0034247J0895058J1459746J2237734J2681251J3402802
14287B66483042J3637734J4395157J5055774J5028647J5847275J6026207J5774150
14280C72247986J5704380J5400067J4624605J3765885J2417606J1033429R240182
14273D64434140O230710K141612j633979k528249Q29065l884043m388004p537739
$$ plain form
14265 453663513 444478589 434352042 422147387 408517606 393383929 377712348 361287915
14258 361287915 345119428 329003118 312848939 297704021 282710647 268417086 254775425
14251 254775425 241877086 229253949 217342956 206808540 197861749 188028584 178485255
14244 178485255 170129116 162067006 154242905 147096637 140008510 133782275 128039086 122389990
14236 122389990 117053516 111453159 106422030 102141523 98373677 94763536 91199056 86926202
14228 86926202 83610937 80483531 77061615 73954864 71460648 69141267 66488073 64495850
14220 64495850 62067842 60096019 57951043 56075860 54104667 52297036 50756988 49930993
14212 49930993 48155321 46275106 45053127 43744131 42545446 41757335 40722142 39035437
$$ packed form
14265D53663513r184924j0126547j2204655j3629781j5133677j5671581j6424433
14258C61287915j6168487j6116310j6154179j5144918j4993374j4293561j3641661
14251B54775425j2898339j2623137j1910993j0534416q946791r833165r543329
14244A78485255q356139q062110p824101p146268p088127o226235n743189n649096
14236A22389990n336474n600357n031129m280507l767846l610141l564480m272854
14228H6926202l315265l127406l421916l106751k494216k319381k653194j992223
14220F4495850k428008j971823k144976j875183j971193j807631j540048q25995
14212D9930993j775672j880215j221979j308996j198685p88111j035193j686705
$$ plain form
14204 39035437 37913912 36707958 35699171 34878311 34417285 33341963 32114045 31497158
14196 31497158 30534057 29821633 29277687 28560072 28010332 27266008 26562067 25873653 24923966
14187 24923966 24183898 23980166 23484114 22583061 22667585 21902063 21723057 20963550 20792342
14178 20792342 20159693 19672682 19446523 19125577 18635231 18485002 17828344 17161155 17027216
14169 17027216 16646426 16394420 15671457 15723722 15534533 15519948 14856877 14956044 14691889 13834321
14159 13834321 13976778 13621380 13840561 13514645 13174083 12798638 12809496 12300309 12636690
14150 12636690 11969208 11780912 11752384 11437883 11415532 11226158 11228204 10471264 10437418 10470864
14140 10470864 10339117 10483272 10175279 9600806 9828952 9918770 9430135 9243672 9394945
$$ packed form
14204C9035437j121525j205954j008787q20860m61026j075322j227918o16887
14196C1497158r63101p12424n43946p17615n49740p44324p03941o88414r49687
14187B4923966p40068k03732m96052r01053Q4524p65522j79006p59507j71208
14178B0792342o32649m87011k26159l20946m90346j50229o56658o67189j33939
14169A7027216l80790k52006p22963N2265j89189j4585o63071R9167k64155q57568
14159A3834321J42457l55398K19181l25916l40562l75445J0858n09187L36381
14150A2636690o67482j88296k8528l14501k2351j89374K046p56940l3846L3446
14140A0470864j31747J44155l07993n74473K28146Q9818m88635j86463J51273
$$ plain form
14131 9394945 8969325 8742401 9096451 9135235 8692182 8568026 8280485 8315907 8107318 8072627
14121 8072627 7982600 7516149 7563542 7922387 7462663 7497591 7532991 7395959 6963309 6927961
14111 6927961 6801563 6854195 6818032 6931894 6400718 6589248 6541726 6470558 6473358 6244805
14101 6244805 6151197 5750424 6061476 6046935 5873051 5898310 5832563 5611017 5423795 5504966
14091 5504966 5389681 5702699 5363424 5457084 5234517 5022848 5392489 5103540 4883801 5113747
14081 5113747 4908246 4849622 4983247 4879324 4551599 4393047 4441098 4417684 4443716 4500968
14071 4500968 4308771 4356270 4265155 3917990 4133408 3974735 4256616 4027844 4002487 4266323
14061 4266323 3948213 4323952 4431422 4293733 4337154 3822961 3972855 3952589 3975059 3789271
$$ packed form
14131I394945m25620k26924L54050L8784m43053j24156k87541L5422k08589l4691
14121H072627r0027m66451M7393L58845m59724L4928L5400j37032m32650l5348
14111F927961j26398N2632l6163J13862n31176J88530m7522p1168K800k28553
14101F244805r3608m00773L11052j4541j73884K5259o5747k21546j87222Q1171
14091E504966j15285L13018l39275R3660k22567k11669L69641k88949k19739K29946
14081E113747k05501n8624J33625j03923l27725j58552M8051k3414K6032N7252
14071D500968j92197M7499r1115l47165K15418j58673K81881k28772k5357K63836
14061D266323l18110L75739J07470j37689M3421n14193J49894k0266K2470j85788
$$ plain form
14051 3789271 3508198 3717609 3506016 3319099 2900428 3193701 3591619 3239590 3348157
14042 3348157 3460427 3195764 3070932 3304794 3214814 3138189 3202306 3442548 3161820 3155263
14032 3155263 2986330 3211684 2958753 2928184 3035723 3048412 3161652 2901579 2934759 2838504
14022 2838504 2569712 2784571 2774716 2664871 2847135 2532703 2874107 2339889 2485443 2360318
14012 2360318 2391673 2290199 2469338 2343715 2412596 2563048 2733643 2063633 2482841 2728087
14002 2728087 2199024 1813942 2470805 1868018 1999675 2009369 2144526 2245882 1746733 1927920
13992 1927920 1851366 2284685 2386158 2897233 4947385 10921836 25810939 49790113 32832306
13983 32832306 15596703 8921974 6294337 5084641 4181694 3898198 3431906 3218835
$$ packed form
14051C789271k81073K09411k11593j86917m18671K93273L97918l52029J08567
14042C348157J12270k64663j24832K33862q9980p6625O4117K40242k80728o557
14032C155263j68933K25354k52931l0569J07539J2689J13240k60073L3180r6255
14022B838504k68792K14859r855j09845J82264l14432L41404n34218J45554j25125
14012B360318L1355j01474J79139j25623O8881J50452J70595o70010M19208K45246
14002B728087n29063l85082O56863o02787J31657R694J35157J01356m99149J81187
13992A927920p6554M33319J01473N11075K050152N974451J4889103K3979174j6957807
13983C2832306A5596703o674729k627637j209696r02947k83496m66292k13071
$$ plain form
13975 3218835 2956667 2507337 2724939 2826621 2447897 2691620 2696441 2109560 2314628 2081097
13965 2081097 2294237 2140173 2109856 2315359 2366632 2235206 2277487 2177242 2136046 1958717
13955 1958717 2107791 2270930 2138453 1814357 2333627 2073693 1919096 1833761 1812861 1723390
13945 1723390 1847293 1815642 1844027 1584140 1809576 1959154 1549432 1744529 1827850 1913815
13935 1913815 1693511 1721134 1598400 1626423 1664509 1794851 1329877 1516509 1631424 1740069
13925 1740069 1431285 1677762 1682183 1762764 1395436 1767067 1706046 1618416 1550985 1621923 1432824
13914 1432824 1531890 1547112 1650946 1429475 1394009 1315408 1364123 1149219 1183420 1271100 1469129
13903 1469129 1436558 1445006 1253051 1235706 1532781 1409009 1370779 1355439 994099 1306427
$$ packed form
13975C218835k62168m49330K17602J01682l78724K43723M821n86881K05068k33531
13965B081097K13140j54064l0317K05503N1273j31426M2281j00245m1196j77329
13955A958717J49074J63139j32477l24096N19270k59934j54597q5335k0900q9471
13945A723390J23903l1651K8385k59887K25436J49578m09722J95097Q3321Q5965
13935A913815k20304K7623j22734K8023L8086J30342m64974J86632J14915J08645
13925A740069l08784K46477M421Q0581l67328L71631o1021q7630o7431P0938j89099
13914A432824R9066J5222J03834k21471l5466p8601M8715k14904L4201Q7680J98029
13903A469129l2571Q448j91955j7345K97075j23772l8230j5340l61340L12328
$$ plain form
13893 1306427 1281131 1112141 1086311 1257482 1389853 1024234 1259341 1267652 1196626 1183853
13883 1183853 1221629 1525587 1040079 1416332 1384256 758252 1150479 1251808 1456659 1084424
13873 1084424 1346951 958675 994065 1320763 1183806 1116501 1017402 981315 987271 1141021
13863 1141021 1061684 1161366 1082317 1172312 1279863 942719 1066940 1452204 891687 1252496
13853 1252496 1114719 1325970 1007390 1081230 1272976 1167882 1155570 1014097 1082893 938293
13843 938293 1266366 1132106 904816 941035 849200 812381 1092554 990311 974600 1069094
13833 1069094 781922 855275 870087 1215300 1051806 1079860 508741 1029254 833996 851383
13823 851383 968687 1160366 1045998 943110 713454 854643 664468 836091 864767 1058134
$$ packed form
13893A306427k5296j68990k5830J71171J32371l65619K35107Q311p1026j2773
13883A183853L7776L03958m85508L76253l2076o26004L92227J01329K04851l72235
13873A084424K62527l88276L5390L26698j36957o7305r9099l6087N956J53750
13863A141021p9337R9682p9049Q9995J07551l37144J24221L85264n60517L60809
13853A252496j37777K11251l18580P3840J91746j05094j2312j41473O8796j44600
13843I38293L28073j34260k27290L6219r1835l6819K80173j02243j5711R4494
13833A069094k87172P3353J4812L45213j63494K8054E08741N20513j95258J7387
13823H51383J17304J91679j14368j02888k29656J41189j90175J71623K8676J93367
$$ plain form
13813 1058134 757764 642235 1016815 745193 802096 757496 698746 635040 840200 1049505
13803 1049505 812676 934961 881109 543284 645173 917704 646187 680257 886081 873714
13793 873714 839947 1166999 704737 913326 519931 970391 537436 603778 911597 903848
13783 903848 836454 623364 808393 613487 719782 316961 873917 382756 680960 596281
13773 596281 826995 908760 738133 864497 387961 534847 843449 824710 816821 769032
13763 769032 930147 878704 592789 597987 868358 361042 587539 1088759 385551 739007
13753 739007 644273 434480 420737 842252 497845 803081 895885 794148 244360 636294
13743 636294 639561 555934 270278 714265 651911 728828 725542 630658 452873 678529 670893
$$ packed form
13813A058134l00370j15529L74580k71622N6903m4600n8750o3706K05160K09305
13803A049505k36829J22285n3852l37825J01889K72531k71517L4070K05824j2367
13793H73714l3767L27052m62262K08589l93395M50460m32955O6342L07819p749
13783I03848o7394k13090J85029j94906J06295C16961N56956C82756K98204q4679
13773E96281K30714Q1765j70627J26364C87961J46886L08602j8739p889m7789
13763G69032J61115n1443k85915N198K70371C61042K26497N01220C85551L53456
13753G39007r4734k09793j3743M21515l44407L05236R2804j01737B44360L91934
13743F36294L267q3627B70278M43987o2354P6917l286r4884j77785K25656p636
$$ plain form
13732 670893 598054 473063 631830 782607 419470 663736 366333 537924 563857 831758
13722 831758 678543 843456 786689 682602 668255 313499 884722 614441 733470 556417
13712 556417 71210 739337 885496 574115 419113 529458 406677 630469 711755 432124
13702 432124 284759 595100 588620 595408 632863 522820 402937 238690 546650 637917 419256
13691 419256 457072 398155 603104 716023 770284 403978 351024 378962 347745 470269 552844
13680 552844 402095 470568 536841 698315 440325 628120 459944 353676 495952 9523
13669 311328 281470 538477 217017 748345 391352 310662 238542 415867 361692 478248
13659 478248 480446 502753 165188 361003 669800 495023 358220 202111 744917 604165
$$ packed form
13732F70893p2839j24991J58767J50777l63137K44266k97403J71591K5933K67901
13722H31758j53215J64913n6767j04087j4347C13499N71223k70281J19029j77053
13712E56417G1210O68127J46159l11381j55002J10345j22781K23792Q1286k79631
13702D32124j47365L10341o480O788L7455j10043j19883j64247L07960R1267k18661
13691D19256L7816n8917K04949J12919N4261l66306n2954K7938l1217J22524Q2575
13680E52844j50749O8473O6273J61474k57990J87795j68176j06268J42276I523
13669C11328k9858K57007B17017N31328l56993q0690p2120J77325n4175J16556
13659D78248K198K2307A65188J95815L08797j74777j36803j56109N42806j40752
$$ plain form
13649 604165 72772 577093 611689 681491 572951 266087 554830 223227 496694 545012
13639 545012 419476 214854 355243 468712 226725 573281 504162 527528 330038 502917
13629 502917 706308 385565 180183 115381 255368 406586 245273 345980 311809 596372
13619 596372 626219 377198 425899 519623 -45762 194880 595846 415189 660683 590884
13609 590884 272359 583581 512943 250888 344906 335630 453492 376797 281064 364616 460141
13598 460141 253673 563177 253681 263910 405485 565284 774918 400270 484829 379957
13588 379957 86767 644751 399865 325320 275679 513412 529190 349520 -7859 145169 494143
13577 494143 454138 562255 288006 418102 158315 223276 533327 493210 18489 173512
$$ packed form
13649F04165G2772N04321L4596O9802j08540B66087K88743B23227K73467M8318
13639E45012j25536k04622J40389J13469B26725L46556o9119K3366j97490J72879
13629E02917K03391l20743A80183o4802J39987J51218j61313J00707l4171K84563
13619E96372K9847k49021M8701R3724d5762A94880M00966j80657K45494o9799
13609E90884B72359L11222p0638B50888R4018r276J17862p6695r5733Q3552R5525
13598D60141k06468L09504B53681J0229J41575J59799K09634l74648Q4559j04872
13588C79957H6767N57984k44886p4545m9641K37733J5778j79670g859A45169L48974
13577D94143m0005J08117k74249J30096A58315O4961L10051m0117A8489J55023
$$ plain form
13567 173512 269425 174235 297922 331315 454426 531455 119905 501204 637093 280676
13556 226988 537153 210562 258453 658411 238315 163006 118129 83257 198973 330418
13546 330418 430998 221499 174602 181366 293939 420719 124075 516928 445202 384690
13536 384690 662241 421570 -20881 386495 222889 327386 277919 467050 231898 262129
13526 262129 533106 715488 403852 466197 161313 150401 240147 454947 95225 13659
13515 146964 180161 485345 114973 24346 160972 -4815 444366 -14886 124210 428020
13505 428020 229724 211318 -62071 368050 333633 240504 347510 303314 101738 136184 225817
13494 225817 335205 261978 166256 753656 270203 279652 316638 119175 498811 105019
$$ packed form
13567A73512R5913r5190J23687L3393J23111P7029A19905L81299J35889B80676
13556B26988L10165B10562M7891L99958B38315p5309m4877l4872J15716J31445
13546C30418J00580k09499m6897O764J12573J26780A24075L92853p1726o0512
13536C84690K77551k40671b0881C86495j63606J04497m9467J89131B31898L0231
13526B62129K70977J82382l11636O2345A61313j0912Q9746K14800I5225A3659
13515A46964L3197L05184A14973B4346J36626d815D44366a4886A24210L03810
13505D28020j98296j8406f2071C68050l4417r3129J07006m4196A01738L4446Q9633
13494B25817J09388p3227r5722N87400B70203R449L6986A19175L79636A05019
$$ plain form
13483 142072 319514 290873 161419 225693 138665 21990 486001 -32111 284769 225917 53574
13471 354825 321440 289537 284305 385366 502753 -146766 350717 317898 457790 231511
13461 231511 102739 333202 220051 108881 -9228 106551 243518 127630 26149 343891
13451 343891 266797 355940 113463 182527 221340 180689 28323 368702 302315 52674 157973
13440 157973 154720 94556 306042 129944 402257 59288 403980 -46251 72780 631188 445532
13429 445532 466453 -134071 296155 82403 248624 136062 534697 -123080 174704 180768
13419 180768 -122174 48919 370713 -129918 167621 61415 206769 144845 212977 235987
13409 235987 146843 115661 324590 124971 200874 99178 250542 -209648 17550 -22073 -44294
$$ packed form
13483A42072J77442k8641j29454O4274q7028B1990M64011c2111B84769n8852E3574
13471C54825l3385l1903n232J01061J17387a46766C50717l2819J39892k26279
13461B31511A02739K30463j13151A08881i228A06551J36967j15888B6149L17742
13451C43891p7094Q9143A13463O9064L8813m0651B8323L40379o6387E2674J05299
13440A57973l253o0164K11486A29944K72313E9288L44692d6251G2780N58408j85656
13429D45532K0921a34071B96155H2403J66221j12562L98635a23080A74704O064
13419A80768a22174D8919L21794a29918A67621F1415J45354o1924O8132K3010
13409B35987q9144l1182K08929A24971P5903I9178J51364b09648A7550b2073k2221
$$ plain form
13398 -44294 133853 152044 127829 15681 311821 364385 316879 15531 86764 141052 51713
13386 85502 8150 -58189 198507 -111517 257634 361803 125170 368159 161325 89735
13376 89735 -11465 64464 224410 125684 94461 437285 433852 440212 284736 432197 341553
13365 341553 344230 202628 103695 115116 257069 344044 182816 -54670 505134 150126 310803
13354 310803 5243 351220 131670 366106 2509 44322 269572 166315 303884 565416
13344 565416 73410 198997 358040 -52101 79751 360374 410714 386330 420452 11800 368666
13333 368666 438596 161683 350650 257952 156969 380256 471916 172451 258775 328277
13323 328277 225544 34718 -101625 490385 135913 280917 55717 170342 230136 399115
$$ packed form
13398d4294A33853J8191k4215A5681K96140N2564m7506A5531P1233N4288E1713
13386H5502H150e8189A98507a11517B57634J04169A25170K42989A61325p1590
13376H9735a1465F4464J59946r8726l1223L42824l433O360j55476J47461r0644
13365C41553K677j41602r8933J1421J41953Q6975j61228e4670E05134A50126J60677
13354C10803E243L45977A31670K34436B509M1813K25250j03257J37569K61532
13344E65416G3410J25587J59043e2101G9751K80623N0340k4384L4122A1800L56866
13333C68666O9930A61683J88967r2698j00983K23287R1660A72451Q6324O9502
13323C28277j02733C4718a01625D90385A35913J45004E5717J14625N9794J68979
$$ plain form
13313 399115 471118 186474 90616 -7713 180942 -161785 272867 129983 296755 42625
13302 136388 49833 171479 11473 252349 192258 158922 -138843 202559 91008 56572 -3191
13290 68275 350256 370754 56812 210843 76332 107062 208330 195322 177323 -68593 355012
13278 122012 4220 10204 -90028 -4728 -167509 152363 111114 280239 166329 -31731 245165
13266 497314 238072 328235 178039 -229219 112261 244449 172164 159831 75675 100684
13256 100684 213777 361978 49746 303765 162954 -81577 -176674 -40074 7245 89288 -42883
13244 -77218 -54467 407510 -146035 -89647 134387 -21280 449974 -115805 261777 22356
13233 36740 101730 383625 -53248 -54386 63808 356510 103088 160271 70440 167111 -143619
$$ packed form
13313C99115P2003A86474I0616g713A80942a61785B72867A29983J66772D2625
13302A36388D9833J21646A1473K40876o0091l3336a38843B02559I1008l4436c191
13290F8275K81981K0498E6812J54031G6332L0730J01268j3008j7999f8593C55012
13278A22012D220N984i0028d728j62781A52363m1249J69125j13910c1731B45165
13266D97314B38072R0163j50196b29219A12261J32188p2285j2333G5675K5009
13256A00684J13093J48201D9746K54019j40811h1577r5097d0074G245Q2043d2883
13244g7218K2751D07510a46035N6388A34387b1280D49974a15805B61777B2356
13233C6740O4990K81895e3248j138F3808K92702A03088N7183G0440R6671a43619
$$ plain form
13221 160738 274762 -106231 230327 404945 114076 -102482 194883 -60596 -94432 -235564
13211 -235564 -127029 83238 -252105 232640 201151 -205250 -78279 -23731 -99305 99810 116175
13200 116175 118774 -182680 128789 187744 -85743 -25864 285632 -40860 228197 197285 237970
13189 237970 302752 15517 -23168 -68943 316135 -109316 187438 6687 -42083 -35139 176492
13177 41231 -5092 -163548 321429 239653 374035 183216 125877 186610 231420 391704 163664
13165 441344 134872 139674 204395 -159633 193925 -208695 202575 96929 407777 -60195
13154 169025 244958 110847 127396 -103609 32820 104710 72945 -139160 -256403 195461
13143 322403 -94041 -167138 66143 492006 -137249 -8827 53575 -269058 -38639 82080 184490
$$ packed form
13221A60738J14024a06231B30327J74618A14076a02482A94883f0596l3836j41132
13211b35564J08535H3238b52105B32640l1489b05250g8279b3731p5574I9810J6365
13200A16175K599a82680A28789N8955h5743b5864B85632d0860B28197l0912M0685
13189B37970O4782A5517b3168m5775C16135a09316A87438F687d2083O944A76492
13177D1231e092j58456C21429q1776J34382A83216n7339O0733M4810J60284A63664
13165D41344A34872M802O4721a59633A93925b08695B02575I6929L10848f0195
13154A69025P5933A10847J6549a03609C2820P1890l1765a39160j17243A95461
13143C22403i4041p3097F6143M25863a37249h827E3575b69058c8639H2080J02410
$$ plain form
13132 184490 38986 -72855 -159434 -162690 -436969 93935 169729 118961 81271 6270 176875
13121 176875 -72233 260950 132570 95735 172568 164195 81621 54443 -68071 152714 -204298
13109 -226006 -200297 41934 -191276 8928 83011 -299584 376882 49866 83530 253660 -214011
13097 252085 97281 208625 348393 226312 127658 69133 174453 39365 -207948 -131199
13087 -131199 -292253 35280 38897 138316 157063 -304109 96243 -536 -27299 85538 37088 83633
13075 83633 383675 -187243 146792 -291358 -124943 49535 248495 -65264 -131354 -86614
13065 -86614 -174487 129630 15540 -88008 -160417 274829 655778 166199 345715 -77333 16560
13053 14794 494195 71864 229948 290962 -269337 318963 165077 -33009 -69968 161755
$$ packed form
13132A84490C8986g2855q6579l256k74279I3935P5794n0768l7690F270J70605
13121A76875g2233B60950j28380l6835P6833q373H1621k7178f8071A52714b04298
13109b26006K5709D1934a91276H928P4083b99584C76882D9866L3664J70130b14011
13097B52085I7281J11344J39768j22081r8654n8525J05320C9365b07948P6749
13087a31199j61054C5280L617R9419J8747c04109I6243e36k6763H5538C7088M6545
13075H3633L00042a87243A46792b91358a24943D9535J98960f5264o6090M4740
13065h6614q7873A29630A5540h8008p2409B74829L80949A66199J79516g7333A6560
13053A4794M79401G1864J58084O1014b69337C18963j53886c3009l6959A61755
$$ plain form
13042 457506 196632 3709 84886 146923 410961 300389 282862 187382 191435 478235 -145047
13030 340141 194761 195068 -44893 211117 247980 34137 108697 55920 135474 56736 -169089
13018 -111335 -214718 208831 -64474 334358 9666 56214 203466 152354 -628 163544 -208085
13006 -120694 343735 185681 -51025 308591 -119512 224897 240668 247131 -117601 324103
12995 -95739 -30838 263590 20507 -47456 -125415 34176 137379 -5684 186835 288029 584830
12984 584830 -56744 -133382 -272043 150915 144439 136872 261090 -6426 -75989 24551 -276937
12972 360232 347223 222566 137775 208187 165456 76682 426282 130827 36040 -218311 369900
12960 157974 -10644 317186 330547 -126140 -233555 92899 -35327 -226315 -185020 128992
$$ packed form
13042D57506A96632C709Q1177O2037K64038j10572j7527r5480M053K86800a45047
13030C40141j45380L07d4893B11117L6863C4137P4560n2777P9554E6736a69089
13018a11335j03383B08831f4474C34358I666M6548J47252n1112f28A63544b08085
13006a20694C43735j58054e1025C08591a19512B24897J5771O463a17601C24103
12995i5739c0838B63590B0507d7456p7959C4176J03203e684A86835J01194K96801
12984E84830e6744p6638j38661A50915o476p567J24218f426o9563B4551b76937
12972C60232j3009j24657q4791P0412m2731G6682L49600A30827C6040b18311C69900
12960A57974a0644C17186J3361a26140j07415I2899c5327j90988M1295A28992
$$ plain form
12949 315571 63404 -107748 277583 -165066 145824 -16480 -77327 151544 196488 -63256
12938 59361 219771 -188659 219775 44456 241260 5354 -27542 57361 -104592 -37778 -143498
12927 -143498 -194028 373439 117806 338228 233055 284780 -5352 96045 -107385 -390034
12917 -390034 -188 205046 30086 -94848 -146678 98221 -2810 9437 131784 192247 -217887 -17360
12904 -146162 -119973 -234246 -286101 -27716 -196613 33385 -31258 143746 128790 -154229 197122
12892 -380157 -32151 82084 -175332 -91834 -5168 156021 138017 223250 204238 11434 -17360
12880 238545 -230951 198440 -54640 108260 -268583 36116 -169271 8958 82895 -114983
12869 -21952 114900 -238617 68434 91542 45203 103087 100407 128738 88249 -28565 -169662
$$ packed form
12949C15571F3404a07748B77583a65066A45824a6480o0847A51544M4944f3256
12938E9361J60410a88659B19775D4456J96804E354b7542E7361a04592c7778j05720
12927a43498n0530C73439A17806K20422j05173N1725e352I6045a07385k82649
12917c90034a88B05046C0086i4848n1830I8221b810I437J22347O0463b17887a7360
12904a46162K6189j14273n1855b7716j68897C3385c1258A43746j4956a54229A97122
12892c80157c2151H2084a75332Q3498e168A56021j8004Q5233j9012A1434a7360
12880B38545b30951A98440e4640A08260b68583C6116a69271H958P3937a14983
12869b1952A14900b38617F8434K3108D5203N7884k680K8331m0489b8565j41097
$$ plain form
12858 -169662 164148 96734 -233158 -118179 285639 14746 257758 35296 267709 69200
12847 -26869 30485 282121 161025 390737 -393552 23779 -202220 157928 35564 -283758
12836 -186851 -160412 19031 -180648 -202799 -255490 61075 36481 -142642 81366 -57296 -144188
12825 -144188 181255 182245 -113722 -57391 -25340 258381 -119298 -7843 266905 346436 76218
12813 178464 -49725 -41500 -97345 -400193 154292 24068 130030 94183 128116 258856 27590
12801 95674 88574 199995 -31931 70845 99957 27668 -200477 70379 150686 266942 -95175
12789 29341 -118307 96466 -134796 -201344 -152149 -73528 -140387 113811 -339409 140784 -35560
12777 109497 215648 -174141 -117505 -312937 -200187 47912 12916 101826 -222422 99487
$$ packed form
12858a69662A64148o7414b33158J14979B85639A4746K43012C5296K32413F9200
12847b6869C0485K51636j21096K29712c93552B3779b02220A57928C5564b83758
12836a86851K6439A9031a80648k2151n2691F1075k4594a42642H1366e7296q6892
12825a44188A81255R90a13722N6331b5340B58381a19298g843B66905P9531G6218
12813A78464d9725Q225n5845l02848A54292B4068J05962l5847L3933J30740B7590
12801I5674p100J11421c1931G0845K9112B7668b00477G0379Q0307J16256i5175
12789B9341a18307I6466a34796o6548M9195g3528o6859A13811c39409A40784c5560
12777A09497J06151a74141N6636j95432J12750D7912A2916Q8910b22422I9487
$$ plain form
12766 19597 104635 -171534 -72969 -130774 -109301 -171272 -74721 -101877 28873 11774 107273
12755 107273 -96691 -146321 247229 33806 238272 -179013 -355953 100961 24455 72193
12745 72193 -121413 -175152 54545 34642 208999 347268 41804 422551 37498 34333 127605
12734 127605 162887 224914 4052 11268 56889 41002 93266 175288 -155946 -153003 -93798 -96210
12722 -96210 92751 234411 -107373 -135884 -436984 127126 129914 -265280 174926 -8877 139412
12710 202117 111056 195139 155718 204675 161538 481691 530577 127893 371855 17997 268510
12699 268510 88156 -237612 176439 21414 -206813 21716 -59540 88324 276270 31040 -112527
12687 65443 -132332 -34686 159000 94796 -314828 351208 115053 454220 154808 -103624
$$ packed form
12766A9597Q5038a71534g2969n7805K1473o1971g4721k7156B8873A1774R5499
12755A07273i6691m9630B47229C3806K04466a79013j76940A00961B4455M7738
12745G2193a21413n3739E4545j9903J74357J38269D1804L80747C7498l165R3272
12734A27605L5282O2027D052P216M5621j5887N2264Q2022a55946K943N9205k412
12722i6210I2751J41660a07373k8511l01100A27126K788b65280A74926h877A39412
12710B02117r1061Q4083l9421M8957m3137L20153M8886A27893K43962A7997K50513
12699B68510H8156b37612A76439B1414b06813B1716e9540H8324J87946C1040a12527
12687F5443a32332c4686A59000o4204c14828C51208A15053L39167A54808a03624
$$ plain form
12676 -144447 45814 -10671 131710 307121 434869 216415 6304 180865 217711 229380 100592
12664 36913 -175556 11796 -82051 53780 5178 -100615 266662 203263 121889 -481441 -82784
12652 183030 277996 219624 -141874 -384890 154856 69554 123975 -54529 216500 -163129
12641 231599 -228425 197428 -31069 237192 74790 383757 44727 99243 77903 175618 115007
12630 115007 62666 188644 181856 39455 102080 373503 3461 17322 -861 -11960 375935 -179218
12617 33084 -141195 156492 -11333 27146 -25238 166067 90451 -346439 -7049 -40030 226580
12605 -25574 35442 122135 25508 -91907 -7625 -229073 166223 -148691 -136468 206932 -239186
12593 -125013 -360730 -192534 -153123 105407 256425 -67715 202959 -146957 -207376 235447
$$ packed form
12676a44447D5814a0671A31710J75411J27748B16415F304J74561L6846J1669A00592
12664C6913a75556A1796h2051E3780E178a00615B66662o3399q1374d81441h2784
12652A83030R4966n8372a41874k43016A54856F9554N4421e4529B16500a63129
12641B31599b28425A97428c1069B37192G4790L08967D4727N4516k1340R7715o0611
12630A15007n2341J25978o788C9455O2625K71423C461J3861h61j1099C75935a79218
12617C3084a41195A56492a1333B7146b5238A66067p5616c46439g049l2981B26580
12605b5574C5442Q6693B5508i1907g625k21448A66223a48691J2223B06932b39186
12593a25013k35717J68196L9411A05407J51018f7715B02959a46957o0419B35447
$$ plain form
12582 146628 -292198 130880 -132214 367226 -19404 203914 250768 217509 -6204 38466 180076
12571 180076 -98657 272053 -2313 -283236 564898 -71593 222915 -243953 -17254 -98350 -136208
12560 -136208 -12194 -181000 56923 13284 -94014 -102153 -444012 -359825 -26264 -147118 20227
12548 118792 38492 15721 29345 -349277 -167527 101255 104565 -171596 -98372 -325956 418732
12536 -15537 -18743 9274 -314571 194558 -372954 173236 71534 137720 61266 -349163 206336
12524 330853 -191425 220477 -287629 -30193 134467 -113815 -46763 23273 19309 151910
12514 151910 -291284 435 8535 262095 20988 -417643 217585 139311 21632 -185946 -215950
12503 -215950 -72481 -125254 -16423 -302658 5415 -235020 182876 -171464 -77948 -86661 -161509
$$ packed form
12582A46628b92198A30880a32214C67226a9404B03914M6854l3259f204C8466J41610
12571A80076i8657B72053b313k80923E64898g1593B22915b43953a7254q1096l7858
12560a36208a2194j68806E6923A3284i4014q139l41859Q4187b6264j20854B0227
12548A18792C8492A5721J3624c49277a67527A01255L310a71596P3224k27584D18732
12536a5537l206I274c14571A94558c72954A73236G1534O6186F1266c49163B06336
12524C30853a91425B20477b87629c0193A34467a13815d6763B3273l964J32601
12514A51910b91284D35Q100K53560B0988d17643B17585p8274B1632a85946l0004
12503b15950g2481n2773a6423k86235E415b35020A82876a71464g7948q713p4848
$$ plain form
12492 -161509 -130951 -67235 -68868 243167 -101982 127971 -96401 8879 -177035 541533 -166746
12480 64542 -12669 -122733 -78347 118335 -75307 29673 -262043 -281054 -204107 -189060 -310619
12469 -310619 50664 43666 -89292 31765 24962 -94979 400481 -131018 -192945 155598 -315954
12457 -88819 -33408 103256 79501 -46358 39108 -216470 271356 -330095 115136 -83279 -384073
12446 -384073 18825 -379226 124923 180428 41709 86431 94184 -216800 24312 -281011 -265895
12435 -265895 -161949 37398 -72531 -65072 210811 401558 -300219 -106341 -97926 -336090 -24414
12423 -153907 60163 -26669 30608 -111589 248529 -125741 -128798 -70059 10076 50173 85498
12412 85498 -99143 -216749 -108212 -51240 26851 153427 -212003 -439864 255009 -49731
$$ packed form
12492a61509L0558O3716j633B43167a01982A27971i6401H879a77035E41533a66746
12480F4542a2669j10064M4386A18335g5307B9673b62043j9011P6947J5047j21559
12469c10619E0664o998h9292C1765o803i4979D00481a31018o1927A55598c15954
12457h8819c3408A03256k3755d6358C9108b16470B71356c30095A15136h3279l00794
12446c84073A8825c79226A24923N5505D1709M4722P753b16800B4312b81011J5116
12435b65895J03946C7398g2531P459B10811J90747c00219a06341Q415k38164b4414
12423a53907F0163b6669C0608a11589B48529a25741l057N8739A0076M0097L5325
12412H5498i9143j17606a08212e1240B6851J26576b12003k27861B55009d9731
$$ plain form
12401 -717 -35042 -169184 -27084 -193130 -375983 221988 -31441 329408 -103235 35490 -61765
12389 31897 232206 -29754 202296 76028 16706 129950 -229519 113245 191617 -156020
12378 66701 -69209 369833 37835 73850 260529 355698 93104 100638 75752 274107 -119159
12366 105973 27493 -20050 -185098 22291 161782 -27768 12346 102606 238118 177115 189423
12355 189423 39218 175244 -66278 -391345 101743 25914 -137994 19329 104877 -161261
12344 242669 199168 -95812 -145905 -10939 -135261 -21187 -128104 -269927 258518 -48705 101919
12332 -63387 143177 -60009 251749 102676 70528 241340 130151 273792 319751 -20993
12321 22682 265515 -44783 -60469 343388 104861 341210 93228 216627 129834 180572 36265
$$ packed form
12401g17l4325j34142b7084j66046j82853B21988c1441C29408a03235C5490f1765
12389C1897K00309b9754B02296G6028A6706J13244b29519A13245P8372a56020
12378F6701f9209C69833C7835L6015J86679R5169I3104P534k4886J98355a19159
12366A05973B7493b0050j65048B2291J39491b7768A2346R0260J35512o1003J2308
12355A89423C9218J36026f6278l25067A01743B5914a37994A9329Q5548a61261
12344B42669m3501i5812n0093a0939j24322b1187j06917j41823B58518d8705A01919
12332f3387A43177f0009B51749A02676l2148J70812j11189J43641M5959b0993
12321B2682K42833d4783j5686C43388A04861K36349I3228J23399q6793N0738C6265
$$ plain form
12309 230950 97999 231475 263205 35212 278989 -129883 -100215 214447 473937 189536
12298 -218398 -48715 282667 87226 175469 104281 447492 49566 -34536 238030 145726 230058
12287 230058 -63694 247908 110272 246885 -153550 48348 172524 135920 325032 370276
12277 370276 82779 206829 270240 282827 -50664 -37832 221601 -16656 61927 -9348 313033
12265 198961 317170 355125 461178 177175 33478 73709 175933 121856 -121763 374179
12254 -34964 -213294 413203 282837 292280 241601 122301 237711 299682 -294083 285045
12243 270975 400021 -72014 546037 162296 274180 244140 152274 78570 -160675 136950
12232 88092 303078 -44303 -28108 -65131 74495 181592 429758 340965 175130 158920 169734
$$ packed form
12309B30950I7999J33476L1730C5212K43777a29883K9668B14447K59490A89536
12298b18398d8715B82667H7226Q8243p1188L43211D9566c4536B38030r2304Q4332
12287B30058f3694B47908A10272J36613a53550D8348J24176l6604J89112M5244
12277C70276H2779J24050O3411J2587e0664J2832B21601a6656F1927i348C13033
12265A98961J18209L7955J06053A77175C3478M0231J02224n4077a21763C74179
12254c4964j78330D13203j30366R443n0679j19300J15410O1971b94083B85045
12243B70975J29046g2014E46037A62296J11884l0040r1866p3704a60675A36950
12232H8092K14986d4303J6195l7023G4495J07097K48166q8793j65835j6210J0814
$$ plain form
12221 169734 269373 228012 397181 272063 99731 245205 196763 330467 92625 -69555 327583
12209 145876 -65170 260950 -78119 224585 22221 72870 385853 119404 22405 -88286 153381
12197 117947 506653 360859 -262815 69193 246411 271629 149377 343014 218542 395886
12187 395886 53743 345309 134161 355296 -280697 -58129 62749 7255 258957 21674 315104
12176 315104 -17966 303466 239053 -126559 386037 222837 33610 196151 241242 33428
12165 41334 432806 318814 232560 79718 357634 198258 561632 105078 -173923 312790
12154 95626 273253 57277 225254 45175 197153 158635 96317 31262 85684 -220244 96378
12142 98418 248989 333534 -176147 113535 -382966 136426 -23397 -158206 214089 335987
$$ packed form
12221A69734R9639m1361J69169j25118I9731J45474m8442J33704I2625f9555C27583
12209A45876f5170B60950g8119B24585B2221N0649L12983A19404B2405h8286A53381
12197A17947L88706j45794b62815F9193J77218K5218j22252J93637j24472J77344
12187C95886E3743K91566A34161K21135b80697e8129F2749G255K51702B1674K93430
12176C15104a7966C03466o4413a26559C86037j63200C3610J62541M5091C3428
12165D1334L91472j13992q6254G9718K77916j59376L63374A05078a73923C12790
12154I5626J77627E7277J67977D5175J51978l8518o2318C1262N4422b20244I6378
12142I8418J50571Q4545a76147A13535c82966A36426b3397j34809B14089J21898
$$ plain form
12132 335987 -97638 145519 384838 131192 273772 -48994 120818 -104464 -31820 180554
12121 -30926 231610 128497 420170 317541 -155560 349968 249881 215297 348090 397349
12111 397349 217097 -16916 -217938 -173891 152644 -196292 -180490 115195 110171 264850
12101 264850 26059 -170681 -67064 -104386 65743 -4869 -37716 144378 -123418 29297 -157697
12089 -92020 58343 225073 -118812 -101862 -143017 -54038 337213 22903 268396 -238406 315375
12077 126933 99174 -157944 99618 7067 370773 246198 -107614 174642 25660 246709
12067 246709 275706 45362 105746 182975 640829 165017 350796 380375 86549 205462 160401
12056 160401 223885 317425 267222 389562 -103785 515654 257652 267640 -4715 64344 -13964
$$ packed form
12132C35987i7638A45519K39319A31192J42580d8994A20818a04464c1820A80554
12121c0926B31610j03113K91673j02629a55560C49968j00087l4584J32793M9259
12111C97349j80252a6916k01022M4047A52644a96292J5802A15195n024J54679
12101B64850B6059a70681f7064l7322F5743d869l2847A44378a23418B9297a57697
12089i2020E8343J66730a18812J6950m1155e4038C37213B2903K45493b38406C15375
12077A26933k7759a57944I9618G067L63706j24575a07614A74642B5660K21049
12067B46709K8997D5362O0384P7229M57854A65017J85779K9579H6549J18913m5061
12056A60401O3484R3540n0203J22340a03785E15654B57652R988d715F4344a3964
$$ plain form
12044 304561 40500 -115688 -20428 -162128 253557 145029 -109627 -196451 101420 110395
12034 110395 92257 -246277 -34829 -233615 -278649 4788 491803 -152073 418323 65115 58247
12023 58247 -110466 -126710 -58319 365611 -6963 57134 57746 111505 165500 184981 -122579 -162286
12011 -162286 408273 68612 233244 -100536 8443 43611 -23582 -155534 258978 -53063 -52935
12000 -52935 279946 -95079 70612 -83718 -168550 -22686 164052 469652 30773 306413 30338
11988 341080 195416 26571 -250154 4572 -350739 1702 125508 198489 271 -66594 -54302
11977 -54302 155246 86998 121378 -454589 -47252 -45298 169630 -144093 98236 -49861 -8664
11965 -352759 15930 -118789 -148986 -32850 301758 -197400 126986 3383 -18864 210055 -81954
$$ packed form
12044C04561D0500a15688b0428j41700B53557j08528a09627q6824A01420Q975
12034A10395j8138b46277c4829j98786m5034D788M87015a52073D18323F5115o868
12023E8247a10466j6244e8319C65611f963E7134O12N3759N3995J9481a22579l9707
12011a62286D08273F8612J64632a00536H443L5168b3582j31952B58978e3063J28
12000e2935B79946i5079G0612h3718q4832b2686A64052L05600C0773K75640C0338
11988C41080j45664B6571b50154D572c50739A702J23806P2981B71f6594J2292
11977e4302A55246o8248L4380d54589d7252J954A69630a44093I8236d9861h664
11965c52759A5930a18789l0197c2850C01758a97400A26986C383a8864B10055h1954
$$ plain form
11953 361661 298623 -87791 -60944 194609 4922 343044 -40183 -114909 144497 -4276 -82422
11942 -82422 -66246 149225 1794 -386555 229165 36629 -64880 -64899 -41072 376345 -256944
11930 2503 -245177 208857 166688 71389 1604 15077 -115119 34004 66242 39421 50255
11919 50255 -247228 -2691 -24910 112962 -21375 -109603 -39708 54700 -219864 42749 60642
11908 60642 36541 -137856 60161 -35636 169069 27177 -145043 89823 274575 -128420 -202133
11897 -202133 -21968 -328023 -552117 -276391 -107200 -73042 103618 -205106 -109444 48550
11886 -345150 -108125 -55204 -61668 -51430 18178 -84320 87476 34444 -122465 -146356 -461776
11875 -461776 130665 -174361 -298930 -185205 -126454 84317 58480 -188508 -69588 250835
$$ packed form
11953C61661o3038h7791K6847A94609D922L38122d0183p4726A44497d276p8146
11942h2422J6176A49225A794c86555B29165C6629f4880j9K3827C76345b56944
11930B503b45177B08857m2169G1389A604J3473a15119C4004L2238k6821J0834
11919E0255b47228b691k2219A12962b1375q8228c9708E4700b19864D2749J7893
11908F0642k4101a37856F0161c5636A69069B7177a45043H9823J84752a28420p3713
11897b02133b1968l06055k24094K75726a07200L4158A03618b05106R5662D8550
11886c45150a08125N2921o464J0238A8178h4320H7476C4444a22465k3891l15420
11875d61776A30665a74361j24569J13725N8751H4317k5837a88508f9588B50835
$$ plain form
11864 -197378 193435 35106 157906 -117959 -132336 123475 -231718 -120766 322904 -67949
11853 -115513 -280685 -121888 -58323 371822 -341687 251391 -76816 383989 114756 -163543
11842 141667 -286903 101874 -484119 -122000 -89299 93115 -248297 -20976 -102682 -172533
11832 -172533 36968 46466 -123425 78964 147510 -66814 327926 159522 22073 316056 -71092
11820 -202166 -169525 -160355 -62927 95727 205291 169291 -167583 -93622 -36287 -53731 79091
11808 -6528 82151 5627 17588 163460 34584 132564 206081 -237974 -117766 -262476 14184
11796 208644 54177 -200460 -33635 -90454 -138928 43773 -111917 -190095 -234814 -22375 104936
11784 -154800 129828 -293968 -124725 298559 -283481 115834 192803 -176896 104411 34034
$$ packed form
11864a97378A93435C5106J22800a17959j4377A23475b31718J10952C22904f7949
11853a15513j65172a21888e8323C71822c41687B51391g6816C83989A14756a63543
11842A41667b86903A01874d84119a22000L2701I3115b48297b0976q1706o9851
11832a72533C6968R498a23425G8964O8546f6814C27926A59522B2073K93983g1092
11820b02166L2641R170f2927I5727J09564l6000a67583P3961c6287j7444G9091
11808f528H2151E627J1961J45872C4584R7980P3517b37974a17766j44710A4184
11796B08644E4177b00460c3635n6819m8474D3773a11917p8178m4719b2375A04936
11784a54800A29828b93968a24725B98559b83481A15834P6969a76896A04411C4034
$$ plain form
11773 -164710 98632 68005 -150829 47284 9591 128088 189669 33784 41513 -189624 -34847
11761 -146147 335265 126628 223002 132020 -288454 -234077 -98856 145196 -86512 -107413 -52770
11749 371767 -52709 -311184 90203 -218765 -55116 90602 125797 -132037 -52204 -239659 -143190
11738 -143190 -80329 1677 -277772 -31330 -241863 189112 60278 -410623 150131 -114814
11727 -100178 306305 -101286 -6240 111680 194969 52626 28359 -214010 -126942 -114757 -131850
11716 -131850 3153 -233004 -208621 -125190 -81427 138262 -149808 -158831 -276042 100045 172021
11705 172021 8218 -77435 132691 47911 249671 -260713 369158 88558 -121813 -148304 -95486
11694 -95486 -78665 75077 276682 -231647 85919 -23224 243419 -170060 -37424 -35824 87645
$$ packed form
11773a64710I8632l0627a50829D7284I591J18497O1581C3784P729a89624c4847
11761a46147C35265A26628R6374r0982b88454N4377i8856A45196h6512k0901e2770
11749C71767e2709k58475I0203b18765e5116I0602L5195a32037e2204j87455R6469
11738a43190O2861A677b77772c1330k10533A89112F0278d10623A50131a14814
11727a00178C06305a01286f240A11680Q3289E2626k4267b14010Q7068J2185j7093
11716a31850C153b33004K4383Q3431M3763A38262a49808r023j17211A00045P1976
11705A72021H218g7435A32691D7911K01760b60713C69158H8558a21813k6491N2818
11694i5486J6821G5077K01605b31647H5919b3224B43419a70060c7424J600H7645
$$ plain form
11682 126642 546514 -43414 207946 -36869 73883 -3275 195851 2843 96482 155124 -79222
11670 61665 231576 247504 -185855 60591 174249 150084 -494046 365875 -196266 -353644
11660 -353644 168993 428351 -293304 -11713 -48846 109933 -39322 109589 -107246 -327060
11650 -327060 91332 71235 259152 -105481 207088 -236471 81183 251495 -157593 -170733
11640 -170733 -82001 -132910 -158376 -41143 -8582 -119451 104407 -170741 116143 -72872 -213935
11629 -213935 195503 -78796 -105399 -51951 106759 258810 -29434 -87803 47789 162362 -17292
11617 27191 -133938 -35721 131051 154327 -204918 72294 168521 25510 70307 -94845 242836
11605 228528 -203416 107082 -509251 -52616 190318 -112049 212136 163342 -74596 -3592
$$ packed form
11682A26642M19872d3414B07946c6869G3883c275A95851B843R3639N8642g9222
11670F1665J69911J5928a85855F0591J13658k4165d94046C65875a96266j57378
11660c53644A68993K59358b93304a1713l7133A09933c9322A09589a07246k19814
11650c27060I1332k0097J87917a05481B07088b36471H1183J70312a57593j3140
11640a70733h2001n0909k5466d1143h582j10869A04407a70741A16143g2872j41063
11629b13935A95503g8796k6603e1951A06759J52051b9434n8369D7789J14573a7292
11617B7191a33938c5721A31051K3276b04918G2294R6227B5510M4797i4845B42836
11605B28528b03416A07082e09251e2616A90318a12049B12136m8794g4596c592
$$ plain form
11594 347216 136027 260792 -90299 252546 99556 -36911 59800 -316583 -193701 161869
11583 -193261 29413 9127 25373 367981 -48416 189495 -164832 343733 152313 159727 327822
11572 327822 133709 249831 58252 -96511 524742 303029 104833 110200 177574 -30245 94909
11560 74937 51706 3927 -65251 139480 39069 -158033 65921 -396484 106044 -116224 220549
11548 210139 6855 -11137 -40609 -81243 39120 -31725 244753 198080 104322 -54394 292331
11536 156179 148308 169338 16340 -292925 304748 -26627 300836 -76194 -16604 195312 119088
11525 119088 517278 21668 -40043 -168426 80341 -247628 251396 -111743 444956 -136850
11514 -81113 -40197 39075 102396 226142 249108 -69961 322321 -243081 184750 -160655 147082
$$ packed form
11594C47216A36027J24765i0299B52546I9556c6911E9800c16583J22882A61869
11583a93261B9413I127J6246L42608d8416A89495a64832C43733A52313P414J68095
11572C27822A33709J16122E8252i6511E24742k21713A04833N367O7374c0245I4909
11560G4937k3231C927f5251A39480C9069a58033F5921c96484A06044a16224B20549
11548B10139F855a1137k9472m0634C9120c1725B44753m6673r3758e4394B92331
11536A56179p871K1030A6340b92925C04748b6627C00836g6194a6604A95312p6224
11525A19088L98190B1668d0043j28383H0341b47628B51396a11743D44956a36850
11514h1113d0197C9075O3321J23746K2966f9961C22321b43081A84750a60655A47082
$$ plain form
11502 388700 261097 -41086 -121037 620695 178113 129423 3552 -118823 -228879 39197 -155192
11490 -36280 201304 -77626 250934 -247157 25744 105062 63055 -217558 67660 82314 40986
11478 197997 131459 224001 -121632 231086 -455223 -192867 155491 307582 505229 87701
11467 -277827 32382 156774 -185873 171317 -79955 -167529 247002 250376 165332 255189 160017
11456 160017 -12049 -100976 -78096 126298 100375 -160484 111200 126643 -71681 -7421 433075
11444 -74550 575570 21341 -180091 273898 318377 106021 -274165 -222860 196666 -217377
11433 -117576 94050 107649 -3548 300673 166300 3227 224097 160737 -40746 36566 -84659
11421 231294 67011 -22151 161025 -29900 106181 -91110 -70754 -178670 -149394 203438 79040
$$ packed form
11502C88700j27603d1086p9951F20695A78113m8690C552a18823j10056C9197a55192
11490c6280B01304g7626B50934b47157B5744P9318m2007b17558F7660J4654D0986
11478A97997o6538R2542a21632B31086d55223a92867A55491J52091J97647H7701
11467b77827C2382J24392a85873A71317g9955q7574B47002L374q5044Q9857r5172
11456A60017a2049q8927K2880A26298k5923a60484A11200J5443g1681g421D33075
11444g4550E75570B1341a80091B73898M4479A06021b74165N1305A96666b17377
11433a17576I4050J3599c548C00673j34373C227K20870o3360d0746C6566h4659
11421B31294F7011b2151A61025b9900A06181i1110K0356j07916K9276B03438G9040
$$ plain form
11409 355567 -175693 -118515 67487 37227 158187 -34872 -349419 254758 -125445 -73205
11399 -73205 -78 -221123 -9935 285916 -62630 -198424 -40407 -254249 241923 36880 416843
11388 416843 176490 -91125 -75421 -451463 -161678 168508 -143641 1437 -73904 -359 10693
11376 23552 142971 116439 160583 222764 164985 -217967 77358 22994 69321 -132149 74731
11364 -102169 6336 -92015 -3837 -267961 310362 26307 69465 -160914 22315 34550 -167047
11352 3468 -174145 106058 -19245 -142370 157872 -162335 -161858 112166 -132075 289861 -42135
11340 -199267 41291 48022 233271 225739 -180318 -251226 129270 43828 -167819 -212302 256326
11328 -154889 -57063 54357 138703 -205476 174505 -82899 182555 -171127 -376345 57218
$$ packed form
11409C55567a75693N7178F7487l0260J20960c4872l14547B54758a25445N2240
11399g3205g8k21045i935B85916f2630j35794d0407k13842B41923C6880L79963
11388D16843A76490i1125J5704l76042a61678A68508a43641A437g3904c59A0693
11376B3552J19419k6532M4144O2181n7779b17967G7358B2994M6327a32149G4731
11364a02169F336i2015c837k64124C10362B6307M3158a60914B2315J2235a67047
11352C468a74145A06058a9245j23125A57872a62335M77A12166a32075B89861d2135
11340a99267D1291O731J85249p532a80318p0908A29270D3828a67819m4483B56326
11328a54889e7063E4357Q4346b05476A74505h2899A82555a71127k05218E7218
$$ plain form
11317 -95772 -54025 60675 17484 50253 35800 -130135 -79573 -386711 -45649 -212932 -91092
11305 121826 -124943 -254178 -86267 -86701 -185315 13641 294344 30205 -104345 -331907 -190310
11294 -190310 -182339 -373065 -197690 118945 -43906 -30543 -194131 -74376 -197596 118376
11283 209289 -132466 -182292 38839 128718 -262225 -366391 341826 2658 1180 10790 74624
11272 74624 337506 57906 -111754 -105178 56315 -177421 -211917 175159 -263896 18977 -119615
11260 202239 -64436 219674 -214710 -59521 46880 -124276 -22875 -158857 -287501 -79364
11249 58032 -269259 -4969 44807 102250 -174545 -443039 274041 234463 -12171 257445 79154
11237 54702 -69412 110161 59297 59092 65942 -145191 9399 -203234 -57022 -45818 158702 -114497
$$ packed form
11317i5772M1747F0675A7484L2769j4453a30135N0562l07138d5649j67283i1092
11305A21826a24943j29235h6267m34r8614A3641K80703C0205a04345k27562J41597
11294a90310P971j90726J75375A18945d3906J3363j63588g4376j23220A18376
11283B09289a32466m9826C8839Q9879b62225j04166C41826B658A180R610O3834
11272G4624K62882E7906a11754O576E6315a77421l4496A75159b63896A8977a19615
11260B02239f4436B19674b14710e9521D6880a24276b2875j35982j28644g9364
11249E8032b69259d969D4807N7443a74545k68494B74041l9578a2171B57445G9154
11237E4702f9412A10161n0864k05O850a45191I399b03234e7022J1204A58702a14497
$$ plain form
11224 77152 -82697 100603 -32284 -57444 -111434 -161111 182896 -88213 26806 -25251 -70153
11213 -70153 -253823 -121921 -133344 -294309 215673 359724 -222508 -74969 -100593 216779
11202 -155175 225334 11679 -234217 12025 -60405 -70771 -71569 -204498 -65393 12422 19174
11191 19174 21502 -36756 -127382 -87318 -171986 -95313 -13189 -165547 -54628 -261549 93969
11179 -523086 -48667 -242599 -149520 294606 -125149 -446233 -222017 268637 294732 219066
11169 219066 -50064 15344 -279462 -35112 -281530 -81791 -50959 -81868 121865 70163 208862
11158 208862 -104532 35829 289649 -77374 268093 19114 -283633 -257431 -164633 137667
11147 -66277 307466 59940 -75784 42564 -175876 -140912 -7925 -214134 -114817 44663 35941
$$ packed form
11224G7152h2697A00603c2284k5160n3990m9677A82896h8213B6806b5251m4902
11213g0153j83670a21921j1423j60965B15673J44051b22508g4969k5624B16779
11202a55175B25334A1679b34217A2025f0405j0366p98j32929f5393A2422O752
11191A9174K328c6756r0626M0064q4668P6673a3189j52358e4628k06921I3969
11179e23086d8667j93932R3079B94606a25149l21084b22017B68637K6095p5666
11169B19066e0064A5344b79462c5112k46418h1791L0832l0909A21865n1702J38699
11158B08862a04532C5829K53820g7374B68093A9114b83633K6202R2798A37667
11147f6277C07466E9940g5784D2564a75876L4964g925k06209R9317D4663q722
$$ plain form
11136 35941 423035 144042 6269 122527 99211 -196531 -50292 -82328 194414 5915 119979
11125 119979 -291729 -164533 -159968 169442 -580605 101998 273910 -158194 -47718 324934
11114 214030 -200803 -49389 216832 213176 269281 -47282 76026 -331777 -75301 7511 15597
11103 15597 221550 408274 -28719 222282 194906 406950 83564 -308583 136125 226775
11093 226775 149015 -79516 56484 11533 -2948 -149031 54000 134966 115221 133790 335948
11082 335948 359865 262728 268463 218246 25619 439832 20362 103907 292297 -124735 19639
11070 71411 117255 338050 94312 352575 175389 427708 328490 438916 391113 420216 284745
11059 284745 377356 482685 304891 341159 616703 695541 432063 474120 608727 603356 432991
$$ packed form
11136C5941L87094A44042F269J16258k3316a96531e0292l2036A94414E915J14064
11125A19979b91729J27196M565A69442e80605A01998J71912a58194d7718C24934
11114B14030b00803d9389B16832l656N6105d7282G6026c31777g5301G511Q086
11103A5597K05953J86724b8719B22282k7376K12044H3564c08583A36125R0650
11093B26775p7760g9516E6484A1533b948j46083E4000Q0966j9745J8569K02158
11082C35948K3917r7137N735n0217B5619M14213B0362Q3545J88390a24735A9639
11070G1411M5844K20795I4312K58263A75389K52319r9218J10426m7803K9103j35471
11059B84745R2611J05329j77794L6268K75544P8838k63478M2057J34607n371j70365
$$ plain form
11048 432991 741906 739099 561016 608867 455633 467683 412141 931908 587093 992719
11038 992719 596987 685375 911864 399468 530521 599409 663006 734098 244356 708450
11028 708450 408912 275434 362103 442010 605330 658467 564902 715358 560303 389373
11018 389373 501846 606931 198446 493423 248002 878614 590968 716865 551256 334894
11008 334894 679462 224339 159304 531109 686845 731647 425237 663976 437399 545816
10998 545816 370219 658102 542029 636803 364138 780527 615081 589950 551548 791881
10988 791881 431608 263546 635789 690468 566213 693993 887054 1031055 992892 693644
10978 693644 992211 821154 1272407 1351190 1023948 1384211 1662341 1592117 2088435 2155994
$$ packed form
11048D32991L08915k807j78083M7851j53234J2050n5542N19767l44815M05626
11038I92719l95732Q8388K26489C99468J31053O8888O3597P1092B44356M64094
11028G08450k99538j33478Q6669P9907J63320N3137r3565J50456j55055j70930
11018C89373J12473J05085A98446K94977k45421O30612k87646J25897j65609k16362
11008C34894L44568B24339o5035L71805J55736M4802l06410K38739k26577J08417
10998E45816j75597K87883j16073R4774k72665M16389j65446k5131l8402K40333
10988G91881l60273j68062L72243N4679j24255J27780J93061J44001l8163k99248
10978F93644K98567j71057M51253P8783l27242L60263K78130p0224M96318O7559
$$ plain form
10968 2155994 2213860 2473119 2216354 2374828 2079115 1872982 2041443 2078867 1662161 1777393
10958 1777393 1914434 1479082 1670776 1699565 1916267 2153630 1987665 2123362 1873632 1898611
10948 1898611 1482921 1090596 917689 552418 483776 549184 330651 267430 219691 87075
10937 294107 -90070 209886 -102665 193661 301539 5245 98735 121590 -43934 276568 -21725
10925 60388 31973 182792 -103500 5363 198818 358843 40832 86040 -4394 119026 76788
10914 76788 75577 -283335 -90676 196810 135470 54371 -258861 113509 -205233 -99016 122285
10902 46956 134839 -123344 -11692 -393981 315499 16658 -142602 -221004 -302238 44432 -95647
10890 182783 -317167 -27080 -336321 39917 -245206 41094 -182321 71083 86862 -275846
$$ packed form
10968B155994N7866K59259k56765J58474k95713k06133J68461L7424m16706J15232
10958A777393J37041m35352J91694K8789K16702K37363j65965J35697k49730K4979
10948A898611m15690l92325j72907l65271o8642O5408k18533o3221m7739H7075
10937B94107i0070B09886a02665A93661J07878E245R3490K2855d3934B76568b1725
10925F0388k8415J50819a03500E363J93455J60025D0832M5208d394A19026m2238
10914G6788j211b83335i0676A96810o1340E4371b58861A13509b05233i9016A22285
10902D6956Q7883a23344a1692l82289C15499A6658a42602p8402q1234D4432i5647
10890A82783c17167b7080l09241C9917b45206D1094a82321G1083J5779b75846
$$ plain form
10879 373405 -77917 -192006 -6556 262102 -8463 -66424 44329 -235151 95979 69137 77102
10868 77102 14588 -47437 -134280 -148367 62666 -283387 174111 -353758 68426 -18438 -196919
10857 -196919 -376353 -164040 -19756 -298170 91009 -137754 259394 49631 -102790 -20933
10846 210901 45683 225423 65905 6534 233221 36175 40633 89061 -16538 254778 -53801
10834 -85378 -30742 -5930 -75417 85940 -34013 -197702 -184807 -228462 -2098 289938 -34565 -155496
10822 -155496 106622 -50555 -107854 -120222 -180657 -120519 227929 -60885 -65702 -29341 350855
10810 -219263 -400707 -59649 113171 -128244 -115705 234021 -115988 -454748 -21032 -428298
10800 -428298 -115432 -133164 177801 200187 -137816 -170024 73633 -215965 -175414 -71903 -32891
$$ packed form
10879C73405g7917j14089f556B62102h463n7961D4329b35151I5979k6842P965
10868G7102A4588d7437q6843j4087F2666b83387A74111c53758F8426a8438j78481
10857a96919j79434a64040a9756k78414I1009a37754B59394D9631a02790b0933
10846B10901D5683J79740F5905F534K26687C6175M458M8428a6538B54778e3801
10834h5378c0742e930o9487H5940c4013j63689J2895m3655b098B89938c4565j20931
10822a55496A06622e0555n7299j2368o0435O0138B27929f0885m817b9341C50855
10810b19263j81444e9649A13171a28244J2539B34021a15988l38760b1032m07266
10800d28298a15432j7732A77801K2386a37816l2208G3633b15965M0551g1903c2891
$$ plain form
10788 -43558 138144 -217888 57091 -385774 236330 -71435 -91573 146506 -117343 81267
10777 179612 -32041 -286082 -2204 -401228 91202 226045 144583 -88207 -198746 213270 -294982
10765 -112873 -125701 44440 -240283 -229430 -30338 24774 -7131 187990 -92373 -241595 -8313
10753 -236865 -240900 -239417 -111055 -290035 -230766 40917 84429 -231592 583 -454665 -192680
10741 51736 -202195 -206191 -367436 86348 -35133 -50456 -194136 -104175 -302207 152444 -53800
10729 -128051 -103736 134932 -185061 68454 247796 -88473 -147564 -144403 -178648 -76339 -382162
10718 -382162 -120347 -239198 9007 -69770 110703 -11829 -139360 67918 -63226 88476 247999
10707 247999 173241 400316 -106556 350832 9040 -287454 -203752 158292 -307147 -50762
$$ packed form
10788d3558A38144b17888E7091c85774B36330g1435k0138A46506a17343H1267
10777A79612c2041k54041b204l99024I1202J34843q1462h8207j10539B13270b94982
10765a12873j2828D4440b40283J0853c0338B4774g131A87990i2373j49222h313
10753b36865m035J483a11055j78980N9269D0917M3512b31592E83d54665a92680
10741E1736b02195l996j61245H6348c5133j5323j43680Q9961j98032A52444e3800
10729a28051K4315A34932a85061F8454J79342h8473n9091L161l4245g6339l05823
10718c82162a20347j18851I007f9770A10703a1829j27531F7918f3226H8476J59523
10707B47999p4758K27075a06556C50832I040b87454Q3702A58292c07147e0762
$$ plain form
10696 26557 -87642 217140 123522 -252664 42269 -108786 -140724 -281986 137858 11052 81971
10685 81971 242821 -171413 -61211 148228 -174553 144706 -90818 -186362 -346090 214 -335310
10673 -327087 -98623 332336 -141471 50361 62027 -1271 -100832 105950 -65178 -424957 -106359
10661 -148543 61702 27836 -67802 -210827 -303385 -234932 -272806 -167793 -262079 -132754 28445
10649 -202044 -66107 -56660 19708 -164716 -16771 203502 -91652 -316610 -190905 -264287 -171055
10638 -171055 89288 -173308 161079 -15298 -7934 67109 -15696 -453935 -198399 61811 -243945
10626 50449 138745 143069 -342601 67137 -213810 -34709 159806 198079 -35592 82278 112339
10615 112339 163154 -1599 -9544 -333980 -21362 -221320 -140236 -210076 -184268 -328808 -87620
$$ packed form
10696B6557h7642B17140r3618b52664D2269a08786l1938j41262A37858A1052P0919
10685H1971J60850a71413f1211A48228a74553A44706i0818r5544j59728B14c35310
10673c27087i8623C32336a41471E0361J1666a271r9561A05950f5178l59779a06359
10661a48543F1702B7836f7802j43025r2558O8453l7874J05013r4286J29325B8445
10649b02044f6107R447A9708a64716a6771B03502i1652k24958J25705p3382R3232
10638a71055H9288a73308A61079a5298P364F7109a5696m38239a98399F1811b43945
10626E0449Q8296M324c42601F7137b13810c4709A59806L8273c5592H2278L0061
10615A12339N0815a599p945l24436b1362j99958Q1084o9840K5808j44540h7620
$$ plain form
10603 -112354 -102952 -149843 -124628 -328570 91829 -212211 -134937 -26918 -24499 -127126 -58649
10591 -128287 -32489 -303883 61519 41972 213159 30746 45467 426698 27839 92913 258907
10580 258907 -219948 -127925 -93754 385753 -32985 160426 -6788 -128163 50111 -9675 11738
10568 141282 238467 108332 107935 12524 -56530 90934 28923 87179 -244765 -29212 178287
10556 -96367 -118460 -83490 158315 -4728 -473472 -164352 20949 89711 18596 -167411 225036
10544 68733 -179425 -177309 -28501 -280275 -143065 -85042 99556 -136771 96369 42492 -69732
10532 117507 91160 -87125 -7719 28274 -104487 31807 -222958 -343902 86169 -169663 18059
10520 -373268 244385 129205 55908 34008 -156498 207721 -155159 192808 100 303279
$$ packed form
10603a12354R402m6891K5215k03942I1829b12211P7274b6918K419j02627e8649
10591a28287c2489k71394F1519j9547J71187C0746J4721L81231B7839O5074J65994
10580B58907b19948R2023L4171C85753c2985A60426f788j21375E0111i675A1738
10568A41282R7185A08332l97A2524e6530I0934B8923N8256b44765b9212A78287
10556i6367k2093L4970A58315d728m68744a64352B0949O8762A8596a67411B25036
10544F8733a79425K116b8501k51774J37210N8023I9556a36771I6369D2492f9732
10532A17507k6347h7125g719B8274a04487C1807b22958j20944H6169a69663A8059
10520c73268B44385j15180E5908k1900a56498B07721a55159A92808A00L03179
$$ plain form
10510 303279 -308594 14104 219166 -113203 32099 -8062 307752 -352182 101210 88711
10500 88711 183728 -117208 -137031 -65430 -52286 -25514 -150465 -284257 -98692 -26216 -490622
10489 -490622 84376 -197789 -292997 -31391 213991 199701 110740 89065 -269637 95761 -191147
10477 -84953 36572 544144 328751 511128 259024 176723 121837 341980 -85786 -146307 -58168
10465 112365 -399014 -193507 163838 147811 -184491 -313339 55523 202447 -100810 -76648
10455 -76648 -113350 -132615 50252 226328 232643 27802 145570 -188623 -271193 112988 29826
10443 -59716 131169 -203582 -298413 -1671 -257395 226618 163402 -52643 116157 309958 48613
10431 -179061 -180547 -35605 -81311 -270120 129743 -177496 24182 -129921 46695 -21388 55601
$$ packed form
10510C03279c08594A4104K05062a13203C2099h062C07752c52182A01210j2499
10500H8711R5017a17208j9823f5430J3144b5514j24951j33792i8692b6216m64406
10489d90622H4376a97789r5208c1391B13991j4290q8961k1675b69637I5761a91147
10477h4953C6572N07572k15393J82377k52104q2301n4886K20143h5786o0521e8168
10465A12365c99014a93507A63838j6027a84491j28848E5523J46924a00810K4162
10455g6648l6702j9265E0252J76076O315B7802J17768a88623q2570A12988B9826
10443e9716A31169b03582r4831a671k55724B26618o3216e2643A16157J93801D8613
10431a79061j486c5605m5706j88809A29743a77496B4182a29921D6695b1388E5601
$$ plain form
10419 3690 -95749 135232 59735 -121207 -332448 103020 36586 266219 41825 -209451 -346802
10408 -346802 -245209 222512 249033 -257634 -245417 362300 -10754 -307112 -230259 -253413
10398 -253413 -277467 -237444 -305518 -229042 -289233 -176409 -200800 -415977 84383 271395 67627
10386 -96806 10162 197175 348746 63247 59580 134275 49281 -104305 236467 326941 159191
10374 28086 252861 128717 238920 298318 243626 -68881 -26134 492407 630085 294804
10363 45279 449494 434200 -105489 188349 267563 565782 141245 150350 205766 -56067 -21971
10351 234369 -2294 59631 476282 212660 343929 334894 463683 179139 200557 247221 315214
10340 315214 323509 703465 243347 118682 389993 -142369 310273 66898 -92768 -77546
$$ packed form
10419C690i5749A35232E9735a21207k11241A03020C6586K29633D1825b09451j37351
10408c46802J01593B22512K6521b57634J2217C62300a0754k96358P6853k3154
10398b53413k4054M0023o8074P6476o0191J12824k4391k15177H4383J87012F7627
10386i6806A0162J87013J51571F3247l667P4695D9281a04305B36467R0474A59191
10374B8086K24775j24144J10203N9398n4692f8881b6134D92407J37678B94804
10363D5279M04215j5294a05489A88349P9214K98219A41245R105N5416e6067b1971
10351B34369b294E9631M16651B12660J31269r035J28789A79139K1418M6664O7993
10340C15214Q295L79956B43347A18682K71311a42369C10273F6898i2768J5222
$$ plain form
10330 -77546 366381 323619 272919 232547 -241154 314420 -24845 79030 398162 47054 -61088
10318 -26557 -8208 204181 -61799 184802 146028 -196572 311717 198530 44517 -202296 -239709
10307 -239709 -39478 -35025 -105060 -94400 197273 -164454 66587 67250 -71955 346102 -126295
10295 -138019 -44599 -85526 -68037 159988 76718 69070 -228447 4912 -31691 409718 -21097
10283 -25591 -262538 64568 -213446 -177179 98394 -129106 131388 22136 -187920 237352
10272 83438 83389 1165 -99655 231886 -68510 36180 23513 -456284 -78926 -209609 -113794 -146304
10260 -146304 -43970 153693 -153445 -168332 200304 161031 519789 44930 310517 317743 457244
10249 457244 425763 605409 435020 350181 103816 -39302 -170468 198436 133917 -116161
$$ packed form
10330g7546C66381m2762n0700m0372b41154C14420b4845G9030L19132D7054f1088
10318b6557h208B04181f1799A84802l8774a96572C11717j13187D4517b02296l7413
10307b39709c9478M453p0035J0660A97273a64454F6587O63g1955C46102a26295
10295a38019d4599m0927J7489A59988G6718p648b28447D912c1691D09718b1097
10283b5591k36947F4568b13446L6267I8394a29106A31388B2136a87920B37352
10272H3438m9A165i9655B31886f8510C6180j2667d56284g8926j30683R5815l2510
10260a46304d3970A53693a53445j4887B00304l9273L58758D4930K65587P226J39501
10249D57244l1481J79646j70389q4839A03816c9302j31166A98436o4519a16161
$$ plain form
10238 89730 105992 89201 -213600 -135049 -6781 -115793 90336 -66303 104709 -237708 124419
10226 -106809 -304367 -6304 -75513 47711 24287 -192886 -246639 -136949 -48637 -319034 -157442
10214 -243004 -163926 -87751 -250193 -143199 98275 -256742 44136 143331 -75690 -139229 -68048
10202 -39913 -267923 -7469 54301 -22711 -59525 -235096 -240077 -72393 -105850 63323 -135727
10190 -289333 -27701 -30913 -102564 -291951 44396 -99818 7729 -240123 -50286 143754 -196161
10178 -57594 38688 -41053 -278481 48208 -79843 -77723 17800 154722 97914 -84135 165782
10166 -44499 -212238 -180877 50447 -128683 22818 -445837 -275072 -137361 114468 -333861
10155 306857 -113755 -68364 60360 37410 -22236 -212471 22562 -136634 -192139 -21511 -287940
$$ packed form
10238H9730J6262j6791b13600P8551f781j09012I0336f6303A04709b37708A24419
10226a06809j97558f304o9209D7711k3424a92886n3753J09690d8637k70397a57442
10214b43004P9078P6175j62442J06994I8275b56742D4136R9195g5690o3539f8048
10202c9913k28010g469E4301b2711l6814j75571m981g2393l3457F3323a35727
10190b89333b7701l212p1651j89387D4396i9818G729b40123e0286A43754a96161
10178e7594C8688d1053k37428D8208g9843K120A7800J36922n6808h4135A65782
10166d4499j67739L1361E0447a28683B2818d45837J70765a37361A14468c33861
10155C06857a13755M5391F0360k2950b2236j90235B2562a36634n5505b1511k66429
$$ plain form
10144 -287940 -425235 -37548 -30961 36607 -139626 469477 65885 6306 98317 -75813 204466
10132 74119 -114739 5551 330977 -30486 -244492 -16188 -52630 21331 -128316 16929 -392915
10120 -89031 -314989 101132 440555 201501 107325 -24362 -17026 -193776 -96049 -35501 -276635
10109 -276635 -331483 -175795 309344 -263812 -90770 -161099 -270854 -169623 -144885 -43312
10098 -161256 -282463 -46212 -103620 -418217 73890 -114423 22171 -27273 -17571 181434 -54844
10086 -80614 28921 -424992 15097 181345 -61133 -330907 -135135 -85886 83390 -63359 240590
10074 -124128 249996 108503 -121807 127787 -300964 -235767 -397221 8464 -108436 -121688
10064 -121688 -333027 19314 50041 -78219 105881 400867 60953 -34691 -231263 -127997
$$ packed form
10144b87940j37295c7548O587C6607a39626D69477F5885F306R2011g5813B04466
10132G4119a14739E551L25426c0486k14006a6188l6442B1331a28316A6929c92915
10120h9031k25958A01132L39423B01501r4176b4362P336j76750i6049c5501k41134
10109b76635n4848J55688C09344b63812i0770p0329j09755J01231K4738d3312
10098a61256j21207d6212n7408l14597G3890a14423B2171b7273R702A81434e4844
10086h0614B8921d24992A5097J66248f1133k69774a35135M9249H3390f3359B40590
10074a24128B49996A08503a21807A27787c00964O5197j61454H464a08436j3252
10064a21688k11339A9314L0727g8219A05881K94986F0953c4691j96572J03266
$$ plain form
10054 -127997 -397724 127718 -186289 28149 -89534 -107998 16158 151363 102314 -64458 -170821
10043 -170821 -184693 -141039 -96437 201058 -231845 -123743 55687 -353829 -116462 -226728
10033 -226728 328421 -227801 34683 -126560 62951 -243556 -152281 -331897 -72155 -303125
10023 -303125 -116289 311611 -153387 -470677 -256401 -25986 -79758 -34698 -235390 -251644
10013 -251644 -62596 431568 24862 -31952 -64220 -62257 -159784 -111303 2371 -109310 -35888
10001 93245 -92826 56493 -50429 24143 -469 -487420 -72583 11514 -435999 200644 -246831
9989 169391 37615 -298049 50638 28846 -33293 223520 -360801 -297979 -194962 -261595 -174469
9978 -174469 -109762 -202075 -192963 39296 131442 -112282 -33059 -50100 -38527 -95406 -182953 5115
$$ packed form
10054a27997k69727A27718a86289B8149h9534j8464A6158J35205m9049f4458j06363
10043a70821j3872M3654M4602B01058b31845J08102E5687c53829a16462j10266
10033b26728C28421b27801C4683a26560F2951b43556R1275j79616g2155k30970
10023c03125a16289C11611a53387l17290K14276b5986n3772c4698k00692j6254
10013b51644f2596D31568B4862c1952l2268J963r7527M8481B371a09310c5888
10001I3245i2826E6493e0429B4143d69m86951g2583A1514d35999B00644b46831
9989A69391C7615b98049E0638k1792c3293B23520c60801O2822J03017o6633Q7126
9978a74469O4707r2313R112C9296R2146a12282c3059j7041J1573n6879q7547E115
$$ plain form
9965 69892 -161777 -397160 -190019 -98101 -24796 -7966 -148655 -181180 -204135 -79154 350104
9953 -214583 -6093 -388237 91246 -81753 -87245 257489 66398 -76045 -103266 -41347 -109209 -136047
9941 -136047 -78361 -149226 -244437 -65825 -110401 11708 145872 -114311 29598 -175704 -38007
9929 186686 -538158 -267132 -37634 21226 257855 -400503 135484 -70845 -188806 -528730
9919 -528730 88262 343615 -124622 -181514 279705 90749 -149631 -84865 196235 94686 178337
9908 178337 -170307 -75471 -33686 146754 -355512 281369 99065 23439 139132 -2086 -334235
9897 -334235 -182213 -6361 -77782 -352243 -236146 -206150 -147927 -181432 164126 344016 -259671
9885 -82791 21574 -52659 65302 -164404 -92351 18218 9452 -57397 -166996 -113077 -95677 156023
$$ packed form
9965F9892a61777k35383a90019R1918b4796g966j40689l2525k2955g9154C50104
9953b14583f093l82144I1246h1753n492B57489F6398g6045k7221d1347o7862k6838
9941a36047N7686p0865r5211f5825m4576A1708J34164a14311B9598a75704c8007
9929A86686e38158b67132c7634B1226K36629d00503A35484g0845j17961l39924
9919e28730H8262K55353a24622n6892B79705I0749a49631O4766A96235I4686Q3651
9908A78337a70307g5471c3686A46754c55512B81369I9065B3439J15693b086l32149
9897c34235J52022f361p1421k74461J16097K9996N8223l3505A64126J79890b59671
9885h2791B1574e2659F5302a64404P2053A8218q766e7397j09599N3919J7400A56023
$$ plain form
9872 -90626 -177764 -11285 34326 -131725 290947 -118206 -112050 169934 -24190 -15699 -213943
9861 -213943 29086 -98121 200791 113599 -53470 186383 -80372 36669 85103 -230785 -115123
9849 -188570 -44398 -201014 230507 36357 -124578 -221865 -141399 398942 -44159 14161 -140853
9837 -107389 150158 30959 -216354 -79035 -98512 -249120 119503 193963 268349 -314683 -151949
9825 -52888 277903 -129766 42019 -85824 105157 -269747 118540 -39223 165337 8517 166257
9814 166257 -459926 24372 36518 44036 -213077 -229078 -118630 -89918 433254 -249567 -108791
9802 -148903 -96500 -115559 -315263 -71505 64128 -343804 -133906 -190395 -73836 -51964 -93274
9791 -93274 173087 -94020 -151079 302189 -89256 102088 -124052 -205298 -371404 -356785 -77689
$$ packed form
9872i0626q7138a1285C4326a31725B90947a18206O156A69934b4190Q491j98244
9861b13943B9086i8121B00791q7192e3470A86383h0372C6669M8434b30785a15123
9849a88570d4398j56616B30507C6357a24578r7287Q0466C98942d4159A4161a40853
9837a07389A50158C0959b16354g9035j9477j50608A19503P4460P4386c14683a51949
9825e2888B77903a29766D2019h5824A05157b69747A18540c9223A65337H517J57740
9814A66257d59926B4372J2146P518b13077j6001J10448K8712D33254b49567a08791
9802a48903N2403j9059j99704g1505F4128c43804a33906n6489g3836K1872m1310
9791i3274A73087i4020n7059C02189h9256A02088a24052q1246j66106J4619g7689
$$ plain form
9779 -68939 26040 -100257 -76292 -149560 -117954 -91736 237485 61185 8427 -257509 39051
9767 132638 -44017 -168821 19895 278870 -35722 31278 54853 -46590 -510274 -87792 -12520
9755 -199190 50100 -80372 68531 8394 51887 138872 -85520 -232812 87537 -171040 -266945
9744 -266945 -153710 171663 -152208 -140594 -65049 134847 -196574 12089 -130506 -72680
9734 -72680 430407 -40264 38329 69753 92179 92648 -334913 -129891 139729 -182958 -205042
9723 -205042 -296895 -107880 2132 191114 -287676 70782 -19300 71371 -139041 167392 -55990
9711 -187657 22491 -187089 59731 -342560 -347046 1311 -59523 -3539 -271326 249920 -167189
9699 -341722 -130038 32852 -400243 -160069 -4822 -193674 54901 -41184 136555 -147446 71086
$$ packed form
9779f8939B6040a00257K3965p3268L1606K6218B37485F1185H427b57509C9051
9767A32638d4017j24804A9895K58975c5722C1278K3575d6590m63684h7792a2520
9755a99190E0100h0372F8531H394M3493Q6985h5520j47292H7537a71040r5905
9744b66945J13235A71663a52208J1614f5049A34847a96574A2089a30506N7826
9734g2680D30407d0264C8329L1424K2426M69c34913a29891A39729a82958k2084
9723b05042r1853a07880B132J88982b87676G0782a9300G1371a39041A67392e5990
9711a87657B2491a87089E9731c42560m486A311e9523c539k67787B49920a67189
9699c41722a30038C2852d00243a60069d822j88852E4901d1184A36555a47446G1086
$$ plain form
9687 -212209 -225382 -175974 -87160 -54613 -169786 -34704 46440 -70830 -271676 -5982 22016
9675 43944 19792 41451 249059 -188497 -230154 322814 55846 -114494 -331341 -18617 -128533
9664 -128533 -195330 -210677 225560 107558 -184781 182452 -62397 217392 -189950 -97809
9654 -97809 205144 -271448 -161226 -184806 -103059 -166495 58630 -250355 -88409 -144610 103499
9642 43803 119783 -64236 28215 13878 -174722 151517 -204945 -174465 91039 -68041 -32347
9630 -142313 54047 40447 -23402 64712 26369 -211394 -308045 -25353 -305560 87238 167533
9619 167533 16134 -154987 195776 -206576 289804 -168571 5007 161826 -404766 36696
9608 -167534 44855 -559349 32040 41634 -50446 -508184 -406999 340019 179316 -18836 -33343
$$ packed form
9687b12209j3173M9408h7160L2547j15173c4704D6440g0830k00846e982B2016
9675D3944A9792K1659K07608a88497m1657C22814E5846a14494k16847a8617j09916
9664a28533o6797j5347B25560A07558a84781A82452f2397B17392a89950R2141
9654i7809B05144b71448J10222k3580Q1747o3436E8630b50355h8409n6201A03499
9642D3803P5980f4236B8215A3878a74722A51517b04945L0480I1039f8041c2347
9630a42313E4047j3600b3402F4712B6369b11394r6651b5353k80207H7238Q0295
9619A67533A6134a54987A95776b06576B89804a68571E007J56819d04766C6696
9608a67534D4855e59349C2040R594e0446m57738J01185C40019j60703a8836j4507
$$ plain form
9597 -33343 138657 -263992 -116540 258608 -7389 -165249 158841 25609 -304778 -378420 -208121
9586 -208121 74488 -3613 -82369 170630 -300041 -43106 -36906 -105997 -92166 -470406 34246
9574 132110 -10592 -269790 50263 16355 -62470 -132995 -8057 46477 -1004 89734 -222313 279130
9561 23329 -322708 268611 -125782 -113515 53652 89012 52158 -5770 -50782 2073 -166110
9549 -217913 -371045 -55341 -34924 -232208 257901 72359 -162309 -258016 -197258 -184141 -75190
9537 -360080 -214105 -30429 -310644 52819 -33924 5981 -124312 -159919 -5230 -58099 -1211 89034
9524 448318 -137523 -185991 25530 -102280 -237996 -61796 -109301 -67278 146548 -51188 78229
9512 -133356 -54768 118408 49456 -207274 -177159 42674 101886 -235709 278162 -224277 28255
$$ packed form
9597c3343A38657b63992a16540B58608g389j57860A58841B5609c04778p3642J70299
9586b08121G4488c613p8756A70630c00041d3106O200o9091J3831l78240C4246
9574A32110a0592k59198E0263A6355f2470p0525h057D6477a004H9734b22313B79130
9561B3329c22708B68611a25782J2267E3652L5360l6854e770m5012B073a66110
9549b17913j53132e5341K0417j97284B57901G2359a62309r5707O0758J3117g5190
9537c60080J45975c0429k80215E2819c3924E981a24312l5607e230n2869a211H9034
9524D48318a37523m8468B5530a02280j35716f1796m7505M2023A46548e1188G8229
9512a33356e4768A18408D9456b07274L0115D2674N9212b35709B78162b24277B8255
$$ plain form
9500 265217 -148642 85594 -216265 -159427 9903 -30573 221427 283474 -72187 43903 -20078
9488 410866 56121 38178 -9723 -131482 -127006 206372 -69005 1506 133715 -48352 -149706
9477 -149706 206936 -202745 -72948 -464 -218282 -179340 430635 -47918 -50616 104098 196673
9466 196673 -223323 -121463 146457 -253082 14821 -170790 -225565 -26059 -191806 -128047
9456 -128047 -184054 -230146 161172 -116348 -204233 20327 109401 -227996 89345 -218765 -116994
9445 -116994 203697 -56222 -111083 -137972 80717 -325960 -125914 176851 -47484 33261 31909
9434 31909 345482 58069 -29626 -103915 51262 -2984 -101273 97727 -222326 79590 -156482
9422 -163633 -310804 -153558 167927 1341 -79478 -19335 -22772 -100969 159013 87058 132566
$$ packed form
9500B65217a48642H5594b16265N6838I903c0573B21427O2047g2187D3903b0078
9488D10866E6121j7943i723j21759M476B06372f9005A506J32209d8352j01354
9477a49706B06936b02745g2948d64k17818L8942D30635d7918k698A04098R2575
9466A96673b23323J01860A46457b53082A4821a70790n4775b6059j65747O3759
9456a28047n6007m6092A61172a16348q7885B0327Q9074b27996H9345b18765J01771
9445a16994B03697e6222n4861k6889H0717c25960a25914A76851d7484C3261j352
9434C1909L13573E8069b9626p4289E1262b984r8289I7727b22326G9590a56482
9422a63633j47171a53558A67927A341g9478a9335l437p8197A59013p1955M5508
$$ plain form
9411 132566 24119 63933 -237007 -151474 -321561 167559 -200955 -238322 -130104 13733 -416923
9399 -137167 16374 -16146 74596 43147 236727 83380 -17186 -15565 -100040 60018 -32278 -234734
9387 -234734 -503048 -215361 -16817 182326 -193508 -86658 -5899 143330 -118382 -95878 36444
9375 94131 215850 -337859 102240 77222 -170680 -33931 98639 173806 -202289 -3036 -98688
9364 -98688 116811 -392497 -244534 -238681 -73503 -291449 -100537 -7678 -41945 -353057 94411
9352 -96111 -136888 111182 -101640 -198214 -317388 -137770 -282044 -220676 -361115 180222
9341 380368 101395 -435441 58333 135223 -157653 216620 -145938 7677 -182890 -179954 -147713
9330 -147713 -63033 -21817 -152997 -109370 -199602 -265935 -188297 -429592 -35898 84673 -139227
$$ packed form
9411A32566B4119L9814b37007Q5533j70087A67559b00955l7367J08218A3733d16923
9399a37167A6374a6146G4596l1449J93580H3380a7186J621q4475F0018c2278k02456
9387b34734k68314b15361a6817A82326a93508h6658e899A43330a18382K2504C6444
9375I4131J21719c37859A02240k5018a70680c3931I8639P5167b02289c036r5652
9364i8688A16811c92497J47963N853g3503k17946a00537g678l4267l11112I4411
9352i6111m0777A11182a01640r6574j19174a37770j44274O1368j40439A80222
9341C80368A01395d35441E8333P6890a57653B16620a45938G677a82890K936L2241
9330a47713f3033b1817j31180M3627r0232o6333P7638k41295c5898H4673a39227
$$ plain form
9318 -131615 165121 47633 -37864 81023 325324 -164870 -240959 -82478 -140112 -451211 81430
9306 -24824 -198811 116614 15323 -97062 -296553 134460 -11608 127519 174852 -132116 65596
9294 -254330 163601 103542 -219337 370823 -144175 171532 -42057 -463185 -56615 21352
9283 47713 302307 -90367 -417206 250033 -186187 89555 261102 -33839 -11936 -55535 -78952
9272 -78952 49260 219146 -291729 16083 -142377 -175460 -251293 86202 40175 118839 -330794
9260 -32022 -131182 89797 -197380 17938 -38466 3459 -9307 -89065 -238461 -137031 -224261 23754
9247 98688 -22578 34600 99152 -223419 -350584 187656 -37137 28982 82233 -229713 -79216
9235 -350845 -136364 -95452 130097 148923 55951 -782 164049 31659 -97264 -83112 -170332
$$ packed form
9318a31615A65121D7633c7864H1023K44301a64870p6089h2478n7634l11099H1430
9306b4824j73987A16614A5323i7062j99491A34460a1608A27519M7333a32116F5596
9294b54330A63601o0059b19337C70823a44175A71532d2057m21128e6615B1352
9283D7713K54594i0367l26839B50033a86187H9555J71547c3839a1936m3599k3417
9272g8952D9260J69886b91729A6083a42377l3083p5833H6202D0175P8664c30794
9260c2022r9160H9797a97380A7938c8466C459i307p9758j49396J01430q7230B3754
9247I8688b2578C4600O4552b23419j27165A87656c7137B8982N3251b29713g9216
9235c50845a36364M0912A30097J8826E5951g82A64049C1659i7264J4152q7220
$$ plain form
9224 -170332 -417549 -177723 -195693 -234174 -298578 21690 -389399 -174981 -229887 -92900 -179835
9213 -179835 101252 -210827 175928 -210560 -370946 -114595 23783 -2603 28066 165756
9203 165756 88675 -94478 -169662 -190219 -6461 -183661 132534 -209566 19788 -159652 251033
9191 23798 132793 -83018 -122789 163779 165119 -144975 19381 109630 220895 -71992 -493323
9180 -493323 -397517 139344 -11563 217765 -261109 -39475 -79729 -122456 -105277 123865 -219316
9168 16939 169887 -166479 -130067 -31164 -101676 -118551 410619 173577 -131817 -342499 23144
9156 -289804 -311410 -98386 -72236 -165025 126842 -59102 150026 122817 -96330 -201044 30813
9144 -62575 -6295 96803 -140506 -157232 -195530 30199 157914 -196720 -170686 -4617 27130 103997
$$ packed form
9224a70332k47217a77723j7970l8481o4404B1690c89399a74981n4906i2900q6935
9213a79835A01252b10827A75928b10560j60386a14595B3783b603B8066J37690
9203A65756p7081i4478p5184k0557f461j77200A32534b09566A9788a59652B51033
9191B3798J08995h3018l9771A63779J340a44975A9381R0249J11265g1992m21331
9180d93323R5806A39344a1563B17765b61109c9475m0254m2727J7179A23865b19316
9168A6939J52948a66479L6412c1164p0512j6875D10619A73577a31817k10682B3144
9156b89804k1606i8386K6150r2789A26842e9102A50026k7209i6330j04714C0813
9144f2575f295I6803a40506j6726l8298C0199J27715a96720K6034d617B7130P6867
$$ plain form
9132 103997 -284895 -67549 -468731 -298629 -334089 -52515 -4903 -44440 130748 -266388 62031
9120 -70021 134079 -216268 -113303 194675 58538 -97758 -38311 -65288 24115 -4463 39568
9108 11370 -272510 -423227 -59743 -34805 -123433 -223651 5099 -51397 -180164 118953 102853
9097 102853 68168 -123633 -56104 -129511 -44781 -177447 236095 -56865 58940 162225 -67562
9085 88207 -290227 -174027 -87093 -10491 -290556 159834 -38620 -8585 -19931 -85917 -59290
9074 -59290 134549 229331 -53669 -103418 -206948 94799 -252441 -30756 -123418 90006 -54538
9062 -285267 -13356 -128372 240197 97149 48604 133934 -177145 -8440 112305 -203444 -275853
9051 -275853 -22573 -274791 82337 117549 -63710 -158030 87209 -216488 33488 30499 -290071
$$ packed form
9132A03997b84895f7549m01182J70102l5460e2515d903l9537A30748b66388F2031
9120g0021A34079b16268J02965A94675E8538i7758c8311k6977B4115d463C9568
9108A1370b72510j50717e9743K4938q8628j00218E099e1397j28767A18953j6100
9097A02853l4685a23633e6104p3407d4781j32666B36095e6865E8940J03285f7562
9085H8207b90227J16200Q6934a0491k80065A59834c8620h585j1346o5986K6627
9074e9290A34549R4782e3669m9749j03530I4799b52441c0756r2662I0006e4538
9062b85267a3356j15016B40197I7149m8545Q5330a77145h440A12305b03444p2409
9051b75853b2573k52218H2337L5212f3710r4320H7209b16488C3488k989b90071
$$ plain form
9039 -212385 -194385 -417247 -8072 -19699 321646 77998 -419365 -137312 -229869 8164 59080
9028 59080 -69401 -298074 -150431 -32681 215614 -314854 -203096 -269226 87260 513481 -36248
9016 -132983 -56727 14035 -119098 -73774 21431 -5719 37349 131862 -73964 -62454 -39159 -510331
9004 -510331 326648 -168649 32780 51068 55510 -207288 24188 -28014 -163102 -258098 -157064
8993 -157064 -373407 -90354 -203656 80680 -57840 187180 792 -448463 81951 113681 -316863
8981 61734 -100210 -59441 -45342 -145374 -65386 221352 36666 180339 -2011 -61325 -199879
8970 -199879 -167553 258190 146268 65287 10224 -43259 -86396 99081 -286712 234740 -268811
8958 -33833 -232040 40864 63352 -224185 133302 -16313 -149813 -23689 -184090 -212284 -26562
$$ packed form
9039b12385J8000k22862h072j1627C21646G7998d19365a37312r2557H164N0916
9028E9080f9401k28673J47643c2681B15614c14854J11758o6130H7260M26221c6248
9016a32983e6727A4035a19098M5324B1431e719C7349R4513g3964J1510K3295m71172
9004e10331C26648a68649C2780J8288M442b07288B4188b8014j35088r4996J01034
8993a57064k16343i0354j13302H0680e7840A87180G92d48463H1951L1730c16863
8981F1734a00210M0769J4099j00032f5386B21352C6666J43673b011n9314j38554
8970a99879L2326B58190j11922F5287A0224d3259m3137I9081b86712B34740b68811
8958c3833j98207D0864K2488b24185A33302a6313j33500b3689j60401k8194b6562
$$ plain form
8946 -5821 -16163 258895 -28073 155397 193858 27333 -236462 -155242 -3665 -214850 179766
8934 144156 50894 29458 275104 269601 -286822 56074 164602 46639 -26637 149364 191251
8923 191251 76441 572087 855789 2695655 8721629 11496532 3570030 982808 836703
8914 836703 579414 137691 37177 70424 17349 -134109 -14921 -18888 -4142 333199 174899
8903 174899 193619 -189978 44900 -199551 226653 -133202 120764 40469 112721 -241947
8892 20396 189846 -101252 663 197745 -342526 131468 225703 -200483 118117 -389792 -195510
8881 -195510 -472965 -81957 -268630 -182794 -295636 -86798 -138467 -3165 -325274 -25816 -37365
$$ packed form
8946e821j0342B58895b8073A55397L8461B7333b36462Q1220c665k11185A79766
8934A44156E0894k1436K45646n503b86822E6074J08528D6639b6637A49364M1887
8923A91251G6441M95646K83702J839866O025974K774903C570030I82808j46105
8914H36703k57289A37691C7177L3247A7349a34109a4921l967d142C33199j58300
8903A74899J8720a89978D4900a99551B26653a33202A20764D0469P2252b41947
8892B0396J69450a01252F63J97082c42526A31468R4235b00483A18117c89792J94282
8881a95510k77455h1957j86673Q5836j12842h6798n1669c165l22109b5816j1549
$$ [...]
##END NTUPLES=NMR SPECTRUM
##END=
