
##TITLE=AC1360_QARH12182_7155250_VSlBu4yxFI
##JCAMPDX= 6.0         $$ Bruker NMR JCAMP-DX V2.0
##DATA TYPE= NMR SPECTRUM
##DATA CLASS= NTUPLES
##ORIGIN= BRUKER
##OWNER= Administrator
$$ 1.72 TOPSPIN		Version 2.1
$$ 2012-12-01 10:39:26.074 -0500  Administrator@X
$$ Compression mode = diff/dup
##.OBSERVE FREQUENCY= 400.02188249412
##.OBSERVE NUCLEUS= ^1H
##.ACQUISITION MODE= SIMULTANEOUS (DQD)
##.ACQUISITION SCHEME= undefined
##.AVERAGES= 64
##.DIGITISER RES= 22
##SPECTROMETER/DATA SYSTEM= spect
##.PULSE SEQUENCE= noesygpps1d.comp
##.SOLVENT NAME= COFFEE_meoh
##.SHIFT REFERENCE= INTERNAL, COFFEE_meoh, 1, 14.96281
##AUDIT TRAIL= $$ (NUMBER, WHEN, WHO, WHERE, PROCESS, VERSION, WHAT)
$$ ##TITLE= Audit trail, TOPSPIN		Version 2.1
$$ ##JCAMPDX= 5.01
$$ ##ORIGIN= Bruker BioSpin GmbH
$$ ##OWNER= Administrator
$$ $$ E:\/data/COFFEE/nmr/AC1360_QARH12182_7155250_VSlBu4yxFI/12/pdata/1/auditp.txt
$$ ##AUDIT TRAIL=  $$ (NUMBER, WHEN, WHO, WHERE, PROCESS, VERSION, WHAT)
(   1,<2012-12-01 10:39:20.448 -0500>,<Administrator>,<X>,<go>,<TOPSPIN 2.1>,
      <created by zg
	started at 2012-12-01 10:27:49.581 -0500,
	POWCHK enabled, PULCHK disabled,
       configuration hash MD5:
       86 BA 57 50 F2 9D 5C 9B 26 00 A9 28 5F 66 2E 89
       data hash MD5: 64K
       1C 90 39 7D 38 8C FB 2F EF B7 90 0E B9 88 FB BA>)
(   2,<2012-12-01 10:39:23.464 -0500>,<Administrator>,<X>,<proc1d>,<TOPSPIN 2.1>,
      <Start of raw data processing
       efp LB = 0.3 FT_mod = 6 PKNL = 1 PHC0 = 0 PHC1 = 0 SI = 128K 
       data hash MD5: 128K
       9E 51 6B D2 2E 0F 02 ED 21 3A E5 4D AC DE D5 D4>)
(   3,<2012-12-01 10:39:24.556 -0500>,<Administrator>,<X>,<proc1d>,<TOPSPIN 2.1>,
      <pk PHC0 = -80.15625 PHC1 = 0 
       data hash MD5: 128K
       FC 11 77 6D EC 46 93 10 DE FE EB 04 5A 5F C9 77>)
(   4,<2012-12-01 10:39:25.141 -0500>,<Administrator>,<X>,<proc1d>,<TOPSPIN 2.1>,
      <abs ABSG = 1 
       data hash MD5: 128K
       61 39 9B 90 9F 54 07 92 16 C7 94 B2 34 8E D6 0A>)
(   5,<2012-12-01 10:39:25.336 -0500>,<Administrator>,<X>,<proc1d>,<TOPSPIN 2.1>,
      <abs ABSG = 2 
       data hash MD5: 128K
       6E 21 C1 CD 3C 04 B0 65 A1 A0 23 23 47 D7 E8 9E>)
(   6,<2012-12-01 10:39:25.461 -0500>,<Administrator>,<X>,<proc1d>,<TOPSPIN 2.1>,
      <abs ABSG = 3 
       data hash MD5: 128K
       C2 67 53 7A BD CF 4B 6D F8 CF B7 3E 32 FF 3E AD>)
(   7,<2012-12-01 10:39:25.642 -0500>,<Administrator>,<X>,<proc1d>,<TOPSPIN 2.1>,
      <abs ABSG = 4 
       data hash MD5: 128K
       03 29 C5 B9 51 56 62 4C 1D 93 C7 D5 04 20 7E 0F>)
(   8,<2012-12-01 10:39:25.796 -0500>,<Administrator>,<X>,<proc1d>,<TOPSPIN 2.1>,
      <abs ABSG = 5 
       data hash MD5: 128K
       A7 19 B0 D0 BE 9F 48 56 6D 50 4E FB 86 66 2B EF>)
$$ ##END=
$$ 
$$ $$ hash MD5
$$ $$ 1D 3E 2D C2 ED A0 72 2D 21 DC 91 4A 15 39 CC D1
##$RELAX= 
##$RELAX= 
##$RELAX= 
##$RELAX= 
##$RELAX= 
##$RELAX= 
##$RELAX= 
##$RELAX= 
$$ Bruker specific parameters
$$ --------------------------
##$DU= <E:\>
##$EXPNO= 12
$$ [...]
##$TP07= 0
##$TPNAME0= <>
##$TPNAME1= <>
##$TPNAME2= <>
##$TPNAME3= <>
##$TPNAME4= <>
##$TPNAME5= <>
##$TPNAME6= <>
##$TPNAME7= <>
##$TPOAL= (0..7)
0.5 0.5 0.5 0.5 0.5 0.5 0.5 0.5
##$TPOFFS= (0..7)
0 0 0 0 0 0 0 0
##$TUNHIN= 0
##$TUNHOUT= 0
##$TUNXOUT= 0
##$USERA1= <user>
##$USERA2= <user>
##$USERA3= <user>
##$USERA4= <user>
##$USERA5= <user>
##$V9= 5
##$VALIST= <valist>
##$VCLIST= <CCCCCCCCCCCCCCC>
##$VD= 0
##$VDLIST= <DDDDDDDDDDDDDDD>
##$VPLIST= <PPPPPPPPPPPPPPP>
##$VTLIST= <TTTTTTTTTTTTTTT>
##$WBST= 1024
##$WBSW= 4
##$XGAIN= (0..3)
0 0 0 0
##$XL= 0
##$YL= 0
##$YMAX_a= 8393835
##$YMIN_a= -18275116
##$ZGOPTNS= <>
##$ZL1= 120
##$ZL2= 120
##$ZL3= 120
##$ZL4= 120
##$ABSF1= 14.96281
##$ABSF2= -5.595372
##$ABSG= 5
##$ABSL= 3
##$ALPHA= 0
##$AQORDER= 0
##$ASSFAC= 0
##$ASSFACI= 0
##$ASSFACX= 0
##$ASSWID= 0
##$AUNMP= <proc_prof1d_extract.lims>
##$AXLEFT= 0
##$AXNAME= <>
##$AXNUC= <1H>
##$AXRIGHT= 0
##$AXTYPE= 0
##$AXUNIT= <>
##$AZFE= 0.1
##$AZFW= 0.1
##$BCFW= 0
##$BC_mod= 0
##$BYTORDP= 0
##$COROFFS= 0
##$CY= 15
##$DATMOD= 1
##$DC= 0
##$DFILT= <>
##$DTYPP= 0
##$F1P= 0
##$F2P= 0
##$FCOR= 0.5
##$FTSIZE= 131072
##$FT_mod= 6
##$GAMMA= 0
##$GB= 0
##$INTBC= 1
##$INTSCL= 1
##$ISEN= 128
##$LB= 0.3
##$LEV0= 0
##$LPBIN= 0
##$MAXI= 10000
##$MC2= 0
##$MEAN= 0
##$ME_mod= 0
##$MI= 0
##$NCOEF= 0
##$NC_proc= -2
##$NLEV= 6
##$NOISF1= 0
##$NOISF2= 0
##$NSP= 0
##$NTH_PI= 0
##$NZP= 0
##$OFFSET= 14.96281
##$PC= 1
##$PHC0= -80.15625
##$PHC1= 0
##$PH_mod= 1
##$PKNL= yes
##$PPARMOD= 0
##$PPDIAG= 0
##$PPIPTYP= 0
##$PPMPNUM= 2147483647
##$PPRESOL= 1
##$PSCAL= 4
##$PSIGN= 0
##$PYNMP= <proc.py>
##$REVERSE= no
##$SF= 400.020008911283
##$SI= 131072
##$SIGF1= 0
##$SIGF2= 0
##$SINO= 400
##$SIOLD= 131072
##$SPECTYP= <>
##$SREGLST= <1H.CDCl3>
##$SSB= 0
##$STSI= 131072
##$STSR= 0
##$SW_p= 8223.68421052631
##$SYMM= 0
##$S_DEV= 0
##$TDeff= 65536
##$TDoff= 0
##$TI= <>
##$TILT= no
##$TM1= 0
##$TM2= 0
##$TOPLEV= 0
##$USERP1= <user>
##$USERP2= <user>
##$USERP3= <user>
##$USERP4= <user>
##$USERP5= <user>
##$WDW= 1
##$XDIM= 131072
##$YMAX_p= 452285860
##$YMIN_p= -11453
##$CURPLOT= <Network HP LaserJet P1505>
##$CURPRIN= <$Network HP LaserJet P1505>
##$DFORMAT= <normdp>
##$LAYOUT= <+/1D_H.xwp>
##$LFORMAT= <normlp>
##$PFORMAT= <normpl>
##$SURQMSG= 1
$$ End of Bruker specific parameters
$$ ---------------------------------
##NTUPLES= NMR SPECTRUM
##VAR_NAME=  FREQUENCY,     SPECTRUM/REAL,   SPECTRUM/IMAG
##SYMBOL=    X,             R,               I
##VAR_TYPE=  INDEPENDENT,   DEPENDENT,       DEPENDENT
##VAR_FORM=  AFFN,          ASDF,            ASDF
##VAR_DIM=   131072,        131072,          131072
##UNITS=     HZ,            ARBITRARY UNITS, ARBITRARY UNITS
##FACTOR=    0.0627417313425164, 1,          1
##FIRST=     8223.62146879497, 2428,         -63492
##LAST=      0,             5296,            -63960
##MIN=       0,             -11453,          0
##MAX=       8223.62146879497, 452285860,    0
$$ Real data points
##PAGE= N=1
##DATA TABLE= (X++(R..R)), XYDATA
$$ [...]
63160A388000J4950R168L067l227r947j7463k5363l2283l7117l9998m1747m2801
$$ 1388000 1402950 1412118 1415185 1411958 1402011 1384548 1359185 1326902 1289785 1249787 1208040 1165239
63148A165239m3180m2954m2101m0174l6723l2081k7288k3216j9974j7133j4445
$$ 1165239 1122059 1079105 1037004 996830 960107 928026 900738 877522 857548 840415 825970
63137H25970j2199j0775r916q793p075n432m572m251l860l539l732l988l366k022
$$ 825970 813771 802996 793080 784287 777212 771780 767208 762957 759097 755558 751826 747838 744472 742450
63123G42450j216j527k119k097j632j257r84p16o98r74j077q06o82r90j069k08
$$ 742450 741234 739707 737588 735491 733859 732602 731618 730902 730204 729230 728153 727347 726665 725675 724606 724398
63107G24398J291K534L146L348L353L297L437L866M293M492M631M856N015N144
$$ 724398 725689 728223 731369 734717 738070 741367 744804 748670 752963 757455 762086 766942 771957 777101
63093G77101N703O761P602P703P598Q062Q905R439R738J0449J1423J1617J0562
$$ 777101 782804 789565 797167 804870 812468 820530 829435 838874 848612 859061 870484 882101 892663
63080H92663R163Q613R079R753R891R402Q639P969P534P271P067O752O088M929
$$ 892663 901826 910439 919518 929271 939162 948564 957203 965172 972706 979977 987044 993796 999884 1004813
63066A004813L514K387J880J874K195K975M410O329Q303J0143J2083J4466J7332
$$ 1004813 1008327 1010714 1012594 1014468 1016663 1019638 1024048 1030377 1038680 1048823 1060906 1075372 1092704
63053A092704K0294K2858K4964K7147K9913L3027L5750L7828L9832M2384M5347
$$ 1092704 1112998 1135856 1160820 1187967 1217880 1250907 1286657 1324485 1364317 1406701 1452048
63042A452048M7982M9630N0186N0093N0090N0717N1924N3306N4621N5810N6693
$$ 1452048 1500030 1549660 1599846 1649939 1700029 1750746 1802670 1855976 1910597 1966407 2023100
63031B023100N7090N7240N7487N7439N5977N2280M6408L8820K9832J9763Q993
$$ 2023100 2080190 2137430 2194917 2252356 2308333 2360613 2407021 2445841 2475673 2495436 2504429
63020B504429k371j4330k6224l6671m4739n0654n5084n8183n9766n9796n8206
$$ 2504429 2502058 2487728 2461504 2424833 2380094 2329440 2274356 2216173 2156407 2096611 2038405
63009B038405n4693m9266m2679l5797k8887k1890j5015q418j727N463J2850J9752
$$ 2038405 1983712 1934446 1891767 1855970 1827083 1805193 1790178 1781760 1780033 1785496 1798346 1818098
62997A818098K6051L2211L8438M4391M9683N4220N7958O0795O2820O4434O6027
$$ 1818098 1844149 1876360 1914798 1959189 2008872 2063092 2121050 2181845 2244665 2309099 2375126
62986B375126O7661O8954O9271O8169O5729O2229N7579N1400M3614L4374K3377
$$ 2375126 2442787 2511741 2581012 2649181 2714910 2777139 2834718 2886118 2929732 2964106 2987483
62975B987483J0046n250k0867l5327m8453o0589p1415q0287q7163r2273r5301
$$ 2987483 2997529 2992279 2971412 2936085 2887632 2827043 2755628 2675341 2588178 2495905 2400604
62964B400604r5807r4175r1297q7537q2846p7647p2572o7499o1878n6046n1094
$$ 2400604 2304797 2210622 2119325 2031788 1948942 1871295 1798723 1731224 1669346 1613300 1562206
62953A562206m7310m3788l9947l6407l3848l1949l0126k8527k7476k6514k4894
$$ 1562206 1514896 1471108 1431161 1394754 1360906 1328957 1298831 1270304 1242828 1216314 1191420
62942A191420k2718k0718j9099j7433j5762j4910j5348j6275j6368j5277j3880
$$ 1191420 1168702 1147984 1128885 1111452 1095690 1080780 1065432 1049157 1032789 1017512 1003632
62931A003632j3130j2993j2711j1816j0582r570r030q805q558p940o784n350m199
$$ 1003632 990502 977509 964798 952982 942400 932830 923800 914995 906437 898497 891713 886363 882164
62918H82164l647l478l368l422l978m973n809n890n185m247l810m201n056n715
$$ 882164 878517 875039 871671 868249 864271 859298 853489 847599 842414 838167 834357 830156 825100 819385
62904H19385n890n729n287m411l382k949l322l706l493l411m422n906o206n063
$$ 819385 813495 807766 802479 798068 794686 791737 788415 784709 781216 777805 773383 767477 761271 756208
62890G56208m217n011o590p385p378p648q217p818n927l751k652k446j965p35
$$ 756208 751991 746980 740390 733005 725627 717979 709762 701944 696017 692266 689614 687168 685203 684468
62876F84468O14J410J631J576J404J205J148J333J690K074K317K217J748J354
$$ 684468 685082 686492 688123 689699 691103 692308 693456 694789 696479 698553 700870 703087 704835 706189
62862G06189J618K452L014K646J649P96M54N39R10J283J016k82j954k863k732
$$ 706189 707807 710259 713273 715919 717568 718364 718818 719357 720267 721550 722566 722284 720330 717467 714735
62847G14735k301k106j920j618j699k457l330l680l645l651l651l574l897m865
$$ 714735 712434 710328 708408 706790 705091 702634 699304 695624 691979 688328 684677 681103 677206 672341
62833F72341n524m742l090k563m167o705q353q630q264p875p540p312p384p707
$$ 672341 666817 662075 658985 656422 652255 645550 637197 628567 620303 612428 604888 597576 590192 582485
62819E82485p931p805p412p035o962p243p543p329o506n583m955m216k679n43
$$ 582485 574554 566749 559337 552302 545340 538097 530554 523225 516719 511136 506181 501965 499286 498743
62805D98743J031J247P37Q69K179L831M708M677M588N233O540P869Q820R590J0592
$$ 498743 499774 501021 501758 502627 504806 508637 513345 518022 522610 527843 534383 542252 551072 560662 571254
62790E71254J1895J3174J4142J4854J5536J6319J7343J8968K1531K4861K8359
$$ 571254 583149 596323 610465 625319 640855 657174 674517 693485 715016 739877 768236
62779G68236L1717L5227L9159M3206M6950N0666N5044O0163O5239O9523P2988
$$ 768236 799953 835180 874339 917545 964495 1015161 1070205 1130368 1195607 1265130 1338118
62768A338118P5889P8065P8988P8242P5610P0848O3793N4693M4151L2621K0172
$$ 1338118 1414007 1492072 1571060 1649302 1724912 1795760 1859553 1914246 1958397 1991018 2011190
62757B011190O844o872k0119l2215m2973n2400o0286o6333p0597p3413p4847p4632
$$ 2011190 2018034 2011162 1991043 1958828 1915855 1863455 1803169 1736836 1666239 1592826 1517979 1443347
62745A443347p2842p0157o7193o3945o0267n6437n2692m8699m4236m0089l7292
$$ 1443347 1370505 1300348 1233155 1169210 1108943 1052506 999814 951115 906879 866790 829498
62734H29498l5595l3628l0742k7663k5070k2539j9516j6422j4048j2378j0882
$$ 829498 793903 760275 729533 701870 676800 654261 634745 618323 604275 591897 581015
62723E81015r470q426p595o528n290m370l691k477l59J935L451M231N240P135
$$ 581015 571545 563119 555524 548996 543706 539336 535645 533168 532809 534744 538195 542426 547666 554801
62709E54801R524J1602J3186J4800J6834J9144K1608K4511K7999L1630L5015L8643
$$ 554801 564325 575927 589113 603913 620747 639891 661499 686010 714009 745639 780654 819297
62697H19297M3305M8991N5045O1261O7960P4948Q1466Q7380R3461R9974J05831
$$ 819297 862602 911593 966638 1027899 1095859 1170807 1252273 1339653 1433114 1533088 1638919
62686A638919J09727J11324J10733J07428J00536Q9817P5815N9269M0993K1858
$$ 1638919 1748646 1859970 1970703 2078131 2178667 2268484 2344299 2403568 2444561 2466419
62676B466419K425j7224l6757n5042p0801q3538r3415j00543j04940j06888j06832
$$ 2466419 2468844 2451620 2414863 2359821 2289020 2205482 2112067 2011524 1906584 1799696 1692864
62665A692864j04975j01385r6311r0235q3754p7556p2088o7073o1823n6206n0787
$$ 1692864 1587889 1486504 1390193 1299958 1216204 1138648 1066560 999487 937664 881458 830671
62654H30671m5855m1129l6722l3413l1375k9494k6778k3753k1557k0269j9083
$$ 830671 784816 743687 706965 673552 642177 612683 585905 562152 540595 520326 501243
62643E01243j7646j6221j4831j3279j1789j0788j0212r741r430r399r174q235
$$ 501243 483597 467376 452545 439266 427477 416689 406477 396736 387306 377907 368733 360498
62631C60498o969o204n985n705n207m854m646m203l585l234l095k663j885j272
$$ 360498 353529 347325 341340 335635 330428 325574 320928 316725 313140 309906 306811 304148 302263 300991
62617C00991j010p66l64pK48N31P61Q45J156K074L179L643L438L302L644M247
$$ 300991 299981 299215 298851 298844 299092 299623 300384 301229 302385 304459 307638 311281 314719 318021 321665 325912
62601C25912M956N853O789P583Q624J0368J2408J3972J5269J7251J9986K2549
$$ 325912 330868 336721 343510 351093 359717 370085 382493 396465 411734 428985 448971 471520
62589D71520K4645K7155L0589L4059L6462L7746L8480L8844L8706L8034L6658
$$ 471520 496165 523320 553909 587968 624430 662176 700656 739500 778206 816240 852898
62578H52898L4011K9593K3429J6024Q180Q61n406j1007j6581k1905k6154k9096
$$ 852898 886909 916502 939931 955955 964135 964996 959590 948583 932002 910097 883943 854847
62566H54847l1118l2153l1725l0215k8881k8166k7105k4921k2296k0404j9453
$$ 854847 823729 791576 759851 729636 700755 672589 645484 620563 598267 577863 558410
62555E58410j8803j7838j6238j4106j2239j1617j2100j2413j1844j1138j1121
$$ 558410 539607 521769 505531 491425 479186 467569 455469 443056 431212 420074 408953
62544D08953j1310j0676r181p640o493n417m012k265n37O32R38P85Q73J282J474
$$ 408953 397643 386967 377786 370146 363653 358236 354224 351959 351422 352054 352992 353777 354650 355932 357406
62529C57406J428J898L249M826N974O937Q145R324R956J0201J0662J1665J3259
$$ 357406 358834 360732 363981 368807 374781 381718 389863 399187 409143 419344 430006 441671 454930
62516D54930J5471J8080K0540K2622K4824K7769L1539L5729L9761M3101M5869
$$ 454930 470401 488481 509021 531643 556467 584236 615775 651504 691265 734366 780235
62505G80235M9164N3852N8882O1987O2337O1178N9315N5493M8318L8490K7797
$$ 780235 829399 883251 942133 1004120 1066457 1127635 1186950 1242443 1290761 1329251 1357048
62494A357048J6868N400o169j6791k6226l4921m2631m8419n1961n3788n4302n3512
$$ 1357048 1373916 1379316 1373147 1356356 1330130 1295209 1252578 1204159 1152198 1098410 1044108 990596
62482I90596n1697m9417m6891m4088m1233l8463l5311l1396k7302k3840k0768
$$ 990596 938899 889482 842591 798503 757270 718807 683496 652100 624798 600958 580190
62471E80190j7386j4065j1905j0868r594p353n007l544k717j672j80J377K695
$$ 580190 562804 548739 536834 525966 516372 509019 504012 500468 497751 496079 495899 497276 499971
62458D99971L714M463N138O028P127Q121Q917R797J0927J2010J2640J2688J2227
$$ 499971 503685 508148 513286 519314 526441 534562 543479 553276 564203 576213 588853 601541 613768
62445F13768J1308R861P660M494N81l356o699r550j2341j5014j6986j7861j7864
$$ 613768 625076 634937 642597 647091 647672 644316 637617 628067 615726 600712 583726 565865 548001
62432E48001j7539j7304j7117j6477j4956j2871j1085r852q467o429m341l010
$$ 548001 530462 513158 496041 479564 464608 451737 440652 430800 422333 415904 411563 408553
62420D08553k171r76O52K041K996M076N691P624R504J1100J2166J2609J2785J3017
$$ 408553 406382 405406 406058 408099 411095 415171 420862 428486 437990 449090 461256 473865 486650 499667
62406D99667J2962J2055J0468Q874P407N562L183P45j385l311n106o626p854q859
$$ 499667 512629 524684 535152 544026 551433 556995 560178 560923 559538 556227 551121 544495 536641 527782
62392E27782r380r150q579q428q713q682p892o612n101l347j691o70MJ511M390
$$ 527782 518402 509252 500673 492245 483532 474850 466958 460346 455245 451898 450207 449537 449541 451052 455442
62377D55442P725J0382J2443J4777J7683K0675K3379K6054K9194L2848L6405L9054
$$ 455442 463167 473549 485992 500769 518452 539127 562506 588560 617754 650602 687007 726061
62365G26061M0694M2190M4310M6500M7416M6667M5206M3681M1377L7322L1759
$$ 726061 766755 808945 853255 899755 947171 993838 1039044 1082725 1124102 1161424 1193183
62354A193183K5664J9318J2210M248l750j0823j6559k0879k3741k5294k6022k6512
$$ 1193183 1218847 1238165 1250375 1254623 1250873 1240050 1223491 1202612 1178871 1153577 1127555 1101043
62342A101043k7102k7824k8544k9023k8993k8384k7478k6721k6231k5510k3880
$$ 1101043 1073941 1046117 1017573 988550 959557 931173 903695 876974 850743 825233 801353
62331H01353k1279j8501j6493j5540j5186j4797j3990j2753j1399j0315r546q729
$$ 801353 780074 761573 745080 729540 714354 699557 685567 672814 661415 651100 641554 632825
62319F32825p605o398n462m826m425m478n191o288p356q504j0118j1968j3186
$$ 632825 625220 618822 613360 608534 604109 599631 594440 588152 580796 572292 562174 550206 537020
62306E37020j3294j2764j2344j2186j1913j1267j0431r790r398q788p462n609
$$ 537020 523726 510962 498618 486432 474519 463252 452821 443031 433633 424845 417383 411774
62294D11774m031l111k268q53Q47K046K665L343M404N503O378P181P952Q377Q365
$$ 411774 407743 404632 402364 401511 402358 404404 407069 410412 414816 420319 426697 433878 441830 450207 458572
62279D58572Q357Q763R538J0485J1563J2674J3528J3969J4151J4254J4373J4773
$$ 458572 466929 475692 485230 495715 507278 519952 533480 547449 561600 575854 590227 605000
62267F05000J5869J7691J9735K1660K3839K6860L0640L4294L7031L8990M1107
$$ 605000 620869 638560 658295 679955 703794 730654 761294 795588 832619 871609 912716
62256I12716M3953M6787M7993M6535M2694L7330L0899K3481J5264O471k717j1603
$$ 912716 956669 1003456 1051449 1097984 1140678 1178008 1208907 1232388 1247652 1254123 1251406 1239803
62244A239803j8810k3545k6718k9949l3547l6424l7847l8296l8392l8033l6999
$$ 1239803 1220993 1197448 1170730 1140781 1107234 1070810 1032963 994667 956275 918242 881243
62233H81243l5501l3676l1260k8263k5332k2955k0861j8705j6774j5418j4263
$$ 881243 845742 812066 780806 752543 727211 704256 683395 664690 647916 632498 618235
62222F18235j2676j0815r521r180r179q619p254n690m667m259l807k778j462n74
$$ 618235 605559 594744 585223 576043 566864 558245 550991 545301 540634 536375 532568 529790 528328 527754
62208E27754k94j21M54J591L250N084O281O279N739O068P655R443J0571J1581
$$ 527754 527460 527339 527793 529384 532634 537718 543999 550278 556017 562085 569740 579183 589754 601335
62194F01335J3344J5481J6785J6976J7099J8120J9786K1049K1165K0167J8507
$$ 601335 614679 630160 646945 663921 681020 699140 718926 739975 761140 781307 799814
62183G99814J6567J4506J2419J0423Q549O796N445N081N968P606R349J1256J3811
$$ 799814 816381 830887 843306 853729 862278 869074 874519 879600 885568 893174 902523 913779 927590
62170I27590J6925J9920K2485K4953K7455K9517L0759L1388L1519L0562K7786
$$ 927590 944515 964435 986920 1011873 1039328 1068845 1099604 1130992 1162511 1193073 1220859
62159A220859K3250J7870J2811R015O861N873N012L507J320j165l505n222o086
$$ 1220859 1244109 1261979 1274790 1283805 1290666 1296539 1301551 1305058 1306378 1305213 1301708 1296486 1290400
62146A290400o522p290q412q992q424p266o509o506p105q341j0350j2709j4535
$$ 1290400 1283878 1276588 1268176 1259184 1250760 1243494 1236985 1230479 1223374 1215033 1204683 1191974 1177439
62133A177439j5288j5204j4957j5045j5387j5377j4479j2847j1152r800q721p875
$$ 1177439 1162151 1146947 1131990 1116945 1101558 1086181 1071702 1058855 1047703 1037903 1029182 1021307
62121A021307p427p191o565n333m071l307k720j662j79J058J669J917K252K830
$$ 1021307 1013880 1006689 1000124 994791 990720 987413 984693 983031 982852 983910 985579 987496 989748 992578
62107I92578L553M298N058N916O825P525P964Q685J0386J2995J5596J7390J8455
$$ 992578 996131 1000429 1005487 1011403 1018228 1025753 1033717 1042402 1052788 1065783 1081379 1098769 1117224
62094A117224J9498K1274K4180K7914L1464L3989L5811L7864M0124M1436M1215
$$ 1117224 1136722 1157996 1182176 1210090 1241554 1275543 1311354 1349218 1389342 1430778 1471993
62083A471993M0452M0451M1341M2497M3834M5764M8097M9729M9501M7052M3051
$$ 1471993 1512445 1552896 1594237 1636734 1680568 1726332 1774429 1824158 1873659 1920711 1963762
62072A963762L8945L6221L5580L6842L9615M3542M7793N1073N2675N3044N2861
$$ 1963762 2002707 2038928 2074508 2111350 2150965 2194507 2242300 2293373 2346048 2399092 2451953
62061B451953N2089N0329M7611M4187M0082L5389L0617K6185K1972J7925J4559
$$ 2451953 2504042 2554371 2601982 2646169 2686251 2721640 2752257 2778442 2800414 2818339 2832898
62050B832898J2151R944O984L496O50q55j232q57J23J519L124N045P484J0184
$$ 2832898 2845049 2854993 2861977 2865473 2866123 2865268 2864036 2863179 2863302 2864821 2867945 2872990 2880474 2890658
62036B890658J2657J4916J7492K0758K4539K8326L1480L3578L4947L6556L8839
$$ 2890658 2903315 2918231 2935723 2956481 2981020 3009346 3040826 3074404 3109351 3145907 3184746
62025C184746M1059M2398M3223M4459M6053M7113M7380M7569M8094M8502M8381
$$ 3184746 3225805 3268203 3311426 3355885 3401938 3449051 3496431 3544000 3592094 3640596 3688977
62014C688977M7948M7301M6004M3943M1999M1063M0769L9838L7600L4608L1724
$$ 3688977 3736925 3784226 3830230 3874173 3916172 3957235 3998004 4037842 4075442 4110050 4141774
62003D141774K9106K6271K2943J9380J5823J1976P448K503k167o513j1321j6972
$$ 4141774 4170880 4197151 4220094 4239474 4255297 4267273 4274721 4277224 4275057 4268544 4257223 4240251
61991D240251k2595k7028l0159l2586l4259l4378l2662k9934k7118k4322k1248
$$ 4240251 4217656 4190628 4160469 4127883 4093624 4059246 4026584 3996650 3969532 3945210 3923962
61980C923962j7975j4832j1728q182m054O4L460O173R012J2570J6417J9564K1567
$$ 3923962 3905987 3891155 3879427 3871245 3867191 3867255 3870715 3876888 3885900 3898470 3914887 3934451 3956018
61967C956018K2861K4046K5377K6988K8946L0793L1540L0671K8816K7034K5605
$$ 3956018 3978879 4002925 4028302 4055290 4084236 4115029 4146569 4177240 4206056 4233090 4258695
61956D258695K3954K1457J7982J3783R268M805N34l488p006r799j2294j5332j9094
$$ 4258695 4282649 4304106 4322088 4335871 4345139 4349944 4350478 4346990 4339984 4330185 4317891 4302559 4283465
61943D283465k2821k5902k8573l1017l2606l2759l2019l1380l0905k9837k7856
$$ 4283465 4260644 4234742 4206169 4175152 4142546 4109787 4077768 4046388 4015483 3985646 3957790
61932C957790k5332k2471j9019j4867j0345n769j121L873R576J6209K3557L1267
$$ 3957790 3932458 3909987 3890968 3876101 3865756 3859987 3858866 3862739 3872315 3888524 3912081 3943348
61920C943348L9673M9709O1695P4904Q8920J04642J23132J44295J67778J94406
$$ 3943348 3983021 4032730 4094425 4169329 4258249 4362891 4486023 4630318 4798096 4992502
61910D992502K25455K61106L01067L46426L99136M59613N26228N97244O71655
$$ 4992502 5217957 5479063 5780130 6126556 6525692 6985305 7511533 8108777 8780432
61901H780432P47559Q20808Q85435R33858R56035R39724Q73302P49235N66704
$$ 8780432 9527991 10348799 11234234 12168092 13124127 14063851 14937153 15686388 16253092
61892A6253092L33976O9611k00362m49562o57920q14130r15018r64423r71237
$$ 16253092 16587068 16656679 16456317 16006755 15348835 14534705 13619687 12655264 11684027
61883A1684027r45977q98016q35443p65806o95245o27056n62243n01549m46273
$$ 11684027 10738050 9840034 9004591 8238785 7543540 6916484 6354241 5852692 5406419
61874E406419l97372l54768l17666k84980k55545k28589k04183j82756j64189
$$ 5406419 5009047 4654279 4336613 4051633 3796088 3567499 3363316 3180560 3016371
61865C016371j47778j33012j19912j08512r8482q9301q0649p2506o5093n8618
$$ 3016371 2868593 2735581 2615669 2507157 2408675 2319374 2238725 2166219 2101126 2042508
61855B042508n2911m7466m2033l6957l2617k8799k4995k1265j8231j6155j4493
$$ 2042508 1989597 1942131 1900098 1863141 1830524 1801725 1776730 1755465 1737234 1721079 1706586
61844A706586j2632j0815r911j0256j1067j1161j0132q490o838n279l717k230
$$ 1706586 1693954 1683139 1673228 1662972 1651905 1640744 1630612 1622122 1615284 1610005 1606288 1604058
61832A604058q32O52K103K873K579J786J324J175P49O2l00k77m72r95j082k35
$$ 1604058 1603226 1603878 1605981 1608854 1611433 1613219 1614543 1615718 1616467 1616529 1616229 1615952 1615480 1614485 1613403 1613168
61816A613168J132K675M846Q060J1698J4802J7320J9934K2984K6254K9638L3329
$$ 1613168 1614300 1616975 1621821 1629881 1641579 1656381 1673701 1693635 1716619 1742873 1772511 1805840
61804A805840L7378M1580M5900N0520N5521O0822O6477P2669P9384Q6438R3839
$$ 1805840 1843218 1884798 1930698 1981218 2036739 2097561 2164038 2236707 2316091 2402529 2496368
61793B496368J01946J11177J21748J33709J47104J62134J79312J99419K23044
$$ 2496368 2598314 2709491 2831239 2964948 3112052 3274186 3453498 3652917 3875961
61784C875961K50176K80498L14239L52711L97849M51173N13312N84619O65981
$$ 3875961 4126137 4406635 4720874 5073585 5471434 5922607 6435919 7020538 7686519
61775G686519P58642Q63117R78626J103484J235257J369712J499514J613940J699173
$$ 7686519 8445161 9308278 10286904 11390388 12625645 13995357 15494871 17108811 18807984
61766A8807984J738150J710918J597534J383732J067116O61527J97735k81075
$$ 18807984 20546134 22257052 23854586 25238318 26305434 26966961 27164696 26883621
61758B6883621p28932j108019j395561j584544j680615j697905j654721j569422
$$ 26883621 26154689 25046670 23651109 22066565 20385950 18688045 17033324 15463902
61750A5463902j457887j332985j204697j079925r62579q54560p56786o69485n92255
$$ 15463902 14006015 12673030 11468333 10388408 9425829 8571269 7814483 7144998 6552743
61741F552743n24390m65049m13128l67457l27338k92415k61951k34855k10636
$$ 6552743 6028353 5563304 5150176 4782719 4455381 4162966 3901015 3666160 3455524
61732C455524j89655j71976j56610j42442j29438j18314j09265j01563r4280q7010
$$ 3455524 3265869 3093893 2937283 2794841 2665403 2547089 2437824 2336261 2241981 2154971
61722B154971q0063p4182o9744o6039o1801n6721n1889m8268m5311m1682l7004
$$ 2154971 2074908 2000726 1930982 1864943 1803142 1746421 1694532 1646264 1600953 1559271 1522267
61711A522267l2136k7906k4346k1129j8248j5987j4573j3831j3125j1796r905
$$ 1522267 1490131 1462225 1437879 1416750 1398502 1382515 1367942 1354111 1340986 1329190 1319285
61700A319285q228p305o781o040n081m338l887l381k592j504r9J538K976L825
$$ 1319285 1311057 1303752 1296971 1290931 1285850 1281512 1277625 1274244 1271652 1270148 1270049 1271587 1274563 1278388
61686A278388M171M235L775K421M64j324k647l891n266o400o994p404q264r815
$$ 1278388 1282559 1286794 1290569 1292990 1293454 1292130 1289483 1285592 1280326 1273926 1266932 1259528 1251264 1241449
61672A241449j1834j3910j5525j6200j5897j5173j4640j4342j3869j3050j2237
$$ 1241449 1229615 1215705 1200180 1183980 1168083 1152910 1138270 1123928 1110059 1097009 1084772
61661A084772j1782j1504j0879r744q472p339o083m364k450r44J60J608L806O131
$$ 1084772 1072990 1061486 1050607 1040863 1032391 1025052 1018969 1014605 1012155 1011211 1011371 1012979 1016785 1022916
61647A022916P647Q259Q678R416J0318J1078J1759J2569J3374J3719J3349J2532
$$ 1022916 1030563 1038822 1047500 1056916 1067234 1078312 1090071 1102640 1116014 1129733 1143082 1155614
61635A155614J1788J1322J0910J0286R475Q538P302N605L725K091O57j048l186
$$ 1155614 1167402 1178724 1189634 1199920 1209395 1217933 1225235 1230840 1234565 1236656 1237313 1236265 1233079
61622A233079n393p372r194j0798j1765j1964j2054j2766j3879j4404j3732j2225
$$ 1233079 1227686 1220314 1211120 1200322 1188557 1176593 1164539 1151773 1137894 1123490 1109758 1097533
61610A097533j0632r316q136o797n177l385j629o7J248K349L305M230N237O407
$$ 1097533 1086901 1077585 1069449 1062652 1057475 1054090 1052461 1052394 1053642 1055991 1059296 1063526 1068763 1075170
61596A075170P830R507J1132J2153J2334J2153J2370J3200J4167J4650J4294J3068
$$ 1075170 1083000 1092507 1103639 1115792 1128126 1140279 1152649 1165849 1180016 1194666 1208960 1222028
61584A222028J1390J0067R655R751R384Q183O737N773N520N925O873P952Q598
$$ 1222028 1233418 1243485 1253140 1262891 1272275 1280458 1287195 1292968 1298488 1304413 1311286 1319238 1327836
61571A327836Q823R345J0688J2503J4230J5920J7967K0313K2423K3896K4755K5206
$$ 1327836 1336659 1346004 1356692 1369195 1383425 1399345 1417312 1437625 1460048 1483944 1508699 1533905
61559A533905K5446K5610K5671K5463K4967K4381K3835K3209K2445K1755K1313
$$ 1533905 1559351 1584961 1610632 1636095 1661062 1685443 1709278 1732487 1754932 1776687 1798000
61548A798000K0888K0033J8499J6305J3525J0177O312K100k158o109r574j2431
$$ 1798000 1818888 1838921 1857420 1873725 1887250 1897427 1903739 1905839 1903681 1897572 1887998 1875567
61536A875567j4340j4866j4230j3493j3469j3739j3295j1979j0536r464q656q028
$$ 1875567 1861227 1846361 1832131 1818638 1805169 1791430 1778135 1766156 1755620 1746156 1737500 1729472
61524A729472p579o762m784j828J028L377O125J0145J5180K0564K6227L2396L9093
$$ 1729472 1721893 1715131 1710347 1708519 1709547 1712924 1719049 1729194 1744374 1764938 1791165 1823561 1862654
61511A862654M6515N5306O5801P7628R0484J04677J20355J37067J54746J74319
$$ 1862654 1909169 1964475 2030276 2107904 2198388 2303065 2423420 2560487 2715233 2889552
61501B889552J96415K20059K43521K65923K86969L05490L19188L25480L21785
$$ 2889552 3085967 3306026 3549547 3815470 4102439 4407929 4727117 5052597 5374382
61492E374382L05311K73972K27978J70234J05248L7919k7130q6158j36655j77098
$$ 5374382 5679693 5953665 6181643 6351877 6457125 6495044 6467914 6381756 6245101 6068003
61482F068003k06719k25861k35975k38635k34766k25254k11666j95691j78324
$$ 6068003 5861284 5635423 5399448 5160813 4926047 4700793 4489127 4293436 4115112
61473D115112j60218j42279j25010j07801q9962p2064n5319l9925k5183j0997
$$ 4115112 3954894 3812615 3687605 3579804 3489842 3417778 3362459 3322534 3297351 3286354
61463C286354K007J3825K5189L6036M5029N1230N5265N8249O0257O0573N8999
$$ 3286354 3288361 3302186 3327375 3363411 3408440 3459670 3514935 3573184 3633441 3694014 3753013
61452C753013N6210N2968M9557M5959M2339L9196L7106L6326L6843L8757M2285
$$ 3753013 3809223 3862191 3911748 3957707 4000046 4039242 4076348 4112674 4149517 4188274 4230559
61441D230559M7147N2325N6850O0591O3850O6465O7702O6883O3717N8231N0812
$$ 4230559 4277706 4330031 4386881 4447472 4511322 4577787 4645489 4712372 4776089 4834320 4885132
61430D885132M2010L1957K0300P133o409j9050l0450m0778m9724n6739o1868o5478
$$ 4885132 4927142 4959099 4979399 4986532 4980123 4961073 4930623 4889845 4840121 4783382 4721514 4656036
61418D656036o7365o6972o4339o0020n4281m7261l9723l2513k5360j7271q337
$$ 4656036 4588671 4521699 4457360 4397340 4343059 4295798 4256075 4223562 4198202 4180931 4172594
61407D172594k5O554J1650J5737J8370J8851J7290J4229R758L769l135r645j4695
$$ 4172594 4172569 4179123 4190773 4206510 4224880 4243731 4261021 4275250 4285008 4288777 4285642 4275997 4261302
61394D261302j8067j9974k0316j8443j3694o094L803J5812L0467M8124O8213Q9873
$$ 4261302 4243235 4223261 4202945 4184502 4170808 4164714 4168517 4184329 4214796 4262920 4331133 4421006
61382D421006J12995J37940J64507J92016K20186K49017K77663L04247L26960
$$ 4421006 4534001 4671941 4836448 5028464 5248650 5497667 5775330 6079577 6406537
61373F406537L44627L55815L58184L49184L27089K91210K41884J81068J12899
$$ 6406537 6751164 7106979 7465163 7814347 8141436 8432646 8674530 8855598 8968497
61364H968497M2979k3461q3187j35273j80068k17974k49201k74373k94520l10006
$$ 8968497 9011476 8988015 8904828 8769555 8589487 8371513 8122312 7847939 7553419 7243413
61354G243413l19997l23579l21196l14426l04685k92630k78556k62609k44804
$$ 7243413 6923416 6599837 6278641 5964215 5659530 5366900 5088344 4825735 4580931
61345D580931k25514k05825j86778j68351j49793j30895j12342r4913p8913o4341
$$ 4580931 4355417 4149592 3962814 3794463 3644670 3513775 3401433 3306520 3227607 3163266
61335C163266n0912l7996k5131j2620j120R249J8877K7959L6308M3707M9850N4255
$$ 3163266 3112354 3074358 3049227 3036607 3035487 3044736 3063613 3091572 3127880 3171587 3221437 3275692
61323C275692N6833N8247N9098N9094N7723N5271N2317M8852M4834M1142L8645
$$ 3275692 3332525 3390772 3449870 3508964 3566687 3621958 3674275 3723127 3767961 3809103 3847748
61312C847748L6704L4009L0711K8224K6903K5448K2772J9070J4703R519L693k086
$$ 3847748 3884452 3918461 3949172 3977396 4004299 4029747 4052519 4071589 4086292 4095811 4099504 4097418
61300D097418p796j4209k1302k7861l3360l8918m5562n2562n8524o3162o7058
$$ 4097418 4089622 4075413 4054111 4026250 3992890 3953972 3908410 3855848 3797324 3734162 3667104
61289C667104p0298p2374p2943p1969o9491o5777o1225n5700m8684m0492l2502
$$ 3667104 3596806 3524432 3451489 3379520 3310029 3244252 3183027 3127327 3078643 3038151 3005649
61278C005649k5608j9246j2654o329j462J486K842K894J852J65j850m435p832
$$ 3005649 2980041 2960795 2948141 2941812 2940350 2941836 2944678 2947572 2949424 2949589 2947739 2943304 2935472
61265B935472j1612j5014j7668j9507k0423k0405j9505j7364j3256p072M63Q952
$$ 2935472 2923860 2908846 2891178 2871671 2851248 2830843 2811338 2793974 2780718 2773646 2774109 2783061
61253B783061J9071L1458M5539O0188P4985R0086J05291J20097J34293J47615
$$ 2783061 2802132 2833590 2879129 2939317 3014302 3104388 3209679 3329776 3464069 3611684
61243C611684J58916J66349J68347J63932J52156J31981J02907O5693K2444k3885
$$ 3611684 3770600 3936949 4105296 4269228 4421384 4553365 4656272 4721965 4744409 4720524
61233D720524p0239j13763j51482j80357j98570k06851k07637k02846j93197j79678
$$ 4720524 4650285 4536522 4385040 4204683 4006113 3799262 3591625 3388779 3195582 3015904
61223C015904j64434j49469j35358j21853j09044r7255q6479p6654o7930o0150
$$ 3015904 2851470 2702001 2566643 2444790 2335746 2238491 2152012 2075358 2007428 1947278
61213A947278n2618m5045l8149l2611k7962k3139j7756j2230p089k701P75L674
$$ 1947278 1894660 1849615 1811466 1778855 1750893 1727754 1709998 1697768 1690679 1687978 1688753 1692427
61201A692427O693J0004J2961J5084J6664J7950J8409J7484J5482J3029J0257
$$ 1692427 1699120 1709124 1722085 1737169 1753833 1771783 1790192 1807676 1823158 1836187 1846444
61190A846444P202M515K912K241J666N80j197l606o272q614j0543j2579j4860
$$ 1846444 1853646 1858161 1861073 1863314 1864980 1865560 1864363 1860757 1854485 1845871 1835328 1822749 1807889
61177A807889j6661j7419j7564j7790j8127j8458j9185k0600k2182k3277k4092
$$ 1807889 1791228 1773809 1756245 1738455 1720328 1701870 1682685 1662085 1639903 1616626 1592534
61166A592534k5236k6791k8514l0369l2157l3197l3183l2909l3292l4161l4652
$$ 1592534 1567298 1540507 1511993 1481624 1449467 1416270 1383087 1350178 1316886 1282725 1248073
61155A248073l4323l3221l1434k9444k8249k8344k8990k9226k8994k8544k7592
$$ 1248073 1213750 1180529 1149095 1119651 1091402 1063058 1034068 1004842 975848 947304 919712
61144I19712k5987k4401k3261k1734j8985j5704j3163j1308r273p116n548m316
$$ 919712 893725 869324 846063 824329 805344 789640 776477 765169 755896 748780 743232 738916
61132G38916k534l72J173K131L481N213O107N869N866P179R217J0912J2198J3633
$$ 738916 736382 736010 737183 739314 742795 748008 754115 759984 765850 773029 782246 793158 805356 818989
61118H18989J5395J7366J9463K1441K2855K3633K4115K4344K3923K2767K1303
$$ 818989 834384 851750 871213 892654 915509 939142 963257 987601 1011524 1034291 1055594
61107A055594J9751J7856J5533J3077J0489P263L226q91m108o124p477r016j1149
$$ 1055594 1075345 1093201 1108734 1121811 1132300 1139563 1142789 1141898 1137790 1131666 1124189 1115173 1104024
61094A104024j3364j4656j4694j4229j3972j3702j3142j2988j3969j5362j5694
$$ 1104024 1090660 1076004 1061310 1047081 1033109 1019407 1006265 993277 979308 963946 948252
61083I48252j4743j3618j2938j2167j0948r787r121q719q433q601r292r940j0093
$$ 948252 933509 919891 906953 894786 883838 874051 864930 856211 847778 839177 829885 819945 809852
61070H09852r868r475q975q639q765q977q599p901q017r256j0383j0113q604o953
$$ 809852 799984 790509 781534 772895 764130 755153 746554 738653 730636 721380 710997 700884 692280 685327
61056F85327n868n332n052m641l675k056j79J386K325K753L287M669O927R065
$$ 685327 679459 674127 669075 664434 660759 658703 658524 659910 662235 664988 668275 672944 679871 688936
61042F88936J0212J0751J1659J2929J3547J2974J1727J0477R397Q514P888P244
$$ 688936 699148 709899 721558 734487 748034 761008 772735 783212 792609 801123 809011 816255
61030H16255O167M824L870L550L521L507L521L511L492L936N137O480P175P590
$$ 816255 822422 827246 831116 834666 838187 841694 845215 848726 852218 856154 861291 867771 874946 882536
61016H82536Q775J0784J2635J3950J5412J7410J9472K1275K3196K5501K7995L0617
$$ 882536 891311 902095 914730 928680 944092 961502 980974 1002249 1025445 1050946 1078941 1109558
61004A109558L3459L6056L7820L9372M2219M6806N1961N6462O0036O2681O4426
$$ 1109558 1143017 1179073 1216893 1256265 1298484 1345290 1397251 1453713 1513749 1576430 1640856
60993A640856O6078O9031P3899Q0441Q8758R9111J10498J21254J31316J42270
$$ 1640856 1706934 1775965 1849864 1930305 2019063 2118174 2228672 2349926 2481242 2623512
60983B623512J55316J71607J94770K29941K79328L41812M18200N13207O30363
$$ 2623512 2778828 2950435 3145205 3375146 3654474 3996286 4414486 4927693 5558056
60974E558056P69117R30018J117863J335125J577676J843144K131704K413701
$$ 5558056 6327173 7257191 8375054 9710179 11287855 13130999 15262703 17676404
60966A7676404K589581K511353K086792J382064O10512L136l18751l60783j88792
$$ 17676404 20265985 22777338 24864130 26246194 26856706 26859842 26541091 26180308 25991516
60957B5991516J12510M15871N40620L29702k33155r89485j701998k193653k413839
$$ 25991516 26104026 26519897 27060517 27390219 27157064 26167579 24465581 22271928 19858089
60948A9858089k407661k251855k015818j751690j493210j256971j048908q71372
$$ 19858089 17450428 15198573 13182755 11431065 9937855 8680884 7631976 6760604
60940F760604p24394o04223n05440m24719l60780l11639k74001k44938k22340
$$ 6760604 6036210 5431987 4926547 4501828 4141048 3829409 3555408 3310470 3088130
60931C088130k04009j87894j73156j59823j47472j35278j23079j11335j00145
$$ 3088130 2884121 2696227 2523071 2363248 2215776 2080498 1957419 1846084 1745939
60922A745939q9404p9807p2609o8126o5282o2829o0272n7419n3840m9371m4640
$$ 1745939 1656535 1576728 1504119 1435993 1370711 1307882 1247610 1190191 1136351 1086980 1042340
60911A042340m0565l7337l4328l0902k7116k3592k0856j8882j7299j5930j4956
$$ 1042340 1001775 964438 930110 899208 872092 848500 827644 808762 791463 775533 760577
60900G60577j4496j4247j3785j3081j2383j1651j0531r009p654o908o423n493
$$ 760577 746081 731834 718049 704968 692585 680934 670403 661394 653740 646832 640409 634916
60888F34916m050k712j867j211l60M95R62J111J361J969K974M439O227P743Q510
$$ 634916 630866 628154 626287 625076 624716 625211 626173 627284 628645 630614 633588 638027 644254 651997 660507
60873F60507Q964J0043J1952J3969J5571J7040J8572J9540J9258J7988J6537J5113
$$ 660507 669471 679514 691466 705435 721006 738046 756618 776158 795416 813404 829941 845054
60861H45054J3145J0178O374K239j704n004p456r291j0903j2381j3543j4255j4374
$$ 845054 858199 868377 874751 876990 875286 870282 862826 853535 842632 830251 816708 802453 788079
60848G88079j3519j1421q525n796l716j829M34K872M780N907O691P531Q278Q616
$$ 788079 774560 763139 754614 748818 745102 743273 743707 746579 751359 757266 763957 771488 779766 788382
60834G88382Q549Q202P457O301N385N671P344R619J1801J3979J6259J7972J8339
$$ 788382 796931 805133 812590 818891 824276 829947 837291 846910 858711 872690 888949 906921 925260
60821I25260J7665J7086J7225J7706J7901J7519J6446J4697J2763J1364J0645
$$ 925260 942925 960011 977236 994942 1012843 1030362 1046808 1061505 1074268 1085632 1096277
60810A096277J0028R041P855O830O029N365M830M235L163J358j116m163p767j1619
$$ 1096277 1106305 1115346 1123201 1130031 1136060 1141425 1146255 1150490 1153653 1155011 1153895 1149732 1141965 1130346
60796A130346j5161j8153k0803k3145k4698k5062k4457k3397k2113k0569j8715
$$ 1130346 1115185 1097032 1076229 1053084 1028386 1003324 978867 955470 933357 912788 894073
60785H94073j6580j4267j2016r928p645m706j366J396K841L178L232L762N131
$$ 894073 877493 863226 851210 841282 833637 828931 827565 828961 831802 834980 838212 841974 847105
60772H47105P100Q805R422Q991Q200P398O351M998L702K550J166n52k100l119
$$ 847105 854205 863010 872432 881423 889623 897021 903372 908370 912072 914622 915788 915236 913136 910017
60758I10017l778m131l722k318l92J521L515N921Q745J1866J5270J8661K1424
$$ 910017 906239 902108 898386 896068 895676 897197 900712 906633 915378 927244 942514 961175 982599
60745I82599K3369K5006K6640K7679K7324K5503K2734J9561J6523J4113J2259
$$ 982599 1005968 1030974 1057614 1085293 1112617 1138120 1160854 1180415 1196938 1211051 1223310
60734A223310J0308P927N620L905K547J080m75j866l124m342n406o342p451q688
$$ 1223310 1233618 1241545 1247165 1251070 1253617 1254697 1254222 1252356 1249232 1244890 1239484 1233142 1225691 1217003
60720A217003r558j0028j0875j2629j4818j6753j8393j9836k0779k1230k1889
$$ 1217003 1207445 1197417 1186542 1173913 1159095 1142342 1123949 1104113 1083334 1062104 1040215
60709A040215k3059k3863k3504k2587k2119k1908k1069j9590j8034j6185j3393
$$ 1040215 1017156 993293 969789 947202 925083 903175 882106 862516 844482 828297 814904
60698H14904j0169p945p031o080l899q35K115M619O938R234J1447J3490J5252
$$ 814904 804735 796790 789759 783679 779780 778945 781060 785679 792617 801851 813298 826788 842040
60685H42040J6565J7366J7661J7423J6629J5327J3385J0512O799K928n92m018
$$ 842040 858605 875971 893632 911055 927684 943011 956396 966908 973707 976635 976043 972025
60673I72025p737j1516j4877j7770k0167k1497k1251j9828j8010j5903j3257j0563
$$ 972025 964288 952772 937895 920125 899958 878461 857210 837382 819372 803469 790212 779649
60661G79649q796q191q124q207q603r276r714r603r143q559p801o760n397l749
$$ 779649 770853 762662 754538 746331 737728 728452 718738 709135 699992 691433 683632 676872 671475 667726
60647F67726k195j397j459j587j194q81j480k625l279l303l269l077k056m44O11
$$ 667726 665531 664134 662675 661088 659894 659013 657533 654908 651629 648326 645057 641980 639924 639480 640091
60632F40091Q14J220K645M624O388P919R477J0964J2277J3627J5061J6246J7055
$$ 640091 640905 642125 644770 649394 655782 663701 673178 684142 696419 710046 725107 741353 758408
60619G58408J7829J8826K0035K1633K3752K5697K6381K5949K5957K7268K8723
$$ 758408 776237 795063 815098 836731 860483 886180 912561 938510 964467 991735 1020458
60608A020458K8665K7120K5454K4357K3116K0790J7262J3038Q513L713j548p336
$$ 1020458 1049123 1076243 1101697 1126054 1149170 1169960 1187222 1200260 1208773 1212486 1210938 1203602
60596A203602j3348j8955k3499k6509k7759k7439k6189k4619k2777k0395j7590
$$ 1203602 1190254 1171299 1147800 1121291 1093532 1066093 1039904 1015285 992508 972113 954523
60585I54523j4935j2822j1194r913q972q257p543o814o205n691n196m990n394
$$ 954523 939588 926766 915572 905659 896687 888430 880887 874073 867868 862177 856981 851991 846597
60572H46597o054o084n070l425j634K67K288M101N437O435P220P595P398O925
$$ 846597 840543 834459 829389 825964 824330 824597 826885 830986 836423 842858 850078 857673 865071 871996
60558H71996O565O241N616M793M463N184O636P878Q525R373J1443J4563J7602
$$ 871996 878561 884802 890418 895211 899674 904858 911494 919372 927897 937270 948713 963276 980878
60545I80878K0195K3342K7947L3556L9271M5121N1679N8784O5611P1414P5123
$$ 980878 1001073 1024415 1052362 1085918 1125189 1170310 1221989 1280773 1346384 1417798 1492921
60534A492921P4665O8072N5340L8286J8769j893k1906l8987n1671n9726o3151
$$ 1492921 1567586 1635658 1690998 1729284 1748053 1746160 1724254 1685267 1633596 1573870 1510719
60523A510719o1890n6808m9724m1923l3606k5017j7020j0021l398L186Q882J2716
$$ 1510719 1448829 1392021 1342297 1300374 1266768 1241751 1224731 1214710 1211312 1214498 1223380 1236096
60511A236096J4855J6107J6920J7582J8751K0931K3917K7547L2576M0115N0486
$$ 1236096 1250951 1267058 1283978 1301560 1320311 1341242 1365159 1392706 1425282 1465397 1515883
60500A515883O3293P8289R5640J15587J38499J65057J95872K30925K69558L10660
$$ 1515883 1579176 1657465 1753105 1868692 2007191 2172248 2368120 2599045 2868603 3179263
60490C179263L52553L93043M29976M61175M83045M89293M71927M24412L44752
$$ 3179263 3531816 3924859 4354835 4816010 5299055 5788348 6260275 6684687 7029439
60481G029439K36415J07070l3315j73420l00791m03249m72378n06564n10514m91755
$$ 7029439 7265854 7372924 7339609 7166189 6865398 6462149 5989771 5483207 4972693 4480938
60471D480938m57718m15017l69279l24364k82177k43796k10286j82079j58415
$$ 4480938 4023220 3608203 3238924 2914560 2632383 2388587 2178301 1996222 1837807
60462A837807j38110j20553j05535r2662q1505p1935o3820n6673n0079m4127l9013
$$ 1837807 1699697 1579144 1473609 1380947 1299442 1227507 1163687 1107014 1056935 1012808 973795
60451I73795l4580l0682k7632k5808k4969k4378k3473k2101k0382j8612j7096
$$ 973795 939215 908533 880901 855093 830124 805746 782273 760172 739790 721178 704082
60440G04082j5807j4421j2872j1566j0831j0388r674q487p158o207n854n696n020
$$ 704082 688275 673854 660982 649416 638585 628197 618523 610036 602878 596671 590817 585121 580101
60427E80101l709k589k409k721k471j484m82K88J398L014M426N182N791O696P397
$$ 580101 576392 573803 571394 568673 566202 564718 564236 564524 565922 568936 573362 578544 584335 591031 598428
60412E98428P290O655O165N892N512N066M860M899M911M758M469M131M014M411
$$ 598428 605718 612373 618538 624430 629942 635008 639868 644767 649678 654436 658905 663036 667050 671461
60398F71461N190N865O250O523O629O284N733N628N893N626M514L402K965K677
$$ 671461 676651 682516 688766 695289 701918 708202 713935 719563 725456 731082 735596 738998 741963 744640
60384G44640J917J178J276J993K374J933P92q77k736m037m328m051l752l200j987
$$ 744640 746557 747735 749011 751004 753378 755311 756103 755226 752490 748453 744125 740074 736322 733122 731135
60369G31135n08N59J277K013K398J873R94J008K068K981K894K272J969K194K819
$$ 731135 730627 731186 732463 734476 736874 738747 739741 740749 742817 745798 748692 750964 752933 755127 757946
60354G57946L931N540P191Q357Q964R280R554R948J0546J1151J1279J0563R128
$$ 757946 761877 767417 774608 782965 791929 801209 810763 820711 831257 842408 853687 864250 873378
60341H73378P411N780M387L247K289J383M96r0J35J366L054M347N097O125Q099
$$ 873378 880789 886569 890956 894203 896492 897875 898371 898281 898416 899782 902836 907183 912280 918405 926504
60326I26504J0494J2164J2725J2774J2782J2406J1027Q375M586J75l964p116r405
$$ 926504 936998 949162 961887 974661 987443 999849 1010876 1019251 1023837 1024012 1020048 1012932 1003527
60313A003527j1401j2960j3278j2177j0551r160p826o231m802m104l917l545k761
$$ 1003527 992126 979166 965888 953711 943160 934000 926174 919943 915141 911037 907120 903575 900814
60300I00814j892j242q46o23l98lN25R54J191J252R58J61p73j252j319j473j657
$$ 900814 898922 897680 896834 896211 895813 895810 896335 897289 898480 899732 900690 900851 900078 898826 897507 896034 894377
60283H94377j219j45N89K77n45q55k39J102K824M551O049P537R346J1211J2569
$$ 894377 893158 893013 893602 893879 893334 892479 892240 893342 896166 900717 906766 914303 923649 934860 947429
60268I47429J3619J5161J7362J9607K1744K4265K7031K9093L0366L2264L5971
$$ 947429 961048 976209 993571 1013178 1034922 1059187 1086218 1115311 1145677 1177941 1213912
60257A213912M1052M6430N1689N6860O1970O7500P4209Q1871Q9291R6225J03961
$$ 1213912 1254964 1301394 1353083 1409943 1471913 1539413 1613622 1695493 1784784 1881009 1984970
60246A984970J13163J22532J30554J37220J42856J46576J47364J45611J42138
$$ 1984970 2098133 2220665 2351219 2488439 2631295 2777871 2925235 3070846 3212984
60237C212984J36626J28385J17769J05438R1159P4839N7762M1261K4936P852r288
$$ 3212984 3349610 3477995 3595764 3701202 3792361 3867200 3924962 3966223 3991159 3999011 3989723
60226C989723k4801l8143m9615n8626o4069o5998o5180o1487n4421m4769l3842
$$ 3989723 3964922 3926779 3877164 3818538 3754469 3688471 3623291 3561804 3507383 3462614 3428772
60215C428772k1508o919R222K5196M0886N7591P5193R1819J06594J20476J33781
$$ 3428772 3407264 3400345 3409567 3434763 3475649 3533240 3608433 3700252 3806846 3927322 4061103
60204D061103J44928J52584J57071J58630J55939J47614J34027J16638R6462P4030
$$ 4061103 4206031 4358615 4515686 4674316 4830255 4977869 5111896 5228534 5324996 5399026
60194E399026M9995K5019l11k5096m8439p0305r1002j09591j24046j33258j37622
$$ 5399026 5449021 5474040 5473729 5448633 5400194 5329889 5238887 5129296 5005250 4871992 4734370
60183D734370j37384j31889j21198j06940r0686p2557n2306l0688q828J2916L4487
$$ 4734370 4596986 4465097 4343899 4236959 4146273 4073716 4021410 3990722 3981894 3994810 4029297
60172D029297N5267P4408R1328J05229J14792J19098J18277J12791J02799Q8789
$$ 4029297 4084564 4158972 4250300 4355529 4470321 4589419 4707696 4820487 4923286 5012075
60162E012075P2061N3924L5009J5816k813k0237l6238n0073o0209o5646o6733
$$ 5012075 5084136 5138060 5173069 5188885 5186072 5165835 5129597 5079524 5019315 4953669 4886936
60151D886936o3973n6831m4685k8259r122J1758L4051N7165Q0358J03674J27786
$$ 4886936 4822963 4766132 4721447 4693188 4684066 4695824 4729875 4787040 4867398 4971072 5098858
60140E098858J52837J78132K03191K28620K55663K84986L15892L46724L76086
$$ 5098858 5251695 5429827 5633018 5861638 6117301 6402287 6718179 7064903 7440989
60131G440989M03602M29265M52156M70167M80923M82627M74276M55813M28156
$$ 7440989 7844591 8273856 8726012 9196179 9677102 10159729 10634005 11089818 11517974
60122A1517974L92470L49317K98916K42161J80591J15472M7689k1453r0186j57170
$$ 11517974 11910444 12259761 12558677 12800838 12981429 13096901 13144590 13123137 13032951 12875781
60112A2875781k21510k81619l34934l78996m12069m32684m39809m34036m17574
$$ 12875781 12654271 12372652 12037718 11658722 11246653 10813969 10374160 9940124 9522550
60103I522550l92477l59706l20428k77046k31890j85636j38031q9778m2671J929
$$ 9522550 9130073 8770367 8449939 8172893 7941003 7755367 7617336 7527558 7484887 7486816
60093G486816M3823Q3006J18570J48693J71502J85859J91324J87504J73956J51170
$$ 7486816 7530639 7613645 7732215 7880908 8052410 8238269 8429593 8617097 8791053 8942223
60083H942223J21347Q7384N1187J3624k4132o0345r3932j24788j52678j76912
$$ 8942223 9063570 9150954 9202141 9215765 9191633 9131288 9037356 8912568 8759890 8582978
60073H582978j97471k15241k30367k41423k47075k47764k44840k38732k28939
$$ 8582978 8385507 8170266 7939899 7698476 7451401 7203637 6958797 6720065 6491126
60064F491126k15360j98706j79710j58779j36366j13132q9658o6093m1997j6682
$$ 6491126 6275766 6077060 5897350 5738571 5602205 5489073 5399415 5333322 5291325 5274643
60054E274643R728L5712N9497Q0977J01517J21654J39987J54701J64985J70281
$$ 5274643 5284371 5320083 5379580 5460557 5562074 5683728 5823715 5978416 6143401 6313682
60044F313682J69277J60880J45576J24902J00067P1941M1827J1040j9988n1249
$$ 6313682 6482959 6643839 6789415 6914317 7014384 7086325 7128152 7139192 7119204 7067955
60034G067955q1892j10267j35055j55591j71194j81083j85082j83874j78342j69116
$$ 7067955 6986063 6875796 6740741 6585150 6413956 6232873 6047791 5863917 5685575 5516459
60024E516459j56813j42212j26065j08971r1363p3467n5219l6404j6764L977K5951
$$ 5516459 5359646 5217434 5091369 4982398 4891035 4817568 4762349 4725945 4709181 4713158 4739109
60013D739109M8893P2317R5990J19922J43875J67195J89164K08908K24820K34797
$$ 4739109 4788002 4860319 4956309 5076231 5220106 5387301 5576465 5785373 6010193 6244990
60003F244990K37424K32566K20635K01801J76312J45148J09984P2721L5036k118
$$ 6244990 6482414 6714980 6935615 7137416 7313728 7458876 7568860 7641581 7676617 7674499
59993G674499l8646p4428j08240j38205j63166j82786j96214k02021k00031j92095
$$ 7674499 7635853 7561425 7453185 7314980 7151814 6969028 6772814 6570793 6370762 6178667
59983F178667j80180j64539j44722j21616r7315p3100m8581k2836M083L0884N5893
$$ 6178667 5998487 5833948 5689226 5567610 5470295 5397195 5348614 5325778 5329861 5360745 5416638
59972E416638P8267R8394J16706J32209J42924J47964J48257J44845J37594J26315
$$ 5416638 5494905 5593299 5710005 5842214 5985138 6133102 6281359 6426204 6563798 6690113
59962F690113J12188R6870Q0831O3704M5915K8782J3160r66j3440k3388k9788
$$ 6690113 6802301 6899171 6980002 7043706 7089621 7118403 7131563 7130597 7117157 7093769 7063981
59951G063981l1927k9167k0983p460J0783L3412O0750R3106J30054J70630K14143
$$ 7063981 7032054 7002887 6981904 6974444 6985227 7018639 7079389 7172495 7302549 7473179 7687322
59940G687322K60484L09593L60701M12199M62106N08363N48518N79618N98708
$$ 7687322 7947806 8257399 8618100 9030299 9492405 10000768 10549286 11128904 11727612
59931A1727612O02945N88839N52275M90597M04796K98986J78240M8155q3829k08800
$$ 11727612 12330557 12919396 13471671 13962268 14367064 14666050 14844290 14892445 14808616 14599816
59921A4599816l19215m10657m80903n28810n55001n62246n53844n32303n00253
$$ 14599816 14280601 13869944 13389041 12860231 12305230 11742984 11189140 10656837 10156584
59912A0156584m61411m19247l75210l29317k81954k34051j86017j37816q9876
$$ 10156584 9695173 9275926 8900716 8571399 8289445 8055394 7869377 7731561 7641685
59903G641685m2954K802M7751R1689J33561J72176K06580K35775K58547K73412
$$ 7641685 7598731 7601533 7649284 7740973 7874534 8046710 8253290 8489065 8747612 9021024
59893I021024K78345K70881K49090K12545J62260J00196K9186m7077j24568j99246
$$ 9021024 9299369 9570250 9819340 10031885 10194145 10294341 10323527 10276450 10151882 9952636
59883I952636k66878l23520l66802l96457m13240m17955m11882l97264l76463
$$ 9952636 9685758 9362238 8995436 8598979 8185739 7767784 7355902 6958638 6582175
59874F582175l51065l22322k91898k61412k31707k03156j76262j51469j28971
$$ 6582175 6231110 5908788 5616890 5355478 5123771 4920615 4744353 4592884 4463913
59865D463913j09282r3427q1931p4225o9517o7555o7949o9579p1471p3405p4779
$$ 4463913 4354631 4261204 4179273 4105048 4035531 3967976 3900027 3830448 3758977 3685572 3610793
59854C610793p3882o9442o2299n4166m5352l5083k3713j3114m774J163M650M733
$$ 3610793 3536911 3467469 3405170 3351004 3305652 3270569 3246856 3233742 3228968 3230131 3234781 3239514
59842C239514M30p922j8625k9674l9746m8378n5333n9928o1286n9270n4643m8250
$$ 3239514 3239944 3232022 3213397 3183723 3143977 3095599 3040266 2980338 2919052 2859782 2805139 2756889
59830B756889m0549l2069k3366j4343m559N467J4446K2299L0619M0381N0522N9776
$$ 2756889 2716340 2684271 2660905 2646562 2642003 2647470 2661916 2684215 2714834 2755215 2805737 2865513
59818B865513O8533P7468Q5411R0329R1670R0215Q6304P9855P1681O2983N3692
$$ 2865513 2934046 3011514 3096925 3187254 3278924 3369139 3455443 3535298 3606979 3669962 3723654
59807C723654M2876L0622J8096N890o081j6990k4893k8461k7827k3665j6518p108
$$ 3723654 3766530 3797152 3815248 3821138 3815057 3798067 3773174 3744713 3716886 3693221 3676703 3669595
59795C669595L934J6795L2037M9488O8602Q9785J14167J42070J72910K06669K44150
$$ 3669595 3673529 3690324 3722361 3771849 3840451 3930236 4044403 4186473 4359383 4566052 4810202
59784D810202K85552L29955L76396M24056M70660N11401N39640N47806N27651
$$ 4810202 5095754 5425709 5802105 6226161 6696821 7208222 7747862 8295668 8823319
59775H823319M71538L76007K45482R3283o1210j98419l04829l75954m14351m25426
$$ 8823319 9294857 9670864 9916346 10009629 9948419 9750000 9445171 9069217 8654866 8229440
59765H229440m15112l89715l55451l17196k78112k40314k05032j72291j41568
$$ 8229440 7814328 7424613 7069162 6751966 6473854 6233540 6028508 5856217 5714649
59756E714649j12900q6681o2628l9945j8369J931K1330M0533N9529P7880R6042
$$ 5714649 5601749 5515068 5452440 5412495 5394126 5396057 5417387 5457920 5517449 5595329 5691371
59745E691371J15274J36151J58238J81289K05731K31880K59800K90036L23454
$$ 5691371 5806645 5942796 6101034 6282323 6488054 6719934 6979734 7269770 7593224
59736G593224L60153L99507M41327M85976N33107N81309O29073O75035P17083
$$ 7593224 7953377 8352884 8794211 9280187 9813294 10394603 11023676 11698711 12415794
59727A2415794P52183P77309P89766P86889P66874P30537O81490O24597N65149
$$ 12415794 13167977 13945286 14735052 15521941 16288815 17019352 17700842 18325439 18890588
59718A8890588N09282M63572M33376M22054M31386M61214N08436N67867O34681
$$ 18890588 19399870 19863442 20296818 20718872 21150258 21611472 22119908 22687775 23322456
59709B3322456P04946P73544Q33143Q76092Q96302Q88952Q49970P77334O72522
$$ 23322456 24027402 24800946 25634089 26510181 27406483 28295435 29145405 29922739 30595261
59700C0595261N40118L86916K22004N6611r7722k31403l37598m12083m53268m62082
$$ 30595261 31135379 31522295 31744299 31800910 31703188 31471785 31134187 30722104 30268836 29806754
59690B9806754m41226l94437l26067k40282j39998k6983R6977K29639L69147N14504
$$ 29806754 29365528 28971091 28645024 28404742 28264744 28237761 28334738 28564377 28933524 29448028
59680B9448028O64832Q18466R72455J121829J258837J373502J455034J492146
$$ 29448028 30112860 30931326 31903781 33025610 34284447 35657949 37112983 38605129
59672C8605129J472559J384212J218732R74725O59400K89192j10865n10539q80031
$$ 38605129 40077688 41461900 42680632 43655357 44314757 44603949 44493084 43982545 43102514
59663D3102514j194620j436918j598264j679574j689747j641809j549949j429039
$$ 43102514 41907894 40470976 38872712 37193138 35503391 33861582 32311633 30882594
59655C0882594j294571j161666j044558r56892r10163r09247r48671j013561j084704
$$ 30882594 29588023 28426357 27381799 26424907 25514744 24605497 23656826 22643265 21558561
59646B1558561j144329j180132j186776j164896j119008j055844r82956r06611
$$ 21558561 20414232 19234100 18047324 16882428 15763420 14707576 13724620 12818009
59638A2818009q30249p55395o83777o17380n56785n01118m49946m03771l62386
$$ 12818009 11987760 11232365 10548588 9931208 9374423 8873305 8423359 8019588 7657202
59629G657202l24388k88888k56343k26991j99893j74336j50846j29954j11124
$$ 7657202 7332814 7043926 6787583 6560592 6360699 6186363 6035517 5905563 5794439
59620E794439r3788p8384o5496n5059m7201m2801m2294m4945n0083n7947o8371
$$ 5794439 5700651 5622267 5556771 5501712 5454511 5411710 5369416 5324471 5274388 5216441 5148070
59609E148070p9813r0682j00611j09477j16324j20410j22270j22438j20154j14649
$$ 5148070 5068257 4977575 4876964 4767487 4651163 4530753 4408483 4286045 4165891 4051242
59599D051242j06891r8612r0280q1453p2419o3906n5587m6441l6502k6964j8634
$$ 4051242 3944351 3845739 3755459 3674006 3601587 3537681 3482094 3435653 3399151 3372187 3353553
59588C353553j1304m565J829Q182J4411J9442K2123K2755K2806K3185K3568K3448
$$ 3353553 3342249 3337684 3339513 3347695 3362106 3381548 3403671 3426426 3449232 3472417 3495985 3519433
59576C519433K3015K2887K3666K5881K9812L5345M2244N0348N9246O8227P7100
$$ 3519433 3542448 3565335 3589001 3614882 3644694 3680039 3722283 3772631 3831877 3900104 3977204
59565C977204Q6678R7859J10574J24220J38658J54209J71036J89212K09058K30676
$$ 3977204 4063882 4161741 4272315 4396535 4535193 4689402 4860438 5049650 5258708 5489384
59555E489384K53421K76489K99724L23136L45989L67112L85937M02305M15421
$$ 5489384 5742805 6019294 6319018 6642154 6988143 7355255 7741192 8143497 8558918
59546H558918M23847M26663M24044M16621M04964L89832L72494L54488L37242
$$ 8558918 8982765 9409428 9833472 10250093 10655057 11044889 11417383 11771871 12109113
59537A2109113L21867L08884K97771K86929K74578K60272K45674K33220K23378
$$ 12109113 12430980 12739864 13037635 13324564 13599142 13859414 14105088 14338308 14561686
59528A4561686K13323J98720J76309J44273J00981M5269k1862r7201j77472k60325
$$ 14561686 14775009 14973729 15150038 15294311 15395292 15440561 15418699 15321498 15144026 14883701
59518A4883701l42727m19921m87077n41304n81325o06303o16158o12495n98132
$$ 14883701 14540974 14121053 13633976 13092672 12511347 11905044 11288886 10676391 10078259
59509A0078259n75833n48010n16906m84183m50463m15945l81131l46660l13003
$$ 10078259 9502426 8954416 8437510 7953327 7502864 7086919 6705788 6359128 6046125
59500F046125k80799k50896k23550j98158j74318j52496j33076j15441r8615q2214
$$ 6046125 5765326 5514430 5290880 5092722 4918404 4765908 4632832 4517391 4418776 4336562
59490D336562o6206n0330l4432j8741l224J2682K9229M5964O2773Q0495R9814
$$ 4336562 4270356 4220026 4185594 4166853 4163629 4176311 4205540 4251504 4314277 4394772 4494586
59479D494586J20338J41532J63708J87297K11889K36944K62605K88744L13802
$$ 4494586 4614924 4756456 4920164 5107461 5319350 5556294 5818899 6107643 6421445
59470F421445L35716L53380L66093L71936L68003L52122L23593K82550K29574
$$ 6421445 6757161 7110541 7476634 7848570 8216573 8568695 8892288 9174838 9404412
59461I404412J66015R4102J6863o1718j37180k05895k65667l14767l51433l75083
$$ 9404412 9570427 9664529 9681392 9619674 9482494 9276599 9010932 8696165 8344732 7969649
59451G969649l87200l89921l84416l71607l53706l33507l12473k90645k68227
$$ 7969649 7582449 7192528 6808112 6436505 6082799 5749292 5436819 5146174 4877947
59442D877947k46101k24845k04413j84836j66472j49445j33541j18570j04315
$$ 4877947 4631846 4407001 4202588 4017752 3851280 3701835 3568294 3449724 3345409
59433C345409r0386p6781o4282n3588m4282l5335k6328j7552r230j432N477J1135
$$ 3345409 3255023 3178242 3113960 3060372 3016090 2980755 2954427 2936875 2927645 2926213 2931690 2942825
59421B942825J5835K0248K4586K8603L2220L5645L9023M2449M6174N0497N5437
$$ 2942825 2958660 2978908 3003494 3032097 3064317 3099962 3138985 3181434 3227608 3278105 3333542
59410C333542O0507O4450O5612O3585O0810O1379O7747P9303R4292J11865J31957
$$ 3333542 3394049 3458499 3524111 3587696 3648506 3709885 3777632 3856935 3951227 4063092 4195049
59399D195049J54663J80580K10078K41297K70574K96709L23689L57329L99837
$$ 4195049 4349712 4530292 4740370 4981667 5252241 5548950 5872639 6229968 6629805
59390F629805M49077N01999N56567O10660O61207P04870P38341P57983P60509
$$ 6629805 7078882 7580881 8137448 8748108 9409315 10114185 10852526 11610509 12371018
59381A2371018P44468P10601O61261O00351N33109M64377L96988L32483K72595
$$ 12371018 13115486 13826087 14487348 15087699 15620808 16085185 16482173 16814656 17087251
59372A7087251K18591J69575J22914P6242K7894k4114q1761j45470k13894k85050
$$ 17087251 17305842 17475417 17598331 17674573 17702467 17678353 17596592 17451122 17237228 16952178
59362A6952178l56224m22743m78408n17867n38122n38271n19240m84170m37940
$$ 16952178 16595954 16173211 15694803 15176936 14638814 14100543 13581303 13097133 12659193
59353A2659193l85700l32183k82025k39708k08736j91250j88057j98314k19381
$$ 12659193 12273493 11941310 11659285 11419577 11210841 11019591 10831534 10633220 10413839
59344A0413839k47861k80688l14843l46783l73269l92551m03943m06824m01115
$$ 10413839 10165978 9885290 9570447 9223664 8850395 8457844 8053901 7647077 7245962
59335G245962l88330l70845l50217l27039l02148k76853k52080k28255k05800
$$ 7245962 6857632 6486787 6136570 5809531 5507383 5230530 4978450 4750195 4544395
59326D544395j84909j65181j46339j28960j13642r9933q7103p5412o5514n7030
$$ 4544395 4359486 4194305 4047966 3919006 3805364 3705431 3618328 3542916 3477402 3420372
59316C420372m8882m0624l2393k4110j5770q036j272N449J3083K0948K7766L3820
$$ 3420372 3371490 3330866 3298473 3274363 3258593 3250557 3249285 3254734 3267817 3288765 3316531 3350351
59304C350351M0465M7923N5229O2206O9861P8877Q9046J00229J12526J25566J38872
$$ 3350351 3390816 3438739 3493968 3556174 3626035 3704912 3793958 3894187 4006713 4132279 4271151
59293D271151J52779J67776J83201J97820K11356K24049K35206K43654K49243
$$ 4271151 4423930 4591706 4774907 4972727 5184083 5408132 5643338 5886992 6136235
59284F136235K52336K52246K47935K39977K29991K18353K04297J88028J70631
$$ 6136235 6388571 6640817 6888752 7128729 7358720 7577073 7781370 7969398 8140029
59275H140029J51909J30449J05987P9596N1252J9515j5626n1584q5873j18373
$$ 8140029 8291938 8422387 8528374 8607970 8659222 8678737 8663111 8611527 8525654 8407281
59265H407281j49962j80263k07530k29557k44069k49441k45895k35245k19189
$$ 8407281 8257319 8077056 7869526 7639969 7395900 7146459 6900564 6665319 6446130
59256F446130j98785j75440j50973j26303j01294p5987n0701k4899K389L0876
$$ 6446130 6247345 6071905 5920932 5794629 5693335 5617348 5566647 5541748 5544137 5575013
59246E575013N9353Q7913J18079J50422J83929K18226K54516K93532L34250L75487
$$ 5575013 5634366 5722279 5840358 5990780 6174709 6392935 6647451 6940983 7275233 7650720
59236G650720M17129M58730M98354N33836N63870N86889N99958N99695N83319
$$ 7650720 8067849 8526579 9024933 9558769 10122639 10709528 11309486 11909181 12492500
59227A2492500N48258M92280M15247L19862K09970Q8988l9333j69836k96704m14583
$$ 12492500 13040758 13533038 13948285 14268147 14478117 14567105 14527772 14357936 14061232 13646649
59217A3646649n18472o03586o66395p05567p21706p17172o96200o63921o24326
$$ 13646649 13128177 12524591 11858196 11152629 10430923 9713751 9017551 8353630 7729304
59208G729304n79715n32128m84130m37740l93779l52691l15100k81185k50526
$$ 7729304 7149589 6617461 6133331 5695591 5301812 4949121 4634021 4352836 4102310
59199D102310k22945j98616j77235j58138j41313j27135j15094j04226r4715q7516
$$ 4102310 3879365 3680749 3503514 3345376 3204063 3076928 2961834 2857608 2762893 2675377
59189B675377q2257p7295p2090o7643o4213o0595n6334n2666n0204m7587m3619
$$ 2675377 2593120 2515825 2443735 2376092 2311879 2251284 2194950 2142284 2092080 2044493 2000874
59178B000874l9139l5498l2538k9369k5950k2679j9400j5819j2154q544m806j319
$$ 2000874 1961735 1926237 1893699 1864330 1838380 1815701 1796301 1780482 1768328 1759784 1754978 1753659
59166A753659J056K590M927Q888J3375J7232K0906K5250K9952L4250L8149M1985
$$ 1753659 1754715 1757305 1762232 1771120 1784495 1801727 1822633 1847883 1877835 1912085 1950234 1992219
59154A992219M5776M9791N4662O0133O4741O7703P0078P3237P7165Q1097Q4842
$$ 1992219 2037995 2087786 2142448 2202581 2267322 2335025 2405103 2478340 2555505 2636602 2721444
59143B721444Q8717R3008R8114J04374J11383J18533J26462J36531J48556J60620
$$ 2721444 2810161 2903169 3001283 3105657 3217040 3335573 3462035 3598566 3747122 3907742
59133C907742J71657J82414J93287K03071K10783K16873K21531K23688K22967
$$ 3907742 4079399 4261813 4455100 4658171 4868954 5085827 5307358 5531046 5754013
59124E754013K21023K19561K18557K17683K17970K20496K24790K29859K35323
$$ 5754013 5975036 6194597 6413154 6630837 6848807 7069303 7294093 7523952 7759275
59115G759275K40008K40734K34063K18177J91758J52597R9389L4153l8520j13730
$$ 7759275 7999283 8240017 8474080 8692257 8884015 9036612 9136001 9170154 9131634 9017904
59105I017904j86506k51302l03425l40759l63056l70490l64304l47821l25053
$$ 9017904 8831398 8580096 8276671 7935912 7572856 7202366 6838062 6490241 6165188
59096F165188k98667k70212k41365k13483j86708j60916j36872j15304r5619p6804
$$ 6165188 5866521 5596309 5354944 5141461 4954753 4793837 4656965 4541661 4446042 4369238
59086D369238n8856m2171k6426j1265K691J4740K5118L4000M0294M2712M1255
$$ 4369238 4310382 4268211 4241785 4230520 4233211 4247951 4273069 4307069 4347363 4390075 4431330
59075D431330L6479K8173J6017P78j6350l4849n4216p3016q9758j03970j15460
$$ 4431330 4467809 4495982 4511999 4512777 4496427 4461578 4407362 4334346 4244588 4140618 4025158
59064D025158j23425j27402j28178j26787j23473j18623j13572j09393j05899
$$ 4025158 3901733 3774331 3646153 3519366 3395893 3277270 3163698 3054305 2948406
59055B948406j02874j01049j00777j00957j00483r9530r8232r5526r0638q4463
$$ 2948406 2845532 2744483 2643706 2542749 2442266 2342736 2244504 2148978 2058340 1973877
59045A973877p8086p1273o3835n6939n1422m6201m0168l4240k9734k5984k1670
$$ 1973877 1895791 1824518 1760683 1703744 1652322 1606121 1565953 1531713 1501979 1475995 1454325
59034A454325j7279j4022j1305p624l228K69K469M372O383Q002R085R785R562
$$ 1454325 1437046 1423024 1411719 1404095 1400867 1401136 1403605 1407977 1414360 1422362 1431447 1441232 1450794
59021A450794P818N134K582M34j274j905j311p26r70q64R17L540N389O630Q395
$$ 1450794 1458612 1463746 1466328 1466762 1465488 1463583 1462272 1461546 1460576 1459712 1460629 1464169 1469558 1476188 1484583
59006A484583J0442J1695J2296J2965J3147J1907R988Q920Q640Q002P026O608
$$ 1484583 1495025 1506720 1519016 1531981 1545128 1557035 1567023 1575943 1584583 1592585 1599611 1606219
58994A606219O730O902P686R684J1816J2768J3346J5060J7205J7937J7618J8352
$$ 1606219 1612949 1619851 1627537 1637221 1649037 1661805 1675151 1690211 1707416 1725353 1742971 1761323
58982A761323K0460K2191K2862K3668K5201K6628K7736K9449L1954L4266L6067
$$ 1761323 1781783 1803974 1826836 1850504 1875705 1902333 1930069 1959518 1991472 2025738 2061805
58971B061805L8171M0967M4030M7391N1417N5537N8652O0733O2374O3093O2020
$$ 2061805 2099976 2140943 2184973 2232364 2283781 2339318 2397970 2458703 2521077 2584170 2646190
58960B646190N9864N8222N7283N6269N5765N7268O0599O4187O7901P3227Q0583
$$ 2646190 2706054 2764276 2821559 2877828 2933593 2990861 3051460 3115647 3183548 3256775 3337358
58949C337358Q8899R8075J09351J22673J36153J48902J62423J78331J96463K15935
$$ 3337358 3426257 3524332 3633683 3756356 3892509 4041411 4203834 4382165 4578628 4794563
58939D794563K36424K57873K80445L05263L33831L66359M01975M40631M83347
$$ 4794563 5030987 5288860 5569305 5874568 6208399 6574758 6976733 7417364 7900711
58930G900711N30572N81910O37356O97086P59981Q23961Q87608R49488J005920
$$ 7900711 8431283 9013193 9650549 10347635 11107616 11931577 12819185 13768673 14774593
58921A4774593J051269J080469J089412J073044J025429R42350Q22627O67447
$$ 14774593 15825862 16906331 17995743 19068787 20094216 21036566 21859193 22526640
58913B2526640M80903K71417N0526j70365l80872n70432p29523q53098r41196
$$ 22526640 23007543 23278960 23329486 23159121 22778249 22207817 21478294 20625196 19684000
58904A9684000r96056j020598j019411r98398r62513r15533q61853q05970p49822
$$ 19684000 18687944 17667346 16647935 15649537 14687024 13771491 12909638 12103668 11353846
58895A1353846o93161o36994n84121n35750m90265m46354m04864l66638l31046
$$ 11353846 10660685 10023691 9439570 8903820 8413555 7967201 7562337 7195699 6864653
58886F864653k98039k69323k46033k26988k10690j97259j87067j78957j71228
$$ 6864653 6566614 6297291 6051258 5824270 5613580 5416321 5229254 5050297 4879069
58877D879069j63191j54703j45405j35312j25159j15344j05573r5910q6911p8422
$$ 4879069 4715878 4561175 4415770 4280458 4155299 4039955 3934382 3838472 3751561 3673139
58867C673139o9709o1026n3529m7332m1244l4713k8386k2515j6575j0727n671
$$ 3673139 3603430 3542404 3488875 3441543 3400299 3365586 3337200 3314685 3298110 3287383 3281712
58856C281712p76N559J3287K0535K6652L3213M1327N0086N8588O7427P7096Q6860
$$ 3281712 3280936 3286495 3299782 3320317 3346969 3380182 3421509 3471595 3530183 3597610 3674706 3761566
58844C761566R6227J05960J16613J27713J39177J51925J66363J81757J97807K15224
$$ 3761566 3857793 3963753 4080366 4208079 4347256 4499181 4665544 4847301 5045108 5260332
58834E260332K34262K54436K76202L01090L29571L60666L94231M31675M73852
$$ 5260332 5494594 5749030 6025232 6326322 6655893 7016559 7410790 7842465 8316317
58825H316317N20306N71075O26955O87171P48978Q10398Q71025R29046R79669
$$ 8316317 8836623 9407698 10034653 10721824 11470802 12281200 13152225 14081271 15060940
58816A5060940J017571J038611J038055J009625R48169Q51899P21168N57509L65749
$$ 15060940 16078511 17117122 18155177 19164802 20112971 20964870 21686038 22243547 22609296
58807B2609296J55307o2274k76041m75492o50539p94034r03414r78880j021580
$$ 22609296 22764603 22702329 22426288 21950796 21300257 20506223 19602809 18623929 17602349
58798A7602349j034620j023794r95318r53753r02967q47385p90745p34828o80609
$$ 17602349 16567729 15543935 14548617 13594864 12691897 11844512 11053767 10318939 9638330
58789I638330o29419n81990n37712m95871m56441m19165l83486l50041l20444
$$ 9638330 9008911 8426921 7889209 7393338 6936897 6517732 6134246 5784205 5463761
58780E463761k94849k71518k49518k29777k12692j96918j81612j67771j56172
$$ 5463761 5168912 4897394 4647876 4418099 4205407 4008489 3826877 3659106 3502934
58771C502934j46100j37127j29959j24254j17859j09706j01315r4011q6815p8646
$$ 3502934 3356834 3219707 3089748 2965494 2847635 2737929 2636614 2542603 2455788 2377142
58761B377142p0414o3215n6433m9322m2640l6950l1266k5060j9761j6522j4348
$$ 2377142 2306728 2243513 2187080 2137758 2095118 2058168 2026902 2001842 1982081 1965559 1951211
58750A951211j2076j0349r859r577q676q341r647j1410j2131j2453j3595j4967
$$ 1951211 1939135 1928786 1918927 1909350 1900674 1892333 1882686 1871276 1859145 1846692 1833097 1818130
58738A818130j5506j5884j7249j8982j9773j9793j9985k0343k0694k1858k4311
$$ 1818130 1802624 1786740 1769491 1750509 1730736 1710943 1690958 1670615 1649921 1628063 1603752
58727A603752k6807k8127k8954l0407l1940l2402l2060l1829l1644l1052l0315
$$ 1603752 1576945 1548818 1519864 1489457 1457517 1425115 1393055 1361226 1329582 1298530 1268215
58716A268215k9564k8059k5603k3266k1605j9684j7146j5327j4902j4308j2227
$$ 1268215 1238651 1210592 1184989 1161723 1140118 1120434 1103288 1087961 1073059 1058751 1046524
58705A046524r769q416p587o099m364l262k473j779k231m143n714n620n169n841
$$ 1046524 1036755 1028339 1020752 1014653 1010289 1007027 1004554 1002775 1000544 996401 990687 985067 979898 974057
58691I74057o636o183n662o958r381j0820j1022j1186j1409j0922j0018r487q861
$$ 974057 967421 961238 955576 948618 939237 928417 917395 906209 894800 883878 873860 864373 855512
58678H55512p223n069l630l122l080l368l492k318Q6J832J928J903L129M544M889
$$ 855512 848289 843220 839590 836468 833388 830020 826528 824210 824296 826128 828056 829959 833088 837632 842521
58663H42521N172O727Q665R497R581R675R030P156N767O363P600P618P268Q290
$$ 842521 847693 854420 863085 872582 882163 891838 900868 908024 913791 920154 927754 935372 942640 950930
58649I50930J0010J0807J1461J4003J8250K2331K5802K9636L3928L8030M2240
$$ 950930 960940 971747 983208 997211 1015461 1037792 1063594 1093230 1127158 1165188 1207428
58638A207428M7186N2430N7645O3983P2351Q1767R1373J02392J15978J31036J46515
$$ 1207428 1254614 1307044 1364689 1428672 1501023 1582790 1674163 1776555 1892533 2023569 2170084
58627B170084J63883J84651K07445K30343K54021K79433L04220L24729L39757
$$ 2170084 2333967 2518618 2726063 2956406 3210427 3489860 3794080 4118809 4458566
58618D458566L48653L47389L30563K96481K46924J83274J06981K3234n9939j36355
$$ 4458566 4807219 5154608 5485171 5781652 6028576 6211850 6318831 6342065 6282126 6145771
58608F145771k02716k55804k92481l12573l18738l13493k98879k78290k55442
$$ 6145771 5943055 5687251 5394770 5082197 4763459 4449966 4151087 3872797 3617355
58599C617355k31698k06988j82785j61408j42953j25837j09970r6687q6011p6718
$$ 3617355 3385657 3178669 2995884 2834476 2691523 2565686 2455716 2359029 2273018 2196300
58589B196300o8550o1847n5729m9214m3287l9339l6584l3645l1418l1379l2329
$$ 2196300 2127750 2065903 2010174 1960960 1917673 1878334 1841750 1808105 1776687 1745308 1712979
58578A712979l2020l0865l0770l1474l1478l1460l3106l5339l5497l3521l1405
$$ 1712979 1680959 1650094 1619324 1587850 1556372 1524912 1491806 1456467 1420970 1387449 1356044
58567A356044k9285k5859k2059k0321k0449k0024j8695j8379j9398k0013j9776
$$ 1356044 1326759 1300900 1278841 1258520 1238071 1218047 1199352 1180973 1161575 1141562 1121786
58556A121786j9785j9724j8171j5697j4226j3428j1305q099o102n612m715k998
$$ 1121786 1102001 1082277 1064106 1048409 1034183 1020755 1009450 1001351 995249 989637 984922 981924
58544I81924j964j732q93L90O14K74J412L837N375N801O999R095J0112R596Q992
$$ 981924 979960 978228 977335 977725 978339 978613 980025 983862 989237 995038 1002037 1011132 1021244 1030840 1039832
58529A039832Q245N620J127l345p550j2923j8998k3285k5073k6000k6649k5965
$$ 1039832 1048077 1053697 1054824 1051479 1043929 1031006 1012008 988723 963650 937650 911001 885036
58517H85036k4142k2646k1227j8386j4779j2705j2118j0843q605p219o754n358
$$ 885036 860894 838248 817021 798635 783856 771151 759033 748190 739585 732366 725612 720254
58505G20254l075j974k323k266j457j294j581q00L79j52j758j747k97k36j860
$$ 720254 717179 715205 712882 710616 709159 707865 706284 705484 705863 705711 703953 702206 701909 701673 699813
58490F99813k405j084j84n53l97P11R56J66M31K097L206L496M818P112Q177P900
$$ 699813 697408 696324 696140 695587 695190 695901 696857 697023 697454 699551 702757 706253 711071 718183 726360 734260
58474G34260Q472R945J0082Q995R299J1095J1605J0446J0363J1936J2544J1468
$$ 734260 742732 752677 762759 771754 781053 792148 803753 814199 824562 836498 849042 860510
58462H60510J0907J0834Q080K035l824p622j1373j5981j9044j9457j9472k0212
$$ 860510 871417 882251 890331 892366 888542 880920 869547 853566 834522 815065 795593 775381
58450G75381j9783j7639j6131j5932j4564j1382r231r269q828o428m261l590k383
$$ 775381 755598 737959 721828 705896 691332 679950 670719 661450 652622 646194 641933 638343 635960
58437F35960L10K162J968J822K758K678P57n09J72O98k0J09J981L228K680K575
$$ 635960 636270 638432 640400 642222 644980 647658 648415 647906 648078 648776 648756 648865 650846 654074 656754 659329
58421F59329M202N683O103P375J0066J1774J1746J2561J5256J7393J7816J8607
$$ 659329 663531 669214 675317 682692 692758 704532 716278 728839 744095 761488 779304 797911
58409G97911K0424K0784J8965J7610J7515J5877J1707P777N098J039m954r376
$$ 797911 818335 839119 858084 875694 893209 909086 920793 928570 933668 934707 929753 920377
58397I20377j0743j1952j4131j4214j1244r104r739r702o761m046m038m226k382
$$ 920377 909634 897682 883551 869337 858093 848989 839250 829548 822787 818741 814703 810477 808095
58384H08095o29n56J06K328K850J79k071j475q70k379l169j153P44J93k35J551
$$ 808095 807466 806910 807016 809344 812194 812373 810302 808827 807957 805578 802409 801256 802000 802193 801958 803509
58368H03509L022K359K277M393N486L583K055L390M667L611L122N246O648M887
$$ 803509 806531 808890 811167 815560 821046 824629 826684 830074 834741 838352 841474 846720 853368 858255
58354H58255L229M387N470L983K805M124M684K278P36K903M831K745k50j40J235
$$ 858255 861484 865871 871341 875324 878129 882253 886937 889215 889951 892854 897685 900430 900180 900040 901275
58339I01275J128J564M229N738L956K915N604Q100O964N853Q324J0685R012O759
$$ 901275 902403 903967 908196 913934 917890 920805 926409 934509 941473 947326 955650 966335 975347 982106
58325I82106Q193J0473R608Q222R888J1694J0078Q224J0064J2608J1789J0250
$$ 982106 990299 1000772 1010380 1018602 1028490 1040184 1050262 1058486 1068550 1081158 1092947 1103197
58313A103197J1698J3330J1533R358J0606J2314J0782R074J0802J2666J1079R815
$$ 1103197 1114895 1128225 1139758 1149116 1159722 1172036 1182818 1191892 1202694 1215360 1226439 1236254
58301A236254J2883J6325J5473J3728J5559J7609J5752J4055J7283K1314K0574
$$ 1236254 1249137 1265462 1280935 1294663 1310222 1327831 1343583 1357638 1374921 1396235 1416809
58290A416809J8252J9450K1144J9078J7491K1475K6517K6361K4440K6649K9829
$$ 1416809 1435061 1454511 1475655 1494733 1512224 1533699 1560216 1586577 1611017 1637666 1667495
58279A667495K8659K6816K9663L2867L0325K6350K7707L0683K8669K5455K7892
$$ 1667495 1696154 1722970 1752633 1785500 1815825 1842175 1869882 1900565 1929234 1954689 1982581
58268A982581L2475L2608L2093L7557M4570M5498M4156M8238N4166N4396N2625
$$ 1982581 2015056 2047664 2079757 2117314 2161884 2207382 2251538 2299776 2353942 2408338 2460963
58257B460963N6431O1929O1385N9002O2954O9001O8546O5767O9679P6568P7837
$$ 2460963 2517394 2579323 2640708 2699710 2762664 2831665 2900211 2965978 3035657 3112225 3190062
58246C190062P7637Q4558R3597R5293R4838J02547J13392J16481J16668J25343
$$ 3190062 3267699 3352257 3445854 3541147 3635985 3738532 3851924 3968405 4085073 4210416
58236D210416J37961J43165J45922J58216J74907J83222J88223K03397K24091
$$ 4210416 4348377 4491542 4637464 4795680 4970587 5153809 5342032 5545429 5769520
58227E769520K36689K45996K65961K91403L07888L21321L47614L81428M06869
$$ 5769520 6006209 6252205 6518166 6809569 7117457 7438778 7786392 8167820 8574689
58218H574689M30346M69429N18177N59000N99522O60136P34767Q04131Q77743
$$ 8574689 9005035 9474464 9992641 10551641 11151163 11811299 12546066 13350197 14227940
58209A4227940R79630J103210J227077J364532J547115J771158K016399K305640
$$ 14227940 15207570 16310780 17537857 18902389 20449504 22220662 24237061 26542701
58201B6542701K685696L163572L730703M437499N368078O556186Q011388R808735
$$ 26542701 29228397 32391969 36122672 40560171 45928249 52484435 60495823 70304558
58193G0304558J2049889J4754943J7908424K1573792K5800474L0459461L5375798
$$ 70304558 82354447 97109390 115017814 136591606 162392080 192851541 228227339
58186B28227339M0474649M5200191M7511164M4096431L2615365J4160721o742153
$$ 228227339 268701988 313902179 361413343 405509774 438125139 452285860 445543707
58179D45543707k4841333l6999650m2885216m3811224m1452300l7292012l2466765
$$ 445543707 420702374 383702724 340817508 297006284 255553984 218261972 185795207
58172A85795207k7671734k3227320j9293318j5971591j3250917j1014253r158878
$$ 185795207 158123473 134896153 115602835 99631244 86380327 75366074 66207196
58165F6207196p642010o407243n360868m444354l655007k974280k343545j729562
$$ 66207196 58565186 52157943 46797075 42352721 38697714 35723434 33379889 31650327
58157C1650327j147467n95894l2093N62372J154775J734120K336987K918978L227142
$$ 31650327 30502860 29906966 29874873 30437245 31592020 33326140 35663127 38582105 41809247
58148D1809247K900261J763171L0313j791261l212122m011612m251749m116307
$$ 41809247 44709508 46472679 46502992 44711731 41499609 37487997 33236248 29119941
58140B9119941l766178l310429k832989k392250k006447j671296j389584j166810
$$ 29119941 25353763 22043334 19210345 16818095 14811648 13140352 11750768 10583958
58132A0583958r90778q40923p12725o12249n33224m61515l97395l51410l21216
$$ 10583958 9593180 8752257 8039532 7427283 6894059 6432544 6035149 5683739 5362523
58123E362523k93310k65325k46193k35629k23187k07040j94813j85874j71065
$$ 5362523 5069213 4803888 4557695 4322066 4098879 3891839 3697026 3511152 3340087
58114C340087j50515j34344j24768j13802r9583q9153q4196p9178p4374p5746
$$ 3340087 3189572 3055228 2930460 2816658 2717075 2627922 2543726 2464548 2390174 2314428
58104B314428q1167q1386p5627p2002p1803o7808n9211n3817n3673n2222m7633
$$ 2314428 2233261 2151875 2076248 2004246 1932443 1864635 1805424 1751607 1697934 1645712 1598079
58093A598079m5745m7649m7128m2643l9735l9477l6400k9766k5446k4675k2297
$$ 1598079 1552334 1504685 1457557 1414914 1375179 1335702 1299302 1269536 1244090 1219415 1197118
58082A197118j7785j6711j9526k0154j7463j7091k0048k0584j7293j5452j6277
$$ 1197118 1179333 1162622 1143096 1122942 1105479 1088388 1068340 1047756 1030463 1015011 998734
58071I98734j4757j0406r269j2635j4279j1643r602j0357r769o636n713q317r374
$$ 998734 983977 973571 964302 951667 937388 925745 916143 905786 896017 889381 883668 875351 865977
58058H65977p076o222q808j0391r002q760j1276j2132r462p628q926r597p443
$$ 865977 858901 852679 843871 833480 824478 815718 804442 792310 782848 775220 766294 756697 749254
58045G49254n632n686m389q28J048J1J87L176N041M099M175P010Q863P927P641
$$ 749254 743622 737936 733547 732719 733767 733778 733965 737141 742182 746281 750456 757466 766329 774256 781897
58030G81897R353R034M903J138L76n83l944o642o661o990r408j0738r115p887
$$ 781897 791250 800284 805187 806325 806701 806118 802174 795532 788871 781881 772473 761735 752620 744733
58016G44733r366j0689r659q831j0033j0547q633p303q702j0041q969p787q627
$$ 744733 735367 724678 715019 706188 696155 685608 676975 669672 660970 650929 641960 634173 625546
58003F25546r447q454p654q420q339n962l995m302m419k364l08nP98M063P835
$$ 625546 616099 607645 599991 591571 583232 577270 573275 568973 564554 562190 561882 561877 562675 566738 574573
57988E74573J0224J2686J6181J8326J7567J6056J5460J3979J0509P439O396N368
$$ 574573 584797 597483 613664 631990 649557 665613 681073 695052 705561 713000 719396 724764
57976G24764K918J029Q73R2k812n549o450p512j0163j2244j2157j1869j2852j3250
$$ 724764 727682 728711 729584 729676 726864 721315 714865 707353 697190 684946 672789 660920 648068 634818
57962F34818j1956j1238j2253j2396j0102p965p881p586n362l795n029o523n411
$$ 634818 622862 611624 599371 586975 576873 568908 561027 553441 548079 544284 539255 532732 527321
57949E27321l204k363j920m28L87j063k587j771j83l19j275j040k40j55J72J592
$$ 527321 524117 521754 519834 519406 519793 518730 516143 514372 514189 513870 512595 511555 511315 511160 511332 512924
57933E12924K383J250pK12L67j022k380k286k376l915m756l044p18k9K36J749
$$ 512924 515307 516557 516550 516762 517129 516107 513727 511441 509065 505150 500394 497350 496632 496603 496839 498588
57917D98588L100K823K758M750O971P199O834P938R209Q682P684Q166Q787P548
$$ 498588 501688 504511 507269 512019 518990 526189 533023 540961 550170 558852 566536 574702 583489 591037
57903E91037N803N668N859M129J588N89L38j380l964n322n807p097q743r287r340
$$ 591037 596840 602508 608367 612496 614084 614673 615011 613631 609667 604345 598538 591441 582698 573411 564071
57888E64071j0193j0947j0232r134r225r481q220o347n531n011l391j646j187
$$ 564071 553878 542931 532699 523565 514340 504859 496639 490292 484761 479750 476359 474713 473526
57875D73526q62Q52K599K490J765K702M636N570N958P391R114R401Q899R158R390
$$ 473526 472664 473516 476115 478605 480370 483072 487708 493278 499236 506627 515741 525142 534041 543199 552589
57860E52589Q024N970M945M134J959m45j087r61k290m364m893m291m833o508p360
$$ 552589 560613 566583 571528 575662 577621 577176 576089 575128 572838 568474 563581 559290 554457 547949 540589
57845E40589p195p440q005p620o611o247o137n206m293m807n859n742n066n359
$$ 540589 533394 525954 517949 510329 503718 497471 491334 486128 481835 477028 471169 465427 460361 455002
57831D55002n933n349m621n565p276p731p583q629r860r001o941o477p442p258
$$ 455002 449069 443720 439099 433534 426258 418527 410944 402315 392455 383454 376513 370036 362594 355336
57817C55336n746n182n853n692m437m045m779m663l258k356k473k056o90J60J57
$$ 355336 349590 344408 338555 332863 328426 324381 319602 314939 311681 309325 306852 304796 304106 304266 304423
57802C04423P56K315L514M075N186O858P665P589Q333J0336J2061J2570J2326
$$ 304423 305179 307494 311008 315083 320269 327127 334792 342381 350714 361050 373111 385681 398007
57789C98007J1217Q474M832K268J230M48m85q09q26j770l340l935l464l378l845
$$ 398007 409224 417698 422530 424798 426028 426476 425991 425182 424356 422586 419246 415311 411847 408469 404624
57774D04624l512k212j233p15N42K406L231K683K278K722L169L307L763M187L398
$$ 404624 401112 398900 397667 396952 397494 399900 403131 405814 408092 410814 413983 417290 421053 425240 428638
57759D28638J724P75P10J88r13j360j348k616n302p257p113n619l524n87K739
$$ 428638 430362 431137 431847 432035 431122 429762 428414 425798 420496 413239 406126 400507 396983 396396 399135
57744C99135N086O238P313Q523Q949Q837R688J1644J3091J3261J3037J2878J2279
$$ 399135 404221 410459 417772 426295 435244 444081 453769 465413 478504 491765 504802 517680 529959
57731E29959J1577J1867J2816J2940J2401J2975J4927J6514J7096J7950J9460
$$ 529959 541536 553403 566219 579159 591560 604535 619462 635976 653072 671022 690482
57720F90482K0187J9596J9117J9632K0364K1084K2959K6278K9771L3049L7365
$$ 690482 710669 730265 749382 769014 789378 810462 833421 859699 889470 922519 959884
57709I59884M3026M8515N3309N9048O6734P5117Q3344R2980J05786J21281J38018
$$ 959884 1002910 1051425 1104734 1163782 1230516 1305633 1388977 1481957 1587743 1709024 1847042
57698A847042J55815J75384J97075K20980K46935K73583K98655L20601L38467
$$ 1847042 2002857 2178241 2375316 2596296 2843231 3116814 3415469 3736070 4074537
57689D074537L49809L50570L37541L09334K64983K04225J30212M9912k9210j01446
$$ 4074537 4424346 4774916 5112457 5421791 5686774 5890999 6021211 6071123 6041913 5940467
57679E940467j61846k05867k31482k40045k34033k15469j86856j51449j11516
$$ 5940467 5778621 5572754 5341272 5101227 4867194 4651725 4464869 4313420 4201904
57670D201904o8033k2912J9634N3489P0334O0175J7262n1967j29279j95283k39133
$$ 4201904 4133871 4110959 4130593 4184082 4254416 4314591 4331853 4279886 4150607 3955324 3716191
57659C716191k58981k57729k40975k15793j87656j58718j30113j04031q1990o3110
$$ 3716191 3457210 3199481 2958506 2742713 2555057 2396339 2266226 2162195 2080205 2017095
57649B017095m5933l0399j6541l096J0741K3883L5509M7139O0766P6388R3062
$$ 2017095 1971162 1940763 1924222 1921126 1931867 1955750 1991259 2038398 2099164 2175552 2268614
57638B268614J10991J30694J51423J72259J93733K16697K40364K62740K81894
$$ 2268614 2379605 2510299 2661722 2833981 3027714 3244411 3484775 3747515 4029409
57629D029409K95485L00324K93852K75140K43340J96792J35463O3396j2695q6615
$$ 4029409 4324894 4625218 4919070 5194210 5437550 5634342 5769805 5833201 5820506 5733891
57619E733891j53637k09885k52719k81421k96674l00070k94469k83294k68559
$$ 5733891 5580254 5370369 5117650 4836229 4539555 4239485 3945016 3661722 3393163
57610C393163k50675k30734k11112j93017j75397j57527j40827j26680j14361
$$ 3393163 3142488 2911754 2700642 2507625 2332228 2174701 2033874 1907194 1792833
57601A792833j02681r2034q3136p5282o7612o0703n5234n0476m5651m1364l8140
$$ 1792833 1690152 1598118 1514982 1439700 1372088 1311385 1256151 1205675 1160024 1118660 1080520
57590A080520l4928l0875k7076k4795k3292k1254j9064j7675j6571j4763j2773
$$ 1080520 1045592 1014717 987641 962846 939554 918300 899236 881561 864990 850227 837454
57579H37454j1592j0791r542q293p556o220l369n19L01j22P04L151N308O321P406
$$ 837454 825862 815071 805529 797236 789680 783460 780091 779572 779873 779751 780455 783606 788914 795235 802641
57564H02641R463J1842J3797J5477J7137J8732K0462K2616K5019K7541L0754L4983
$$ 802641 812104 823946 837743 853220 870357 889089 909551 932167 957186 984727 1015481 1050464
57552A050464L9406M3301M7524N3329O0474O7892P5725Q5117R6484J09384J23694
$$ 1050464 1089870 1133171 1180695 1234024 1294498 1362390 1438115 1523232 1619716 1729100 1852794
57541A852794J39484J56141J72894J89704K06481K21957K34435K42764K45323
$$ 1852794 1992278 2148419 2321313 2511017 2717498 2939455 3173890 3416654 3661977
57532C661977K39065K21250J91452J50727J00010M1297k0660p9900j32194j75055
$$ 3661977 3901042 4122292 4313744 4464471 4564481 4605778 4585118 4505218 4373024 4197969
57522D197969k06185k24412k31591k31137k24801k12872j97040j80443j64667
$$ 4197969 3991784 3767372 3535781 3304644 3079843 2866971 2669931 2489488 2324821
57513B324821j48962j32898j17759j04792r3803q4041p5080o6405n7505m8805
$$ 2324821 2175859 2042961 1925202 1820410 1726607 1642566 1567486 1501081 1443576 1394771
57503A394771m1344l5342l0084k5149k0546j5813j0347m623K88M423Q833J3914
$$ 1394771 1353427 1318085 1288001 1262852 1242306 1226493 1216146 1211523 1211811 1216234 1225067 1238981
57491A238981J9164K4628L1126L8888M7232N5784O4949P5126Q6504R9506J14367
$$ 1238981 1258145 1282773 1313899 1352787 1400019 1455803 1520752 1595878 1682382 1781888 1896255
57480A896255J30455J47018J64188J82050J99256K13924K25384K33276K35256
$$ 1896255 2026710 2173728 2337916 2519966 2719222 2933146 3158530 3391806 3627062
57471C627062K27411K07122J74159J29365P4293J2466n0705j09953j61246k01406
$$ 3627062 3854473 4061595 4235754 4365119 4439412 4451878 4401173 4291220 4129974 3928568
57461C928568k28601k43555k48840k46615k38149k25265k10348j94518j77410
$$ 3928568 3699967 3456412 3207572 2960957 2722808 2497543 2287195 2092677 1915267
57452A915267j59229j41673j26322j13325j02040r1883q2317p3094o4790n8091
$$ 1915267 1756038 1614365 1488043 1374718 1272678 1180795 1098478 1025384 960594 902503
57442I02503n2572m7267m2223l8170l4836l1137k7064k3826k1899k0460j9007
$$ 902503 849931 802664 760441 722271 687435 656298 629234 605408 583509 563049 544042
57431E44042j8039j7723j7308j6273j4933j3589j2228j1195j0933j0977j0452
$$ 544042 526003 508280 490972 474699 459766 446177 433949 422754 411821 400844 390392
57420C90392r540r112q977q060o337n021m596m379m173m574n354n287m114l020
$$ 390392 380852 371740 362763 354703 348366 343345 338749 334370 330197 325623 320269 314982 310868 307848
57406C07848k635k254j586j495k286k841k366j518j059p48m12n80j292j563r03
$$ 307848 305213 302959 301373 299878 297592 294751 292385 290867 289808 289060 288648 288068 286776 285213 284310
57391B84310j16J14J61L03M5n60m26Q09J855J642Q46N17L77l05j215j586j492
$$ 284310 284194 284308 284469 284772 284817 284257 283831 284640 286495 288137 288983 289500 289877 289572 288357 286771 285279
57374B85279j519j743j911k009j943j386m90j1j43j88J54K18k98o78n44p05j682
$$ 285279 283760 282017 280106 278097 276154 274768 274278 274267 274124 273936 274090 274308 274010 273332 272788 272083 270401
57357B70401k543k227j148m53l34j08N43J289J653J337M87q8L29J226J394Q28
$$ 270401 267858 265631 264483 264030 263696 263588 264131 265420 267073 268410 268897 268809 269138 270364 271758 272586
57341B72586Q07J816K717K597K118K232K770L143L359L504L280K782K691L052
$$ 272586 273393 275209 277926 280523 282641 284873 287643 290786 294145 297649 300929 303711 306402 309454
57327C09454K958K167J798K552L581L987M197M791N237M965M612M939N507N642
$$ 309454 312412 314579 316377 318929 322510 326497 330694 335485 340722 345687 350299 355238 360745 366387
57313C66387N799O696P866Q304P966P608P708Q350R517J0790J1500J1770J2503
$$ 366387 372186 378882 386748 395052 403018 410626 418334 426684 436201 446991 458491 470261 482764
57300D82764J3845J4826J5184J6035J7880J9427J9648J9555K0603K2645K4823
$$ 482764 496609 511435 526619 542654 560534 579961 599609 619164 639767 662412 687235
57289F87235K7243L0156L2614L3643L3830L4166L4223L3080L1216K9722K8288
$$ 687235 714478 744634 777248 810891 844721 878887 913110 946190 977406 1007128 1035416
57278A035416K5635K1458J6358J0404L287m520j2170j9574k6882l3358l8124m1389
$$ 1035416 1061051 1082509 1098867 1109271 1112558 1108038 1095868 1076294 1049412 1016054 977930 936541
57266I36541m3686m4471m2946l9653l5865l1991k7877k4043k1110j8588j5658
$$ 936541 892855 848384 805438 765785 729920 697929 670052 646009 624899 606311 590653
57255E90653j2665j0431q714o744m661k981j425K56J104K78j123j317k51R64K180
$$ 590653 577988 567557 558843 552099 547438 544457 543032 543288 544392 544670 543547 542230 541979 542943 545123
57240E45123L796M979M532L178K751L400L749L552L947N049N656N483N632O443
$$ 545123 548919 553898 558430 561608 564359 567759 571508 575060 579007 584056 589712 595195 600827 607270
57226F07270O962O862O984P583P880P750Q066Q891R074Q214P372P312P533P543
$$ 607270 614232 621094 628078 635661 643541 651291 659357 668248 677322 685536 692908 700220 707753 715296
57212G15296P623P932Q197Q588R483J0239R742Q384P877Q760R749R883R725R988
$$ 715296 722919 730851 739048 747636 757119 767358 777100 785484 793361 802121 811870 821753 831478 841466
57198H41466J0554J1294J2398J3500J3818J3441J3131J2847J2049J1384J2156
$$ 841466 852020 863314 875712 889212 903030 916471 929602 942449 954498 965882 978038
57187I78038J4012J5201J5305J5626J6535J6764J5976J5688J6727J7902J8288
$$ 978038 992050 1007251 1022556 1038182 1054717 1071481 1087457 1103145 1119872 1137774 1156062
57176A156062J8854K0650K3115K5333K7307K9068L0115L0633L1546L2591L2177
$$ 1156062 1174916 1195566 1218681 1244014 1271321 1300389 1330504 1361137 1392683 1425274 1457451
57165A457451L0092K8328K8149K8329K7529K6392K5844K5355K4371K3804K4378
$$ 1457451 1487543 1515871 1544020 1572349 1599878 1626270 1652114 1677469 1701840 1725644 1750022
57154A750022K5133K5140K5176K6131K7298K7846K8550L0387L2687L4309L5369
$$ 1750022 1775155 1800295 1825471 1851602 1878900 1906746 1935296 1965683 1998370 2032679 2068048
57143B068048L6338L6758L6265L5590L5177L4312L2939L2722L4708L7612L9873
$$ 2068048 2104386 2141144 2177409 2212999 2248176 2282488 2315427 2348149 2382857 2420469 2460342
57132B460342M1787M3987M5642M6039M6208M7171M8254M8953N0585N4169N8627
$$ 2460342 2502129 2546116 2591758 2637797 2684005 2731176 2779430 2828383 2878968 2933137 2991764
57121B991764O3027O8535P5914Q3440Q9733R6275J04405J12352J18428J24756
$$ 2991764 3054791 3123326 3199240 3282680 3372413 3468688 3573093 3685445 3803873 3928629
57111C928629J34272J46252J58658J72694J90937K13051K37766K67313L05333
$$ 3928629 4062901 4209153 4367811 4540505 4731442 4944493 5182259 5449572 5754905
57102E754905L52431M08756M79066N70026O84623Q25207R99518J216356J476879
$$ 5754905 6107336 6516092 6995158 7565184 8249807 9075014 10074532 11290888 12767767
57093A2767767J777335K116927K492109K885103L271658L639787L981719M260591
$$ 12767767 14545102 16662029 19154138 22039241 25310899 28950686 32932405 37192996
57085C7192996M407994M380097M214334M012903L862832L770577L660562L421108
$$ 37192996 41600990 45981087 50195421 54208324 58071156 61841733 65502295 68923403
57077F8923403K960951K253424J348667L42357o75461j646203k531125l294856
$$ 68923403 71884354 74137778 75486445 75828802 75153341 73507138 70976013 67681157
57069F7681157l909195m362510m654946m789083m772956m627975m385340m075108
$$ 67681157 63771962 59409452 54754506 49965423 45192467 40564492 36179152 32104044
57061C2104044l722878l352996k986823k637446k310934k012527j747267j515551
$$ 32104044 28381166 25028170 22041347 19403901 17092967 15080440 13333173 11817622
57053A1817622j313163j136494r84212q54032p42013o45771n65082m98655m43245
$$ 11817622 10504459 9367965 8383753 7529721 6787708 6141937 5576855 5078200 4634955
57044D634955l96496l57757l25531k96860k70059k45608k23619k02806j82677
$$ 4634955 4238459 3880702 3555171 3258311 2988252 2742644 2519025 2316219 2133542
57035B133542j64367j48368j33569j19407j06857r6328q6661p7318o9505o3852
$$ 2133542 1969175 1820807 1687238 1567831 1460974 1364646 1277985 1200667 1131162 1067310
57025A067310n8834n2991m6986m2011l7692l3228k9211k6451k4086k0737j6819
$$ 1067310 1008476 955485 908499 866488 828796 795568 766357 739906 715820 695083 678264
57014F78264j3947j2526j1523j0310r145p953o102l389j26L844R128J5861K3752
$$ 678264 664317 651791 640268 629958 620813 612860 606758 603369 603243 607087 616215 632076 655828
57001F55828L3156M5135O0571Q0282J05728J37339J70063J91017J84201J40723
$$ 655828 688984 734119 794690 874972 980700 1118039 1288102 1479119 1663320 1804043
56991A804043O6699j8448r2705j42623j66636j70245j59949j40971j17762r4211
$$ 1804043 1870742 1852294 1759589 1616966 1450330 1280085 1120136 979165 861403 767192
56981G67192p3326n7409m8046m5143m6448m8921n0499n0176m7259m1678l4674
$$ 767192 693866 636457 588411 543268 496820 447899 397400 347224 299965 258287 223613
56970B23613k8004k2369j7271j2197p200k508J739N412Q671J2178J6411K0966
$$ 223613 195609 173240 155969 143772 136572 134064 135803 141215 149886 162064 178475 199441
56958A99441K5114K8897L2933L7008L9276L6946K7939J2807m560j8960k7599l1514
$$ 199441 224555 253452 286385 323393 362669 399615 427554 440361 435801 416841 389242 357728
56946C57728l2942l2332k8964k3457j7908j3727j0729q284o019l384K53M798R640
$$ 357728 324786 292454 263490 240033 222125 208398 197669 189385 183366 179982 180235 185033 194673
56933A94673J4664K0225K6378L2867L9343M4154M3533L4054J6458m219k2601l5959
$$ 194673 209337 229562 255940 288807 328150 372304 415837 449891 466349 462130 439529 403570
56921D03570m3716m6201m4707m1242l7015l1981k6321k1183j7353j4399j1822
$$ 403570 359854 313653 268946 227704 190689 158708 132387 111204 93851 79452 67630
56910F7630r989r181q689p687o220m697l179j703n17N21J890L412M330M827O252
$$ 67630 57641 48460 39771 32084 25864 21167 17988 16285 15768 16289 18179 21591 25921 30748 37000
56895C7000R259J2863J6032J9023K2414K6071K9940L4625M0187M5547N0060N4200
$$ 37000 46259 59122 75154 94177 116591 142662 172602 207227 247414 292961 343021 397221
56883C97221N7349N6284M7980L3346J6608J456j0680j9324k4057k5281k4283k2052
$$ 397221 454570 510854 558834 592180 608788 610244 599564 580240 556183 530902 506619 484567
56871D84567j8838j4902j0673o072n74N859J2701J9775K7529L6308M5991N6410
$$ 484567 465729 450827 440154 434082 433508 439367 452068 471843 499372 535680 581671 638081
56859F38081O7401P7818Q4537Q2779O8367M1062O259k7398n2997o8279p4361p3226
$$ 638081 705482 783300 867837 950616 1018983 1060045 1066304 1038906 985909 917630 843269 770043
56847G70043o6963n7858m7567l6548k4948j3386k130R471K1865L4549M7467O1890
$$ 770043 703080 645222 597655 561107 536159 522773 520643 530114 551979 586528 633995 695885
56835F95885P8593R6187J12847J28202J40729J43744J27485Q7493L0283k9918
$$ 695885 774478 870665 983512 1111714 1252443 1396187 1523672 1611165 1641448 1611530
56825A611530p9624j11953j26943j28513j21222j08616r3326p7574o2837m9256
$$ 1611530 1531906 1419953 1293010 1164497 1043275 934659 841333 763759 700922 651666
56815F51666l6057k2633q964M727J8148L1051M3636N6684P0812Q5511R8417J04690
$$ 651666 615609 592976 584012 588739 606887 637938 681574 738258 809070 894581 992998 1097688
56803A097688R7612P2351L1125j6034n7217q5444j00025j03397r8707q9289p7879
$$ 1097688 1195300 1267651 1298776 1282742 1225525 1140081 1040056 936659 837952 748663 670784
56792F70784o5764n3609m2577l3386k4988j5872o321K264R841J7672K6071L4066
$$ 670784 605020 551411 508834 475448 450460 434588 428267 430531 440372 458044 484115 518181
56780E18181M1307M7983N2459N0870M0149K0792l397k7099m5293n5404n8534n7688
$$ 518181 559488 607471 659930 710800 750949 771741 768344 741245 695952 640548 582014 524326
56768E24326n4608m9355m2590l6142l0939k6244k1593j7826j5388j3262j0594
$$ 524326 469718 420363 377773 341631 310692 284448 262855 245029 229641 216379 205785
56757B05785q025o474n708n106m748m778m618l812k866k439k384k317k396k777
$$ 205785 197760 191286 185578 180472 175724 170946 166328 162516 159650 157211 154827 152510 150114 147337
56743A47337k997k651k096j876j918j930k026k398k791k778k256j396n61k74p42
$$ 147337 144340 141689 139593 137717 135799 133869 131843 129445 126654 123876 121620 120224 119663 119389 118647
56728A18647j315j171n39m25j082j682j703j538j489j209o15l70r24j792k282
$$ 118647 117332 116161 115622 115197 114115 112433 110730 109192 107703 106494 105879 105509 104585 102793 100511
56713A00511k278j930j283n17j3J22J13J6k16l00RK31k02q28o64K43R13R97R93
$$ 100511 98233 96303 95020 94503 94490 94612 94725 94741 94525 94225 94234 94465 94263 93435 92771 93014 93927 94924 95917
56694I5917J011O69K49N50J352J576J129J107J835K292J958J661J937K124J759
$$ 95917 96928 97597 97846 98396 99748 101324 102453 103560 105395 107687 109645 111306 113243 115367 117126
56679A17126J441J486J195K21o18p81r34j597k105j864j394j234r94l93o8m07
$$ 117126 118567 120053 121248 121469 120851 120070 119136 117539 115434 113570 112176 110942 109948 109555 109487 109080
56663A09080o82l15J19P5J50Q36J380R68J55j00M6j30n65o97n34m62m82l95k84
$$ 109080 108398 108083 108202 108277 108427 109263 110643 111611 111766 111666 111712 111582 111017 110320 109786 109324 108842 108447 108163
56644A08163j75R6L20m2q50j267j170j442k396l100k906k340j927j389p04n62
$$ 108163 107988 108084 108404 108362 107512 106245 105075 103633 101237 98137 95231 92891 90964 89575 88871 88309
56628H8309r44p20M14J149P16K86R80J976K057J634J689J919J548R84J037J365
$$ 88309 87365 86645 87059 88208 88924 89210 90190 92166 94223 95857 97546 99465 101013 101997 103034 104399
56612A04399J237R68J160J336Q26K22L89P85L10p88j359j197j006r38o09j72j36
$$ 104399 105636 106604 107764 109100 109926 110148 110537 111322 111632 110844 109485 108288 107282 106344 105735 105563 105427
56595A05427m46p59j167j673j627p18J40J02k36J13Q64J110R29J033J376J423
$$ 105427 104981 104222 103055 101382 99755 99037 99177 99279 99043 99156 100020 101130 102059 103092 104468 105891
56579A05891J288J356J319P95L68Q67K034K972L409L539L306K829K874L807M791
$$ 105891 107179 108535 109854 110649 111017 111884 113918 116890 120299 123838 127144 129973 132847 136654 141445
56564A41445M994M876N213N728N746N449N319N200M922M949N369N260M138K941
$$ 141445 146439 151315 156528 162256 168002 173451 178770 183970 188892 193841 199210 204470 208608 211549
56550B11549K485K194J543J286J813J793K53j431j596j051j650l189m023l929
$$ 211549 214034 216228 217771 219057 220870 222663 222916 221485 219889 218838 217188 213999 209976 206047
56536B06047l995m320m031l243k921l016k684k009j734j713j378j205j941k914
$$ 206047 202052 197732 193701 190458 187537 184521 181837 179828 178094 176381 175003 173798 171857 168943
56522A68943k995k617k970l739l680k855k303j999j244n44q86j558j027L58P96
$$ 168943 165948 163331 160361 156622 152942 150087 147784 145785 144541 143997 143111 141553 140526 140884 141680
56507A41680L2m76k78m10j086j276r02j196k428l265k943k284k056j914j435p94
$$ 141680 141712 141236 140958 140548 139462 138186 137284 136088 133660 130395 127452 125168 123112 121198 119763 118969
56491A18969r7O75J041N74l9J76R52J450J888K882L830L753L208L265L296K028
$$ 118969 118872 119547 120588 121162 121123 121299 122251 123701 125589 128471 132301 136054 139262 142527 145823 147851
56475A47851L49M27K204L343K811J961J782J586R57P40J315J939K315L014L866
$$ 147851 148200 148627 150831 154174 156985 158946 160728 162314 163271 164011 165326 167265 169580 172594 176460
56460A76460L875L149L041L899M525M259L755L282K221P39J44R43K016K344K048
$$ 176460 180335 183484 186525 190424 194949 199208 202963 206245 208466 209205 209349 210292 212308 214652 216700
56445B16700J461O23n1n9J38k67q65o91j89o78k054k915k920l029l480l539l165
$$ 216700 218161 218784 218733 218674 218812 218545 217680 216989 216800 216122 214068 211153 208233 205204 201724 198185 195020
56428A95020k971k630j435k93q92k888m110l604k328r97L72R77q8j624j430K66
$$ 195020 192049 189419 187984 187691 186799 183911 179801 176197 173869 172872 173244 174221 174133 172509 171079 171345
56412A71345J090K50p95j491k955n074n888m637k809j456p3J278J506Q59J022
$$ 171345 172435 172685 171890 170399 167444 162370 156482 151845 149036 147580 147507 148785 150291 151150 152172
56397A52172K157K511J683J494K701L713L554L328L739L788L109K932L663L974
$$ 152172 154329 156840 158523 160017 162718 166431 169985 173313 177052 180840 183949 186881 190544 194518
56383A94518L382L215M031M626M471M465M445K815l02k520k920l329m651n071
$$ 194518 197900 201115 205146 209772 214243 218708 223153 225968 225666 223146 220226 216897 212246 207175
56369B07175l516j831j741k405k677l095l857l516j542K93Q19J269K535L274K559
$$ 207175 203659 201828 200087 197682 195005 191910 188053 184537 182995 183288 184107 185376 187911 191185 193744
56354A93744J806K170K534K023J879K949L721K946J867J880K251K117K429L826
$$ 193744 195550 197720 200254 202277 204156 207105 210826 213772 215639 217519 219770 221887 224316 228142
56340B28142M853M340L447L518L982M185M964O601P616P387P567R033J0000R161
$$ 228142 232995 237335 240782 244300 248282 252467 257431 264032 271648 279035 286602 295635 305635 314796
56326C14796Q110Q427Q970Q287P277P055O628N130M023M562N292M468K859J821
$$ 314796 322906 331333 340303 348590 355867 362922 369550 374680 378703 383265 388557 393025 395884 397705
56312C97705Q29p54j734j297r62j947k840k218j284j390j407j01J194R96M80J164
$$ 397705 398534 397780 396046 394749 393787 391840 389000 386782 385498 384108 382701 382600 383794 384790 385270 386434
56296C86434K104K055K180L717N262N289N239P021R582J0907J1533J3010J4752
$$ 386434 388538 390593 392773 396490 401752 407041 412280 419301 428883 439790 451323 464333 479085
56283D79085J5496J6064J7699J9421J9962K0518K2688K5433K7063K8402L1084
$$ 479085 494581 510645 528344 547765 567727 588245 610933 636366 663429 691831 722915
56272G22915L4473L7292M0483M5435N1145N6079O1258O8414P6918Q5396R4732
$$ 722915 757388 794680 835163 880598 931743 987822 1049080 1117494 1194412 1279808 1374540
56261A374540J06379J19394J32037J44674J58299J72002J84681J97304K10517
$$ 1374540 1480919 1600313 1732350 1877024 2035323 2207325 2392006 2589310 2799827
56252B799827K22114K29795K34252K36395K33849K23763K07009J86137J61238
$$ 2799827 3021941 3251736 3485988 3722383 3956232 4179995 4387004 4573141 4734379
56243D734379J31474R8745O6120L4309L197k5026m7879o6012q1130r2496r9012
$$ 4734379 4865853 4964598 5030718 5065027 5068224 5043198 4995319 4929307 4848177 4755681 4656669
56232D656669j02641j05938j08221j08135j07902j10768j16025j20847j25333
$$ 4656669 4554028 4448090 4339869 4231734 4123832 4013064 3897039 3776192 3650859
56223C650859j31390j38219j43390j47077j50872j53757j53507j50920j48313
$$ 3650859 3519469 3381250 3237860 3090783 2939911 2786154 2632647 2481727 2333414
56214B333414j45118j39238j31577j24787j18575j10617j01226r2854q5730p8122
$$ 2333414 2188296 2049058 1917481 1792694 1674119 1563502 1462276 1369422 1283692 1205570
56204A205570p0131o3234n6953m9927m3270l8988l6111l2186k7477k3946k1415
$$ 1205570 1135439 1072205 1015252 965325 922055 883067 846956 814770 787293 763347 741932
56193G41932j8614j6390j5864j5096j1814p817o246o286n115l269l150l884k798
$$ 741932 723318 706928 691064 675968 664154 656337 650091 643805 638690 635421 632271 628387 625589
56180F25589n43L24M29K120M275L957K052J886L264L206J643J056J367N11q41
$$ 625589 625046 625370 625799 627919 632194 636151 638203 640089 643353 646559 648202 649258 650625 651136 650295
56165F50295m90M15r23l410l752k591l198n053m725k385j309j533r7K812M094
$$ 650295 649805 650220 649297 645887 642135 639544 636346 631293 626568 624183 622874 621341 621244 624056 628150
56150F28150L819N054P758Q896Q541R920J3431J6465J9107K4077L1022L6797M1474
$$ 628150 631969 637023 644781 653677 662218 672138 685569 702034 721141 745218 776240 813037 854511
56137H54511M8242N7411O6265P4596Q4480R4688J01322J03763J04079J01192R2119
$$ 854511 902753 960164 1026429 1101025 1185505 1280193 1381515 1485278 1589357 1690549 1782668
56126A782668P8687O6568N7712N0018M3730M1162M0322L6073K7779J9123J0824
$$ 1782668 1861355 1927923 1985635 2035653 2079383 2120545 2160867 2196940 2224719 2243842 2254666
56115B254666Q06q783j2892j2433j4138k0898k9664l9288n2294o7827q0625q8534
$$ 2254666 2255472 2246689 2233797 2221364 2207226 2186328 2156664 2117376 2065082 1997255 1916630 1828096
56103A828096r3948r6944r4506q7428q0431p4429o6093n5787m8075m3522l7952
$$ 1828096 1734148 1637204 1542698 1455270 1374839 1300410 1234317 1178530 1130455 1086933 1048981
56092A048981l0842k6236k4437k0979j5154j1205r927p398l287j799l131k626
$$ 1048981 1018139 991903 967466 946487 931333 920128 910201 902803 899516 897717 894586 891960
56080H91960K41R56p56J14M144O048M659M876P896Q953O826O060P799P999O538
$$ 891960 892201 893157 892401 892515 896659 902707 907366 912242 920138 929091 935917 941977 949776 957775 964313
56065I64313Q143J2387J3138J0000R616J3372J4812J1897J0508J2848J3717J1617
$$ 964313 972456 984843 997981 1007981 1017597 1030969 1045781 1057678 1068186 1081034 1094751 1106368
56053A106368J2005J6025J7567J5224J5393J9743K1588J8827J8210K2345K4821
$$ 1106368 1118373 1134398 1151965 1167189 1182582 1202325 1223913 1242740 1260950 1283295 1308116
56042A308116K2973K2984K7229K9164K6104K4552K7392K8450K5321K4601K8697
$$ 1308116 1331089 1354073 1381302 1410466 1436570 1461122 1488514 1516964 1542285 1566886 1595583
56031A595583L0581K7598K7085L2117L5450L4015L5270M2261M6830M4942M4329
$$ 1595583 1626164 1653762 1680847 1712964 1748414 1782429 1817699 1859960 1906790 1951732 1996061
56020A996061M9249N2364M9680M8669N3225N5640N2212N1543N8317O4145O3757
$$ 1996061 2045310 2097674 2147354 2196023 2249248 2304888 2357100 2408643 2466960 2531105 2594862
56009B594862O4707P1693P7145P6986P9419Q8337R4742R4517R7378J08009J16416
$$ 2594862 2659569 2731262 2808407 2885393 2964812 3053149 3147891 3242408 3339786 3447795 3564211
55998C564211J17496J21254J32619J40985J41507J46022J60303J71921J74014
$$ 3564211 3681707 3802961 3935580 4076565 4218072 4364094 4524397 4696318 4870332
55989D870332J79010J94580K08955K15088K25559K47636K68261K80516K99267
$$ 4870332 5049342 5243922 5452877 5667965 5893524 6141160 6409421 6689937 6989204
55980F989204L32779L65757L89197M18822M64097N09108N45405N92078O60353
$$ 6989204 7321983 7687740 8076937 8495759 8959856 9468964 10014369 10606447 11266800
55971A1266800P31936P97113Q78511R90415J113107J236615J388759J588403J816044
$$ 11266800 11998736 12795849 13674360 14664775 15777882 17014497 18403256 19991659 21807703
55962B1807703K066183K380534K791553L288175L882108M648934N654704O908949
$$ 21807703 23873886 26254420 29045973 32334148 36216256 40865190 46519894 53428843
55954E3428843Q445179J0368119J2753972J5591701J8889559K2711896K7014854
$$ 53428843 61874022 72242141 84996113 100587814 119477373 142189269 169204123
55947A69204123L1613890L6414785M1271392M5061109M5056032L8146986K3485454
$$ 169204123 200818013 237232798 278504190 323565299 368621331 406768317 430253771
55940D30253771L939682j5385262l0205518l8895962m2087004m1308579l8105345
$$ 430253771 434193453 418808191 388602673 349706711 307619707 266311128 228205783
55933B28205783l3753388k9134703k4709131k0683370j7190241j4286903j1908193
$$ 228205783 194452395 165317692 140608561 119925191 102734950 88448047 76539854
55926G6539854r944759q337664p047781n997593n111479m370106l770644l273525
$$ 76539854 66595095 58257431 51209650 45212057 40100578 35730472 31959828 28686303
55918B8686303k836100k459388k155051j900070j665777j459500j297363j164400
$$ 28686303 25850203 23390815 21235764 19335694 17669917 16210417 14913054 13748654
55910A3748654j038267r25560q39907p68627o93753o23331n71239n27385m76803
$$ 13748654 12710387 11784827 10944920 10176293 9482540 8859209 8287970 7760585 7283782
55901G283782m27922l94184l66764l32022k97863k77238k62491k40494k17307
$$ 7283782 6855860 6461676 6094912 5762890 5465027 5187789 4925298 4684804 4467497
55892D467497k04367j95411j79530j62778j55338j50894j39320j26569j22170
$$ 4467497 4263130 4067719 3888189 3725411 3570073 3419179 3279859 3153290 3031120
55883C031120j19924j10334r9563r7212r7385r0328q1159p8979p8709p1638o3217
$$ 3031120 2911196 2800862 2701299 2604087 2506702 2416374 2335215 2256236 2177527 2105889 2042672
55872B042672o2709o5159o0757n2659m9101m7146m0286l3228l3237l5397l1647
$$ 2042672 1979963 1914804 1854047 1801388 1752287 1705141 1664855 1631627 1598390 1562993 1531346
55861A531346k6100k6396k8277k3782j6678j4978j5635j1200m524k644l157n27
$$ 1531346 1505246 1478850 1450573 1426791 1410113 1395135 1379500 1368300 1363776 1361132 1357975 1357448
55849A357448R30n696j6200k2200k5357l1638l7830l7312l3269l3019l4709l2356
$$ 1357448 1358378 1352682 1336482 1314282 1288925 1257287 1219457 1182145 1148876 1115857 1081148 1048792
55837A048792k8479k8954l0744k7460k2029k1245k2666j9454j3651j2118j3532
$$ 1048792 1020313 991359 960615 933155 911126 889881 867215 847761 834110 821992 808460
55826H08460j1678p747p351q982p226l918m646p471o456l070k918m443k058K441
$$ 808460 796782 789035 781684 772702 765476 761558 756912 749441 742985 739915 736997 732554 730496 732937
55812G32937K828M4k7K045Q16l326n383n708q572j2734j3338j1294j1274j2382
$$ 732937 735765 735809 735782 737827 738643 735317 729934 724226 715654 702920 689582 678288 667014 654632
55798F54632j0310o712o940j0251j1603j1267j3396j6862j6917j4434j4338j6287
$$ 654632 644322 637610 630670 620419 608816 597549 584153 567291 550374 535940 521602 505315
55786E05315j5804j3266j2819j3775j1822p684n940o372m856j674o88j584j171
$$ 505315 489511 476245 463426 449651 437829 430145 424205 417833 412977 411303 410615 409031 407860
55773D07860r68m980j1138j3509j2021j1631j2950j2105r178q203r190q345n914
$$ 407860 406892 401912 390774 377265 365244 353613 340663 328558 319380 311177 301987 293642 287728
55760B87728n799p717p534n136m325n204m350k141k349m637m959l143k694l486
$$ 287728 281929 274212 266678 261542 257217 252013 247663 245522 243173 238536 233577 230434 227740 224254
55746B24254k102Q73J449j48j2J589O28k527l202r14m7j565j716L11R22o54q81
$$ 224254 222152 223025 224474 224326 224314 225903 226531 224004 220802 219888 219841 218276 216560 216871 217793 217139 216258
55729B16258J149K178J219Q57J180q85n039o997n572m211m456m032k450k280l634
$$ 216258 217407 219585 220804 221661 222841 221956 216917 209920 204348 200137 195681 191649 189199 186919 183285
55714A83285l460j344k86p59J12K726M182M135N475Q368R586Q659Q697J0170R809
$$ 183285 179825 178481 178195 177436 177548 180274 184456 188591 194066 202434 212020 220679 229376 239546 249355
55699B49355O774L989K372l40m068n655m842m988o665o574m103k781l722l632
$$ 249355 256129 260118 262490 262150 258082 252427 247585 242597 235932 229358 225255 222474 218752 215120
55685B15120j144P63N97Q36K645L674L157L808O529Q323P597O528O235M716J527
$$ 215120 213976 214739 215336 216172 218817 222491 225648 229456 235985 244308 251905 258433 264668 269384 270911
55670B70911m93k54l35j944k751j717j173k146k321p37J68p51j248k47K2j448
$$ 270911 270418 270164 269829 267885 265134 263417 262244 260098 257777 257040 257208 256457 255209 254962 254984 253536
55654B53536k345j548j265k645l624l240l649n753p174o740o682q205r123q152
$$ 253536 251191 249643 248378 245733 242109 238869 235220 229467 222293 215553 208871 200666 191543 183391
55640A83391p400q221q700p518o386o490o262m903m222m992n211l945l030l178
$$ 183391 175991 167770 159070 151552 145166 138676 132414 127511 123289 118297 113086 109141 106111 102933
55626A02933k440m33K04j350k186q17J06j217k381j239K59k52j635k015k039k553
$$ 102933 100493 100060 100264 98914 96728 95911 96017 94800 92419 91180 91439 91187 89552 87537 85498 82945
55610H2945k309p23J68q32j791j234q16j843k464j091N21M33j57L61Q00l79j887
$$ 82945 80636 79913 80081 79249 77458 76224 75408 73565 71101 70010 70531 70964 70807 71168 71968 71589 69702
55593F9702j776o29l9J25O15R71P59P94J382J438O49K86O53L27q95j237l69m28
$$ 69702 67926 67297 67258 67383 67998 68969 69728 70522 71904 73342 73991 74277 74930 75257 74362 73125 72756 72328
55575G2328k149l236k297j102j108j034J24R45N27L96J452K057J241O72J426K003
$$ 72328 70179 66943 64646 63544 62436 61402 61526 62471 62998 63394 64846 66903 68144 68816 70242 72245
55559G2245J562J811L418M021K267N25R20J953J697J248K043K775J999J111J699
$$ 72245 73807 75618 79036 83057 85324 85849 86769 88722 90419 91667 93710 96485 98484 99595 101294
55544A01294K523K030J334J845K415J687Q86J447K260K082K253M035N640M940
$$ 101294 103817 105847 107181 109026 111441 113128 114014 115461 117721 119803 122056 126091 131731 136671
55530A36671L055K219K047R79n13j084j256k167l175l361l749n465p291p627p311
$$ 136671 139726 141945 143992 144971 144458 143374 142118 139951 136776 133415 129666 124201 116910 109283 101972
55515A01972p999r292r899j0186j1161j2311j2549j1941F006a772l511j4J264
$$ 101972 93973 84681 74782 64596 53435 41124 28575 16634 6006 -1772 -5283 -5297 -4033
55502d033J674D26L827L745L561M422N338N124M635M842M757L500K304K209J980
$$ -4033 -2359 426 4253 7998 11559 15981 21319 26443 31078 35920 40677 44177 46481 48690 50670
55487E0670O30k93N45J531Q00m99n34k37j470l588m842n519o720p551o532m429
$$ 50670 51300 51007 51552 53083 53883 53384 52850 52613 51143 47555 42713 37194 30474 22923 16391 11962
55471A1962k969k072r19k54j004j937A328m14l56c16o83k35n05o71L51e97D93
$$ 11962 8993 6921 6002 5748 4744 2807 1328 914 558 -316 -999 -1234 -1739 -2410 -2059 -597 493
55453E23q4L57J19j91O28J732J542N81M22Q76P37K39L43O88M80K36M78J88j195
$$ 523 439 796 915 724 1352 3084 4626 5207 5629 6505 7242 7481 7824 8512 8992 9228 9706 9894 8699
55434H699j911m86J430J478K81q5L13J29k12N11J515J194J81K43J067R64m0n53
$$ 8699 6788 6302 7732 9210 9491 9406 9719 9848 9636 10147 11662 12856 13037 13280 14347 15311 15271 14718
55416A4718m38m62k08J020K161J806O88L91N93K28l2Q49J660P12r51j095k4K75
$$ 14718 14280 13818 13610 14630 16791 18597 19285 19676 20269 20497 20465 21314 22974 23686 22735 21640 21616 21891
55398B1891k49j38L73j65j316j320k98P0l12j25M82R2j088j397n99j4OJ82L20
$$ 21891 21642 21504 21877 21712 20396 19076 18778 18848 18536 18411 18893 18985 17897 16500 15901 15887 15893 16075 16395
55379A6395l36j084o27M60N51k69o73o31j015j355o43L27Q2p96p55k78q95j953
$$ 16395 16059 14975 14348 14808 15359 15090 14417 13786 12771 11416 10773 11100 11182 10386 9631 9353 8458 6505
55361F505j559j28K47m22j68J218J856J207O87P33L15n00m66J65j79j307j236
$$ 6505 4946 4818 5065 4643 4475 5693 7549 8756 9443 10176 10491 9991 9525 9690 9511 8204 6968
55344F968M01J719J698J312J123M78n74j000q14r99j284m50J022J266J72m51m3
$$ 6968 7369 9088 10786 12098 13221 13699 13125 12125 11311 10312 9028 8578 9600 10866 11038 10587 10544
55327A0544O2n18m99M34R26M78K29N74L91o38j242p61j14mj05l43j052j548o99
$$ 10544 10606 10088 9589 10023 10949 11427 11656 12230 12621 11983 10741 9980 9866 9862 9757 9414 8362 6814 6115
55308F115R64J715J340J225J713J753J214J100J298O30o09p02N50J410J125P12
$$ 6115 7079 8794 10134 11359 13072 14825 16039 17139 18437 19067 18458 17756 18306 19716 20841 21553
55292B1553M80n51k185k608j211M35J139J336J221J22j519j914o73L70k4r31j269
$$ 21553 22033 21482 19297 16689 15478 15913 17052 18388 19609 19731 18212 16298 15625 15995 15971 15040 13771
55275A3771j317j430j221p66q32j246q73K65Q08L84J12M22M81K15O14J493J318
$$ 13771 12454 11024 9803 9037 8205 6959 6086 6351 7159 7543 7655 8077 8558 8773 9387 10880 12198
55258A2198o7q36j07Q15Q78P26Q53N14m67q92k13M98M65K85L07j45j142j644j341
$$ 12198 12131 11295 11188 12003 12881 13607 14460 14974 14507 13615 13402 13900 14365 14650 14957 14812 13670 12026 10685
55239A0685j112j050r6J668K516J778Q99R43J113P32O08J185J364M31n59n67j38
$$ 10685 9573 8523 8427 10095 12611 14389 15288 16231 17344 18076 18684 19869 21233 21664 21105 20538 20400
55222B0400r4j53J29L94L84M32M85j7p70p66j68k47j053j094Q9J076R73O08O37
$$ 20400 20306 20153 20282 20676 21060 21492 21977 21960 21190 20424 20256 20009 18956 17862 17951 19027 20000 20608 21245
55203B1245M80o2r4N76Q42K77k10l55j112k503k982j847l62M17R26J485J522J142
$$ 21245 21725 21663 21569 22145 22987 23264 23054 22699 21587 19084 16102 14255 13893 14310 15236 16721 18243 19385
55185A9385J360K016J686L92o8O98Q42l32r62M5J037O68J93Q14J292L61p55n62
$$ 19385 20745 22761 24447 24839 24771 25469 26311 25979 25017 25062 26099 26767 26960 27774 29066 29427 28672 28110
55167B8110L9m12j200r06l3M5n19q01j010j627j833p55P86J494J521J555J220
$$ 28110 28149 27737 26537 25631 25598 25643 25124 24323 23313 21686 19853 19098 19884 21378 22899 24454 25674
55150B5674Q1r10p34o0o3m86m52j24k3K27R75J341N05q07j428j424j359r86n6
$$ 25674 25755 24845 24111 24051 23988 23502 23050 22926 22903 23130 24105 25446 25951 25144 23716 22292 20933 19947 19891
55131A9891O64N34K28M92Q49O61M01N55N38q9n56l52l42j042j248j5J404J313
$$ 19891 20555 21089 21317 21809 22658 23319 23720 24275 24813 24724 24168 23816 23474 22432 21184 21169 22573 23886
55113B3886J64m23k31j84m28l58n4k8o5M54J423K277K775K764J983P90J48K13
$$ 23886 24050 23627 23396 23212 22784 22426 22372 22344 22279 22733 24156 26433 29208 31972 33955 34745 34893 35106
55095C5106J42j66K81J510K022J328R82J827K356J402L49P23J472R62r4j01M28
$$ 35106 35248 35082 35363 36873 38895 40223 41205 43032 45388 46790 47139 47862 49334 50296 50202 50101 50529
55078E0529m0j074r97J05N85J5m25j69J32P2r1l42q36j209j100q50p34k87N62
$$ 50529 50489 49415 48418 48523 49108 49123 48698 48529 48661 48733 48642 48300 47464 46255 45155 44305 43571 43284 43846
55059D3846Q18J9o70l40J20j38j74Q87J706P15j044j353k60L82rl57j75J6J68
$$ 43846 44664 44683 44013 43673 43793 43655 43481 44368 46074 46789 45745 44392 44132 44514 44505 44148 43973 43989 44157
55040D4157O08Q22J78o01m57J34J47J02J065K273K066P45J78P42R87L21j63J66
$$ 44157 44765 45587 45765 45164 44707 44841 44988 45090 46155 48428 50494 51239 51417 52159 53146 53467 53304 53470
55022E3470O41P94R74J092N59k94l42M38P22j51j308j750j507j111r32j177j685
$$ 53470 54111 54905 55879 56971 57530 57236 56894 57332 58054 57903 56595 54845 53338 52227 51295 50118 48433
55005D8433j767j095l60k94n87p36j109j928k111p24J193J943J673J738K186J887
$$ 48433 46666 45571 45211 44917 44330 43594 42485 40557 38446 37722 38915 40858 42531 44269 46455 48342
54989D8342Q75M06P67R44O61Q10J576J932J398Q13Q49J107J109J005R52P77N77
$$ 48342 49217 49623 50390 51334 51995 52805 54381 56313 57711 58524 59373 60480 61589 62594 63546 64323 64900
54972F4900P64J384K109K825L559M052M238M690N737O655O814O940Q098J0029
$$ 64900 65664 67048 69157 71982 75541 79593 83831 88521 94258 100913 107727 114667 122765 132794
54958A32794J1835J3667J6222J9023K0778K1088K0410J8632J5242J0580N525J80
$$ 132794 144629 158296 174518 193541 214319 235407 255817 274449 289691 300271 305796 305976
54946C05976n670j1198j5139j7460j9012j9844j9345j7721j5820j3740j1196q833
$$ 305976 300306 289108 273969 256509 237497 217653 198308 180587 164767 151027 139831 130998
54934A30998p613p160o332n129m409m000k893j151J44P44J345K008K182K304L465
$$ 130998 123385 116225 109893 104764 100355 96355 93462 92311 92455 93199 94544 96552 98734 101038 104503
54919A04503N494P065P831Q828J0626J2652J4551J6592J8598J9815J9919J8890
$$ 104503 109997 117062 124893 133721 144347 156999 171550 188142 206740 226555 246474 265364
54907B65364J6164J1402N767P51l960r534j5215j8753j9573j9272j8827j7596
$$ 265364 281528 292930 298697 299448 295488 285954 270739 251986 232413 213141 194314 176718
54895A76718j5541j4046j3628j2946j1013q619o720n114l691l159l520l374j912
$$ 176718 161177 147131 133503 120557 109544 100925 94205 89091 85400 82241 78721 75347 73435
54882G3435l11N0m63o55l57k16m22o53p71q50r48j257j938k567k510j961j780
$$ 73435 73124 73174 72711 72056 71699 71483 71061 70408 69637 68787 67839 66582 64644 62077 59567 57606 55826
54865E5826k157k345j986j630j664j674j232n23J09N64O92L26l37r69j580k096
$$ 55826 53669 51324 49338 47708 46044 44370 43138 42615 42724 43288 43980 44306 43969 43000 41420 39324
54849C9324j831m31J137J585J041N92M88J33m65o96o20p37o82L15J732K167J429
$$ 39324 37493 37062 38199 39784 40825 41417 41905 42038 41573 40877 40257 39520 38838 39153 40885 43052 44481
54832D4481P18O84Q80J122J747K442K382J705J255R28n8j274j326j14J049J748
$$ 44481 45199 45883 46763 47885 49632 52074 54456 56161 57416 58344 58286 57012 55686 55572 56621 58369
54816E8369K860M345M786L775K800L023L953N010O508Q303R291R298R805J1844
$$ 58369 61229 65574 70360 74135 76935 79958 83911 88921 95429 103732 113023 122321 132126 143970
54802A43970J4635J7113J9243K0942K1333K0071J8049J5719J2171O850Q45m570
$$ 143970 158605 175718 194961 215903 237236 257307 275356 291075 303246 310096 310941 306371
54790C06371r338j3547j6334j7062j6528j5857j5104j3897j2495j1269j0007q538
$$ 306371 297033 283486 267152 250090 233562 217705 202601 188704 176209 164940 154933 146395
54778A46395p207o085m710l223k603l013l081j737K78J638K240K912M026N305
$$ 146395 139188 133103 128393 125170 122567 119554 116473 114736 115014 116652 118892 121804 125830 131135
54764A31135O433P294Q058R336J1540J4036J5773J6810J8069J9527K0010J8848
$$ 131135 137568 144862 152920 162256 173796 187832 203605 220415 238484 258011 278021 296869
54752B96869J6360J2604P303J312l596o836r323j1298j1830j1012j0623j1556
$$ 296869 313229 325833 333136 334448 330852 324016 314693 303395 291565 280553 269930 258374
54740B58374j2483j2130j1183j0759j0676j0461j0480j0765j0228q393o588o050
$$ 258374 245891 233761 222578 211819 201143 190682 180202 169437 159209 150816 144228 138178
54728A38178o186n935n477n295m861l824l165l654m249l624k307j708j868j744
$$ 138178 131992 126057 120580 115285 110424 106600 103435 99781 95532 91908 89601 87893 86025 84281
54714H4281j091n83n12o75j051j590j741j138k20N10J162J811K025J725J496J435
$$ 84281 83190 82607 82095 81420 80369 78779 77038 75900 75680 76190 77352 79163 81188 82913 84409 85844
54698H5844Q87p3k98M42P23j46o75M26J987K148J164N89P11O52L08L49P82J052
$$ 85844 86731 86658 86360 86802 87525 87379 86704 87130 89117 91265 92429 93018 93729 94381 94689 95038 95820 96872
54680I6872J180J483J586J034L50L50Q42J178J401J782J884J297P07J068K251
$$ 96872 98052 99535 101121 102155 102505 102855 103697 104875 106276 108058 109942 111239 111946 113014 115265
54665A15265L486M489N254N549N552O058P111P491O714O205P167Q489Q428P208
$$ 115265 118751 123240 128494 134043 139595 145653 152764 160255 166969 173174 180341 188830 197258 204466
54651B04466O200N521M354K827J728R66J64O2J432L173L526K799K803L906M744
$$ 204466 210666 216187 220541 223368 225096 226062 226226 226288 227720 230893 234419 237218 240021 243927 248671
54636B48671M794N098O147O952O701N708M288K100q85m067p144j0350j3410j5394
$$ 248671 253465 258563 264710 271662 278363 284071 288359 290459 289574 285507 278363 268013 254603 239209
54622B39209j5844j5158j3814j2067j0423r290q224o515m473l080k440j686n13
$$ 239209 223365 208207 194393 182326 171903 162613 154389 147874 143401 140321 137881 136195 135682
54609A35682M68J008J679K820L952M576M797M930N124N472N892N915N208M095
$$ 135682 136150 137158 138837 141657 145609 150185 154982 159912 165036 170508 176400 182315 187523 191618
54595A91618L019J712k09k255l523m010m509n351o095o371o245n881n511n545
$$ 191618 194637 196349 196140 193885 190362 186352 181843 176492 170397 164026 157781 151900 146389 140844
54581A40844o007o201n637m894m732m862m520l830l535l655l538k989k370j807
$$ 140844 134837 128636 122999 118105 113373 108511 103991 100161 96626 92971 89433 86444 84074 82267
54567H2267j265j111j624k205k042j357r40q54n68j58j35l83l68k05m06p41n54
$$ 82267 81002 79891 78267 76062 74020 72663 71723 70869 70301 70143 70008 69625 69257 69052 68646 67905 67351
54550F7351m9Kk32K41J457K171J638N57j03k50k10%M54R58J326J625J949K326
$$ 67351 67302 67304 67072 67313 68770 70941 72579 73136 73033 72783 72573 72573 73027 73985 75311 76936 78885 81211
54532H1211K826L397L734L686L645M027M678N219N625N884N584M484L086J945
$$ 81211 84037 87434 91168 94854 98499 102526 107204 112423 118048 123932 129516 134000 137086 139031
54518A39031P99q63k786m263n183n943o697p264p527p235n911l654j526m24r5
$$ 139031 139830 138967 136181 131918 126735 120792 114095 106831 99304 92069 86158 82504 80978 80554 80459
54503H0459P5pn52r97p39j69J9p1l6j32o22r32n90k27m69n89L08J494J559O03
$$ 80459 80534 80527 79975 78978 78239 78070 78089 78018 77982 77850 77228 76296 75706 75479 75010 74421 74729 76223 77782 78385
54483G8385p8J0M41J246K633L675L134J562P55J130J335O49oJ54M92J41p54j449
$$ 78385 78307 78317 78758 80004 82637 86312 89446 91008 91763 92893 94228 94877 94871 95025 95517 95658 94904 93455
54465I3455j456p15L55Q82M54k29l83m32j147k064k097j404j077j174p32K96P76
$$ 93455 91999 91284 91639 92521 92975 92746 92363 91931 90784 88720 86623 85219 84142 82968 82236 82532 83308
54448H3308K91k38k00j31n59j179j579j769j706j272q52r64j385j516j388j322
$$ 83308 83599 83361 83161 83030 82471 81292 79713 77944 76238 74966 74114 73150 71765 70249 68861 67539
54432F7539r45J31J100R27K06L61J279J551R98Q93J510J541N03k90J48J011J218
$$ 67539 66594 66725 67825 68752 68958 69319 70598 72149 73147 74040 75550 77091 77594 77304 77452 78463 79681
54415G9681R38P84Q03R50J481K197K406K063J805J604P57m26m82R98K568L042
$$ 79681 80619 81403 82206 83156 84637 86834 89240 91303 93108 94712 95469 95043 94561 95559 98127 101169
54399A01169L014L424L988M074M062M663N705O487O707O465N994N827O525P790
$$ 101169 104183 107607 111595 115669 119731 124394 130099 136586 143293 149758 155752 161579 168104 175894
54385A75894Q602Q474P793O790N232L274J572J67j566l587m978n359n384n580
$$ 175894 184496 192970 200763 207553 212785 216059 217631 217798 216232 212645 207667 202308 196924 191344
54371A91344n805o131o900p638p289n938m949m939n028m597m266m499m721m513
$$ 191344 185539 179408 172508 164870 157581 151643 146694 141755 136727 132130 127864 123365 118644 114131
54357A14131m231l823k522n52M33l13j339j132k66p6m51k67P58K020L103L870
$$ 114131 109900 106077 103555 103003 103436 103123 101784 100652 100386 100310 99859 99592 100350 102370 105473 109343
54341A09343M027L589L257L525M055M497N171O261P165P364P196P122O988O597
$$ 109343 113370 116959 120216 123741 127796 132293 137464 143725 150890 158254 165450 172572 179560 186157
54327A86157O148N592M476K907J605N30j250l730n408n478n183n897p096p504
$$ 186157 192305 197897 202373 205280 206885 207415 206165 202435 197027 191549 186366 180469 173373 165869
54313A65869p185p051p209p159o976o964o728n801m688m188m158l972l670l645
$$ 165869 158684 151633 144424 137265 130289 123325 116597 110796 106108 101920 97762 93790 90120 86475
54299H6475l640l156k435k138k281k381k295k172j900j351q26o16m66m1N16Q98
$$ 86475 82835 79679 77244 75106 72825 70444 68149 65977 64077 62726 61900 61284 60818 60777 61293 62191
54283F2191J061Q88J15r86j516j069k52L13O88R28O02l11j015j035q88j004q73
$$ 62191 63252 64140 64255 63269 61753 60684 60432 60745 61433 62361 62963 62652 61637 60602 59714 58710 57837
54266E7837m6R81J618J994K195J684M32l69K03J466K209K234J902J089k82j466
$$ 57837 57791 58772 60390 62384 64579 66263 66695 66326 66529 67995 70204 72438 74340 75429 75147 73681
54250G3681j782j593j395q41K91J021M21p33j008m25j83o35r57o89l59n10r77
$$ 73681 71899 70306 68911 68070 68361 69382 69803 69070 68062 67637 67454 66819 65862 65173 64814 64304 63327
54233F3327j269j011k31M66L68l04m89J63O59K29n11p68r25j526j927j255n2M77
$$ 63327 62058 61047 60816 61282 61650 61346 60857 61020 61679 61908 61397 60629 59704 58178 56251 54996 54944 55421
54215E5421L73O91J670K436K428K000J622J340R94L32q31k038k276j244K8N17
$$ 55421 55794 56485 58155 60591 63019 65019 66641 67981 68975 69307 68476 66438 64162 62918 62946 63463
54199F3463L87J82k36r50j139k60O88M77l78l34Q28J836J828J126K13p80j568
$$ 63463 63850 64032 63796 62846 61707 61447 62135 62612 62234 61900 62728 64564 66392 67518 67731 66951 65383
54182F5383j712j285p26k06K21J46o35j469j597j233j091j193j095p97n15j3Q71
$$ 65383 63671 62386 61660 61454 61675 61821 61186 59717 58120 56887 55796 54603 53508 52711 52196 52183 53054
54165E3054J448R63j97j077j509j838j808r47K33O51K50M9N94J325J452P95k03
$$ 53054 54502 55465 55268 54191 52682 50844 49036 48089 48322 48973 49223 49272 49866 51191 52643 53438 53235
54148E3235p03j04J014J129k19j477j059L94J070O52M69J238K154K305J717Q62
$$ 53235 52532 52428 53442 54571 54352 52875 51816 52210 53280 53932 54401 55639 57793 60098 61815 62677
54132F2677M4n27p48p67o50k39J85j72j338k042j360j11N03O58J056J192K90p74
$$ 62677 62721 62194 61446 60679 60029 59790 59975 59803 58465 56423 55063 54952 55455 56113 57169 58361 58651 57877
54114E7877m28R92J520N13n27l08O77J334J326P68j73r33q64k38j8m31p17m67
$$ 57877 57449 58441 59961 60474 59947 59639 60316 61650 62976 63744 63571 62638 61774 61536 61518 61087 60370 59903
54096E9903j98l47o52q15r47j163j316j333j205p86j35J98n8l27j17J9n56j241
$$ 59903 59705 59358 58706 57891 56944 55781 54465 53132 51927 51141 51006 51204 51146 50819 50702 50721 50165 48924
54078D8924j037j85L49N73J202J983J902J032N74R67J404J382J344J546J561J235
$$ 48924 47887 47702 48051 48624 49826 51809 53711 54743 55317 56284 57688 59070 60414 61960 63521 64756
54062F4756R62Q06M22J6K06Q46J077O98L37K58J66K10R07J941K339J988J777K021
$$ 64756 65718 66524 66946 66962 67168 68014 69091 69789 70126 70384 70550 70760 71667 73608 75947 77935 79712 81733
54044H1733J985J292N35K29K68O30J601K978M116M800N164M926L919L166L875
$$ 81733 83718 85010 85545 85774 86042 86672 88273 91251 95367 100167 105331 110257 114176 117342 121217
54029A21217N441O124N721N781O862P597P076O269O173O205N568M754M514M446
$$ 121217 126658 132782 138503 144284 151146 158743 165819 172088 178261 184466 190034 194788 199302 203748
54015B03748L792K715J799J021R2p72j223j339j358j454j996l249m569m906m340
$$ 203748 207540 210255 212054 213075 213167 212395 211172 209833 208475 207021 205025 201776 197207 192301 187961
54000A87961m021m344m449l954l725m263m691m251l587l553l711l143j916q42
$$ 187961 183940 179596 175147 171193 167468 163205 158514 154263 150676 147123 143412 140269 138353 137511
53986A37511l91n52j114j444p50P45J723J495R74J192J760J656Q39Q5j62oM36
$$ 137511 137120 136568 135454 134010 133260 134005 135728 137223 138197 139389 141149 142805 143644 143729 143567 143561 143997
53969A43997R77J136O26k76j204k138l001l359l000k274j591j119j024j370j588
$$ 143997 144974 146110 146736 146460 145256 143118 140117 136758 133758 131484 129893 128774 127750 126380 124792
53954A24792r44K22P71M70L50R97J679J761J770K318L015L338L645M421N347N999
$$ 124792 123848 124070 124841 125311 125661 126658 128337 130098 131868 134186 137201 140539 144184 148605 153952 159951
53938A59951O703P850R065R884J0533J1232J1432J0574R046P546O050M238K335
$$ 159951 166654 174504 183569 193453 203986 215218 226650 237224 246270 253816 259866 264104 266439
53925B66439P50n56j592j766o66R95K099K457K761L541M747O037O897O875O196
$$ 266439 267189 266633 265041 263275 262609 263604 265703 268160 270921 274462 279209 285246 292143 299018 305214
53910C05214N759O058O534O475O021N776N912O171O311N960M601K272j12j643
$$ 305214 310973 317031 323565 330040 336061 341837 347749 353920 360231 366191 370792 373064 372952 371309
53896C71309k355k831l381l998m674n266n471n239m980n103n782p125q934j0315
$$ 371309 368954 366123 362742 358744 354070 348804 343333 338094 333114 328011 322229 315104 306170 295855
53882B95855j0338r312q528q506q547q194p970q172q112p283o322n962n908n541
$$ 295855 285517 276205 267677 259171 250624 242430 234460 226288 218176 210893 204571 198609 192701 187160
53868A87160n013m846n048n338n599n574m862l741l207l604m007l603k849k530
$$ 187160 182147 177301 172253 166915 161316 155742 150880 147139 143932 140328 136321 132718 129869 127339
53854A27339k600k621k611k643k374j776j524j918k197j694r11o14p05q06j100
$$ 127339 124739 122118 119507 116864 114490 112714 111190 109272 107075 105381 104470 103856 103151 102345 101245
53839A01245j671j834j131k64k9m8M34J197J548J511J451J130K29p03r52q13r99
$$ 101245 99574 97740 96609 96345 96316 96268 96702 97899 99447 100958 102409 103539 103768 103065 102113 101300 100301
53822A00301j338j143n45k91n36p07m21K85J276K121K045R95J71O30J808K453
$$ 100301 98963 97820 97275 96984 96448 95741 95320 95605 96881 99002 101047 102042 102213 102843 104651 107104
53806A07104K447K595L004L041K629K474K907L529M026M511N027N445N832O270
$$ 107104 109551 112146 115150 118191 120820 123294 126201 129730 133756 138267 143294 148739 154571 160841
53792A60841O491O237N779N450N037M247L434L077K908K377J621J192J057O91
$$ 160841 167332 173569 179348 184798 189835 194082 197516 200593 203501 205878 207499 208691 209748 210439
53778B10439Ln83q37r15r80j233j920k933l734m127m542n037m842l647k551k754
$$ 210439 210442 209859 209022 208107 207127 205894 203974 201041 197307 193180 188638 183601 178759 175112 172561 169807
53762A69807l893m687m713m447m049l258k275j670j504j389j250j294j477j678
$$ 169807 165914 161227 156514 152067 148018 144760 142485 140815 139311 137922 136672 135378 133901 132223
53748A32223k117k774k926k029o90P1Q8j70n95j249j721j661j504j718j828j210
$$ 132223 130106 127332 124406 122377 121687 121758 121846 121676 121081 119832 118111 116450 114946 113228 111400 110190
53732A10190l62k14n91n63k0L14K31J99L72M99P38J394K071K046J450J024Q63
$$ 110190 109828 109614 109023 108460 108440 108754 108985 109184 109556 110055 110793 112187 114258 116304 117754 118778 119641
53715A19641N21J45L93J233J890K042K054K046J757J338J394K129L226M475N763
$$ 119641 120162 120307 120700 121933 123823 125865 127919 129965 131722 133060 134454 136583 139809 144284 150047
53700A50047O610O580O012N522N007M044K951K391K110J210l76j720k194k018
$$ 150047 156657 163237 169249 174771 179778 183822 186773 189164 191274 192484 192108 190388 188194 186176
53686A86176j556r74n95p15j083j220j154j086q41l43j66o32r20j97Q73J075N61
$$ 186176 184620 183646 183051 182336 181253 180033 178879 177793 176952 176609 176443 175811 174891 174694 175567 176642 177203
53669A77203M09O66M60q3J48J248J894J331L60j18k71n14o31k65M82J267J760
$$ 177203 177612 178278 178738 178655 178803 180051 181945 183276 183636 183518 183247 182733 182102 181837 182319 183586 185346
53652A85346J700J278J285K070K750K445J762J837K399K338J769J781K307K226
$$ 185346 187046 188324 189609 191679 194429 196874 198636 200473 202872 205210 206979 208760 211067 213293
53638B13293J569J591K304J983n3k066k390j688j615k474l330l559l204k450j596
$$ 213293 214862 216453 218757 220740 220687 218621 216231 214543 212928 210454 207124 203565 200361 197911 196315
53623A96315j032p02j74M85O69L07K7Q2J3k54j48M32Q58R71J427K375K929K592
$$ 196315 195283 194581 194407 194892 195561 195868 195895 195977 195990 195736 195588 196020 196878 197849 199276 201651 204580 207172
53605B07172K048J987K187K339K725L423L871L827L810M064M047L579L355L732
$$ 207172 209220 211207 213394 215733 218458 221881 225752 229579 233389 237453 241500 245079 248434 252166
53591B52166M004L622L110L018L009K749K723L212L453K765J785J549J992K316
$$ 252166 256170 259792 262902 265920 268929 271678 274401 277613 281066 283831 285616 287165 289157 291473
53577B91473K224J966J661J332J192J238J037N02K95Q88J845K530K927L128K781
$$ 291473 293697 295663 297324 298656 299848 301086 302123 302625 302920 303808 305653 308183 311110 314238 317019
53562C17019J782Q94Q77J490K013K302K636K973K993K606J949J288J118J865L149
$$ 317019 318801 319695 320572 322062 324075 326377 329013 331986 334979 337585 339534 340822 341940 343805 346954
53547C46954M020M195M335M858N343N526N890O672P291P435P783Q776R598R327
$$ 346954 350974 355169 359504 364362 369705 375231 381121 387793 395084 402519 410302 419078 428676 438003
53533D38003Q469Q318R230J0429J1149J1272J1065J0974J1303J1745J1621J0931
$$ 438003 446472 454790 464020 474449 485598 496870 507935 518909 530212 541957 553578 564509
53521E64509J0466J0508J0275R185P889P240P074O825O649P026P730Q206Q523
$$ 564509 574975 585483 595758 604943 612832 620072 627146 633971 640620 647646 655376 663582 672105
53508F72105R126R906J0409J0699J1294J2371J3552J4455J5006J5451J6218J7381
$$ 672105 681231 691137 701546 712245 723539 735910 749462 763917 778923 794374 810592 827973
53496H27973J8247J8114J7552J7964J9582K1013K1256K1037K1303K1580K0986
$$ 827973 846220 864334 881886 899850 919432 940445 961701 982738 1004041 1025621 1046607
53485A046607J9927J9460J9559J9233J8080J6568J5084J3755J2986J3152J3844
$$ 1046607 1066534 1085994 1105553 1124786 1142866 1159434 1174518 1188273 1201259 1214411 1228255
53474A228255J4207J3964J3487J3095J2997J3494J4526J5280J5035J4162J3538
$$ 1228255 1242462 1256426 1269913 1283008 1296005 1309499 1324025 1339305 1354340 1368502 1382040
53463A382040J3322J3042J2569J2135J1575J0424Q802P403O518N624M105J997
$$ 1382040 1395362 1408404 1420973 1433108 1444683 1455107 1463909 1471312 1477830 1483454 1487559 1489556
53451A489556jj101j207j267k473m853p130q246q515q901r817j1155j2824j4642
$$ 1489556 1489555 1488454 1487247 1485980 1483507 1478654 1471524 1463278 1454763 1445862 1436045 1424890 1412066 1397424
53437A397424j6165j7293j8541k0129k1344k1525k1203k1491k2671k4044k4921
$$ 1397424 1381259 1363966 1345425 1325296 1303952 1282427 1261224 1239733 1217062 1193018 1168097
53426A168097k5055k4416k3119k1451j9554j7452j5528j4394j3946j3327j2238
$$ 1168097 1143042 1118626 1095507 1074056 1054502 1037050 1021522 1007128 993182 979855 967617
53415I67617j1431j1272j0812r206p153n840n110l866j816L01J961L259M325N221
$$ 967617 956186 944914 934102 924896 917743 911903 906793 902927 901111 901412 903373 906632 910957 916178
53401I16178O279P774R504J1240J3148J5192J6768J7729J8963K1055K3129K4215
$$ 916178 922457 930231 939735 950975 964123 979315 996083 1013812 1032775 1053830 1076959 1101174
53389A101174K5006K6862K9597L1808L3049L4182L5602L6752L7489L8507M0090
$$ 1101174 1126180 1153042 1182639 1214447 1247496 1281678 1317280 1354032 1391521 1430028 1470118
53378A470118M1655M2870M4110M5435M6149M5903M5307M5027M4901M4406M3443
$$ 1470118 1511773 1554643 1598753 1644188 1690337 1736240 1781547 1826574 1871475 1915881 1959324
53367A959324M2325M1410M0900M0564L9658L7609L4672L1479K8096K4255K0193
$$ 1959324 2001649 2043059 2083959 2124523 2164181 2201790 2236462 2267941 2296037 2320292 2340485
53356B340485J6447J2905Q923M418J2l934p621j1137j4314j7301k0523k3880k6748
$$ 2340485 2356932 2369837 2378760 2383178 2383190 2379256 2371635 2360498 2346184 2328883 2308360 2284480 2257732
53343B257732k8917l0755l2400l3499l3973l4311l4886l5554l6151l6727l7107
$$ 2257732 2228815 2198060 2165660 2132161 2098188 2063877 2028991 1993437 1957286 1920559 1883452
53332A883452l6797l5695l4418l3719l3835l4500l5235l5602l5462l5043l4510
$$ 1883452 1846655 1810960 1776542 1742823 1708988 1674488 1639253 1603651 1568189 1533146 1498636
53321A498636l3687l2468l1212l0234k9191k7561k5430k3270k1169j8979j6981
$$ 1498636 1464949 1432481 1401269 1371035 1341844 1314283 1288853 1265583 1244414 1225435 1208454
53310A208454j5706j5209j5114j5225j5533j5859j6009j5965j5380j3501j0374
$$ 1208454 1192748 1177539 1162425 1147200 1131667 1115808 1099799 1083834 1068454 1054953 1044579
53299A044579p546o353n993m538j616J282L063M138N133N985O783Q184J0320J2330
$$ 1044579 1037033 1030680 1024687 1020149 1018533 1019815 1022878 1027016 1032149 1038134 1044917 1053101 1063421 1075751
53285A075751J3678J5023J7076J9392K1063K2044K3078K4697K6845K9190L1254
$$ 1075751 1089429 1104452 1121528 1140920 1161983 1184027 1207105 1231802 1258647 1287837 1319091
53274A319091L2561L3008L2948L2692L2131L1040K9445K7600K5779K4164K2641
$$ 1319091 1351652 1384660 1417608 1450300 1482431 1513471 1542916 1570516 1596295 1620459 1643100
53263A643100K0741J8143J5105J2048Q914N589K658R23J19r92l092n562p576r106
$$ 1643100 1663841 1681984 1697089 1709137 1718051 1723640 1726298 1727221 1727340 1726348 1723256 1717694 1710118 1701012
53249A701012j0468j1569j2205j2709j3698j5261j6793j7669j7880j7900j7977
$$ 1701012 1690544 1678975 1666770 1654061 1640363 1625102 1608309 1590640 1572760 1554860 1536883
53238A536883j7742j6813j5670j5298j5838j6250j5750j4887j4625j5104j6006
$$ 1536883 1519141 1502328 1486658 1471360 1455522 1439272 1423522 1408635 1394010 1378906 1362900
53227A362900j7404j9201k0379k0049j8937j8563j9135j9557j9372j9291j9685
$$ 1362900 1345496 1326295 1305916 1285867 1266930 1248367 1229232 1209675 1190303 1171012 1151327
53216A151327j9868j9299j8310j7264j6034j4686j3718j3205j2744j2473j3103
$$ 1151327 1131459 1112160 1093850 1076586 1060552 1045866 1032148 1018943 1006199 993726 980623
53205I80623j4455j5159j4510j3585j3725j4741j5511j5589j5211j4324j2675
$$ 980623 966168 951009 936499 922914 909189 894448 878937 863348 848137 833813 821138
53194H21138j0670r171q415p783o811n892n748o486p416p835p804p976q680r557
$$ 821138 810468 801297 792882 785099 778288 772396 766648 760162 752746 744911 737107 729131 720451 710894
53180G10894j0322j1238j2487j3563j3993j4202j4844j5633j5814j5535j5645
$$ 710894 700572 689334 676847 663284 649291 635089 620245 604612 588798 573263 557618
53169E57618j6146j6073j5013j3735j3016j2748j2561j2400j2160j1572j0757
$$ 557618 541472 525399 510386 496651 483635 470887 458326 445926 433766 422194 411437
53158D11437j0171r822r228q365p691p164o236n010m323m284l888k551r85N5Q34
$$ 411437 401266 391444 382216 373851 366160 358996 352760 347750 343427 339143 335255 332704 331719 331774 332608
53143C32608J769K511K740L027L932M936N163M569L648K453P78j139k808m149
$$ 332608 334377 336888 339628 342655 346587 351523 356686 361255 364903 367356 368134 366995 364187 360038
53129C60038n277o044o351o548o920p204p096o897p045p382p458p216o832o263
$$ 360038 354761 348717 342366 335818 328898 321694 314598 307701 300656 293274 285816 278600 271768 265505
53115B65505n447m716m472m684n008n199n104m672m193m082m140l648k531j742
$$ 265505 260058 255342 250870 246186 241178 235979 230875 226203 222010 217928 213788 210140 207609 205867
53101B05867j967k601k648k080j611j595j828k147k537k797k716k426k200k028
$$ 205867 203900 201299 198651 196571 194960 193365 191537 189390 186853 184056 181340 178914 176714 174686
53087A74686j814j676j733j885k049k321k607k583k325k382k870l049k375j407
$$ 174686 172872 171196 169463 167578 165529 163208 160601 158018 155693 153311 150441 147392 145017 143610
53073A43610j014j167j244j107j143j431j736k064k559k858k352j123l1K61o0
$$ 143610 142596 141429 140185 139078 137935 136504 134768 132704 130145 127287 124935 123812 123781 124042 123982
53058A23982m40o33p24p74p03m54j22J63L57M74L70j62r20j234p50j8J57k29n56
$$ 123982 123542 122909 122185 121411 120708 120254 120132 120295 120652 121126 121496 121334 120414 119180 118430 118412 118569 118340 117784
53039A17784n69n09l86L9M91L23m33r60q39n61o30r22j155j216p92L97J699J836
$$ 117784 117215 116706 116320 116359 116850 117173 116740 115780 114941 114380 113750 112828 111673 110457 109665 110062 111761 113597
53021A13597O15o27q03l23j9J58N45Q45P65Q31J550K376K527K285K489L137L473
$$ 113597 114212 113585 112782 112459 112440 112598 113143 113988 114753 115584 117134 119510 122037 124322 126811 129948 133421
53004A33421L204K782K629K857L483M398N256N989O921P954Q216P274O142O184
$$ 133421 136625 139407 142036 144893 148376 152774 158030 164019 170940 178894 187110 194384 200526 206710
52990B06710P342Q361Q295P038M746J758j013k647l188l458l981m696n389n764
$$ 206710 214052 222413 230708 237746 242492 244250 243237 240590 237402 233944 229963 225267 219878 214114
52976B14114n373m289l523l949n007n355m641l704l163k779k289j949k011k316
$$ 214114 208741 204452 200929 196980 191973 186618 181977 178273 175110 172331 170042 168093 166082 163766
52962A63766k625k763k432j491m41%j78l25j83j02j48K16J235K278K647K500K473
$$ 163766 161141 158378 155946 154455 154014 154014 153836 153511 153328 153226 153078 153294 154529 156807 159454 161954 164427
52945A64427K668K532J763Q70O53J142J482R93J14j43M41J070J135J006J301J999
$$ 164427 167095 169627 171390 172260 172913 174055 175537 176530 176644 176501 176942 178012 179147 180153 181454 183453
52929A83453K666L090L262L046K404J642J131J054J504K351K836K087M05p15m36
$$ 183453 186119 189209 192471 195517 197921 199563 200694 201748 203252 205603 208439 210526 210931 210216 209780
52914B09780L09K34n32r55p02k35K46Q48J292J103M84J19K41O02J112J752K050
$$ 209780 210089 210323 209791 208836 208134 207899 208145 208993 210285 211388 211872 211991 212232 212834 213946 215698 217748
52897B17748J546O61L04O69J216J676K208K609K308J298M15M06J205K173K666
$$ 217748 219294 219955 220259 220928 222144 223820 226028 228637 230945 232243 232658 233064 234269 236442 239108
52882B39108K451K003K236L445M776N209M831M519M744N424O512P878Q817Q676
$$ 239108 241559 243562 245798 249243 254019 259228 264059 268578 273322 278746 285258 293136 301953 310629
52868C10629P863P303P027O271M926L743K968J874R9j589k351k388k451k767l055
$$ 310629 318492 325795 332822 339093 344019 347762 350730 352604 352703 351114 348763 346375 343924 341157 338102
52853C38102l193l340l550l669l538l215k984l087l334l146k318j470j434k310
$$ 338102 334909 331569 328019 324350 320812 317597 314613 311526 308192 305046 302728 301258 299824 297514
52839B97514l494m391m732m452l770l154k738k033p20N84Q91m8j696l393m549
$$ 297514 294020 289629 284897 280445 276675 273521 270783 268750 268030 268614 269505 269457 267761 264368 259819
52824B59819m647l852l183l297l498k854j864j819k769l390k890j864j093o23
$$ 259819 255172 251320 248137 244840 241342 238488 236624 234805 232036 228646 225756 223892 222799 222176
52810B22176m09p75j723k574k755k410j899j334q57p87j149j521j577j416j286
$$ 222176 221767 220992 219269 216695 213940 211530 209631 208297 207440 206653 205504 203983 202406 200990 199704
52795A99704j401j946k769l179k663j668j076j083j210j207j152r39n52o25j641
$$ 199704 198303 196357 193588 190409 187746 186078 185002 183919 182709 181502 180350 179411 178859 178234 176593
52780A76593k737k535j175k06l66p17m32j00n64j494j936j569q27l18n31j506
$$ 176593 173856 171321 170146 169940 169574 168857 168425 168325 167761 166267 164331 162762 161935 161617 161086 159580
52764A59580k455k430j583j007j078r82k02N19L30n65j488k223k702k531j648
$$ 159580 157125 154695 153112 152105 151027 150045 149843 150362 150692 150127 148639 146416 143714 141183 139535
52749A39535q26q32j502k154k385k040j056O9M01l07j147j250p73j68O50J646
$$ 139535 138709 137877 136375 134221 131836 129796 128740 128809 129210 128903 127756 126506 125733 125565 126215 127861
52733A27861K049J394O07R69K406L784M563N175N911O430O411N911N091M153L527
$$ 127861 129910 131304 131911 132880 135286 139070 143633 148808 154719 161149 167560 173471 178562 182715 186242
52718A86242L388L172K129M12j076j927k608l611m743n550n876n855n650n422
$$ 186242 189630 192802 194931 195343 194267 192340 189732 186121 181378 175828 169952 164097 158447 153025
52704A53025n295n201m940m436l828l326l114l278l690l984l936l648l287k783
$$ 153025 147730 142529 137589 133153 129325 125999 122885 119607 115917 111933 107997 104349 101062 98279
52690I8279k114j651j840k517k928k518j479l90M13R37J121O88m16j662k283k003
$$ 98279 96165 94514 92674 90157 87229 84711 83232 82842 83255 84192 85313 86001 85585 83923 81640 79637
52674G9637j228n08j64l73j144j929j881q49K41N24K59J60J40l86j234j526j054
$$ 79637 78409 77901 77737 77364 76220 74291 72410 71561 71802 72326 72585 72745 72885 72499 71265 69739 68685
52657F8685o02p05r08n83J57P67R00N07k14p20n79j28j31n64n67J81Q32O24J9
$$ 68685 68083 67378 66470 65887 66044 66811 67711 68218 68004 67284 66705 66577 66446 65882 65315 65496 66328 66952 66971
52638F6971p0L72O26M05R2lM4J78N71J235J705J391K35j034j488r35q4L54M54
$$ 66971 66901 67273 67899 68304 68396 68393 68437 68615 69186 70421 72126 73517 73752 72718 71230 70295 70211 70565 71019
52619G1019O10P32M18k18o35o04l13J54P20Q08j31j541k113j440m61J0K65Q16
$$ 71019 71629 72361 72779 72561 71926 71322 71009 71163 71883 72691 72560 71019 68906 67466 67005 67015 67280 68096
52601F8096J379J401R30L74j21n37o29k15M06P27N07p2n41m06L00Q71Q44Q48J695
$$ 68096 69475 70876 71806 72180 72059 71522 70893 70678 71084 71811 72318 72246 71705 71299 71599 72470 73314 74162 75857
52582G5857K885L056J997R63P55P78M87M37J089J710J500R53J049J657J836J275
$$ 75857 78742 81798 83795 84758 85513 86291 86778 87215 88304 90014 91514 92467 93516 95173 97009 98284
52566I8284N90L70O77J204J482J182O33O20J266J744J532J182J329J655J546J137
$$ 98284 98874 99244 99921 101125 102607 103789 104422 105042 106308 108052 109584 110766 112095 113750 115296 116433
52550A16433R00P89O30P54J415K044J938J313Q80P40N23K46K24M13O20J034J840
$$ 116433 117333 118122 118752 119506 120921 122965 124903 126216 127096 127836 128359 128605 128829 129242 129862 130896 132736
52533A32736K577K657K254K003K074K137J964J387J43j508k438j824l46O27P76
$$ 132736 135313 137970 140224 142227 144301 146438 148402 149789 149932 148424 145986 144162 143816 144443 145219
52518A45219Q17J054R98M88J44M47J043J206N96n18j428j487q11k64m05p03l79
$$ 145219 146036 147090 148088 148576 148720 149167 150210 151416 152012 151494 150066 148579 147768 147504 147099 146396 146017
52501A46017M21Q72O00j07r23j603j761j293q44j064j601j564q63k48j55l00m16
$$ 146017 146438 147310 147910 147803 146880 145277 143516 142223 141379 140315 138714 137150 136287 136039 135884 135584 135168
52484A35168n70o90m61J26P26J197J673K003J803J136O02O10R80J332J469J317
$$ 135168 134598 133908 133447 133573 134299 135496 137169 139172 140975 142111 142713 143323 144303 145635 147104 148421
52468A48421Q97M02%l25n65m57J06P56J149J517K180K768K546J420Q8p17p59k27
$$ 148421 149318 149720 149720 149395 148830 148373 148479 149235 150384 151901 154081 156849 159395 160815 160903 160186 159427 159200
52450A59200L81N11J19k05o6J87J71K72R57J738J702Q92K99M90J047J382J467
$$ 159200 159581 160092 160211 160006 159940 160127 160298 160570 161527 163265 164967 165859 166158 166648 167695 169077 170544
52433A70544J625K091K820L354L076K074J388J851K984L644L431K711J663K48
$$ 170544 172169 174260 177080 180434 183510 185584 186972 188823 191807 195451 198882 201593 203256 203504
52419B03504j070j614j575j856k747l533l590l154k791k795l192l808m200m007
$$ 203504 202434 200820 199245 197389 194642 191109 187519 184365 181574 178779 175587 171779 167579 163572
52405A63572l452l011k692k169j496j110j113j174j087q99n84j87j18o61j331
$$ 163572 160120 157109 154417 152248 150752 149642 148529 147355 146268 145369 144785 144598 144480 143819 142488
52390A42488j452j164j159j519j622j142m24J16L39K58J77O46J532J607R4j737
$$ 142488 141036 139872 138713 137194 135572 134430 134006 134122 134461 134719 134896 135542 137074 138681 138775 137038
52374A37038j827j01J445J487Q10O12Q13P64N20M67N63O70J088J983K742K586
$$ 137038 135211 135110 136555 138042 138852 139464 140277 141041 141561 142028 142591 143261 144349 146332 149074 151660
52358A51660J581N45K17O94J515K111K391K851L722M302L823K799K537L344M171
$$ 151660 153241 153786 154003 154697 156212 158323 160714 163565 167287 171589 175412 178211 180748 184092 188263
52343A88263M244M007M068M166L759K849J752O97P0L78J457K369K537K372K389
$$ 188263 192507 196514 200582 204748 208507 211356 213108 213805 213875 214253 215710 218079 220616 222988 225377
52328B25377K408K112J720J530J384J214J532K703M135M874M698M084L453K976
$$ 225377 227785 229897 231617 233147 234531 235745 237277 239980 244115 248989 253687 257771 261224 264200
52314B64200K921L550M720N922O693O890O781O862P347P814P801P705Q409R916
$$ 264200 267121 270671 275391 281313 288006 294896 301677 308539 315886 323700 331501 339206 347615 357531
52300C57531J1090J1129J0595J0546J1194J2037J2776J3508J4208J4637J4629
$$ 357531 368621 379750 390345 400891 412085 424122 436898 450406 464614 479251 493880
52289D93880J4262J3838J3793J4340J5107J5548J5724J6225J7137J7766J7617
$$ 493880 508142 521980 535773 550113 565220 580768 596492 612717 629854 647620 665237
52278F65237J7118J6939J7156J7413J7469J7202J6480J5422J4422J3659J2951
$$ 665237 682355 699294 716450 733863 751332 768534 785014 800436 814858 828517 841468
52267H41468J2274J1826J1419J0402Q553O501M831L398J975Q89M18R2o89j743
$$ 841468 853742 865568 876987 887389 895942 902443 907274 910672 912647 913536 913954 914046 913357 911614
52253I11614k411k522k404k210j841j347q39j79P42J574J858J782K049L043M511
$$ 911614 909203 906681 904277 902067 900226 898879 898040 897861 898603 900177 902035 903817 905866 908909 913420
52238I13420O089P709R440J1103J2274J2648J2383J2091J2290J2917J3511J3851
$$ 913420 919509 927218 936658 947761 960035 972683 985066 997157 1009447 1022364 1035875 1049726
52226A049726J4067J4199J4049J3550J2916J2250J1422J0400R381Q477P646O992
$$ 1049726 1063793 1077992 1092041 1105591 1118507 1130757 1142179 1152579 1161960 1170437 1178083 1185075
52214A185075O638O285N389L929K516J551P65k06j255k082k558k653k440k282
$$ 1185075 1191713 1197998 1203387 1207316 1209832 1211383 1212148 1211942 1210687 1208605 1206047 1203394 1200954 1198672
52200A198672k572l060l099k702k627l127l369k612j321m75k48m8M49R87J295
$$ 1198672 1196100 1193040 1189941 1187239 1184612 1181485 1178116 1175504 1174183 1173708 1173460 1173412 1173861 1174848 1176143
52185A176143J399J470J686K171K780L086K772K006J292J108J620K443K736J964
$$ 1176143 1177542 1179012 1180698 1182869 1185649 1188735 1191507 1193513 1194805 1195913 1197533 1199976 1202712 1204676
52171A204676O01l58n82n15n02n04p63j759l226m133m100l964m447n006m760l888
$$ 1204676 1205277 1204919 1204337 1203822 1203320 1202816 1202053 1200294 1197068 1192935 1188835 1184871 1180424 1175418 1170658 1166770
52155A166770l274l229l325l151k603j726q18m94j046j978k632l047l786n053
$$ 1166770 1163496 1160267 1156942 1153791 1151188 1149462 1148644 1148150 1147104 1145126 1142494 1139447 1135661 1130608
52141A130608o422p265p299o848o737p496q640r147q731q036p459o682n721n404
$$ 1130608 1124186 1116921 1109622 1102774 1096037 1088541 1079901 1070754 1062023 1053987 1046528 1039846 1034125 1028721
52127A028721o095o794o368n178m492m732n179n178m820m406l983l566l238k986
$$ 1028721 1022626 1015832 1009464 1004286 999794 995062 989883 984705 979885 975479 971496 967930 964692 961706
$$ [...]
##END NTUPLES=NMR SPECTRUM
##END=
