
##TITLE=AC1361_QARH12183_6945731_E7gg5MRiDO
##JCAMPDX= 6.0         $$ Bruker NMR JCAMP-DX V2.0
##DATA TYPE= NMR SPECTRUM
##DATA CLASS= NTUPLES
##ORIGIN= BRUKER
##OWNER= Administrator
$$ 1.72 TOPSPIN		Version 2.1
$$ 2012-10-18 13:47:38.038 -0700  Administrator@X
$$ Compression mode = diff/dup
##.OBSERVE FREQUENCY= 400.02188249412
##.OBSERVE NUCLEUS= ^1H
##.ACQUISITION MODE= SIMULTANEOUS (DQD)
##.ACQUISITION SCHEME= undefined
##.AVERAGES= 8
##.DIGITISER RES= 22
##SPECTROMETER/DATA SYSTEM= spect
##.PULSE SEQUENCE= zg30
##.SOLVENT NAME= COFFEE_meoh
##.SHIFT REFERENCE= INTERNAL, COFFEE_meoh, 1, 14.98509
##AUDIT TRAIL= $$ (NUMBER, WHEN, WHO, WHERE, PROCESS, VERSION, WHAT)
$$ ##TITLE= Audit trail, TOPSPIN		Version 2.1
$$ ##JCAMPDX= 5.01
$$ ##ORIGIN= Bruker BioSpin GmbH
$$ ##OWNER= Administrator
$$ $$ C:\Bruker\TOPSPIN/data/COFFEE/nmr/AC1361_QARH12183_6945731_E7gg5MRiDO/10/pdata/1/auditp.txt
$$ ##AUDIT TRAIL=  $$ (NUMBER, WHEN, WHO, WHERE, PROCESS, VERSION, WHAT)
(   1,<2012-10-13 23:26:20.234 -0500>,<Administrator>,<TOPSPIN>,<go>,<TOPSPIN 2.1>,
      <created by zg
	started at 2012-10-13 23:25:13.718 -0500,
	POWCHK enabled, PULCHK disabled,
       configuration hash MD5:
       6B 1B 68 BB D9 2E 58 E2 7F 35 AD 54 07 DF 0E 41
       data hash MD5: 64K
       BB 3F 80 50 06 E0 B5 04 AA DB 28 9E F5 3E F5 F0>)
(   2,<2012-10-13 23:26:22.953 -0500>,<Administrator>,<TOPSPIN>,<proc1d>,<TOPSPIN 2.1>,
      <Start of raw data processing
       efp LB = 0 FT_mod = 6 PKNL = 1 PHC0 = 0 PHC1 = 0 SI = 32K 
       data hash MD5: 32K
       DE 3F 52 53 7F 35 F2 4C CD B3 BA 1C 0A B8 A2 D2>)
(   3,<2012-10-13 23:26:23.296 -0500>,<Administrator>,<TOPSPIN>,<proc1d>,<TOPSPIN 2.1>,
      <pk PHC0 = 183.5651 PHC1 = 0 
       data hash MD5: 32K
       50 23 63 79 F3 C4 C9 6A 70 FF BE CE 3F F9 8D 77>)
(   4,<2012-10-13 23:26:23.406 -0500>,<Administrator>,<TOPSPIN>,<proc1d>,<TOPSPIN 2.1>,
      <abs ABSG = 1 
       data hash MD5: 32K
       C4 9F 29 0F A1 99 D6 33 15 6C 62 30 35 7D 54 C8>)
(   5,<2012-10-13 23:26:23.437 -0500>,<Administrator>,<TOPSPIN>,<proc1d>,<TOPSPIN 2.1>,
      <abs ABSG = 2 
       data hash MD5: 32K
       0E D0 D6 53 C8 29 1A F0 8E D7 BC 76 EC D2 35 74>)
(   6,<2012-10-13 23:26:23.468 -0500>,<Administrator>,<TOPSPIN>,<proc1d>,<TOPSPIN 2.1>,
      <abs ABSG = 3 
       data hash MD5: 32K
       12 BD B9 4F 33 55 6D C6 43 53 44 C0 C4 AA 88 B4>)
(   7,<2012-10-13 23:26:23.500 -0500>,<Administrator>,<TOPSPIN>,<proc1d>,<TOPSPIN 2.1>,
      <abs ABSG = 4 
       data hash MD5: 32K
       43 2F 4A EA 4A 43 69 5C 21 94 D4 71 D3 57 C1 4B>)
(   8,<2012-10-13 23:26:23.531 -0500>,<Administrator>,<TOPSPIN>,<proc1d>,<TOPSPIN 2.1>,
      <abs ABSG = 5 
       data hash MD5: 32K
       6C 86 A4 76 EB 62 5C 2B 83 C6 C3 CB 84 F7 AB 65>)
(   9,<2012-10-13 23:26:27.140 -0500>,<Administrator>,<TOPSPIN>,<audit>,<TOPSPIN 2.1>,
      <user comment:
       ICON-NMR User ID: COFFEE
       data hash MD5: 32K
       6C 86 A4 76 EB 62 5C 2B 83 C6 C3 CB 84 F7 AB 65>)
$$ ##END=
$$ 
$$ [...]
150 150 150 150 150 150 150 150
##$TP07= 0
##$TPNAME0= <>
##$TPNAME1= <>
##$TPNAME2= <>
##$TPNAME3= <>
##$TPNAME4= <>
##$TPNAME5= <>
##$TPNAME6= <>
##$TPNAME7= <>
##$TPOAL= (0..7)
0.5 0.5 0.5 0.5 0.5 0.5 0.5 0.5
##$TPOFFS= (0..7)
0 0 0 0 0 0 0 0
##$TUNHIN= 0
##$TUNHOUT= 0
##$TUNXOUT= 0
##$USERA1= <user>
##$USERA2= <user>
##$USERA3= <user>
##$USERA4= <user>
##$USERA5= <user>
##$V9= 5
##$VALIST= <valist>
##$VCLIST= <CCCCCCCCCCCCCCC>
##$VD= 0
##$VDLIST= <DDDDDDDDDDDDDDD>
##$VPLIST= <PPPPPPPPPPPPPPP>
##$VTLIST= <TTTTTTTTTTTTTTT>
##$WBST= 2048
##$WBSW= 25
##$XGAIN= (0..3)
0 0 0 0
##$XL= 0
##$YL= 0
##$YMAX_a= 500184
##$YMIN_a= -641757
##$ZGOPTNS= <>
##$ZL1= 120
##$ZL2= 120
##$ZL3= 120
##$ZL4= 120
##$ABSF1= 14.98509
##$ABSF2= -5.573092
##$ABSG= 5
##$ABSL= 3
##$ALPHA= 0
##$AQORDER= 0
##$ASSFAC= 0
##$ASSFACI= 0
##$ASSFACX= 0
##$ASSWID= 0
##$AUNMP= <proc_prof1d_extract_pilot.lims>
##$AXLEFT= 0
##$AXNAME= <>
##$AXNUC= <1H>
##$AXRIGHT= 0
##$AXTYPE= 0
##$AXUNIT= <>
##$AZFE= 0.1
##$AZFW= 0.1
##$BCFW= 0
##$BC_mod= 0
##$BYTORDP= 0
##$COROFFS= 0
##$CY= 15
##$DATMOD= 1
##$DC= 0
##$DFILT= <>
##$DTYPP= 0
##$F1P= 0
##$F2P= 0
##$FCOR= 0.5
##$FTSIZE= 32768
##$FT_mod= 6
##$GAMMA= 0
##$GB= 0
##$INTBC= 1
##$INTSCL= 1
##$ISEN= 128
##$LB= 0
##$LEV0= 0
##$LPBIN= 0
##$MAXI= 10000
##$MC2= 0
##$MEAN= 0
##$ME_mod= 0
##$MI= 0
##$NCOEF= 0
##$NC_proc= -8
##$NLEV= 6
##$NOISF1= 0
##$NOISF2= 0
##$NSP= 0
##$NTH_PI= 0
##$NZP= 0
##$OFFSET= 14.98509
##$PC= 1
##$PHC0= 183.5651
##$PHC1= 0
##$PH_mod= 1
##$PKNL= yes
##$PPARMOD= 0
##$PPDIAG= 0
##$PPIPTYP= 0
##$PPMPNUM= 2147483647
##$PPRESOL= 1
##$PSCAL= 4
##$PSIGN= 0
##$PYNMP= <proc.py>
##$REVERSE= no
##$SF= 400.02
##$SI= 32768
##$SIGF1= 0
##$SIGF2= 0
##$SINO= 400
##$SIOLD= 32768
##$SPECTYP= <>
##$SREGLST= <1H.CDCl3>
##$SSB= 0
##$STSI= 32768
##$STSR= 0
##$SW_p= 8223.68421052631
##$SYMM= 0
##$S_DEV= 0
##$TDeff= 65536
##$TDoff= 0
##$TI= <>
##$TILT= no
##$TM1= 0
##$TM2= 0
##$TOPLEV= 0
##$USERP1= <user>
##$USERP2= <user>
##$USERP3= <user>
##$USERP4= <user>
##$USERP5= <user>
##$WDW= 1
##$XDIM= 32768
##$YMAX_p= 446573963
##$YMIN_p= -676606
##$CURPLOT= <Network HP LaserJet P1505>
##$CURPRIN= <$Network HP LaserJet P1505>
##$DFORMAT= <normdp>
##$LAYOUT= <+/1D_H.xwp>
##$LFORMAT= <normlp>
##$PFORMAT= <normpl>
##$SURQMSG= 1
$$ End of Bruker specific parameters
$$ ---------------------------------
##NTUPLES= NMR SPECTRUM
##VAR_NAME=  FREQUENCY,     SPECTRUM/REAL,   SPECTRUM/IMAG
##SYMBOL=    X,             R,               I
##VAR_TYPE=  INDEPENDENT,   DEPENDENT,       DEPENDENT
##VAR_FORM=  AFFN,          ASDF,            ASDF
##VAR_DIM=   32768,         32768,           32768
##UNITS=     HZ,            ARBITRARY UNITS, ARBITRARY UNITS
##FACTOR=    0.250966925370066, 1,           1
##FIRST=     8223.43324360094, 11594,        98678
##LAST=      0,             -68372,          -224020
##MIN=       0,             -676606,         0
##MAX=       8223.43324360094, 446573963,    0
$$ Real data points
##PAGE= N=1
##DATA TABLE= (X++(R..R)), XYDATA
$$ [...]
19546B11299c75202P3658a3536D5761b5293m4179L071E9177K16909A27286d986
19534A87276h0938K7729j646A74419b5956A00668b00872A30888B7844b4503C4809
19522c0466C41924a20991n1746n5513P190r6121I5259a3861o2159j33592j38408
19511c48020j76445b15966d4293H8999N1769o4081b20280Q9734q7999A46504g2364
19499i7103M8165A74308P2509G4137a97035M9704b6646F4945a18815j51122A24685
19487b22163J03597q7212B2529b26649A23383a10612A05349e6173j37560H6588
19476a00412j23110C73687A42889d7470j86373C6925e8585I3296f1416D1045a4475
19464h7797n70j26426m0969G4045C6295i1842k18627a49999l21687a01353l42835
$$ plain form
19546 211299 -375202 -301544 -13536 45761 -25293 -69472 -66401 59177 276086 127286 -4986
19534 187276 -80938 -53209 -54855 174419 -25956 100668 -200872 130888 27844 -24503 34809
19522 -30466 341924 -120991 -172737 -228250 -221060 -317181 95259 -13861 -76020 -209612 -348020
19511 -348020 -524465 -215966 -44293 88999 140768 76687 -220280 -130546 -218545 146504 -72364
19499 -97103 -48938 174308 246817 74137 -197035 -147331 -26646 64945 -118815 -269937 124685
19487 -222163 -118566 -205778 22529 -226649 123383 -110612 105349 -56173 -193733 86588
19476 -100412 -223522 373687 142889 -47470 -233843 36925 -58585 93296 -61416 41045 -14475
19464 -87797 -88367 -214793 -255762 74045 36295 -91842 -310469 -149999 -471686 -101353 -444188
19453d44188a75368h7236K2844j59930h2062j04024j39421A21426c4056k5855
19443e9911k7272A48405a15292N2634A25585b14914H6115a47806N5766p1403r0227
19432b53670Q5028f0737k8506n2449f9852k36220A2707J73692a41397O925a7489
19420A03244l1018a29797n8659k7203Q6917A67997c27214c813D33981b72850g6889
19408c27993I1810a99400A75778a88657A1742c11154e6164A79015A0484b24967
19397a22329k87541B38891j09670A5800b35851B4369a61788B62552f0555B04694
19386B94175a22983n909A05922f469j66987K5481f194k77566a32799C9124b53713
19374a58640b5133j08806D1489q603o225i1607R573r4995J6052M0914j7368H8800
$$ plain form
19453 -444188 -175368 -87236 -64392 -224322 -82062 -186086 -325507 121426 -34056 -59911
19443 -59911 -87183 148405 -115292 -62658 125585 -214914 86115 -147806 -92040 -163443 -253670
19432 -253670 -168642 -60737 -89243 -141692 -69852 -306072 12707 186399 -141397 -134472 -17489
19420 103244 72226 -129797 -188456 -215659 -128742 167997 -327214 -3813 433981 -272850 -76889
19408 -327993 91810 -199400 175778 -188657 11742 -311154 -56164 179015 10484 -224967
19397 -122329 -409870 238891 129221 15800 -235851 24369 -161788 262552 -60555 204694
19386 294175 -122983 -128892 105922 -6469 -173456 -147975 -6194 -283760 -132799 39124 -253713
19374 -158640 -25133 -133939 41489 32886 26661 -91607 -82034 -177029 -160977 -120063 -137431 88800
19361a52576K0660j01007k3010p6746a49374H8781b11592O8295B49161j8410b02396
19349b81290A9554g101G8476g2091A37899F7400a42975j37772R0946j26215a684
19337B00903r0526a1809p935k77801a3484n9066G5855a42522a9683I6580M5346
19326A41926b30750j92552a52009F002P5614a63994D0805b02776B1182i1201B10857
19314A97217e5624B55354A00008a36007j67957a09390j44821D6032a09790l016
19304a12806j63895J04264G1585J97952a63156c9953B8273a37511d2609p0192
19294a12801d6751k31569B24274a82980j9617j13693A98564a91482O4732b5847
19283A3061a62848K2644M8382l9819E6150a53538A31879a2616k44508J01550j29466
$$ plain form
19361 -152576 -131916 -232923 -255933 -332679 -149374 88781 -211592 -143297 249161 230751 -202396
19349 -281290 19554 -7101 78476 -72091 137899 67400 -142975 -280747 -189801 -316016 -1684
19337 200903 110377 -11809 -19744 -297545 -13484 -72550 75855 -142522 -19683 96580 141926
19326 141926 -230750 -423302 -152009 6002 81616 -163994 40805 -202776 21182 -91201 210857
19314 197217 -55624 255354 100008 -136007 -303964 -109390 -254211 46032 -109790 -112806
19304 -112806 -276701 -172437 71585 269537 -163156 -39953 28273 -137511 -42609 -112801
19294 -112801 -46751 -278320 224274 -182980 -202597 -316290 198564 -191482 -126750 -25847
19283 13061 -162848 -140204 -91822 -131641 56150 -153538 131879 -12616 -257124 -155574 -285040
19272b85040b4561l08468a1966m3048j61187f8209j25762L1924B53183f3473G1975
19260A27099F1022j7930K9027O1266o5763a87634k88879J80592d3592J3005l44380
19249c74967A91604q9342g5526j35788P3030C48161b3648q4369l8056k95157g6221
19237F8480O87c81954C16682L4452E4671a633q9363B03957c47031C46482A14530
19225i722j64588g5406B77812h5441c505p2589B63190p9136i398l36008A19336
19213a335C26524F0744c30005f2240H2908J29759m0796b02722D23878F7064O1594
19202A28658C9705A6558b45228f2939A1189c87011H6103i4914M6881k38248H6608
19190A10488a56495C12010j24383b31363P1098M3811l2534G4113B1662b45329
$$ plain form
19272 -285040 -24561 -333029 -11966 -55014 -216201 -68209 -193971 -162047 253183 -63473 71975
19260 127099 61022 43092 72119 133385 67622 -187634 -476513 -295921 -43592 -30587 -374967
19249 -374967 191604 102262 -75526 -211314 -138284 348161 -23648 -108017 -146073 -441230 -76221
19237 68480 69167 -381954 316682 351134 54671 -1633 -90996 203957 -347031 346482 114530
19225 -9722 -174310 -75406 277812 -85441 -3505 -76094 263190 184054 -9398 -345406 119336
19213 -1335 326524 60744 -330005 -62240 82908 212667 171871 -202722 423878 67064 128658
19202 128658 39705 16558 -245228 -62939 11189 -387011 86103 -94914 -48033 -286281 86608
19190 110488 -156495 312010 187627 -231363 -160265 -116454 -148988 74113 21662 -245329
19179A03666h8507B2419L15222c76395J61413Q1647e6857j21919f9096j23856
19169a92952j94753h2610I5505O4432c34151F1242L5225a45618j64035M2695c1218
19157g1707k64610a57633P1354n578d2772r5241j693J4155a3187k1343R550B41622
19144h786C3498a28566l30213K07941R6889e0654G2353J32655F0072g7398q2295
19133a59693a7797j21189A65979e083A15999B4982b00767K938B20960b59795H2626
19121A11537a17974D4917b00313k4788J772P7763f3402D30277a08263A32060g3672
19109A9107b37551I292a45179e042G8081F289c97528A62395a93275g2607k7397
19098a00004L1181b5506B11627g1799j22388a5554p442r0000B48762b9590A99900
$$ plain form
19179 103666 -88507 22419 337641 -376395 -214982 -133335 -56857 -178776 -69096 -192952
19169 -192952 -387705 -82610 95505 159937 -334151 61242 96467 -145618 -309653 -266958 -31218
19157 -71707 -336317 -157633 -86279 -91857 -42772 -138013 -139706 -125551 -13187 -34530 -24980 241622
19144 -8786 33498 -128566 -458779 -250838 -153949 -50654 72353 205008 60072 -77398 -159693
19133 -159693 -17797 -138986 165979 -5083 115999 24982 -200767 -197829 220960 -259795 82626
19121 111537 -117974 44917 -200313 -225101 -223329 -145566 -63402 430277 -108263 132060 -73672
19109 19107 -237551 9292 -145179 -5042 78081 6289 -397528 162395 -193275 -72607 -100004
19098 -100004 -68823 -25506 211627 -71799 -194187 -15554 -22996 -112996 248762 -29590 199900
19086d9083B03331D4458J319b31089I5202L5762g1872B9992J5320c90646J72855
19075b17791F7405a92295R4395L9183n3015g552j11561m4701j47800J28696C7507
19063b86500D4946a90651k17875b00050b7474j20620J1826q9687K8749A2406O4531
19052G6937a57838j94042A6625L0099f7745D9222P7154a95094K5716h0207m8782
19041a28989B99743d8046o2810B21800c38976d8545C7927a37999F5475R4250a34565
19029a54111O0780A89547J7763A9535c6214m1747A94787C486K1551b8591A9562
19017D5297K69357A9680J62637b34770k888K2962f3746K9414A26835J07655b09893
19005b40338M9423A59752K33569c4546k90664B23364G983L4126b41692K1005C3693
$$ plain form
19086 -49083 203331 44458 45777 -231089 95202 130964 -71872 29992 45312 -390646 -217791
19075 -217791 67405 -192295 -97900 -58717 -111732 -7552 -119113 -163814 -311614 -182918 37507
19063 -286500 44946 -190651 -408526 -200050 -27474 -148094 -136268 -225955 -197206 12406 76937
19052 76937 -157838 -351880 16625 46724 -67745 49222 126376 -195094 -169378 -80207 -128989
19041 -128989 299743 -48046 -110856 221800 -338976 -48545 37927 -137999 65475 159725 -134565
19029 -154111 -93331 189547 207310 19535 -36214 -77961 194787 3486 25037 -28591 19562
19017 45297 314654 19680 182317 -234770 -237658 -214696 -63746 -34332 126835 234490 -209893
19005 -240338 -190915 159752 393321 -34546 -325210 223364 7983 42109 -241692 -220687 33693
18993a7160j78713B06901B6358N8698l8039b41525j1219e5734k95181C54514b89350
18981G3043M36080b41889A09001c9970G1747c90188D5552b3899k17149j27196
18971c68244a11763B96742e0j89223b1943B1028i2849B13086C2637o956a2955
18959A66851G1641J39671a57958P1378J2043j04841k9266g3050C4654J99231r0228
18948A43657b78897F4204d6459N663P115m3568P392D3033g026j13075i52l85403
18936c86355a61958i450n52226g2852C52589b39021a301p9186k0200A2615R8608
18925A11223a44257E7784M9556E2762a07839K4661k04112m134J23018B9662D926
18913e5475K0524j87458k5703Q9855g2768P845o5446B64997b81629I6515N9458
$$ plain form
18993 -17160 -195873 206901 26358 85056 47017 -241525 -252744 -55734 -350915 354514 -289350
18981 73043 509123 -241889 109001 -39970 71747 -390188 45552 -23899 -241048 -368244
18971 -368244 -111763 296742 -50 -189273 -21943 21028 -92849 213086 32637 25681 -12955
18959 166851 71641 211312 -157958 -86580 -74537 -179378 -208644 -73050 34654 233885 143657
18948 143657 -278897 64204 -46459 -40796 -33681 -77249 -69857 43033 -7026 -120101 -952 -386355
18936 -386355 -161958 -9450 -561676 -72852 352589 -239021 -1301 -80487 -100687 12615 111223
18925 111223 -144257 57784 107340 52762 -107839 -83178 -287290 -291424 -168406 29662 4926
18913 -55475 -34951 -222409 -248112 -158257 -72768 -64923 -130369 264997 -281629 96515 155973
18902A55973J16521H8770h943k08592g5296G1434a5990I0095g2845l5088p8785
18891a86718M0559B23121M1455H985M10509b77493F0674L30188c1000j53979f938
18879b1877A51290o2022h3416A27893j9685b48004N2243A61407d3276m7041j02407
18868a92724f9603q7670B94212a04872n7945E2843L521K66854a00423A39904n1168
18857H8736R1302c28517R8743a12413n1810A99384J8564q2100a34485c0145m3215
18846g3360A90676b91137a4879j45116B15680A3079Q2564N4636i4984G796g9670
18834A29179b5320A88786b55591k14257a21300l38652a65226A42285b65666b7443
18823a14029A27398c1341p1105A6183K17923K7356K5312C3612N0675N2263o0601
$$ plain form
18902 155973 272494 88770 -8943 -217535 -75296 71434 -15990 90095 -72845 -107933 -186718
18891 -186718 -146159 223121 264576 8985 419494 -277493 60674 390862 -31000 -184979 -6938
18879 -21877 151290 89268 -83416 127893 108208 -248004 -195761 161407 -43276 -90317 -192724
18868 -192724 -69603 -157273 294212 -104872 -162817 52843 56364 323218 -100423 139904 88736
18857 88736 180038 -328517 -229774 -112413 -164223 199384 217948 135848 -134485 -30145 -73360
18846 -73360 190676 -291137 -14879 -159995 215680 13079 95643 150279 -94984 7796 -79670
18834 129179 -25320 188786 -255591 -469848 -121300 -459952 -165226 142285 -265666 -27443
18823 -114029 127398 -31341 -102446 16183 234106 261462 286774 33612 84287 136550 75949
18812G5949c03256A37852L9593M55351A11338L1604K8649a56359O5253A5884j446
18801A4438h2185I3625J69286a89674B48449p1208j7398p172a73864I546a43669
18789b92441J39836m088m4117N3743B8771P6045b34901c5644B7571h5308B20657
18777c46695a1986j8636j23922j63264J57211I1545e6547A45649N7979a82557
18766A01625a71621c7185l135A98131G916c14390l44660B34307d5362k02758R0676
18755a57444C6995a58447g7046K4679Q247l85172J78304P9079I8440a89099C2131
18743A07902b0288l48059B16538a279m690H3421J77681a1647A18800c9252q2904
18732a22156j02828n2863F469N0673Q79b72098a20367j4359K1261A29331i6138
$$ plain form
18812 75949 -303256 137852 177445 632796 111338 142942 171591 -156359 -91106 15884 14438
18801 14438 -82185 93625 262911 -189674 248449 177241 159843 152671 -173864 9546 -143669
18789 -292441 -152605 -156693 -200810 -147067 28771 104816 -234901 -35644 27571 -85308 220657
18777 -346695 -11986 -30622 -154544 -317808 -160597 91545 -56547 145649 203628 -182557
18766 101625 -171621 -37185 -40320 198131 7916 -314390 -659050 234307 -45362 -248120 -157444
18755 -157444 36995 -158447 -77046 -52367 -44120 -429292 -250988 -171909 98440 -189099 32131
18743 107902 -20288 -368347 216538 -1279 -5969 83421 261102 -11647 118800 -39252 -122156
18732 -122156 -224984 -277847 6469 57142 58021 -272098 -120367 -134726 -113465 129331 -96138
18720g9512E3550c5487H249a00514L4096B39769a25798B4139a53784G5555a53249
18708C0082E333a33597k3739b1723B04510b18249F1764L6544g6528n4250A05076
18696b04470E7381b5081B6402N6284b6895H865a54439a3647A64626b66140L280
18685b62860D1040e1412j08318d2479b634B02962g2296B80308a76515f4353j57826
18674b22179h4707j19634j54260M2591A14051f2111o480j28303h310j58174A03716
18662a704A60304E564J19318B5551J61880a93589A09661a66335j21434J12962
18652a74807a5591g61A48240b24026A3986J15209a77491A19009k4327M3158b25660
18640B01119a51609r836j47487J41072B00967a74850D943P6714k3819c95414I7550
$$ plain form
18720 -79512 53550 -35487 8249 -100514 -66418 239769 -125798 24139 -153784 75555 -153249
18708 30082 5333 -133597 -157336 -21723 204510 -218249 61764 98308 -76528 -130778 105076
18696 -204470 57381 -25081 26402 82686 -26895 8865 -154439 -13647 164626 -266140 -262860
18685 -262860 41040 -51412 -159730 -42479 -2634 202962 -72296 280308 -176515 -64353 -222179
18674 -222179 -84707 -204341 -358601 -316010 114051 -62111 -68591 -196894 -8310 -166484 103716
18662 -1704 160304 5564 124882 25551 187431 -193589 109661 -166335 -287769 -174807
18652 -174807 -15591 -761 148240 -224026 13986 129195 -177491 119009 94682 137840 -225660
18640 201119 -151609 -161445 -308932 -167860 200967 -174850 4943 81657 57838 -395414 97550
18628b5180l49793A41450a81005K0324E0497a7899l990B22877q1763a90926N8888
18617a32038N8840E0631j9480e4249k5222C4028a88813H3646C6970c21515K4173
18606b97342A07560J54489I6710J06230G4321B0221J53681d4273r4750l46411
18596d85434K27275l0535j0361Q2432A21435J5425b19352A07330k7563a01638
18585a63644l56836D7501g5576j81035B56414e15549a1538j69701O3420B70365
18574A72467D3280f8184A8093e1332n6352A03406a95754B35103E7744A8249M0979
18563E9228a2065A97421D5464h6832E4117e2596A79532a27968A82200c4805a0017
18551b57178Q6957B15066b60812H1514J5870Q0590a70560n3979a2909F300J23638
$$ plain form
18628 -25180 -374973 141450 -181005 -160681 50497 -17899 -21889 222877 141114 -190926 -132038
18617 -132038 -73198 50631 31151 -54249 -79471 34028 -188813 83646 36970 -321515 -297342
18606 -297342 107560 262049 96710 202940 74321 20221 173902 -44273 -139023 -485434
18596 -485434 -258159 -288694 -299055 -216623 121435 136860 -219352 107330 79767 -101638
18585 -163644 -520480 47501 -75576 -256611 256414 -515549 -11538 -181239 -117819 270365
18574 172467 43280 -68184 18093 -51332 -107684 103406 -195754 235103 57744 18249 59228
18563 59228 -12065 197421 45464 -86832 54117 -52596 179532 -127968 182200 -34805 -10017
18551 -257178 -170221 215066 -260812 81514 97384 177974 -170560 -224539 -12909 6300 129938
18540A29938b3005d497k59546d2133F5410M3021H130f9411A10759E1943a30939
18528a18491p3605G724b75062J17388l02402E1125a16886G8198g6355A20985R9652
18517B20637b9968H6671L033j7293J5872c37358e1245G5298a60294b5730n2619
18506g8349B18271c66745I5025d6782C8461J2349a06105n833A3355b56236A84977
18494b48896D31737d5634J5439A45042a08125j32357E1169a39243k4268B50645
18483C34093f7723j19498E3617a09605b5151o7081r3401f5147B20201d4369C7517
18471F6096a88023A44442c71884g0715j12841g2869B8948c4474D5736a56067O6522
18460h9545b9548l9287D83697a23169C2918b71581C19382j36213b39867d1083
$$ plain form
18540 129938 -23005 -4497 -264043 -42133 65410 108431 8130 -69411 110759 51943 -130939
18528 -118491 -192096 7724 -275062 -157674 -460076 51125 -116886 78198 -76355 120985 220637
18517 220637 -29968 86671 89704 72411 88283 -337358 -51245 75298 -160294 -25730 -78349
18506 -78349 218271 -366745 95025 -46782 38461 50810 -106105 -111938 13355 -256236 184977
18494 -248896 431737 -45634 -30195 145042 -108125 -240482 51169 -139243 -163511 250645
18483 334093 -67723 -187221 53617 -109605 -25151 -92232 -185633 -65147 220201 -44369 37517
18471 66096 -188023 144442 -371884 -70715 -183556 -72869 28948 -34474 45736 -156067 -89545
18460 -89545 -29548 -68835 483697 -123169 32918 -271581 319382 183169 -239867 -41083
18449E953a47188a4367B6167K5176a76071j41294a6427H2336i2781o5004j53797
18438c11582i6779H4045b01039C73270C2457d1477k374A25818O4547a54094g6147
18426b47262M1467f0629j32186H5687a1843M58k82278b3773r4000j19984A00069
18414h4600r1871d9533j58368M2005A06951m3949N0780b7790A06207a09383E3308
18402a6806B32892G8488J2881a64208B87429a4227A10733K2769a35943c45k09556
18391b09901G1161k4580J97339B9854J38204a1175G3048i6603E2707g4868b0394
18379A32720a8577j5030A9471d52112a55225B4730b7125n1977k01816h292j25579
18368a33871F8034O4978a319I8139a90090B86445a02044D7061J6205c66627J42436
$$ plain form
18449 5953 -147188 -14367 26167 51343 -176071 -317365 -16427 82336 -92781 -157785 -311582
18438 -311582 -96779 84045 -201039 373270 32457 -41477 -43851 125818 190365 -154094 -76147
18426 -247262 -205795 -60629 -192815 85687 -11843 -11385 -293663 -23773 -117773 -237757 100069
18414 -84600 -176471 -49533 -207901 -165896 106951 63002 113782 -27790 106207 -109383 53308
18402 -16806 232892 78488 91369 -164208 287429 -14227 110733 133502 -135943 -345 -209901
18391 -209901 71161 46581 243920 29854 168058 -11175 73048 -96603 52707 -74868 -20394
18379 132720 -18577 -33607 19471 -452112 -155225 24730 -27125 -79102 -280918 -8292 -133871
18368 -133871 68034 133012 -1319 98139 -190090 286445 -102044 47061 63266 -366627 -224191
18357b24191B41373H9868J9803d225j10474F3225N1832a18005b2852B01336f6082
18345i9642m7692G53d6272D13720g2335A9263b13702A3218c64113a39586c1686
18333f2417K5216G3998a85699E2054b73208g1119K1613l9606E6950P8431n4000
18322H1381L3204D7331A8163c34149A01087b24807J10743j4318a9816k80001A48355
18310B70075e0361g233F1632J14901K24345I8047R9560e4054I0959c22551b3148
18298b6639A34572i8963B70306i560p0994j73660i7021A33477J1145b84679A77612
18286A7229J6009h2759a3291A67328P364a35398k33238J19349e9366b0689H3319
18274b07081E9586b19226Q7728I645M305O6633K1909b46161O9882M4858m6097
$$ plain form
18357 -224191 241373 89868 109671 -4225 -114699 63225 115057 -118005 -22852 201336 -66082
18345 -99642 -147334 753 -46272 413720 -72335 19263 -213702 13218 -364113 -139586 -31686
18333 -62417 -37201 73998 -185699 52054 -273208 -71119 -49506 -89112 56950 135381 81381
18322 81381 114585 47331 18163 -334149 101087 -224807 -114064 -128382 -19816 -299817 148355
18310 270075 -50361 -7233 61632 176533 400878 98047 197607 -54054 90959 -322551 -23148
18298 -26639 134572 -98963 270306 -9560 -80554 -254214 -97021 133477 144622 -284679 177612
18286 17229 33238 -82759 -13291 167328 174692 -135398 -368636 -249287 -59366 -20689 83319
18274 -207081 59586 -219226 -131498 9645 13950 80583 102492 -246161 -176279 -131421 -177518
18263a77518g5287j02231b6992j03299j48611K3412a0529l04949a3178l4192k93921
18252c41291C72265d93086E1563m061e5879D3904B387b34006B0261d4118p9228
18241a23346j23480l0423A80523i7617j9922E8806b77717A56927o5758B1397K44261
18230B65658B5144N8257l4200c4136n6366I0252I455b33415d123C7403P9952O7245
18218A84600a53112f2983B15991b9k22776N3364k303J8950A67058H0418l0105
18207E0313b37071B59504P1122a71392r2292R0855f7561H1794L6158g5067j80990
18196b56057C00951a89867A56651a60914g1663E6060J20646b57962B9669b50675
18185C83313C5204b5677r7391C57619a32531K6348K3914b6606m0887r5249F6998
$$ plain form
18263 -177518 -75287 -177518 -26992 -130291 -278902 -255490 -10529 -315478 -13178 -47370 -341291
18252 -341291 372265 -493086 51563 47502 -55879 43904 2387 -234006 20261 -44118 -123346
18241 -123346 -246826 -277249 180523 -97617 -117539 58806 -277717 156927 91169 21397 265658
18230 265658 25144 83401 49201 -34136 -90502 90252 9455 -233415 -4123 37403 117355 184600
18218 184600 -153112 -62983 215991 -29 -222805 -169441 -171744 -152794 167058 80418 50313
18207 50313 -237071 259504 330626 -171392 -263684 -172829 -67561 81794 117952 -75067 -256057
18196 -256057 300951 -189867 156651 -160914 -71663 56060 176706 -257962 29669 -250675
18185 383313 35204 -25677 -123068 357619 -132531 -106183 -82269 -26606 -67493 -162742 66998
18173a26005A82692h4396J0407k6520k99938A28910a47125A11509a11344L7750
18163g3594R256C8945J68654a37348L534A68903m2718O4161J30455c08618e7288
18151F4963I737c17001f2848o6074q5151o9300i0066B97057b22687A86072g1862
18139b04806D9125g7392A51829A6899c18617F0790M1620c24311J30379A31400
18128C7945h2854n4307q7396D8545j9399K4327a18752A42991e9561j52087K8904
18117a82744r8567C8260b52089E0206J80705A605c5938B1675a59489A95762D6028
18105a39294j7404A2328J1553B269a5376o1272L659j52286K8927B78271m784c9892
18092d39457a66638p1435J08559C4721O9608i1301L9375a7357l9019F0870P0699
$$ plain form
18173 -126005 182692 -84396 -73989 -100509 -400447 128910 -147125 111509 -111344 -73594
18163 -73594 -64338 38945 207599 -137348 -133814 168903 126185 190346 320801 -308618 -57288
18151 64963 9737 -317001 -62848 -128922 -214073 -283373 -90066 297057 -222687 186072 -71862
18139 -204806 49125 -77392 151829 16899 -318617 60790 102410 -324311 -193932 131400
18128 37945 -82854 -137161 -224557 48545 29146 53473 -118752 142991 -59561 -211648 -182744
18117 -182744 -281311 38260 -252089 50206 230911 1605 -35938 21675 -159489 195762 46028
18105 -139294 -156698 12328 23881 2269 -15376 -76648 -72989 -225275 -196348 278271 273487 -39892
18092 -439457 -166638 -238073 -129514 34721 104329 -91301 -51926 -17357 -56376 60870 131569
18081A31569e8606j35272k47727J42914g9693A35448a32202A6333K05842A6639
18070g6606B19689a80869A63141m0535L18430D0754a95210B11209R3916c83392
18059G169O849E946b23489a01387B05880k4336e7245m0992o1573a6674l9311B07759
18046A33267d7496A23190b32928D2974J73605b09134B00190b78187A89280G581
18035a6038o9197G0474C4388g1801o2378A03196M0734A2214a13595F6325P4520
18024A40845a02440b1759j39838c5041B74938c633k5209A68850D8800d46205b00569
18012a49478j0394O9693j97060J41464E6726a88970Q1869A06582i6173p5318j3999
18001a85490f7643j77074h5456j40369K3362g3556A73052e6481A64814c6999j23323
$$ plain form
18081 131569 -58606 -193878 -441605 -298691 -79693 135448 -132202 16333 222175 16639
18070 -76606 219689 -180869 163141 122606 441036 40754 -195210 211209 305125 -383392
18059 7169 14018 5946 -223489 -101387 205880 181544 -57245 -98237 -159810 -16674 -55985 207759
18046 133267 -47496 123190 -232928 42974 216579 -209134 200190 -278187 189280 7581
18035 -16038 -85235 70474 34388 -71801 -134179 103196 143930 12214 -113595 66325 140845
18024 140845 -102440 -21759 -161597 -35041 274938 -3633 -28842 168850 48800 -446205 -200569
18012 -149478 -159872 -90179 -287239 -145775 56726 -188970 -107101 106582 -96173 -171491 -185490
18001 -185490 -67643 -244717 -85456 -225825 -202463 -73556 173052 -56481 164814 -36999 -160322
17990a60322l9929l6484B2038c07747c262I8659b9213B5873R5873l9523h5837
17978f3943A12938c24761D1083a88702o3511A30410D8184b0203k5274A04161O7514
17967A71675b88222A59811G0388a496j168A23493N0041E9350J64126b1303A31474
17955e3312m2995C0398a22858j19578G5400b13244P1599d6858p910m6067q6748
17944a87583C3299a14997A74819g07E4339J53867p2123j9506N453C5610K9907
17933F5517b45580c0861j11948A02697R9822k9624a30541j24233i2456j11372
17923b03828A80808b08227A8429a19200A1875J60427g4249j54074d8404n5293
17913a03697d0582j99332C30578a85678h4548E6817f051A26302D0546P1525c43110
$$ plain form
17990 -160322 -200251 -236735 22038 -307747 -3262 98659 -29213 25873 121746 82223 -85837
17978 -63943 112938 -324761 41083 -188702 -252213 130410 48184 -20203 -45477 104161 171675
17967 171675 -288222 159811 70388 -1496 -2664 123493 173534 59350 223476 -21303 131474
17955 -53312 -96307 30398 -122858 -242436 75400 -213244 -141645 -46858 -54768 -100835 -187583
17944 -187583 33299 -114997 174819 -707 54339 208206 136083 116577 122030 35610 65517
17933 65517 -245580 -30861 -142809 102697 202519 172895 -130541 -254774 -92456 -203828
17923 -203828 180808 -208227 18429 -119200 11875 172302 -74249 -228323 -48404 -103697
17913 -103697 -40582 -239914 330578 -185678 -84548 56817 -6051 126302 40546 112071 -343110
17901c5264D3131a05542n527j8896D1638N3892K49101C1816J25026a10735D64526
17889A06081c15496g4129A80027c5323B33882a48183d3532l4572A46601e1010
17878i1231A21255a44825N8158A33734a87949b8707A40234g6771l26642a08689
17867A43896n0436A5617K1466a20933C9530L6835l6922J75750I2941b20815b7574
17855c6714o4237G0396i6438F0051c9944j63475H0243c7275B74034q9490F8280
17843F7511a48810B10809a4714F593O4267a03730A13367g8878A67465J93330a525
17831a21196B13867K4544D6479Q4455d3986G1630C4512f6111B0292K56358e943
17819D6839K83287I8958N4880a65680a1403H8462a26882A39361f1320b2165H7906
$$ plain form
17901 -35264 43131 -105542 -111069 -129965 41638 95530 344631 31816 156842 -110735 464526
17889 106081 -315496 -74129 180027 -35323 233882 -148183 -43532 -78104 146601 -51010
17878 -91231 121255 -144825 -86667 133734 -187949 -28707 140234 -76771 -403413 -108689
17867 143896 93460 15617 37083 -120933 39530 76365 39443 215193 92941 -220815 -27574
17855 -36714 -100951 70396 -96438 60051 -39944 -203419 80243 -37275 274034 184544 68280
17843 67511 -148810 210809 -14714 6593 70860 -103730 113367 -78878 167465 360795 -1525
17831 -121196 213867 238411 46479 130934 -43986 71630 34512 -66111 20292 276650 -5943
17819 46839 330126 98958 153838 -165680 -11403 88462 -126882 139361 -61320 -22165 87906
17807a14654B3287a18438B89372d2378A53312l1517J37528A14293A4680a37884
17796B34341A11241C3463n098R2904K9626b82490A21465i4675p6728b5705j18151
17785a43856A96417m3234L3401L818C0789b66866K6606i6457m7115B81058a95773
17773I6358B9760J27042b55573e9924A53991c47090a67713m7225H3764f9462B52067
17761H1337a16864j45445R1107B09122a14491A20487a49875d0777A77071a05693
17750B4976f4118m2782A9208J99746M7453A7589K4957b8662j07772c320k43887
17739b47207B0661J31146a84878B36965j15387A0478h0516E46J44094J03302p1057
17728A76885b3085i066m9769B837K10369a85090M9493A78124f0176k7836j2433
$$ plain form
17807 -114654 23287 -118438 289372 -42378 153312 121795 259323 114293 14680 -137884
17796 234341 111241 33463 28365 121269 150895 -282490 121465 -94675 -171403 -25705 -143856
17785 -143856 196417 153183 186584 190402 30789 -266866 -240260 -96457 -143572 281058 -195773
17773 96358 29760 156802 -255573 -59924 153991 -347090 -167713 -214938 83764 -69462 252067
17761 81337 -116864 -262309 -171202 209122 -114491 120487 -149875 -40777 177071 -105693
17750 24976 -64118 -106900 19208 218954 266407 17589 42546 -28662 -136434 -3320 -247207
17739 -247207 20661 151807 -184878 236965 121578 10478 -80516 546 144640 247942 176885
17728 176885 -23085 -9066 -58835 2837 213206 -185090 -135597 178124 -60176 -88012 -100445
17717a00445d8477l26956J80521b1174A19354M6868h0798G9498O2609b17915D9701
17705G3033h0812A25489J18320m1430c73794e6610f211A55432f0189b6021I3184
17693D9138J11183e8259C21928K6749A58543a17560M9274D06795E226a15336B27514
17681A8254J53416a82028e3232A37054b9531A41749l403f0796l3311m2874a7690
17669b83387J36086c1387o6318A78097m0566b74108A32940L74090f4326A80750
17658c6934H9533J59329A23960e2402H0857K92914b65522j5357a2805k89358F0213
17646A73580q646D0199e951j58234D0309a57571A22848J34004d8827B35318i1736
17634E9569P547c9385B24917a20510B39689e0858C02651A03411b371j8511A96267
$$ plain form
17717 -100445 -48477 -375433 -194912 -21174 119354 166222 -80798 79498 142107 -217915 49701
17705 73033 -80812 125489 243809 202379 -373794 -56610 -6211 155432 -60189 -26021 93184
17693 49138 160321 -58259 321928 348677 158543 -117560 -68286 406795 5226 -115336 227514
17681 18254 171670 -182028 -53232 137054 -29531 141749 138346 -60796 -94107 -136981 -17690
17669 -283387 -147301 -31387 -97705 178097 137531 -274108 132940 507030 -64326 180750
17658 -36934 89533 248862 123960 -52402 80857 373771 -265522 -280879 -12805 -302163 60213
17646 173580 164934 40199 -5951 -164185 40309 -157571 122848 256852 -48827 235318 -91736
17634 59569 67116 -39385 224917 -120510 239689 -50858 302651 103411 -2371 -20882 196267
17622a84609e0472A79014A4399a93846M5410A05525K2673d2859F2561f5789H5282
17610A10287k7462B8276J62972b13832F8547m249a5979j73278C46585a53456j037
17599a54493A24970c10795a1862k9425l16701e4118F554f9396k8448A41633c00344
17587a36657l557B662a00771A8090N4900K9531O2668N7847e021C09987a95248
17575b34156R578B6793a58915O6535o4742f1695p583j42727A83047c4966A76901
17563B8793J80348o2247k4566J09620j07177K3212J35719a21730G4565J69190
17553B43755B6957e3414m38479A19319E7469a35789b511k24306A43915a40017
17542E9066a13162k0304I5023i7584B16619a53766B09635A02349l7635a77812
$$ plain form
17622 -184609 -50472 179014 14399 -193846 -148436 105525 128198 -42859 62561 -65789 85282
17610 110287 82825 28276 191248 -213832 68547 64298 -15979 -189257 346585 -153456 -154493
17599 -154493 124970 -310795 -11862 -41287 -357988 -54118 6554 -69396 -97844 141633 -300344
17587 -136657 -140214 2662 -100771 18090 72990 102521 165189 223036 -5021 309987 -195248
17575 -234156 -224578 26793 -158915 -92380 -157122 -61695 -69278 -212005 183047 -34966 176901
17563 28793 209141 146894 122328 231948 124771 147983 283702 -121730 74565 243755
17553 243755 26957 -53414 -491893 119319 57469 -135789 -2511 -226817 143915 -140017
17542 59066 -113162 -133466 95023 -97584 216619 -153766 209635 102349 64714 -177812
17531g4325C8363K90696A02057J14642p8245E9080J24170K86657I3071P5337R8813
17520B67221F4789a90044F0014L9853b37910I8330j6988Q3138n077c045B41701
17508a42535E4802a78402A61643c0367J3058p9882A55963m7749K55434A1366K65051
17497B76417b9462B86485G0754J37606D9610M0022K20762B2672P6927J65259j4173
17486B50685o7644M381k0425A6789L91273A06124B7555M76209i6499B9856J05871
17475A35727J69037K337b51865B76625A30258C2954N6680K5714Q1357J02594i4032
17463A05200L13393o2900E9946K07286C8171e0714J104B60076I2297N1740K79147
17452D23184j18962K83843j39063p0709I4598J50415A2086J72177J2834K69793
$$ plain form
17531 -74325 38363 329059 102057 216699 138454 59080 183250 469907 93071 168408 267221
17520 267221 64789 -190044 60014 99867 -237910 98330 81342 164480 159403 -3045 241701
17508 -142535 54802 -178402 161643 -30367 -17309 -97191 155963 108214 363648 11366 276417
17497 276417 -29462 286485 70754 208360 49610 89632 310394 22672 99599 264858 250685
17486 250685 183041 187422 166997 16789 408062 106124 27555 503764 -96499 29856 135727
17475 135727 304764 307101 -251865 276625 130258 32954 89634 115348 196705 299299 -94032
17463 105200 418593 355693 59946 267232 38171 -50714 -49610 260076 92297 144037 423184
17452 423184 304222 588065 449002 378293 94598 245013 12086 184263 197097 466890
17442D66890A31232o0683L62815A81747P2036O9235O9430J215E6439J34149N5721
17431B46309H9186P4790M30638A61437F7129J23837j6220M06464B3343g9298B53798
17419b6985A24884K13781j26604j6758G1609R3671N23251A87822F2614C731K29121
17408B32852F198K21275F0594b4381j5065A87531A6337N7344J39679n0476C2579
17396A03212M3823J47449O6258k8214o9130l5707a15191B49335K12140d5427D2705
17384C80944a14521A32067d6831C10966e810B15239L795h6278D66933B02466k3355
17373A79111O1698H4420B0749K09347r422A07060i1775n1479e945A42023O677
17362A48700C2562M58633a5032B59108O332j3505j08536o7216F764P3260a46255
$$ plain form
17442 466890 131232 70549 433364 181747 253783 323018 392448 393663 56439 190588 246309
17431 246309 89186 163976 594614 161437 67129 190966 174746 581210 23343 -79298 253798
17419 -26985 124884 338665 212061 195303 71609 165280 688531 187822 62614 3731 232852
17408 232852 6198 227473 60594 -24381 -39446 187531 16337 73681 213360 162884 32579
17396 103212 147035 294484 360742 332528 263398 227691 -115191 249335 461475 -45427 42705
17384 380944 -114521 132067 -46831 310966 -5810 215239 219034 -86278 466933 202466 179111
17373 179111 240809 84420 20749 230096 220674 107060 -91775 -143254 -5945 142023 148700
17362 148700 32562 491195 -15032 259108 265440 251935 143399 76183 6764 80024 -146255
17350a79172B68301A17353O0726a02014J767a9945k7149G675J76064q0319O177
17339A09597K10343j5771a20153A75973C9710J26734M343P025F1599j8607Q1035
17328A24027a8882A21541J14213J1741o4329M7632H1457J61931C3563d9916E0623
17316C09283A30330R9188B3037O6503J86026l5844R8135d0593G0102N197J58170
17305B33469F9817J66326J06415k1038A6536O2269j0265J32707J57662a85136
17294C7428J417d5436B95583b11366B03480J25334j33662H9851N283J82605r2045
17283A85694J99238A15603K86134C320P007a27103E7803L95105h8597b9568C14690
17271A59273A8355J64611L41041B4077J17574j976k780R1198A6897K47439L1a51614
$$ plain form
17350 -179172 268301 117353 178079 -102014 -100247 -19945 -47094 7675 183739 103420 109597
17339 109597 319940 304169 -120153 175973 39710 166444 170787 177812 61599 42992 124027
17328 124027 -18882 121541 235754 247495 183166 230798 81457 243388 33563 -49916 50623
17316 309283 130330 229518 23037 89540 275566 239722 337857 -40593 70102 75299 233469
17305 233469 69817 236143 342558 321520 16536 78805 68540 201247 358909 -185136
17294 37428 38845 -45436 295583 -211366 203480 328814 195152 89851 95134 277739 185694
17283 185694 384932 115603 401737 3320 10327 -127103 57803 452908 -88597 -29568 314690
17271 159273 18355 182966 524007 24077 141651 139675 136895 228093 16897 264336 264367 -151614
17258b54348b5222A24L50305e5937C06684j4237A24439K33925b02837B86734j08762
17247A77972L35924B2055J9315J66500J66280q0222G3432J93390l7199I6337c395
17235A3409J97012c6650o8095A07778N565J12484a26059B03170J69432A21917
17224a0771B64553K51007k02397A50237C5500R2025P151J8378J81960E8523j0984
17213D7539K30742R8080G2008K23519r9971j1141l5920e636F08045q0821j07326
17202D19898o3866j54850K21118G8953O7628J26567A11330P0377J03165i1778
17191G879N60648a29792A98406A9713a415C56942j51818J89320J20200C6016L28295
17180C64311a12159J4109B58056q9094Q4997l4967a28637C34493j53681q8981
$$ plain form
17258 -254348 -25222 124 350429 -55937 306684 292447 124439 358364 -202837 286734 177972
17247 177972 513896 22055 41370 207870 374150 293928 73432 266822 229623 96337 -3395
17235 13409 210421 -36650 -104745 107778 113343 225827 -126059 203170 372602 121917
17224 -10771 264553 515560 313163 150237 35500 127525 134676 153054 335014 58523 47539
17213 47539 278281 376361 72008 295527 195556 184415 148495 -5636 608045 527224 419898
17202 419898 356032 201182 422300 78953 146581 273148 111330 181707 284872 -91778
17191 7879 568527 -129792 198406 19713 -1415 356942 205124 394444 514644 36016 364311
17180 364311 -112159 -98050 258056 168962 253959 218992 -128637 334493 180812 91831
17170I1831L34901o7142J05598c2980D13999J1986A7535Q6373K68623G7556K09188
17159B86744K83938B53301k6395K41625m7647E7166J76190j00496E9537J68625
17149B28162o0396M2813O3634J00093E8974M24088L5119p0703H4476K27285j10419
17138B01342f630C36467A28161J88160L2402J96900A67490A0011K83227j08791
17128A84447M6426J86366K7999j49357b38109A94415J20559b8578B34428D3509
17117A18482L39127A47356K92044j72860Q2492A43989i6927A20689J14931K85273
17107E20893j60226a08265D75022m2411n3632j11301J89806J01184O5147k66503
17097C57312L11826i7875B60429J64656k0653c2883A04784N33199k88060K87000
$$ plain form
17170 91831 426732 359590 465188 -32980 413999 425985 17535 103908 372531 77556 286744
17159 286744 570682 253301 226906 468531 420884 57166 233356 132860 59537 228162
17149 228162 167766 210579 274213 374306 58974 483062 518181 447478 84476 311761 201342
17138 201342 -6630 336467 128161 316321 348723 545623 167490 10011 293238 184447
17128 184447 230873 417239 445238 295881 -238109 194415 314974 -28578 234428 43509
17117 118482 457609 147356 439400 266540 349032 143989 -96927 120689 235620 520893
17107 520893 360667 -108265 475022 432611 378979 267678 457484 558668 623815 357312
17097 357312 669138 -97875 260429 425085 404432 -32883 104784 637983 349923 636923
17087F36923B32942K08798k03836K1707K62482B37742J17683O6804I1226L91000
17077D82226r418m1278j3937J7611A95548K00680O5957J16800j41416P3897A00622
17065E07574K69352B77419r8233K03037J05916I4348J48242J01237k9725A34816
17054D56457J03493A77058C8224M60506R3440l3275K06962k37457j01682A34406
17043E46928o6808J16164o5949j25272J71598j8651J59469k72481M122L1128J76097
17032F56345k38226L18690j13493j77585J89011Q7403k21082M22955A80980L10385
17022D91365K6804R5337R5705p9299O114j93311K47633k45599j89687M34655k22388
17011D67329N52817k97691J87441l31751j79324L30180m9226J25490l57159K1831
$$ plain form
17087 636923 232942 441740 237904 259611 522093 237742 355425 422229 91226 482226
17077 482226 472808 431530 417593 435204 195548 396228 462185 578985 437569 511466 100622
17065 507574 776926 277419 179186 382223 488139 94348 242590 343827 314102 134816
17054 456457 559950 177058 38224 498730 592170 558895 765857 528400 426718 134406
17043 546928 480120 596284 530335 405063 576661 558010 717479 444998 449120 480248 656345
17032 656345 418119 736809 623316 445731 634742 722145 501063 924018 180980 491365
17022 491365 518169 613506 709211 629912 636026 442715 690348 444749 255062 689717 467329
17011 467329 1020146 722455 909896 578145 398821 729001 679775 805265 448106 469937
17001D69937J98965o3223j25599M73370m31697K24435l8468k5738L27484B78732
16990G55405J56925M6864m30884J48441K1845J59256j18444M1088j44534J06004
16980G41966J18769D29357J21721L90086q1625l0461k7783k388K10915l82985
16970F26837K53596O4526l7634j60258K4447J26354J92017l65178P2898n2398
16960G45207j29481J65811J43522L00747n86225J64825M51333k02125j05192J7705
16950I66127r620K91419n17211M63647l2452m12093K29813k5840q5412k68374
16940F00004M26728k99331N00714q6764L6228k43699N8210q7727L03112O692k6913
16929A187254j31237R9676M038L46802K9296m56964N08071k59416l60866M04168
$$ plain form
17001 469937 668902 605679 480080 953450 521753 746188 707720 681982 1009466 278732
16990 755405 912330 959194 528310 676751 698596 857852 739408 780496 635962 741966
16980 741966 860735 429357 551078 941164 859539 829078 801295 798907 1009822 626837
16970 626837 880433 944959 907325 747067 771514 897868 1089885 724707 797605 745207
16960 745207 615726 781537 925059 1225806 639581 804406 1255739 1053614 948422 966127
16950 966127 956507 1247926 730715 1194362 1161910 749817 979630 953790 868378 600004
16940 600004 1026732 727401 1228115 1141351 1177579 933880 992090 904363 1207475 1214167 1187254
16929 1187254 1056017 1155693 1159731 1506533 1535829 1078865 1586936 1327520 966654 1370822
16919A370822l33673N73895o70686M84105k64398M07842l80521o310p2922J82980
16909A291134J35495K9312o2389P3047j0625k16753L01331j4071J1700k76999
16899A261182K28322O4883M8836M7879j25721J08575J68479q8997m16763M69017
16889A765692k48887j04123M39796K1287j33223j4547j60189K50294R2269l26074
16879A582295K88651k24255M81518j08176K14670P3197l36692K75802k18487k02812
16869A825711M44558r4317K78372j80226J19136M1224q2840J81400j85807P0285
16859B417496Q3575q002q426J57364K41883j79734K35713J18457p7862J22987
16849C103451l59864L19008r6619m5261K52365L4182j97698L20662J38095P3698
$$ plain form
16919 1370822 1037149 1611044 940358 1424463 1160065 1567907 1187386 1181076 1108154 1291134
16909 1291134 1426629 1455941 1393552 1466599 1455974 1239221 1540552 1526481 1538181 1261182
16899 1261182 1489504 1554387 1603223 1651102 1525381 1633956 1802435 1713438 1296675 1765692
16889 1765692 1516805 1412682 1852478 1873765 1740542 1725995 1565806 1816100 1908369 1582295
16879 1582295 1870946 1646691 2128209 2020033 2234703 2307900 1971208 2247010 2028523 1825711
16869 1825711 2270269 2175952 2454324 2274098 2393234 2434458 2351618 2533018 2347211 2417496
16859 2417496 2501071 2493069 2484643 2642007 2883890 2704156 2939869 3058326 2980464 3103451
16849 3103451 2743587 3062595 2965976 2920715 3173080 3207262 3009564 3330226 3468321 3542019
16839C542019l12422P9377K73305k90608L54189n9749K87165R2199k33519L93006
16829D124962Q0357k4726j69490J03046J86175k05527K33303N3033K8862J07324
16819D517319M53300k66595M10913j66333m21169N48203o8499L80311K54810r7330
16809E544930L02912n2612j12145O04739K81885m4573J73231K49377L24043j00256
16799G171531J1176K08833L00860L85962l22990M18596M45086j02498M42656M01461
16789I360673J0658J30194L11551J62941M30532K27750K33396N08196J02381L63622
16779A1841894K05416Q21354J52608L71097Q73179J41065N61399O33376J49522
16770A5750910O73139N75087N52093P34680N76420J081612N79157O06256P14539
$$ plain form
16839 3542019 3229597 3308974 3582279 3291671 3645860 3586111 3873276 3965475 3731956 4124962
16829 4124962 4205319 4180593 4011103 4114149 4300324 4094797 4328100 4381133 4409995 4517319
16819 4517319 4970619 4704024 5114937 4948604 4527435 5075638 5007139 5387450 5642260 5544930
16809 5544930 5847842 5795230 5683085 6287824 6569709 6525136 6698367 6947744 7271787 7171531
16799 7171531 7182707 7391540 7692400 8078362 7755372 8173968 8619054 8516556 8959212 9360673
16789 9360673 9371331 9501525 9813076 9976017 10406549 10634299 10867695 11375891 11478272 11841894
16779 11841894 12047310 12868664 13021272 13392369 14265548 14406613 14968012 15601388 15750910
16770 15750910 16424049 16999136 17551229 18285909 18862329 19943941 20523098 21129354 21843893
16761B1843893J000651J173719P43334R80722Q52218J615692J155390J406960
16753C0772579J188833J838302J504718J452048J969191J724301K191810K418727
16745D5060509K225530K915878K060288L007042L620397L253382L808625L576720
16737F9528371M148730M504054M678114N292834N452728N563743O254797O781767
16729A12205138O501853P177632P188442P731615P867749P654548P823736P381276
16721A71531989P220833O922456N329223M941016L582031J798284N04653q70180
16713B00960305k557972m088757n469508o213088p121025p796919p950032q128417
16705A51634587q289572p667540p523051p230071p087383o905469n934094o035156
$$ plain form
16761 21843893 22844544 24018263 24761597 25742319 26594537 28210229 29365619 30772579
16753 30772579 31961412 33799714 35304432 36756480 38725671 40449972 42641782 45060509
16745 45060509 47286039 50201917 52262205 55269247 58889644 62143026 65951651 69528371
16737 69528371 73677101 78181155 82859269 88152103 93604831 99168574 105423371 112205138
16729 112205138 118706991 125884623 133073065 140804680 148672429 156326977 164150713 171531989
16721 171531989 178752822 185675278 191004501 195945517 199527548 201325832 201830485 200960305
16713 200960305 198402333 194313576 188844068 182630980 175509955 167713036 159763004 151634587
16705 151634587 143345015 135677475 128154424 120924353 113836970 106931501 100997407 94962251
16697I4962251n474350n014097m784291m578916m245107l802756l655197l118472
16689F0289065l685241k907832k715989k500496k504039k328849k122546k140259
16681C9383814j705450k041263j902557j013366j633475j289351j556119r82576
16673B7259657j293499j507578j062390q48621p72335q53278m32861j166775j092577
16664A8229743j61236r77721m82832o74951n33490p44303k76586m40663l22643
16655A3615318o89789m24468n42133n00869k23404o09527k8955o84638R9035l47826
16645I662744m94672j718p07449J69490o87769j96776j36158l45072L37371r66592
16635F633399L85358j74579M9877q26830O7707m6443k19143j22418k32492K32638
$$ plain form
16697 94962251 89487901 84473804 79689513 75110597 70865490 67062734 63407537 60289065
16689 60289065 56603824 53695992 50980003 48479507 45975468 43646619 41524073 39383814
16681 39383814 37678364 35637101 33734544 32721178 31087703 29798352 28242233 27259657
16673 27259657 25966158 24458580 23396190 22547569 21775234 20921956 20489095 19322320 18229743
16664 18229743 18068507 17090786 16607954 15933003 15399513 14655210 14378624 13937961 13615318
16655 13615318 12925529 12501061 11958928 11458059 11234655 10625128 10596173 9911535 10010570 9662744
16645 9662744 9168072 9166354 8458905 8628395 7940626 7743850 7607692 7262620 7599991 6633399
16635 6633399 7018757 6844178 6894055 6067225 6134932 6088489 5869346 5746928 5514436 5747074
16625E747074o23814J67381j43922m06990M33094m40354j27508O2995j52420k151
16615D513385k18539L32421l44212m25642l2464k50181L29602J48972p26485K23645
16605C550502q5295j85707J49820p7794j91535j6393j35859k03427K44770J610
16595C050692j26373k67645j36491R7244o1778l7842j01873k10728L78522j51
16585B583577N7200m55887K00701k16432Q8203j63103J28126L68822m86716j19801
16575A984690j5972K07860P995j37347l59872P8515K62725l44540j54630N40298
16565B069722l63468J04881P762j15843m11515O54162l95014l311o8074K74074
16555A753376Q7019j30528n28307M42938m84893M84004l91951J26856K43312m36859
$$ plain form
16625 5747074 5123260 5290641 5146719 4739729 5172823 4732469 4604961 4667956 4515536 4513385
16615 4513385 4294846 4627267 4283055 3857413 3824949 3574768 3904370 4053342 3326857 3550502
16605 3550502 3465207 3279500 3429320 3351526 3159991 3143598 3007739 2804312 3049082 3050692
16595 3050692 2924319 2656674 2520183 2617427 2555649 2517807 2415934 2205206 2583728 2583577
16585 2583577 2640777 2184890 2385591 2169159 2257362 2094259 2222385 2591207 2104491 1984690
16575 1984690 1968718 2176578 2184573 2047226 1687354 1765869 2028594 1684054 1529424 2069722
16565 2069722 1706254 1811135 1818897 1703054 1291539 1945701 1550687 1547376 1479302 1753376
16555 1753376 1840395 1709867 1181560 1624498 1139605 1623609 1231658 1358514 1601826 1164967
16545A164967L34300l77334j56533L22557L462J17712k55136j68688Q0783L13805
16535A379895n21809K46450J60546k42259K20625q6778R781l19466J85423J27634
16525A160042j80514k5000J71732N7557l55784K26841q3175p0659J8952j80607
16515G39385N02352n65307R5396O6917L13565k74453j95940K74126j80902J38956
16505I14095j93610K64510k43125J65313O6469j51428k36182B72677O62006l63420
16495E71263L93756n8304N3582D68377N16298l97351O965N2637M5194j82715J46873
16484F56278r9117j33279K30168m2042j42014K05741N0545j22745k25545M57263
16474H35253o6309J62974D49691J99416L3919J64531p448C63198K88773j45986
$$ plain form
16545 1164967 1499267 1121933 965400 1287957 1291419 1409131 1153995 985307 1066090 1379895
16535 1379895 858086 1104536 1265082 1022823 1243448 1156670 1166451 846985 1032408 1160042
16525 1160042 979528 954528 1126260 1183817 828033 1054874 971699 901040 919992 739385
16515 739385 1241737 676430 771826 838743 1152308 877855 681915 956041 775139 914095
16505 914095 720485 984995 741870 907183 973652 822224 586042 272677 934683 571263
16495 571263 965019 906715 960297 468377 984675 587324 594289 646926 692120 509405 656278
16484 656278 557161 423882 654050 612008 469994 675735 726280 603535 377990 835253
16474 835253 768944 931918 449691 649107 683026 847557 840109 363198 651971 505985
16464E05985J81477j61219J17421B93385L20253R6215B50396J41030o2937L08140
16454F36629m6381j81848q6111O5199J38024N2181J48282B59290J17782L2323
16444D09395J17791j37401J92984B27382L33908L1244M2043j11947k30048J38990
16434D31572A47012M49605B47303L90054O0096I7835K66503K5221r3689N8969
16424C54839J23702J05933a30335B90296A00341Q8389Q0477L68619o1699k58839
16414C17288J11493j4751J41809O4069A35580K18595P963j72216M54625A59861
16403B38733K4528O6639m1164J75943I8453J39869J94284M3389j96857K61953
16393E41091A01259P9818O252K27893A98778J32244a31491A41626K45078j83393
$$ plain form
16464 505985 687462 526243 643664 293385 613638 709853 250396 391426 328489 636629
16454 636629 590248 408400 322289 387488 525512 577693 725975 259290 377072 409395
16444 409395 527186 389785 582769 227382 561290 592534 634577 522630 292582 431572
16434 431572 147012 596617 247303 637357 697453 97835 364338 389559 295870 354839
16424 354839 478541 584474 -130335 290296 100341 188730 269207 637826 576127 317288
16414 317288 428781 414030 555839 619908 135580 354175 362138 189922 644547 159861
16403 238733 263261 329900 288736 464679 98453 238322 432606 475995 279138 541091
16393 541091 101259 181077 187329 415222 198778 331022 -131491 141626 386704 203311
16383B03311K9184a68495C97512F1238O0008j2087K83915L3657J61841j76093
16373D12479j42496q360j5563I3386M01102j55837n1619A23144J54505P4112j44507
16362B07254G6847K82038e4853C35552j00842J5410a86560Q5354L9896E16900
16351a51849G7055b3909B72547j08698L0489K50108J45185O1691B88587j1478
16341B77109j25383a25892N6856B68997j21580F1652a5347A44219l9490D5805
16330B08983A0833J94812D8668P4931L1941h0703B77732A24809N1113J66063A48062
16318a58863I1937Q642L5100b5748B07780g8252A95504H3179f601I9896K50590
16307C50486j67462J7627b18659F4891K64554G2272b48577E7044J48517H5691
$$ plain form
16383 203311 232495 -168495 397512 61238 121246 109159 393074 426731 588572 412479
16373 412479 269983 261623 246060 93386 494488 338651 287032 123144 277649 351761 207254
16362 207254 76847 358885 -54853 335552 234710 250120 -186560 -101206 -61310 516900
16351 -151849 77055 -23909 272547 163849 194338 444446 589631 651322 288587 277109
16341 277109 151726 -125892 -69036 268997 147417 61652 -15347 144219 104729 45805
16330 208983 10833 205645 48668 123599 155540 -80703 277732 124809 175922 341985 148062
16318 -158863 91937 100579 135679 -25748 207780 -78252 195504 83179 -6601 99896 350486
16307 350486 183024 200651 -218659 64891 329445 72272 -248577 57044 205561 85691
16296B11399E8797K7396b35763B32106K9737l7249p6336f5153A48797d0274A92989
16284g0392C00507j01470L8965E4215a5047C17205A11872m748a07389A04869J26828
16273B31697i1600J4018j1198A5512a63028l2675C5943J02538J76650l9814O2323
16262C37640F3292J86695K1343a38494A05717l3443M32603j94094r2134b10797
16251f5294K9990F7305B6507K42764A387P9140M1038J40082b40011A08847L74185
16240D83032A04780J81690H8912a42418A83502a89076B85300M1854b27951g8562
16229b17788A52642d4471k4033A26203A2882h9057B39755A09883K09753j58049
16219A61587m8578a1221A36178f4460C68944a58320A46162k4039D3993b58307
$$ plain form
16296 211399 58797 86193 -235763 232106 261843 224594 148258 -65153 148797 -40274 192989
16284 -70392 300507 199037 238002 54215 -15047 317205 111872 107124 -107389 104869 231697
16273 231697 -91600 -77582 -88780 15512 -163028 -195703 35943 138481 315131 275317 337640
16262 337640 63292 249987 271330 -138494 105717 72274 504877 310783 218649 -210797
16251 -65294 -35304 67305 26507 269271 1387 80527 121565 261647 -240011 108847 483032
16240 483032 104780 286470 88912 -142418 183502 -189076 285300 327154 -227951 -78562
16229 -217788 152642 -44471 -68504 126203 12882 -89057 239755 109883 319636 161587
16219 161587 113009 -11221 136178 -64460 368944 -158320 146162 122123 43993 -258307
16208A06609K91612E3934K7784F009O8160A4394R1597P6163C9373c0820o1997
16197i2817H8355c38669a3456C46997B3263R8775b55005A21041i8187h246A71570
16185A73307a38958l2212j96104A53057R5158d2988B40627b6996j51675N1747
16175a26924J4609o9687O4054a066j99845h9079c0337A69612e5097a3059B66627
16163g3319b571C01213A34090i1712A7857d93117B8190i4983H1026K2378a69270
16151A47895Q4180b77196O812A88042r692a42041c8033A72927a23319N0749m7859
16140a20429A7633K06635c4668A60255c09012a50121A49429a47477C2001F619
16129c8955D95841a55957J9263E0998a06355C81427a54112L5429j31437A13128
$$ plain form
16208 106609 398221 53934 81718 6009 74169 14394 105991 182154 39373 -30820 -92817
16197 -92817 88355 -338669 -13456 346997 23263 122038 -255005 121041 -98187 -8246 171570
16185 173307 -138958 -171170 -367274 153057 248215 -42988 240627 -26996 -178671 -126924
16175 -126924 -112315 -182002 -117948 -1066 -200911 -89079 -30337 169612 -55097 -13059 266627
16163 -73319 -2571 301213 134090 -91712 17857 -493117 28190 -94983 81026 103404 -169270
16151 147895 232075 -277196 -270384 188042 178350 -142041 -38033 172927 -123319 -72570 -120429
16140 -120429 17633 224268 -34668 160255 -309012 -150121 149429 -147477 32001 6619
16129 -38955 495841 -155957 -136694 50998 -106355 381427 -154112 -118683 -250120 113128
16118A37516F0294b5475l3996J7966e680F3693J44389F1714J31993i4684p6930
16107a71614d5781j43003j2601A13196D3540h6296j87569A23547I415a49840a0827
16095a03377C79446d8910j70644o6818J42924j41521m827A37259E8780j4740A5315
16083c599j6999k58769g9707l7957j36769B73752J7578f3463D287J32342l6391
16072A00238a04182j60287H0143b29245F3945a459B67330e4164k55656b5248A41319
16060b01512E9401K9388D1395L31070A53035D3774i2411E9910J83280C4212A2174
16048A27109i0705B56041E7390j9065J1964b04490B3833a64816B71631G3905J73719
16037B47624a31361p4147P1712k9186K2096L8406b0883e533j37879b5072B6175
$$ plain form
16118 137516 60294 -25475 -59471 -41505 -5680 63693 208082 61714 193707 -94684 -171614
16107 -171614 -45781 -188784 -201385 113196 43540 -86296 -273865 123547 9415 -149840 -10827
16095 -103377 379446 -48910 -219554 -286372 -143448 -284969 -289796 137259 58780 44040 15315
16083 -3599 -20598 -279367 -79707 -117664 -254433 273752 291330 -63463 4287 136629 100238
16072 100238 -104182 -264469 80143 -229245 63945 -1459 267330 -54164 -309820 -25248 141319
16060 -201512 59401 88789 41395 372465 153035 43774 -92411 59910 243190 34212 12174
16048 127109 -90705 256041 57390 38325 50289 -204490 23833 -164816 271631 73905 247624
16037 247624 -131361 -205508 -133796 -162982 -140886 -102480 -20883 -5533 -143412 -25072 26175
16025I1082a06485A99408A5517b14242g3986j17183g0912A21764E5405N1964a88596
16013A36193a69533B01486c02774J03804f8703m1588A02707h1157j59025A2939
16002a88075f0780E103b28642A64696d64027c2223E5623a27142B8127J96312C395
15990b5751G6858a31680A6318K9897a21619j18260B05212N0002J84876E3119P2858
15979A25977j3809h5006A85060q427b08974c0012D0388L0319b6218A27087c94870
15967F3972b8038m4107r463E7704K03171a9920A53477a04295B52064f4515c1168
15955A70924c28298J28314Q0861C6019a40547I8848B7212a18083l6124j79801
15945c34008f3051A08847c8221A1241b44327o0611F3244b93416J9221L2339a2816
$$ plain form
16025 91082 -106485 199408 15517 -214242 -73986 -191169 -70912 121764 55405 107369 -188596
16013 136193 -169533 201486 -302774 -198970 -68703 -110291 102707 -81157 -240182 12939
16002 -188075 -60780 5103 -228642 164696 -464027 -32223 55623 -127142 28127 224439 3395
15990 -25751 76858 -131680 16318 46215 -121619 -239879 205212 255214 440090 53119 125977
15979 125977 112168 -85006 185060 176633 -208974 -30012 40388 70707 -26218 127087 -394870
15967 63972 -28038 -72145 -81608 57704 260875 -19920 153477 -104295 252064 -64515 -31168
15955 170924 -328298 -199984 -119123 36019 -140547 98848 27212 -118083 -154207 -334008
15945 -334008 -63051 108847 -38221 11241 -244327 -304938 63244 -293416 -274195 -241856 -12816
15933c28419a48513O9217j95479o0145e6234D2329b35433B36416G7982L8145a8387
15921a83545Q5676D2250K99231a41639G8488M7216a43846e0924k97179h9786A14067
15909F4304A6919a94099O1790N7526k12134J0397A66096a22540d5425J48j7194
15898f2471m9387p7664N4511A26751K46124a56229j29044f1774j39320H6473a51663
15886b48417A54759a04147a2858k15578B01383a14400A28954b02208Q1050A5643
15875b979k3050C5606c0606j29452j42969A93858a86475k29389f0890B40079I2130
15863b79383P504P793A3763L2164K1672a25957B3553J78602C2347a40086A72884
15851a65727K0392P1571K2748B2943A1126O2069a38865i697A33913c0462j10005
$$ plain form
15933 -328419 -148513 -79296 -274775 -334920 -56234 42329 -235433 236416 77982 116127 -18387
15921 -183545 -97869 42250 341481 -141639 78488 125704 -143846 -50924 -348103 -89786 114067
15909 64304 16919 -194099 -132309 -74783 -286917 -276520 166096 -122540 -45425 -45277 -62471
15898 -62471 -111858 -189522 -135011 126751 372875 -156229 -285273 -61774 -201094 86473 -151663
15886 -248417 154759 -104147 -12858 -228436 201383 -114400 128954 -202208 -121158 15643
15875 -2979 -26029 35606 -30606 -160058 -303027 193858 -186475 -415864 -60890 240079 92130
15863 -279383 -271879 -264086 13763 45927 67599 -125957 23553 202155 32347 -140086 172884
15851 -165727 -145335 -73764 -51016 22943 11126 73195 -138865 -9697 133913 -30462 -140467
15840a40467F7461c64836J39426B04529H6385b80731C69350f0812A03070k8124
15830G4946i0747A84104E1396a35948o2473o9843J08492D9768O300O2093a36817
15818D6194g8219I2672c06194B33800b04209P8107m838n5720p7713h4548k4501
15807a09049A4638i9353o5841A15655J09595K2520b26198B15035a97802A21067
15796B05393a54361C5809a22106G8297c19731i7640k91569B0164O2067a27860
15785A4433K01219a61460B55200a68060k04515B04841E6254a20004A92400g6882
15774a75788n0687C43064b147j28931K6j27459B5229J63374h0919m001D9800b04436
15761C66689a73714B39937a34990E7859L74147A83467p7323j1721K84571H7690
$$ plain form
15840 -140467 67461 -364836 -225410 204529 86385 -280731 369350 -60812 103070 74946
15830 74946 -90747 184104 51396 -135948 -198421 -268264 -159772 49768 56068 118161 -136817
15818 46194 -78219 92672 -306194 233800 -204209 -126102 -130940 -186660 -264373 -84548 -109049
15807 -109049 14638 -99353 -165194 115655 225250 247770 -226198 215035 -197802 121067
15796 205393 -154361 35809 -122106 78297 -319731 -97640 -389209 20164 82231 -127860
15785 14433 215652 -161460 255200 -168060 -372575 204841 56254 -120004 192400 -76882
15774 -175788 -226475 343064 -2147 -131078 -131052 -258511 25229 188603 -80919 -84920 49800 -204436
15761 366689 -173714 239937 -134990 57859 432006 183467 106144 94423 378994 87690
15750A71066A3067P7558P5591d1722A02491Q887A2339c89168h0885j19860B31956
15738a96479M3903j27148k4758B8775O1685a53628O4963m6924D4328a41965B39305
15726C24481a56380C75228a30327A08994q241P7204e63526K70993J08487A67700
15715b30367g1482n5979e2803l3384A70088i9745A42264b83633j58802I774J56467
15704A66241F3397R580J0848h1696B39886B4522J34741k2014i309B23938a33705
15692A90274c36596d2832D5732K78408A15362L3229K0588l9987J73191A1009J68162
15681A79171b1310E4303f9188q3021G2833Q8691c0438o6329D26535e3170D1079
15669B16172b22002f396B86186g2957B4789c90718O6921A35650a3344j16871j14457
$$ plain form
15750 171066 13067 90625 166216 -41722 102491 111378 12339 -389168 -80885 -200745 231956
15738 -196479 -152576 -279724 -304482 28775 90460 -153628 -88665 -135589 44328 -141965 239305
15726 324481 -156380 375228 -130327 108994 100753 177957 -563526 -292533 -184046 167700
15715 -230367 -71482 -127461 -52803 -86187 170088 -99745 142264 -283633 -442435 9774 166241
15704 166241 63397 72977 83825 -81696 239886 24522 159263 137249 -9309 223938 -133705
15692 190274 -336596 -42832 45732 324140 115362 148591 169179 129192 302383 11009 179171
15681 179171 -21310 54303 -69188 -152209 72833 161524 -30438 -96767 426535 -53170 41079
15669 216172 -222002 -6396 286186 -72957 24789 -390718 -323797 135650 -13344 -130215 -244672
15658b44672A87885H7263B5427e4112A51452b37801P7695E0031o721c21448E0027
15646C557b51061B2957a06401J7757p8611A60518r528E4724K35004b60475o4732
15635c25207B11598I3821J87071A26399a79873j13289c6491A02768J28101a33187
15624b07926i724l45769a36496B39484c81338A9505b60554A13582a87221m1108
15614b28329P9807A32027a08001A74339a44309A25942L6294K0974E4409R5640
15604A50049a38178A95995L9913j10043a77023a1705o1772c0003j7135j0769b6117
15592A96793H4910c7801B34737a4073B80814a64753j27358B60759a14466l6483
15582a50949d8725r838l44728D24295j73730b4441B92180a2249I6489a55461B22431
$$ plain form
15658 -244672 187885 87263 25427 -54112 151452 -237801 -160106 50031 43310 -321448 50027
15646 3557 -251061 22957 -106401 -88644 -167255 160518 150990 54724 289728 -260475 -325207
15635 -325207 211598 93821 280892 126399 -179873 -293162 -36491 102768 230869 -133187
15624 -207926 -9724 -355493 -136496 239484 -381338 19505 -260554 113582 -187221 -228329
15614 -228329 -148522 132027 -108001 174339 -144309 125942 162236 183210 54409 150049
15604 150049 -138178 195995 235908 125865 -177023 -11705 -73477 -30003 -47138 -57907 -26117
15592 196793 84910 -37801 234737 -14073 280814 -164753 -292111 260759 -114466 -150949
15582 -150949 -48725 -58563 -403291 424295 250565 -24441 292180 -12249 96489 -155461 222431
15570h3543j95142R141E9242O2091b15167m4761a03534j56572a7420B31076e7086
15558E09307A27685M7231c5343C64273b03608f5911A50484b23338g9872K3519
15548e6353l3413k93372J50834j95457G9996C0144L3825q041K06179d66588a73477
15536A6945f9691G2865a23542j11459C8827a16947c1274A06737b5764k26104A71087
15524a1824l6633B7791K76064A16585a41956A3868J17655a08319A82065c3097
15513a43945b7446j78827f6731A87266a28951A13975d6024k2024A92221n2670
15503A39551b56629F5554C1229a98522A05385C3113f5494j90191J14528I8458
15492H261K18142a66519g2397B47256i3492A810b07795D4047c8793A57973b4727
$$ plain form
15570 -83543 -278685 -269544 59242 121333 -215167 -259928 -103534 -260106 -17420 231076 -57086
15558 509307 127685 174916 -35343 364273 -203608 -65911 150484 -223338 -79872 -56353
15548 -56353 -89766 -383138 -232304 -427761 79996 30144 63969 55928 262107 -466588 -173477
15536 16945 -69691 72865 -123542 -235001 38827 -116947 -31274 106737 -25764 -251868 171087
15524 -11824 -48457 27791 303855 116585 -141956 13868 131523 -108319 182065 -33097
15513 -143945 -27446 -206273 -66731 187266 -128951 113975 -46024 -68048 192221 139551
15503 139551 -256629 65554 31229 -198522 105385 33113 -65494 -255685 -141157 98458
15492 8261 226403 -166519 -72397 247256 -93492 1810 -207795 44047 -38793 157973 -24727
15480a53520A25889o217n8279J20244A9892b4814j19186O1403C4873A3640R6384
15469A10024K8240o1794b00182B45395m551q5733a32348b9466A96392c5187E12
15457c53646g9819L2038B110b3721q7850B2701a72430A0644N5158A5560a23374
15445B81924j5138j04367o7449Q0636a21693B50588d3664n143C0215L18358a0626
15433A32899c16346k0656e0827p3514A32003a96997B37525p0146b08545f1749
15422a13966B70925A0646a92013H4442a25569A16714a7667I9752i1565A18399
15411F5722d2512r0902c7552B43188a33264E5148J79422r1796n8129g3013l44725
15400d17738K02640C13310b89061A96087D4066b35128I5357f2521F1987R0119
$$ plain form
15480 -153520 125889 119672 61393 181637 19892 -24814 -144000 -82597 34873 13640 110024
15469 110024 138264 76470 -200182 245395 240844 155111 -132348 -29466 196392 -35187 512
15457 -353646 -79819 -47781 2110 -23721 -111571 22701 -172430 10644 65802 15560 -123374
15445 281924 266786 162419 94970 175606 -121693 250588 -43664 -48807 30215 348573 -10626
15433 132899 -316346 -337002 -50827 -124341 132003 -196997 237525 167379 -208545 -61749
15422 -113966 270925 10646 -192013 84442 -125569 116714 -17667 99752 -91565 118399
15411 65722 -42512 -133414 -37552 243188 -133264 55148 234570 142774 84645 -73013 -417738
15400 -417738 -215098 313310 -289061 196087 44066 -235128 95357 -62521 61987 152106
15390A52106A7624b9125B48534a0850j97112Q4343A77249R7935G7331c00983r5150
15379c96133B94606h6134L2715I6756a60403E5324J53479a89819J0304A69689
15368B2556L5808k7525b06878K8793B74314f1012K0271I7734a25593b6661k16720
15357b43381C15766E8009J06876A7061b49936A45625a67671B0228c2084B758f3993
15345H4206O3132a65237J4203A08657l6004L3602j0523D4836b54307I679b56835
15333G9861d2766n5764l8050A28555L8612b00j6627B20844a10595B87199a05316
15321B77417a14787A80840B6678N3636b76475a21091C8358j0251i3009Q480n3571
15310a38100D14021B2608q689b20471m2310A87035A6749c1847E8504L5085L39412
$$ plain form
15390 152106 17624 -29125 248534 -10850 -207962 -123619 177249 275184 77331 -300983 -396133
15379 -396133 294606 -86134 -53419 96756 -160403 55324 208803 -189819 -179515 169689
15368 22556 58364 30839 -206878 -178085 274314 -61012 -40741 97734 -125593 -26661 -243381
15357 -243381 315766 58009 164885 17061 -249936 145625 -167671 20228 -32084 2758 -63993
15345 84206 147338 -165237 -151034 108657 72653 106255 95732 44836 -254307 9679 -256835
15333 79861 -42766 -98530 -136580 128555 167167 -200 -16827 220844 -110595 287199 -105316
15321 277417 -114787 180840 26678 80314 -276475 -121091 38358 28107 -93009 -84529 -138100
15310 -138100 414021 22608 13919 -220471 -262781 187035 16749 -31847 58504 93589 433001
15299D33001A24121L343h1917C5579O5446R2322A4699a9662C93939G8441K88811
15288C67252I6929J50439a22211C1451a20862e8071B37940K6177L6614C0209J1749
15277D1958J98866M2190j37536l3940e4389A76574J96830A63060q0729a03735
15266C11771a46039A96551a64321D0670J53937b04230A27976m6081K30804b2A67571
15254E5612e0340B03361K26135n0922J52059M03287m5970j66958L46961l85418
15244F82535B90674H4076L9110J12650L15161B47689h1977r6974A31556J19286
15234B50842c8542C12287j42971B73M21811E7950A6965Q1869g8402A70717K10062
15223C80779e612l24083A83890J6548p9357l1746a21530B52489A19841K814n0789
$$ plain form
15299 433001 124121 127464 -81917 35579 101025 193347 14699 -19662 393939 78441 367252
15288 367252 96929 247368 -122211 31451 -120862 -58071 237940 264117 300731 30209 41958
15277 41958 240824 283014 145478 111538 -54389 176574 373404 163060 82331 -103735
15266 311771 -146039 196551 -164321 40670 194607 -204230 127976 81895 312699 -22 167571
15254 55612 -50340 203361 429496 378574 530633 933920 887950 720992 1067953 682535
15244 682535 290674 84076 123186 235836 550997 247689 -81977 -178951 131556 250842
15234 250842 -38542 312287 169316 273 422084 57950 16965 98834 -78402 170717 380779
15223 380779 -5612 -329695 183890 200438 121081 89335 -121530 252489 119841 122655 71866
15212G1866k0519d0388B33125a73550D37073j42934I9637L0096K67c4766A90735
15200h3281L1437H2421b14354A53118e7854B45209J26066i6744r3859E1460M3146
15189I4606r073a8372F2269M19645A71188N6812a68938B43727g2946E1185a56079
15177b21864B9086K7599J8029B7635R4811k1374b56408M6557B12595D7360O8618
15166A15978Q6059b14822f2272A61879j4543a27901A61098n0375b97429a18360
15155B57711n7608k660b9179C07995a68060A57726p1500J97973c589A05044i0575
15143b78262k8341c2169D81061a23968B43898b01742m789d7926B14064L4814a1093
15131B41976A16060j0770b09183h757C40282j55312g8975C84320j46592k9958
$$ plain form
15212 71866 51347 -40388 233125 -173550 437073 294139 99637 129733 130000 -34766 190735
15200 -83281 -51844 82421 -214354 153118 -57854 245209 371275 -96744 -190603 51460 94606
15189 94606 85533 -18372 62269 481914 171188 228000 -168938 243727 -72946 51185 -156079
15177 -221864 29086 56685 74714 27635 122446 101072 -256408 -209851 212595 47360 115978
15166 115978 202037 -214822 -62272 161879 147336 -127901 161098 110723 -297429 -118360
15155 257711 200103 197443 -29179 307995 -168060 157726 86226 284199 -3589 105044 -90575
15143 -278262 -306603 -32169 481061 -123968 243898 -201742 -206531 -47926 214064 248878 -11093
15131 241976 116060 105290 -209183 -8757 340282 184970 -78975 384320 237728 207770
15121B07770f0792F7316f1248A93129c8994K766G0311P0173R8153M2550d3848
15109a34907A33962O8665K34186a33169B86087p757q1999C522J4095K79732I0405
15097A7379J39380Q5454F9510O6666N6649M6633J41004a27240A11326a20533e851
15085C27570b99643f6479I2471K8474a69368M4514C51836A34620l1769K20544
15075C23395A43512h2193C38453K0925a43881L6735D2440f429A90895p6093K05593
15064C20395A08280O207j4443e0238G5568J41297O9421D2227J22829J16659p6353
15053B05362r1914o052L07412A76700H1300J66208J39794M3471d7042B50240f1604
15041B29025A4516J08872Q4423r5786K19704a04230A63754K86632A15521J8403
$$ plain form
15121 207770 -60792 67316 -61248 193129 -38994 -36228 70311 140484 238637 281187 -43848
15109 -134907 133962 202627 436813 -133169 286087 278330 196331 3522 17617 297349 90405
15097 17379 156759 242213 69510 136176 192825 239458 380462 -127240 111326 -120533 -5851
15085 327570 -299643 -66479 92471 120945 -169368 -124854 351836 134620 102851 323395
15075 323395 143512 -82193 338453 359378 -143881 -107146 42440 -6429 190895 114802 320395
15064 320395 108280 114487 100044 -50238 75568 216865 286286 42227 165056 281715 205362
15053 205362 113448 107396 414808 176700 81300 247508 387302 430773 -47042 250240 -61604
15041 229025 14516 123388 207811 112025 331729 -104230 163754 450386 115521 133924
15031A33924J8458N3663r0557R2935i6746B28989K14715A43742L5293m6285g1420
15019B45126G0069L14987p0591j31768g3723B6976K43789J3966A26228h9601C33337
15007F2167J64113L5902p9972M9418G5533N16212A8107M58409j91563J0733A28347
14995D43235k21263o678I6245P9808M44392j55705k32116L9176J07557A61922
14984B87822m5896K98797C8286J76952M27773r2365j46750q6013J5649j32789
14974B00743F8689L36990j20831o6776e9035B82407J17311c0247H6224M7942M9292
14963A83458K78255P978k17023K06860q4495m9110K08599k22021l2831A02543
14952C07210j19111L37429B05890B5043M07870A46260d6256D63885A77328J67278
$$ plain form
15031 133924 152382 206045 115488 208423 -96746 228989 443704 143742 179035 132750 -71420
15019 245126 70069 385056 314465 182697 -73723 26976 270765 284731 126228 -89601 333337
15007 62167 226280 262182 182210 231628 75533 591745 18107 476516 284953 295686 128347
14995 443235 221972 215294 96245 176053 620445 464740 232624 271800 379357 161922
14984 287822 241926 540723 38286 215238 643011 550646 403896 317883 333532 200743
14974 200743 68689 405679 284848 218072 -59035 282407 399718 -30247 86224 134166 183458
14963 183458 461713 469691 252668 459528 375033 325923 534522 312501 279670 102543
14952 307210 188099 525528 205890 25043 432913 146260 -46256 463885 177328 344606
14942C44606P2208n0106H5579K39784J66246A95793L90198n4846B44139J83003
14932D27142j59151N9310J40136a252A02413L02556j8984O9601p7779a9309B23750
14920A98460K0940K69995j13374j24598G2957d0040A83396K14013j05566J80193
14910D72036J31905a79784a2693C98890j89685R8518J67484r1020j65372H3912
14899E21101j88091N9630A77045L65261B14809L51053j49033I7856K21547q8858
14889B30545J15579J39810B01317J59375P5045m1375J04958B39502M13139C22937
14878F730K69671p9236L00316K5357A51674L54765A13979L4271L018K48888Q3831
14867D83987B39864J79749N2145l8051I4013M93789m1004j19627A85771J788J78547
$$ plain form
14942 344606 416814 366708 85579 325363 491609 195793 585991 531145 244139 427142
14932 427142 267991 327301 467437 -1252 102413 404969 385985 455586 377807 -19309 223750
14920 198460 219400 489395 376021 251423 72957 -40040 183396 397409 291843 472036
14910 472036 603941 -179784 -12693 398890 209205 307723 475207 384187 218815 83912
14899 521101 333010 392640 177045 542306 214809 565862 416829 97856 319403 230545
14889 230545 346124 485934 201317 360692 435737 394362 499320 239502 652641 322937
14878 6730 276401 197165 497481 522838 151674 506439 113979 148250 151268 400156 483987
14867 483987 239864 419613 471758 433707 94013 587802 546798 427171 185771 187559 366106
14856C66106A09218K39638J91119k57027M0634N4946A37815E4773K78808N03332
14846H36913n4357m3045k10516k38331L60594k0693m1771j80665j50367K55404
14836E13166A98032Q6605K71539k11958L9892L13544l9676k95298j538J24000
14826D85142M7607o1801p2297K0110J01395k56953J22323J27056K22872l28084
14816D07370K01155k9907L6308C04386L272K74862R0721B40496O50618k23945
14806F67169k76086L05241q3298k99796M40826k78579J84327P5111R73k11806
14796E24082M8469K29495k61152k6367M43827l54242J3478m942J07917k83924
14786D36641j18962P7020M0138J83337K87411l13830q4847K75874k10895r7791
$$ plain form
14856 366106 109218 348856 539975 282948 323582 378528 137815 54773 333581 836913
14846 836913 782556 739511 528995 290664 651258 630565 588794 408129 257762 513166
14836 513166 198032 284637 556176 344218 384110 697654 657978 362680 361142 485142
14826 485142 532749 470948 398651 418761 520156 263203 385526 512582 735454 407370
14816 407370 608525 578618 614926 304386 307658 582520 673241 240496 891114 667169
14806 667169 391083 696324 613026 313230 754056 475477 659804 734915 735888 524082
14796 524082 572551 802046 540894 514527 958354 604112 617590 612648 720565 436641
14786 436641 317679 394699 434837 618174 905585 591755 506908 782782 571887 474096
14776D74096L34457J85974k25350K30346j72030k70061j31550r682K27319L49211
14766I92730l44096J71319j03360j024q3669P734k60815L04982L7943j81413r9124
14755D41207L16534N2036q9287C11086K22255M6680J54498J21047j41237O8656
14745G82985N4852r5401P0766j86342m9029K40995k66740M63335C21477N28113
14735H49590J44693m52470K53484k66480J92107k8456M3954m8426Q3903K07669
14725I79568j88892L7583m7647n5376N4199p9378n964j19709L25019m7231p640
14714H44532K8604J82853k28494J24874J76989l54950j22729J30456N06360m52656
14704H35839q509r606J19063o7305L01754K869l38432K6168M5167N8787j58890
$$ plain form
14776 474096 808553 994527 769177 999523 827493 557432 425882 416200 643519 992730
14766 992730 648634 819953 716593 715569 631900 639634 378819 683801 721744 540331 441207
14755 441207 757741 809777 720490 311086 533341 580021 734519 855566 714329 782985
14745 782985 837837 742436 813202 626860 577831 818826 552086 1015421 321477 849590
14735 849590 994283 541813 795297 528817 720924 692468 736422 687996 771899 979568
14725 979568 790676 828259 780612 725236 779435 700057 694093 574384 899403 852172 844532
14714 844532 873136 1055989 827495 952369 1129358 774408 651679 782135 1288495 835839
14704 835839 827330 817724 936787 869482 1171236 1174105 835673 861841 907008 965795 806905
14693H06905K14552o130K2391Q4514q0189j851j55737L60408j2460k42342R2799
14682A082860l30564Q437m6609N38839l20517J58325J09356p8130n4258J12499
14672A180238l02793J11753P1279Q9814L453j4691P1998k46629J97641K87135
14662A449198k87414J52038K0428j01350j75480M66759l40857l0706n6043j17421
14652I79152O4496K82038j63886K78331j33666j39552J77477j88271q7062K83753
14642A352810r2392R1917j99377J49649q2883j26863K60102j73310L00881k85648
14632A194886k9139L17108K48684K2726l20805J22570k1777k48957K24388J66753
14622A676437k24807j41309K68331N9496j22434l92125M39483K00563k31561j82644
$$ plain form
14693 806905 1021457 1015327 1037718 1122232 1042043 1040192 884455 1244863 1232403 990061 1082860
14682 1082860 752296 760733 714124 1252963 932446 1090771 1200127 1121997 1067739 1180238
14672 1180238 877445 989198 1060477 1150291 1153744 1139053 1211051 964422 1162063 1449198
14662 1449198 1161784 1313822 1334250 1232900 1057420 1524179 1183322 1152616 1096573 979152
14652 979152 1043648 1325686 1161800 1440131 1306465 1166913 1344390 1156119 1069057 1352810
14642 1352810 1260418 1352335 1152958 1302607 1219724 1092861 1352963 1179653 1480534 1194886
14632 1194886 1165747 1482855 1731539 1754265 1433460 1556030 1534253 1285296 1509684 1676437
14622 1676437 1451630 1310321 1578652 1638148 1515714 1123589 1563072 1763635 1532074 1349430
14612A349430J58088M14475k19470j4213N823N2295l9157l31337J62248K62158
14602A800340l45284K55358J47413n64680K18755K3628k3990J75589j5525L73623
14592B045227k34554J66140j96616K56315l6918N6370o2040k0200j85155K96683
14582B085252j50800J4533K18466M37697m31103K25180j75317Q0794q40l9259
14572B264603K88781k84159L8373O8501J4351J48361M4506q8014K24890J12068
14562B832261L00884q4506J7275J65496K23598J92428M39042M37978l2236N40082
14552E032302L62138O30892Q52712J714184L611500N269861R068680M906046j2139341
14543A9308974q247912m573934j612256j065480n25605J14648o01109K72859k78337
$$ plain form
14612 1349430 1507518 1921993 1702523 1688310 1694133 1746428 1707271 1375934 1538182 1800340
14602 1800340 1455056 1710414 1857827 1293147 1511902 1535530 1511540 1687129 1671604 2045227
14592 2045227 1810673 1976813 1780197 2036512 1999594 2055964 1993924 1973724 1788569 2085252
14582 2085252 1934452 1948985 2167451 2605148 2174045 2399225 2223908 2304702 2303862 2264603
14572 2264603 2553384 2269225 2307598 2376099 2390450 2538811 2583317 2495303 2720193 2832261
14562 2832261 3133145 3048639 3065914 3231410 3455008 3647436 4086478 4524456 4492220 5032302
14552 5032302 5394440 6025332 6878044 8592228 12203728 17473589 26542269 31448315 19308974
14543 19308974 11061062 6487128 4874872 3809392 3283787 3398435 2797326 3070185 2791848
14534B791848L3166l90554J81554J86853m7290J04056j83781m8301r2081J05642
14524B641112m5951j36114J61291K26519j51900j04686P3035J4202J12990j1026
14514B779472k39396N93993l78879N03479j97394k68636J84442J80983k19417
14505B938647k7544k4148J90375K69262k78750L87477k12108Q2961n0364J6599
14495C292407M31210l65699J5485K95977q9651p3432j13143J21003J31917L81359
14485D027433n30408J99607Q9518J43896J28510p1714O0660j59186L66846L154
14475D258316m027K20077j03731q3863L0478j2373R378K46277J27089j15082J28290
14464D700829j80522J52682j63381M03517k68976O76154n09773N05494K7546j30234
$$ plain form
14534 2791848 2825014 2434460 2616014 2802867 2755577 2859633 2675852 2627551 2535470 2641112
14524 2641112 2595161 2459047 2620338 2846857 2694957 2590271 2663306 2677508 2790498 2779472
14514 2779472 2540076 3134069 2755190 3258669 3061275 2792639 2977081 3158064 2938647
14505 2938647 2911103 2886955 3077330 3346592 3067842 3455319 3243211 3326172 3275808 3292407
14495 3292407 3723617 3357918 3373403 3669380 3579729 3506297 3393154 3514157 3646074 4027433
14485 4027433 3497025 3696632 3786150 3930046 4058556 3986842 4047502 3888316 4255162 4258316
14475 4258316 4254289 4474366 4370635 4286772 4317250 4304877 4314255 4560532 4687621 4572539 4700829
14464 4700829 4520307 4672989 4509608 4913125 4644149 5320303 4810530 5316024 5343570 5213336
14454E213336N4331M6607K76173k5834J77840k16565k7265L31967J69445J1559
14444F011594N7068k58421K23204R1681k16206M06903N1526K40297l18050J72832
14434F462428M56862L25464l37290n5649O42843k61492Q7840K89850J22857l5673
14424G698040r7420J67538l0339K71712k5888J67517K19366j30896L44957Q0334
14414H664921O9855L9434L76683j62514N79771j50716J03395N31031k57112L44284
14404A0139032K26742j63200L36853L52831q9415K71740J8068L24598K76671o2114
14394A1631806K83967O0214M16200J8783j31898P63282J51059L16323L18412O6420
14384A3894568L42526j14029O05015K3229M35456K18540L86766J96666L36151
$$ plain form
14454 5213336 5267667 5314274 5590447 5564613 5742453 5525888 5498623 5830590 6000035 6011594
14444 6011594 6068662 5810241 6033445 6125126 5908920 6315823 6367349 6607646 6289596 6462428
14434 6462428 6919290 7244754 6907464 6851815 7494658 7233166 7321006 7610856 7733713 7698040
14424 7698040 7600620 7768158 7737819 8009531 7983643 8151160 8370526 8239630 8584587 8664921
14414 8664921 8734776 8774210 9150893 8988379 9568150 9417434 9520829 10051860 9794748 10139032
14404 10139032 10365774 10202574 10539427 10892258 10802843 11074583 11092651 11417249 11693920 11631806
14394 11631806 11915773 11975987 12392187 12410970 12279072 13042354 13193413 13509736 13828148 13894568
14384 13894568 14237094 14123065 14728080 14751309 15186765 15405305 15792071 15988737 16324888
14375A6324888L47243N91315M02039J39484K73805L80304J39998P28997M00548
14366A9728621K74129M97290J15110Q88439L17571J89418L67469Q80458L56187
14357B3614692N54488K25749P28172N84479Q25621O99305Q33775M17253M01735
14348B8885269J276557N66056N66306J168187P02359R14856P38393J194593J070645
14339C7083221O89713J178320J193265J386451J107405P34109J536060J205795
14331D6114339J577947J519481J458372J608693J867668J895870J919597K058417
14323F0020384J932617J875425K128760K469637K788219K370671K584562K863937
14315G9034212L104654L028548L506854L499048L719424L794013L892520M475565
$$ plain form
14375 16324888 16672131 17263446 17665485 17804969 18078774 18459078 18599076 19328073 19728621
14366 19728621 20002750 20500040 20615150 21503589 21821160 22010578 22378047 23258505 23614692
14357 23614692 24169180 24394929 25123101 25707580 26533201 27232506 28066281 28483534 28885269
14348 28885269 30161826 30727882 31294188 32462375 33164734 34079590 34817983 36012576 37083221
14339 37083221 37772934 38951254 40144519 41530970 42638375 43372484 44908544 46114339
14331 46114339 47692286 49211767 50670139 52278832 54146500 56042370 57961967 60020384
14323 60020384 61953001 63828426 65957186 68426823 71215042 73585713 76170275 79034212
14315 79034212 82138866 85167414 88674268 92173316 95892740 99686753 103579273 108054838
14307A08054838M404530M515063N402791N247105N414981N986525O052823O702125
14299A51780781P099389P439150P852126Q179725Q908167R308709R446506J0563795
14291B20578348J0488620J0450674J1265253J1997205J1818814J1265829J1398208
14284B99262951J1290753J1954011J2225968J1804277J1434632J1373237J0632244
14277C79978073J0573055J0049369J0563519J0561464Q959005O452107N047300
14270D42183892M065893L24178m043822m480931n571380j0335728j2453739j3635310
14262C96053053j3934343j3722511j3243467j3183438j3291750j3232360j2360133
14255C03085051j2165032j1446026j1159828j0194293j0816289j0373824j0373354
$$ plain form
14307 108054838 112459368 116974431 122377222 127624327 133039308 139025833 145078656 151780781
14299 151780781 158880170 166319320 174171446 182351171 191259338 200568047 210014553 220578348
14291 220578348 231066968 241517642 252782895 264780100 276598914 287864743 299262951
14284 299262951 310553704 322507715 334733683 346537960 357972592 369345829 379978073
14277 379978073 390551128 400600497 411164016 421725480 430684485 437136592 442183892
14270 442183892 446249785 446573963 442530141 438049210 432477830 422142102 409688363 396053053
14262 396053053 382118710 368396199 355152732 341969294 328677544 315445184 303085051
14255 303085051 290920019 279473993 268314165 258119872 247303583 236929759 226556405
14248B26556405r601034r153344r053744q178902q010937p569840p208955p167993
14240A60611656p090350n874858o044451n700184n174653n177749n267183m866023
14232A15416205l920703m445508m290861l881103l815762l526260l588788l215792
14224H4731428l384465k849712k968342k613690k445009k543535k246656k289548
14216F3390471k366961j760425k010301j708382j878714j842086j499154j580251
14208D8744197j390058j030476j514752j669925j351174j212913j104707j109512
14200C8360680j094917q84919j430308j288401n15777p41599r01306r71380o95927
14191B9836146o27629j141977m00741q21601n30860j048944j14835r28847l82801
$$ plain form
14248 226556405 216955371 207802027 198748283 190569381 182558444 174988604 167779649 160611656
14240 160611656 153521306 147646448 141601997 135901813 130727160 125549411 120282228 115416205
14232 115416205 111495502 107049994 102759133 98878030 95062268 91536008 87947220 84731428
14224 84731428 81346963 78497251 75528909 72915219 70470210 67926675 65680019 63390471
14216 63390471 61023510 59263085 57252784 55544402 53665688 51823602 50324448 48744197
14208 48744197 47354139 46323663 44808911 43138986 41787812 40574899 39470192 38360680
14200 38360680 37265763 36380844 34950536 33662135 33146358 32404759 31503453 30532073 29836146
14191 29836146 29208517 28066540 27665799 26844198 26313338 25264394 25149559 24220712 23837911
14182B3837911n17764n71368l09792m20224o94728l34337n13562q07782j29799
14173A9538555q2790p09910j09485n05216k86591l50772l00586o96088O8822k27953
14163A6337986k54302o21954l03915k49451m56112Q2804n01318l94696Q8544k26193
14153A3501393n9406l61087k95332j41527k81210l79064O2195K8183j55882o91634
14143A1226629j86222J32086n17076L38004o12966k44699l14461L3393m8790j6221
14133I789677j2555m13475J35396k87867M636o46595N61931n29020k32599J42548
14123H512077j47508j90048k43093R2122R2679j62159k10279n3397j67937m45471
14113G076986K164j79610K15395k82919J31584L2360k16037j79972M7904m6470
$$ plain form
14182 23837911 23320147 22748779 22438987 22018763 21324035 20989698 20476136 19668354 19538555
14173 19538555 19455765 18745855 18636370 18131154 17844563 17493791 17193205 16497117 16565939 16337986
14163 16337986 16083684 15461730 15157815 14908364 14452252 14535056 14033738 13639042 13727586 13501393
14153 13501393 13441987 13080900 12785568 12644041 12362831 11983767 12045962 12074145 11918263 11226629
14143 11226629 11040407 11172493 10655417 10993421 10380455 10135756 9821295 9854688 9805898 9789677
14133 9789677 9777122 9363647 9499043 9211176 9215812 8569217 9131148 8602128 8369529 8512077
14123 8512077 8364569 8174521 7931428 8023550 8116229 7954070 7743791 7690394 7522457 7076986
14113 7076986 7079150 6899540 7114935 6832016 6963600 6995960 6779923 6599951 6647855 6601385
14103F601385l39613K12576j88430J51850j84125N4345l78291j66419L23651l15001
14093E771928Q8676l06436j47189M23101n02537Q4271r5957k45039j12391K38485
14083E196912M2593j97922q2623P8123k54303k47189J11344n7594K79861j5665
14073D853537j29211l89670M4285l2382K32895j38734K47885n32160j94703r9268
14063C862474L19919j6016J17035l89118j89258N29766k38459k49994M6861k20581
14053C572629J67980l2488j83180o9993j03145L42695J0096l47927J07701Q9789
14043C554157J10519m40247K00169m38673P8900J53846k38689L65259j48336K207
14033C199112r5972j17587q1900J97806J1057j02957N0951j78918j75467K12739
$$ plain form
14103 6601385 6261772 6474348 6285918 6437768 6253643 6307988 5929697 5763278 6086929 5771928
14093 5771928 5860604 5554168 5406979 5830080 5327543 5411814 5315857 5070818 4958427 5196912
14083 5196912 5239505 5041583 4958960 5037083 4782780 4535591 4646935 4589341 4869202 4853537
14073 4853537 4724326 4334656 4378941 4346559 4579454 4440720 4688605 4156445 3961742 3862474
14063 3862474 4182393 4166377 4283412 3894294 3705036 4234802 3996343 3746349 3793210 3572629
14053 3572629 3740609 3708121 3524941 3454948 3351803 3694498 3704594 3356667 3464368 3554157
14043 3554157 3664676 3224429 3424598 2985925 3064825 3218671 2979982 3345241 3196905 3199112
14033 3199112 3103140 2985553 2903653 3101459 3112516 3009559 3060510 2881592 2706125 2918864
14023B918864m86089K98276M3198J98304k78838K37541k33618O8508j45029o5571
14013B555546K78248q8125k94555L77367m29607l5800o3528K84790k11180j18839
14003B254317J66086J60010j32228K54546r8831M4957L02260k39897K06867N93353
13993C511440l33462L22314N20068P02986Q32611K594289M522249R657250Q159854
13984C0489599q235294p980447m603350k573932j299905p71668o46901l83632
13976C994470k30892k77159k2625Q286n47516J33022m95058J63290K02715k39279
13966B689254J24745n7054L5870k92064J60508m53771o9575J89556R1957k11768
13956B207658j90113K25157k61312L67658k61965J39590n01258J73724L9526r1486
$$ plain form
14023 2918864 2432775 2731051 2774249 2972553 2693715 2931256 2697638 2766146 2621117 2555546
14013 2555546 2833794 2745669 2451114 2828481 2398874 2363074 2299546 2584336 2373156 2254317
14003 2254317 2420403 2580413 2448185 2702731 2603900 2648857 2951117 2711220 2918087 3511440
13993 3511440 3177978 3500292 4020360 4723346 5555957 8150246 12672495 22329745 30489599
13984 30489599 22254305 14273858 9670508 7096576 5796671 5025003 4378102 3994470
13976 3994470 3763578 3486419 3463794 3472080 2924564 3057586 2562528 2725818 2928533 2689254
13966 2689254 2813999 2756945 2792815 2500751 2661259 2207488 2137913 2327469 2419426 2207658
13956 2207658 2017545 2242702 1981390 2349048 2087083 2226673 1725415 1899139 1938665 1847179
13946A847179n2914J98699J70630j13963l62766K34482j57747j95336K23801L08
13936A792373j86067J83282k70878M30277k97712J22608N9820l02463J71403j76919
13926A525724J77239J86309m85849P7233J51638j74482K7923p594L65213m65619
13916A377735K76227j5899k39152j15292J53990k47982M49092l47371L4306J25699
13906A451353j24445R1621l4541k82376K24270n1882N9327J4724j40166L50676
13896A558561k00510q680P0678J32029l13989J37139Q2626m65474L59239j87911
13886A163708R9996n6142J28331r3524J40667j03076P6985k36167O5242N8340
13876A244360D85640N23662J53170j18973N0596L0203l21337L61862n9244J85968
$$ plain form
13946 1847179 1794265 1992964 2163594 2049631 1686865 1921347 1763600 1568264 1792065 1792373
13936 1792373 1606306 1789588 1518710 1948987 1651275 1773883 1833703 1531240 1702643 1525724
13926 1525724 1702963 1889272 1403423 1480656 1632294 1457812 1485735 1478141 1843354 1377735
13916 1377735 1653962 1638063 1398911 1283619 1437609 1189627 1638719 1291348 1325654 1451353
13906 1451353 1326908 1418529 1383988 1101612 1325882 1274000 1333327 1348051 1207885 1558561
13896 1558561 1358051 1349371 1420049 1552078 1238089 1375228 1457854 992380 1351619 1163708
13886 1163708 1263704 1207562 1335893 1242369 1383036 1279960 1356945 1120778 1186020 1244360
13876 1244360 485640 1009302 1162472 1043499 1094095 1124298 802961 1164823 1105579 1291547
13866A291547k33210n9918Q4080K9590j2406k07976R8452K47440k05233J1465
13856A043831Q5055l85017J20438o577K42312k59809K1418r0023K55868J88851
13846A216347l48968l10789O70514m06379J39864J99899j21183J2465l02212K16929
13836I66487J468j38344J09229j40385J00291K48976k2261j74365o637p4039K22622
13825A093042k40973j77688k0684L53640n7024k3250o6631k05408J99860O5176
13815I20060l87070N20056l84669K72744j42540K04707l10336N39297n54207J05220
13805G83262m4649N4013m6766K78103m81828L24878j01633K77694k08491J36681
13795I71264J32207E23150L32609o2577k20211J29987L38922j58714j32829N4619
$$ plain form
13866 1291547 1058337 998419 1082499 1112089 1099683 891707 990159 1237599 1032366 1043831
13856 1043831 1128886 743869 864307 857730 1100042 840233 861651 771628 1027496 1216347
13846 1216347 867379 556590 1227104 820725 960589 1160488 1039305 1051770 749558 966487
13836 966487 967955 829611 938840 798455 898746 1147722 1125461 951096 944459 870420 1093042
13825 1093042 852069 674381 653697 1007337 950313 927063 860432 655024 854884 920060
13815 920060 532990 1053046 668377 941121 798581 1003288 692952 1232249 678042 783262
13805 783262 738613 792626 745860 1023963 542135 867013 765380 1043074 834583 971264
13795 971264 1103471 523150 855759 793182 572971 702958 1041880 883166 750337 804956
13785H04956l47395J83661J00347M05327k80991k40662Q4818L6140R5639p1628
13775G70212j27832J61857j08855N0297k86347k5226J46962R0998k34448J22770
13765E60388R8589k71302J59283J93051k80750R5747K00767k93460M09527k91036
13755E80804J93248J2197B57774M11481J35097L7447q4859k02930o0282L31200
13745H24928q7350j28057k78640K8064M33601l62049J76769O5289k7882k47245
13735C97428K13227N997k27815M45083l95881L02850k59242N710m7593j5037r6681
13724C28046L13201J0821L34012D81534J79932B05177M36933k6648P7791j75160
13714E18093A56740N34377K61866m73767A63181M34852K08672B20012K67548K86388
$$ plain form
13785 804956 457561 641222 741569 1146896 865905 625243 710061 746201 841840 770212
13775 770212 642380 804237 695382 745679 459332 434106 581068 672066 437618 560388
13765 560388 658977 387675 546958 740009 459259 555006 755773 462313 871840 580804
13755 580804 774052 786249 257774 669255 804352 841799 756940 554010 493728 824928
13745 824928 737578 609521 330881 358945 792546 430497 607266 672555 644673 397428
13735 397428 610655 616652 388837 833920 438039 740889 481647 487357 439764 424727 328046
13724 328046 641247 652068 986080 481534 661466 205177 642110 615462 693253 518093
13714 518093 156740 691117 952983 479216 163181 598033 806705 220012 487560 773948
13704G73948l79346J86354k74166L36695k50980L77380j31552j60971B35939J54424
13694C90363K29558J06058C30227n6162J11273K20187o0255k4647O2968j58777
13684D24814B06443J85868J60060N5557k24769k4826o3427J89384K12036j03579
13674E92747k00885O2307J92962J55415j38559o5834A27794K0155M1886K12308
13664D02143Q8818A58467K58804L93957l37473H1504O62918l60590A23898J41595
13654B65493M88372l32141J53553J68169A65059L66471j53438N7361r30B09954
13643E17515A10061K01289K97305B3173K2283L57437q7739K5899P2402j04190
13633C09265j2444l4620L1551K82657A94736K53810j02708L23714j68613k30846
$$ plain form
13704 773948 394602 580956 306790 643485 392505 769885 638333 477362 235939 390363
13694 390363 619921 725979 330227 274065 385338 605525 545270 520623 583591 424814
13684 424814 206443 392311 552371 607928 383159 358333 294906 484290 696326 592747
13674 592747 391862 454169 647131 802546 663987 598153 127794 147949 189835 402143
13664 402143 490961 158467 417271 811228 473755 81504 744422 383832 123898 265493
13654 265493 753865 421724 575277 743446 165059 531530 378092 435453 434523 209954
13643 517515 110061 311350 608655 23173 45456 402893 315154 341053 413455 309265
13633 309265 296821 262201 293752 576409 194736 448546 345838 669552 500939 270093
13623B70093M10673B46010K13238d5159E78256k19152Q5938J36855q8647K3186
13613E16436j9060q2980j60384J8037k3264J77166L0635K8777o9510J87113j89369
13602D13597l4484K19165j51153R3014k64867K00251A65353G8273L12678o0268
13592C30683Q0311E2863M11144A21788K68512j02393r71n2933o8100K76140k18626
13581B23417a7783D39207e9351d1B42091Q9110K33484j87015K35509j60872A49216
13569H9494K00080J11494a8193C87800j70189M47144A92818N2128p8394L6089
13559B02641J04193J71060a53147A06236C0052K14850K38892j62827q4534J05030
13549C41463G0508R3949J68783E5505L06753j21814p6218O2919K59264k10933
$$ plain form
13623 270093 680766 246010 459248 -45159 578256 359104 445042 581897 493250 516436
13613 516436 497376 414396 254012 272049 248785 425951 456586 485363 415853 602966 413597
13602 413597 379113 598278 447125 540139 275272 475523 165353 78273 390951 330683
13592 330683 410994 52863 464007 121788 390300 287907 286936 234003 165903 442043 223417
13581 223417 -17783 439207 -59351 -41 242091 331201 564685 377670 613179 452307 149216
13569 89494 289574 401068 -18193 387800 217611 664755 192818 244946 166552 202641
13559 202641 306834 477894 -153147 106236 30052 244902 483794 320967 236433 341463
13549 341463 70508 164457 333240 55505 362258 240444 164226 227145 486409 275476
13539B75476E9651N4649b12442A65782q1479J223P5749K39024G9740O0944R2272
13528B32956K72212B45844E7955J89457J23781K87092B67276p6882c5353F54893
13517C04984J30197A24668n7103J97202J39361M5090A91554o6997J32974J16631
13507C74162j23793J27249l5653K48787A15184K69000j20391n8507J9869r9603
13497A25552J91900k777B4049K94785M41197B06403c1363G5371A4457L98190C0181
13485B78240J46580D6350A7557N10737j64567n9592k8156a07181B75747a03865
13474D57291m662A19844N13881A75874L1688H6561L13924j43172N9873A28499
13463B54982J82021A45038Q6652j3980q0481K44740A81128J67563C2568J77906
$$ plain form
13539 275476 59651 114300 -212442 165782 84303 85526 161275 400299 79740 140684 232956
13528 232956 505168 245844 57955 247412 371193 658285 267276 190394 -35353 654893
13517 304984 435181 124668 67565 264767 404128 449218 191554 124557 257531 374162
13507 374162 250369 377618 341965 590752 115184 384184 263793 205286 225155 125552
13497 125552 317452 314675 24049 318834 760031 206403 -31363 75371 14457 412647 30181
13485 278240 424820 46350 17557 528294 363727 304135 275979 -107181 275747 -103865
13474 457291 452629 119844 633725 175874 207562 86561 400485 257313 317186 128499
13463 254982 437003 145038 231690 217710 137229 381969 181128 348691 32568 210474
13453B10474L9142K11187G548L16313F7765Q875O0784O5064K1954p010J04825
13442C22257j29900F8600K07140K3R6470N0437k8072i8228D8813M40683H1181
13430B44408B8706c636H4507M75718A91053d3242D18458j2498g5185B78397R5168
13419C73565j24745N7710J77867l6786G4693J10946a14463G8034l3788J0779L83424
13408D38449r9751J27652B07619a2512k3024C16977j05552J94938B00574o0954
13398A39620K29157A84369P2784B9332K4120K22826j23373Q1933R2883j00990
13388B26731E450d0593A75088c8536d058C93467j82003q1728J37203C6729a25518
13376E32658A95603J26020A48472K76111D2373M11440A94129K1677I3240J41284
$$ plain form
13453 210474 249616 460803 7548 323861 67765 76640 137424 202488 224442 217432 322257
13442 322257 192357 68600 275740 275763 372233 422670 394598 -98228 48813 489496 81181
13430 244408 28706 -3636 84507 560225 191053 -43242 418458 405960 -75185 278397 373565
13419 373565 248820 306530 484397 447611 74693 185639 -114463 78034 44246 55025 438449
13408 438449 338698 466350 207619 -12512 -35536 316977 211425 406363 200574 139620
13398 139620 368777 184369 257153 29332 53452 276278 152905 234838 327721 226731
13388 226731 5450 -40593 175088 -38536 -4058 393467 211464 129736 266939 36729 -125518
13376 532658 195603 321623 148472 424583 42373 453813 194129 215806 93240 234524
13366B34524Q8494A52112F2687K91202A28907D1103M78289A02426J80374N9968
13356C42768c8642B97380f4802A19978L83978H5863L46598A92601J92864A66403
13345A50284J34752J89453I3609L15018b0685B57213G4477j8396J05562o6834
13335I4809J52872Q8025J1844A63175R6189J3544P8713A10035M3802L3976b8482
13323B84717I2518J94900C8623j0546K97981C2598K46377O1762j17586r5019m7692
13312H0440J36257J91495h6311D0553J35020n137J91850i1911B00315L97438B72855
13300C88684f9405k47459C30616I7636k990J36904c37470E7921a12137C53558
13289A27157A3527a44090j25709A48814F7756B4211r935a81844h221H4680N4457
$$ plain form
13366 234524 323018 152112 62687 353889 128907 41103 519392 102426 282800 342768
13356 342768 -38642 297380 -64802 119978 503956 85863 432461 192601 385465 166403
13345 150284 285036 474489 93609 408627 -20685 257213 74477 56081 161643 94809
13335 94809 247681 335706 347550 163175 259364 272908 351621 110035 153837 187813 -28482
13323 284717 92518 287418 38623 28077 326058 32598 278975 340737 223151 128132 80440
13312 80440 216697 408192 -86311 40553 175573 170436 362286 -91911 200315 597753 272855
13300 388684 -69405 -316864 330616 97636 94646 231550 -337470 57921 -112137 353558
13289 127157 13527 -144090 -269799 148814 67756 24211 14276 -181844 -8221 84680 139137
13278A39137k1594J22802A00728K18934g8729C9975K31090A18555n5469B3129
13267C75117a58501B82519A05301B7701J51244K25537b8383G6069K9017a40275
13256B72205a81556B98992A03650C6793a77128A84753a79982D76591B26193a65952
13245C38140g1183A88165C6217J4105a14917e2697D9036J5811e558A45850J05501
13234B51351A13768J15388A13245K29451j07623J32160g6278C08430a64477A17992
13223C54030C8505N30222H6781k1748H435J46345P726a07168A86317H4382L2168
13212A16550M5080K0950C074M04127A69392o5757C0946e2311j1444C14717D9566
13200B80743A30943a02384B81916n5835L2142R1922e2822l2810A08061j4926B892
$$ plain form
13278 139137 117543 240345 100728 319662 -78729 39975 271065 118555 63086 23129
13267 375117 -158501 282519 105301 27701 178945 404482 -28383 76069 105086 -140275
13256 272205 -181556 298992 103650 36793 -177128 184753 -179982 476591 226193 -165952
13245 338140 -71183 188165 36217 50322 -114917 -52697 49036 64847 -5558 145850 251351
13234 251351 113768 229156 113245 342696 235073 367233 -76278 308430 -164477 117992
13223 354030 38505 568727 86781 65033 8435 154780 162506 -107168 186317 84382 116550
13212 116550 161630 182580 3074 407201 169392 103635 30946 -52311 -63755 314717 49566
13200 280743 130943 -102384 281916 226081 258223 350145 -52822 -85632 108061 93135 2892
13188A29638j9801J1123g2352B82568A05558R8413G4246g5674q8995J8634C34967
13176a91593C20195a20395a0169A04643e7111j00863D4613K51331m7937A15247
13165F1502A7871N8475Q5869a76331A14380J68597b83975F7072J20203a79676
13154B02601f9730B49809a59907N9893L3249A90132n1868J06073m498I74K46897
13143B47871K30125a05507A48646L3025p0532j5925B3176J97223l0294a71838
13132B02606b01859i4556A43699d2609p5123L9152A91389m087p4469d0223a7300
13120i6099l328C104a2916E3390K65140j00438D2780e4542B86954A0031l515J34576
13108A41092K09997G7861a20910k16510d0745j2605k5127B2027O9293h2523A13006
$$ plain form
13188 129638 109837 120960 -72352 282568 105558 203971 74246 -75674 -164669 -146035 334967
13176 -191593 320195 -120395 -10169 104643 -57111 -157974 44613 295944 248007 115247
13165 61502 17871 76346 162215 -176331 114380 282977 -283975 67072 187275 -179676
13154 202601 -69730 249809 -159907 -100014 -66765 190132 138264 244337 239839 974 247871
13143 247871 477996 -105507 148646 181671 111139 95214 23176 220399 190105 -171838
13132 202606 -201859 -94556 143699 -42609 -117732 -78580 191389 187302 112833 -40223 -17300
13120 -96099 -99427 3104 -12916 53390 318530 218092 42780 -54542 286954 10031 6516 141092
13108 141092 351089 77861 -120910 -337420 -40745 -53350 -78477 22027 91320 -82523 113006
13096A74324h0801A49197A9413Q9746f5122B707R9411L67400D5540J06531d9043
13084A92518b465E7448K12719B0591J12517O4185I7249l9172b43058J19848B03932
13072D7732i4117A47203C2949R299b9188A12595h8696A2770L17302D4047h6724
13060C43806a02467B4071a86119B10651n7807G3682Q3553J4407k6774a92800D3779
13048D66278a0742I7526K88917A56556J59481j13309I7548J57595A07880P8909
13038A86789G0218B4388J86617L05894A94047E17a78918g9555B36889k9072o7262
13027A40555J20364k2577J97675E5362J34178m3700M9238E9500a0886C46496c16676
13015A80055a35332I1573J28148M8866H0323E851f4436A04835P1690a03101B13487
$$ plain form
13096 174324 -80801 149197 19413 109159 -65122 2707 102118 469518 45540 152071 -49043
13084 192518 -2465 57448 270167 20591 133108 197293 97249 58077 -243058 -123210 203932
13072 47732 -94117 147203 32949 42248 -29188 112595 -88696 12770 330072 44047 -86724
13060 343806 -102467 24071 -186119 210651 152844 73682 157235 171642 144868 -192800 43779
13048 466278 -10742 97526 386443 156556 316037 202728 97548 255143 107880 186789
13038 186789 70218 24388 211005 516899 194047 517 -178918 -79555 236889 207817 140555
13027 140555 260919 238342 436017 55362 189540 145840 195078 59500 -10886 346496 -316676
13015 180055 -135332 91573 219721 268587 80323 5851 -64436 104835 176525 -103101 213487
13003C43099H2709A7537J43641J7206N5082F4030P7935f2784k7031m3690a7402
12991c4487A95555a66523A98637a7591A70665J52222n6869j11214B6265Q8357
12981A14622K30172a67556k44249A53348c5439a4282I055Q911K1017a53039G7945
12969i2206C24630F5010a0527k24151K0042R4021A40591A8252J3447f7615F3167
12957B66409J55096a78137l35117a33830e8229k53593A08031b19029B36764j071
12947B35693k1280B4354q65L32505A34044n7515J00486j6683Q2549o8071J65435
12936C40245a52044O7755E3338K41914b1055C4149b93971H4228J72374a04703
12925a53469f9612n1147D9870e4114C7190R0066a95873E6469a29848j80766B87153
$$ plain form
13003 343099 82709 17537 161178 178384 233466 64030 141965 -62784 -89815 -133505 -17402
12991 -34487 195555 -166523 198637 -17591 170665 322887 266018 154804 26265 114622
12981 114622 344794 -167556 -411805 153348 -35439 -14282 9055 17966 38983 -153039 77945
12969 -92206 324630 65010 -10527 -234678 -214636 -120615 140591 18252 31699 -67615 63167
12957 266409 421505 -178137 -513254 -133830 -58229 -311822 108031 -219029 236764 235693
12947 235693 214413 24354 23489 355994 134044 76529 177015 160332 242881 174810 340245
12936 340245 -152044 -84289 53338 295252 -21055 34149 -293971 84228 256602 -104703
12925 -153469 -69612 -120759 49870 -54114 37190 127256 -195873 56469 -129848 -310614 287153
12913f4027A64502n6809l8104a26713c5122G9244l2897d3046B72395q9822p292
12902A75281a03963D0988c7436q0472M3048H6582j0322N8005l8993m630f1370
12890E5137J34974F8383d1953j13780k04685J24225R6685e166k812A26861a19535
12878C542K86447j19836M4577K27343F4577R6529a8556O844j54399g5159A44970
12866F657J2392e368A15312j4539J45466E7853R7870a35285A68860a1211B12903
12854B00247b81479A36550c36230A31423g5979n9789k44129B3153K16584a20376
12843A28054J31176I306J33700a67815A72046E8951A082L32881c20762g2827A32582
12831C21711I9646A9123P5508j3800p907J28018a32640D5579a0109C2268d70228
$$ plain form
12913 -64027 164502 107693 69589 -126713 -35122 79244 46347 -43046 272395 182573 175281
12902 175281 -103963 40988 -37436 -117908 -74860 86582 76260 134265 95272 90642 -61370
12890 55137 190111 68383 -41953 -155733 -360418 -236193 -139508 -5166 -7978 126861 -119535
12878 3542 289989 170153 214730 442073 64577 161106 -18556 -11712 -166111 -75159 144970
12866 6657 19049 -5368 115312 100773 246239 57853 155723 -135285 168860 -11211 212903
12854 200247 -281479 136550 -336230 131423 -75979 -135768 -379897 23153 239737 -120376
12843 128054 259230 9306 143006 -167815 172046 58951 1082 333963 -320762 -72827 132582
12831 321711 99646 19123 94631 80831 72924 200942 -132640 45579 -10109 32268 -470228
12819d0905C0320a02559k4442L9482M1889j22780A95703A7713b37794J3594A48895
12807A30490f3676A06094g637j34349A95051b35955B19959O7403D3944a57570
12796A50411m3280J66720j13976b34552B6471a13404B16363j01556J24346a26890
12785B51961F0441b78134h563H9843J30825A272L42257a10828B93507E5123K00983
12774B56106R0556B2448Q1834a17566j5383d7359n2905o0623C03753b05735E9538
12762i1235j4730j03549a0048A20504m9644a96834A42476g9055F9678J18099n0199
12751A37578j4734C9560R9629J0648a35490a0823j13722L0860C8048J30864b9012
12739c4337A03840J38040j16140N7715q1268N4636b6401C17061A13571J3401a91546
$$ plain form
12819 -40905 30320 -102559 -127001 -87519 -45630 -168410 195703 17713 -237794 -224200 148895
12807 130490 -63676 106094 -7637 -141986 195051 -235955 219959 287362 43944 -157570
12796 150411 107131 273851 159875 -234552 26471 -113404 216363 114807 239153 -126890
12785 251961 60441 -278134 -8563 89843 220668 1272 343529 -110828 293507 55123 256106
12774 256106 346662 22448 104282 -117566 -132949 -47359 -100264 -160887 303753 -205735 59538
12762 -91235 -105965 -209514 -10048 120504 70860 -196834 142476 -79055 69678 187777 137578
12751 137578 122844 39560 139189 149837 -135490 -10823 -124545 -93685 38048 168912 -29012
12739 -34337 103840 241880 125740 183455 102187 156823 -26401 317061 113571 126972 -191546
12727c0462n0150B59582E3556d8251B85095C4034J43270d7991j88361c3055j95637
12716b28692H0716A2291a73065A8053a39217A71783O0292c1418F2912J81352Q2415
12705C26679A30929K05527a2961j73473I2108L76831j99061l3209b30247h8336
12694B20090b52611H2848h19j71270B24501D3991L7359b17122C3735K73175A31682
12682a19167B75265f0225B4539J4511Q1069C7777Q4557c6025C60174J94651G0903
12670B54922N8810a65428e7941G1333J58057C2843q583L7520J40821E7212D660
12658I32a94317I58M11712d6635j92087g6953o5023C72093b60337B1250J22152
12647A43402a62056L6732e3731A45016a32937e1948A11879m2596j6086K43751
$$ plain form
12727 -30462 -80612 259582 53556 -48251 285095 34034 177304 -47991 -236352 -33055 -228692
12716 -228692 80716 12291 -173065 18053 -139217 171783 232075 -31418 62912 244264 326679
12705 326679 130929 336456 -12961 -186434 92108 468939 269878 236669 -230247 -88336
12694 220090 -252611 82848 -819 -172089 224501 43991 81350 -217122 33735 306910 131682
12682 -119167 275265 -60225 24539 39050 120119 37777 122334 -36025 360174 554825 70903
12670 254922 313732 -165428 -57941 71333 229390 32843 24260 61780 202601 57212 4660
12658 932 -194317 958 412670 -46635 -238722 -76953 -141976 372093 -260337 21250 143402
12647 143402 -162056 -125324 -53731 145016 -132937 -51948 111879 69283 53197 296948
12637B96948p0656D8452Q5001K83022C8779J33674g2461E67343I1925J8296a73529
12625I40b56048B03135I1088J48427b88732I4084J8996a62083j10020f1634H4367
12613B92826a90191F5856Q1390b8365j69323c961H7823M0098H459h94G7513C3753
12600D08158C438N7302k5549J50581N9718a5158l2429A54118k4754D1624b31174
12588H4433b61552a9562p1223b5072k9789i009B77609I8970a65885C3766J8393
12577E2159c1916n0203j9743A6607J28691a44576e1612A53691d4034B13142e0637
12565A10150c2435E8092k066H206J98997J68722b2806B81966a8560A10557c9421
12553A39604J14027a29350A84290c9994j09068B66977M0244o3855c200A04377
$$ plain form
12637 296948 226292 48452 133453 416475 38779 172453 -72461 567343 91925 110221 -173529
12625 940 -256048 203135 91088 239515 -288732 94084 113080 -162083 -272103 -61634 84367
12613 292826 -190191 65856 147246 -28365 -197688 -3961 87823 127921 8459 -894 77513 33753
12600 408158 3438 60740 35191 185772 245490 -15158 -47587 154118 129364 41624 -231174
12588 84433 -261552 -19562 -90785 -25072 -54861 -9009 277609 98970 -165885 33766 52159
12577 52159 -31916 -82119 -101862 16607 145298 -144576 -51612 153691 -44034 213142 -50637
12565 110150 -32435 58092 56026 8206 207203 375925 -22806 281966 -18560 110557 -39421
12553 139604 253631 -129350 184290 -39994 -149062 266977 307221 243366 -3200 104377
12542G9253g1096A1669a03207B54314b4358f649A19956h097k12117A35945C7880
12530H5429c57439A41104L8274m6532b14173B30353b6316e806A22446h6380B9421
12518a49895C6049j2980J04984a1168A55284e0330A48511M4564F0194K08706a60415
12506B01738b61613A32867k8261b7542j86646D9998a4769D7254R9823E3761J11631
12495A65392a7288j08779F6215a48507H7358e8687j65290K8156Q6564e0419G4427
12483C81719h7392k7792L7315A05173N3229G6832k0178k3768b5334j67924e9721
12471b61515i9172B78465D4301O1784d25221g848m8588C613b47745F202b74196
12459b36449D2467d15725f0350A84443G4085K31249I661c33243A35374E5746J50643
$$ plain form
12542 79253 -71096 11669 -103207 254314 -24358 -6649 119956 -8097 -220214 135945 37880
12530 85429 -357439 141104 179378 132846 -214173 230353 -26316 -5806 122446 -86380 29421
12518 -149895 36049 23069 128053 -11168 155284 -50330 148511 193075 60194 268900 -160415
12506 201738 -261613 132867 104606 -27542 -214188 49998 -14769 47254 147077 53761 165392
12495 165392 -17288 -126067 66215 -148507 87358 -58687 -223977 -195821 -109257 -50419 74427
12483 381719 -87392 -115184 -77869 105173 158402 76832 56654 32886 -25334 -193258 -59721
12471 -261515 -99172 278465 44301 106085 -425221 -7848 -56436 3613 -247745 6202 -274196
12459 -236449 42467 -415725 -60350 184443 74085 305334 9661 -333243 135374 55746 206389
12448B06389c9559A06839D0532a04708a0572A08143N0706k9277g547G7282a13072
12436d3708F7046b19091A7090a72165A23806A7128e8765g789p7967B56987m2805
12425B14182C4753h9264A6340K71267b09197A53126b72539e7064A69118b9055
12414A255f5236g661B89661a0136A11467I229e95966B08346f0102F6287i0832
12402G6203J96766a36629J7280r0636K3549g0107m4832D594a19079a2120j07472
12391a19592L0431C55299I7724J09105n8408c67214J48748A32466a3673l4510
12381d8183j61812A55740a92971A20776a40988I8828e200l4520k30470i4933c1055
12369c8702D9059b92970f2074j08578A08486l7947a92511A79632a69615M9586
$$ plain form
12448 206389 -39559 106839 40532 -104708 -10572 108143 158849 129572 -7547 77282 -113072
12436 -43708 67046 -219091 17090 -172165 123806 17128 -58765 -7789 -85756 256987 214182
12425 214182 34753 -89264 16340 287607 -209197 153126 -272539 -57064 169118 -29055
12414 1255 -65236 -7661 289661 -10136 111467 9229 -595966 208346 -60102 66287 -90832
12402 76203 272969 -136629 -119349 -209985 -186436 -70107 -114939 4594 -119079 -12120 -119592
12391 -119592 -89161 355299 97724 206829 148421 -367214 -218466 132466 -13673 -48183
12381 -48183 -209995 155740 -192971 120776 -140988 98828 -5200 -39720 -270190 -94933 -31055
12369 -38702 49059 -292970 -62074 -170652 108486 70539 -192511 179632 -169615 -120029
12359a20029j0317d1535q5535H1536N4736d5553A86774P9521b57201Q3471r2600
12348b66330g4655p1477A01623c6540R462j1075j25883l8025N3468N3034G5271
12336c42167A21031i4208C03556q9573B8586b16154A94148q9301P3627c04848
12325B27622c9131B74018G5587c68380C6477a844A27076b22845J06049H9625b28620
12313A49828L2153o3114c2129D56559h8935B18283c44647A58390b39221B8186
12302D51748A16665k3936b9423k4478L058D4494d3305F4031B6620J94348e2647
12290C74695g9395B99185n5654o7735i2958P902a5735j71466o1286e6532o9775
12279a26307k54971D9070L69652A20520A1697M0006R7039o0315J89299b32963
$$ plain form
12359 -120029 -130346 -41535 -127070 81536 136272 -45553 186774 266295 -257201 -173730 -266330
12348 -266330 -74655 -146132 101623 -36540 -27078 -38153 -164036 -202061 -148593 -95559 75271
12336 -342167 121031 -94208 303556 213983 28586 -216154 194148 104847 178474 -304848
12325 227622 -39131 274018 75587 -368380 36477 -1844 127076 -222845 -116796 89625 -228620
12313 149828 181981 118867 -32129 456559 -88935 218283 -344647 158390 -239221 28186
12302 451748 116665 92729 -29423 -53901 -50843 44494 -43305 64031 26620 220968 -52647
12290 374695 -79395 299185 243531 175796 -92958 -85056 -15735 -187201 -248487 -56532 -126307
12279 -126307 -381278 49070 418722 120520 11697 51703 148742 88427 277726 -232963
12268C11408j27413J72892r0771b32387f4576e524A33607m908Q799F5302b035
12256b53056D2693L30211c3536E20588A30528n0009a12221B34615a4948r0805
12246a05753A21772d3198F9779a2944A93036C6622a31653K5923j27967A68114
12235A78013E433g5114A58000a22775B45819I7297b0643B21743R8065q6517B1786
12223A74222L42324j75366j27411J50886q1387B2482J278a06851A22211J67091
12213B89302D3317A9226f5787B6043a91826C059J590J70594H0000K71113g0135
12201c22286C19132o9354E4538a87107B0735K59750m7802m422h0939B52280J2658
12190B64938G4972l5614a6718p626r3887B75422L5386F0824a06420A25209a11950
$$ plain form
12268 311408 183995 356887 266116 -232387 -64576 -5524 133607 128699 137498 65302 -2035
12256 -253056 42693 372904 -33536 520588 130528 80519 -112221 234615 -14948 -105753
12246 -105753 121772 -43198 69779 -12944 193036 36622 -131653 -105730 -233697 168114
12235 178013 5433 -75114 158000 -122775 245819 97297 -20643 221743 319808 233291 21786
12223 174222 516546 341180 213769 364655 283268 22482 23760 -106851 122211 289302
12213 289302 43317 19226 -65787 26043 -191826 3059 4649 175243 80000 351113 -70135
12201 -322286 319132 249778 54538 -187107 20735 280485 232683 228261 -80939 252280 264938
12190 264938 74972 39358 -16718 -24344 -118231 275422 310808 60824 -106420 125209 -111950
12178B65390i503D8396f1443A36613K32918A23968D7128J04747j7417O0428a61974
12166G6945K14867b50199n1809C07641E0319J82460B9152e8631H7090J86588j3354
12155B60324a21536b2491q1901p7621B8027K48529I990g5028J6226k3097j75072
12144b56971B36884J02919R0939A82968a80460C15307A07062i4947A0759a18963
12133g7795e371l1396A3755h1787E13147k05424B9524g7358I3852a1662j66046
12122a77708O7688C12272p2368j15201R6817j8994d0556B81725e829D5465N8827
12111A04292J6942b21600A63218p8609c7874k267A14376c0211A18371K56829k4969
12100C50231a10846D0847h3619B09462a93255A48743B63b35153a4857j81108R1029
$$ plain form
12178 265390 -9503 48396 -61443 136613 369531 123968 47128 151875 134458 194886 -161974
12166 76945 291812 -250199 -302008 307641 50319 232779 29152 -58631 87090 273678 260324
12155 260324 -121536 -22491 -104392 -182013 28027 276556 9990 -75028 -58802 -81899 -256971
12144 -256971 236884 339803 430742 182968 -180460 315307 107062 -94947 10759 -118963
12133 -77795 -5371 -36767 13755 -81787 513147 307723 29524 -77358 93852 -11662 -177708
12122 -177708 -110020 312272 239904 124703 221520 202526 -40556 281725 -5829 45465 104292
12111 104292 121234 -221600 163218 84609 -37874 -40141 114376 -30211 118371 375200 350231
12100 350231 -110846 40847 -83619 209462 -193255 148743 263 -235153 -14857 -195965 -104936
12089a04936L3j8440a0610m4863j7298G9757c22402B7063i74A57036o8778l2777
12077E5481k5406R7466a57574B46757p2673j4419C9650a04286A23033m6017K59429
12066C36445L95632N45463D51586Q2572j84212L4016e4878B37106N0277G5086
12055d2794j1495l8489K4487B33a31965b7847a713j86234q8116F9840a73780o9516
12043b43296H242a6720n5577b0188j57753a6319j9240B9472i2732C05361A22869
12031g4915j58755i0820B37434b91955b0532j60409g600n2830k93063J31226j83202
12020d05469B92638A43165d8839A32946A3308h0940m5178I7884c3896B38656l8520
12009B00136O9545J09301j82358E2404C268f254A06393c06077B4525L8489d31647
$$ plain form
12089 -104936 -104903 -123343 -10610 -55473 -72771 79757 -322402 27063 -974 157036 88258 55481
12077 55481 30075 127541 -157574 246757 174084 159665 39650 -104286 123033 77016 336445
12066 336445 732077 1277540 451586 534158 349946 383962 -54878 237106 287383 75086
12055 -42794 -54289 -92778 -68291 233 -131965 -27847 -1713 -187947 -276063 69840 -173780 -243296
12043 -243296 8242 -16720 -72297 -20188 -177941 -16319 -35559 29472 -92732 305361 122869
12031 -74915 -233670 -90820 237434 -291955 -20532 -180941 -7600 -60430 -353493 -222267 -405469
12020 -405469 292638 143165 -48839 132946 13308 -80940 -126118 97884 -33896 238656 200136
12009 200136 269681 378982 196624 52404 3268 -6254 106393 -306077 24525 63014 -431647
11997g023j70292F7069L1134b00936a9917j49748E7287a23785b6113j10535D5673
11985b64070C077c2346A75561d9150A16456m4389a05787H1117b23895d067e09
11973b102A82129b08179a01984r6300F0974Q6624c36577G4747b70045C05083b09364
11961a29639J2529F8007d4971m57242b14647I7480C2598c80943K1170D9898J19549
11950A69447f9485k9077c7768m81668C4242g8964o8458F218O8152I369J10797
11939A20166K13270a41036A69757c7288A76722a15956A40766O1390J49156G4970
11928I2556a49347B93434a81126A9744K4579Q5334i0414H6917a86292B12782C3886
11916a28753e736B43912r9269b44616J00755B25405n7056a29707j22329f2279
$$ plain form
11997 -7023 -177315 67069 98203 -200936 -19917 -169665 57287 -123785 -26113 -136648 45673
11985 -264070 3077 -32346 175561 -49150 116456 72067 -105787 81117 -223895 -4067 -509
11973 -2102 182129 -208179 -101984 -198284 60974 147598 -336577 74747 -270045 305083 -209364
11961 -129639 -117110 68007 -44971 -502213 -214647 97480 32598 -380943 -359773 49898 169447
11950 169447 -69485 -98562 -37768 -519436 34242 -78964 -147422 6218 74370 9369 120166
11939 120166 333436 -141036 169757 -37288 176722 -115956 140766 202156 351312 74970
11928 92556 -149347 293434 -181126 19744 44323 129657 -90414 86917 -186292 212782 33886
11916 -128753 -5736 243912 144643 -244616 -143861 225405 168349 -129707 -252036 -62279
11905b09179G0240M4185A8946a25703b8091j7627B1206b199j54855M1605j04038
11894b19487a392C7269J16144b2131j08113f0652k44465i3893r7332n2568e6357
11882A34669R0647I8772A2679L7603j880i7746A63152d6952j76885M8261O5918
11871a09658k08263J30505I2026J23795d8983P52l6031F5997k3735b53394P1279
11860a82115A97720E083K04725i4177j6989J4330A01158c9689j31594C2731M6139
11849G8870e6201I1607A0128a06120A13459a44732A72313a46633G4403a14473
11838E5020a13623r3073A4754K96980H7216a39924b6150A32165c7743A26514a51430
11826b20055a2394B87188e3743f190D606J33659j5642b93894m0880c2033B02402
$$ plain form
11905 -209179 70240 114425 18946 -125703 -28091 -45718 21206 -2199 -157054 -115449 -219487
11894 -219487 -1392 37269 153413 -22131 -130244 -60652 -305117 -93893 -191225 -243793 -56357
11882 134669 225316 98772 12679 50282 48402 -97746 163152 -46952 -223837 -175576 -109658
11871 -109658 -317921 -187416 92026 215821 -48983 -48231 -84262 65997 42262 -253394 -182115
11860 -182115 197720 5083 209808 -94177 -111166 -96836 101158 -39689 -171283 32731 78870
11849 78870 -56201 91607 10128 -106120 113459 -144732 172313 -146633 74403 -114473
11838 55020 -113623 -206696 14754 311734 87216 -139924 -26150 132165 -37743 126514 -151430
11826 -220055 -12394 287188 -53743 -6190 4606 138265 122623 -293894 -334774 -32033 202402
11814a89330h715I4815a4744E42422a25595l9156N2317C8784G177Q406d06567
11802a27487A10309C4073c16147b7905p3472o8956A45070j9756a6379k88252l9109
11791c43740A9435J83651i3368q9943C4190d03261A188J9447a16187D0620J47029
11780A87649e3785A62095j3456D1569P2869a68721e6792E7541a51663f2935D6
11768A05527b63812h8111L5087A17634a6235I3031m5930b22319d5991r696j89797
11757b45484a5329A01751a02301b9965B90933i0573B59986a15051r3762f2837
11746a28712G4894r930J02358q1986A7737K77212a08230A18107f0225I7689J65644
11735B63333a51906A94998c6425D06390i9950C52910a02087E1745f9909B90495
$$ plain form
11814 -189330 -8715 94815 -14744 542422 -125595 -164751 -112434 38784 7177 15583 -406567
11802 -127487 110309 34073 -316147 -27905 -101377 -170333 145070 125314 -16379 -304631 -343740
11791 -343740 19435 203086 -93368 -183311 34190 -403261 1188 20635 -116187 40620 187649
11780 187649 -53785 162095 148639 41569 114438 -168721 -56792 57541 -151663 -62935 46
11768 105527 -263812 -88111 -53024 117634 -16235 93031 47101 -222319 -45991 -55687 -245484
11757 -245484 -15329 101751 -102301 -29965 290933 -90573 259986 -115051 -208813 -62837
11746 -128712 74894 64964 167322 85336 17737 294949 -108230 118107 -60225 97689 263333
11735 263333 -151906 194998 -36425 406390 -99950 352910 -102087 51745 -69909 290495
11724a584j31638j08759C16804a04455d20G0850a7510j8703l51419e6631j31667
11713a88298G4400b77907g051j20921E8382R205B9435N291J28855K9929a23172
11701C22822c016D4400j3812a24360A28022n1864J57560A13510a76333C58879
11690H6482J46367B78J05638L036b47514f226j95356B13909D9367Q0758n289J55918
11678B80754j19603O7040F5001B5865L06811A55096g6187I9797c15484b7161B45050
11666I334J00451m114h2955A69325c4285B55213a77662A34441a15420d496j66467
11655a70963B59221B7281r320h6134l1761G3566J3949Q3278e2644B3538a64591
11643b9738C156b3952B1951i2203B44598c0664l02904f6629E32839i3422a0396
$$ plain form
11724 -1584 -133222 -241981 316804 -104455 -420 70850 -17510 -36213 -387632 -56631 -188298
11713 -188298 74400 -277907 -7051 -127972 58382 67587 29435 34726 163581 193510 -123172
11701 322822 -3016 44400 30588 -124360 128022 76158 233718 113510 -176333 358879
11690 86482 232849 278 105916 108952 -247514 -6226 -201582 213909 49367 130125 124836 280754
11678 280754 161151 228191 65001 25865 332676 155096 -76187 99797 -315484 -27161 245050
11666 9334 109785 105671 -82955 169325 -34285 255213 -177662 134441 -115420 -4496 -170963
11655 -170963 259221 27281 17961 -86134 -117895 73566 87515 170793 -52644 23538 -164591
11643 -29738 3156 -23952 21951 -92203 244598 -30664 -333568 -66629 532839 -93422 -10396
11631g9907L5307k8082A09671k9889b96016H7343b02603E5015f3851j58342F3421
11619B43756k4939O0830I5381K12603e1564I8299h8996G5041K59975A30569m4785
11608H5784a10772c6611j42718A90941B1712M90573A63783a57631J4136c3525
11597b5309m8527D1146b98295i159q0764G984M16012m4985j87904B91J22734l0766
11585I2259J3111e7199A02241a32683H4184K36192l767j48741R5729j20922e1418
11573F1410c08408a25942k1117G7417B3426b19554B41827a17932M6969A62529
11562B49605c6096j2208A08875C9375R5825B5184J11332E3129M12596A25340e3001
11550c20077a49190H2594K61308A24045a29588A2651J65375A951J96041J73947
$$ plain form
11631 -79907 -44600 -72682 109671 79782 -296016 87343 -202603 55015 -63851 -222193 63421
11619 243756 218817 279647 95381 307984 -51564 98299 -88996 75041 335016 130569 85784
11608 85784 -110772 -36611 -179329 190941 21712 512285 163783 -157631 -143495 -33525
11597 -25309 -73836 41146 -298295 -9159 -89923 7984 423996 379011 191107 291 123025 92259
11585 92259 105370 -57199 102241 -132683 84184 320376 316609 167868 263597 142675 -51418
11573 61410 -308408 -125942 -147059 77417 23426 -219554 241827 -117932 -70963 162529
11562 249605 -36096 -48304 108875 39375 135200 25184 136516 53129 465725 125340 -53001
11550 -320077 -149190 82594 343902 124045 -129588 12651 178026 1951 197992 371939
11540C71939b32448a9512C0466O4152N2503J61343m1199a60122D02779N5472A35074
11528A23817B071a36894J1866L5563A59630a32983A68482m2533g7608b3008r5651
11517a18659A9133o834R4278a15903A15095k5487L4696l593B861R4027L51640
11506D48528a33761B03167n7551m7211a45765G241K37718H5905B1250f1082C57176
11494b57862B3518d898B34373p8389I226L47031j69457B2649i6299j52249A6261
11482C15015o594A37469a3855B38681m8458K3178L452O3406D6908N04613d9657
11470C47546j05054j20948N2820N8502j04393N8844E8457H674M12095C6464J28717
11459A65181A5304d8531C21255A31289m8266e9089B22737K34212f861D95504e3974
$$ plain form
11540 371939 -232448 -19512 30466 94618 147121 308464 267265 -160122 402779 458251 135074
11528 123817 2071 -136894 -125028 -89465 159630 -132983 168482 125949 -77608 -23008 -118659
11517 -118659 19133 12299 106577 -115903 115095 89608 124304 120711 2861 96888 448528
11506 448528 -133761 203167 145616 98405 -145765 7241 244959 85905 21250 -61082 357176
11494 -257862 23518 -4898 234373 155984 9226 356257 186800 22649 -96299 -248548 16261
11482 315015 308421 137469 -13855 238681 190223 213401 216853 280259 46908 551521 -49657
11470 347546 242492 121544 174364 232866 128473 187317 58457 8674 420769 36464 165181
11459 165181 15304 -48531 321255 131289 83023 -59089 222737 456949 -6861 495504 -53974
11447b01101D6434j1204b7911j5713j8225C78875a72579g1300B9227J21981a41642
11435g2201m4769k1809H13M8681J31606a6250A5133K3042J36648a3431G4542K44178
11423C18720a74034D5861K2195a35327A75298D8689a0856k79132c2336j07814
11413a40150A5050N993K68998j24960q1128A671Q2915k258a21689M9921l6638
11402a08406F318a45013l2069A23345h2342B33787h912E5958a5877A88104D6593
11390e3847o5867A79328E7304J73872b90679a19291l69087B40759b6505k53633
11380b80138h222j18116d6101m6267a6887A54505J97527b00751R2639K5388B05619
11368F627k827a15432A99970e04697E204a44931b0898j03555B7478b74160D6572
$$ plain form
11447 -201101 46434 35230 -27911 -43624 -61849 378875 -172579 -71300 29227 151208 -141642
11435 -72201 -116970 -138779 813 49494 181100 -16250 15133 38175 174823 -13431 74542 318720
11423 318720 -174034 45861 68056 -135327 175298 48689 -10856 -289988 -32336 -140150
11413 -140150 15050 21043 290041 165081 83953 1671 84586 82328 -121689 -71768 -108406
11402 -108406 6318 -145013 -177082 123345 -82342 233787 -8912 55958 -15877 188104 46593
11390 -53847 -119714 179328 57304 231176 -290679 -119291 -488378 240759 -26505 -280138
11380 -280138 -8222 -126338 -46101 -92368 -16887 154505 352032 -200751 -108112 -82724 205619
11368 6627 3800 -115432 199970 -504697 5204 -144931 -20898 -124453 27478 -274160 46572
11356d172C7929i97A27299M7368A5558K53871l0834f3696k00238A11800O5576
11345A77376i1972M303H5168f3243m9796I1930c28248e0845A08842f0631k48520
11334c09151A00481b8827A96237a10831n95b8358C11306a2130j69700A28039c168
11322B00040i240A3252b55383h7580q571L9724A92347a03105o0650A3369a00113
11310B058M65222C7350K4397K219b72901i4719E0882j3605d1652G8694J11822
11299A90516I2793g2845C4336h6566q9310M0735A59895a6148A4516d623l6615
11288d1238j52173r8814a3753k18007h4885l61378J80969Q4433Q45p1843B36239
11276a67975K4316A77449b46213A22615a24666j9741A23523i5208I0305a35989
$$ plain form
11356 -4172 37929 -997 127299 174667 15558 269429 238595 -63696 -263934 111800 177376
11345 177376 -91972 -87669 85168 -63243 -113039 91930 -328248 -50845 108842 -60631 -309151
11334 -309151 100481 -28827 196237 -110831 -111426 -28358 311306 -12130 -181830 128039 -3168
11322 200040 -9240 13252 -255383 -87580 -96151 -56427 192347 -103105 -163755 13369 -100113
11310 2058 467280 37350 61747 63966 -272901 -94719 50882 37277 -41652 78694 190516
11299 190516 92793 -72845 34336 -86566 -175876 -135141 159895 -16148 14516 -4623 -41238
11288 -41238 -193411 -292225 -13753 -231760 -84885 -446263 -265294 -180861 -180016 -251859 236239
11276 -167975 -143659 177449 -246213 122615 -124666 -144407 123523 -95208 90305 -135989
11265b81249k58257E0646h3215A96016a45409R752C63882D4899b84449E8478J02076
11254A60554k8176J84325a55256j01352f572k50583E9773c59077e7217A82425
11243b8163k35767J26856A04104J37520c67225Q3311A45628g0868G9256J9387
11233I8643f8797j78896j04057b2342k99294C83946I0622L0763a63237b2409j2652
11222c5061A2660a56854k0868A09220M3856D2535J00600Q3743a83656h2674B57633
11210c081B46157c2027k52606O5507A90482j7167a13425L3385B00665d3004A12699
11198d4424A85895a06346D844O8677c7601E4270L2922B6549J8974j3503a19083
11186b58884j79J22136q344A43064Q7557b301l57148a37539B1079c8203B5097
$$ plain form
11265 -281249 -539506 50646 -83215 196016 -145409 -135657 363882 44899 -284449 58478 160554
11254 160554 132378 316703 -155256 -256608 -6572 -257155 59773 -359077 -57217 182425
11243 -28163 -263930 -137074 104104 241624 -367225 -283914 145628 -70868 79256 98643
11233 98643 -68797 -247693 -351750 -22342 -321636 383946 90622 121385 -163237 -22409 -35061
11222 -35061 12660 -156854 -177722 109220 153076 42535 143135 226878 -183656 -82674 257633
11210 -3081 246157 -32027 -284633 -219126 190482 173315 -113425 -80040 200665 -43004 112699
11198 -44424 185895 -106346 4844 73521 -37601 54270 87192 26549 45523 32020 -119083
11186 -258884 -259063 -136927 -145271 143064 230621 -2301 -359449 -137539 21079 -38203 25097
11174b88703h1739A10006h4623m4812j91288C39530G0342C3728h1408k82209J02026
11163b61591a30689k7514g7273J3478A21555J67447c931E3780J69466j05671K4527
11152A42102b69696k5562J00251j10550J35761E2968b13491B26988a5064j35412
11142a50476A26398c32722D0025R8314f614j87658H1175c41820C05879F9124J39466
11131B08590a31471A16K43266d3574n1227A05119a83378N2014j05167M4482K4385
11120a67664O3037D3040J03746K09187A21618K35454I9026i4053D0101M4163J02016
11109A86280m5126N5102p8381O9428e9316g602C05875H1212L65635j60371J4549
11098C01025C0293K46319J42051A89063F6117L9577J53728B7051L81185H4574
$$ plain form
11174 -288703 -81739 110006 -84623 -129435 -320723 339530 70342 33728 -81408 -363617 -261591
11163 -261591 -130689 -158203 -77273 -63795 121555 289002 -3931 53780 223246 117575 142102
11152 142102 -269696 -295258 -195007 -305557 -169796 52968 -213491 226988 -15064 -150476
11142 -150476 126398 -332722 40025 138339 -6614 -194272 81175 -341820 305879 69124 208590
11131 208590 -131471 116 243382 -43574 -94801 105119 -183378 -131364 -236531 -192049 -167664
11120 -167664 -104627 43040 146786 355973 121618 357072 99026 -94053 40101 84264 186280
11109 186280 141154 196256 117875 187303 -59316 -7602 305875 81212 446847 286476 301025
11098 301025 30293 276612 418663 189063 66117 105694 259422 27051 408236 84574
11087A24823K00863k2106L3968E2786a43803B33473h2539C62120j35076K22553
11077D49597C6562L33846A49392d5454B26432K15434B17587I8301M26872B34322
11066A98978L62826B50515K65502l7929J65426k88794K10581j22347j00700p0890
11056B71364O75571m05662j8141J19662j70370k8583K13881K93679k27387p189
11046G16825n1R1882k77849R3898l3251J05396r0513Q4797j43183K76178o6202
11035G57927L10415k86775j23837j27669J23374K06305j41239k8437o3231J41625
11025G68458o3832k35811L99370l55325P9610j63455M91327C58831M54299k88885
11015E24245N0902O7758l8861J87797j33137q2199k77836M57859p9455J62008
$$ plain form
11087 124823 325686 303580 337548 52786 -143803 233473 -82539 362120 227044 449597
11077 449597 36562 370408 149392 -45454 226432 441866 217587 98301 525173 234322
11066 198978 561804 250515 516017 478088 643514 354720 565301 442954 342254 271364
11056 271364 946935 541273 523132 642794 472424 443841 657722 951401 724014 716825
11046 716825 716774 808656 530807 624705 591454 696850 606337 691134 547951 824129 757927
11035 757927 1068342 781567 657730 530061 653435 859740 718501 690064 626833 768458
11025 768458 704626 468815 868185 512860 592470 429015 920342 358831 813130 524245
11015 524245 575147 642905 604044 791841 658704 576505 298669 756528 677073 839081
11005H39081j08771q1362q8398O25285m79506L27505k19968K36933l45522l8581
10995F66696J50094J75492l88381R605K96445j9339j19717J32630Q2176K13216
10985A198917l56496M38510k7801k68497L53849r8735K41635q6229K41990J79726
10975A816869P01562l21084L23200O3641j01420o9573R6362j12726L3477k75036
10965B155272n4113l77935K86652J8983Q5646m19872N15719o1313m44609J27080
10955A831510j29459m0609l96212r7340O0459l05252l59914M00108C61191K5334
10945C86525o1295J1834E519K38173n0589J69004H5010g8211A21820L21621k04100
10934B39341i857C65180j09237R2273A32479B320M922N2994J2381l2882R5832
$$ plain form
11005 839081 730310 648948 560550 1185835 706329 1033834 813866 1050799 705277 666696
10995 666696 816790 992282 603901 613506 909951 890612 770895 903525 985701 1198917
10985 1198917 842421 1280931 1253130 984633 1338482 1239747 1481382 1395153 1637143 1816869
10975 1816869 2518431 2197347 2520547 2584188 2482768 2413195 2509557 2396831 2430308 2155272
10965 2155272 2101159 1723224 2009876 2028859 2114505 1694633 2210352 2149039 1704430 1831510
10955 1831510 1702051 1661442 1265230 1167890 1228349 923097 563183 963291 361191 386525
10945 386525 325230 337064 5519 243692 193103 362107 85010 -78211 121820 443441 239341
10934 239341 -9857 365180 255943 348216 132479 2320 7242 60236 72617 39735 135567
10923A35567b6694P70n5815B20836K1726b38728a03690A92782J71655D5804K08435
10912B54239d2656B31829c16938J31217h9300j29919e0883k85444a01606a2974
10901B53545a23994p0587K1092A15293c89510i5855C4527K30734a42662A24440
10890a48126a4263A02882b03280B76836O8309F1560L3978j7359j4728k0486a98629
10878H3296a92161A94084f9456q5810m7581L494N8414a7095k0726n5348A2356
10866A53609i1621b9525c354k21232A30586a99423O2824R284r6039a03223j68747
10855b71970A79387a46023j76066b4914k33315A48986L7078k9760b37530g184
10844D79256c18174A38602K2922M9726a29960A00904b51391D048K44b41696H0603
$$ plain form
10923 135567 -26694 -25924 -81739 220836 242562 -238728 -103690 192782 364437 45804 254239
10912 254239 -42656 231829 -316938 -185721 -89300 -219219 -50883 -336327 -101606 -12974
10901 253545 -123994 -194581 -173489 115293 -389510 -95855 34527 265261 -142662 124440
10890 -148126 -14263 102882 -203280 276836 345145 61560 95538 78179 63451 42965 -198629
10878 83296 -192161 194084 -69456 -155266 -202847 -199353 -140939 -17095 -37821 -93169 12356
10866 153609 -91621 -29525 -3354 -224586 130586 -199423 -136599 -127315 -223354 -103223 -271970
10855 -271970 179387 -146023 -322089 -24914 -258229 148986 186064 156304 -237530 -7184
10844 479256 -318174 138602 161524 211250 -129960 100904 -251391 4048 4292 -241696 80603
10832b7095E7667c2628J0026k61750C4355a01941Q38h400j07648D4532a92020
10820E2599b69160E9693k8998c60350D9372J17234e9984l04307a31583k2136A104
10808A30347D9583i1809j13665M1062M7140G452c28835B77998q5361E5316R157
10797F4473b76288A43786a1726A31340a06405d7794O11A09934b6582B27809a04257
10785b49840R4598L7613A60533b56795A13662a06805k6365C14141a42754K7172
10775a15582d6595A2273h2120K328A66786J76734b90442G9119e9703N672B43454
10763G9851A3052c92481H4443b16334i494k26922d8281A66051a8071C03009d35393
10751E5127N9518e1620r0929A93540a99437f5253A85923a35677B38057A8225a73410
$$ plain form
10832 -27095 57667 -32628 -22602 -284352 34355 -101941 -101103 -8400 -116048 44532 -192020
10820 52599 -269160 59693 30695 -360350 49372 166606 -59984 -364291 -131583 -153719 1104
10808 130347 49583 -91809 -205474 -164412 -117272 7452 -328835 277998 192637 55316 64473
10797 64473 -276288 143786 -11726 131340 -106405 -47794 -47183 109934 -26582 227809 -104257
10785 -249840 -155242 -117629 160533 -256795 113662 -106805 -133170 314141 -142754 -115582
10775 -115582 -46595 12273 -82120 -79792 166786 343520 -290442 79119 -59703 -54031 243454
10763 79851 13052 -392481 84443 -216334 -9494 -236416 -48281 166051 -18071 303009 -435393
10751 55127 114645 -51620 -142549 193540 -199437 -65253 185923 -135677 238057 18225 -173410
10739B60292a12344j70230i0363q7045A04117a52440l3336A37062C8014J78362
10729B16376j00337A1055b62358J09638G0814d4768l599A23536l7960K28182A52914
10717a65058H9411k805a39591I0313C1744K69614b07252E9726j9606K80651a48759
10705H8018l3199a54727f38l6211C0401L7024c53943F197f5797l7379A29226m1004
10693H8222a27441l0235m5201L4705l16580J70128j62065a74110J8116p0770Q5650
10682a41114A24455b82251A53130E2002d8746r2791j18092F3188a24500B37K07531
10671B07768C7405R3509b62900f8545F8413c25111a34625r5008A29982i7373k4718
10660a22091m2363G325a1541j77693A57435a25905B51005d986C7701b27973m3333
$$ plain form
10739 260292 -112344 -282574 -90363 -177408 104117 -152440 -185776 137062 38014 216376
10729 216376 116039 11055 -262358 -152720 70814 -44768 -48367 123536 85576 313758 152914
10717 -165058 89411 86606 -139591 90313 31744 301358 -207252 59726 40120 320771 -148759
10705 88018 54819 -154727 -638 -36849 30401 67425 -353943 6197 -65797 -103176 129226 88222
10693 88222 -127441 -157676 -202877 -168172 -484752 -314624 -476689 -174110 -155994 -226764 -141114
10682 -141114 124455 -282251 153130 52002 -48746 -141537 -259629 63188 -124500 237 207768
10671 207768 37405 130914 -262900 -68545 68413 -325111 -134625 -229633 129982 -97373 -122091
10660 -122091 -164454 7325 -11541 -189234 157435 -125905 251005 -4986 37701 -227973 -271306
10649b71306j38427a62205B1409K33893J4020c1499j31114O6813A7353a26870
10638e0085k50292a07868j75105i7565B22342c26034j28217A36589c1913j87253
10628b19166I7803L5903k4135a72439e4889q0920A59128K482d84132a98818O9667
10617a29151j60256a38498B5802b11062B7801f2171r8523f6713F2444b2121r1019
10606a13140k4755L5937A00587J56554H1854b18315G8073g7076n9304p0760A11962
10594b3492k1885D7411b56575a10140m0817D4529R3674d21830H2684E09f5501
10582c04551E2630B2014c23481O3072C68304F1904N6106N737o0462a36405r476
10571a45881A36736E8496A5142b5342B41283h4657I2427h0214F3566B4127a51697
$$ plain form
10649 -271306 -409733 -162205 21409 255302 269322 -31499 -162613 -95800 17353 -126870
10638 -50085 -300377 -107868 -282973 -97565 222342 -326034 -454251 136589 -31913 -219166
10628 -219166 97803 133706 109571 -172439 -54889 -135809 159128 161610 -484132 -198818 -129151
10617 -129151 -289407 -138498 25802 -211062 27801 -62171 -160694 -66713 62444 -22121 -113140
10606 -113140 -137895 -101958 100587 257141 81854 -218315 78073 -77076 -136380 -207140 111962
10594 -23492 -45377 47411 -256575 -110140 -150957 44529 138203 -421830 82684 509 -65501
10582 -304551 52630 22014 -323481 -260409 368304 61904 118010 123747 63285 -136405 -145881
10571 -145881 136736 58496 15142 -25342 241283 -84657 92427 -80214 63566 24127 -151697
10559b04537j13989g8022C6745f8595k22811A18448K21154a28158j6725j54946
10549b99829D6486M8896J62807C3817c12871I5826R8303a28001q7548H8500C3288
10537A2657J22396C1081h4115A85705c79548C7890c5555k0640l4473l5862k76958
10526d03488b9258B21381h44j39209o1847A26678b37134A99686C5040e3145j94539
10515b47684A82181e5683A87209o8839k5626b00254A90464j1037c6487j24088
10505a60575A37775o428K2158a96227i5750F1313a28915A46774C3214a27506o181
10494a33687B25798c45388a01024c7705A29798a15242A70669P6545f9467D5746
10483D46110A306K89608A27077J43514k8638H1805k2543M8820a03016A12882a04518
$$ plain form
10559 -204537 -318526 -78022 36745 -68595 -291406 118448 339602 -128158 -144883 -299829
10549 -299829 46486 95382 258189 33817 -312871 95826 194129 -128001 -215549 88500 33288
10537 12657 135053 31081 -84115 185705 -379548 37890 -35555 -56195 -90668 -126530 -403488
10526 -403488 -29258 221381 -844 -140053 -201900 126678 -237134 199686 35040 -53145 -247684
10515 -247684 182181 -55683 187209 118370 92744 -200254 190464 179427 -36487 -160575
10505 -160575 137775 131347 153505 -196227 -95750 61313 -128915 146774 33214 -127506 -133687
10494 -133687 225798 -345388 -101024 -37705 129798 -115242 170669 247214 -69467 45746
10483 446110 1306 290914 127077 270591 241953 81805 59262 108082 -103016 112882 -104518
10471h6022F4232k7936A38J49253h792G6609d45800F8003k8223c27439c970r9165
10459a03135F3246c91372k4096d3873g882J42C5901b41566D5247b01125Q7702
10448a13423l49626J84510f1126j157j72809K0382h3274A33520b08176k80550
10438d88726H0441a95804G2353j2246L6687A1569a52092A86294a15124C49835
10427a06750A22295B2991M8813K4163J15750F6977a12293e2827q5423A09455b4409
10415A92035n1309a01819H2805a71851A7403K9351c509A83670p9075a30847j92392
10404c23239f7808j92679A22867f4881B62063j28273k3910e8536B20553r3385
10394A27168a76479A37108l616d9029B05327b13697A60359c24188h1285B80419
$$ plain form
10471 -86022 64232 36296 138 149391 -8792 76609 -445800 68003 39780 -327439 -3970 -103135
10459 -103135 63246 -391372 -415468 -43873 -7882 -7740 35901 -241566 45247 -201125 -113423
10448 -113423 -463049 -278539 -61126 -62283 -235092 -214710 -83274 133520 -208176 -488726
10438 -488726 80441 -195804 72353 60107 96794 11569 -152092 186294 -115124 349835
10427 -106750 122295 22991 71804 95967 211717 66977 -112293 -52827 -138250 109455 -24409
10415 192035 140726 -101819 82805 -171851 17403 46754 -3509 183670 104595 -130847 -323239
10404 -323239 -67808 -260487 122867 -64881 262063 133790 109880 -58536 220553 127168
10394 127168 -176479 137108 133492 -49029 205327 -213697 160359 -324188 -81285 280419
10383B22071M1469H0531K75077j65264m8603J23091h8923k5913A8326R1686L60073
10372D70085N0766A33083P2839J21741M4083a06045A29284N78699j21791B5417
10361B12074n6651M2582N8877c7570L669A24109d5217B36324J13015M6136J26369
10350E21844j95076L22366G1701K7080J59568J049J55978j75365J61119A95570
10339D43666j42986j03626k3593D4112a14975c870B34453k3591r0273O89087A26895
10327D95472A47033n9822J32582p6017K13198j18899l4884i9468L5424B52567
10316C78748O7010a09789A87705k2027j892i5557B85120b37180h5794L8895o3823
10305a10722A28493a4258A80602b74468a09283B2863J00186O3346f4133C942L53329
$$ plain form
10383 222071 263540 80531 355608 190344 141741 264832 -88923 -114836 18326 110012 470085
10372 470085 520851 133083 205922 327663 371746 -106045 129284 707983 586192 25417
10361 212074 155423 198005 256882 -37570 -33901 124109 -45217 236324 349339 395475 521844
10350 521844 326768 649134 71701 98781 258349 259398 415376 240011 401130 195570
10339 443666 300680 197054 173461 44112 -114975 -3870 234453 210862 120589 809676 126895
10327 495472 147033 87211 219793 143776 356974 238075 203191 -99468 -64044 252567
10316 378748 445758 -109789 187705 165678 163786 -95557 285120 -237180 -85794 -46899 -110722
10305 -110722 128493 -14258 180602 -274468 -109283 22863 123049 186395 -64133 3942 357271
10294C57271a65274N4244r9773C5647i2938c8959C0338Q4309c01203i6069D1223
10282b16473J5221a4945q0313G152a20939M3943B06726b24117A61560c28042c4772
10270a28444G4777J42992a69554C86142A0780R7261j4197J01771L44636J772r3057
10259D48966J47419k2103A84855J53480r9174I4528K70953n5376i5131k9927l572
10248a28630e3440l23331K8514B02882b23743B41290A12061J14458p8562J34357
10238B82314d30889A50685E7510a02048k04386a25947b9873o8486R400k42755
10228c31714a15600k4360A36848a93954A27057b5595k27606D3013b5570A957P0576
10217G2533c06024g0786b6825r1600G0570K986e9509k34168p8731C6897c43231
$$ plain form
10294 357271 -165274 -111030 -210803 35647 -92938 -38959 30338 114647 -301203 -96069 41223
10282 -216473 -201252 -14945 -95258 7152 -120939 -76996 206726 -224117 161560 -328042 -34772
10270 -128444 74777 217769 -169554 386142 10780 108041 93844 195615 540251 542023 448966
10259 448966 596385 574282 184855 338335 239161 94528 365481 310105 -95131 -125058 -128630
10248 -128630 -53440 -376771 -348257 202882 -223743 241290 112061 226519 147957 282314
10238 282314 -430889 150685 57510 -102048 -306434 -125947 -29873 -98359 -88959 -331714
10228 -331714 -115600 -139960 136848 -193954 127057 -25595 -253201 43013 -25570 1957 72533
10217 72533 -306024 -70786 -26825 -118425 70570 73556 -59509 -293677 -372408 36897 -343231
10205a26743d2165r5107A83218a3449j18519k01935A08202a22809d4176a0816
10194b98120i9448j7486k10178C9320L1424c24964J46219A11058d8250E0839a47216
10182a24875B12499A5237a74732A22674D7884Q5847a76591a8844j44494P6676
10172h6662j3703r0340L9317e5247l7301a6260l0516j11053i019j55564A43519
10160i2089C1556P1452d792j32703j52526A47745a25002J9749I4271b38024J0515
10149b27509c2133h533k9878m347A37000f64C0964i2715k48435A4192b44404G5789
10136B21671i3830A52177C1015i7349q6934M0781b8997a4025A0575a41294c9748
10124A4667b24068A5073b45834g3637l79021J83499B40316A0406i4621a976k68414
$$ plain form
10205 -126743 -42165 -137272 183218 -13449 -131968 -333903 108202 -122809 -44176 -10816
10194 -298120 -99448 -116934 -327112 39320 70744 -324964 -178745 111058 -48250 50839 -147216
10182 -124875 212499 15237 -174732 122674 47884 133731 -176591 -18844 -163338 -86662
10172 -86662 -100365 -190705 -151388 -55247 -92548 -16260 -46776 -157829 -9019 -164583 143519
10160 -92089 31556 103008 -4792 -137495 -290021 147745 -125002 -105253 94271 -238024 -227509
10149 -227509 -32133 -8533 -38411 -42758 137000 -664 30964 -92715 -341150 14192 -244404 75789
10136 221671 -93830 152177 31015 -97349 -184283 -143502 -28997 -14025 10575 -141294 -39748
10124 14667 -224068 15073 -245834 -73637 -452658 -269159 240316 10406 -94621 -1976 -270390
10113b70390B34893h4012n1343A45413B7653b03329B02175d9286j51192g7651
10102a01505H2952Q5176A2110i256k285m9317j14982B0106a78781N1376C00320
10090b25833f0779C2193a51069m7273l280e0628l20880A86190H9422J32190D1815
10078a83710M1957K0905o07m2332C0078b41916l585C147b91173B8687a94377A55510
10065d32976A36051a20063e2434l48283b2121l52134A11945d10815h8933p1124
10055a60057j4467l2944a5911m0258k12657B52902C6489b06770A14012a5031l33262
10044c48293E064a77342M7364A54376J9387F6880L1394F249d1207q6776r2550
10033b20533o6034a00770B22108a53646d2441k26194N4218L3073m8198a00553
$$ plain form
10113 -270390 234893 -84012 -135355 145413 27653 -203329 202175 -49286 -200478 -77651
10102 -101505 82952 168128 12110 -9256 -11541 -60858 -175840 20106 -178781 -127405 300320
10090 -225833 -60779 32193 -151069 -198342 -201622 -50628 -371508 186190 89422 221612 41815
10078 -183710 -141753 -120848 -121455 -163787 30078 -241916 -245501 3147 -291173 28687 -194377 155510
10065 -432976 136051 -120063 -52434 -400717 -22121 -374255 111945 -410815 -88933 -160057
10055 -160057 -174524 -207468 -15911 -56169 -268826 252902 36489 -206770 114012 -15031 -348293
10044 -348293 5064 -177342 -129978 154376 173763 66880 98274 6249 -41207 -127983 -220533
10033 -220533 -286567 -100770 222108 -153646 -42441 -268635 -214417 -181344 -229542 -100553
10022a73187g0663G8680a23030B14036K4453D0992J47560a03475L2718o9070b540
10010A84561a56381p5918A00394h8663B21469D6544c39387R4218Q1643B03211
9999b12303C5508d0151l9951j91420A75406A2085a1560j2017l7463j2168n2553
9988a25761A35752m1137a7048j81626F8896K9078b01114j5005G3961c71847B51700
9976B12013a6252j69221C877J5726c8672l17711F8004A8301c85806a88903h2180
9964G7509a26122K7641B7934a14745a5858p9759q4634G0826b08840b6606j33883
9953a60489j29126A37850b8748n2036l9445K3024E1015a83541I3084k9808K02168
9942B65444B1949e9106I8969B3212a4257A22833b21769K2049J0242k92886a20505
$$ plain form
10022 -173187 -70663 78680 -123030 214036 238489 40992 188552 -103475 -70757 -139827 -2540
10010 184561 -156381 -232299 100394 -88663 221469 46544 -339387 -245169 -163526 203211
9999 -212303 35508 -40151 -80102 -271522 175406 12085 -11560 -23577 -61040 -73208 -125761
9988 -125761 135752 94615 -17048 -198674 68896 97974 -201114 -216119 73961 -371847 251700
9976 212013 -16252 -185473 3877 19603 -38672 -356383 68004 18301 -385806 -188903 -82180
9964 77509 -126122 -98481 27934 -114745 -15858 -95617 -180251 70826 -208840 -26606 -160489
9953 -160489 -289615 137850 -28748 -80784 -120229 -97205 51015 -183541 93084 63276 265444
9942 265444 21949 -59106 98969 23212 -14257 122833 -221769 -199720 -189478 -482364 -120505
9930i6366L2491j25410q6993A41285b08064A40856a1690r8292D8305b2588A14327
9918a58166O9060g127j64989g5382M024A90665c34034B67701h2070l33391a74534
9906a19555O674K0172j13560B01466m6948F782b17130L3638r2871A41023L7104
9895A78127a0240k84263c9483j68492A73325L322J04275b36027f9930b7917B4177
9883E2162b7479C7084a57749F2160l0758J99060a94739d1187j30860G6671a02478
9871H1280a69694c7496j61624N6684N3825A94779F2512D559c57919c4567m4696
9860g9263a094I2700b4102l02954b5910B91914a69542A75382D8066b20631q5164
9849c05795a41705C1205j0614m903b57472a13171e395j24302j10479Q4482M8215
$$ plain form
9930 -96366 -63875 -189285 -276278 141285 -208064 140856 -11690 -109982 48305 -22588 114327
9918 -158166 -89106 -7127 -172116 -75382 -71358 190665 -334034 267701 -82070 -415461 -174534
9906 -119555 -112881 -92709 -206269 201466 154518 6782 -217130 -183492 -276363 141023 178127
9895 178127 -10240 -294503 -39483 -207975 173325 176647 280922 -236027 -69930 -27917 24177
9883 52162 -27479 37084 -157749 62160 31402 230462 -194739 -41187 -172047 76671 -102478
9871 81280 -169694 -37496 -199120 -142436 -88611 194779 62512 4559 -357919 -34567 -79263
9860 -79263 -1094 92700 -24102 -327056 -25910 291914 -169542 175382 48066 -220631 -305795
9849 -305795 -141705 31205 20591 15688 -257472 -113171 -5395 -129697 -240176 -155694 -107479
9838a07479L7671l06066A26765m6405a32520l7798j41773J33549O1537D23868
9827D087d1775m23261a13650A57263d5606j71241F9766a16515m2520f8215A7680
9815a50435g2995l44137D1024b33117L9784h1556j14327e5255C83798A28701e3112
9803A17443h6899A35159M0017i1466j94017J32052m3260A26202j2003m2334a8357
9791f0074n3595e5747I305a34003j0054j17640j56357J28463B13516a19804A88530
9779C7296L1711J00309d2827k00021J2271h6177B67881a99007A06635b00244f7462
9767A09156e2921J1753E1740J22091i1944l1629k06962C4401b55624D8016a33375
9755B29094o7283D451a61266H2321a26033a4143F0956Q1413B611b89295R1948
$$ plain form
9838 -107479 -69808 -375874 126765 80360 -132520 -170318 -312091 -178542 -117005 423868
9827 4087 -41775 -465036 -113650 157263 -45606 -216847 69766 -116515 -159035 -68215 17680
9815 -150435 -72995 -417132 41024 -233117 -193333 -81556 -195883 -55255 383798 128701 -53112
9803 117443 -86899 135159 175176 -91466 -285483 -153431 -196691 126202 114199 71865 -18357
9791 -60074 -113669 -55747 9305 -134003 -144057 -261697 -418054 -289591 213516 -119804 188530
9779 37296 69007 169316 -42827 -242848 -230577 -86177 267881 -199007 106635 -200244 -67462
9767 109156 -52921 -41168 51740 173831 -91944 -123573 -330535 34401 -255624 48016 -133375
9755 229094 161811 4451 -161266 82321 -126033 -14143 60956 142369 2611 -289295 -197347
9744a97347A63003a44456I3531a29889j38495j79131I3398e0749j15381D8422
9733B85332B1355f2047l302j39373A81661G3504b87683G1172K44303J8086a41572
9721a76692d4255j3017l7444j7398p568j90945A14736g0182A8149A237a38357
9709C2788h7070E5161a73119L9203j58824e5070n1205A8101Q59a5611B79419j11919
9697A67500I501b10782i0686L4260j76936B20985a42831e2783g967k65511c6669
9685h0624A2080R9469C0539a26622q4376a4258A33388b8708q7317k43654a78811
9673D306J77312a52977k0553a4524j34135J5545D3493K0665Q401B9690K6123a07051
9660B45224K5433a13583J0129j4372D6172a44839b2635j83076H3939P4646h4817
$$ plain form
9744 -197347 163003 -144456 93531 -129889 -268384 -447515 93398 -50749 -166130 48422
9733 285332 21355 -62047 -65349 -204722 181661 73504 -287683 71172 315475 333561 -141572
9721 -176692 -44255 -57272 -94716 -112114 -119682 -310627 114736 -70182 18149 1237 -138357
9709 32788 -87070 55161 -173119 -133916 -292740 -55070 -106275 18101 18960 -15611 279419 167500
9697 167500 9501 -210782 -90686 -56426 -233362 220985 -142831 -52783 -7967 -273478 -36669
9685 -80624 12080 111549 30539 -126622 -210998 -14258 133388 -28708 -116025 -359679 -178811
9673 4306 181618 -152977 -173530 -14524 -148659 -133114 43493 64158 72559 29690 55813 -107051
9660 245224 270657 -113583 -103454 -117826 46172 -144839 -22635 -205711 83939 158585 -84817
9648b37854k03848K17147M800J02877m06606A29705O9521a04825j25572e7332
9637d85437b09452A7777a21548k62627J12599A2584b42660A10513i6502D0998
9626a06217c5864A90691a50219g4962j73819a4655j42539A71237b77639b4990
9615A17054r063J8042b06342M7699H1055B052a58935j38312i1524L0313j10457
9604a71668b9581k14926D0069a11999l2483m5722K2003K9678j45646B3622J60684
9593A84306a03117k1106a1221A7783K69806p0337b7065D1780b25704M4686C6853
9581A06217b50254i2855B3938h1715j09b6465A51289G3820f9838I354J49996h8043
9568C6695a63129m5555L081P1065J5944n6633B61132N7189b16356N0241d2233
$$ plain form
9648 -237854 -441702 -224555 -219755 -116878 -523484 129705 199226 -104825 -230397 -57332
9637 -485437 -209452 17777 -121548 -384175 -271576 12584 -242660 110513 -96502 40998
9626 -106217 -35864 190691 -150219 -74962 -248781 -14655 -157194 171237 -277639 -24990
9615 117054 107991 126033 -206342 -158643 81055 2052 -158935 -297247 -91524 -61211 -171668
9604 -171668 -29581 -244507 40069 -111999 -144482 -190204 -168201 -138523 -284169 23622 184306
9593 184306 -103117 -124223 -11221 17783 287589 217252 -27065 41780 -225704 -181018 36853
9581 106217 -250254 -92855 23938 -81715 -81824 -26465 151289 73820 -69838 9354 159350 -88043
9568 36695 -163129 -208684 -205603 -134538 -118594 -175227 261132 318321 -216356 -166115 -42233
9556a44038g662l292j91387Q626a0529j10257B58234b65571B18120C7029a62926
9544A99533n079M324j1934G7397J72451j14357c70566e2678j19179M7154b3464
9532b18519Q577A63005b98390B6556e2175n0768j53169a4506A67616J85355j33224
9521B19747b16427a4905j75216P4717O464B70652a26317j82199A19235i9661O840
9510i2821A143b79312B06504m6500E9623b48336C7598J62051h1622D5884M9351
9499I5235f4226k3503j47551F0777a15586B6179g0508J1502G4702a91794A76492
9487A87164O4083J15307b80527A2230b26355j73288d1054j00772r9428H4149i6125
9475b39114g1390A18476J52345c42858a60167D75874a89700e8288A03783f2071
$$ plain form
9556 -144038 -7662 -10954 -202341 -193715 -10529 -120786 258234 -265571 218120 37029 -162926
9544 199533 194454 198778 186844 77397 249848 135491 -370566 -52678 -171857 -124703 -23464
9532 -218519 -209942 163005 -298390 26556 -52175 -102943 -256112 -14506 167616 352971 219747
9521 219747 -216427 -14905 -190121 -115404 -108940 270652 -126317 -308516 119235 -99661 -92821
9510 -92821 1143 -279312 206504 160004 59623 -248336 37598 199649 -81622 45884 95235
9499 95235 -64226 -87729 -235280 60777 -115586 26179 -70508 -59006 74702 -191794 176492
9487 187164 251247 366554 -280527 12230 -226355 -399643 -41054 -141826 -241254 84149 -96125
9475 -239114 -71390 118476 270821 -342858 -160167 475874 -189700 -58288 103783 -62071
9464B0719K62504b7257a3379A23781a19459b0710k80235C4618a25529A38174b19870
9452g8769j80650O8636h0647j68974f6869d566B183d4182k21466A44355a47624
9440h0220m8578A90731H6736d65375c6578j35391q9885g7417a4093A86499a52869
9428c9503B87770c2635A38035I007K19245a21774J2525m3370G7497i8735p8479
9417a77214o6864A85390E6384b43588C2911c7616n1976k5839B20670J41674b63834
9405d7734b1945B30674a28904e6460F5976o057b26323A04598c400p3419K9119
9394d7700k4620D6495c19101a37680d842G0079a12480j16782B3115a46135A07904
9382a57249a5317k66947E5902J06083b9111l8067A13031c0845j22379f9299j85355
$$ plain form
9464 20719 283223 -27257 -13379 123781 -119459 -20710 -300945 34618 -125529 138174 -219870
9452 -78769 -259419 -190783 -80647 -249621 -66869 -4566 2183 -44182 -265648 144355 -147624
9440 -80220 -128798 190731 86736 -465375 -36578 -171969 -261854 -77417 -14093 186499 -152869
9428 -39503 287770 -32635 138035 9007 228252 -121774 -109249 -152619 77497 -98735 -177214
9417 -177214 -244078 185390 56384 -243588 32911 -37616 -89592 -115431 220670 362344 -263834
9405 -47734 -21945 230674 -128904 -56460 65976 59919 -226323 104598 -3400 -76819 -47700
9394 -47700 -72320 46495 -319101 -137680 -4842 70079 -112480 -229262 23115 -146135 107904
9382 -157249 -15317 -282264 55902 161985 -29111 -67178 113031 -30845 -153224 -69299 -254654
9371b54654B35843b23870H4085c90605B37514J8887a38206F5866a1092q9478A62886
9359a17855l0129J0277C4233a90313B60843b32076M2369j18676J02168E4541J04385
9348A58926K385f2652n6503A22434a42789r7733d4178H4643L09582A17535J32412
9337B49947B6761B776d04677J64116G9234c42356A36849a57838L3383M1825A57130
9325c571G4793b0014r1619H6172e9218n2013d0053l7526L5312B93776D7719J7712
9313F5431a86034O0314A53876C2318M8775O9758B8919a77768k10576J73294i4512
9301A27794b11398B33748a16864c5900M363D3388h3238j6620m03372a77634N8717
9290a18917o4684A9659i8682J0452n9663A69508a11921L104F2643b03012j18630
$$ plain form
9371 -254654 235843 -223870 84085 -390605 237514 256401 -138206 65866 -11092 -100570 162886
9359 -117855 -147984 -137707 34233 -190313 260843 -232076 -189707 -308383 -206215 54541 158926
9348 158926 161311 -62652 -119155 122434 -142789 -240522 -44178 84643 394225 117535 249947
9337 249947 26761 2776 -404677 -240561 79234 -342356 136849 -157838 -124455 -82630 157130
9325 -3571 74793 -20014 -111633 86172 -59218 -111231 -40053 -77579 -42267 293776 47719 65431
9313 65431 -186034 -125720 153876 32318 81093 150851 28919 -177768 -388344 -215050 -94512
9301 127794 -211398 233748 -116864 -35900 -31537 43388 -83238 -99858 -503230 -177634 -118917
9290 -118917 -183601 19659 -98682 -88230 -147893 169508 -111921 -108817 62643 -203012 -321642
9279c21642h7430k55402B45115c10574P9112q3537e284p1555l97737a69335g5111
9267b6786j90763j52771h895G5350J18350g4307k36057N1469L6937b5695p7064
9256a02759l5447k7196P1560m6923h491q839A68481e84312A02407a85244K2656
9245a62588A61902a00233A57152b8173l8295l81380f7733A18678E2937a89942
9234A3025n968L53714D6176b09881A82900A6578a02345r8229f2263n9460c2270
9222A78444A0470P4391J13609a93124B43732b4826j97664r1748D5514a74371l14863
9211d89234c8270l6973B96443h8779p5122H3178O8900b63679J23985m10062i9230
9199H7541k2759h6290k21898A39725D5356h8932J0446j03972A64088G6383c89777
$$ plain form
9279 -321642 -87430 -342832 245115 -310574 -231462 -314999 -5284 -76839 -474576 -169335 -75111
9267 -26786 -217549 -370320 -8895 75350 193700 -74307 -310364 -258895 -221958 -25695 -102759
9256 -102759 -138206 -165402 -93842 -140765 -8491 -17330 168481 -584312 102407 -185244 -162588
9245 -162588 161902 -100233 157152 -28173 -66468 -447848 -67733 118678 52937 -189942
9234 13025 7057 360771 46176 -209881 182900 16578 -102345 -200574 -62263 -121723 -32270
9222 178444 10470 84861 198470 -193124 243732 -24826 -222490 -314238 45514 -174371 -489234
9211 -489234 -38270 -75243 296443 -88779 -163901 83178 152078 -263679 -139694 -549756 -99230
9199 87541 64782 -86290 -308188 139725 45356 -88932 -78486 -182458 164088 76383 -389777
9187A72651d03162D25749D7708b83448a15585l9770l9653h0369j65564J7717J7690
9176b10526G1254e12592B28306i5674G235J87070a44529P1018A22794K56726a28012
9164c25553h9525M0118k59485a30924B25541a20227l31565g8680B13489Q7672
9154C01161d5017j97515E1271L8449a44409N1729q3611j71703i0832A32366a12259
9142c782j47845A12249m1992b85569P5127P716d5141k4036m17704B52528c34296
9130a60051k11936N2033A16663a27912n4298D8455J94408e1501m6615k51487e2201
9118B8141K13358b64273H462a66392G8652a92047e8371j57518A4985L5360J15517
9107A65862i941A84614d463A58632a04959B3957G751a88559A54060a50085j9376
$$ plain form
9187 172651 -403162 425749 47708 -283448 -115585 -155355 -195008 -80369 -245933 -228216 -210526
9176 -210526 71254 -512592 228306 -95674 7235 194305 -144529 -73511 122794 379520 -128012
9164 -325553 -89525 -49407 -308892 -130924 225541 -120227 -451792 -78680 213489 301161
9154 301161 -45017 -242532 51271 89720 -144409 -92680 -176291 -347994 -90832 132366 -112259
9142 -3782 -151627 112249 70257 -285569 -210442 -202726 -45141 -69177 -486881 252528 -334296
9130 -160051 -371987 -319954 116663 -127912 -182210 48455 242863 -51501 -98116 -349603 -52201
9118 28141 241499 -264273 8462 -166392 78652 -192047 -58371 -215889 14985 50345 165862
9107 165862 -9941 184614 -4463 158632 -104959 23957 7751 -188559 154060 -150085 -169461
9096a69461D4910a16107n9991k1257A22176f7550k995A34641d00135c1259j34010
9085a65269q9802B991a727l09111b1304C0150a16389j14107O2395h0780l75657
9074d56437b0764k83892e3661F4714f8669l3510l3603A24293m8502b52822E2058
9062a7872F6957i7980m2531j5688P5473A32635C8727D082d3796K0890H3767K38107
9050C21874h8227A55150e9930k7026j99528e9755h684I176a30299N7938o7867
9039a40228q1650g8025L2830A02058i767r7601C69792b06009K5453A81484h7322
9027c5472m8618A26743a00414G545a74011A6929d1388F7795b7352E6282h9962
9015b05254D180f3439a2662q2444j34834O2181g834l7544a5802D332a88576B0097
$$ plain form
9096 -169461 44910 -116107 -176098 -197355 122176 -67550 -70545 134641 -400135 -31259 -165269
9085 -165269 -255071 2991 -1727 -310838 -21304 30150 -116389 -230496 -168101 -80780 -456437
9074 -456437 -20764 -304656 -53661 64714 -68669 -102179 -135782 124293 75791 -252822 52058
9062 -17872 66957 -97980 -140511 -156199 -80726 132635 38727 4082 -43796 -22906 83767 321874
9050 321874 -88227 155150 -59930 -86956 -286484 -59755 -8684 9176 -130299 -72361 -140228
9039 -140228 -221878 -78025 -45195 102058 -9767 -107368 369792 -206009 -180556 181484 -87322
9027 -35472 -84090 126743 -100414 7545 -174011 16929 -41388 67795 -27352 56282 -89962
9015 -205254 4180 -63439 -12662 -95106 -229940 -167759 -7834 -45378 -15802 4332 -188576 20097
9002h1409k573H2549R2823p3366f5302c0288C717K81407a55727C28639A02824
8990b95919c8899j54985A23212a7242m5677K6802H8056k8521b16753g1335H0706
8978i4281j31504g5132d137j32292e7055j93071I5384D0352h388j97361B09886
8966e2540C35238B8827J07369c09073N6669d398j40692J1741B03482a18422K0838
8955i7584b3190B35940J67170j08017a07012j23387j7128A5366c97578J53049
8945b44529B8008J54818G6837i3055F7874d0622B33562G4209J37049r9008K96833
8934D09083I1351K22793A38193c9134B81329m0128J55000A40324R30422M66956
8924A537702O42060K505016N245003D402270B042447I14079C10509J73909M8776
$$ plain form
9002 -81409 -83982 82549 175372 102006 -65302 -30288 3717 285124 -155727 328639 102824
8990 -295919 -38899 -193884 123212 -17242 -62919 -36117 88056 59535 -216753 -71335 80706
8978 -94281 -225785 -75132 -4137 -136429 -57055 -250126 95384 40352 -8388 -205749 209886
8966 -52540 335238 28827 136196 -309073 -252404 -4398 -145090 -133349 203482 -118422 -97584
8955 -97584 -23190 235940 403110 295093 -107012 -230399 -247527 15366 -397578 -244529
8945 -244529 28008 182826 76837 -93055 67874 -40622 233562 74209 211258 112250 409083
8934 409083 91351 314144 138193 -39134 281329 241201 396201 140324 1070746 1537702
8924 1537702 2179762 4684778 9929781 4402270 2042447 914079 310509 484418 533194
8915E33194l702A70109J5514J03059c963B42284K18940k06993a30021R214B59595
8903A06253J89436h5661A08025D6275a89324f5203j31029b4024A82009H9841b62386
8891h6537K5754q5022A90911E291Q907B34c6041B12536B0042b92764C9041O1223
8879A00264A7770a41950A62284a39373B8126K65307a03507A62700J02818b71072
$$ plain form
8915 533194 529492 170109 185623 288682 -3963 242284 461224 254231 -130021 -120807 259595
8903 106253 295689 -85661 108025 46275 -189324 -65203 -196232 -24024 182009 89841 -262386
8891 -86537 -60783 -145805 190911 5291 14198 234 -36041 212536 20042 -292764 39041 100264
8879 100264 17770 -141950 162284 -139373 28126 293433 -103507 162700 265518 -271072
$$ [...]
##END NTUPLES=NMR SPECTRUM
##END=
