
##TITLE=AC1361_QARH12183_6945731_E7gg5MRiDO
##JCAMPDX= 6.0         $$ Bruker NMR JCAMP-DX V2.0
##DATA TYPE= NMR SPECTRUM
##DATA CLASS= NTUPLES
##ORIGIN= BRUKER
##OWNER= Administrator
$$ 1.72 TOPSPIN		Version 2.1
$$ 2012-10-18 13:47:45.475 -0700  Administrator@X
$$ Compression mode = diff/dup
##.OBSERVE FREQUENCY= 400.02188249412
##.OBSERVE NUCLEUS= ^1H
##.ACQUISITION MODE= SIMULTANEOUS (DQD)
##.ACQUISITION SCHEME= undefined
##.AVERAGES= 64
##.DIGITISER RES= 22
##SPECTROMETER/DATA SYSTEM= spect
##.PULSE SEQUENCE= noesygpps1d.comp
##.SOLVENT NAME= COFFEE_meoh
##.SHIFT REFERENCE= INTERNAL, COFFEE_meoh, 1, 14.96058
##AUDIT TRAIL= $$ (NUMBER, WHEN, WHO, WHERE, PROCESS, VERSION, WHAT)
$$ ##TITLE= Audit trail, TOPSPIN		Version 2.1
$$ ##JCAMPDX= 5.01
$$ ##ORIGIN= Bruker BioSpin GmbH
$$ ##OWNER= Administrator
$$ $$ C:\Bruker\TOPSPIN/data/COFFEE/nmr/AC1361_QARH12183_6945731_E7gg5MRiDO/12/pdata/1/auditp.txt
$$ ##AUDIT TRAIL=  $$ (NUMBER, WHEN, WHO, WHERE, PROCESS, VERSION, WHAT)
(   1,<2012-10-13 23:39:27.406 -0500>,<Administrator>,<TOPSPIN>,<go>,<TOPSPIN 2.1>,
      <created by zg
	started at 2012-10-13 23:27:57.031 -0500,
	POWCHK enabled, PULCHK disabled,
       configuration hash MD5:
       6B 1B 68 BB D9 2E 58 E2 7F 35 AD 54 07 DF 0E 41
       data hash MD5: 64K
       EC 30 DF EE 50 39 03 CA 21 54 B4 39 4B 59 8B 8B>)
(   2,<2012-10-13 23:39:30.093 -0500>,<Administrator>,<TOPSPIN>,<proc1d>,<TOPSPIN 2.1>,
      <Start of raw data processing
       efp LB = 0.3 FT_mod = 6 PKNL = 1 PHC0 = 0 PHC1 = 0 SI = 128K 
       data hash MD5: 128K
       13 5A 88 83 E2 F0 C7 F4 11 1E 92 67 AF FC D5 E5>)
(   3,<2012-10-13 23:39:31.250 -0500>,<Administrator>,<TOPSPIN>,<proc1d>,<TOPSPIN 2.1>,
      <pk PHC0 = 5.718384 PHC1 = 0 
       data hash MD5: 128K
       D4 79 5B E7 D2 80 1D E5 26 C1 A1 8A 53 A1 A5 8B>)
(   4,<2012-10-13 23:39:31.484 -0500>,<Administrator>,<TOPSPIN>,<proc1d>,<TOPSPIN 2.1>,
      <abs ABSG = 1 
       data hash MD5: 128K
       62 AB 76 32 EF 2B F6 F5 E1 58 2B 2F 6D 50 58 1A>)
(   5,<2012-10-13 23:39:31.546 -0500>,<Administrator>,<TOPSPIN>,<proc1d>,<TOPSPIN 2.1>,
      <abs ABSG = 2 
       data hash MD5: 128K
       28 59 4B 52 DF 73 27 CD 21 BC 5C 6A 6B 22 26 1F>)
(   6,<2012-10-13 23:39:31.718 -0500>,<Administrator>,<TOPSPIN>,<proc1d>,<TOPSPIN 2.1>,
      <abs ABSG = 3 
       data hash MD5: 128K
       85 90 39 01 C1 F2 52 4D 3F AE E2 A7 76 63 48 89>)
(   7,<2012-10-13 23:39:31.859 -0500>,<Administrator>,<TOPSPIN>,<proc1d>,<TOPSPIN 2.1>,
      <abs ABSG = 4 
       data hash MD5: 128K
       84 0B 93 BD 39 5A 97 39 8B 6D 82 EA 19 35 B4 B1>)
(   8,<2012-10-13 23:39:31.921 -0500>,<Administrator>,<TOPSPIN>,<proc1d>,<TOPSPIN 2.1>,
      <abs ABSG = 5 
       data hash MD5: 128K
       DC 71 9F 44 1B 87 8D A8 BF 0D D9 E2 FC E4 63 E1>)
(   9,<2012-10-13 23:39:32.171 -0500>,<Administrator>,<TOPSPIN>,<audit>,<TOPSPIN 2.1>,
      <user comment:
       ICON-NMR User ID: COFFEE
       data hash MD5: 128K
$$ [...]
##$TP07= 0
##$TPNAME0= <>
##$TPNAME1= <>
##$TPNAME2= <>
##$TPNAME3= <>
##$TPNAME4= <>
##$TPNAME5= <>
##$TPNAME6= <>
##$TPNAME7= <>
##$TPOAL= (0..7)
0.5 0.5 0.5 0.5 0.5 0.5 0.5 0.5
##$TPOFFS= (0..7)
0 0 0 0 0 0 0 0
##$TUNHIN= 0
##$TUNHOUT= 0
##$TUNXOUT= 0
##$USERA1= <user>
##$USERA2= <user>
##$USERA3= <user>
##$USERA4= <user>
##$USERA5= <user>
##$V9= 5
##$VALIST= <valist>
##$VCLIST= <CCCCCCCCCCCCCCC>
##$VD= 0
##$VDLIST= <DDDDDDDDDDDDDDD>
##$VPLIST= <PPPPPPPPPPPPPPP>
##$VTLIST= <TTTTTTTTTTTTTTT>
##$WBST= 2048
##$WBSW= 25
##$XGAIN= (0..3)
0 0 0 0
##$XL= 0
##$YL= 0
##$YMAX_a= 12715203
##$YMIN_a= -9479450
##$ZGOPTNS= <>
##$ZL1= 120
##$ZL2= 120
##$ZL3= 120
##$ZL4= 120
##$ABSF1= 14.96058
##$ABSF2= -5.597602
##$ABSG= 5
##$ABSL= 3
##$ALPHA= 0
##$AQORDER= 0
##$ASSFAC= 0
##$ASSFACI= 0
##$ASSFACX= 0
##$ASSWID= 0
##$AUNMP= <proc_prof1d_extract.lims>
##$AXLEFT= 0
##$AXNAME= <>
##$AXNUC= <1H>
##$AXRIGHT= 0
##$AXTYPE= 0
##$AXUNIT= <>
##$AZFE= 0.1
##$AZFW= 0.1
##$BCFW= 0
##$BC_mod= 0
##$BYTORDP= 0
##$COROFFS= 0
##$CY= 15
##$DATMOD= 1
##$DC= 0
##$DFILT= <>
##$DTYPP= 0
##$F1P= 0
##$F2P= 0
##$FCOR= 0.5
##$FTSIZE= 131072
##$FT_mod= 6
##$GAMMA= 0
##$GB= 0
##$INTBC= 1
##$INTSCL= 1
##$ISEN= 128
##$LB= 0.3
##$LEV0= 0
##$LPBIN= 0
##$MAXI= 10000
##$MC2= 0
##$MEAN= 0
##$ME_mod= 0
##$MI= 0
##$NCOEF= 0
##$NC_proc= -2
##$NLEV= 6
##$NOISF1= 0
##$NOISF2= 0
##$NSP= 0
##$NTH_PI= 0
##$NZP= 0
##$OFFSET= 14.96058
##$PC= 1
##$PHC0= 5.718384
##$PHC1= 0
##$PH_mod= 1
##$PKNL= yes
##$PPARMOD= 0
##$PPDIAG= 0
##$PPIPTYP= 0
##$PPMPNUM= 2147483647
##$PPRESOL= 1
##$PSCAL= 4
##$PSIGN= 0
##$PYNMP= <proc.py>
##$REVERSE= no
##$SF= 400.020009803392
##$SI= 131072
##$SIGF1= 0
##$SIGF2= 0
##$SINO= 400
##$SIOLD= 131072
##$SPECTYP= <>
##$SREGLST= <1H.CDCl3>
##$SSB= 0
##$STSI= 131072
##$STSR= 0
##$SW_p= 8223.68421052631
##$SYMM= 0
##$S_DEV= 0
##$TDeff= 65536
##$TDoff= 0
##$TI= <>
##$TILT= no
##$TM1= 0
##$TM2= 0
##$TOPLEV= 0
##$USERP1= <user>
##$USERP2= <user>
##$USERP3= <user>
##$USERP4= <user>
##$USERP5= <user>
##$WDW= 1
##$XDIM= 131072
##$YMAX_p= 286322595
##$YMIN_p= -13668
##$CURPLOT= <Network HP LaserJet P1505>
##$CURPRIN= <$Network HP LaserJet P1505>
##$DFORMAT= <normdp>
##$LAYOUT= <+/1D_H.xwp>
##$LFORMAT= <normlp>
##$PFORMAT= <normpl>
##$SURQMSG= 1
$$ End of Bruker specific parameters
$$ ---------------------------------
##NTUPLES= NMR SPECTRUM
##VAR_NAME=  FREQUENCY,     SPECTRUM/REAL,   SPECTRUM/IMAG
##SYMBOL=    X,             R,               I
##VAR_TYPE=  INDEPENDENT,   DEPENDENT,       DEPENDENT
##VAR_FORM=  AFFN,          ASDF,            ASDF
##VAR_DIM=   131072,        131072,          131072
##UNITS=     HZ,            ARBITRARY UNITS, ARBITRARY UNITS
##FACTOR=    0.0627417313425164, 1,          1
##FIRST=     8223.62146879497, 285,          -66793
##LAST=      0,             2557,            -66692
##MIN=       0,             -13668,          0
##MAX=       8223.62146879497, 286322595,    0
$$ Real data points
##PAGE= N=1
##DATA TABLE= (X++(R..R)), XYDATA
$$ [...]
64000C51242k181j525j351q49J62Q61Q93J040J898K808K914K640L166M606N670
63985C71994N309M112L598M448N913O961P459P907Q457Q749Q728Q852R378R990
63971D71855J0466J1148J2277J3364J3831J3947J4461J5544J6755J7875J9119
63960F30642K0568K2027K3487K5150K6923K8515L0129L2495L5971M0105M4343
63949I60355M8771N3861N9773O6260P3084Q0312Q8150R6553J04942J12511J18913
63938A863485J24400J29049J32157J32879J31209J27766J22715J15508J05715
63929B984883R3572P9523O3773M6498K8055Q861j0722l0211m9033o6751q2999
63918C065449r7205j08838j17842j24425j28571j30174j29586j27352j23477j17723
$$ y = [351242, 349061, 347536, 346185, 345336, 345498, 346359, 347252, 348292, 350190, 352998, 355912, 358552, 361718, 366324, 371994, 377303, 381415, 385013, 389461, 395374, 402335, 409794, 417701, 426158, 434907, 443635, 452487, 461865, 471855, 482321, 493469, 505746, 519110, 532941, 546888, 561349, 576893, 593648, 611523, 630642, 651210, 673237, 696724, 721874, 748797, 777312, 807441, 839936, 875907, 916012, 960355, 1009126, 1062987, 1122760, 1189020, 1262104, 1342416, 1430566, 1527119, 1632061, 1744572, 1863485, 1987885, 2116934, 2249091, 2381970, 2513179, 2640945, 2763660, 2879168, 2984883, 3078455, 3157978, 3221751, 3268249, 3296304, 3305165, 3294443, 3264232, 3215199, 3148448, 3065449, 2968244, 2859406, 2741564, 2617139, 2488568, 2358394, 2228808, 2101456, 1977979, 1860256]
63908A860256j10580j03153r5867q8153p9776p1570o4362n7849n1312m4889l9347
63897A053398l4939l1215k7863k4975k2488j9924j6947j3970j1937j1373j1668
63886H26099j1494j0234q776q300q504p802n429k448k60J045K300L947N879Q038
63872G84061J0345J2320J3574J4484J5736J7336J8692J9545K0101K0359J9924
63861I66477J8570J6505J4114J1728R588P594N303K524l59l068n958r276j2337
63848A021405j4242j5200j6252j7834j9496k0952k2416k3850k4761k5080k5329
63837G95993k5662k5594k5008k4574k4712k4918k4585k3781k2689k1098j9084
63826E34288j7494j6885j6568j5599j4231j3434j3237j2647j1209r615q588p980
$$ y = [1860256, 1749676, 1646523, 1550656, 1462503, 1382727, 1311157, 1246795, 1188946, 1137634, 1092745, 1053398, 1018459, 987244, 959381, 934406, 911918, 891994, 875047, 861077, 849140, 837767, 826099, 814605, 804371, 795595, 787295, 778791, 770989, 765560, 763112, 762852, 763897, 766197, 770144, 776023, 784061, 794406, 806726, 820300, 834784, 850520, 867856, 886548, 906093, 926194, 946553, 966477, 985047, 1001552, 1015666, 1027394, 1036982, 1044576, 1049879, 1052403, 1052044, 1048976, 1043018, 1033742, 1021405, 1007163, 991963, 975711, 957877, 938381, 917429, 895013, 871163, 846402, 821322, 795993, 770331, 744737, 719729, 695155, 670443, 645525, 620940, 597159, 574470, 553372, 534288, 516794, 499909, 483341, 467742, 453511, 440077, 426840, 414193, 402984, 393369, 384781, 376801]
63814C76801p332o627o112n855n826o004o128n741m810m016l983m460m624m105
63800C01178l348k989l103l247l020k483k016j822j773j707j715j906k112k095
63786B67842j987k138k534k747k594k404k408k275j673j005j015j719k278k069
63772B38996j433j092j170j161p32j42J45nl86p64r87r63p02m40m58p37r26p67
63754B26276l83o6J22K74L40K16Q8L28Q91J182P96J16j21K88Q94J183R34J64q32
63735B32690j378q63M63J567J693J131P45J010J718K329K413J974J609K026L118
63720B52245L845L449K466K000K212K247J652J129J463K270K363J213m38j437
63706B76679j370p86m26m69n35l29J2K50M77R04J387J541J236P00J82j13J67J265
$$ y = [376801, 369469, 362842, 356730, 350875, 345049, 339045, 332917, 327176, 322366, 318350, 314367, 309907, 305283, 301178, 297830, 294841, 291738, 288491, 285471, 282988, 280972, 279150, 277377, 275670, 273955, 272049, 269937, 267842, 265855, 263717, 261183, 258436, 255842, 253438, 251030, 248755, 247082, 246077, 245062, 243343, 241065, 238996, 237563, 236471, 235301, 234140, 233408, 233266, 233411, 233406, 233020, 232256, 231269, 230306, 229604, 229164, 228706, 227969, 227043, 226276, 225893, 225827, 225949, 226223, 226563, 226779, 226867, 227195, 228086, 229268, 230064, 230180, 230059, 230347, 231241, 232424, 233358, 233522, 232690, 231312, 230449, 230912, 232479, 234172, 235303, 236048, 237058, 238776, 241105, 243518, 245492, 247101, 249127, 252245, 256090, 259539, 262005, 264005, 266217, 268464, 270116, 271245, 272708, 274978, 277341, 278554, 278116, 276679, 275309, 274523, 274097, 273628, 273093, 272764, 272776, 273026, 273503, 274407, 275794, 277335, 278571, 279271, 279453, 279340, 279507, 280772]
63688B80772K684L361K776J586Q92J169K112L152L747L490K469J381Q71P91N09
63673C11762j02m80k30K79M20J39o0J81O33Q44O79L71O6l62j015j671k032k161
63655C07261k351k616k652k364k091k124k302k284j964j429p54o4L83M90N08P37
63639B86384J117J388J496J623J929K411K960L408L681L977M535N097N080M452
63625C29538M049M601N830O988P881Q749R520R921J0190J0826J1707J2209J2311
63612D44320J2693J3562J4218J4276J4473J5633J7374J8687J9381K0178K1402
63601F26197K2367K2179K0611J8019J4747J1021P157L644Q40j300l166m967o414
63588G30935p066p077p239q156r579j0805j1514j1980j2674j3878j5502j6908
$$ y = [280772, 283456, 286817, 289593, 291179, 292071, 293240, 295352, 298504, 302251, 305741, 308210, 309591, 310462, 311253, 311762, 311660, 311180, 310950, 311229, 311649, 311788, 311728, 311909, 312542, 313386, 314065, 314436, 314502, 314140, 313125, 311454, 309422, 307261, 304910, 302294, 299642, 297278, 295187, 293063, 290761, 288477, 286513, 285084, 284330, 284266, 284649, 285139, 285647, 286384, 287501, 288889, 290385, 292008, 293937, 296348, 299308, 302716, 306397, 310374, 314909, 320006, 325086, 329538, 333587, 338188, 344018, 351006, 358887, 367636, 377156, 387077, 397267, 408093, 419800, 432009, 444320, 457013, 470575, 484793, 499069, 513542, 529175, 546549, 565236, 584617, 604795, 626197, 648564, 670743, 691354, 709373, 724120, 735141, 742298, 745942, 746782, 745482, 742316, 737349, 730935, 723869, 716792, 709553, 701397, 691818, 681013, 669499, 657519, 644845, 630967, 615465, 598557]
63576E98557j7124j5750j3541j1721j0642r613q063o333n019m006k636o51J458
63563D94916K988L644L718L894M798O386P872Q560Q723R221J0292J1260J1650
63550E87922J1982J3005J4583J5949J6816J7690J9057K0857K2719K4206K4736
63539G89522K3819K1523J8336J4475R884M991P66k341m907p543r894j1243j1623
63526H35765j1710j1900j2211j2821j4046j5841j7929k0243k2679k4591k5272
63515F46522k4858k4066k3102k1609j9729j8323j7804j7497j6537j4844j2907
63504D35246j1146r823r054q593p983p139o363n686m821l898l462l479l184k343
63490C48272j767j979k246j763r52n88l49N75J899K532K282K005K119K181K016
$$ y = [598557, 581433, 565683, 552142, 540421, 529779, 520166, 512103, 505770, 500751, 496745, 494109, 493458, 494916, 497904, 501548, 505266, 509160, 513958, 520344, 528216, 536776, 545499, 554720, 565012, 576272, 587922, 599904, 612909, 627492, 643441, 660257, 677947, 697004, 717861, 740580, 764786, 789522, 813341, 834864, 853200, 867675, 877559, 882550, 883316, 880975, 876068, 868525, 858631, 847388, 835765, 824055, 812155, 799944, 787123, 773077, 757236, 739307, 719064, 696385, 671794, 646522, 621664, 597598, 574496, 552887, 533158, 514835, 497031, 479534, 462997, 448153, 435246, 424100, 414277, 405223, 396630, 388647, 381508, 375145, 369459, 364638, 360740, 357278, 353799, 350615, 348272, 346505, 344526, 342280, 340517, 339565, 338977, 338628, 339203, 341102, 343634, 345916, 347921, 350040, 352221, 354237]
63475C54237K024K133J639N67P8Q47J992K287J717J017L74n14j500k048k053j895
63459C60902j734j368p25l8N06Q54R35Q14Q68J350J956K258K452L154M417N525
63443C82126N928N947O320P325Q552R397R687R932J1000J3225J5880J7786J8506
63430E21611J8678J9093J9808K0271J9938J8574J6302J3695J1574J0316R527Q788
63418G08175Q530R693J2378J5404J7471J8415J9029J9875K0753K1163K0848J9644
63406I11378J7260J3512Q772L938j00k963m928o615q413j0146j1420j2316j3457
63393H84502j5224j7213j8773j9836k0792k1717k2245k2195k1783k1125k0074
63382F63525j8810j7928j7497j6570j4271j1115q518p108o174m847l144j615m86
$$ y = [354237, 356261, 358394, 360033, 360600, 360678, 361525, 363517, 365804, 367521, 368538, 368912, 368398, 366898, 364850, 362797, 360902, 359168, 357800, 357075, 357037, 357543, 358397, 359332, 360146, 361014, 362364, 364320, 366578, 369030, 372184, 376601, 382126, 388054, 394001, 400321, 407646, 416198, 425595, 435282, 445214, 456214, 469439, 485319, 503105, 521611, 540289, 559382, 579190, 599461, 619399, 637973, 654275, 667970, 679544, 689860, 699387, 708175, 716705, 726398, 738776, 754180, 771651, 790066, 809095, 828970, 849723, 870886, 891734, 911378, 928638, 942150, 950922, 954860, 954760, 951797, 946869, 940254, 931841, 921695, 910275, 897959, 884502, 869278, 852065, 833292, 813456, 792664, 770947, 748702, 726507, 704724, 683599, 663525, 644715, 626787, 609290, 592720, 578449, 567334, 558816, 551708, 545534, 540687, 537543, 535928, 535442]
63369E35442M83J636L232N340P545R140R870J0392J1601J3675J6000J7937J9295
63356F61588K0257K1120K2129K3229K4026K4213K3981K3675K3132K1727J9112
63345I08189J5528J1378O960K733o52k947m701o686r070j1353j2952j3631j3621
63332H69175j3654j4698j7111k0083k2256k3043k3025k2980k2890k2208k0758
63321F46469j8973j7226j5330j2929j0189p796o276n624n747o917r321j2214j4139
63308E03788j4275j3266j2356j1954j1496j0539r478q935q912q760p902o393m875
63295C74647m020l958m141l895l076k137j597j597j934k277k369k204k085k264
63281C37093k464k053r13J57K56m81r74n14L06L80m27j037o00L42O03L1l66N1
$$ y = [535442, 535925, 537561, 540793, 546133, 553678, 562818, 572688, 583080, 594681, 608356, 624356, 642293, 661588, 681845, 702965, 725094, 748323, 772349, 796562, 820543, 844218, 867350, 889077, 908189, 923717, 935095, 942055, 944788, 944136, 941189, 936488, 929802, 920732, 909379, 896427, 882796, 869175, 855521, 840823, 823712, 803629, 781373, 758330, 735305, 712325, 689435, 667227, 646469, 627496, 610270, 594940, 582011, 571822, 564026, 557750, 552126, 546379, 539462, 530141, 517927, 503788, 489513, 476247, 463891, 451937, 440441, 429902, 420424, 411489, 402577, 393817, 385915, 379522, 374647, 370627, 366669, 362528, 358633, 355557, 353420, 351823, 350226, 348292, 346015, 343646, 341442, 339357, 337093, 334629, 332576, 331663, 331820, 332076, 331595, 330621, 330107, 330413, 330793, 330366, 329329, 328729, 329071, 329674, 329705, 329339, 329390]
63263C29390P41J111J528K464L265K931J858J546K528L703M118M235M851N702
63249C69971O070O010O056O190O117O229P152Q491R076Q658Q385R274J0991J2533
63235D81203J3424J3796J3808J3609J3616J4220J5323J6419J7108J7328J7205
63224F47059J6966J6834J6853J6864J6755J6586J6415J6125J5661J5146J4637
63213H25901J3860J2476J0534Q419O327L907O40l366p153r702j1034j2157j3785
63200H24867j5372j5860j5025j3561j1967j0077p780n476l384j014K167N855R205
63187G42578J1760J3665J5185J6450J7607J8764J9838K0755K1653K2623K3404
63176I44282K3735K3854K4117K4260K3598K2023K0239J8759J7207J4891J1675
$$ y = [329390, 330131, 331242, 332770, 335234, 338499, 341430, 343288, 344834, 347362, 351065, 355183, 359418, 364269, 369971, 376041, 382051, 388107, 394297, 400414, 406643, 413795, 422286, 431362, 440020, 448405, 457679, 468670, 481203, 494627, 508423, 522231, 535840, 549456, 563676, 578999, 595418, 612526, 629854, 647059, 664025, 680859, 697712, 714576, 731331, 747917, 764332, 780457, 796118, 811264, 825901, 839761, 852237, 862771, 871190, 877517, 881424, 882064, 878698, 871545, 861843, 850809, 838652, 824867, 809495, 793635, 778610, 765049, 753082, 743005, 735225, 729749, 726365, 725351, 727518, 733373, 742578, 754338, 768003, 783188, 799638, 817245, 836009, 855847, 876602, 898255, 920878, 944282, 968017, 991871, 1015988, 1040248, 1063846, 1085869, 1106108, 1124867, 1142074, 1156965, 1168640]
63165A168640P921L891m34n084j0044j5339k0827k6008l0261l3308l5297l6538
63153I67312l7267l7610l7483l6627l4924l2655l0234k7794k5233k2629k0251
63142F24605j8170j6131j3924j1747j0030q996q438p913p158o402o074o141n893
63129D97588m726k968j531q80p18o62n79k56O12J688J988J137J91M50J765K819
63113D95918K893K554K495K567K336J978K032K559L068L170L002K906K953K873
63099E33304K492K059J966K203K368K351K492K828K764K021J437J905K900L070
63085E66160K255J707K241L229L841M095M184L845L210L251M487O000O759P126
63071F22390Q019R213R781R737R928J0533J1034J1532J2700J4369J5536J6078
$$ y = [1168640, 1176561, 1180452, 1180018, 1174934, 1164890, 1149551, 1128724, 1102716, 1072455, 1039147, 1003850, 967312, 930045, 892435, 854952, 818325, 783401, 750746, 720512, 692718, 667485, 644856, 624605, 606435, 590304, 576380, 564633, 554603, 545607, 537169, 529256, 522098, 515696, 509622, 503481, 497588, 492862, 489894, 488363, 487483, 486765, 486103, 485524, 485268, 485880, 487568, 489556, 490693, 490884, 491334, 493099, 495918, 498811, 501365, 503860, 506427, 508763, 510741, 512773, 515332, 518400, 521570, 524572, 527478, 530431, 533304, 535796, 537855, 539821, 542024, 544392, 546743, 549235, 552063, 554827, 556848, 558285, 560190, 563090, 566160, 568415, 570122, 572363, 575592, 579433, 583528, 587712, 591557, 594767, 598018, 602505, 608505, 615264, 622390, 630409, 639622, 649403, 659140, 669068, 679601, 690635, 702167, 714867, 729236, 744772, 760850]
63059G60850J7109J9213K1532K3181K4448K5898K7335K8472K9842L2027L4571
63048A044478L6505L7599L8338L8966L9312L9380L9495L9882M0473M1016M1128
63037A476572M0558L9649L9104L9041L8748L7671L6057L4141L1388K7181K1730
63026A861840J5557Q655R51o768j3424j8949k4066k8805l2272l4030l4791l5243
63014A658655l4899l2671k8341k2931j7696j2997q257k916K711P804J2207J6697
63002A537366K1825K7011L1313L4671L7685M0427M2252M2899M2962M3133M3447
62991A944991M3476M2855M1484L9576L7526L5393L2452K7778K1198J3380M956
62980B285065l970j3431k3193l2885m2108n0446n7733o4260p0147p4585p6345
$$ y = [760850, 777959, 797172, 818704, 841885, 866333, 892231, 919566, 948038, 977880, 1009907, 1044478, 1080983, 1118582, 1156920, 1195886, 1235198, 1274578, 1314073, 1353955, 1394428, 1435444, 1476572, 1517130, 1556779, 1595883, 1634924, 1673672, 1711343, 1747400, 1781541, 1812929, 1840110, 1861840, 1877397, 1886052, 1887003, 1880235, 1866811, 1847862, 1823796, 1794991, 1762719, 1728689, 1693898, 1658655, 1623756, 1591085, 1562744, 1539813, 1522117, 1509120, 1500863, 1497947, 1500658, 1508462, 1520669, 1537366, 1559191, 1586202, 1617515, 1652186, 1689871, 1730298, 1772550, 1815449, 1858411, 1901544, 1944991, 1988467, 2031322, 2072806, 2112382, 2149908, 2185301, 2217753, 2245531, 2266729, 2280109, 2285065, 2281095, 2267664, 2244471, 2211586, 2169478, 2119032, 2061299, 1997039, 1926892, 1852307, 1775962]
62969A775962p5315p2850p0364o8041o5230o1575n7326n2926m8650m4559m0533
62958A118593l6545l2905l0026k7881k6086k4481k3128k1805k0176j8577j7809
62947H39174j7874j7750j6854j5935j5829j6066j5625j4548j3738j3471j3101
62936F68383j2230j1177j0190r079p906p209p158p152o698o135n943n799n045
62923E66662l797k884k698k797k718k619k755k888k660k281k230k451k409k044
62909E29431j992k633l431l673l461l410l640l684l272k670k223k136k587l535
62895D87084m351m268l286k073r65K39J382J746J125L06l5k02o00p90k13O29P45
62878D76473Q2n11n90m65l67k23k61q45j549j349j41P56K49j090j860j647j287
$$ y = [1775962, 1700647, 1627797, 1557433, 1489392, 1424162, 1362587, 1305261, 1252335, 1203685, 1159126, 1118593, 1082048, 1049143, 1019117, 991236, 965150, 940669, 917541, 895736, 875560, 856983, 839174, 821300, 803550, 786696, 770761, 754932, 738866, 723241, 708693, 694955, 681484, 668383, 656153, 644976, 634786, 625707, 617801, 610592, 603434, 596282, 589584, 583449, 577506, 571707, 566662, 562865, 559981, 557283, 554486, 551768, 549149, 546394, 543506, 540846, 538565, 536335, 533884, 531475, 529431, 527439, 524806, 521375, 517702, 514241, 510831, 507191, 503507, 500235, 497565, 495342, 493206, 490619, 487084, 482733, 478465, 475179, 473106, 472141, 472380, 473762, 475508, 476633, 476939, 476904, 476702, 476102, 475312, 475099, 475728, 476473, 476555, 476044, 475454, 474989, 474622, 474399, 474138, 473293, 471744, 470395, 470254, 471010, 471259, 470169, 468309, 466662, 465375]
62861D65375j511k045k130j530p74n63j012j519j410o13M06J257J798J854J299
62846D58882M89J29M52Q88Q45M46J90K49M66P81J216J570J583J267Q53M44N9j58
62828D70651m6L05P05J221J979K704K844K259J488J169J470K118K775L202L300
62813D98144L170L101L386M126N198O309P108P370P179O816O603O829P664Q916
62799E81919J0018J0574J0882J1569J2726J3746J4190J4327J4701J5473J6568
62788G26693J8094K0144K2395K4420K6347K8714L1650L4660L7382M0075M3105
62777A053679M6354M9468N2370N4986N6692N6601N4554N1345M7702M3396L7658
62766A604805L0292K1954J3354M588m504j3630k2088k9489l6006m1815m6601m9960
$$ y = [465375, 463864, 461819, 459689, 458159, 457385, 456822, 455810, 454291, 452881, 452268, 452674, 453931, 455729, 457583, 458882, 459371, 459500, 459952, 460840, 461685, 462131, 462321, 462570, 463036, 463817, 465033, 466603, 468186, 469453, 470306, 470750, 470809, 470651, 470605, 470910, 471615, 472836, 474815, 477519, 480363, 482622, 484110, 485279, 486749, 488867, 491642, 494844, 498144, 501314, 504415, 507801, 511927, 517125, 523434, 530542, 537912, 545091, 551907, 558510, 565339, 573003, 581919, 591937, 602511, 613393, 624962, 637688, 651434, 665624, 679951, 694652, 710125, 726693, 744787, 764931, 787326, 811746, 838093, 866807, 898457, 933117, 970499, 1010574, 1053679, 1100033, 1149501, 1201871, 1256857, 1313549, 1370150, 1424704, 1476049, 1523751, 1567147, 1604805, 1635097, 1657051, 1670405, 1674993, 1670489, 1656859, 1634771, 1605282, 1569276, 1527461, 1480860, 1430900]
62754A430900n2017n3216n3665n3105n1596m9619m7347m4403m0705l7087l4451
62743I13689l2573l0368k7312k4026k1411j9653j8226j6464j4018j1120q487o709
62731F83322n622m590l326k018o61J067L020M331M420L870L843M884O689Q714
62717G07943J0539J1856J2672J3461J4810J6901J9544K2437K5168K7269K8765
62706I11365L0433L3046L6495M0120M3685M7560N1989N6768O1613O6248P0204
62695A449526P3032P4844P6161P7148P7391P6348P3515O8227O0077M9672L8266
62684B194207K6428J3683k13j4406k7846m0326n1992o2336p0473p6195q0001q2253
62672A728277q2962q2268q0506p7750p3907o9358o4910o0908n6926n2583m8256
$$ y = [1430900, 1378883, 1325667, 1272002, 1218897, 1167301, 1117682, 1070335, 1025932, 985227, 948140, 913689, 881116, 850748, 823436, 799410, 777999, 758346, 740120, 723656, 709638, 698518, 690031, 683322, 677700, 673110, 669784, 667766, 667105, 668172, 671192, 675523, 679943, 683813, 687656, 692540, 699229, 707943, 718482, 730338, 743010, 756471, 771281, 788182, 807726, 830163, 855331, 882600, 911365, 941798, 974844, 1011339, 1051459, 1095144, 1142704, 1194693, 1251461, 1313074, 1379322, 1449526, 1522558, 1597402, 1673563, 1750711, 1828102, 1904450, 1977965, 2046192, 2106269, 2155941, 2194207, 2220635, 2234318, 2234105, 2219699, 2191853, 2151527, 2099535, 2037199, 1966726, 1890531, 1810530, 1728277, 1645315, 1563047, 1482541, 1404791, 1330884, 1261526, 1196616, 1135708, 1078782, 1026199, 977943]
62661I77943m4511m1164l7479l3280k9401k6697k4939k3102k0663j8152j6247
62650F62308j4833j3388j1961j1084j0823j0628j0201r815r538q873p662o648
62638E36854o477o591n933m462l163k626k442k074j620j400j353j222j032j051
62624D95408j409j901k131j824j151o12m68l99j1O00J105J558K281L262M234N171
62608E03713O131O731O547O074O395P684Q881R321R817J1450J3855J5680J6394
62595F28673J6878J8193K0415K2792K4575K5544K5919K5896K5263K3670K1226
62584H79044J8470J5587J2141P890L365q47m871r034j3057j6489j9585k2791k5564
62571H24259k6774k6307k5365k4771k3986k2262j9975j8154j7125j6389j5481
$$ y = [977943, 933432, 892268, 854789, 821509, 792108, 765411, 740472, 717370, 696707, 678555, 662308, 647475, 634087, 622126, 611042, 600219, 589591, 579390, 569575, 560037, 551164, 543502, 536854, 530377, 523786, 517853, 513391, 510228, 507602, 505160, 503086, 501466, 500066, 498713, 497491, 496459, 495408, 493999, 492098, 489967, 488143, 486992, 486380, 485912, 485513, 485502, 486102, 487207, 488765, 491046, 494308, 498542, 503713, 509844, 516575, 523122, 529196, 535591, 543275, 552156, 561477, 571294, 582744, 596599, 612279, 628673, 645551, 663744, 684159, 706951, 731526, 757070, 782989, 808885, 834148, 857818, 879044, 897514, 913101, 925242, 933132, 936497, 935650, 930779, 921745, 908688, 892199, 872614, 849823, 824259, 797485, 771178, 745813, 721042, 697056, 674794, 654819, 636665, 619540, 603151, 587670]
62560E87670j4392j3210j1891j0351q581o763n392m927n060m721l305j513m86
62547D97078l23j48M90J042R52N84P24J554K511L075L301L550L974M434M845N337
62531E32980N982O551O836P136Q024R569J1182J2431J3580J4994J6502J7832J9328
62518F82927K1564K4413K7176K9629L2151L4811L7094L8840M0636M2762M4424
62507A056427M4630M3458M1634L9153L5110K9047K1728J4311P204R7p165j4184
62495A311450k0393k5573k9796l3009l4846l4978l3573l1214k8403k5308k2007
62484I92350j8652j5248j1620p800m182r98K074N361Q483J0726J2019J2985J3983
62471I99481J4642J4441J3218J0965P651L639k71l640o931j0754j4918j8749k2151
$$ y = [587670, 573278, 560068, 548177, 537826, 529245, 522482, 517090, 512163, 507103, 502382, 499077, 497564, 497078, 496755, 496607, 497097, 498139, 499091, 499675, 500399, 501953, 504464, 507539, 510840, 514390, 518364, 522798, 527643, 532980, 538962, 545513, 552349, 559485, 567509, 577078, 588260, 600691, 614271, 629265, 645767, 663599, 682927, 704491, 728904, 756080, 785709, 817860, 852671, 889765, 928605, 969241, 1012003, 1056427, 1101057, 1144515, 1186149, 1225302, 1260412, 1289459, 1311187, 1325498, 1332702, 1332799, 1325634, 1311450, 1291057, 1265484, 1235688, 1202679, 1167833, 1132855, 1099282, 1068068, 1039665, 1014357, 992350, 973698, 958450, 946830, 939030, 934848, 933850, 935924, 941285, 949768, 960494, 972513, 985498, 999481, 1014123, 1028564, 1041782, 1052747, 1060398, 1064037, 1063766, 1060126, 1053195, 1042441, 1027523, 1008774, 986623]
62458I86623k5512k8654l0648l1046l0639l0504l0630l0113k8448k6047k3452
62447F70930k0747j7926j5370j3464j1987j0358q423o650n504m921m446l629k271
62434E45234n58Q80J428J185R28J135J263L75j634l916n635o645p164p307p243
62419E12326p396q051q828q922p918o207m590l586l159k983k888k974l272l437
62405D38115l049k234j705j946k578k748k112j150n38m38m70k28L52J045J642
62390D21958K082K318K261J979J869K279K952L201K813K460K867L840M567M820
62376D62266N220O179P137P283O756O557P276Q392Q982Q860Q708R297J0817J2916
62362E76646J5058J6822J8108J9282K0985K3579K6742K9711L1864L3119L3904
$$ y = [986623, 961111, 932457, 901809, 870763, 840124, 809620, 778990, 748877, 720429, 694382, 670930, 650183, 632257, 616887, 603423, 591436, 581078, 572655, 566005, 560501, 555580, 551134, 547505, 545234, 544676, 545556, 546984, 548169, 549097, 550232, 551495, 551870, 550236, 546320, 540685, 534040, 526876, 519569, 512326, 504930, 496879, 488051, 479129, 471211, 465004, 460414, 456828, 453669, 450686, 447798, 444824, 441552, 438115, 435066, 432832, 431127, 429181, 426603, 423855, 421743, 420593, 420055, 419617, 419147, 418919, 419271, 420316, 421958, 424040, 426358, 428619, 430598, 432467, 434746, 437698, 440899, 443712, 446172, 449039, 452879, 457446, 462266, 467486, 473665, 480802, 488085, 494841, 501398, 508674, 517066, 526048, 534908, 543616, 552913, 563730, 576646, 591704, 608526, 626634, 645916, 666901, 690480, 717222, 746933, 778797, 811916, 845820]
62351H45820L4834L6201L7563L7938L6664L3937L0309K5869K0289J3676O815N02
62339A160417m975r592j3336j6473j9628k3158k6642k9291l0664l0759k9804k8279
62327H97816k6822k5626k4153k1956j9485j7582j6353j5226j4024j3223j3112
62316F90254j3306j3334j3141j2843j2535j2469j2903j3470j3382j2486j1573
62305E48812j1217j0894r815q171o873o345o159n710m755l427k225j803k254k751
62291D66413k373j188l2O22J006J410J821K270K856L379L481L269L316L830M419
62276D94499M759M974N175N233N295N863O938P718P719P620Q333R673J0720J1240
62262E95759J1906J3129J4546J5888J7606K0281K3772K7323L0260L2385L3954
$$ y = [845820, 880654, 916855, 954418, 992356, 1029020, 1062957, 1093266, 1119135, 1139424, 1153100, 1159915, 1160417, 1155442, 1145850, 1132514, 1116041, 1096413, 1073255, 1046613, 1017322, 986658, 955899, 926095, 897816, 870994, 845368, 821215, 799259, 779774, 762192, 745839, 730613, 716589, 703366, 690254, 676948, 663614, 650473, 637630, 625095, 612626, 599723, 586253, 572871, 560385, 548812, 537595, 526701, 516886, 508715, 501842, 495497, 489338, 483628, 478873, 475446, 473221, 471418, 469164, 466413, 464040, 462852, 462820, 463442, 464448, 465858, 467679, 469949, 472805, 476184, 479665, 482934, 486250, 490080, 494499, 499258, 504232, 509407, 514640, 519935, 525798, 532736, 540454, 548173, 555793, 564126, 573799, 584519, 595759, 607665, 620794, 635340, 651228, 668834, 689115, 712887, 740210, 770470, 802855, 836809]
62251H36809L5469L7285L9162M0382M0338L8871L5970L1498K5501J8603J1791
62240A191679N756N01m497r771j5438k1103k6252l0721l4669l8074m0487m1429
62228I35495m0893l9378l7443l5343l3024l0402k7710k5325k3252k0989j8257
62217F03479j5648j4000j3162j2082j0252q400p383p061o815o508o229n534l983
62204D86422k186j356j712k214k018j299m79M41J312J538J028P81J677L207M241
62189D89383M614N048N732O106O094O524P909R596J0595J0730J0540J0492J0729
62176E94092J1249J1792J1800J1022J0055R852J0741J2249J3857J5532J7426J9448
62164G49115K1341K3017K4604K6200K7747K9046K9816K9722K8483K6094K2844
$$ y = [836809, 872278, 909563, 948725, 989107, 1029445, 1068316, 1104286, 1135784, 1161285, 1179888, 1191679, 1197435, 1197936, 1193439, 1183668, 1168230, 1147127, 1120875, 1090154, 1055485, 1017411, 976924, 935495, 894602, 855224, 817781, 782438, 749414, 719012, 691302, 665977, 642725, 621736, 603479, 587831, 573831, 560669, 548587, 538335, 529935, 522552, 515491, 508676, 502168, 495939, 490405, 486422, 484236, 482880, 481168, 478954, 476936, 475637, 475158, 475599, 476911, 478449, 479477, 480258, 481935, 485142, 489383, 493997, 499045, 504777, 510883, 516977, 523501, 531410, 541006, 551601, 562331, 572871, 583363, 594092, 605341, 617133, 628933, 639955, 650010, 659862, 670603, 682852, 696709, 712241, 729667, 749115, 770456, 793473, 818077, 844277, 872024, 901070, 930886, 960608, 989091, 1015185, 1038029]
62153A038029J9073J4866J0153N046n9m854r346j3546j7116j9700k1532k3292
62141I77722k5241k6781k7094k6008k4059k1871j9768j7825j6027j4239j2222
62130G46587r850p338n143l565k460j419k92O65J222J524J825K050J986J717J507
62115G29016J277P46K6l75l97o81j677k914l636l889m384n411o338o360n463m449
62099F85091m027l963l289j524N64J816K195K824M396O290P578Q209Q601Q740
62085G23501Q502Q362Q821R431R439R237J0065J2179J4377J5684J6421J7156J7553
62072H80728J7115J6343J6246J6981J7731J7774J7097J6132J5363J5157J5493
62061A062160J5954J6284J6750J7625J8589J9018J8644J7422J5148J1714P681
$$ y = [1038029, 1057102, 1071968, 1082121, 1087167, 1087108, 1082254, 1072908, 1059362, 1042246, 1022546, 1001014, 977722, 952481, 925700, 898606, 872598, 848539, 826668, 806900, 789075, 773048, 758809, 746587, 736737, 729399, 724256, 720691, 718231, 716812, 716520, 717185, 718407, 719931, 721756, 723806, 725792, 727509, 729016, 730293, 731039, 731065, 730690, 730293, 729612, 727935, 725021, 721385, 717496, 713112, 707701, 701363, 695003, 689540, 685091, 681064, 677101, 673812, 672288, 672852, 674668, 676863, 679687, 684083, 690373, 697951, 706160, 714761, 723501, 732003, 740365, 749186, 758617, 768056, 777293, 787358, 799537, 813914, 829598, 846019, 863175, 880728, 897843, 914186, 930432, 947413, 965144, 982918, 1000015, 1016147, 1031510, 1046667, 1062160, 1078114, 1094398, 1111148, 1128773, 1147362, 1166380, 1185024, 1202446, 1217594, 1229308, 1236989]
62050A236989L862M38k971o411r509j2348j5687j9927k4376k7958l0318l1877
62038A059907l3097l4100l4849l5271l5152l4104l1876k8791k5828k3969k3186
62027G19684k2267k0114j7122j4721j3529j2639j1034r028p771p740q374q924
62015E66421r024q573p711o928o583o272n290l797k862l002l408l049k066j333
62001D96523j116r20m94j47k5J73N40P15O00O93J204J440P04o75j871k806m016
61984D90522n408o054n510m591m432n238o376p179p276o464m897l291k459k589
61970D18758l159l544l492l089k538k017j658j536j641j769j529p74J4J61k62
61955C91925m40J04Q74J180J072J035J205J475K011K959L859M124M000M342N360
$$ y = [1236989, 1240851, 1241289, 1238318, 1231907, 1222398, 1210050, 1194363, 1174436, 1150060, 1122102, 1091784, 1059907, 1026810, 992710, 957861, 922590, 887438, 853334, 821458, 792667, 766839, 742870, 719684, 697417, 677303, 660181, 645460, 631931, 619292, 608258, 599230, 591459, 583719, 575345, 566421, 557397, 548824, 541113, 534185, 527602, 521330, 516040, 512243, 509381, 506379, 502971, 499922, 497856, 496523, 495407, 494487, 493993, 493846, 493821, 493994, 494534, 495249, 495849, 496542, 497746, 499186, 499890, 499215, 497344, 494538, 490522, 485114, 479060, 473550, 468959, 464527, 459289, 452913, 445734, 438458, 431994, 427097, 423806, 421347, 418758, 415599, 412055, 408563, 405474, 402936, 400919, 399261, 397725, 396084, 394315, 392786, 392012, 392026, 392187, 391925, 391485, 391589, 392463, 393643, 394715, 395750, 396955, 398430, 400441, 403400, 407259, 411383, 415383, 419725, 425085]
61940D25085O365O885P306Q114R145R986J0583J1019J1136J0819J0330R948R559
61927E46280Q950Q239P625O986O083N001L967K965J870Q16j3p77j711k562k832
61912E90887k530k227k186j914q64P86K343L414M274N381O739P834Q095P387O019
61897F33438M386K727J187o0r74j778k796m103n370o102o114n846o062p057q138
61882E87338q199o856m830l188k509k799l760m825n364n228m889m695m292l211
61868E22693j831j112j410k060k243j853j246n72L32J515K705L578M103M594N368
61853E32561O386P330Q031Q708R670J0923J2169J3068J3439J3394J3360J3649
61841F62688J3870J3144J1213Q936P195N763L782J182j183k763l875m949n880
$$ y = [425085, 431450, 438335, 445641, 453755, 462900, 472886, 483469, 494488, 505624, 516443, 526773, 536721, 546280, 555230, 563469, 571094, 578080, 584163, 589164, 593131, 596096, 597966, 598782, 598769, 597992, 596281, 593719, 590887, 588357, 586130, 583944, 582030, 581166, 581952, 584295, 587709, 591983, 597364, 604103, 611937, 620032, 627419, 633438, 637824, 640551, 641738, 641678, 640704, 638926, 636130, 632027, 626657, 620555, 614441, 608595, 602533, 595476, 587338, 579139, 572283, 567453, 564265, 561756, 558957, 555197, 550372, 545008, 539780, 534891, 530196, 525904, 522693, 520862, 519750, 518340, 516280, 514037, 512184, 510938, 510366, 510698, 512213, 514918, 518496, 522599, 527193, 532561, 538947, 546277, 554308, 563016, 572686, 583609, 595778, 608846, 622285, 635679, 649039, 662688, 676558, 689702, 700915, 709851, 717046, 722809, 726591, 727773, 726590, 723827, 719952, 715003, 709123]
61828G09123o417o502n935m292j716P31K025K274K370K833L421L705L508K756
61814G07884J388m80k546m562o498q480j0614j2762j4472j5295j5297j4985j4654
61801E88627j4019j2809j1375j0358r919r659r167q320p095n560m056l041k581
61788D80668k328k040j778j551j068k26M62L40n63j492j838j726j612j608j563
61773D62077j583j946k457k442j678q86q27j245j301q78o48q70r01j93Q80J650
61757D46752J977J960J346M8j134j180j76P59J010J127J657J997J120r02k688
61742D53673l063k302j675j978k757k995k276j150n05p39j466j810j149J86J033
61727D31027O39l06m30N39J431J353R26J200K004K226J523P47O76J059J168P00
$$ y = [709123, 702706, 696204, 690269, 685977, 684261, 684992, 687017, 689291, 691661, 694494, 697915, 701620, 705128, 707884, 709272, 708792, 706246, 701684, 695186, 686706, 676092, 663330, 648858, 633563, 618266, 603281, 588627, 574608, 561799, 550424, 540066, 530147, 520488, 511321, 503001, 495906, 490346, 486290, 483249, 480668, 478340, 476300, 474522, 472971, 471903, 471677, 472139, 472479, 471916, 470424, 468586, 466860, 465248, 463640, 462077, 460494, 458548, 456091, 453649, 451971, 451085, 450258, 449013, 447712, 446834, 446186, 445316, 444415, 444222, 445102, 446752, 448729, 450689, 452035, 452083, 450949, 449769, 449593, 450352, 451362, 452489, 454146, 456143, 457263, 456361, 453673, 450610, 448308, 446633, 444655, 441898, 438903, 436627, 435477, 434972, 434233, 432767, 430957, 429808, 429994, 431027, 431666, 431360, 430930, 431469, 432900, 434253, 435179, 436379, 438383, 440609, 442132, 442879, 443555, 444614, 445782, 446482]
61711D46482n5n55l86L49Q73M53p39j807k229k248k216k114j944k029k546l167
61695D26122l411l128k456j681j298j754k815l532l241k245j305p52m87m80q10
61680C96727j287j541j448j251j200j241j078n40P9J87m08j049r57k03M09M95
61664C85694M35N55O60O78R76J568J709Q64m04j162j256j075o73O7P63R43R04
61647C91246J273J817J674P35o3l1N16R74J172J080O25M7j33Q4Q7l28n28j13K53
61628D00387l07j592k599k758k279j600j036r10j386k138k671k860k884k666j898
61613C70803o96K46K81n78j715k435k421j983j781k180k892l421l677l861l920
61598C39770l561k846k270k159k303k412k593l016l393l185k351j544j403j836
$$ y = [446482, 446427, 445872, 445486, 445835, 446708, 447161, 446422, 444615, 442386, 440138, 437922, 435808, 433864, 431835, 429289, 426122, 422711, 419583, 417127, 415446, 414148, 412394, 409579, 406047, 402806, 400561, 399256, 398504, 398017, 397537, 396727, 395440, 393899, 392451, 391200, 390000, 388759, 387681, 387141, 387220, 387407, 386999, 385950, 384993, 384790, 385199, 385694, 386129, 386684, 387344, 388022, 388998, 390566, 392275, 393139, 392735, 391573, 390317, 389242, 388569, 388636, 389399, 390342, 391246, 392519, 394336, 396010, 396745, 396682, 396651, 397167, 398141, 399313, 400393, 401018, 401065, 400932, 401016, 401103, 400775, 400247, 400134, 400387, 400080, 398488, 395889, 393131, 390852, 389252, 388216, 387306, 385920, 383782, 381111, 378251, 375367, 372701, 370803, 370107, 370353, 370634, 370056, 368341, 365906, 363485, 361502, 359721, 357541, 354649, 351228, 347551, 343690, 339770, 336209, 333363, 331093, 328934, 326631, 324219, 321626, 318610, 315217, 312032, 309681, 308137, 306734, 304898]
61584C04898k248k304k275k480k759k714k329k021j999j954j547r48n76n41o08
61569B77595o73q88j281j509j182l47M55O25M3p70j059n36L14P32M82L8PN12J164
61550B73722J456J177N48O9J23N66Q43N44j34o07n47j54J80L14L34K53J0k46j55
61531B78296L57Q18O99R2m31n77o48r68j320j238o54mK53K1m42p12m81J44O17
61512B73822M69j52o25o02l44k72m29n70n93n81n06k52J0j61q53j432j183l24
61494B65422J43l30j126j280o94r9L1m7M6K50L26L20M22N84N99M17J76nq0m7m
61473B65024p6j29K62J278K421K886K387J380N04Ok98o78j113j266q59j42K76
61456B71863J82J29O55J438J654J126N74O10R52Q60J09q41j379j253o16J81Q10
$$ y = [304898, 302650, 300346, 298071, 295591, 292832, 290118, 287789, 285768, 283769, 281815, 280268, 279320, 278744, 278203, 277595, 276922, 276034, 274753, 273244, 272062, 271715, 272170, 272795, 272838, 272068, 271009, 270473, 270787, 271519, 272001, 272039, 272046, 272558, 273722, 275178, 276355, 276903, 276972, 277095, 277661, 278504, 279048, 278914, 278307, 277760, 277606, 277786, 278100, 278434, 278687, 278697, 278451, 278296, 278653, 279471, 280170, 280262, 279831, 279254, 278606, 277638, 276318, 275080, 274426, 274422, 274675, 274696, 274254, 273542, 273061, 273205, 273822, 274291, 274139, 273514, 272912, 272568, 272296, 271867, 271297, 270704, 270123, 269617, 269365, 269375, 269214, 268361, 266929, 265746, 265422, 265565, 265235, 264109, 262829, 262135, 262036, 262067, 262020, 262066, 262316, 262642, 262962, 263384, 263968, 264567, 264984, 265160, 265155, 265075, 265028, 265024, 264948, 264819, 265081, 266359, 268780, 271666, 274053, 275433, 275937, 275943, 275645, 274967, 273854, 272588, 271729, 271587, 271863, 272045, 272174, 272829, 274267, 275921, 277047, 277621, 278231, 279183, 280043, 280152, 279311, 277932, 276679, 276063, 276244, 277054]
61439B77054J093J006O81M13N57J169J793J882J424R87J031J429J718J624J201
61424B95062P30N10O26Q29Q64R27J386K007J951Q82l51o58k1P05J091J463J954
61407C09957K025J319L04l67p12j040j167p24m6P8m46q79q34q03j173j441j009
61390C03042j73M18P66J170J236L54q80r41N40K039K068J029L54N32R49J219J584
61373C15306K078K303K137J914J747J330O28J34K07N89Q70R51Q94P78Q92J608
61357C34366K779L666L736L168K425J792J565K097L202M035M076L830M007M371
61343C79115M103L056J910J162P00M96J007K431M040M732M209L253K792K909K878
61328D18793K169J202Q43J271J753J727J568J816K091J513J37q78p14J24O85R07
$$ y = [277054, 278147, 279153, 279834, 280247, 280804, 281973, 283766, 285648, 287072, 288059, 289090, 290519, 292237, 293861, 295062, 295792, 296302, 296928, 297757, 298621, 299548, 300934, 302941, 304892, 305774, 305423, 304765, 304744, 305449, 306540, 308003, 309957, 311982, 313301, 313605, 313238, 312526, 311486, 310319, 309595, 309549, 309627, 309181, 308302, 307468, 306665, 305492, 304051, 303042, 302869, 303287, 304053, 305223, 306459, 306813, 305933, 304992, 305532, 307571, 309639, 310668, 311022, 311554, 312503, 313722, 315306, 317384, 319687, 321824, 323738, 325485, 326815, 327443, 327577, 327784, 328373, 329243, 330194, 331088, 331866, 332758, 334366, 337145, 340811, 344547, 347715, 350140, 351932, 353497, 355594, 358796, 362831, 366907, 370737, 374744, 379115, 383218, 386274, 388184, 389346, 390046, 390542, 391549, 393980, 398020, 402752, 406961, 410214, 413006, 415915, 418793, 420962, 422164, 423007, 424278, 426031, 427758, 429326, 431142, 433233, 434746, 434883, 434005, 433291, 433415, 434100, 435007]
61312D35007J547K994M741N961O209N609M750M443N155O455P395P575P583Q059
61298E13483Q661Q469P261N800M728L787K480R48l56j474k769m084m787m710m399
61283E33038m306m343m410m713n172n145m255l097k498k445k261j632q87l74j15
61268D87385n5j21k7N41J498K430L065L351L241K808K452K576L029L388L669M217
61252E23447M835M708L420J630M28L59J189K252K817K497J624R43P75P62N23J78
61236E52387o0l31p99j198j146p11l00r6j6o4k83l53K84J710L182L830L634L524
61218E63194M397O098P572Q022P657P182O879O556O174O001O114O234O158N941
61204F54179N521M667L498K632K506K923L480M051M573M811M839N284O581Q195
$$ y = [435007, 436554, 439548, 444289, 450250, 456459, 462068, 466818, 471261, 476416, 482871, 490266, 497841, 505424, 513483, 522144, 530613, 537874, 543674, 548402, 552189, 554669, 555617, 555261, 553787, 551018, 546934, 542147, 537437, 533038, 528732, 524389, 519979, 515266, 510094, 504949, 500694, 497597, 495099, 492654, 490393, 488761, 487874, 487500, 487385, 487330, 487209, 487182, 487723, 489221, 491651, 494716, 498067, 501308, 504116, 506568, 509144, 512173, 515561, 519230, 523447, 528282, 532990, 536410, 538040, 538468, 538827, 540016, 542268, 545085, 547582, 549206, 550149, 550924, 551686, 552209, 552387, 552327, 551996, 551197, 549999, 548853, 548142, 547842, 547746, 547730, 547666, 547383, 547030, 547314, 549024, 552206, 556036, 559670, 563194, 567591, 573689, 581261, 589283, 596940, 604122, 611001, 617557, 623731, 629732, 635846, 642080, 648238, 654179, 659700, 664367, 667865, 670497, 673003, 675926, 679406, 683457, 688030, 692841, 697680, 702964, 709545, 717740]
61190G17740R168R237Q926Q640Q215P373O102M590L082J861J019L15m25r02p81
61175G84160m29o16j439k116k086j782j966k735l574m184m805n753o922p835q085
61160G29833p765p442p591q102q472q413q027p446o694o022n908o455p043o955
61146F27498o156n223m561m020l289k408j795j817k366k911l028k861k861l097
61132E81105l123k648j947j362o71N70K248L732M698N467O389P303P882Q198Q730
61117F26571R890J1709J3827J5574J6363J6258J6113J6708J7856J8623J8497J7966
61105H15955J7786J8034J8148J7683J6758J5780J5020J4373J3420J1744R347O662
61093I90710M035J351j521m174n989o989p941r428j1235j2808j3859j4290j3979
$$ y = [717740, 726908, 736145, 745071, 753711, 761926, 769299, 775401, 779991, 783073, 784934, 785953, 786268, 785843, 784941, 784160, 783731, 783115, 781676, 779560, 777474, 775692, 773726, 770991, 767417, 763233, 758428, 752675, 745753, 737918, 729833, 722068, 714626, 707035, 698933, 690461, 682048, 674021, 666575, 659881, 653859, 647951, 641496, 634453, 627498, 621342, 616119, 611558, 607538, 604249, 601841, 600046, 598229, 595863, 592952, 589924, 587063, 584202, 581105, 577982, 575334, 573387, 572025, 571354, 571924, 574172, 577904, 582602, 588069, 594458, 601761, 609643, 617841, 626571, 636461, 648170, 661997, 677571, 693934, 710192, 726305, 743013, 760869, 779492, 797989, 815955, 833741, 851775, 869923, 887606, 904364, 920144, 935164, 949537, 962957, 974701, 984048, 990710, 994745, 996096, 994575, 990401, 984412, 977423, 969482, 960054, 948819, 936011, 922152, 907862, 893883]
61080H93883j3118j2459j2603j3104j2921j1769j0509r949r741q922p219n328
61068G66241l901k723j140R23K735L568L587L727M745O535Q402R826J0806J1595
61054H24926J2380J3250J4232J5234J6121J6989J8196J9910K1751K3130K4025
61043A020144K5151K7151K9779L2150L3789L5168L7107L9915M3311M6928N0522
61032A421115N3696N5975N7434N8964O1487O4859O7952O9988P1589P4129P8210
61021B135398Q3205Q8379R3990J00890J09472J19678J31884J47025J65646J87548
61011C363115K12668K41656K75103L12935L55293M03669M60588N28209O06947
61002F760183O93698P80236Q54639R05887R25609R03492Q24700O80609M86905
$$ y = [893883, 880765, 868306, 855703, 842599, 829678, 817909, 807400, 797451, 787710, 778788, 771569, 766241, 762340, 759617, 758477, 759400, 762135, 765703, 769290, 773017, 777762, 784297, 792699, 802525, 813331, 824926, 837306, 850556, 864788, 880022, 896143, 913132, 931328, 951238, 972989, 996119, 1020144, 1045295, 1072446, 1102225, 1134375, 1168164, 1203332, 1240439, 1280354, 1323665, 1370593, 1421115, 1474811, 1530786, 1588220, 1647184, 1708671, 1773530, 1841482, 1911470, 1983059, 2057188, 2135398, 2218603, 2306982, 2400972, 2501862, 2611334, 2731012, 2862896, 3009921, 3175567, 3363115, 3575783, 3817439, 4092542, 4405477, 4760770, 5164439, 5625027, 6153236, 6760183, 7453881, 8234117, 9088756, 9994643, 10920252, 11823744, 12648444, 13329053, 13815958]
60993A3815958K86562J26894L0043j4433l1959m4484o9524j27477k37546m01078
60983A3332956n91323p64458q84424r40377r43951r13251q60326p90839p09990
60974E934017o24877n41842m64417l94587l34039k83229k40785k05229j76443
60965B668569j54478j37802j23965j11602j00652r1095q2550p4910o8293o2406
60955A660816n6806n1749m7919m5260m2873m0256l7875l6210l4888l3141l0715
60944A203124k8044k5773k4238k3237k2190k0759j9255j8191j7524j6736j5625
60933I71552j4586j4063j4087j4444j4856j4971j4569j3926j3637j3854j3971
60922H14588j3294j1816j0203r147q914r277r738r832r392q532p493o582o121
$$ y = [13815958, 14102520, 14229414, 14259457, 14245024, 14213065, 14168581, 14099057, 13971580, 13734034, 13332956, 12741633, 11977175, 11092751, 10152374, 9208423, 8295172, 7434846, 6644007, 5934017, 5309140, 4767298, 4302881, 3908294, 3574255, 3291026, 3050241, 2845012, 2668569, 2514091, 2376289, 2252324, 2140722, 2040070, 1948975, 1866425, 1791515, 1723222, 1660816, 1604010, 1552261, 1504342, 1459082, 1416209, 1375953, 1338078, 1301868, 1266980, 1233839, 1203124, 1175080, 1149307, 1125069, 1101832, 1079642, 1058883, 1039628, 1021437, 1003913, 987177, 971552, 956966, 942903, 928816, 914372, 899516, 884545, 869976, 856050, 842413, 828559, 814588, 801294, 789478, 779275, 770128, 761214, 751937, 742199, 732367, 722975, 714443, 706950, 700368, 694247]
60909F94247o231o644o938o913o628o145n496m855m464m339m256l997l512k860
60895F20969k236j964k157k466k377j847j347j301j773k615l573m132l717k409
60881E87055j155r33j712k469k292j267j91L83O68J091J596J833J850K139K893
60866E89489L734M362M978N663N951N555N096N328N940N970N321M951N538O736
60852F64612P936Q897R343Q761P219N746N297N746O400P069P995R048R634R402
60838G73105Q591P738P318P528Q107Q454Q227P668P211O994O975P127P170O584
60824H78797N313M132L724L589K558K20k690n266p173q442r221r836j0616j1518
60810H33571j2268j2872j3514j3967j3799j3197j2932j3223j3404j3011j2489
$$ y = [694247, 688016, 681372, 674434, 667521, 660893, 654748, 649252, 644397, 639933, 635594, 631338, 627341, 623829, 620969, 618733, 616769, 614612, 612146, 609769, 607922, 606575, 605274, 603501, 600886, 597313, 593181, 589464, 587055, 585900, 584967, 583255, 580786, 578494, 577227, 577036, 577419, 578087, 579178, 580774, 582607, 584457, 586596, 589489, 593223, 597585, 602563, 608226, 614177, 619732, 624828, 630156, 636096, 642066, 647387, 652338, 657876, 664612, 672548, 681445, 690788, 699549, 706768, 712514, 717811, 723557, 729957, 737026, 745021, 754069, 763703, 773105, 781696, 789434, 796752, 804280, 812387, 820841, 829068, 836736, 843947, 850941, 857916, 865043, 872213, 878797, 884110, 888242, 891966, 895555, 898113, 898333, 895643, 890377, 883204, 874762, 865541, 855705, 845089, 833571, 821303, 808431, 794917, 780950, 767151, 753954, 741022, 727799, 714395, 701384, 688895]
60799F88895j2304j2020j1020r654q841q747q710q340p882p471o852o002n311
60786E75741m914m536m287m815o147p097o612n208m258m172m210l945l862m284
60772E07394m640m323l598l158l272l775m447m926m738l984l550l991m626m484
60758D49882l768l481l838m105l990m035m322l969k551j110q77j643k248k181
60744D07764j787j267m66L82O43J04q01j693k518l144l306l106k964k905k528
60729C82408j840j417j468j416q78l83n41j012j006n40m17r79j581j456o23K06
60713C67057L40m13j643k595k805k564k543k921l202k991k603k618l003l093k403
60698C32000j236k82J69L85N88N51J2o99r68p01m40m82m75j32J51o6l46J02J184
$$ y = [688895, 676591, 664571, 653551, 643897, 635056, 626309, 617599, 609259, 601377, 593906, 587054, 581052, 575741, 570827, 566291, 562004, 557189, 551042, 543945, 537333, 532125, 527867, 523695, 519485, 515540, 511678, 507394, 502754, 498431, 494833, 491675, 488403, 484628, 480181, 475255, 470517, 466533, 462983, 458992, 454366, 449882, 446114, 442633, 438795, 434690, 430700, 426665, 422343, 418374, 415823, 414713, 413836, 412193, 409945, 407764, 405977, 404710, 404244, 404626, 405269, 405373, 404572, 402879, 400361, 397217, 393911, 390805, 387841, 384936, 382408, 380568, 379151, 377683, 376267, 375389, 375006, 374465, 373453, 372447, 371907, 371490, 370511, 368930, 367474, 366851, 367057, 367397, 366984, 365341, 362746, 359941, 357377, 354834, 351913, 348711, 345720, 343117, 340499, 337496, 334403, 332000, 330764, 330482, 330651, 331036, 331624, 332175, 332187, 331488, 330520, 329819, 329379, 328897, 328422, 328290, 328441, 328375, 328029, 328131, 329315]
60679C29315J954J961J782J971K217K005J509J236J214J137R82R25Q53N56K43
60664C49860K26L47K94L64J054J961K040J153M53P61J494J825K078K963M049M202
60648C75124L336K612K659K704J884N71j81NO01R73P97k9j311k448k868k639k348
60631C79442k367k552k609k467k234k061k137k523k912k761j841o35K3k75j108
60616C50983j573j090J40J368J961J823J248N80L4l34n96q08q37m69K18P73Q40
60599C54261N97N05P32J004J013P21L27J03K14M97M85p8p74r29m47J26M55Q26
60581C59638J503K126K225J997J984K229K277K076K172K882L846M715N755P260
60567D02685Q756R420R112Q447P844P109O036M867L823K636R90q50k227k811k846
$$ y = [329315, 331269, 333230, 335012, 336983, 339200, 341205, 342714, 343950, 345164, 346301, 347283, 348208, 349061, 349617, 349860, 350086, 350433, 350727, 351091, 352145, 354106, 356146, 357299, 357752, 358513, 360007, 361832, 363910, 366873, 370922, 375124, 378460, 381072, 383731, 386435, 388319, 388890, 388709, 388714, 389315, 390288, 391085, 391056, 389745, 387297, 384429, 381790, 379442, 377075, 374523, 371914, 369447, 367213, 365152, 363015, 360492, 357580, 354819, 352978, 352343, 352366, 352091, 350983, 349410, 348320, 348460, 349828, 351789, 353612, 354860, 355440, 355474, 355140, 354544, 353736, 352899, 352430, 352648, 353421, 354261, 354858, 355363, 356095, 357099, 358112, 358833, 359160, 359263, 359477, 359974, 360459, 360381, 359607, 358678, 358231, 358357, 358812, 359638, 361141, 363267, 365492, 367489, 369473, 371702, 373979, 376055, 378227, 381109, 384955, 389670, 395425, 402685, 411441, 420861, 429973, 438420, 446264, 453373, 459409, 464276, 468099, 470735, 471725, 470875, 468648, 465837, 462991]
60552D62991k767k836l020k887j803M11K989M765N316N254N424O121P189Q414
60538D95561R490R917R351P982O326M650K904J104m76j547k025j980j594j182
60524E38481j071j222j232q40l85m81j227j936j857j046k79l5J92J266L187M924
60508E36439N636N775O522Q269J0109J1088J1523J2638J5076J8209K1036K3232
60496F85552K5071K6673K7808K8354K8421K7895K6192K2659J7157J0179K562m888
60484I23635j1709j7884k3527k8450l2172l4346l4975l4222l2388l0058k7785
60473F16119k5504k2698j9444j6725j5206j4255j2830j0977r589q908q123o655
60461D45205m976l889l586l734l976m001l576k881k528k857l522l935l895l570
$$ y = [462991, 460224, 457388, 454368, 451481, 449678, 450089, 453078, 457843, 463159, 468413, 473837, 479958, 487147, 495561, 505051, 514968, 524319, 532301, 538627, 543277, 546181, 547285, 546809, 545262, 543237, 541257, 539663, 538481, 537410, 536188, 534956, 534116, 533731, 533250, 532023, 530087, 528230, 527184, 526905, 526870, 527062, 528328, 531515, 536439, 542075, 547850, 554372, 562641, 572750, 583838, 595361, 607999, 623075, 641284, 662320, 685552, 710623, 737296, 765104, 793458, 821879, 849774, 875966, 898625, 915782, 925961, 928523, 923635, 911926, 894042, 870515, 842065, 809893, 775547, 740572, 706350, 673962, 643904, 616119, 590615, 567917, 548473, 531748, 516542, 502287, 489457, 478480, 468891, 459983, 451860, 445205, 440229, 436340, 432754, 429020, 425044, 421043, 417467, 414586, 412058, 409201, 405679, 401744, 397849, 394279]
60447C94279l205l031l153l315l109k530j964j526r35k46n2n80j199j339j310
60432C66785j643k048j804q84PL75K72r7m88m31L66J449K010J807J222N17k94
60415C67121r45r86m81J3K51N08Q52R15O56O52J280K071K367K223K155K255K046
60398C82953J212R7n83m10L56J041J191R47P52Q65J269J821K186J972J242P85
60382C97696J302K446L189L019K349J765J511J662K225K933L440L780M062L877
60368D35256K762J266N83R51J337J039P08J172K090K497K083J277N68L60R41K017
60352D56907K768K880K964L398L609L224L044L754M456L903K601K149K649K490
60338E00796Q29j231k436k858l067l023k693k690l334l874l565k806k431k400
$$ y = [394279, 391074, 388043, 384890, 381575, 378466, 375936, 373972, 372446, 371511, 371265, 371213, 370633, 369434, 368095, 366785, 365142, 363094, 361290, 360406, 360413, 360788, 361060, 360963, 360475, 360044, 360410, 361859, 363869, 365676, 366898, 367415, 367121, 366176, 365190, 364709, 364722, 364973, 365481, 366333, 367248, 367904, 368556, 369836, 371907, 374274, 376497, 378652, 380907, 382953, 384165, 384262, 383679, 383269, 383625, 384666, 385857, 386804, 387556, 388421, 389690, 391511, 393697, 395669, 396911, 397696, 398998, 401444, 404633, 407652, 410001, 411766, 413277, 414939, 417164, 420097, 423537, 427317, 431379, 435256, 438018, 439284, 439867, 440818, 442155, 443194, 443902, 445074, 447164, 449661, 451744, 453021, 453589, 453949, 454890, 456907, 459675, 462555, 465519, 468917, 472526, 475750, 478794, 482548, 487004, 490907, 493508, 495657, 498306, 500796, 501625, 500394, 497958, 495100, 492033, 489010, 486317, 483627, 480293, 476419, 472854, 470048, 467617, 465217]
60324D65217k228k138k706l600l751k839j670r68n68m5N54R98J378J998K922L932
60308D56486M776N378N948O930Q572J0499J1920J2308J1735J0572R119P533N811
60295E67587L760J155j947n220q342j1053j2959j3632j3029j1627r991q400o997
60282D69305o053n761n844n616m573k895j315m32j96j16rk54j138k181k573k187
60266D28162j741j778j990j777j165p70j022j788k551k735k007o95K49J18p24
60251D07786j258j045n51k57k9L61O31M16l6n8O27J668K546K897K554J628O35
60234D18515K00M75J029J334J195P62L69L53P82J334J580J418J043O19K37J17
60218D31362M65J108J627J907K237K733L059K914K516K396K866L866N020N773
$$ y = [465217, 462989, 460851, 458145, 454545, 450794, 447955, 446285, 445317, 444749, 444704, 445258, 446256, 447634, 449632, 452554, 456486, 461262, 466640, 472588, 479518, 488090, 498589, 510509, 522817, 534552, 545124, 554243, 561776, 567587, 571347, 572502, 570555, 565335, 556993, 545940, 532981, 519349, 506320, 494693, 484702, 476302, 469305, 463252, 457491, 451647, 446031, 441458, 438563, 437248, 436816, 436620, 436504, 436495, 436241, 435103, 432922, 430349, 428162, 426421, 424643, 422653, 420876, 419711, 418941, 417919, 416131, 413580, 410845, 408838, 408143, 408392, 408510, 407786, 406528, 405483, 404932, 404675, 404646, 405007, 405638, 406054, 406018, 405960, 406587, 408255, 410801, 413698, 416252, 417880, 418515, 418715, 419190, 420219, 421553, 422748, 423510, 423879, 424232, 425014, 426348, 427928, 429346, 430389, 431008, 431245, 431362, 431827, 432935, 434562, 436469, 438706, 441439, 444498, 447412, 449928, 452324, 455190, 459056, 464076, 469849]
60204D69849N704N004M346M220M568N209O123P080P398O617N194L978L207K497
60190E40994J732J329J510J877J959J796J630J349O74k60r38j218j655k765m174
60175E43840m914m694m323m522m779m058k516j531j822k396j995r31n78j406k438
60160E00937k675k160j506j047p97p10n69m0Q51J557J614J191Q61R75J415J762
60144E01659J586Q31N3lP71J702K246K618L336M352N123N359N306N304N342N139
60128E50724M492L509K605K220K393K636K398J659Q92M41J68j78m34j53P39J652
60112E75763J941J651J379J456J581J403J088J031J257J362J007J81q98j944k745
60097E85513l320l780l941l410k359j741k155k857k587j249P5O32O46M12k06r85
$$ y = [469849, 475553, 480557, 484903, 489123, 493691, 498900, 505023, 512103, 519501, 526118, 531312, 535290, 538497, 540994, 542726, 544055, 545565, 547442, 549401, 551197, 552827, 554176, 554850, 554590, 553652, 552434, 550779, 548014, 543840, 538926, 534232, 529909, 525387, 520608, 516550, 514034, 512503, 510681, 508285, 506290, 505359, 504781, 503375, 500937, 498262, 496102, 494596, 493549, 492752, 492042, 491473, 491433, 492284, 493841, 495455, 496646, 497507, 498482, 499897, 501659, 503245, 504076, 504129, 504126, 504897, 506599, 508845, 511463, 514799, 519151, 524274, 529633, 534939, 540243, 545585, 550724, 555216, 558725, 561330, 563550, 565943, 568579, 570977, 572636, 573528, 573969, 574137, 573959, 573525, 573372, 574111, 575763, 577704, 579355, 580734, 582190, 583771, 585174, 586262, 587293, 588550, 589912, 590919, 591100, 590202, 588258, 585513, 582193, 578413, 574472, 571062, 568703, 566962, 564807, 561950, 559363, 558114, 558189, 558821, 559467, 559879, 559673, 558688]
60081E58688j057r6R99J311J210J587K321K448J635N04m53j384k395l169l571
60066E58578m009m795n650o162o398o622o698o189n051l922l602m246n138n327
60052D84769m531l383k644k351j932j069j75P0m68j178j232l58R29J900K358K645
60036D73350K998L235L219L166L242L186K694J910J159M31l80r97j028o52n31
60021D95002j011j879k839l722m307m433m393m673n195n324m839m297m180m132
60007D39778l498k329j341j077j400j772j811j524j173r00o07k80k36o81j087
59992D20062n67R64K455K853K248J536J302J434J639J857K084K167J973J626J446
59977D45079J585J790J691J355J273J618J792J154mp37o47k41mJ58M25O22O48
$$ y = [558688, 557631, 557535, 558534, 559845, 561055, 562642, 564963, 567411, 569046, 569550, 569097, 567713, 565318, 562149, 558578, 554569, 549774, 544124, 537962, 531564, 524942, 518244, 512055, 507004, 503082, 499480, 495234, 490096, 484769, 480238, 476855, 474211, 471860, 469928, 468859, 468684, 468754, 468286, 467108, 465876, 465518, 466447, 468347, 470705, 473350, 476348, 479583, 482802, 485968, 489210, 492396, 495090, 497000, 498159, 498590, 498210, 497213, 496185, 495533, 495002, 493991, 492112, 489273, 485551, 481244, 476811, 472418, 467745, 462550, 457226, 452387, 448090, 443910, 439778, 436280, 433951, 432610, 431533, 430133, 428361, 426550, 425026, 423853, 422953, 422346, 422066, 421830, 421149, 420062, 419495, 420459, 422914, 425767, 428015, 429551, 430853, 432287, 433926, 435783, 437867, 440034, 442007, 443633, 445079, 446664, 448454, 450145, 451500, 452773, 454391, 456183, 457337, 457333, 456596, 455949, 455708, 455704, 455862, 456287, 456909, 457557]
59960D57557P41J009J210J370J989L100L729L087J810J200J481J674J072M4o76
59945D80397q31n99l11l74r99j909k645l084l284l016k072r27l61l66k44R7j65
59928D59307j417k728k972k213j367r05n68j40K55N93J137K014K906L361L267
59913D60530K985L027L558M202M495M460M532M887N243N383N449N532N352M668
59899E24303L679K723J900J226Q07N54N9p88j445j430j064r14q61m33J34R2m32
59882E28110k43J317L200L857L175K479K716L361L329K437J470J052R39N66j70
59867E57595r58j632k202k453k006r57LL38K39J70J61j9l02k85K13R58J571J807
59849E52241J600J129P27M88J63l93r07j138j363j939k665l102l338l828m510
$$ y = [457557, 458298, 459307, 460517, 461887, 463876, 466976, 470705, 473792, 475602, 476802, 478283, 479957, 481029, 481073, 480397, 479566, 478967, 478656, 478282, 477283, 475374, 472729, 469645, 466361, 463345, 461273, 460346, 459985, 459619, 459375, 459472, 459307, 457890, 455162, 452190, 449977, 448610, 447705, 447137, 446997, 447252, 447845, 448982, 450996, 453902, 457263, 460530, 463515, 466542, 470100, 474302, 478797, 483257, 487789, 492676, 497919, 503302, 508751, 514283, 519635, 524303, 527982, 530705, 532605, 533831, 534638, 535192, 535251, 534463, 533018, 531588, 530524, 529610, 528749, 528316, 528450, 528542, 528110, 527867, 529184, 532384, 536241, 539416, 541895, 544611, 547972, 551301, 553738, 555208, 556260, 557199, 557765, 557595, 556637, 555005, 552803, 550350, 548344, 547387, 547390, 547728, 547967, 548137, 548298, 548279, 547977, 547692, 547905, 548863, 550434, 552241, 553841, 554970, 555697, 556185, 556348, 555955, 555048, 553910, 552547, 550608, 547943, 544841, 541503, 537675, 533165]
59834E33165m821m628m473m653m768m454m021l906l951l677l009k281j757j477
59820D81289j403j394j181o92k81l43q10j234j277r30l88J54N90Q88R18M26n63
59803D73769j406j341m93J09k48j117j572j406j234j621k495l334l633l294k718
59788D47966k392k281j881j023k79k44p69j225j268j004o27l33l56p16j012p98
59772D31758q3P45J363J626J510J259J325J852K422K595K418K145J850J739K271
59757D56795L384M054L443K195J726K385L254L687M098M954N906O357O235N856
59743E14329N466N320N588N973N874N249M812M967N112M460L182K170J935K122
59729E76559K047J354K26q32j491j856k108k027j387o79q04j793k604k504j975
$$ y = [533165, 528344, 523716, 519243, 514590, 509822, 505368, 501347, 497441, 493490, 489813, 486804, 484523, 482766, 481289, 479886, 478492, 477311, 476619, 476338, 475995, 475185, 473951, 472674, 471744, 471356, 471510, 472100, 472988, 473906, 474332, 473769, 472363, 471022, 470529, 470638, 470390, 469273, 467701, 466295, 465061, 463440, 460945, 457611, 453978, 450684, 447966, 445574, 443293, 441412, 440389, 440110, 439866, 439097, 437872, 436604, 435600, 434973, 434640, 434284, 433568, 432556, 431758, 431675, 432420, 433783, 435409, 436919, 438178, 439503, 441355, 443777, 446372, 448790, 450935, 452785, 454524, 456795, 460179, 464233, 467676, 469871, 471597, 473982, 477236, 480923, 485021, 489975, 495881, 502238, 508473, 514329, 519795, 525115, 530703, 536676, 542550, 547799, 552611, 557578, 562690, 567150, 570332, 572502, 574437, 576559, 578606, 579960, 580186, 579354, 577863, 576007, 573899, 571872, 570485, 569806, 569002, 567209, 564605, 562101, 560126]
59714E60126j814j931j755j274r20p05l18M8k48j295k305k440j625m44L99N13
59698E44012M0m30m10lL94O95J094J537J654J277O86K67J30J82K81K94J65o4l85
59679E51416q59j374j551j194o82o30j234k159k936l192k756j954j659k461l846
59664E22929m672m488l828l238k621j862j338j354j479j043j03N86N37O7j95Q
59648D97906M24O82P30Q64J251J485R57k61j259j374j076j254j910k202j820j532
59632D91611j988k678k631j809j036p54n85k37k1k27n51o00n19o58r98j345j824
59615D73150k542l048k837k207j928k118k117j624j067o77J2J194K074J801O43
59600D58709m07r15j179j351j169n71J5K29K11K79M32L72p8o78q91m27L06N81
$$ y = [560126, 558312, 556381, 554626, 553352, 552432, 551727, 551409, 551457, 551209, 549914, 547609, 545169, 543544, 543100, 543499, 544012, 544052, 543622, 543212, 543209, 543603, 544298, 545392, 546929, 548583, 549860, 550546, 550813, 550943, 551125, 551406, 551700, 551865, 551801, 551416, 550557, 549183, 547632, 546438, 545756, 545126, 543892, 541733, 538797, 535605, 532849, 530895, 529236, 526775, 522929, 518257, 513769, 509941, 506703, 504082, 502220, 500882, 499528, 498049, 497006, 496903, 497489, 498026, 498093, 497898, 497906, 498330, 499012, 499742, 500606, 501857, 503342, 504299, 504038, 502779, 501405, 500329, 499075, 497165, 494963, 493143, 491611, 489623, 486945, 484314, 482505, 481469, 480715, 480130, 479893, 479872, 479645, 479094, 478494, 477975, 477317, 476319, 474974, 473150, 470608, 467560, 464723, 462516, 460588, 458470, 456353, 454729, 453662, 452985, 452997, 454191, 456265, 458066, 458709, 458302, 457387, 456208, 454857, 453688, 453117, 453132, 453361, 453572, 453851, 454283, 454655, 454577, 453899, 453008, 452581, 452887, 453468]
59582D53468K14k32l48m70j009j648j808j625j739k233k501k213j726j360r19
59567D33851k40L31M49L61N62J071J399J186N45j54n93o02j96M56J099J523J632
59550D42680J521J457J665K110K545K800L021L495M290N076N429N360N419O087
59536D92955P193Q213Q986R606R675Q339N458K091o00k479l912m733m490l448
59522E32854k411j626o63N67J465J611J274Q71M95K11J87K47j88j316k565l310
59506E27703l591l737l742l458l156l306l859m165l759k933k431k628l144l293
59492D80501k826j986j005J16J120J367O74r8M1R36J608J678J736K302L213M185
59476D93562N154N841N716M843M098M129M627M949M893M494L651K463J431Q01
$$ y = [453468, 453682, 453450, 453102, 452632, 451623, 449975, 448167, 446542, 444803, 442570, 440069, 437856, 436130, 434770, 433851, 433611, 433942, 434391, 434752, 435314, 436385, 437784, 438970, 439515, 439361, 438768, 438166, 437970, 438426, 439525, 441048, 442680, 444201, 445658, 447323, 449433, 451978, 454778, 457799, 461294, 465584, 470660, 476089, 481449, 486868, 492955, 500148, 508361, 517347, 526953, 536628, 544967, 550425, 552516, 551916, 549437, 545525, 540792, 536302, 532854, 530443, 528817, 528154, 528721, 530186, 531797, 533071, 533942, 534437, 534648, 534835, 535082, 534894, 533578, 531013, 527703, 524112, 520375, 516633, 513175, 510019, 506713, 502854, 498689, 494930, 491997, 489566, 486938, 483794, 480501, 477675, 475689, 474684, 474800, 475920, 477287, 477961, 477863, 477904, 478840, 480448, 482126, 483862, 486164, 489377, 493562, 498716, 504557, 510273, 515116, 519214, 523343, 527970, 532919, 537812, 542306, 545957, 548420, 549851, 550652]
59462E50652K32m19n50K85J454J970J859J953K607L407M099M956O055O902P097
59447E92559O949P047P485P785P521O786N940M957L245M24k848n291o363o757
59433F29439p265p682p253n904m474l808l996m445m411l627k526j667q69O42L002
59418E75156N224O421P003Q070R967J2157J4169J5910J7152J7554J7188J6366
59406G22337J4823J1689O613M97m964q280q881p425n457m243l745l085k068j749
59392G06062l320o785j0958j4411j6280j6488j5572j4260j3050j2064j1199j0275
59380E61400r135p752o174m425k625j265q53j173j307p22Q8M44M22M51N11M72
59364E28357P83J923L334L909L512L106L311L693L762L808M386N524O801P775
$$ y = [550652, 550884, 550465, 549915, 550200, 551654, 553624, 555483, 557436, 560043, 563450, 567549, 572505, 578560, 585462, 592559, 599508, 606555, 614040, 621825, 629346, 636132, 642072, 647029, 650274, 650698, 647850, 642559, 636196, 629439, 622174, 614492, 607239, 601335, 596861, 593053, 589057, 584612, 580201, 576574, 574048, 572381, 571512, 572154, 575156, 580380, 586801, 593804, 601874, 611841, 623998, 638167, 654077, 671229, 688783, 705971, 722337, 737160, 748849, 755462, 755959, 750995, 742715, 733834, 726409, 720952, 716709, 712964, 709879, 707811, 706062, 702742, 695957, 684999, 670588, 654308, 637820, 622248, 607988, 594938, 582874, 571675, 561400, 552265, 544513, 538339, 533914, 531289, 530024, 529171, 527998, 526691, 525969, 526057, 526501, 526923, 527374, 527885, 528357, 529140, 531063, 534397, 538306, 541818, 544924, 548235, 551928, 555690, 559498, 563884, 569408, 576209, 583984]
59350E83984Q168Q095Q175Q853R629R632R001Q822R559J0470J0947J1369J2036
59337G08740J2169J0922Q761O907N777M844L727K532J176p22l108n237o423o769
59323G43296p007p824r197j0315j0283r174q053p724p807p416o397n308m437l508
59309F38846k315j074l4Q18J563K234K922L683M285M336L693K453O46j663m021
59294F56372n734o538o773o815o710o403o004n553m838l764k657j920j495r81
59280E90187k28N02J014J479K108K736L104L433M301N824P266P782P326O562O074
59265F49470N984O167O365O100M994L346J968J274Q45P6j187k808m713o653p979
59250F63249q146p362o388n822n733n831n711n097m124l273k844k639k376k113
$$ y = [583984, 592152, 600247, 608422, 617275, 626904, 636536, 645537, 654359, 663918, 674388, 685335, 696704, 708740, 720909, 731831, 740592, 747499, 753276, 758120, 761847, 764379, 765555, 764833, 761725, 756488, 750065, 743296, 736289, 728465, 719268, 708953, 698670, 689496, 681443, 673719, 665912, 658496, 652099, 646791, 642354, 638846, 636531, 635457, 635423, 636241, 637804, 640038, 642960, 646643, 650928, 655264, 658957, 661410, 662056, 660393, 656372, 650638, 644100, 637327, 630512, 623802, 617399, 611395, 605842, 601004, 597240, 594583, 592663, 591168, 590187, 589959, 590461, 591475, 592954, 595062, 597798, 600902, 604335, 608636, 614460, 621726, 629508, 636834, 643396, 649470, 655454, 661621, 667986, 674086, 679080, 682426, 684394, 685668, 686513, 686589, 685402, 682594, 677881, 671228, 663249, 655103, 647741, 641353, 635531, 629798, 623967, 618256, 613159, 609035, 605762, 602918, 600279, 597903, 595790]
59236E95790j977j721j012j7O83P42L84R1K59R39J678J732P75o96j933k801l686
59219E89230m723n524n718n399n030n078n630o124n704m168k393j373j094q01
59205E30471k18J92J08j41r5L42J033J699J843J180K75J11P91J313R37J44j90
59188E39795R0O61J432K305K715K268J612J848L045M169M458M173L848L522L100
59173E79041K873L137L649L882L705L442L373L398L206K647J991J837K562L805
59159F22548M702M762M246L629K973K079R76j19j139k140k987l487l795m275m884
59144F23089n090m626l993l880m305m618m361l773l419l460l536l232k579j976
59130E70241j736j705j413n43P59J992K642K563K071J730J912K507L155L584L693
$$ y = [595790, 593813, 592092, 591080, 591063, 591746, 592488, 592872, 592963, 593222, 594161, 595839, 597571, 598346, 597650, 595717, 592916, 589230, 584507, 578983, 573265, 567866, 562836, 557758, 552128, 546004, 540300, 536132, 533739, 532366, 531272, 530471, 530253, 530445, 530553, 530412, 530317, 530659, 531692, 533391, 535234, 536414, 536689, 536800, 537591, 538904, 539841, 539985, 539795, 539885, 540546, 541978, 544283, 546998, 549266, 550878, 552726, 555771, 559940, 564398, 568571, 572419, 575941, 579041, 581914, 585051, 588700, 592582, 596287, 599729, 603102, 606500, 609706, 612353, 614344, 616181, 618743, 622548, 627250, 632012, 636258, 639887, 642860, 644939, 645915, 645796, 644657, 642517, 639530, 636043, 632248, 627973, 623089, 617999, 613373, 609380, 605500, 601195, 596577, 592216, 588443, 585024, 581564, 578028, 574796, 572217, 570241, 568505, 566800, 565387, 564844, 565603, 567595, 570237, 572800, 574871, 576601, 578513, 581020, 584175, 587759, 591452]
59115E91452L471L114L127L846M766M815L572J889J036J416K429L305L652L408
59101F35298K787K224J944J576O13p37j629j612j130q42r31j216j474j394o74
59086F32803M10R56M02p48j604j997k378k847l082l142l604m626n538n727n421
59071E93857n214n152m868m334l939l831l759l589l530l665l683l340k839k492
59057E39622k221j808j367j229j356j393j263j228j275r91k72L51N18O39J194
59042E27921J770J564O36n8j8K41J47p2R8O24J142J566K016K326K236J921J861
59025E45921K275L006L925N075O377P552Q348Q667Q549Q249Q179Q407Q371P481
59011F40382N995M773M139L479K117J98j539k473k444j734j012q84j202j098p6
$$ y = [591452, 594923, 598037, 601164, 605010, 609776, 614591, 618163, 620052, 621088, 622504, 624933, 628238, 631890, 635298, 638085, 640309, 642253, 643829, 644442, 643705, 642076, 640464, 639334, 638492, 637561, 636345, 634871, 633477, 632803, 633213, 634169, 634571, 633823, 632219, 630222, 627844, 624997, 621915, 618773, 615169, 610543, 605005, 599278, 593857, 588643, 583491, 578623, 574289, 570350, 566519, 562760, 559171, 555641, 551976, 548293, 544953, 542114, 539622, 537401, 535593, 534226, 532997, 531641, 530248, 528985, 527757, 526482, 525491, 525219, 525570, 526088, 526727, 527921, 529691, 531255, 531891, 531833, 531815, 532056, 532203, 532131, 532229, 532853, 533995, 535561, 537577, 539903, 542139, 544060, 545921, 548196, 551202, 555127, 560202, 566579, 574131, 582479, 591146, 599695, 607944, 616123, 624530, 632901, 640382, 646377, 651150, 655289, 658768, 660885, 661083, 659544, 657071, 654627, 652893, 651881, 650997, 649795, 648697, 648621]
58996F48621J255J982K131K449L120L429K876J975J548J674J764J372N68l25q99
58981F73540p93m4P23Q89O15N56R08J247J430K019L411N034N965O126O355P275
58965G15256Q560R385R295Q509P601O962O560O115N497M799M000K895J483J68
58951G97085q00j795l371n428p300q559r300r648r555r168q921q988r015q620
58937F96617p835o916n944m958m180l845l817l650k991j892q09k55k98l68J75
58922F49034J279K246K528K231J764J316R02N77L99L26K86K56J88K9j09%M17J082
58904F64751K019L295M688N770O357O686P035P494P957Q164P848P250P218Q173
58890G54705R250R260Q458Q369R667J1273J1958J1864J1740J1624J1146J0482
$$ y = [648621, 649876, 651858, 653989, 656438, 659558, 662987, 665863, 667838, 669386, 671060, 672824, 674196, 674764, 674439, 673540, 672747, 672703, 673426, 674315, 674930, 675486, 676394, 677641, 679071, 681090, 684501, 689535, 695500, 701626, 707981, 715256, 723816, 733201, 742496, 751005, 758606, 765568, 772128, 778243, 783740, 788539, 792539, 795434, 796917, 797085, 796285, 794490, 791119, 785691, 778391, 769832, 760532, 750884, 741329, 732161, 723240, 714252, 705237, 696617, 688782, 681866, 675922, 670964, 666784, 662939, 659122, 655472, 652481, 650589, 649780, 649525, 649227, 648859, 649034, 650313, 652559, 655087, 657318, 659082, 660398, 661300, 661877, 662276, 662602, 662888, 663144, 663332, 663361, 663252, 663252, 663669, 664751, 666770, 670065, 674753, 680523, 686880, 693566, 700601, 708095, 716052, 724216, 732064, 739314, 746532, 754705, 763955, 773215, 781673, 790042, 799709, 810982, 822940, 834804, 846544, 858168, 869314, 879796]
58878H79796J0063R696Q847P451N749L675J103j614m067o393q747j0555j1127
58865H83877j0738j0233r807r118q356q172q554q758q440p984p578o991o367o355
58851G66426p023p517p215o522o087n901n629n296n101n041n097n440n980o109
58837F82468n331m009l126l354m610o179p178p069o050m888m261m289m550m419
58823F13155l524k152j053n51j61N80J330J605J791K535L450L466K564J925K124
58808F27084K274J502L05k44J51J091K144K741K162M43j179j673j573k153l562
58793F29513m755n037m743m353l836l123k576k589l104l736m122l997l222j965
58779E78355p03J18L83K86J11P4L11R07J680J948R06j361l516m248l812l602m182
$$ y = [879796, 889859, 899555, 908402, 915853, 921602, 925277, 926380, 924766, 920699, 914306, 905559, 895004, 883877, 873139, 862906, 853099, 843981, 835625, 827453, 818899, 810141, 801701, 793717, 786139, 779148, 772781, 766426, 759403, 751886, 744671, 738149, 732062, 726161, 720532, 715236, 710135, 705094, 699997, 694557, 688577, 682468, 677137, 673128, 670002, 666648, 662038, 655859, 648681, 641612, 635562, 630674, 626413, 622124, 617574, 613155, 609631, 607479, 606426, 605875, 605714, 606294, 607624, 609229, 611020, 613555, 617005, 620471, 623035, 624960, 627084, 629358, 630860, 631165, 630921, 631072, 632163, 634307, 637048, 639210, 639653, 638474, 636801, 635228, 633075, 629513, 624758, 619721, 614978, 610625, 606789, 603666, 601090, 598501, 595397, 591661, 587539, 583542, 580320, 578355, 577652, 577770, 578153, 578439, 578550, 578624, 578935, 579842, 581522, 583470, 584376, 583015, 579499, 575251, 571439, 567837, 563655]
58762E63655m588l888k561j681j429j166n92j9L17N67Q92J302J766K148K185J874
58746E58782J653J864K203K152J763J545J764K222K559K465J846J148J208K293
58732E85467L570M049L729L317L105K856K565K495K546K322J895J730J824J654
58718F23124J191J125J766K442K505K344K684L361L510K897K339K634L523M002
58704F59447L400J942L00j031j976k717l591m942o723q224q654q163p869q554
58690F02645r638r883q894p455o474o135o085n984n715n377n198n244n164m517
58676E10882l371k282j661j447j417j450j369r57k69L29O68J058J834K828L517
58661E06893L617L335L083L104L275L160K358R59l94j076j063q34p88r17j080
$$ y = [563655, 559067, 555179, 552618, 550937, 549508, 548342, 547750, 547731, 548048, 548615, 549507, 550809, 552575, 554723, 556908, 558782, 560435, 562299, 564502, 566654, 568417, 569962, 571726, 573948, 576507, 578972, 580818, 581966, 583174, 585467, 589037, 593086, 596815, 600132, 603237, 606093, 608658, 611153, 613699, 616021, 617916, 619646, 621470, 623124, 624315, 625440, 627206, 629648, 632153, 634497, 637181, 640542, 644052, 646949, 649288, 651922, 655445, 659447, 662847, 664789, 665089, 664058, 662082, 659365, 655774, 650832, 644109, 635885, 627231, 619068, 611199, 602645, 593007, 583124, 574230, 566775, 560301, 554166, 548081, 542097, 536382, 531005, 525807, 520563, 515399, 510882, 507511, 505229, 503568, 502121, 500704, 499254, 497885, 496928, 496659, 496988, 497656, 498714, 500548, 503376, 506893, 510510, 513845, 516928, 520032, 523307, 526467, 528825, 529784, 529390, 528314, 527251, 526417, 525629, 524712, 523632]
58646E23632j308j699k127k342k268k046j743j326r60r66j281j283n33N40J136
58631E05426J151J222J710K248K381K212K068J989J867J822K056K486K794K781
58617E34213K504K250K423L198M184M679M409L747L176K848K789L015L296L233
58603E79964K775K338K113J790J209P65P79R36Q09M69J52k28p10r18o12j97l6
58586E91398K75J254K581L556M186M913N587N684N434N633O379O904O889O937
58572F57610P457P934P783P227O859O938P478Q458R536J0114J0155J0526J1961
58559G70036J4073J5819J6662J6791J6478J5761J4724J3577J2353J0712Q215M819
58547I30020J178j652l045l388l633m261m954n315n456n732o274p021p911q846
$$ y = [523632, 522324, 520625, 518498, 516156, 513888, 511842, 510099, 508773, 507813, 506847, 505566, 504283, 503750, 504290, 505426, 506577, 507799, 509509, 511757, 514138, 516350, 518418, 520407, 522274, 524096, 526152, 528638, 531432, 534213, 536717, 538967, 541390, 544588, 548772, 553451, 557860, 561607, 564783, 567631, 570420, 573435, 576731, 579964, 582739, 585077, 587190, 588980, 590189, 590954, 591733, 592669, 593478, 593947, 594099, 593871, 593161, 592243, 591631, 591434, 591398, 591673, 592927, 595508, 599064, 603250, 608163, 613750, 619434, 624868, 630501, 636880, 643784, 650673, 657610, 665067, 673001, 680784, 688011, 694870, 701808, 709286, 717744, 727280, 737394, 747549, 758075, 770036, 784109, 799928, 816590, 833381, 849859, 865620, 880344, 893921, 906274, 916986, 925201, 930020, 931198, 929546, 926501, 923113, 919480, 915219, 910265, 904950, 899494, 893762, 887488, 880467, 872556, 863710]
58533H63710r678j0417j1265j2290j3278j3973j4201j3692j2230j0174q358p156
58521G26998o011m298k338j004n39m12k73l99r74j488j362q12o27j146j858k041
58505G01416j512o63n4j2l61m80K3O24L87o86j345o60O51J154N64j38k72j16N1
58486F98571M90J305K073K671L611N053O252O576O410O453O787P304Q295R743
58472G71594J0694J0319R179Q427Q100P209N276K791L01j979l697m460m477m232
58458H15045l595k104j40J226J705K177L278M526N287N770O464P112O939N708
58444H59398M082K901K262J322p37l552n681o241n921n844n925n186l415j539
58430H25924l99P2M21J118K378L901M886M984M948N571O376O443O125O519P330
$$ y = [863710, 854032, 843615, 832350, 820060, 806782, 792809, 778608, 764916, 752686, 742512, 734154, 726998, 720987, 716689, 714351, 713347, 712808, 712396, 712123, 711724, 710750, 709262, 707900, 707088, 706461, 705315, 703457, 701416, 699904, 699241, 699187, 699175, 698814, 698334, 698357, 698981, 699368, 698682, 697337, 696677, 697328, 698482, 699046, 698908, 698636, 698520, 698571, 699061, 700366, 702439, 705110, 708721, 713774, 720026, 726602, 733012, 739465, 746252, 753556, 761851, 771594, 782288, 792607, 801786, 810213, 818313, 825522, 830798, 833589, 833890, 831911, 828214, 823754, 819277, 815045, 811450, 809346, 809206, 810432, 812137, 814314, 817592, 822118, 827405, 833175, 839639, 846751, 853690, 859398, 863480, 866381, 868643, 869965, 869228, 865676, 859995, 853754, 847833, 841989, 836064, 830878, 827463, 825924, 825525, 825597, 826018, 827136, 829514, 833415, 838301, 843285, 848233, 853804, 860180, 866623, 872748, 879267, 886597]
58415H86597O920M809K576J604J314M74q58j792k217k807l878n013n609n262m026
58400H72832k611j933k051k083j416l64N96J542K570L305L521L626M002M389M458
58385H90383M455M690M926M842M681M867N320N677N953O468P307Q186Q695Q649
58371I75099Q371Q570R522J0529J0725J0295J0154J0494J0654J0416J0393J0904
58359A096126J1499J1896J2450J3291J3935J4119J4078J3694J2523J1054J0708
58348A235373J1839J2919J2472J0913R616R062Q853Q771Q936R448J0483J2232
58336A360917J4136J5095J4912J4736J5476J6717J7772J8755J9851K0575K0667
58325A549609K0730K1118K1134K0310J9446J9344J9451J8851J7787J6993J6457
$$ y = [886597, 893517, 898326, 900902, 902506, 903820, 904294, 903436, 901644, 899427, 896620, 892742, 887729, 882120, 876858, 872832, 870221, 868288, 866237, 864154, 862738, 862374, 862970, 864512, 867082, 870387, 873908, 877534, 881536, 885925, 890383, 894838, 899528, 904454, 909296, 913977, 918844, 924164, 929841, 935794, 942262, 949569, 957755, 966450, 975099, 983470, 992040, 1001562, 1012091, 1022816, 1033111, 1043265, 1053759, 1064413, 1074829, 1085222, 1096126, 1107625, 1119521, 1131971, 1145262, 1159197, 1173316, 1187394, 1201088, 1213611, 1224665, 1235373, 1247212, 1260131, 1272603, 1283516, 1293132, 1302194, 1311047, 1319818, 1328754, 1338202, 1348685, 1360917, 1375053, 1390148, 1405060, 1419796, 1435272, 1451989, 1469761, 1488516, 1508367, 1528942, 1549609, 1570339, 1591457, 1612591, 1632901, 1652347, 1671691, 1691142, 1709993, 1727780, 1744773, 1761230]
58314A761230J6025J6321J7730J9213J9567J9302J9865K1510K3251K4571K5754
58303A984339K6824K7398K7606K8090K9225L1040L3507L6111L7746L8037L8158
58292B338081L9304M0981M1968M2440M3712M6219M9074N1565N3932N6555N9285
58281B863116O1706O3559O5024O6911P0062P4189P8001Q0956Q3968Q7865R2232
58270C687589R6496J00936J05690J09957J13371J16991J21715J26900J31915J37712
58260D849272J45303J53779J61623J68996J77013J85580J93837K02008K10991
58251F448402K20542K29507K37308K43845K48640K51709K54539K58726K64301
58242H657519K70690K78403K88315L00381L14569L31826L52487L75072L98329
$$ y = [1761230, 1777255, 1793576, 1811306, 1830519, 1850086, 1869388, 1889253, 1910763, 1934014, 1958585, 1984339, 2011163, 2038561, 2066167, 2094257, 2123482, 2154522, 2188029, 2224140, 2261886, 2299923, 2338081, 2377385, 2418366, 2460334, 2502774, 2546486, 2592705, 2641779, 2693344, 2747276, 2803831, 2863116, 2924822, 2988381, 3053405, 3120316, 3190378, 3264567, 3342568, 3423524, 3507492, 3595357, 3687589, 3784085, 3885021, 3990711, 4100668, 4214039, 4331030, 4452745, 4579645, 4711560, 4849272, 4994575, 5148354, 5309977, 5478973, 5655986, 5841566, 6035403, 6237411, 6448402, 6668944, 6898451, 7135759, 7379604, 7628244, 7879953, 8134492, 8393218, 8657519, 8928209, 9206612, 9494927, 9795308, 10109877, 10441703, 10794190, 11169262, 11567591]
58233A1567591M22890M48991M74392M97192N19171N43744N71884O02669O36351
58224A6284875O73848P14439P56956Q02183Q51075R01894R52257J003043J057248
58215B3997818J116244J180477J252443J335342J429701J534712J651946J784924
58207C5283607J937164K114346K326394K583333K891125L255545L687417M199286
58199E8278217M799250N491566O278545P156998Q120431R174926J0348991J1677787
58191A21326711J3176096J4819312J6519056J8088183J9244040J9682591J9148946
58184B42004935J7412949J4223445R427507L253759l535365r881505j4919293
58177B57986432j8303306k0151071k0769719k0453390j9442062j7947791j6165722
$$ y = [11567591, 11990481, 12439472, 12913864, 13411056, 13930227, 14473971, 15045855, 15648524, 16284875, 16958723, 17673162, 18430118, 19232301, 20083376, 20985270, 21937527, 22940570, 23997818, 25114062, 26294539, 27546982, 28882324, 30312025, 31846737, 33498683, 35283607, 37220771, 39335117, 41661511, 44244844, 47135969, 50391514, 54078931, 58278217, 63077467, 68569033, 74847578, 82004576, 90125007, 99299933, 109648924, 121326711, 134502807, 149322119, 165841175, 183929358, 203173398, 222855989, 242004935, 259417884, 273641329, 283068836, 286322595, 282787230, 272905725, 257986432, 239683126, 219532055, 198762336, 178308946, 158866884, 140919093, 124753371]
58170A24753371j4269336j2403942j0674630r136559p804462o673590n729586
58163E8061266m947443m296611l751956l295709k911164k582141k298484k055727
58155C1922031j848795j670563j515872j381927j264948j160730j068152r87957
58147B1023087r18344q55355p97198p44618o97516o54674o16208n82924n53492
58138A4602758n25337m97982m72616m48878m25071m01215l78988l58889l40022
58129A0753760l22412l06943k93203k79827k66830k55331k45268k35560k26212
58120H322174k18030k10664k03082j95695j89830j85429j81330j77381j74149
58111F586584j70898j66192j60327j54918j50226j45052j39251j34103j29987
$$ y = [124753371, 110484035, 98080093, 87405463, 78268904, 70464442, 63790852, 58061266, 53113823, 48817212, 45065256, 41769547, 38858383, 36276242, 33977758, 31922031, 30073236, 28402673, 26886801, 25504874, 24239926, 23079196, 22011044, 21023087, 20104743, 19249388, 18452190, 17707572, 17010056, 16355382, 15739174, 15156250, 14602758, 14077421, 13579439, 13106823, 12657945, 12232874, 11831659, 11452671, 11093782, 10753760, 10431348, 10124405, 9831202, 9551375, 9284545, 9029214, 8783946, 8548386, 8322174, 8104144, 7893480, 7690398, 7494703, 7304873, 7119444, 6938114, 6760733, 6586584, 6415686, 6249494, 6089167, 5934249, 5784023, 5638971, 5499720, 5365617, 5235630]
58102E235630j25807j21111j16935j13994j11648j09073j06172j03052r9735r6482
58092D131621r3322q9605q5042q0793p8070p6201p3706p0824o9093o8699o8158
58081C278108o6707o5166o4141o3107o1611n9919n8157n6127n4138n2786n1767
58070B624482n0226m8292m6918m6207m5306m4004m2979m2265m0990l8916l6938
58059B141441l5712l5016l4633l4591l4378l3266l1650l0781l0963l1270l1191
58048A777990l1088l0863k9780k8007k6797k6562k6217k5092k4014k3705k3558
58037A482307k2946k2444k2656k2850k2033k0609j9821k0050k0665k1199k1579
58026A245455k1585k0953k0005j9448j9482j9563j9125j8224j7421j7167j7296
$$ y = [5235630, 5109823, 4988712, 4871777, 4757783, 4646135, 4537062, 4430890, 4327838, 4228103, 4131621, 4038299, 3948694, 3863652, 3782859, 3704789, 3628588, 3554882, 3484058, 3414965, 3346266, 3278108, 3211401, 3146235, 3082094, 3018987, 2957376, 2897457, 2839300, 2783173, 2729035, 2676249, 2624482, 2574256, 2525964, 2479046, 2432839, 2387533, 2343529, 2300550, 2258285, 2217295, 2178379, 2141441, 2105729, 2070713, 2036080, 2001489, 1967111, 1933845, 1902195, 1871414, 1840451, 1809181, 1777990, 1746902, 1716039, 1686259, 1658252, 1631455, 1604893, 1578676, 1553584, 1529570, 1505865, 1482307, 1459361, 1436917, 1414261, 1391411, 1369378, 1348769, 1328948, 1308898, 1288233, 1267034, 1245455, 1223870, 1202917, 1182912, 1163464, 1143982, 1124419, 1105294, 1087070, 1069649, 1052482, 1035186]
58015A035186j7203j6588j5877j5572j5513j5192j4565j3997j3545j2936j2116
58004H72082j1230j0228r133q449q571r002q959q547q388q299p513o210n549n935
57990G56069o455o441o475p329q845j0440j1870j2906j3032j2135j0896r938r226
57977F30081q629q427q645q604p801o755o298o415o417n926n186m541m133l965
57963E38339l937l834l515l020k443j898j551j473j526j640k055k830l471l597
57949E01549l702m455n423n503m523l415k674j798n33M29N87M65O83J014J044
57934D73745J057J443J891J896J627J572J673J495R29J37r50k449m073n361o186
57919D68446o652o712o355n955n951o286o525o386n887n135m322l810l840m225
$$ y = [1035186, 1017983, 1001395, 985518, 969946, 954433, 939241, 924676, 910679, 897134, 884198, 872082, 860852, 850624, 841491, 833042, 824471, 815469, 806510, 797963, 789575, 781276, 773763, 767553, 762004, 756069, 749614, 743173, 736698, 729369, 720524, 710084, 698214, 685308, 672276, 660141, 649245, 639307, 630081, 621452, 613025, 604380, 595776, 587975, 581220, 574922, 568507, 562090, 556164, 550978, 546437, 542304, 538339, 534402, 530568, 527053, 524033, 521590, 519692, 518141, 516668, 515142, 513502, 511447, 508617, 505146, 501549, 497847, 493392, 487969, 482466, 477943, 474528, 471854, 470056, 469523, 469952, 470539, 471004, 471687, 472701, 473745, 474802, 476245, 478136, 480032, 481659, 483231, 484904, 486399, 487328, 487465, 486515, 484066, 479993, 474632, 468446, 461794, 455082, 448727, 442772, 436821, 430535, 424010, 417624, 411737, 406602, 402280, 398470, 394630, 390405]
57905C90405m446m089l138j977j151r46j192j584k020k410k411j786r03l54j66
57890C61832J32P81J588K261K402J462m90k228k525j764j340j600j595r97p76
57875C57143j482k173j906j200j125j824k792l802m651m660l502j998j271j459
57861C23298j941k346k502k004p21O31J258J303J398J661J855K113K551K629J875
57846C31058R34Q97J694K209J867J153N16j61q56j120q22m35k86j77n8m00j380
57829C34633k292k301j467n44M6N80J450K570L486L835L557K792J828J153J184
57814C50510J735J976J267j21j474k572l587m295m249l735l627m093m334l939
57800C19462l565l686l713l115k544k792l319k936j617m96k59n19p35p67n45J6
$$ y = [390405, 385959, 381870, 378732, 376755, 375604, 374658, 373466, 371882, 369862, 367452, 365041, 363255, 362352, 361998, 361832, 361964, 362745, 364333, 366594, 368996, 370458, 369968, 367740, 365215, 363451, 362111, 360511, 358916, 357919, 357143, 355661, 353488, 351582, 350382, 349257, 347433, 344641, 340839, 336188, 331528, 328026, 326028, 324757, 323298, 321357, 319011, 316509, 314505, 313784, 314415, 315673, 316976, 318374, 320035, 321890, 324003, 326554, 329183, 331058, 331992, 332889, 334583, 336792, 338659, 339812, 340328, 340167, 339311, 338191, 337369, 336934, 336648, 336471, 336413, 336013, 334633, 332341, 330040, 328573, 328029, 328075, 328655, 330105, 332675, 336161, 339996, 343553, 346345, 348173, 349326, 350510, 352245, 354221, 355488, 355367, 353893, 351321, 347734, 343439, 339190, 335455, 331828, 327735, 323401, 319462, 315897, 312211, 308498, 305383, 302839, 300047, 296728, 293792, 292175, 291679, 291420, 290901, 290166, 289399, 288854, 288870]
57784B88870O40R01Q49Q75J019J035J023J335J907K393K863L577M162L896K871
57769C18216K105K162K423K101J314P59O94O98K16q04j782k035j582j248j590
57754C21647k099j971j402j294j748j813r30K06O71N64O13R82J044L18q55j663
57738C12270j682j209p77m96j40J83K1n54o85J74J320J677J194O28K47l39j102
57721C10730j362q83l54m35r48j293j263j048r10j027j352j519j226p40o29r45
57705B94796j214j229j278j488j566j389j218j151q20J5J014J670J787J417P48
57690B90094K32L16Q04R08K25p05j032m31Q38K314L552M281M654N165O207P920
57674C25342J0289J2980J5262J6703J7949K0073K3126K5969K7611K7896K6634
$$ y = [288870, 289510, 290411, 291260, 292135, 293154, 294189, 295212, 296547, 298454, 300847, 303710, 307287, 311449, 315345, 318216, 320321, 322483, 324906, 327007, 328321, 329080, 329774, 330472, 330688, 329884, 328102, 326067, 324485, 323237, 321647, 319548, 317577, 316175, 314881, 313133, 311320, 310390, 310596, 311267, 311831, 312444, 313426, 314470, 314788, 313933, 312270, 310588, 309379, 308602, 308106, 307966, 308149, 308170, 307616, 306931, 307105, 308425, 310102, 311296, 311924, 312171, 311832, 310730, 309368, 308485, 308131, 307696, 306748, 305455, 304192, 303144, 302234, 301207, 299855, 298336, 297110, 296370, 295741, 294796, 293582, 292353, 291075, 289587, 288021, 286632, 285414, 284263, 283443, 283458, 284472, 286142, 287929, 289346, 290094, 290326, 290642, 291446, 292354, 292579, 291874, 290842, 290411, 291249, 293563, 297115, 301396, 306050, 311215, 317422, 325342, 335631, 348611, 363873, 380576, 398525, 418598, 441724, 467693, 495304, 523200, 549834]
57663E49834K2968J6295P260k576j1674j8831k3363k5542k6389k6511k5511k2962
57651D12998j9447j6088j3445j1420r800q311o577m615l168k870l332l597l245
57638C07083k538j651n79L60O12K07q1L63J236J693J272K95n39q23p37o51o27
57621C04895m94l29m89j056j590j651j342j164j515k339l097l086k134r83n76
57606B83050r23j224j063q51r50j093j028j009j265j564j754k092k578k590j778
57591B61288q15n85j087j712k115k230j911j271q91j056j219r38p45j239j887
57576B41587j764j067p52r02o76J94R92J184R35L85n14j259j079k04J88k90o31
57559B36327j17M93K33m61m21N43J498J686J175M36q1p0L81P52O63L66K73L25
$$ y = [549834, 572802, 589097, 596357, 593781, 582107, 563276, 539913, 514371, 487982, 461471, 435960, 412998, 393551, 377463, 364018, 352598, 342798, 334487, 327910, 323295, 320127, 317257, 313925, 310328, 307083, 304545, 302894, 302315, 302675, 303287, 303494, 303413, 303776, 305012, 306705, 307977, 308272, 307733, 306910, 306173, 305522, 304895, 304401, 304072, 303583, 302527, 300937, 299286, 297944, 296780, 295265, 292926, 289829, 286743, 284609, 283626, 283050, 282127, 280903, 279840, 278989, 278039, 276946, 275918, 274909, 273644, 272080, 270326, 268234, 265656, 263066, 261288, 260473, 259888, 258801, 257089, 254974, 252744, 250833, 249562, 248671, 247615, 246396, 245458, 244713, 243474, 241587, 239823, 238756, 238004, 237102, 236426, 236620, 237612, 238796, 239731, 240116, 239602, 238343, 237264, 237060, 237248, 236958, 236327, 236210, 236703, 236936, 236475, 236054, 236597, 238095, 239781, 240956, 241392, 241311, 241241, 241622, 242374, 243037, 243403, 243676, 244001]
57541B44001K72L26R21J922K590K500K008J764K017K558L021L123K758K089J531
57526B73401J480J919K358K315J912J771K134K416K022J299J180J870K530K450
57512C01057J914J613J690J772J613J285R10O03N03O31Q18R49J050J018O01j24
57496C17903n69l54J64M01L38L10K71j18p38r90o30j57j14l36k31M38J238J542
57478C18368J129L97l5J02N68J018J424J897K329K488K431K470K707K909K899
57463C43101K843L006L435L974M417M590M426M152M170M567M940M902M725N062
57449D02310O052O926O727N352L704K808K919L430L603L269K883K950L501M156
57435D60590M615M897N081N060M745M416M516N067N585N693N574N634N956O312
$$ y = [244001, 244273, 244599, 245520, 247442, 250032, 252532, 254540, 256304, 258321, 260879, 263900, 267023, 269781, 271870, 273401, 274881, 276800, 279158, 281473, 283385, 285156, 287290, 289706, 291728, 293027, 294207, 296077, 298607, 301057, 302971, 304584, 306274, 308046, 309659, 310944, 311854, 312457, 312960, 313591, 314409, 315358, 316408, 317426, 318027, 317903, 317334, 316980, 317144, 317545, 317883, 318193, 318464, 318346, 317608, 316618, 315988, 315831, 315717, 315381, 315150, 315588, 316826, 318368, 319497, 319894, 319859, 319961, 320529, 321547, 322971, 324868, 327197, 329685, 332116, 334586, 337293, 340202, 343101, 345944, 348950, 352385, 356359, 360776, 365366, 369792, 373944, 378114, 382681, 387621, 392523, 397248, 402310, 408362, 415288, 422015, 427367, 431071, 433879, 436798, 440228, 443831, 447100, 449983, 452933, 456434, 460590, 465205, 470102, 475183, 480243, 484988, 489404, 493920, 498987, 504572, 510265, 515839, 521473, 527429, 533741]
57421E33741O571O745O767O536O213O097O219O302O230O226O470O819P062P191
57407F25189P199O859O100N408N466O355P392P895P795P465P212P146P292P554
57393G22327P643P404P153P408Q169Q823Q967Q952R310R859R929R419R114R708
57379H44185J0905J1779J1777J1115J0407J0119J0301J0588J0633J0642J1152
57368I63603J2098J2577J1998J1110J1224J2490J3717J3962J3596J3528J3979
57357A103882J4484J4749J4896J5063J5195J5332J5758J6706J8006J9107J9482
57346A282660J9092J8453J8149J8353J8852J9434J9978K0293K0278K0253K0730
57335A496525K1679K2455K2612K2493K2672K3154K3471K3411K3257K3359K3825
$$ y = [533741, 540312, 547057, 553824, 560360, 566573, 572670, 578889, 585191, 591421, 597647, 604117, 610936, 617998, 625189, 632388, 639247, 645347, 650755, 656221, 662576, 669968, 677863, 685658, 693123, 700335, 707481, 714773, 722327, 729970, 737374, 744527, 751935, 760104, 768927, 777894, 786846, 796156, 806015, 815944, 825363, 834477, 844185, 855090, 866869, 878646, 889761, 900168, 910287, 920588, 931176, 941809, 952451, 963603, 975701, 988278, 1000276, 1011386, 1022610, 1035100, 1048817, 1062779, 1076375, 1089903, 1103882, 1118366, 1133115, 1148011, 1163074, 1178269, 1193601, 1209359, 1226065, 1244071, 1263178, 1282660, 1301752, 1320205, 1338354, 1356707, 1375559, 1394993, 1414971, 1435264, 1455542, 1475795, 1496525, 1518204, 1540659, 1563271, 1585764, 1608436, 1631590, 1655061, 1678472, 1701729, 1725088, 1748913]
57324A748913K4550K5309K5786K5857K5823K6194K7085K8071K8670K8836K8857
57313B043951K8896K8864K8794K9086L0142L1720L3037L3673L4106L5072L6593
57302B393934L8077L9187M0077M0821M1222M1302M1462M1889M2317M2600M3047
57291B845935M3790M4367M4387M4151M4054M3814M2999M2038M1814M2405M3039
57280C322793M3457M4415M6397M8579M9686M9615M9481N0198N1523N2647N3307
57269C862098N3988N5139N6535N7621N8275N8859N9571O0111O0246O0301O0665
57258D503409O1100O1063O0700O0832O1758O2683O2708O2052O1736O2243O3017
57247E183301O3377O3381O3465O3519O2887O1353N9648N8606N8053N7030N5043
$$ y = [1748913, 1773463, 1798772, 1824558, 1850415, 1876238, 1902432, 1929517, 1957588, 1986258, 2015094, 2043951, 2072847, 2101711, 2130505, 2159591, 2189733, 2221453, 2254490, 2288163, 2322269, 2357341, 2393934, 2432011, 2471198, 2511275, 2552096, 2593318, 2634620, 2676082, 2717971, 2760288, 2802888, 2845935, 2889725, 2934092, 2978479, 3022630, 3066684, 3110498, 3153497, 3195535, 3237349, 3279754, 3322793, 3366250, 3410665, 3457062, 3505641, 3555327, 3604942, 3654423, 3704621, 3756144, 3808791, 3862098, 3916086, 3971225, 4027760, 4085381, 4143656, 4202515, 4262086, 4322197, 4382443, 4442744, 4503409, 4564509, 4625572, 4686272, 4747104, 4808862, 4871545, 4934253, 4996305, 5058041, 5120284, 5183301, 5246678, 5310059, 5373524, 5437043, 5499930, 5561283, 5620931, 5679537, 5737590, 5794620, 5849663]
57236E849663N2680N0873N0010M9942N0362N0834N0821N0202M9540M9416M9625
57225F403968M9490M8753M7795M7108M7024M7751M9067N0072M9930M8949M8276
57214F938183M8424M8733M8414M7427M6012M4094M1718L9503L8019L7127L6527
57203G414181L6515L7478L8915L9798L9860L9768L9908L9760L8807L7480L6711
57192G839181L6861L7500L8107L8665L9533M0967M2725M4149M4734M4642M4532
57181H291596M4812M5278M5641M6145M7457M9977N3473N7390O1270O4887O8110
57170H876036P0809P2833P4048P4398P3994P3073P1741O9768O6763O2634N7847
57159I643944N3201M9473M7363M7537N0316N5184O0888O6259P0834P4596P7329
$$ y = [5849663, 5902343, 5953216, 6003226, 6053168, 6103530, 6154364, 6205185, 6255387, 6304927, 6354343, 6403968, 6453458, 6502211, 6550006, 6597114, 6644138, 6691889, 6740956, 6791028, 6840958, 6889907, 6938183, 6986607, 7035340, 7083754, 7131181, 7177193, 7221287, 7263005, 7302508, 7340527, 7377654, 7414181, 7450696, 7488174, 7527089, 7566887, 7606747, 7646515, 7686423, 7726183, 7764990, 7802470, 7839181, 7876042, 7913542, 7951649, 7990314, 8029847, 8070814, 8113539, 8157688, 8202422, 8247064, 8291596, 8336408, 8381686, 8427327, 8473472, 8520929, 8570906, 8624379, 8681769, 8743039, 8807926, 8876036, 8946845, 9019678, 9093726, 9168124, 9242118, 9315191, 9386932, 9456700, 9523463, 9586097, 9643944, 9697145, 9746618, 9793981, 9841518, 9891834, 9947018, 10007906, 10074165, 10144999, 10219595, 10296924]
57148A0296924P8615P8377P7004P4614P0469O3360N2717L9149K3936Q143p572
57137A0855736k2469l5451m5578n2691n7234n9459n9200n6599n2792m9535m8116
57126A0316612m8776n1087n4591n8869o3260o6881o9192p0543p1936p4089p6740
57115I610648p9035q0599q2058q4498q8450r3431r8204j01431j02225j00319r5729
57104H604669q8282p7651o3788m7033k7500m498K3185N6457R5306J38682J84581
57093H794128K30504K74450L15796L55307L94348M33957M73643N10180N37900
57084A2320213N51828N51621N41768N26417N02996M60637L85211K67472J09420
57075A6217583p4176k59839m23506n48812o31101o75556o91871o89319o74238
$$ y = [10296924, 10375539, 10453916, 10530920, 10605534, 10676003, 10739363, 10792080, 10831229, 10855165, 10863308, 10855736, 10833267, 10797816, 10752238, 10699547, 10642313, 10582854, 10523654, 10467055, 10414263, 10364728, 10316612, 10267836, 10216749, 10162158, 10103289, 10040029, 9973148, 9903956, 9833413, 9761477, 9687388, 9610648, 9531613, 9451014, 9368956, 9284458, 9196008, 9102577, 9004373, 8902942, 8800717, 8700398, 8604669, 8516387, 8438736, 8374948, 8327915, 8300415, 8295917, 8319102, 8375559, 8470865, 8609547, 8794128, 9024632, 9299082, 9614878, 9970185, 10364533, 10798490, 11272133, 11782313, 12320213, 12872041, 13423662, 13965430, 14491847, 14994843, 15455480, 15840691, 16108163, 16217583, 16143407, 15883568, 15460062, 14911250, 14280149, 13604593, 12912722, 12223403, 11549165]
57066A1549165o49782o17037n76564n29401m77162m21735l65265l10196k58740
57057G343283k12119j70494j33691j01608p3849m9437k7486q017Q304K1272L1547
57046F627705L9931M6662N1747N5597N8956O2328O5880O9813P4386P9350Q3813
57035G316168Q7035Q9325R1830R5346R9515J03222J05601J06410J05520J02500
57025H302472R7167R0421Q4078P9518P6705P4748P3248P2651P3366P4991P6686
57014I176051P7966P8756P8794P7408P4084O9075O3322N7814N3056M9116M5953
57003I901395M3529M1602L9683L7482L5363L4090L4039L4801L5575L5716L4908
56992A0308183L3135L0827K8815K7846K8085K9193L0789L2569L4192L5304L5730
$$ y = [11549165, 10899383, 10282346, 9705782, 9176381, 8699219, 8277484, 7912219, 7602023, 7343283, 7131164, 6960670, 6826979, 6725371, 6651522, 6602085, 6574599, 6566582, 6574886, 6596158, 6627705, 6667636, 6714298, 6766045, 6821642, 6880598, 6942926, 7008806, 7078619, 7153005, 7232355, 7316168, 7403203, 7492528, 7584358, 7679704, 7779219, 7882441, 7988042, 8094452, 8199972, 8302472, 8399639, 8490060, 8574138, 8653656, 8730361, 8805109, 8878357, 8951008, 9024374, 9099365, 9176051, 9254017, 9332773, 9411567, 9488975, 9563059, 9632134, 9695456, 9753270, 9806326, 9855442, 9901395, 9944924, 9986526, 10026209, 10063691, 10099054, 10133144, 10167183, 10201984, 10237559, 10273275, 10308183, 10341318, 10372145, 10400960, 10428806, 10456891, 10486084, 10516873, 10549442, 10583634, 10618938, 10654668]
56981A0654668L5345L3804L0638K5767J9747J3481P877L697J398R11J655K930
56969A0831918M268N505O717Q020R239R873R701R333R669J0727J1506J1183R934
56956A0947593Q333O420L835M52l605q235j3091j7293k0084k1622k2622k3322
56944A0836759k3475k3333k3831k5550k8077l0592l2581l3722l3709l2584l0916
56933A0518389k9263k7782k6626k6300k7220k9261l2148l5993m0920m6389n1428
56922A0145059n5504n8748o1370o3311o4546o5398o6337o7569o8944p0325p2035
56911I430972p4668p8155q1240q2584q2349q1899q1810q1131p9233p7296p6879
56900H553728p7719p8306p8229p8515p9570q0318p9792p8324p6522p4225p1302
$$ y = [10654668, 10690013, 10723817, 10754455, 10780222, 10799969, 10813450, 10821327, 10825024, 10826422, 10827333, 10828988, 10831918, 10836186, 10841691, 10848408, 10856428, 10865667, 10875540, 10885241, 10894574, 10904243, 10914970, 10926476, 10937659, 10947593, 10955926, 10962346, 10966181, 10966633, 10963028, 10954793, 10941702, 10924409, 10904325, 10882703, 10860081, 10836759, 10813284, 10789951, 10766120, 10740570, 10712493, 10681901, 10649320, 10615598, 10581889, 10549305, 10518389, 10489126, 10461344, 10434718, 10408418, 10381198, 10351937, 10319789, 10283796, 10242876, 10196487, 10145059, 10089555, 10030807, 9969437, 9906126, 9841580, 9776182, 9709845, 9642276, 9573332, 9503007, 9430972, 9356304, 9278149, 9196909, 9114325, 9031976, 8950077, 8868267, 8787136, 8707903, 8630607, 8553728, 8476009, 8397703, 8319474, 8240959, 8161389, 8081071, 8001279, 7922955, 7846433, 7772208, 7700906]
56889G700906o8709o7620o8035o9021o9982p0907p1774p2573p3724p5633p7870
56878F915058p9473q0129q0379q0634q0651q0103p9128p8016p6759p5246p3638
56867F050902p2322p1498p0881o9762o7524o4337o1152n8777n7076n5484n4194
56856E347895n4308n6799o1627o7959p4769q1113q6214q9612r1212r1153q9791
56845D503338q7702q5319q2549p9008p4622o9656o4258n8421n2518m7312m3220
56834C758753m0026l7636l6670l7993m2003m8754n8305p0224q2935r4250j02714
56823C107243j08042j10300j09330j05284r9185r2396q5619p8730p1540o4334
56813B182483n7606n1539m5927m0538l5369l0666k6816k4336k3800k5619k9817
$$ y = [7700906, 7632197, 7564577, 7496542, 7427521, 7357539, 7286632, 7214858, 7142285, 7068561, 6992928, 6915058, 6835585, 6755456, 6675077, 6594443, 6513792, 6433689, 6354561, 6276545, 6199786, 6124540, 6050902, 5978580, 5907082, 5836201, 5766439, 5698915, 5634578, 5573426, 5514649, 5457573, 5402089, 5347895, 5293587, 5236788, 5175161, 5107202, 5032433, 4951320, 4865106, 4775494, 4684282, 4593129, 4503338, 4415636, 4330317, 4247768, 4168760, 4094138, 4024482, 3960224, 3901803, 3849285, 3801973, 3758753, 3718727, 3681091, 3644421, 3606428, 3564425, 3515671, 3457366, 3387142, 3304207, 3209957, 3107243, 2999201, 2888901, 2779571, 2674287, 2575102, 2482706, 2397087, 2318357, 2246817, 2182483, 2124877, 2073338, 2027411, 1986873, 1951504, 1920838, 1894022, 1869686, 1845886, 1820267, 1790450]
56802A790450l5964m3338n1114n8423o4374o8175o9431o8339o5534o1625n6984
56791A147149n1914m6877m2246l7948l3646k9227k4876k0677j6588j2928j0405
56780H19817r353r344r930j1386j4171j7947k1796k5241k8363l0996l2538l2789
56768E75963l2190l1042k9156k6650k4305k2571k0785j8234j5440j3533j2607
56757C29450j1684j0345r347r298r562r123p969o948o538o442o264n970n567m899
56743B19494m033l456l492l751l597l060k822l175l496l045k038j416j681k361
56729A78071k687k365j613q13l94o10j208j510j139m64j10k77q10j579k389k731
56713A57372k248j350q35r16j081r51o82m29l4M50N00j05o55k60R72J981J945
$$ y = [1790450, 1754486, 1711148, 1660034, 1601611, 1537237, 1469062, 1399631, 1331292, 1265758, 1204133, 1147149, 1095235, 1048358, 1006112, 968164, 934518, 905291, 880415, 859738, 843150, 830222, 819817, 810464, 801120, 791190, 779804, 765633, 747686, 725890, 700649, 672286, 641290, 608752, 575963, 543773, 512731, 483575, 456925, 432620, 410049, 389264, 371030, 355590, 342057, 329450, 317766, 307421, 298074, 288776, 279214, 270091, 262122, 255174, 248636, 242194, 235930, 229960, 224393, 219494, 215461, 212005, 208513, 204762, 201165, 198105, 195283, 192108, 188612, 185567, 183529, 182113, 180432, 178071, 175384, 173019, 171406, 170593, 170199, 169589, 168381, 166871, 165732, 165268, 165158, 164881, 164071, 162492, 160103, 157372, 155124, 153774, 152939, 152023, 150942, 149991, 149309, 148880, 148846, 149296, 149796, 149691, 149036, 148776, 149748, 151729, 153674]
56696A53674J033K5m48k78J11J12m92j232j476j172p77n55m11m09q47j599j891
56679A43368j240k75nn14r39p66m54n81r49r51n08r2l3k50o32j188j709j755j196
56660A29331m58RK77O74J196J514J515J417J358J149O43P6j93j59j39k46j99K20
56642A37985O98O45k5p14q02l06L15Q06J221J565J745J897K242K514K078R29j9
56625A52774q4K02q1q04j040o30m61r83j469j232q11j099j810j792p54K10J3j122
56607A39027k041j970j131l37j77n16o92l08K13J09p35j620j903j650j331j158
56591A23780j014p38k24O13J640K369K313J551P29M51P00Q94N23k85q64p47j85
56574A31506K45M58R36J863K714K980K928L104L352K952J828R56J258K524L833
$$ y = [153674, 154707, 154732, 154284, 154006, 154117, 154229, 153737, 152505, 151029, 149857, 149080, 148525, 148114, 147705, 146858, 145259, 143368, 142128, 141853, 141848, 141334, 140395, 139629, 139175, 138594, 137645, 136694, 136186, 136094, 136061, 135811, 135179, 133991, 132282, 130527, 129331, 128873, 128882, 129159, 129833, 131029, 132543, 134058, 135475, 136833, 137982, 138625, 138701, 138508, 138349, 138210, 137964, 137765, 137985, 138683, 139328, 139303, 138589, 137787, 137481, 137796, 138602, 139823, 141388, 143133, 145030, 147272, 149786, 151864, 152793, 152774, 152690, 152892, 152811, 152007, 150967, 150337, 149876, 148893, 147424, 146192, 145381, 144282, 142472, 140680, 139926, 140136, 140149, 139027, 136986, 135016, 133885, 133548, 133371, 132855, 132163, 131855, 132068, 132177, 131442, 129822, 127919, 126269, 124938, 123780, 122766, 122028, 121804, 122417, 124057, 126426, 128739, 130290, 131019, 131470, 132170, 133064, 133587, 133302, 132438, 131691, 131506, 131751, 132209, 133145, 135008, 137722, 140702, 143630, 146734, 150086, 153038, 154866, 155822, 157080, 159604, 163437]
56559A63437M692N309N878O126N694M603L159J668M32k03r5M32Q05P26L06k71
56543B02698r41j533j658j117k93J00k76j109j846k162k068j777j567j586j707
56528A83158j665j329p84j87K14M0q09j742j976j571j408j872k216j758j045j053
56512A63997j662j912j530j202j223j033l53J74P0j57M5K77k4m41j90M41L35q32
56494A54780k084k395j690n54L59N02k82j345j642q63K65R75J218J269J160R06
56478A50579P90R83J218J199J043R88R51P95O09M24p4r77j649j369l34N28P21
56461A56425O15O73Q16P03K53k91n71k83N45J369J569J167P53O27M12j62o45m35
56443A63540K69O70N03L62P54J272J069J8j075j392r68m61l02l38k47n5J7k4J55
$$ y = [163437, 168129, 173438, 179316, 185442, 191136, 195739, 198898, 200566, 200998, 200795, 200700, 201132, 201937, 202663, 202969, 202698, 201757, 200224, 198566, 197449, 197156, 197256, 196980, 195871, 194025, 191863, 189795, 188018, 186451, 184865, 183158, 181493, 180164, 179380, 179193, 179407, 179447, 178638, 176896, 174920, 173349, 171941, 170069, 167853, 166095, 165050, 163997, 162335, 160423, 158893, 157691, 156468, 155435, 155082, 155256, 155326, 155169, 155214, 155491, 155467, 155026, 154836, 155277, 155612, 154780, 152696, 150301, 148611, 148057, 148416, 148918, 148636, 147291, 145649, 144786, 145051, 146026, 147244, 148513, 149673, 150579, 151369, 152352, 153570, 154769, 155812, 156800, 157751, 158546, 159155, 159579, 159505, 158528, 156879, 155510, 155176, 155704, 156425, 157040, 157713, 158529, 159232, 159485, 159194, 158623, 158340, 158885, 160254, 161823, 162990, 163743, 164370, 164782, 164620, 163975, 163540, 163809, 164479, 164982, 165344, 166098, 167370, 168439, 168457, 167382, 165990, 165022, 164561, 164259, 163921, 163674, 163619, 163636, 163612, 163767]
56424A63767P61J511J824J446P64M45P39J218J300Q94L86Q1m8RM20J052J182K06
56406A77957j393k309j837p01j62n56j091r64k58M10P04P37O20K88j71l37R0Q91
56388A71918J586K001K282K445K313J955J779J941K006J543Q58O84J199J795J863
56373A98168J505J250J438K005K670L032K696J665O09L56R96J707J694J117Q28
56358B21736J233J744J579Q29L44O24J231J491J435J631K252K720K484J782J350
56343B44465J506J858J919J703J514J393J137Q00P67J195J660J680J414J457K010
56328B66478K656K932K832K569K254K000K017K319K586K611K632K912L201L047
56314C03046K553K303K537K771K499J874J485J679K303K985L438L633L778M141
$$ y = [163767, 164528, 166039, 167863, 169309, 170073, 170518, 171257, 172475, 173775, 174669, 175055, 175136, 175088, 175097, 175517, 176569, 177751, 177957, 176564, 174255, 172418, 171717, 171555, 170999, 169908, 168944, 168686, 169096, 169800, 170537, 171157, 171445, 171274, 170937, 171027, 171918, 173504, 175505, 177787, 180232, 182545, 184500, 186279, 188220, 190226, 191769, 192627, 193311, 194510, 196305, 198168, 199673, 200923, 202361, 204366, 207036, 210068, 212764, 214429, 215038, 215394, 216390, 218097, 219791, 220908, 221736, 222969, 224713, 226292, 227121, 227465, 228089, 229320, 230811, 232246, 233877, 236129, 238849, 241333, 243115, 244465, 245971, 247829, 249748, 251451, 252965, 254358, 255495, 256295, 257062, 258257, 259917, 261597, 263011, 264468, 266478, 269134, 272066, 274898, 277467, 279721, 281721, 283738, 286057, 288643, 291254, 293886, 296798, 299999, 303046, 305599, 307902, 310439, 313210, 315709, 317583, 319068, 320747, 323050, 326035, 329473, 333106, 336884, 341025]
56300C41025M753N318N524N361N081M870M760M771N027N585O272O797P062P206
56286D19412P375P528P635P852Q313Q802Q971Q912R165R962J0863J1402J1810
56273E38002J2689J4017J5041J5192J4812J4777J5664J7330J9127K0463K1288
56262G18402K2211K3947K6544K9329L1661L3642L5932L8958M2476M5970M9384
56251A098456N3355N8562O4926P1584P7706Q3089Q7925R2330R6327R9984J03107
56240A987351J05000J04974J03004R9440R4194Q6744P6999O5483N2491L7698K1019
56229B834397L357j3980l0333m5560n9230p0615p9569q6713r2511r6607r8422
56218B164214r8080r6307r3604r0040q5828q1625p7811p3908o9199o3879n8961
$$ y = [341025, 345778, 351096, 356620, 361981, 367062, 371932, 376692, 381463, 386490, 392075, 398347, 405144, 412206, 419412, 426787, 434315, 441950, 449802, 458115, 466917, 475888, 484800, 493965, 503927, 514790, 526192, 538002, 550691, 564708, 579749, 594941, 609753, 624530, 640194, 657524, 676651, 697114, 718402, 740613, 764560, 791104, 820433, 852094, 885736, 921668, 960626, 1003102, 1049072, 1098456, 1151811, 1210373, 1275299, 1346883, 1424589, 1507678, 1595603, 1687933, 1784260, 1884244, 1987351, 2092351, 2197325, 2300329, 2399769, 2493963, 2580707, 2657706, 2723189, 2775680, 2813378, 2834397, 2837754, 2823774, 2793441, 2747881, 2688651, 2618036, 2538467, 2451754, 2359243, 2262636, 2164214, 2066134, 1969827, 1876223, 1786183, 1700355, 1618730, 1540919, 1467011, 1397812, 1333933, 1274972]
56207A274972n4973n1298m7194m2939l9362l6562l3788l0532k7148k4236k1949
56196H64991k0106j8546j7127j5757j4551j3648j2711j1114q840o770n678n281
56184G14862m769m015l690m254n245n691m988l362j620n08j48j00O4M30R60J711
56168F79637K613L312L564L590L744M024M183M218M396M867N567O399P230P846
56154G45190Q284R089J0778J2986J4669J5307J5587J6629J8829K1676K4502K7078
56142I40604K9676L2732L6424M0389M3898M6477M8227M9413M9860M9067M6844
56131A413611M3602L9946L6226L2585K9154K6024K3136K0296J7261J3675R256
56120A704772M251m85m190p007r776j3119j7064k1460k6192l0820l4517l6751
$$ y = [1274972, 1219999, 1168701, 1121507, 1078568, 1039206, 1002644, 968856, 938324, 911176, 886940, 864991, 844885, 826339, 809212, 793455, 778904, 765256, 752545, 741431, 732591, 725821, 720143, 714862, 710093, 706078, 702388, 698134, 692889, 687198, 682210, 678848, 677228, 676720, 676572, 676472, 676536, 676966, 677926, 679637, 682250, 685562, 689126, 692716, 696460, 700484, 704667, 708885, 713281, 718148, 723715, 730114, 737344, 745190, 753474, 762563, 773341, 786327, 800996, 816303, 831890, 848519, 867348, 889024, 913526, 940604, 970280, 1003012, 1039436, 1079825, 1123723, 1170200, 1218427, 1267840, 1317700, 1366767, 1413611, 1457213, 1497159, 1533385, 1565970, 1595124, 1621148, 1644284, 1664580, 1681841, 1695516, 1704772, 1709023, 1708538, 1704348, 1697341, 1687565, 1674446, 1657382, 1635922, 1609730, 1578910, 1544393, 1507642]
56108A507642l7674l7621l6541l4305l1231k7822k4258k0534j6876j3488j0137
56097A217155o544l079m53J207K435L629M763N828O984Q128Q911R295R596R903
56083A277758R999R999J0435J1469J2594J3414J4140J5021J5825J6280J6600J7093
56071A440627J7670J8166J8759J9676K0708K1520K2187K3061K4225K5447K6597
56060A678643K7788K9126L0509L1632L2263L2600L3261L4617L6277L7623L8706
56049B043045M0029M1597M2889M3797M4853M6338M7968M9633N1677N4115N6405
56038B562346N8389O0701O3728O6967O9904P2812P6062P9457Q2852Q6691R1187
56027C371096R5585R9112J02042J05069J08295J11698J16048J22208J29803J37551
$$ y = [1507642, 1469968, 1432347, 1395806, 1361501, 1330270, 1302448, 1278190, 1257656, 1240780, 1227292, 1217155, 1210611, 1207532, 1207079, 1208286, 1210721, 1214350, 1219113, 1224941, 1231925, 1240053, 1248964, 1258259, 1267855, 1277758, 1287757, 1297756, 1308191, 1319660, 1332254, 1345668, 1359808, 1374829, 1390654, 1406934, 1423534, 1440627, 1458297, 1476463, 1495222, 1514898, 1535606, 1557126, 1579313, 1602374, 1626599, 1652046, 1678643, 1706431, 1735557, 1766066, 1797698, 1829961, 1862561, 1895822, 1930439, 1966716, 2004339, 2043045, 2083074, 2124671, 2167560, 2211357, 2256210, 2302548, 2350516, 2400149, 2451826, 2505941, 2562346, 2620735, 2681436, 2745164, 2812131, 2882035, 2954847, 3030909, 3110366, 3193218, 3279909, 3371096, 3466681, 3565793, 3667835, 3772904, 3881199, 3992897, 4108945, 4231153, 4360956, 4498507]
56017D498507J44818J52058J59840J68205J76885J85546J93805K01545K08906
56008F090115K15716K21318K25473K28945K32713K37120K42313K48918K57603
55999H200234K68459K81320K96209L12992L31281L51080L72638L95188M16997
55990A1226398M37445M58029M80393N04674N30733N59605N92232O27805O65000
55981A6082314P03904P45238P88579Q32946Q78422R25942R76450J031720J094740
55972B4060255J167600J250060J341822J444916J562337J696482J851586K036038
55964C6411096K259465K528727K849331L229082L676992M199400M799361N477838
55956F5431292O233221P064048P978117Q997643J0150074J1450170J2880603J4364724
$$ y = [4498507, 4643325, 4795383, 4955223, 5123428, 5300313, 5485859, 5679664, 5881209, 6090115, 6305831, 6527149, 6752622, 6981567, 7214280, 7451400, 7693713, 7942631, 8200234, 8468693, 8750013, 9046222, 9359214, 9690495, 10041575, 10414213, 10809401, 11226398, 11663843, 12121872, 12602265, 13106939, 13637672, 14197277, 14789509, 15417314, 16082314, 16786218, 17531456, 18320035, 19152981, 20031403, 20957345, 21933795, 22965515, 24060255, 25227855, 26477915, 27819737, 29264653, 30826990, 32523472, 34375058, 36411096, 38670561, 41199288, 44048619, 47277701, 50954693, 55154093, 59953454, 65431292, 71664513, 78728561, 86706678, 95704321, 105854395, 117304565, 130185168, 144549892]
55948A44549892J5737325J6749866J7128559J6634773J5068896J2260342Q152506
55941B46282159K976708k667157p980334j2296372j5311730j7065942j7766024
55934A76171308j7638928j6885222j5686427j4211361j2612426j1018029r521932
55927G8596983q176908p002257n998840n156930m456836l873270l383698k971251
55919C7576993k621677k322544k065585j845718j657208j493630j351160j228388
55911B2991083j122799j030426r48974q78063q16106p59872p07716o60590o19153
55902A5447384n82173n48409n17825m90195m64452m40122m17675l96815l76141
55893A1213577l55198l35282l17425l01042k85402k70989k58481k47427k37036
$$ y = [144549892, 160287217, 177037083, 194165642, 210800415, 225869311, 238129653, 246282159, 249258867, 246591710, 238611376, 226315004, 211003274, 193937332, 176171308, 158532380, 141647158, 125960731, 111749370, 99136944, 88118915, 78596983, 70420075, 63417818, 57418978, 52262048, 47805212, 43931942, 40548244, 37576993, 34955316, 32632772, 30567187, 28721469, 27064261, 25570631, 24219471, 22991083, 21868284, 20837858, 19888884, 19010821, 18194715, 17434843, 16727127, 16066537, 15447384, 14865211, 14316802, 13798977, 13308782, 12844330, 12404208, 11986533, 11589718, 11213577, 10858379, 10523097, 10205672, 9904630, 9619228, 9348239, 9089758, 8842331, 8605295]
55884H605295k27490k19507k13145k07767k02756j97706j92198j85997j79477
55875F779252j73506j68785j65186j61799j57885j53760j50226j47081j43095
55866E357929j37787j32273j27557j23049j17797j12345j07927j04487j01026
55857D293681r7536r4985r3355r1330q8187q4662q1551p8702p5793p3078p0852
55846C363650o9100o7990o7817o8079o7571o5883o3928o2497o1120n8988n6290
55835B654387n3864n2032n0412m8650m6774m5042m3728m2920m2279m1318l9993
55824B147375l8678l7549l6393l5182l4270l3805l3476l3086l2898l3078l3214
55813A765746l2792l1804l0577k9263k7925k6833k6300k6228k6135k5621k4660
$$ y = [8605295, 8377805, 8158298, 7945153, 7737386, 7534630, 7336924, 7144726, 6958729, 6779252, 6605746, 6436961, 6271775, 6109976, 5952091, 5798331, 5648105, 5501024, 5357929, 5220142, 5087869, 4960312, 4837263, 4719466, 4607121, 4499194, 4394707, 4293681, 4196145, 4101160, 4007805, 3916475, 3828288, 3743626, 3662075, 3583373, 3507580, 3434502, 3363650, 3294550, 3226560, 3158743, 3090664, 3023093, 2957210, 2893282, 2830785, 2769665, 2710677, 2654387, 2600523, 2548491, 2498079, 2449429, 2402655, 2357613, 2313885, 2270965, 2228686, 2187368, 2147375, 2108697, 2071148, 2034755, 1999573, 1965303, 1931498, 1898022, 1864936, 1832038, 1798960, 1765746, 1732954, 1701150, 1670573, 1641310, 1613385, 1586552, 1560252, 1534024, 1507889, 1482268, 1457608]
55802A457608k3502k2428k1559k0824k0056j9132j8063j7091j6631j6809j7074
55791A244439j6609j5335j4062j3431j3214j3048j3186j3872j4415j3904j2696
55780A090667j2283j3541j5856j8093j9721k0738k1076k0590j9332j7538j5504
55769H96395j3520j1801j0431r604r654j0649j2106j3489j4719j5769j6194j5691
55757G42768j4791j4240j3876j2986j1646j0741j0653j0815j0811j0927j1381
55746F09901j1824j2023j2243j2534j2366j1457j0344r686r462r315r106q787
55734D80754q240p661p557p946q129p680p141p165p511p513p133o852o825o728
55720C76673o351n775n139m590m329m328m168l549k730k171j967j916j880j781
$$ y = [1457608, 1434106, 1411678, 1390119, 1369295, 1349239, 1330107, 1312044, 1294953, 1278322, 1261513, 1244439, 1227830, 1212495, 1198433, 1185002, 1171788, 1158740, 1145554, 1131682, 1117267, 1103363, 1090667, 1078384, 1064843, 1048987, 1030894, 1011173, 990435, 969359, 948769, 929437, 911899, 896395, 882875, 871074, 860643, 851039, 841385, 830736, 818630, 805141, 790422, 774653, 758459, 742768, 727977, 713737, 699861, 686875, 675229, 664488, 653835, 643020, 632209, 621282, 609901, 598077, 586054, 573811, 561277, 548911, 537454, 527110, 517424, 507962, 498647, 489541, 480754, 472514, 464853, 457296, 449350, 441221, 433541, 426400, 419235, 411724, 404211, 397078, 390226, 383401, 376673, 370322, 364547, 359408, 354818, 350489, 346161, 341993, 338444, 335714, 333543, 331576, 329660, 327780, 325999]
55706C25999j537j352j657k363k660k112j581k287m206o132p212p645p837p692
55692B69726p069o291n724n275m639l864l274l004k883k684k254j488m57M07N65
55677B21792m7q21j093q71p39j014j356j337j091j040j245j435j561j827k197
55662B04118k345k162j887j610j106l21L64O28N99N53M49R5n21j188j637j633
55646A92396j137n17l20o89j245j567j502j042l84r3p29k076l254l710l651l360
55630A67120k811k179k026k510l034l117l012k980k678j871j066p19m19K22N22
55615A39442l23j676k059j237m62o09j224j677k067k506k525j884j228j208j532
55600A17225j539j301j384j773j804j151l02M2k89r66j599j964j919j362l71P03
$$ y = [325999, 324462, 323110, 321453, 319090, 316430, 314318, 312737, 310450, 306244, 300112, 292900, 285255, 277418, 269726, 262657, 256366, 250642, 245367, 240728, 236864, 233590, 230586, 227703, 225019, 222765, 221277, 220820, 221227, 221792, 221745, 220924, 219831, 218960, 218221, 217207, 215851, 214514, 213423, 212383, 211138, 209703, 208142, 206315, 204118, 201773, 199611, 197724, 196114, 195008, 194687, 195051, 195679, 196278, 196831, 197280, 197375, 196854, 195666, 194029, 192396, 191259, 190742, 190422, 189733, 188488, 186921, 185419, 184377, 183993, 183900, 183171, 181095, 177841, 174131, 170480, 167120, 164309, 162130, 160104, 157594, 154560, 151443, 148431, 145451, 142773, 140902, 139836, 139117, 138698, 138920, 139442, 139119, 137443, 135384, 134147, 133685, 133076, 131852, 130175, 128108, 125602, 123077, 121193, 119965, 118757, 117225, 115686, 114385, 113001, 111228, 109424, 108273, 107971, 108013, 107724, 106758, 105159, 103195, 101276, 99914, 99543, 100246]
55584A00246J426J681J699J654J415Q78L37J92L58M23K71K33N36J064J706K572
55568A16691L572M138L755K577J316M94Jo09j542k504l046l062k844k638k361
55553A13938j882j354j035r67j076j375j741j793j360r17r72j241j030m39l72
55538I6384j173j995j918j120m14q1K19O62R92J031R45R46J036J108J044P11P4
55521I8451o27j011r21n77m00o92j368j946j943j421r67r88j193j018m40J7l1
55504H2925m17p79r74j031r33p21n70n89o02l86j18j69n03n54LO62O37j02p65
55485G5014p18j72K39K04j21m67n87l09K77P61P78L54k50q48j276j275p61n9L87
55466G1171M73L55J23j89m23m69m19k93J16P27R02K58n21m70K62O25J98m02p12
$$ y = [100246, 101672, 103353, 105052, 106706, 108121, 108999, 109336, 109528, 109886, 110309, 110580, 110813, 111349, 112413, 114119, 116691, 120263, 124401, 128156, 130733, 132049, 132543, 132544, 131935, 130393, 127889, 124843, 121781, 118937, 116299, 113938, 112056, 110702, 109667, 108700, 107624, 106249, 104508, 102715, 101355, 100438, 99466, 98225, 97195, 96756, 96384, 95211, 93216, 91298, 90178, 89764, 89683, 89902, 90564, 91556, 92587, 93532, 94478, 95514, 96622, 97666, 98377, 98451, 97824, 96813, 95892, 95315, 94915, 94223, 92855, 90909, 88966, 87545, 86578, 85590, 84397, 83379, 82939, 82956, 82925, 82508, 81729, 80755, 79724, 78791, 78070, 77500, 76911, 76309, 75923, 75805, 75636, 75133, 74579, 74582, 75244, 75881, 75779, 75014, 74296, 74124, 74363, 74567, 74446, 73979, 73392, 73083, 73360, 74121, 74899, 75253, 75003, 74155, 72879, 71604, 70843, 70784, 71171, 71644, 71999, 72122, 71933, 71510, 71041, 70622, 70329, 70445, 71172, 72074, 72332, 71811, 71341, 71603, 72228, 72426, 72024, 71312]
55447G1312r86j300j121l46K02mk78R0N19R0p67p78J57P24J17q78j170q11n90
55428F4182p95r64n83L89J492K043J670Q51N79J261K185K360J683R14O63P62P10
55411G9402L64J4j12j89n37j140j635j787j713j566j257p56m11n56r23r07l83
55394F5908J64K95P3k22l59j21N35J160J103L77k30j82J55J77o5j97k45m65o78
55375F7183m94j16k08q95j452j240m75J72L45J27k68n80n53j59L02N48O04O24
55357F3465O29O02O73Q91R87O32j01p61r74p44l75j77k40l39j55K58M56J89j18
55338F4798J37Q38J136M45q04j601j407o03L5J35n7j23k4o8l40m70o2P75J530
55319F4270J765J340L84o49j090o52Q8K55k58p16o11k78k46m63n46m62m80o32
$$ y = [71312, 70326, 69026, 67905, 67559, 67761, 67757, 67479, 67569, 68088, 68178, 67411, 66633, 66790, 67514, 67631, 66753, 65583, 64772, 64182, 63387, 62423, 61840, 62229, 63721, 65764, 67434, 68285, 68864, 70125, 72310, 74670, 76353, 77267, 77930, 78692, 79402, 79766, 79780, 79668, 79479, 78942, 77802, 76167, 74380, 72667, 71101, 69844, 69088, 68677, 68121, 67198, 66291, 65908, 66072, 66367, 66440, 66218, 65859, 65738, 66273, 67433, 68536, 68913, 68683, 68501, 68656, 68833, 68768, 68571, 68326, 67861, 67183, 66689, 66573, 66365, 65470, 64018, 62778, 62303, 62475, 62820, 62947, 62679, 62099, 61546, 61387, 61689, 62237, 62841, 63465, 64094, 64696, 65369, 66260, 67247, 67879, 67778, 67017, 66043, 65299, 64924, 64747, 64507, 64168, 64013, 64271, 64727, 64916, 64798, 64935, 65773, 66909, 67354, 66550, 64949, 63542, 62939, 62974, 63109, 63052, 62929, 62905, 62837, 62497, 62027, 61965, 62740, 64270, 66035, 67375, 67759, 67110, 66020, 65368, 65456, 65711, 65453, 64737, 64126, 63848, 63602, 63139, 62593, 62131, 61651, 61019]
55301F1019o69m40jN72J154J446J252Q51P09Q36P61K10m93q35o55j80K63M58L66
55282F6624J07j32j93O3O88J371J490P39l12p72n19l10o66j093q27L9O30M37r1
55263F7273j80L35R07R89O22L14L89O09N23P5k95j95K49N80N06J52j31o2K80M09
55243G3349k05j486k564k545j475l55p8n27q67n27K90R93J254J174J017R16P94
55226F9158M75q7o52q73p06m45k85n4L85O99M60j83o41p18p26p21k76O53J282
55207F6745J019M33N42J347J880J526O14l19j013j178n12N69R43J04j054j272
55191G0374m27N28Q06M09k79q85j032n16L08P31M94Q6P5L91N16K71O1K50N74M27
55171G3162k42p41n62j51l24j053j461j068m00j25j98k50l34o10p14j54Q14J387
$$ y = [61019, 60350, 59910, 59909, 60481, 61635, 63081, 64333, 65184, 65893, 66729, 67490, 67700, 67207, 66372, 65717, 65537, 65800, 66258, 66624, 66731, 66599, 66406, 66469, 67157, 68528, 70018, 70757, 70445, 69673, 69154, 68844, 68178, 67085, 66258, 66297, 66927, 67364, 67273, 67093, 67428, 68335, 69324, 69946, 70260, 70649, 71258, 71781, 71856, 71561, 71366, 71615, 72195, 72701, 72853, 72722, 72660, 72940, 73349, 73144, 71658, 69094, 66549, 65074, 64719, 64641, 64114, 63247, 62720, 63010, 64003, 65257, 66431, 67448, 68364, 69158, 69633, 69546, 68894, 68021, 67315, 66870, 66585, 66531, 66916, 67615, 68075, 67892, 67251, 66533, 65807, 65086, 64810, 65463, 66745, 67764, 68197, 68739, 70086, 71966, 73492, 74106, 73787, 72774, 71596, 71084, 71653, 72596, 72700, 71646, 70374, 69947, 70475, 71281, 71690, 71411, 70526, 69494, 68978, 69286, 70017, 70511, 70597, 70672, 71063, 71579, 71850, 71911, 72161, 72735, 73162, 72920, 72179, 71617, 71466, 71142, 70089, 68628, 67560, 67160, 67035, 66837, 66587, 66253, 65643, 64929, 64775, 65589, 66976]
55153F6976J310J093J107J109Q84O91P13O31J35m61o36m16j94n3K54O92Q75O76
55135G5386M25K96k0p42j418j379o21K40P70J088J322J225O20j38n03m74m86o58
55117G4933o10j08N10P75O23K58k40q32j222j044l79K68N36N87Q19J350J819J700
55099G9743P96m75j335j291n81J39M17L26J99K54M31M94L24O2l2P5J86K22L78
55080H0332P20Q91N32j34m85k30L36P84R26P35K78j30o7M92R88Q51J49n05o51
55061H5812m31l48o72j057q87l2Q44R69L66k49l94l00l78o01o96n69l22jL79P23
55041H2156R79J215J359J121M13l81q13q81p94n23m3K35j70r80j360j019m97k28
55023G9789O6O65J122Q53J00l67k98j39k15l59l69l24k84j43mk24q19j161o93
$$ y = [66976, 68286, 69379, 70486, 71595, 72479, 73170, 73883, 74514, 74649, 74188, 73552, 73136, 72942, 72889, 73143, 73835, 74710, 75386, 75811, 76107, 76087, 75345, 73927, 72548, 71927, 72167, 72937, 74025, 75347, 76572, 77192, 77054, 76551, 76077, 75591, 74933, 74323, 74215, 74725, 75500, 76123, 76381, 76141, 75309, 74087, 73043, 72664, 72932, 73468, 74055, 74874, 76224, 78043, 79743, 80539, 80064, 78729, 77438, 76857, 76996, 77413, 77739, 77938, 78192, 78623, 79117, 79441, 79503, 79471, 79546, 79732, 79954, 80332, 81052, 81943, 82475, 82341, 81856, 81626, 81962, 82746, 83672, 84407, 84685, 84555, 84488, 84980, 85968, 86819, 86968, 86463, 85812, 85381, 85033, 84361, 83304, 82417, 82385, 83229, 84198, 84564, 84315, 83921, 83621, 83243, 82642, 81946, 81377, 81055, 81054, 81433, 82156, 83135, 84350, 85709, 86830, 87243, 86862, 86049, 85168, 84374, 83851, 83808, 84043, 83873, 82893, 81533, 80514, 80017, 79789, 79855, 80520, 81642, 82495, 82595, 82228, 81930, 81791, 81576, 81217, 80848, 80524, 80240, 80097, 80093, 79869, 79050, 77889, 77196]
55004G7196L11J066J179R14O53N05N00P13J057J200Q89L00j16p6K81N74N38K47
54986H7931Ll7m5k11l57p3O84J335J233L81n66r61o66K2P33J138R76K42o21r86
54966I0155o44m8J76j15m75l61L31J156J449Q87j41q40p93l58j16j33k3L67P73
54947I1247J000J139J196Q94R5q61j440j359o50M16J318J542J143O81M51J16n98
54930I6330j274j323p62K4Q72J621J728Q28l99q04j48Q09J553K288L073L413L139
54913A10968K894L194L607L412K661K003J759J768J762J465N58r32k353k991k837
54898A26938k437k141j893j634j499j591j824k000j912j486r96q53j019q77j9
54883A04757J103J655J376P29K39M2nr0k56k27M05J620K831L532L790L843L566
$$ y = [77196, 77507, 78573, 79752, 80666, 81319, 81824, 82324, 83037, 84094, 85294, 86183, 86483, 86367, 86291, 86572, 87146, 87684, 87931, 87934, 87897, 87852, 87641, 87284, 87211, 87895, 89230, 90463, 90844, 90278, 89317, 88651, 88673, 89406, 90544, 91520, 91762, 91141, 90155, 89511, 89463, 89639, 89524, 89049, 88688, 89019, 90175, 91624, 92511, 92370, 91530, 90737, 90379, 90263, 90130, 90107, 90474, 91247, 92247, 93386, 94582, 95476, 95571, 94710, 93270, 91911, 91261, 91677, 92995, 94537, 95680, 96361, 96812, 96928, 96330, 95056, 93733, 92971, 92995, 93867, 95488, 97216, 98044, 97645, 96841, 96693, 97502, 99055, 101343, 104416, 107829, 110968, 113862, 117056, 120663, 124075, 126736, 128739, 130498, 132266, 134028, 135493, 136051, 135119, 132766, 129775, 126938, 124501, 122360, 120467, 118833, 117334, 115743, 113919, 111919, 110007, 108521, 107525, 106672, 105653, 104776, 104757, 105860, 107515, 108891, 109620, 109859, 109901, 109896, 109806, 109550, 109323, 109728, 111348, 114179, 117711, 121501, 125344, 128910]
54866A28910K765J736R39M07r3m43l90k03m62j199j831k097k424l093l635l359
54850A15528k230r10j35k14r34j792k371k615k654k518k151j640j167q11n65m32
54834I2389l01O8O75J123J141J039J174J308R73L53N9J36l9p12j271j063k72L10
54816I7090Q0q74j776j724n63P81J341J259J332J592J188j48j469j781j136j71
54800I5021P35J388J478J018N71N55O57M33N0q3m1j62m11n12m90n17m86j85K35
54781I9254M55M49L80K32k5j58K7L45O39J155K008K573K164J135N82R70J743K261
54763A16189K493K636K736K878L192L485L360K901K675K860K880K261J306N14
54749A52366k72j517l036l935l658k723k217k668l493l627k693j450r75j457k053
$$ y = [128910, 131675, 133411, 134350, 134757, 134664, 134221, 133831, 133628, 133166, 131967, 130136, 128039, 125615, 122522, 118887, 115528, 113298, 112388, 112253, 112039, 111105, 109313, 106942, 104327, 101673, 99155, 97004, 95364, 94197, 93386, 92821, 92389, 92088, 92156, 92831, 93954, 95095, 96134, 97308, 98616, 99589, 99942, 100001, 100137, 100098, 99386, 98115, 97052, 96780, 97090, 97170, 96296, 94520, 92796, 92233, 93014, 94355, 95614, 96946, 98538, 99726, 99578, 98109, 96328, 95192, 95021, 95756, 97144, 98622, 99640, 100211, 100766, 101423, 101856, 101906, 101823, 101782, 101620, 101209, 100697, 100207, 99690, 99204, 99019, 99254, 99709, 100158, 100538, 100770, 100745, 100587, 100614, 100959, 101598, 102753, 104761, 107334, 109498, 110633, 111215, 112185, 113928, 116189, 118682, 121318, 124054, 126932, 130124, 133609, 136969, 139870, 142545, 145405, 148285, 150546, 151852, 152366, 152094, 150577, 147541, 143606, 139948, 137225, 135008, 132340, 128847, 125220, 122527, 121077, 120102, 118645, 116592]
54734A16592j903j020k0O09P81N99K78J57M44Q80R62N80J65R4J75M8r2L83J616
54715A21328K879L388L225L065L154L100K656K115J742J226J74j194k235k660
54701A41963k761k883l059l139l069k922k786k657k377j798j064n95n98p67o89
54686A10799m23l91q10j439j885j896j462q19l29j25K9L59O95O99L86L9k65o42
54668A02520j013j107r44q81r98q79k38N55Q49M50k68q32r42m80L78J093J163
54651I8426P27M66P07R45N02m67j056o97K03Q72J090J150J160Q82K27m46p27n99
54633A03365l64l11m95p08o86m62m14p02q80m41L65Q39Q39Q08P73J99q56j386
54615I9483q09L1R6l20j79N70J021Q02M90M22J55o00j317j377q47j83K96L90l2
$$ y = [116592, 114689, 113669, 113649, 114258, 115039, 115638, 115916, 116073, 116517, 117397, 118359, 118939, 119104, 119198, 119373, 119421, 119329, 119712, 121328, 124207, 127595, 130820, 133885, 137039, 140139, 142795, 144910, 146652, 147878, 148052, 146858, 144623, 141963, 139202, 136319, 133260, 130121, 127052, 124130, 121344, 118687, 116310, 114512, 113448, 112853, 112255, 111488, 110799, 110376, 109985, 109175, 107736, 105851, 103955, 102493, 101674, 101345, 101220, 101249, 101608, 102303, 103002, 103388, 103427, 103162, 102520, 101507, 100400, 99456, 98575, 97577, 96698, 96460, 97015, 97864, 98314, 98046, 97214, 96272, 95792, 96170, 97263, 98426, 99153, 99619, 100326, 101271, 101773, 101306, 100250, 99553, 99756, 100628, 101718, 102868, 104028, 104910, 105137, 104691, 103964, 103365, 103001, 102690, 102195, 101487, 100801, 100339, 99925, 99223, 98343, 97902, 98267, 99106, 99945, 100753, 101526, 101725, 100869, 99483, 98674, 98705, 98801, 98481, 98302, 98872, 99893, 100695, 101185, 101607, 101762, 101162, 99845, 98468, 97621, 97438, 97734, 98124, 98092]
54596I8092o53p83j61O14P85L28j28k8O54J399J465N44p23j273q22j37O0o3l0
54577I9140J6l09o79k52J110K404K581J729Q55O12O31J96o62j159p92K6N48O05
54559A06600N55N63M69K26J8j05k19j29N31J649K520K548J744M92p71j583j708
54542A13400j471j349j150k01J362K303J772N08j36R3L41O6l30l64k09l36q07
54525A13492j180j034m11K24N28O92J095J555J443O07k65n34m08m22n64m78k05
54508A14135j17k67l32j53J42M05M38j25j282k221k036r00Q2K46OK1L35O29P90
54489A09796R07J011J036Q72L83l15o75k53N32P28R1n87n93j98l5q1J06N14O80
54470A13919M71K73L88O15N66J30m50p56m62L84J288J677J370O06k78j023j388
$$ y = [98092, 97439, 96656, 96495, 97109, 97894, 98222, 98094, 98066, 98720, 100119, 101584, 102128, 101405, 100132, 99310, 99173, 99233, 99170, 99140, 99156, 98847, 98168, 97916, 99026, 101430, 104011, 105740, 106595, 107207, 107838, 108034, 107372, 106213, 105421, 105447, 105995, 106600, 107155, 107718, 108187, 108413, 108431, 108326, 108107, 107978, 108509, 110158, 112678, 115226, 116970, 117462, 116691, 115108, 113400, 111929, 110580, 109430, 109229, 110591, 112894, 114666, 115174, 115038, 115131, 115472, 115538, 115208, 114844, 114635, 114299, 113492, 112312, 111278, 110867, 111091, 111619, 112311, 113406, 114961, 116404, 117011, 116746, 116212, 115804, 115382, 114818, 114340, 114135, 114018, 113751, 113419, 113266, 113408, 113813, 114251, 114126, 112844, 110623, 108587, 107687, 107769, 108015, 108021, 108042, 108377, 109006, 109796, 110703, 111714, 112750, 113622, 114005, 113690, 113015, 112762, 113294, 114022, 114113, 113526, 112933, 112735, 112700, 112619, 112725, 113239, 113919, 114390, 114663, 115051, 115666, 116232, 116362, 115912, 115156, 114694, 115078, 116366, 118043, 119413, 120019, 119741, 118718, 117330]
54453A17330j228o38R9P73J281J419R46q2j128j601j409j030r74j181j066j95
54437A11316J092J853J451J98r36j172m60O26J355J285N09m76j176j411j158l92
54421A12504O96J479J356N02k09k55k9q7l20l17k64o67j281j108K09J654J992
54404A15855J287P02J041J982K660K501J551L94k28q6K83K63%R8O14R65Q84Q07
54386A31573J067J300J074O00L41K42p7n84p70l44L52O63J59r02j593j076L18
54369A32343J208P08m84j036o59j52m6j12j14j83k32J57R13J257Q62N14R81J745
54351A37670J653N40n97j016j020j181j355r58K04J646K607K631J893J124R72
54336A44813J434K031K496K880K965K220P05n07n27J08O3r80j989k172k030k368
$$ y = [117330, 116102, 115464, 115563, 116336, 117617, 119036, 119982, 119900, 118772, 117171, 115762, 114732, 113758, 112577, 111511, 111316, 112408, 114261, 115712, 115910, 114974, 113802, 113342, 113968, 115323, 116608, 117117, 116641, 115465, 114054, 112896, 112504, 113200, 114679, 116035, 116537, 116328, 116073, 116044, 115957, 115637, 115320, 115056, 114389, 113108, 112000, 112209, 113863, 115855, 117142, 117844, 118885, 120867, 123527, 126028, 127579, 127973, 127745, 127659, 127942, 128205, 128205, 128303, 128917, 129882, 130766, 131573, 132640, 133940, 135014, 135614, 135955, 136197, 136120, 135536, 134766, 134422, 134774, 135437, 135596, 134694, 133101, 132025, 132343, 133551, 134259, 133775, 132739, 132080, 131928, 131882, 131770, 131656, 131473, 131241, 131398, 132311, 133568, 134430, 134944, 135925, 137670, 139323, 139863, 139266, 138250, 137230, 136049, 134694, 133736, 133940, 135586, 138193, 140824, 142717, 143841, 144813, 146247, 148278, 150774, 153654, 156619, 158839, 159544, 159037, 158510, 158618, 158681, 157701, 155712, 153540, 151510, 149142]
54320A49142k958k987k414j967j979j950j472q87p64j180j787k237k207j448j76
54305A22729Q56J083P38M11J70l78j192j459n07J198K306J982Q04N6K17N53K99
54288A29866k57l58K1K52J69L36J055J837K141J982J470M75p75j440j051k82l2
54271A35409k23j64K15L23p0n65q13p55l49L21P15M67J02M30J220J419P89K76
54253A38747M83P81M48k06n05m89n79o82m07J63N56O05M68K12r0r2M01Q70O26
54234A41310k59r94j103q34n43k26J82M59L44j30p22j248j568j510j011l36J1
54217A31822k01n70m53J62M72p6q12n74N73J222N20o08o72M94J743K083J381K1
54199A36527j278j560m81R23J255O15L97J088J387J86j607k269j567p84p21q12
$$ y = [149142, 146184, 143197, 140783, 138816, 136837, 134887, 133415, 132528, 131764, 130584, 128797, 126560, 124353, 122905, 122729, 123585, 124668, 125406, 125817, 125987, 125609, 124417, 122958, 122451, 123649, 125955, 127937, 128741, 128797, 129014, 129567, 129866, 129609, 129251, 129272, 129524, 129693, 130029, 131084, 132921, 135062, 137044, 138514, 138989, 138214, 136774, 135723, 135441, 135409, 135186, 135022, 135237, 135560, 135490, 134925, 134112, 133357, 133008, 133329, 134044, 134511, 134613, 135043, 136263, 137682, 138471, 138747, 139230, 140011, 140459, 140253, 139748, 139259, 138680, 137998, 137591, 137754, 138310, 138915, 139383, 139595, 139505, 139413, 139814, 140684, 141310, 141051, 140057, 138954, 138120, 137577, 137351, 137533, 137992, 138336, 138206, 137484, 136236, 134668, 133158, 132147, 131811, 131822, 131621, 131051, 130598, 130760, 131232, 131156, 130344, 129770, 130343, 131565, 132085, 131477, 130805, 131299, 133042, 135125, 136506, 136527, 135249, 133689, 133208, 134131, 135386, 136001, 136398, 137486, 138873, 139059, 137452, 135183, 133616, 132832, 132111, 131299]
54183A31299l20N84J214J152L41r38j885j624l25O75M42l72n15P4L97O4k04O7
54165A30126K60k45r12p88L1N92M96L15N07O46J32q65j560j453p73j23J51K69
54147A26806O73J384J807J446O21R9J09K05Q3l4k6j98o47q19k60N72Q08L10k15
54128A32724j66K69N20L21q5k34J06O79R98Q79O18N39O14O73O98P13O55O42R80
54109A42143J556J584N13r84j550o89P50J650J656J086L31l20o65o99n67l23R4
54092A45566N40O45L03j10j63J38N29Q71J172J328J169P60M35M48O17N09j9n01
54074A54237k84P35J939K638K680K350J971J721J598J295M60o35j047k65R64J521
54058A71878J382J375J743J832J359R83J174J406J028L69K78R98K116L271M299
$$ y = [131299, 130979, 131563, 132777, 133929, 134270, 133332, 131447, 129823, 129498, 130173, 130615, 130243, 129728, 129802, 130199, 130263, 130059, 130126, 130386, 130141, 129229, 128441, 128472, 129064, 129560, 129875, 130382, 131028, 131160, 130295, 128735, 127282, 126509, 126386, 126537, 126806, 127479, 128863, 130670, 132116, 132737, 132836, 132945, 133150, 133233, 133199, 133173, 132975, 132328, 131509, 131249, 131821, 132629, 132939, 132724, 132558, 132827, 133347, 133668, 133583, 133349, 133455, 134134, 135132, 136011, 136629, 137168, 137782, 138455, 139153, 139866, 140521, 141163, 142143, 143699, 145283, 145796, 144812, 143262, 142573, 143323, 144973, 146629, 147715, 148046, 147726, 147061, 146362, 145795, 145472, 145566, 146106, 146751, 147054, 146944, 146781, 146919, 147448, 148319, 149491, 150819, 151988, 152748, 153183, 153631, 154248, 154757, 154738, 154237, 153953, 154688, 156627, 159265, 161945, 164295, 166266, 167987, 169585, 170880, 171340, 170705, 169658, 169393, 170357, 171878, 173260, 174635, 176378, 178210, 179569, 180552, 181726, 183132, 184160, 184529, 184807, 185805, 187921, 191192, 195491]
54043A95491M947N133N219N533N784N607N400N901O957P566P306O919P207P955
54029B82925Q383Q209P750P260O658N775M499K751O30j417k873l624l967m273
54015C18686m724n328n930o221o011n576n485n921o348o149n419m818m590m218
54001B41948l329k521k655l491l797l060k313k654l527l380j928o41p68j699j945
53986B04240j176m36n23j054j255j040q95j054j251j187q64m50r4Q6L5q5K3L79
53968A93399N76K34l56l90N57J883K451J746M14l90j37O20R28M86l7K12J272K345
53950B05813K738K600K574K988L583L916L749L149K480K317K998M223N264N683
53936B54075N600N248M592L636K831K826L749M943N516N148M392M146M777N755
$$ y = [195491, 200438, 205571, 210790, 216323, 222107, 227714, 233114, 239015, 245972, 253538, 260844, 267763, 274970, 282925, 291308, 299517, 307267, 314527, 321185, 326960, 331459, 334210, 334840, 333423, 330550, 326926, 322959, 318686, 313962, 308634, 302704, 296483, 290472, 284896, 279411, 273490, 267142, 260993, 255574, 250756, 246166, 241948, 238619, 236098, 233443, 229952, 226155, 223095, 220782, 218128, 214601, 211221, 209293, 208652, 207884, 206185, 204240, 203064, 202628, 202105, 201051, 199796, 198756, 197861, 196807, 195556, 194369, 193505, 193055, 192961, 193047, 193082, 192997, 193020, 193399, 193975, 194209, 193853, 193463, 194020, 195903, 198354, 200100, 200514, 200124, 199987, 200607, 201535, 202021, 201984, 202196, 203468, 205813, 208551, 211151, 213725, 216713, 220296, 224212, 227961, 231110, 233590, 235907, 238905, 243128, 248392, 254075, 259675, 264923, 269515, 273151, 275982, 278808, 282557, 287500, 293016, 298164, 302556, 306702, 311479, 317234]
53922C17234O288O168N799N474N105M719M738N366O112O346O086N755N386M637
53908C95213L552K641K091J476M48o83j461j914k368k855l151l245l416l807m169
53893C78352m140l717l430l928n192o260o103m841l614l132k883k119j034l47
53879C27612j89j49j51l96n10K72J820K874K524J236j20j531l467n671p284p992
53863C08878q308q647q785q456p845p252o626n760m706l799l415l736m475m839
53849B22229m158k731j634j452j581j155k59L10K20j19l19m74p11q33p04n16m40
53832B05673l78k97m22p51p66j41N76O07P0j72K25P07Q01Q20J156J575J675J676
53814B12634K105K890L366L196K753K577K730K925K909K714K641L032L871M677
$$ y = [317234, 323522, 329690, 335489, 340963, 346068, 350787, 355525, 360891, 367003, 373349, 379435, 385190, 390576, 395213, 398765, 401406, 403497, 404973, 405421, 404738, 403277, 401363, 398995, 396140, 392989, 389744, 386328, 382521, 378352, 374212, 370495, 367065, 363137, 357945, 351685, 345582, 340741, 337127, 333995, 331112, 328993, 327959, 327612, 327423, 327274, 327123, 326727, 326217, 326489, 328309, 331183, 333707, 334943, 334823, 333292, 329825, 324154, 316870, 308878, 300570, 291923, 283138, 274682, 266837, 259585, 252959, 247199, 242493, 238694, 235279, 231543, 227068, 222229, 218071, 215340, 213706, 212254, 210673, 209518, 209259, 209569, 209789, 209670, 209351, 208877, 208166, 207333, 206629, 206113, 205673, 205295, 204998, 204576, 203825, 203059, 202918, 203494, 204101, 204171, 203999, 204224, 204931, 205732, 206552, 207708, 209283, 210958, 212634, 214739, 217629, 220995, 224191, 226944, 229521, 232251, 235176, 238085, 240799, 243440, 246472, 250343, 255020]
53800B55020M980M838M632M408L815K704J447N86L47O21J160J680J990K077J964
53785B92269J470M28r06j969k510k751k916k917k721k646k980l560l976m097m109
53770B56109m175m253m218l952l443k871k506k423k444k397k334k321k223j822
53756B14727j111l77k3k50p74j003p55o25j233k228k557j823p84l00l71m85l38
53739A99690J68J097K155K624K161J318Q14O57M59J98M3j63n50p11k83K15%o72
53721B09220o97L18J637K560L127L419L083K061J076Q24J138J418J427J247Q70
53706B32728L89K39P28J533K022J987J712J528J596J957K414K594K413K255K412
53691B58507K545K145J404J101J519J925J425R7j039j202o92l98o44r27p87m62
$$ y = [255020, 260000, 264838, 269470, 273878, 277693, 280397, 281844, 282430, 282777, 283398, 284558, 286238, 288228, 290305, 292269, 293739, 294167, 293261, 291292, 288782, 286031, 283115, 280198, 277477, 274831, 271851, 268291, 264315, 260218, 256109, 251934, 247681, 243463, 239511, 236068, 233197, 230691, 228268, 225824, 223427, 221093, 218772, 216549, 214727, 213616, 213239, 213216, 212966, 212192, 211189, 210434, 209809, 208576, 206348, 203791, 201968, 201184, 200884, 200513, 200028, 199690, 199858, 200955, 203110, 205734, 207895, 209213, 210027, 210684, 211143, 211341, 211384, 211221, 210671, 209960, 209677, 209892, 209892, 209220, 208523, 208841, 210478, 213038, 216165, 219584, 222667, 224728, 225804, 226628, 227766, 229184, 230611, 231858, 232728, 233117, 233356, 234084, 235617, 237639, 239626, 241338, 242866, 244462, 246419, 248833, 251427, 253840, 256095, 258507, 261052, 263197, 264601, 265702, 267221, 269146, 270571, 270668, 269629, 268427, 267735, 267337, 266693, 265766, 264979, 264517]
53675B64517l98n61o23o18p59q59n51q3j43q14j324j128n59j43J72O72J237J534
53657B59569J523J335R80N67N35J165K016K242J498K11q61j254j062p69o59m66
53641B66570J25P62Q34N95J053K427L539L334K275J474J133P19K87N26J562K637
53625B89852L083K915K428J845J441J463J784K051K214K431K608K535K427K680
53611C21757L151L306L077K961L170L318L081K604K151J872K044K763L369K828
53597C61452J080o62j260p93l1N60Q36N84j84q32o49K52R98R21K37j82L80J702
53579C64409K655K285R21j61j99L37O40N08J66k89p49r17p27n81p29p76l30K39
53561C66702K98o1k19j4J70K09M24Q86J188J174J316K021K974L510L416L049K846
$$ y = [264517, 264119, 263558, 262935, 262317, 261558, 260699, 260148, 260065, 259922, 259108, 257784, 256656, 256097, 255954, 256126, 256798, 258035, 259569, 261092, 262427, 263407, 263974, 264509, 265674, 267690, 269932, 271430, 271641, 270780, 269526, 268464, 267695, 267036, 266570, 266695, 267457, 268291, 268886, 269939, 272366, 275905, 279239, 281514, 282988, 284121, 284840, 285127, 285653, 287215, 289852, 292935, 295850, 298278, 300123, 301564, 303027, 304811, 306862, 309076, 311507, 314115, 316650, 319077, 321757, 324908, 328214, 331291, 334252, 337422, 340740, 343821, 346425, 348576, 350448, 352492, 355255, 358624, 361452, 362532, 361870, 360610, 359817, 359786, 360346, 361182, 361766, 361582, 360750, 360101, 360353, 361351, 362272, 362509, 362327, 362707, 364409, 367064, 369349, 370270, 370109, 369910, 370247, 370887, 371395, 371561, 371272, 370523, 369606, 368879, 368298, 367569, 366793, 366463, 366702, 367000, 366939, 366720, 366706, 366876, 367085, 367509, 368395, 369583, 370757, 372073, 374094, 377068, 380578, 383994, 387043, 389889]
53544C89889K979L388L913M332M522M666N227O474Q016Q952Q781Q008P573P784
53530D74504Q179Q450Q925R894J1046J1986J2837J3819J4589J4693J4401J4388
53518F17711J4712J4909J5004J5560J6541J7104J7013J7350J8984K1008K1705
53507H07601K0825J9798J9631J9739J9260J8544J8457J8807J8549J7407J6344
53496A014962J6114J6288J6106J5678J5604J5880J5939J5557J5014J4461J3774
53485A185377J3101J2824J2883J2747J2264J1819J1462J0603R016P412O364N309
53473A311181L380Q35j264k575l789n415p082q239q917r513j0223j0873j1131
53460A236375j0828j0373j0609j1856j3281j3798j3442j3172j3378j3501j3214
$$ y = [389889, 392868, 396256, 400169, 404501, 409023, 413689, 418916, 425390, 433406, 442358, 451139, 459147, 466720, 474504, 482683, 491133, 500058, 509952, 520998, 532984, 545821, 559640, 574229, 588922, 603323, 617711, 632423, 647332, 662336, 677896, 694437, 711541, 728554, 745904, 764888, 785896, 807601, 828426, 848224, 867855, 887594, 906854, 925398, 943855, 962662, 981211, 998618, 1014962, 1031076, 1047364, 1063470, 1079148, 1094752, 1110632, 1126571, 1142128, 1157142, 1171603, 1185377, 1198478, 1211302, 1224185, 1236932, 1249196, 1261015, 1272477, 1283080, 1292096, 1299508, 1305872, 1311181, 1314561, 1315396, 1314132, 1311557, 1307768, 1302353, 1295271, 1287032, 1278115, 1268602, 1258379, 1247506, 1236375, 1225547, 1215174, 1204565, 1192709, 1179428, 1165630, 1152188, 1139016, 1125638, 1112137, 1098923]
53449A098923j3063j3433j3620j2618j0422q019o315n498n183m814m073l142k384
53436I96339j774r59N4Q56J406K194L326M272M901O003Q044J0208J1518J2256
53422A058644J3276J4424J4918J5018J5929J7968K0059K1337K2176K3197K4241
53411A261187K5014K5828K7108K8729L0391L2064L3579L4451L4712L5279L6831
53400A605173L8790M0197M1036M1879M2638M2703M2132M1673M1522M1031L9832
53389B058606L8449L7437L6568L5304L3578L1713K9848K7847K5541K2872J9871
53378B397634J6641J3277R787O268K963j17l493p615j2001j5666j8435k1214k4749
53365B343280k8690l2213l4942l6824l7757l7895l7906l8242l8467l7874l6603
$$ y = [1098923, 1085860, 1072427, 1058807, 1046189, 1035767, 1027748, 1021433, 1015935, 1010752, 1005938, 1001865, 998723, 996339, 994565, 993606, 993660, 994516, 995922, 998116, 1001442, 1005714, 1010615, 1016618, 1024662, 1034870, 1046388, 1058644, 1071920, 1086344, 1101262, 1116280, 1132209, 1150177, 1170236, 1191573, 1213749, 1236946, 1261187, 1286201, 1312029, 1339137, 1367866, 1398257, 1430321, 1463900, 1498351, 1533063, 1568342, 1605173, 1643963, 1684160, 1725196, 1767075, 1809713, 1852416, 1894548, 1936221, 1977743, 2018774, 2058606, 2097055, 2134492, 2171060, 2206364, 2239942, 2271655, 2301503, 2329350, 2354891, 2377763, 2397634, 2414275, 2427552, 2437339, 2443607, 2446570, 2446453, 2442960, 2435345, 2423344, 2407678, 2389243, 2368029, 2343280, 2314590, 2282377, 2247435, 2210611, 2172854, 2134959, 2097053, 2058811, 2020344, 1982470, 1945867]
53354A945867l5459l4840l4435l3918l3280l2503l1591l0962l1158l1947l2302
53343A583472l1561l0091k8498k6821k4953k3336k2515k2254k1701k0450j8881
53332A312411j7421j6072j4794j3914j3702j3862j3817j3407j2977j2755j2450
53321A157240j1684j0488r274q295p422o385n060l499j822j86J266K485L510M356
53307A104742N053N753O653P766Q928J0037J1123J2172J3088J3942J4988J6227
53295A230472J7212J7565J7447J7299J7285J7240J7008J6488J5545J4168J2631
53284A410360J1148R503P414N132L249J900O38r14k725m680o735q673j0123j1089
53270A404405j2043j3359j4977j6716j8423j9709k0112j9822j9772k0549k1672
$$ y = [1945867, 1910408, 1875568, 1841133, 1807215, 1773935, 1741432, 1709841, 1678879, 1647721, 1615774, 1583472, 1551911, 1521820, 1493322, 1466501, 1441548, 1418212, 1395697, 1373443, 1351742, 1331292, 1312411, 1294990, 1278918, 1264124, 1250210, 1236508, 1222646, 1208829, 1195422, 1182445, 1169690, 1157240, 1145556, 1135068, 1125794, 1117499, 1110077, 1103692, 1098632, 1095133, 1093311, 1093125, 1094391, 1096876, 1100386, 1104742, 1109795, 1115548, 1122201, 1129967, 1138895, 1148932, 1160055, 1172227, 1185315, 1199257, 1214245, 1230472, 1247684, 1265249, 1282696, 1299995, 1317280, 1334520, 1351528, 1368016, 1383561, 1397729, 1410360, 1421508, 1431011, 1438425, 1443557, 1446806, 1448706, 1449344, 1448430, 1445705, 1441025, 1434290, 1425617, 1415494, 1404405, 1392362, 1379003, 1364026, 1347310, 1328887, 1309178, 1289066, 1269244, 1249472, 1228923, 1207251]
53259A207251k2281k2147k1623k0981k0401k0224k0611k1158k1351k1241k1160
53248I74073k1000k0471j9857j9707j9742j9011j7378j6098j6287j7389j7819
53237G69314j6957j5723j5179j5106j4399j2596j0573r568r804j0390j0512j0298
53225F18209j0322j0695j1020j1104j1202j1572j2090j2429j2354j1800j0863
53214D92758r789q844q173p812p725p695p381o711o077n909o194o634p014p163
53200C89637o884o299n986o173o185n295l958l286l498l782l736l825m201m219
53186C22310l649l294l631l788k876j605j345k090k562k198j796k037k516k570
53172B86353k244j888j511r32k46K63L93Q2n28r75r12o65r13j680k237k132j693
$$ y = [1207251, 1184970, 1162823, 1141200, 1120219, 1099818, 1079594, 1058983, 1037825, 1016474, 995233, 974073, 953073, 932602, 912745, 893038, 873296, 854285, 836907, 820809, 804522, 787133, 769314, 752357, 736634, 721455, 706349, 691950, 679354, 668781, 659213, 649409, 639019, 628507, 618209, 607887, 597192, 586172, 575068, 563866, 552294, 540204, 527775, 515421, 503621, 492758, 482969, 474125, 465952, 458140, 450415, 442720, 435339, 428628, 422551, 416642, 410448, 403814, 396800, 389637, 382753, 376454, 370468, 364295, 358110, 352815, 348857, 345571, 342073, 338291, 334555, 330730, 326529, 322310, 318661, 315367, 311736, 307948, 305072, 303467, 302122, 300032, 297470, 295272, 293476, 291439, 288923, 286353, 284109, 282221, 280710, 279778, 279532, 279795, 280188, 280270, 279742, 278767, 277855, 277190, 276277, 274597, 272360, 270228, 268535]
53155B68535j216m32P30J460R61l92j479j846j940k099k046j508o84P7N91N91
53139B59303k35j597k454j973n56N43N45k16r52j336j571j854k060j951j508q91
53123B41237k27M39R35J012P09N25R13J623J858J205J72m37m31k29j16M0K87L18
53105B49833k9m10m94o17j318k372k882k446j634j053n52J66P01M19m65j044r61
53088B34842p94j068j527j670j440j014l59M58R00M98l78q00l57M35P88M39k68
53071B28685p79q05n31l98n96q52r05q82r57q55j92P57J224R30M34L27N16N72
53053B25693L96K09J52K09L54N26N49L23j1k76m71n88m49N2O41Q20L50n66j438
53034B26475j757j397q39p49j145j321q36j40J38J71N01R72Q90K32j86P2M18K31
$$ y = [268535, 267319, 266887, 267617, 269077, 270038, 269646, 268167, 266321, 264381, 262282, 260236, 258728, 258044, 258121, 258712, 259303, 259068, 257471, 255017, 253044, 252488, 253031, 253576, 253360, 252408, 251072, 249501, 247647, 245587, 243636, 242128, 241237, 241010, 241449, 242384, 243396, 244105, 244630, 245543, 247166, 249024, 250229, 250401, 249964, 249533, 249304, 249188, 249228, 249515, 249833, 249804, 249394, 248900, 248283, 246965, 244593, 241711, 239265, 237631, 236578, 236026, 236192, 236893, 237312, 236847, 235803, 234842, 234048, 232980, 231453, 229783, 228343, 227329, 226970, 227428, 228328, 228826, 228448, 227648, 227291, 227726, 228514, 228953, 228685, 227906, 227101, 226570, 226172, 225576, 224724, 223819, 222937, 221980, 221125, 220933, 221690, 222914, 223844, 224278, 224605, 225121, 225693, 226089, 226298, 226450, 226659, 227013, 227539, 228088, 228411, 228400, 228124, 227653, 227065, 226616, 226668, 227309, 228129, 228479, 227913, 226475, 224718, 223321, 222482, 221733, 220588, 219267, 218431, 218291, 218429, 218600, 219101, 220073, 220963, 221195, 221009, 221081, 221499, 221730]
53016B21730j32N2P29J128Q10J69j56N7M90O42L11j59k63k6N2j60j18M99J067
52997B26722Q26Kn47n86n69o02j88P71J555J602J260J099J031O82J81j2J63L61
52979B33751M30N46Q11J087J219J072N46j53m59l7O50Q71N76L92O90J200J552
52962B44744J688J581J122M63J02L03P59J028R70O16q9j078j989k486k561k361
52946B42812j979j597j441j385r59q3O00N51R5j33j94n46r85p76J56Q63O10j79
52928B35430n68l12N7%n14j156j540j442r11j80M94Q27N36l20j108j166o18k01
52910B27308k22k52K6K59J27p1J2R9j92n54m48k7J31J9J55N78P41M75K59L32K58
52889B29013k39p07o52k40J07L18M04O4p63j362r67J26Q36O83K02m7j81m68o63
$$ y = [221730, 221598, 221650, 222379, 223507, 224317, 224486, 224330, 224387, 224877, 225519, 225830, 225671, 225408, 225382, 225434, 225274, 225156, 225655, 226722, 227548, 227550, 227003, 226417, 225848, 225246, 225058, 225829, 227384, 228986, 230246, 231345, 232376, 233058, 233239, 233227, 233390, 233751, 234181, 234727, 235538, 236625, 237844, 238916, 239462, 239309, 238850, 238813, 239463, 240334, 240910, 241302, 241992, 243192, 244744, 246432, 248013, 249135, 249598, 249700, 250003, 250762, 251790, 252760, 253376, 253287, 252209, 250220, 247734, 245173, 242812, 240833, 239236, 237795, 236410, 235451, 235368, 235968, 236519, 236614, 236481, 236287, 235741, 234756, 233980, 234136, 234999, 235609, 235430, 234862, 234550, 234607, 234607, 234093, 232937, 231397, 229955, 229044, 228864, 229358, 230185, 230721, 230401, 229293, 228127, 227509, 227308, 227086, 226834, 226860, 227119, 227246, 227175, 227187, 227286, 227094, 226540, 226092, 226065, 226196, 226215, 226370, 226948, 227689, 228164, 228423, 228755, 229013, 228774, 228067, 227415, 227175, 227282, 227600, 228004, 228068, 227305, 225943, 224976, 225102, 225938, 226621, 226823, 226776, 226595, 226127, 225464]
52870B25464l86K02O11P68J059J599J843J249Q5p22n74J47N96M06j4j44ql1l94
52851B31756p47o36j26J99j52r83j634j755j592j461j240p34k97n42j443k222
52835B16391k302j937j612j278n94L48R81R14L32k05k10L27Q36O66j40q31r23
52818B10763q02r64j097n84L11O09J1o43o00j16J97M18J053K068K773K642J799
52801B17838P30j25n03m14k43m76j196j972k301k046j456q44l36K02Q80J512J682
52784B10932J187L44k90m47k97j29j07k25l13p7O02J349J494P85k59q64p59l01
52766B12625Q6K76K89O6m00r30j325j574j628j165L8J496K274J980J179N67J22
52749B13976m36p92k76R80J895J684P09j94p49j085j005j78J074J883J927J774
$$ y = [225464, 225078, 225280, 225891, 226659, 227718, 229317, 231160, 232409, 232494, 231772, 231198, 231345, 231941, 232347, 232333, 232189, 232181, 232150, 231756, 231009, 230373, 230247, 230446, 230294, 229311, 227677, 225922, 224330, 222869, 221629, 220895, 220598, 220056, 218613, 216391, 214089, 212152, 210540, 209262, 208668, 209016, 209997, 210911, 211243, 211038, 210828, 211155, 211991, 212657, 212517, 211686, 210763, 209961, 208997, 207900, 207316, 207627, 208236, 208247, 207604, 207004, 206888, 207085, 207503, 208556, 210624, 213397, 216039, 217838, 218568, 218443, 217940, 217526, 217283, 216807, 215611, 213639, 211338, 209292, 207836, 206992, 206656, 206858, 207738, 209250, 210932, 212119, 212463, 212173, 211726, 211429, 211300, 211193, 210968, 210655, 210578, 211180, 212529, 214023, 214808, 214549, 213685, 212926, 212625, 212711, 212987, 213276, 213342, 212942, 212012, 210687, 209113, 207485, 206320, 206358, 207854, 210128, 212108, 213287, 213854, 213976, 213540, 212748, 212472, 213452, 215347, 217031, 217740, 217546, 216797, 215712, 214707, 214529, 215603, 217486, 219413, 221187]
52733B21187J921K028J580Q46N56P96R40O27K38J33Q0k03m28k15J59P6m71r21
52715B28929j033j131j298j086l09M55O29M50M54N32J82m69o99k89J02j08n88
52698B24723n98k8N15M77m9n09m82p9K22J43q4j09M5R7M5J85N79Q87Q50O12L98
52677B27840K37J72L92Q39J000M84l46p93p34o88r18r44k18J022J907J902J309
52660B32463P77N45L92J82Q2K15L56K63R5J93N84R69J181J254J102N36k03m55
52642B40531J1N08J89q25j589j518j021p87q13m90M32J348J456P10j53n15m80
52625B36994m39l37J89J102J754J549N90l75n80J14J042J338R16N79Q67J135M53
52608B46891p99j192j99R95J091L11j70J47P83J151J134Q72O00O13R30J145R19
$$ y = [221187, 223108, 225136, 226716, 227562, 228118, 228914, 229854, 230481, 230719, 230852, 230932, 230729, 230301, 230086, 230245, 230321, 229850, 228929, 227896, 226765, 225467, 224381, 224072, 224527, 225156, 225606, 226060, 226592, 226774, 226305, 225606, 225317, 225419, 225311, 224723, 224125, 224097, 224612, 225089, 225040, 224531, 224049, 223970, 224192, 224335, 224251, 224142, 224187, 224284, 224329, 224514, 225093, 225980, 226830, 227442, 227840, 228077, 228249, 228641, 229480, 230480, 230964, 230618, 229825, 229091, 228403, 227485, 226541, 226323, 227345, 229252, 231154, 232463, 233240, 233785, 234177, 234359, 234441, 234656, 235012, 235275, 235370, 235563, 236147, 237116, 238297, 239551, 240653, 241189, 240986, 240531, 240542, 241050, 241239, 240414, 238825, 237307, 236286, 235499, 234686, 234196, 234628, 235976, 237432, 238142, 237989, 237474, 236994, 236555, 236218, 236407, 237509, 239263, 240812, 241402, 241027, 240447, 240561, 241603, 242941, 243857, 244436, 245303, 246438, 246891, 246092, 244900, 244701, 245696, 246787, 247098, 246928, 247075, 247858, 249009, 250143, 251015, 251615, 252228, 253158, 254303, 255222]
52591B55222M38K9l35o59m84N39J840K395J890Q58j82j025j361q61J47Q27P49
52574B60027K00m76j145j446r16J75Q10M05n22j159j289j067n58L9K70J7k00j5
52556B53150K15J01KM09R42Q23Q3m23j79M34Q03O80R9o93j136p58J83Q69Q81N21
52536B57006J18m44j208j729j530o99K98J080J367Q97j88j124j179m73K41M99
52520B52932M70M43M13L04K07K15L08M90P94J099J256J441K036K910L202K296
52504B70816P55j76J17J128J982K174J617N07o61j392j729k149k749k920k200
52489B65120j057l77m04o20n92m16k96j46J87N81P28M59o1m60m23O3P35J305J608
52470B65934J496Q82L7l86K9R33J593J723J652J731J903J897J591J133Q03P52
$$ y = [255222, 255660, 255689, 255354, 254695, 254211, 254750, 256590, 258985, 260875, 261733, 261551, 260526, 259165, 258304, 258451, 259278, 260027, 260227, 259751, 258606, 257160, 256244, 256419, 257229, 257634, 257112, 255953, 254664, 253597, 253039, 253078, 253348, 253365, 253165, 253150, 253365, 253466, 253468, 253877, 254819, 255642, 255725, 255302, 255123, 255557, 256360, 257040, 257139, 256446, 255310, 254552, 254735, 255604, 256485, 257006, 257124, 256680, 255472, 253743, 252213, 251514, 251812, 252892, 254259, 255156, 254968, 253844, 252665, 252192, 252433, 252932, 253402, 253845, 254258, 254562, 254769, 254984, 255292, 255782, 256576, 257675, 258931, 260372, 262408, 265318, 268520, 270816, 271571, 271395, 271512, 272640, 274622, 276796, 278413, 278920, 278259, 276867, 275138, 272989, 270240, 267320, 265120, 264063, 263686, 263282, 262662, 262070, 261654, 261358, 261212, 261399, 261980, 262708, 263167, 263106, 262646, 262223, 262286, 263021, 264326, 265934, 267430, 268312, 268349, 267963, 267992, 268925, 270518, 272241, 273893, 275624, 277527, 279424, 281015, 282148, 282951, 283703]
52454B83703Q00O28K37n2k09o31j392j827j469r50j252k243k808k435j793j552
52438B66755j531j349j164j257j379j049k46N62Q86N54p7k04O67J919K351J712
52422B67150J020J110J568J615J309J239J604K247L074L819L804K806J726J678
52408B95769K680L927M982N881O408O279N855N666N297L840J426p48k101l253
52394C41908m577n303m741l520k768k658k534k030j342o35J22Q69J467J936K269
52379C18463K298K016J811J938K097J981J927K443L304L756L616L484L805M219
52365C57158M105L414K791K921L792M461L809J879K36L96J912K785J935N16L29
52350C92439J512K706L073L210L931N060N890O250O514O863P181P520Q146R036
$$ y = [283703, 284503, 285131, 285368, 285316, 285107, 284476, 283084, 281257, 279788, 278838, 277586, 275343, 272535, 270100, 268307, 266755, 265224, 263875, 262711, 261454, 260075, 259026, 258780, 259342, 260228, 260782, 260705, 260501, 261168, 263087, 265438, 267150, 268170, 269280, 270848, 272463, 273772, 275011, 276615, 278862, 281936, 285755, 289559, 292365, 294091, 295769, 298449, 302376, 307358, 313239, 319647, 325926, 331781, 337447, 342744, 346584, 348010, 347262, 345161, 341908, 337331, 332028, 327287, 323767, 320999, 318341, 315807, 313777, 312435, 311800, 311922, 312791, 314258, 316194, 318463, 320761, 322777, 324588, 326526, 328623, 330604, 332531, 334974, 338278, 342034, 345650, 349134, 352939, 357158, 361263, 364677, 367468, 370389, 374181, 378642, 382451, 384330, 384566, 384962, 386874, 389659, 391594, 392110, 392439, 393951, 396657, 399730, 402940, 406871, 411931, 417821, 424071, 430585, 437448, 444629, 452149, 460295, 469331]
52336D69331R849J0467J1114J1827J2252J2350J2767J4061J5778J6872J6983J6830
52324F30481J7215J8121J8922J9234J9241J9356J9690J9891J9479J8350J6862
52313H36842J5338J3692J1802R999Q834Q356Q072P614P048O437N630M630L798
52300I48092L349K947K146J071K78R7K72K51l72j483k440k606k071j598j672j905
52284I44356j609p11L52J413K798M704O797Q550R755J0580J1304J1992J2416J2318
52270A035015J1890J1730J2135J2668J2654J2033J1229J0445R508Q434P577P078
52258A162396O584N753M693L701K908K349K042J713Q65n26j695j923j489j294
52244A186077j721k358k860l366l936m136l641k936k836l366l603k724r48Q16
$$ y = [469331, 479180, 489647, 500761, 512588, 524840, 537190, 549957, 564018, 579796, 596668, 613651, 630481, 647696, 665817, 684739, 703973, 723214, 742570, 762260, 782151, 801630, 819980, 836842, 852180, 865872, 877674, 887673, 896507, 904863, 912935, 920549, 927597, 934034, 939664, 944294, 948092, 951441, 954388, 956534, 957605, 957883, 957980, 958252, 958503, 958131, 956648, 954208, 951602, 949531, 947933, 946261, 944356, 942747, 942036, 942388, 943801, 946599, 951303, 958100, 966650, 976405, 986985, 998289, 1010281, 1022697, 1035015, 1046905, 1058635, 1070770, 1083438, 1096092, 1108125, 1119354, 1129799, 1139307, 1147741, 1155318, 1162396, 1168980, 1174733, 1179426, 1183127, 1186035, 1188384, 1190426, 1192139, 1193004, 1192478, 1190783, 1188860, 1187371, 1186077, 1184356, 1181998, 1179138, 1175772, 1171836, 1167700, 1164059, 1161123, 1158287, 1154921, 1151318, 1148594, 1147646, 1148462]
52230A148462J980K633K993K976K522K099K337L220M055M390M568N071N686N873
52216A198865N665N668O102O501O521O462O676P019P262P614Q244Q653Q193P085
52202A296530O169N724N271M623M291M445M277L107J618J120J791K528K541K261
52188A346296K317K389J756N43l74o31q33j517k271k343j842j673k324l271l819
52173A332403m053m507n174n428m975m325m089m165l975l266k254j143M1J100
52159A286190J573J299Q22R22J754K749L303L310K933K191J096K3n01m37l17m91
52143A306419o39k62O00J511K270L000L749M406N006N657O241O587O950P781Q973
52128A368249R951J0644J1690J3390J5117J6287J7327J8972K1016K2532K3146
$$ y = [1148462, 1150442, 1153075, 1156068, 1159044, 1161566, 1163665, 1166002, 1169222, 1173277, 1177667, 1182235, 1187306, 1192992, 1198865, 1204530, 1210198, 1216300, 1222801, 1229322, 1235784, 1242460, 1249479, 1256741, 1264355, 1272599, 1281252, 1289445, 1296530, 1302699, 1308423, 1313694, 1318317, 1322608, 1327053, 1331330, 1334437, 1336055, 1337175, 1338966, 1341494, 1344035, 1346296, 1348613, 1351002, 1352758, 1353301, 1352927, 1352296, 1351463, 1349946, 1347675, 1345332, 1343490, 1341817, 1339493, 1336222, 1332403, 1328350, 1323843, 1318669, 1313241, 1308266, 1303941, 1299852, 1295687, 1291712, 1288446, 1286192, 1285049, 1285090, 1286190, 1287763, 1289062, 1289884, 1290806, 1292560, 1295309, 1298612, 1301922, 1304855, 1307046, 1308142, 1308165, 1307664, 1307227, 1306910, 1306419, 1305780, 1305518, 1306118, 1307629, 1309899, 1312899, 1316648, 1321054, 1326060, 1331717, 1337958, 1344545, 1351495, 1359276, 1368249, 1378200, 1388844, 1400534, 1413924, 1429041, 1445328, 1462655, 1481627, 1502643, 1525175, 1548321]
$$ [...]
##END NTUPLES=NMR SPECTRUM
##END=
