
##TITLE=AC1361_QARH12183_7155206_JLfaZ40g7r
##JCAMPDX= 6.0         $$ Bruker NMR JCAMP-DX V2.0
##DATA TYPE= NMR SPECTRUM
##DATA CLASS= NTUPLES
##ORIGIN= BRUKER
##OWNER= Administrator
$$ 1.72 TOPSPIN		Version 2.1
$$ 2012-12-01 11:03:02.927 -0500  Administrator@X
$$ Compression mode = diff/dup
##.OBSERVE FREQUENCY= 400.02188249412
##.OBSERVE NUCLEUS= ^1H
##.ACQUISITION MODE= SIMULTANEOUS (DQD)
##.ACQUISITION SCHEME= undefined
##.AVERAGES= 8
##.DIGITISER RES= 22
##SPECTROMETER/DATA SYSTEM= spect
##.PULSE SEQUENCE= zg30
##.SOLVENT NAME= COFFEE_meoh
##.SHIFT REFERENCE= INTERNAL, COFFEE_meoh, 1, 14.98509
##AUDIT TRAIL= $$ (NUMBER, WHEN, WHO, WHERE, PROCESS, VERSION, WHAT)
$$ ##TITLE= Audit trail, TOPSPIN		Version 2.1
$$ ##JCAMPDX= 5.01
$$ ##ORIGIN= Bruker BioSpin GmbH
$$ ##OWNER= Administrator
$$ $$ E:\/data/COFFEE/nmr/AC1361_QARH12183_7155206_JLfaZ40g7r/10/pdata/1/auditp.txt
$$ ##AUDIT TRAIL=  $$ (NUMBER, WHEN, WHO, WHERE, PROCESS, VERSION, WHAT)
(   1,<2012-12-01 11:02:53.677 -0500>,<Administrator>,<X>,<go>,<TOPSPIN 2.1>,
      <created by zg
	started at 2012-12-01 11:01:47.630 -0500,
	POWCHK enabled, PULCHK disabled,
       configuration hash MD5:
       86 BA 57 50 F2 9D 5C 9B 26 00 A9 28 5F 66 2E 89
       data hash MD5: 64K
       20 36 79 38 09 43 B4 84 F1 63 D0 BD 0F 46 68 8E>)
(   2,<2012-12-01 11:02:57.306 -0500>,<Administrator>,<X>,<proc1d>,<TOPSPIN 2.1>,
      <Start of raw data processing
       efp LB = 0 FT_mod = 6 PKNL = 1 PHC0 = 0 PHC1 = 0 SI = 32K 
       data hash MD5: 32K
       FA 8C BA 7E B8 AD D1 C8 25 F3 3D 0A 18 72 E5 E2>)
(   3,<2012-12-01 11:02:57.822 -0500>,<Administrator>,<X>,<proc1d>,<TOPSPIN 2.1>,
      <pk PHC0 = 99.71191 PHC1 = 0 
       data hash MD5: 32K
       62 A5 2D 2F AC 3C 99 FC 0F 83 34 6D AD 38 49 A0>)
(   4,<2012-12-01 11:02:58.080 -0500>,<Administrator>,<X>,<proc1d>,<TOPSPIN 2.1>,
      <abs ABSG = 1 
       data hash MD5: 32K
       6B D0 25 01 B2 67 2F F4 01 76 31 E8 07 AF 25 B9>)
(   5,<2012-12-01 11:02:58.252 -0500>,<Administrator>,<X>,<proc1d>,<TOPSPIN 2.1>,
      <abs ABSG = 2 
       data hash MD5: 32K
       29 73 6C 12 F1 48 15 BC 70 90 3E 07 75 EF F8 FD>)
(   6,<2012-12-01 11:02:58.406 -0500>,<Administrator>,<X>,<proc1d>,<TOPSPIN 2.1>,
      <abs ABSG = 3 
       data hash MD5: 32K
       DD F3 47 FD 70 94 DB 1B 49 32 9A B8 FB 2C 54 1E>)
(   7,<2012-12-01 11:02:58.544 -0500>,<Administrator>,<X>,<proc1d>,<TOPSPIN 2.1>,
      <abs ABSG = 4 
       data hash MD5: 32K
       5F F2 36 59 A3 30 D1 09 22 0D E5 90 85 1E 12 90>)
(   8,<2012-12-01 11:02:58.733 -0500>,<Administrator>,<X>,<proc1d>,<TOPSPIN 2.1>,
      <abs ABSG = 5 
       data hash MD5: 32K
       E9 C9 9F 94 CC 40 01 41 DB A3 BC BF C6 77 FD 24>)
$$ ##END=
$$ 
$$ $$ hash MD5
$$ $$ C5 55 15 C6 FF B3 E7 B4 FB 7D EA FF 42 9F AC 8D
##$RELAX= 
##$RELAX= 
##$RELAX= 
##$RELAX= 
##$RELAX= 
##$RELAX= 
##$RELAX= 
$$ Bruker specific parameters
$$ --------------------------
##$DU= <E:\>
##$EXPNO= 10
##$NAME= <AC1361_QARH12183_7155206_JLfaZ40g7r>
$$ [...]
150 150 150 150 150 150 150 150
##$TP07= 0
##$TPNAME0= <>
##$TPNAME1= <>
##$TPNAME2= <>
##$TPNAME3= <>
##$TPNAME4= <>
##$TPNAME5= <>
##$TPNAME6= <>
##$TPNAME7= <>
##$TPOAL= (0..7)
0.5 0.5 0.5 0.5 0.5 0.5 0.5 0.5
##$TPOFFS= (0..7)
0 0 0 0 0 0 0 0
##$TUNHIN= 0
##$TUNHOUT= 0
##$TUNXOUT= 0
##$USERA1= <user>
##$USERA2= <user>
##$USERA3= <user>
##$USERA4= <user>
##$USERA5= <user>
##$V9= 5
##$VALIST= <valist>
##$VCLIST= <CCCCCCCCCCCCCCC>
##$VD= 0
##$VDLIST= <DDDDDDDDDDDDDDD>
##$VPLIST= <PPPPPPPPPPPPPPP>
##$VTLIST= <TTTTTTTTTTTTTTT>
##$WBST= 1024
##$WBSW= 4
##$XGAIN= (0..3)
0 0 0 0
##$XL= 0
##$YL= 0
##$YMAX_a= 669577
##$YMIN_a= -563736
##$ZGOPTNS= <>
##$ZL1= 120
##$ZL2= 120
##$ZL3= 120
##$ZL4= 120
##$ABSF1= 14.98509
##$ABSF2= -5.573092
##$ABSG= 5
##$ABSL= 3
##$ALPHA= 0
##$AQORDER= 0
##$ASSFAC= 0
##$ASSFACI= 0
##$ASSFACX= 0
##$ASSWID= 0
##$AUNMP= <proc_prof1d_extract_pilot.lims>
##$AXLEFT= 0
##$AXNAME= <>
##$AXNUC= <1H>
##$AXRIGHT= 0
##$AXTYPE= 0
##$AXUNIT= <>
##$AZFE= 0.1
##$AZFW= 0.1
##$BCFW= 0
##$BC_mod= 0
##$BYTORDP= 0
##$COROFFS= 0
##$CY= 15
##$DATMOD= 1
##$DC= 0
##$DFILT= <>
##$DTYPP= 0
##$F1P= 0
##$F2P= 0
##$FCOR= 0.5
##$FTSIZE= 32768
##$FT_mod= 6
##$GAMMA= 0
##$GB= 0
##$INTBC= 1
##$INTSCL= 1
##$ISEN= 128
##$LB= 0
##$LEV0= 0
##$LPBIN= 0
##$MAXI= 10000
##$MC2= 0
##$MEAN= 0
##$ME_mod= 0
##$MI= 0
##$NCOEF= 0
##$NC_proc= -8
##$NLEV= 6
##$NOISF1= 0
##$NOISF2= 0
##$NSP= 0
##$NTH_PI= 0
##$NZP= 0
##$OFFSET= 14.98509
##$PC= 1
##$PHC0= 99.71191
##$PHC1= 0
##$PH_mod= 1
##$PKNL= yes
##$PPARMOD= 0
##$PPDIAG= 0
##$PPIPTYP= 0
##$PPMPNUM= 2147483647
##$PPRESOL= 1
##$PSCAL= 4
##$PSIGN= 0
##$PYNMP= <proc.py>
##$REVERSE= no
##$SF= 400.02
##$SI= 32768
##$SIGF1= 0
##$SIGF2= 0
##$SINO= 400
##$SIOLD= 32768
##$SPECTYP= <>
##$SREGLST= <1H.CDCl3>
##$SSB= 0
##$STSI= 32768
##$STSR= 0
##$SW_p= 8223.68421052631
##$SYMM= 0
##$S_DEV= 0
##$TDeff= 65536
##$TDoff= 0
##$TI= <>
##$TILT= no
##$TM1= 0
##$TM2= 0
##$TOPLEV= 0
##$USERP1= <user>
##$USERP2= <user>
##$USERP3= <user>
##$USERP4= <user>
##$USERP5= <user>
##$WDW= 1
##$XDIM= 32768
##$YMAX_p= 472417545
##$YMIN_p= -667621
##$CURPLOT= <Network HP LaserJet P1505>
##$CURPRIN= <$Network HP LaserJet P1505>
##$DFORMAT= <normdp>
##$LAYOUT= <+/1D_H.xwp>
##$LFORMAT= <normlp>
##$PFORMAT= <normpl>
##$SURQMSG= 1
$$ End of Bruker specific parameters
$$ ---------------------------------
##NTUPLES= NMR SPECTRUM
##VAR_NAME=  FREQUENCY,     SPECTRUM/REAL,   SPECTRUM/IMAG
##SYMBOL=    X,             R,               I
##VAR_TYPE=  INDEPENDENT,   DEPENDENT,       DEPENDENT
##VAR_FORM=  AFFN,          ASDF,            ASDF
##VAR_DIM=   32768,         32768,           32768
##UNITS=     HZ,            ARBITRARY UNITS, ARBITRARY UNITS
##FACTOR=    0.250966925370066, 1,           1
##FIRST=     8223.43324360094, -86115,       116465
##LAST=      0,             -62400,          -112779
##MIN=       0,             -667621,         0
##MAX=       8223.43324360094, 472417545,    0
$$ Real data points
##PAGE= N=1
##DATA TABLE= (X++(R..R)), XYDATA
$$ [...]
19460a71222k02230j55814A97606q3039D1029J61289b94778a0712j6123j72465
19450a99300H4065a35942J4625A00705c45201C0126b19448Q9747j42159p4359
19440c46219B25745L9341c04002j1343A5781a51150r8894C5021A3286a76590B04721
19428a1855j67744g7171B40494F0750i1390j7014C5019a67296o0113B30038H5888
19416A99220a53914k39210A01857b01879k0474a8288k19905B55336b70813l5186
19406c05999A52886a00872H326c83253A37690a44016f380l11072A54400n0585
19396A03815C7180c74556A21063b40266O3693B22610A5854i1097j21111M603B2653
19384d7008n7071m1102O7721j33510p3958J27398j30847E9502b08348I5324a87046
$$ y = [-171222, -373452, -529266, 197606, 114567, 41029, 202318, -294778, -10712, -26835, -199300, 84065, -135942, -121317, 100705, -345201, 30126, -219448, -129701, -271860, -346219, 225745, 265086, -304002, -315345, 15781, -151150, -250044, 35021, 13286, -176590, 204721, -11855, -179599, -77171, 240494, 60750, -91390, -108404, 35019, -167296, -227409, 230038, 85888, 199220, -153914, -393124, 101857, -201879, -222353, -18288, -238193, 255336, -270813, -305999, 152886, -100872, 8326, -383253, 137690, -144016, -6380, -317452, 154400, 103815, 37180, -374556, 121063, -240266, -176573, 222610, 15854, -91097, -212208, -207605, 22653, -47008, -104079, -145181, -77460, -210970, -284928, -157530, -288377, 59502, -208348, 95324, -187046]
19372g7742j21918Q734A09907i6948k30358g6010j9431j91003Q1195B18629a03483
19360B1203K6881b02244b5988C20955D8379i3604j15863A24465d478j14014j5836
19349a34328j76047a27879r4332N575H073b20815j0321k4523d5270B37716C7466
19337f8221j01328k34135b00432N9302o880C05080I4096e1437F7710c7128k03656
19326b40784A44198c8713l1681G088c37312J11302M4913A85045a28169B03027
19315A80019b58649A54972b60255j62662I4125b1037k54293g5454p5889I617J33615
19304A43232a04207o8477g0323A3608a98916D7780d4296H3214a11666A72779h6942
19292a68275l57316G5285b24459B09436f224j98161m63178c1190k63576G3051
$$ y = [-77742, -199660, -190926, 109907, -96948, -327306, -76010, -95441, -286444, -205249, 218629, -103483, 21203, 48084, -202244, -25988, 320955, 48379, -93604, -209467, 124465, -4478, -118492, -134328, -310375, -127879, -222211, -216636, 8073, -220815, -231136, -255659, -45270, 237716, 37466, -68221, -169549, -403684, -200432, -141130, -148010, 305080, 94096, -51437, 67710, -37128, -240784, 144198, -38713, -70394, 7088, -337312, -226010, -181097, 185045, -128169, 203027, 180019, -258649, 154972, -260255, -422917, 94125, -21037, -275330, -75454, -151343, 9617, 143232, -104207, -172684, -70323, 13608, -198916, 47780, -44296, 83214, -111666, 172779, -86942, -168275, -525591, 75285, -224459, 209436, -6224, -204385, -667563, -31190, -294766, 73051]
19281b07081L6060M1955A42836a48196E8147L3395b1411l48483d6179A89587a55674
19269b17842K5344c2382A23495b1094j1899j41510M0665m52979G2349e72579b10495
19257a08279F133J86437a64826F0495N9738K0475R1191c32533A2939c09418A38870
19245c1912B16321p4581b20535M8711A99430c00253N0118a7744l7194B10044a77475
19233A2967i3835B18806A700Q3457b3120H0705a48743O0006r0941A70827a18930
19221a50236h007k32652N4735Q3338j16288A6667h8260k7505m7189A19696n3131
19210F6565e4694A87055H0840a52919j30938m1883a46400N032q8504b8915B56449
19198b28230C8272Q8618b81220A25057b62856A75103d98035E3800a85740A78950
$$ y = [-207081, -171021, -129066, 142836, -148196, 58147, 91542, -21411, -369894, -46179, 189587, -155674, -217842, -192498, -32382, 123495, -21094, -32993, -174503, -133838, -586817, 72349, -572579, -210495, -108279, 6133, 192570, -164826, 60495, 120233, 140708, 231899, -332533, 12939, -309418, 138870, -31912, 216321, 141740, -220535, -171824, 199430, -300253, -250135, -17744, -54938, 210044, -177475, 12967, -93835, 218806, 1700, 85157, -23120, 80705, -148743, -88737, -179678, 170827, -118930, -150236, -8007, -240659, -185924, -102586, -218874, 16667, -88260, -115765, -162954, 119696, 66565, -54694, 187055, 80840, -152919, -283857, -325740, -146400, -141368, -229872, -28915, 256449, -228230, 38272, 126890, -281220, 125057, -262856, 175103, -498035, 53800, -185740, 178950]
19187a00320L1704B26671q7202i4804m5873A82135d0815E3465e02827J41885A01571
19175b36842r2910i5160k4377b3444A06425h1897E2378e5927m21345a94369O1404
19164a32965r2266n06P5859C21500g9303j11601D16006a9801q796k2706k81142
19153c32445c9947k49589N1352c5261j27324c2728j26716N4995F355O087e745
19141a72145k138d7658A22629J15869b48247M5997E0594a75809I1445d51083a07848
19129b65628q537g0646A33408g5089e752B089a72674J1690f0768A64738f5789
19117I8120i4064M6651A55092g4954l06606B82410b95892J7064J04721C29101
19106h372j79106B76191g3614l38325i7552j02130o3534N4692A55195e790k60952
$$ y = [-100320, -68616, 226671, 139469, -94804, -140677, 182135, -40815, 53465, -502827, -360942, 101571, -236842, -329752, -95160, -119537, -23444, 106425, -81897, 52378, -55927, -477272, -194369, -132965, -225231, -225737, -149878, 321500, -79303, -190904, 416006, -19801, -28597, -51303, -332445, -39947, -289536, -238184, -35261, -162585, -32728, -159444, -104449, 6355, 12442, -5745, -172145, -174283, -47658, 122629, 238498, -248247, -202250, 50594, -175809, 91445, -451083, -107848, -265628, -274165, -70646, 133408, -75089, -5752, 2089, -172674, -160984, -60768, 164738, -65789, 98120, -94064, -47413, 155092, -74954, -381560, 282410, -295892, -278828, -174107, 329101, -8372, -187478, 276191, -73614, -411939, -97552, -199682, -263216, -208524, 155195, -5790, -266742]
19095b66742f7659B5467q462b96802g0718J7457j95645B7488K4813a85145f1009
19083a91136D4905a60387c7986j91584m1174B39504a51888j00543a13133j58199
19073b71332E3173K88197b3466k9562E58853b68292h5862b0588C753a62353A6642
19061b07938A77899P5609a54241N7956E267c2920B80144a61665B4803h5059B90522
19049i3824j63017J21588G7625h5874p7394P2064G4411a97806f2335d914n8785
19038f3699j36964A7584L2386j615J22979n6945f6231j60675A44363A2014J53132
19027A65146c2834P137B00125b24144G477J8115f743C8529d1601O735q6549j3261
19015a34676C4293f3016i281k07464d5577A76691c9634j2054j98691B56230a18906
$$ y = [-266742, -67659, 25467, 17005, -296802, -70718, -53261, -248906, 27488, 52301, -185145, -61009, -191136, 44905, -160387, -37986, -229570, -270744, 239504, -151888, -252431, -113133, -271332, 53173, 341370, -23466, -53028, 558853, -268292, -85862, -20588, 3753, -162353, 16642, -207938, 177899, 253508, -154241, -96285, 5267, -32920, 280144, -161665, 24803, -85059, 290522, -93824, -256841, -135253, 77625, -85874, -163268, -91204, 74411, -197806, -62335, -4914, -63699, -200663, 17584, 49970, 48355, 171334, 114389, -66231, -226906, 144363, 12014, 165146, -32834, -25697, 200125, -224144, 7477, 25592, -6743, 38529, -41601, -34866, -121415, -134676, 34293, -63016, -9281, -216745, -45577, 176691, -39634, -51688, -250379, 256230, -118906]
19003a26324A62991d3887B17260d8803B55998N8496F2911l249a48172j70887F1982
18991a80696M3642f5926A02361Q4222J27176m6908o4295b52562A0908a58299d2002
18979a73926e1043A29834a78304A91177K6895a87419F02274k2953A53394k4178
18969A29216B7217d29214A92979b3659k55449D8473c99733b5146E6177c76098
18958a54195f5918l3585E182J65905m8214c81676A77948A2g1295B94458c84512
18946a91935Q4272D34652b40540O5354C42394A58470a24866K3877K4699k9573
18936a05863L5275k98987B51019a94916i2568r197M1734k622a2132o3398r0202
18925a65732A9514O2791i7380K3491k18581E5078b00481L1750a8991G0808a29385
$$ y = [-126324, 162991, -43887, 217260, -48803, 255998, 314494, 62911, 59662, -148172, -319059, 61982, -180696, -137054, -65926, 102361, 186583, 313759, 266851, 202556, -252562, 10908, -158299, -42002, -173926, -51043, 129834, -178304, 191177, 218072, -187419, 602274, 579321, 153394, 129216, 27217, -429214, 192979, -23659, -279108, 48473, -399733, -25146, 56177, -376098, -154195, -65918, -99503, 5182, 171087, 122873, -381676, 177948, 12, -71295, 294458, -384512, -191935, -107663, 434652, -240540, -175186, 342394, 158470, -124866, -100989, -76290, -105863, -70588, -369575, 251019, -194916, -92568, -101765, -60031, -62653, -12132, -75530, -165732, 19514, 82305, -97380, -73889, -292470, 55078, -200481, -168731, -18991, 70808, -129385]
18913i5621G0969B5499L48975M9358K33820K69603I9892a37858A50088a00269
18902C2993K12751b34423M9028B0915a51925d7160F3970g7635G6281a72732o5975
18891b38707f0214F4730c38373f2085j65810A7914g8733f68j13364k78602J76003
18880b16631h9969a6564G4148b66082l7588d0202r2910d2548h409j44458j27809
18869b80676h5770M7j33862d4640J5512k0676C7817b68623A95316q3219N2256
18858A64353g1028F4088k5517b08430F6899a7004j98210D26025a34373D7368f4616
18846h5250c3588r6174j62061c6095A44110n805a17506o5290G4873c84153a17468
18834c36153g5957f236l2471a1989H1147R3103B0690K1302j1650J42883b38196
$$ y = [-95621, 70969, 25499, 374474, 423832, 657652, 927255, 99892, -137858, 150088, -100269, 32993, 245744, -234423, -185395, 20915, -151925, -47160, 63970, -77635, 76281, -172732, -238707, -60214, 64730, -338373, -62085, -227895, 17914, -78733, -668, -114032, -392634, -216631, -89969, -16564, 74148, -266082, -303670, -40202, -133112, -42548, -8409, -152867, -280676, -85770, -85723, -219585, -44640, -29128, -49804, 37817, -268623, 195316, 112097, 164353, -71028, 64088, 38571, -208430, 66899, -17004, -215214, 426025, -134373, 47368, -64616, -85250, -33588, -129762, -291823, -36095, 144110, 138305, -117506, -182796, 74873, -384153, -117468, -336153, -75957, -6236, -38707, -11989, 81147, 174250, 20690, 41992, 30342, 173225, -238196]
18822B08842a33193A47719b88455D38161J92687b61339D70377D4241O9434a71109
18811b79893B54572b24732A50259l5794b2722A08569j0251J9866E3771J53453
18801B07224a4332o5580A70915B0619h5922B65635a32362M3403A58305b15546
18790e3334I4705a22226j84677c5572l17203R6662B1709f14672K67420B21380
18779A40985b6954q6500F6455A1380c182n4888B101L6602a27953a1313C75528
18767E0827d92022b45198e370p0536o1856j33093j07685J41836e3032l68857a34307
18755A51667P4193b64225A06379b31025B07059a38917A32093d4452m2712A61849
18744G2886a99294q2851P2870N9886j87603G4834K5611j0096J25409d16444a64118
$$ y = [208842, -133193, 147719, -288455, 438161, 630848, -261339, 470377, 44241, 113675, -171109, -279893, 254572, -224732, 150259, 114465, -22722, 108569, 98318, 118184, 53771, 207224, -14332, -79912, 170915, 20619, -85922, 265635, -132362, -88959, 158305, -215546, -53334, 94705, -122226, -306903, -35572, -352775, -256113, 21709, -614672, -347252, 221380, 140985, -26954, -113454, 66455, 11380, -3182, -58070, 2101, 38703, -127953, -11313, 375528, 50827, -492022, -245198, -5370, -75906, -137762, -270855, -378540, -236704, -53032, -421889, -134307, 151667, 225860, -264225, 106379, -231025, 207059, -138917, 132093, -44452, -87164, 161849, 72886, -199294, -282145, -209275, -149389, -336992, 74834, 100445, 90349, 215758, -416444, -164118]
18732i8643A03531a51447F2607j337a18916k51647C39618b11065J01751B15637
18721h61A51096G5208a54611E7271N4912K34188b80533a31720B2130L41519a03493
18709B40758b66062f6348A43065D5057J61820c23543j57505A41905k9407k7471
18699H5027O115J38603a51999C3882c81775E4429a44394K5214j59419G1042b3801
18687I5395A3748a28525e7791m2091j19513h0893k16990a22649k30442F4743b92250
18675c771m7510K1091j98163J5997h6193B66274c23203A20574B1585q936e0094
18663C47364q3634k4737H2469L1357E2310N6002b34925N579B71009a88460j08731
18652b97191J44152A24488c46211j8933f1397k1156j42510D5043c20754a32037
$$ y = [-98643, 103531, -151447, 62607, 61270, -118916, -370563, 339618, -211065, -109314, 215637, -861, 151096, 75208, -154611, 57271, 112183, 346371, -280533, -131720, 22130, 363649, -103493, 240758, -266062, -66348, 143065, 45057, 206877, -323543, -481048, 141905, 112498, 85027, 91142, 229745, -151999, 33882, -381775, 54429, -144394, -119180, -278599, 71042, -23801, 95395, 13748, -128525, -57791, -99882, -219395, -80893, -297883, -122649, -353091, 64743, -292250, -3771, -51281, -30190, -228353, -212356, -86193, 266274, -323203, 120574, 21585, 12649, -50094, 347364, 263730, 238993, 82469, 113826, 52310, 108312, -234925, -229346, 271009, -188460, -297191, -153039, 124488, -346211, -365144, -61397, -82553, -225063, 45043, -320754, -132037]
18641g0986B24198a71626A06486g9714D2198J29556b8654A13095J50744l7158
18631B26681f4014I7661i4225J6128r6105P6785C4043K6289i1775k30540Q1700
18620b40615C4938d1371o7534H0473J9345C9527A4699a21413A09817a0536o6393
18609g6929A47257a56638A37964a50081D7447e980j6815j92148g3246H610a26515
18597E8138L3984l3162g7271m2922A53196a8289q6464j28158Q9824F7865a81744
18585b26498h9679A07329a42009A40086d30959J08921a45248k54807J24001C00409
18574c0205p2102A47940a73970j61229d0410l6216k65635D1066a45817j69436
18564c15253J05585B82759A24267D5637P5308a90504k2418J02008F2861c4486
$$ y = [-70986, 224198, -171626, 106486, -79714, 42198, 171754, -28654, 113095, 263839, 226681, -64014, 97661, -94225, -78097, -174202, -97417, 34043, 60332, -91775, -322315, -240615, 34938, -41371, -108905, 80473, 99818, 39527, 14699, -121413, 109817, -10536, -76929, 147257, -156638, 137964, -150081, 47447, -5980, -22795, -214943, -73246, 8610, -126515, 58138, 92122, 58960, -77271, -120193, 153196, -18289, -104753, -232911, -143087, 67865, -181744, -226498, -89679, 107329, -142009, 140086, -430959, -322038, -145248, -400055, -276054, 300409, -30205, -102307, 147940, -173970, -335199, -40410, -76626, -342261, 41066, -145817, -315253, -209668, 282759, 124267, 45637, 120945, -190504, -212922, -110914, 62861, -34486]
18553A86063b2209j20396m2916A36667c06099M9918j05955J58098A12947a91841
18542f9735A12325c72992O7125A34029g6606k3011j50325e5871B19681I1208h1741
18530A50865f2644j42758h7155n4974I6679a39989A80437a9116j15511M632a9225
18518a63447k04546F1566a44393O7776l41714A81874c62706B59617a67693f4591
18507F7319L30763j87537e9113D5493a83576K0399D6603L8869d299A41159d7155
18495a27718l0692N2886k1852l7379m4297B67069E4277a32284b3338j62554B2797
18483B02327a78096K1024C4131b22148Q3817K6557i726I7660c49402J44387A17388
18471a525B94657a50495b215j63600B9150K09105J9017H1898P3346a36949A1584
$$ y = [186063, -22209, -142605, -185521, 136667, -306099, -256181, -362136, -204038, 112947, -191841, -69735, 112325, -372992, -305867, 134029, -76606, -99617, -249942, -55871, 219681, 91208, -81741, 150865, -62644, -205402, -87155, -142129, 96679, -139989, 180437, -19116, -134627, -129995, -19225, -163447, -367993, 61566, -144393, -76617, -418331, 181874, -362706, 259617, -167693, -64591, 67319, 398082, 210545, -59113, 45493, -183576, -163177, 46603, 85472, -4299, 141159, -47155, -127718, -158410, -105524, -127376, -164755, -209052, 267069, 54277, -132284, -23338, -185892, 22797, 202327, -178096, -157072, 34131, -222148, -138331, -111774, -9726, 97660, -349402, -205015, 117388, -1525, 294657, -150495, -2215, -165815, 29150, 238255, 257272, 81898, 155244, -136949, 11584]
18459d38089K15694E5421a38802C1928N1758a5432k1321J7966k17657A16325i9832
18447h1013J8830j19253A3469c2305A44936a09756M1361k00117B8770J26404a49587
18435c4064l8554L1564m8379m9016e7839j86628i0804j20559C674h7326K3893
18424f3433j40524j23397E3J79544b38940J6758l0711a4233A58667G8558C0238
18412E0285H507K15509c35993q9593H323e4523F5651Q4683b25651d0979l23427
18401c64406C62051n8112A32810g2815A5769c3845j20162k0673q2831a12667K9488
18390h3179C0664b18326A21219a0301m27557f9302G7706e3759C4198f6965k39554
18379c06519h021A00098A9273Q4649g195k99434c7078j32336D4112J5422M23253
$$ y = [-438089, -222395, 55421, -138802, 31928, 83686, -15432, -36753, -18787, -236444, 116325, -99832, -81013, -62183, -181436, 13469, -32305, 144936, -109756, -68395, -268512, 28770, 155174, -149587, -34064, -72618, -41054, -89433, -138449, -57839, -244467, -90804, -211363, 3674, -87326, -63433, -203957, -327354, 53, 179597, -238940, -222182, -252893, -14233, 158667, 78558, 30238, 50285, 8507, 224016, -335993, -425586, 8323, -54523, 65651, 150334, -225651, -40979, -364406, 362051, 303939, 132810, -72815, 15769, -33845, -154007, -174680, -257511, -112667, -83179, 30664, -218326, 121219, -10301, -437858, -69302, 77706, -53759, 34198, -66965, -306519, -8021, 100098, 19273, 103922, -7195, -306629, -37078, -169414, 44112, 59534, 482787]
18368D82787A76557J48360a080A72951a67607C8102j5501b48353c426B50746a70680
18356a32603L8060E151M29844a01113d4688j78053A71705c1639j34098k02832
18346c68569a02178A09403J27768b01991O5365e0941j46889D0028d4865j62001
18336b06866a2680j01906K3680j68733A23154e38969a25760k2893d8235B7823
18325i1231A61885i1218j51656D0582c6577C1762a55276A08920a60912j86611
18315c47523J56143h0344A02307a17926M8760J3840b5808j36845j57858A0504
18304b86693f475D48601C9583B25K03200a50495l4509G6811d39540a87521j09886
18293b97407K7827D2943J03304i9690j44664A80992B573M8078b60861Q3173j35999
$$ y = [482787, 176557, 324917, -1080, 172951, -167607, 38102, 22601, -248353, -3426, 250746, -170680, -132603, -94543, 5151, 434995, -101113, -44688, -222741, 171705, -31639, -165737, -368569, -102178, 109403, 237171, -201991, -136626, -50941, -197830, 40028, -44865, -206866, -12680, -114586, -90906, -259639, 123154, -538969, -125760, -148653, -48235, 27823, -91231, 161885, -91218, -242874, 40582, -36577, 31762, -155276, 108920, -160912, -347523, -191380, -80344, 102307, -117926, -69166, -55326, -25808, -162653, -320511, 10504, -286693, -6475, 448601, 39583, 225, 203425, -150495, -185004, 76811, -439540, -187521, -297407, -269580, 42943, 146247, -99690, -244354, 180992, 2573, 50651, -260861, -177688, -313687]
18282c13687a37310A3973R9517j3473a27413M0107c874B9721c58994C6401c55563
18270C9709a39863c1525a0786j67426I3225b25084j9943B83326a34989I0079a90067
18258H2962k6738J01814a34844a9580j86806k66711i3583A53285K79448A48608
18247B43730q6103n3405b42215A98094F8602M95J4147l0784a39510A19462c81147
18235G7848n079b46024h4113A12314a54369o0373A16693a14611a5904j15679O794
18224a24789j89867C1838c4812A22618E0528b35109B6311b75203O7955b7204j32965
18213a60169m5085A60894o7852J40387H6878a86172p1767O5363I0536a69233p2294
18202b41527E3333K83465f3315j86963d9993k3170k2594A34580b9352H105h1300
$$ y = [-313687, -137310, 13973, 113490, 100017, -127413, -87306, -3874, 29721, -358994, 36401, -355563, 39709, -139863, -31525, -10786, -178212, 93225, -225084, -245027, 283326, -134989, 90079, -190067, 82962, 56224, 158038, -134844, -19580, -206386, -473097, -93583, 153285, 432733, 148608, 243730, 157627, 104222, -242215, 198094, 68602, 69097, 83244, 52460, -139510, 119462, -381147, 77848, 72769, -246024, -84113, 112314, -154369, -214742, 116693, -114611, -15904, -131583, -124789, -314656, 31838, -34812, 122618, 50528, -235109, 26311, -275203, -207248, -27204, -160169, -205254, 160894, 93042, 233429, 86878, -186172, -257939, -192576, 90536, -169233, -241527, 53333, 336798, -63315, -250278, -49993, -73163, -95757, 134580, -29352, 8105, -81300]
18190h5081n0830f4258l60199C3241K06678b2047j37907k60030a7308l09289f881
18178F3316a10459r953A24372E2542j5837P6666J48564a38222D5284K33562b18893
18166d7177m8638r29A36521J05926k578a534l0744B46268g2288c3932H6329J64885
18154B51214P6571b2184B78540d3943C5452J62990r8487d0408A42450e0955k4975
18143g5930k14969F1491e5728d645A29232a18593A63547a93120n9338C50452a77794
18131a41965O8862G0613h9611p2908j5355q33A14783e9404B51416a3848m3364
18120e7212F7893K2794h8437r1441c8442k26156a11909A13474Q424a05679k8418
18109a34097C29693e3700B49682a50519M8986l69288e6746o5837A30417b8103
$$ y = [-85081, -135911, -64258, -424457, 33241, 239919, -22047, -159954, -419984, -17308, -326597, -6881, 63316, -110459, -120412, 124372, 52542, 36705, 113371, 261935, -138222, 45284, 278846, -218893, -47177, -95815, -96744, 136521, 242447, 239869, -1534, -32278, 246268, -72288, -33932, 86329, 251214, 327785, -22184, 278540, -43943, 35452, 198442, 99955, -40408, 142450, -50955, -75930, -290899, 61491, -55728, -4645, 129232, -118593, 163547, -193120, -252458, 350452, -177794, -141965, -73103, 70613, -89611, -162519, -177874, -178707, 114783, -59404, 251416, -13848, -57212, 67893, 90687, -88437, -179878, -38442, -264598, -111909, 113474, 121898, -105679, -134097, 329693, -53700, 249682, -150519, -101533, -470821, -56746, -122583, 130417, -28103]
18098h7140k1528F1734b51832e0739D3893J61084c55878m8971B14939i0291A57310
18086a79133j17992j8400O2633A13085A1973a97146N2294b0646o0602A32234c26694
18074a20731K4922j30625M916F6084J23274l6041Q3477l3345d02563J65187A62572
18062A2785a15689m1256G2988b25499i6698q8302C18924b98159A39913L0620l1215
18051A39318A7001J82485c0913B03488e5830l4893k53940B03468e351k29291C15481
18039G1625h6229G9609J88181j26586c03284C59029j6254A28813j094a0880j25661
18028a36541O4557B38265K50882B00284d5243k27252A81010a78073B90477a1884
18017B29115a08113D9353J58348a46676J5830M4289j59925f7073a8542k36135
$$ y = [-87140, -108668, 61734, -251832, -50739, 43893, 204977, -355878, -404849, 214939, -90291, 157310, -179133, -297125, -315525, -252892, 113085, 11973, -197146, -144852, -20646, -81248, 132234, -326694, -120731, -95809, -226434, -221518, 66084, 189358, 153317, 236794, 203449, -402563, -237376, 162572, 12785, -115689, -156945, 72988, -225499, -96698, -185000, 318924, -298159, 139913, 170533, 139318, 17001, 199486, -30913, 203488, -55830, -90723, -344663, 203468, -5351, -234642, 315481, 71625, -86229, 79609, 267790, 141204, -303284, 359029, 342775, 128813, 127719, -10880, -136541, -71984, 238265, 489147, 200284, -45243, -272495, 181010, -178073, 290477, -11884, 229115, -108113, 49353, 207701, -146676, -130846, -86557, -246482, -67073, -18542, -254677]
18007b54677A24749a0776L320o6129G7166J64332j02237l1502D6127O9667D2020
17995f8501D22474j85766J2896F9453A9504J27410a12040H7243J31533b1248D1365
17983h980k61933C8432b78616a19233F3770d7633J6695j13643F7412b57889D2431
17971b62857B08136h7209k83491a4496C8880b19942n2921D3861b67492g7729a4710
17959b96967i3484J843c0221k44050Q0859I976R0677a13092J4522C65109h432
17947a15416j09165A42357I178K55661B0883J19898a3985A40978a70051h2401
17936H2079b8468A54479l5192b2498l96216a20151A9266J02526G853b33197A27203
17924c60248F9639e8457B11837a41305k13159f1703j14369f6281D2794d7046A47264
$$ y = [-254677, 124749, -10776, -7456, -73585, 77166, 241498, 139261, 107759, 46127, 115794, 42020, -68501, 422474, 236708, 249604, 69453, 19504, 146914, -112040, 87243, 218776, -21248, 41365, -8980, -270913, 38432, -278616, -119233, 63770, -47633, -30938, -144581, 67412, -257889, 42431, -262857, 208136, -87209, -370700, -14496, 38880, -219942, -272863, 43861, -267492, -77729, -14710, -296967, -93484, -91641, -30221, -274271, -193412, 9976, 100653, -113092, -98570, 365109, -8432, -115416, -224581, 142357, 9178, 264839, 20883, 140781, -13985, 140978, -170051, -82401, 82079, -28468, 154479, 119287, -22498, -418714, -120151, 19266, 121792, 7853, -233197, 127203, -360248, 69639, -58457, 211837, -141305, -354464, -61703, -176072, -66281, 42794, -47046, 147264]
17912B16288O071c07804a04337C61856A22337B1550a3802k1006B82302b17550
17901h1854j37797B35177e7776j25171P5327C35738L9270b31519A86902a76062
17890C36424E1425b60078D96855f5844c836q3074k07149c6476B66893J31247i2929
17878B09693J07160B805K58663f7264A03309O1800c16128a37573A14575C971J27145
17867A31116m0991N9318b41184B49989C4753J08068n636b67773b9741c42r3727
17856i4069A08054h6791A46347a37692C088J70989D8298L7098a92553h9653j0166
17845i9819H5755a64765d1609J5528J1593l11817A80272a52759g1293a1860b482
17833a34236m5891A89454a39271A56752O8180g9851C09698F0733J8A1806L81214
$$ y = [216288, 222359, -307804, -104337, 361856, 122337, 21550, -13802, -34808, 282302, -217550, -81854, -219651, 235177, -57776, -182947, -107620, 335738, 375008, -231519, 186902, -176062, 336424, 51425, -260078, 496855, -65844, -3836, -86910, -294059, -36476, 266893, 398140, -92929, 209693, 316853, 2805, 261468, -67264, 103309, 165109, -316128, -137573, 114575, 3971, 131116, 90125, 149443, -241184, 249989, 34753, 142821, 137185, -267773, -29741, -342, -94069, 108054, -86791, 146347, -137692, 3088, 174077, 48298, 85396, -192553, -89653, -99819, 85755, -164765, -41609, -26081, -14488, -326305, 180272, -152759, -71293, -11860, -2482, -134236, -180127, 189454, -139271, 156752, 224932, -79851, 309698, 60733, 60751, 11806, 393020]
17822C93020a05099o4921E9778Q2533j639K2713D48K60565E6330J22828a99901
17810a03867C13843j11034J10033a00440A4095L30534a28247e8783D16632B05095
17799B33909k7724A954e5380j88401b7020G0040K22163e4136a5605A31433a1968
17787A21285a40408c9074Q693n494A20823c3470B92147a08822N0629F7421d13041
17775b5345p6452A98655a12494D70756A43588a89751M1082C95394C6621b16279
17764H9980J49025G1567L98254A18861f6380p6532r8182C6693j1001P9049J4761
17753A19502h6266j39214C8358b5272F6775A2512a10465A57542q623K4614N300
17742A78833O0032I6257j6993C2222K40289D6427J63323J40286A15401a56964
$$ y = [393020, -105099, -170020, 59778, 142311, 140672, 163385, 448, 261013, 56330, 179158, -199901, -103867, 313843, 202809, 312842, -100440, 14095, 344629, -128247, -58783, 416632, 205095, 233909, 206185, 1954, -55380, -243781, -27020, 70040, 292203, -54136, -15605, 131433, -11968, 121285, -140408, -39074, -30381, -35875, 120823, -33470, 292147, -108822, -58193, 67421, -413041, -25345, -101797, 198655, -112494, 470756, 143588, -189751, -148669, 395394, 36621, -216279, 89980, 239005, 71567, 469821, 118861, -66380, -142912, -241094, 36693, 25692, 104741, 119502, -86266, -225480, 38358, -25272, 66775, 12512, -110465, 157542, 148919, 173533, 178833, 238865, 96257, 79264, 32222, 272511, 46427, 209750, 350036, 115401, -156964]
17731B00283a3658B95621a1812B24405J491c4928B16120O1653q1065g7318H8831
17719d5704p451n7305B9456a24638A6413a91903O7358Q897A23791k9250c640E88
17706A92977n5844k1815b97121f6772p1631A64138N1209j6071k2945H929a51974
17694D0955A2671J96184k813a57397B17407a56914C41433b0490B64132b29475
17683g4622A67235l6136a90526E4512K0020J0120P4127E3342J0234B6751J38923
17672A65674J3459p0070J07739M42667d70B04259C8450J06558f0619A7568J96262
17661B13830a36159B61499a17145e4093B26276B9266K21910A24431M142K6607
17651A55180a76421B21082A03718K60286J91384k51450A23646M9470c51586C97668
$$ y = [200283, -13658, 295621, -11812, 224405, 225896, -34928, 216120, 277773, 196708, -77318, 88831, -45704, -53155, -110460, 29456, -124638, 16413, -191903, -124545, -115648, 123791, 94541, -3640, 588, 192977, 137133, 115318, -297121, -66772, -138403, 164138, 215347, 199276, 176331, 8929, -151974, 40955, 12671, 208855, 206042, -157397, 217407, -156914, 341433, -20490, 264132, -229475, -74622, 167235, 131099, -190526, 54512, 74532, 84652, 158779, 53342, 63576, 26751, 165674, 179133, 109063, 216802, 659469, -470, 204259, 38450, 145008, -60619, 17568, 213830, -136159, 261499, -117145, -54093, 226276, 29266, 251176, 124431, 128573, 155180, -176421, 221082, 103718, 364004, 555388, 303938, 123646, 173116, -351586, 397668]
17640A62526p1887a04404A6985b02307A73897F8193a88441Q9304A38144O6951
17630B05095c896B6953K04370O4212b3434j26036C88308E1010P0201a8405C25391
17618c4382j693B45430b09250g5570B29850L8118d3549j04822d3866G2671f0433
17606C91368a9739D15453b7982J3587D3889c0779j22129A48706K8387J61577A51074
17594A04006d4701A77073a6830A06529R8252m360e0770o116A05901A4064M00316
17583D14380G1539K01797E3482J47981K23683K83674k89269A58956o6575J10708
17573B03089j790j8253J09792d5184C69676a28601I3389a2845B15164I1728M5075
17562A36803A1352K8636K78329A16268M8824O5137p3903O2886J43936j76692I2493
$$ y = [162526, 90639, -104404, 16985, -202307, 173897, 68193, -188441, -99137, 138144, 205095, -3896, 26953, 231323, 295535, -23434, -149470, 388308, 51010, 121211, -18405, 325391, -34382, -36075, 245430, -209250, -75570, 229850, 267968, -43549, -148371, -43866, 72671, -60433, 391368, -19739, 415453, -27982, -14395, 43889, -30779, -152908, 148706, 177093, 338670, 151074, 104006, -44701, 177073, -16830, 106529, 204781, 200421, -50770, -56886, 105901, 14064, 414380, 71539, 273336, 53482, 201463, 425146, 708820, 419551, 158956, 92381, 203089, 201299, 183046, 292838, -45184, 369676, -128601, 93389, -12845, 215164, 91728, 136803, 11352, 39988, 318317, 116268, 165092, 230229, 156326, 219212, 363148, 186456, 92493]
17550C37400E1451K90820J25094A31040J34538A21847K1235O8795L14704a2961
17539I0326J43628J48934J12680k18682D6883c4974A73474m21J15315K56418L2776
17528E77562m080L1719M14815O8579M15116m26291q4718j159k04164H2594L937
17517H6531L23950k7477p2249J66959M24461k47428N76516R3595J26915R3619
17507A545392m98563k41757k11794l6246B30858J79017K078J27743j09525j41375
17497B88796O8605R5858L5257k36035J85600p3526K12906M9174a09884l1944E73271
17485D2130K52866A38807J44409D6498J50894J75242j37628n3813Q8785L35762
17475F05740B99648J11312j96378q9143J69386J05669a57068B25590j05521l3510
$$ y = [337400, 51451, 342271, 467365, 131040, 265578, 121847, 143082, 211877, 526581, -12961, 90326, 233954, 382888, 495568, 276886, 46883, -34974, 173474, 173053, 288368, 544786, 577562, 573482, 605201, 1020016, 1088595, 1503711, 1077420, 992702, 991543, 787379, 82594, 86531, 410481, 383004, 310755, 477714, 902175, 654747, 1231263, 1324858, 1451773, 1545392, 1046829, 805072, 593278, 557032, 230858, 409875, 411953, 539696, 430171, 288796, 357401, 453259, 488516, 252481, 438081, 364555, 577461, 626635, -109884, -141828, 573271, 42130, 294996, 138807, 283216, 46498, 197392, 372634, 235006, 181193, 269978, 605740, 299648, 410960, 214582, 125439, 294825, 400494, -157068, 225590, 120069, 86559]
17465H6559K04285p9896J82556P2659A73018J25270J61869n9217p475j56460M0307
17454B77312L1420q4663J30575J12879p8651A26638L14053E2686L37549l235q4960
17443C02040J69026N1826B02456J25059K52558E9233N21689A50992M47098B01156
17432C72312n7688D4261J81141J98747j46772K73728j75033o8653L25386k49394
17422C83411J4226I5282K79039L12274m6573k50577L19512k59253K80458l14893
17412D15269r9271M5747A75759P1570M8519j36986c5920B60858K5501j18234J41060
17401C09185j16959C9648K05014J8699J99580k17638d65795D68564a01692D22033
17390B07732M8142A22032J07520l1153K83032A24781J50855l2450j14877K8682
$$ y = [86559, 290844, 210948, 393504, 466163, 173018, 298288, 460157, 400940, 393465, 237005, 277312, 308732, 224069, 354644, 467523, 388872, 126638, 440691, 52686, 390235, 387000, 302040, 471066, 522892, 202456, 327515, 580073, 59233, 580922, 150992, 598090, 201156, 372312, 314624, 44261, 225402, 424149, 277377, 551105, 376072, 307419, 632805, 383411, 397637, 95282, 374321, 686595, 640022, 389445, 708957, 449704, 730162, 415269, 315998, 361745, 175759, 247329, 295848, 158862, -35920, 260858, 286359, 168125, 309185, 192226, 39648, 244662, 263361, 462941, 245303, -465795, 468564, -101692, 422033, 207732, 255874, 122032, 229552, 198399, 481431, 124781, 275636, 243186, 128309, 156991]
17380A56991K5476L97035A93523L0934L82992A71845D9396J67405H5699J08101
17370A93800R6861A11743K49926C4782J62164h4240A42233B1897Q4802l1681J38778
17359B13796J99930b12904A2574M96771A94822j6739L30402B11751R1032j20613
17349A82170D8059g7259B75848o7490J85596N2845r6310j70604e1123D52272o9240
17338C83032j16375F5594L11162J08640N1791A20386K09922k6626K31774j66781
17328C68675r5810j12146L66270j22078j04473J59155k16486j00561k520J85233
17318C25259L2980a06333A29502L05209a76521B99266O650j33183K29715j27909
17308B74539C1423N67642M7522A44483m0648L44653j51068P7432j30494j00033
$$ y = [156991, 182467, 579502, 193523, 224457, 607449, 171845, 49396, 216801, 85699, 193800, 290661, 111743, 361669, 34782, 196946, -84240, 142233, 21897, 106699, 75018, 213796, 413726, -212904, 12574, 509345, 194822, 178083, 508485, 211751, 302783, 182170, 48059, -77259, 275848, 208358, 393954, 446799, 350489, 179885, -51123, 452272, 383032, 266657, 65594, 376756, 485396, 537187, 120386, 330308, 303682, 535456, 368675, 272865, 160719, 526989, 404911, 300438, 459593, 243107, 142546, 140026, 325259, 358239, -106333, 129502, 434711, -176521, 299266, 305916, 172733, 402448, 274539, 31423, 599065, 646587, 144483, 103835, 448488, 297420, 374852, 244358, 144325]
17298A44325J79052K00356A7211J30765O0071q2100K51608l2943j8755N0555O791
17287C83203n4472J14231l9462j29466J48148l7985R0359A90066P9196J17317
17277C86579p222O377J31958j0961j81110Q3713A24883M54660B55538m1310K30637
17266D44865g205A98809L22951B53073J76116h2415C30847M2850K5014j40788
17256B57923Q979Q4914J87543k29321J07353j89014n817K90312j12100M4414J7694
17245D62880j68467K6063M36213k83322N7628k35082q7672J24547j1073Q3318
17235D05033K47002p3411k43326J7578j51546k1825L30031j68441M02462k96719
17225D46838J05518A89556L51584o0606K3597j86531j12178J92258Q6240A4900
$$ y = [144325, 323377, 523733, 17211, 147976, 208047, 125947, 377555, 344612, 325857, 376412, 383203, 328731, 442962, 403500, 274034, 422182, 384197, 474556, 190066, 269262, 386579, 379357, 385734, 517692, 506731, 325621, 409334, 124883, 579543, 255538, 214228, 444865, -7205, 198809, 521760, 253073, 429189, -82415, 330847, 373697, 398711, 257923, 266902, 351816, 539359, 310038, 417391, 228377, 222560, 512872, 400772, 445186, 462880, 294413, 320476, 756689, 473367, 530995, 295913, 208241, 332788, 321715, 405033, 652035, 578624, 335298, 352876, 201330, 179505, 509536, 341095, 743557, 446838, 552356, 189556, 541140, 480534, 504131, 317600, 205422, 397680, 483920, 14900]
17214C14678K10682k20240K01327K5488j29977J45051j21533R4086j6943K16393
17204G19012k09755B50688P2645J6141P0805J26454O8080j27808B10504J83252
17194C93756N8681J38521k83412O9840L17145j39436j69697J98805o2059k56531
17184B65613N44666C88208J05258K07500k74276N1473R8234j42407o8421J54050
17174E19619O4170j7375n3556J46567n8346B74039K76440J18451r7115B70518
17163E58274k23674L02769J01828K36929B27102K3645M85228k77827n8678J05591
17153E05061K97946k17390m3962L81137k68799l12210J68405N4282m181j20467
17143D39822L34680k9811k2524B69558K82251A46894P98085C44437L81185K6895
$$ y = [314678, 525360, 305120, 506447, 531935, 401958, 547009, 425476, 519562, 502619, 719012, 509257, 250688, 323333, 339474, 410279, 536733, 604813, 477005, 210504, 393756, 452437, 590958, 307546, 377386, 694531, 555095, 385398, 584203, 522144, 265613, 810279, 388208, 493466, 700966, 426690, 478163, 576397, 433990, 365569, 519619, 583789, 566414, 512858, 659425, 601079, 274039, 550479, 668930, 571815, 270518, 558274, 334600, 637369, 739197, 976126, 227102, 250747, 735975, 458148, 399470, 505061, 803007, 585617, 541655, 922792, 653993, 341783, 510188, 564470, 560289, 439822, 774502, 744691, 722167, 269558, 551809, 146894, 944979, 344437, 725622, 752517]
17133G52517k90862L76006R9529j00972k25746K79260A97812M81822K30686k65333
17123F44987p6283j11656J80601N3745n8695l9005l6384N2449J34377B92879J87066
17112D79945L57309j04077j05004j66598L50977K42670n22761N25834m09706M0332
17102F88921n6486M83397l60634J99101k41686J44684O9367j77712J18341j8219
17092H49074j37314O1478j29971k96118P53875m42957k56209L36736j95301L36088
17082H79381k14590j41953J89450J35269j24397k40881O30738k68793Q0771m6753
17072H78242j50763J0889J31429J98025k10233L07380j81916j5859O6324l47997
17062F85521M68228m6530l61073m1279L78000j28766j12428J78351k21508k1276
$$ y = [752517, 461655, 837661, 937190, 836218, 610472, 889732, 197812, 679634, 910320, 644987, 568704, 457048, 637649, 691394, 632699, 593694, 557310, 609759, 744136, 292879, 479945, 837254, 733177, 628173, 461575, 812552, 1055222, 532461, 1058295, 648589, 688921, 632435, 1115832, 755198, 954299, 712613, 857297, 926664, 748952, 867293, 849074, 711760, 773238, 643267, 347149, 1101024, 658067, 401858, 738594, 543293, 879381, 664791, 522838, 712288, 847557, 723160, 482279, 1113017, 844224, 924995, 878242, 727479, 738368, 869797, 1067822, 857589, 1164969, 983053, 967194, 1033518, 685521, 1153749, 1107219, 746146, 704867, 1082867, 954101, 841673, 1020024, 798516, 777240]
17052G77240K66391r5483p250j12833L89663N8773m60853K6078M26410n09215
17042G58921L6616J8958R8117R9211J84252l14124M44358m13442K70715j97476
17032I86106J68642J41278j31414J06799l33583Q6877K36971j95187R5833j00933
17022A061389K14925n0575K39257l55982J29314J4357K37746m97118K86860l74233
17012I05940L71084j72867K28396k00080J01717K26173L1485m17793M79440j4810
17002A538685j76214j08014l3717K29454J70426k72589J69751n7643N2300j05456
16992A406983K83589p4275o930R3697l4694r7425n4609Q1607P3971j89343J7594
16981A500165L05534j03706j68983Q9912r8318k76292L35032L54351j56513j89242
$$ y = [777240, 1043631, 948148, 940898, 828065, 1217728, 1276501, 815648, 841726, 1268136, 758921, 795537, 814495, 912612, 1011823, 1196075, 881951, 1326309, 912867, 1183582, 986106, 1154748, 1296026, 1164612, 1271411, 937828, 1024705, 1261676, 1066489, 1162322, 1061389, 1276314, 1225739, 1464996, 1109014, 1238328, 1252685, 1490431, 993313, 1280173, 905940, 1277024, 1104157, 1332553, 1132473, 1234190, 1460363, 1491848, 1074055, 1553495, 1538685, 1362471, 1254457, 1220740, 1450194, 1620620, 1348031, 1517782, 1460139, 1512439, 1406983, 1690572, 1616297, 1609367, 1703064, 1668370, 1570945, 1516336, 1597943, 1671914, 1482571, 1500165, 1805699, 1701993, 1533010, 1622922, 1524604, 1248312, 1583344, 1937695, 1781182, 1591940]
16971A591940j32043J41650K76715p9847J82720k56151j84702L50851j8112k44
16961A872777k06711N7627P6364r9307L33942k56061L09189L70170l85073j76293
16951A896624J20229N2436M0932l43790M77930J56937j83029k04337J5716L44422
16941B374070p4698k46604J76667k60402L12739l48909K46657J20647N6265l16223
16931B040209L86725n5609j7109j30778L80584k29397J56836J13299K9297r02
16921B673155Q2649k20232L90111l50046k20526N02150k30804L00384k30906N2791
16911B748726K23065m14707L78938K59106l30951K43067J37792l653o0440K13992
16901C394935k3529k35552m5586K23985N640j25814M07762j55432L52590r3506
$$ y = [1591940, 1459897, 1601547, 1878262, 1798415, 1981135, 1724984, 1540282, 1891133, 1873021, 1872777, 1666066, 1723693, 1800057, 1700750, 2034692, 1778631, 2087820, 2457990, 2072917, 1896624, 2016853, 2069289, 2110221, 1766431, 2244361, 2401298, 2218269, 2013932, 2029648, 2374070, 2299372, 2052768, 2229435, 1969033, 2281772, 1932863, 2179520, 2300167, 2356432, 2040209, 2426934, 2371325, 2354216, 2223438, 2604022, 2374625, 2531461, 2644760, 2674057, 2673155, 2755804, 2535572, 2925683, 2575637, 2355111, 2857261, 2626457, 2926841, 2695935, 2748726, 2971791, 2557084, 2936022, 3195128, 2864177, 3107244, 3245036, 3241383, 3180943, 3394935, 3371406, 3135854, 3090268, 3314253, 3319893, 3194079, 3601841, 3446409, 3798999, 3705493]
16891C705493j52414K82974j29270p8030J71733J30736k82321K83471l18352K98381
16881C912401k00335L93902k05469M69577l26524M03271l35109L12329k40061
16872D183982J15844J93472l513R0184N96116k80016k19625L16847j0061K29546
16862E212776J27268P3917j43866J36449K6182J90495j87522Q8565K53184K41799
16852F019247K55826r3074r2884Q0817J10427m2028K22755K67307J57196Q9981
16842F975570k025L86640m07505M68299O6510K96896q7654q144L22867L73891
16832H385345M2178m50396M62052K57954J86556J82383q3503R3571L00984K24571
16822I601695M85487p7335m6634L9530K31544N58690L85887n27220P49117K04476
$$ y = [3705493, 3553079, 3836053, 3706783, 3628753, 3800486, 3931222, 3648901, 3932372, 3614020, 3912401, 3712066, 4105968, 3900499, 4370076, 4043552, 4446823, 4111714, 4424043, 4183982, 4299826, 4493298, 4489785, 4579969, 5176085, 4896069, 4676444, 4993291, 4983230, 5212776, 5340044, 5413961, 5270095, 5406544, 5432726, 5623221, 5435699, 5524264, 5777448, 6019247, 6275073, 6181999, 6089115, 6169932, 6280359, 6238331, 6461086, 6728393, 6885589, 6975570, 6973545, 7360185, 6952680, 7420979, 7487489, 7784385, 7696731, 7688587, 8011454, 8385345, 8427523, 7977127, 8439179, 8697133, 8883689, 9066072, 8982569, 9076140, 9377124, 9601695, 10087182, 10009847, 9963213, 10002743, 10234287, 10792977, 11178864, 10651644, 11400761, 11605237]
16812A1605237J72111K38213N23535k88867O19202K5108P60306k75015M34692
16803A3814522O09142K21227K32348J78437J47413L16081P23091N6797Q86422
16794A7185480j60466N19456O47261M68663O94735K25969L39357O17517O71146
16785B1209118L35095M77700R60959L21598O65092Q53207O48704M04204Q51144
16776B6726821O21173R97111Q77664P09734Q71640P69687J236751J238817P92104
16767C4841502Q26063J200317J249730J261744J245208J233065J075510J645357
16759D4578496J382521J282054J768251J681787J670529J467035J651195K041350
16751E7523218J804678K291291J613296K451076J544920K687507K445490K271080
$$ y = [11605237, 11777348, 12015561, 12539096, 12250229, 12869431, 12894539, 13654845, 13379830, 13814522, 14423664, 14644891, 14877239, 15055676, 15203089, 15519170, 16242261, 16299058, 17185480, 17025014, 17544470, 18191731, 18660394, 19355129, 19581098, 19920455, 20537972, 21209118, 21544213, 22021913, 22982872, 23304470, 23969562, 24822769, 25471473, 25875677, 26726821, 27347994, 28345105, 29222769, 29932503, 30804143, 31573830, 32810581, 34049398, 34841502, 35667565, 36867882, 38117612, 39379356, 40624564, 41857629, 42933139, 44578496, 45961017, 47243071, 49011322, 50693109, 52363638, 53830673, 55481868, 57523218, 59327896, 61619187, 63232483, 65683559, 67228479, 69915986, 72361476, 74632556]
16743G4632556K090845K173282K292611K585151K109988K694961K135846K622437
16735I3337677K148126K333171J861025K133503J788778J606586J972051J267979
16727A08448896J082694Q91228J098132P09118L91211J06225J15304p82006j89227
16718A11871575j278259j109029j284035j252580j754724j795786j713477k161345
16710I9522340k196483k049826k345422k633380k240913k506706k463173k575063
16702H0511374k525393j967661k629679k086310k316508k496999k073046k157021
16694F2258757j998452j866490k049746j853573j582294j848491j787884j436774
16686D7835053j280105j583454j763520j157847j307684j726279j215444j208250
$$ y = [74632556, 76723401, 78896683, 81189294, 83774445, 85884433, 88579394, 90715240, 93337677, 95485803, 97818974, 99679999, 101813502, 103602280, 105208866, 107180917, 108448896, 109531590, 110422818, 111520950, 112230068, 112621279, 112727504, 112842808, 112060802, 111871575, 110593316, 109484287, 108200252, 106947672, 105192948, 103397162, 101683685, 99522340, 97325857, 95276031, 92930609, 90297229, 88056316, 85549610, 83086437, 80511374, 77985981, 76018320, 73388641, 71302331, 68985823, 66488824, 64415778, 62258757, 60260305, 58393815, 56344069, 54490496, 52908202, 51059711, 49271827, 47835053, 46554948, 44971494, 43207974, 42050127, 40742443, 39016164, 37800720, 36592470]
16678C6592470r35953j173598p14884j240669j036011p94185j133677o82162j038321
16669B7843010p52227o71775o81937o77354o35676m60954j017958n03697o26396
16660B1815036n50486m69456m85084n45034o58095m33132n40537q05064O8491
16651A7396639n97295j51841o60615k32290n18933k07791m24052k73656o26012
16642A3704154l31858J47000r36062L83509k87674m31361l79419j71207k48631
16633A1448451K85096o56826k94345k29310J9648l98164n9561j74726l83979R9117
16623I655401k98510m20973L21976n83869j24625k94757l9486J51410j57870o31317
16613G577380K64452J65610p71159L00045k31947j2235l04447l50718M7640O2619
$$ y = [36592470, 35656517, 34482919, 33768035, 32527366, 31491355, 30697170, 29563493, 28881331, 27843010, 27090783, 26419008, 25737071, 25059717, 24424041, 23963087, 22945129, 22441432, 21815036, 21264550, 20795094, 20310010, 19764976, 19106881, 18673749, 18133212, 17328148, 17396639, 16799344, 16647503, 15986888, 15754598, 15235665, 15027874, 14603822, 14330166, 13704154, 13372296, 13519296, 12583234, 12966743, 12679069, 12247708, 11868289, 11697082, 11448451, 11733547, 11076721, 10782376, 10553066, 10572714, 10174550, 10114989, 9940263, 9556284, 9655401, 9356891, 8935918, 9257894, 8674025, 8549400, 8254643, 8215157, 8366567, 8208697, 7577380, 7841832, 8007442, 7236283, 7536328, 7304381, 7292146, 6987699, 6636981, 6684621, 6747240]
16603F747240j36413P5575m42266k42057K00525j61370J52167m10208K77215m37117
16593E623291l0628L5345o2185P1503j66030m62199K33290j04445p8063r8967
16583D960912k18770j61515K12899j65175k62613K27309k2642m42448J3711M8515
16573D190183j96664O10052m09664j11699n9845o3538O123k52254R7649k74562
16563C535781J83335K80446o00774K57375j43123j11736k959J93002k56859O0291
16553C394779j37926k4024N9071Q4859o6605k27848J64433r032j57473n5730j05074
16542B919430l0496K82674l63925J0594L6893j46225P5190l98385L08889O2862
16532B757501o2214j91228J09936J21995j67054k15404j18387K20549j69725J03698
$$ y = [6747240, 6610827, 6686402, 6244136, 6002079, 6202604, 6041234, 6193401, 5783193, 6060408, 5623291, 5592663, 5628008, 5565823, 5637326, 5471296, 5009097, 5242387, 5137942, 5059879, 4960912, 4742142, 4580627, 4793526, 4628351, 4365738, 4593047, 4570405, 4127957, 4141668, 4190183, 3993519, 4603571, 4193907, 4082208, 4022363, 3958825, 3964948, 3712694, 3810343, 3535781, 3719116, 3999562, 3398788, 3656163, 3513040, 3401304, 3398345, 3591347, 3334488, 3394779, 3256853, 3232829, 3291900, 3376759, 3310154, 3082306, 3246739, 3237707, 3080234, 3024504, 2919430, 2888934, 3171608, 2807683, 2818277, 2855170, 2708945, 2784135, 2385750, 2694639, 2757501, 2695287, 2504059, 2613995, 2735990, 2568936, 2353532, 2235145, 2455694, 2285969, 2389667]
16522B389667j29575K60665j87658P8981m388j86048L27144n62219K39424k99181
16512A926812J67573r8447K99891l00659K72757q7597K2498k83579J34912J03115
16502B157276k40709J51113k04477k45165K3195K21720Q6244N2384j48448J54614
16492B007747n26442K47948K54482o4102m07546J45802j74379J35614j5332J4259
16482A618051j55197K57062j2477j77864k4631J81079k95450L47108j16627p7819
16472A543235m7094j8528P3507J0089O9731q8726k36805J65534r3705j38101L68749
16461A607886l06568K58398l57962j03862L43411k59458L33411n7532k51650o1652
16451A144422J78012K50653l92511P7871j05209j59210L95166m05498K69510K3549
$$ y = [2389667, 2260092, 2520757, 2333099, 2412080, 2407692, 2221644, 2548788, 1986569, 2225993, 1926812, 2094385, 1995938, 2295829, 1995170, 2267927, 2180330, 2202828, 1919249, 2054161, 2157276, 1916567, 2067680, 1863203, 1618038, 1641233, 1862953, 1949197, 2001581, 1853133, 2007747, 1481305, 1729253, 1983735, 1919633, 1512087, 1657889, 1483510, 1619124, 1603792, 1618051, 1462854, 1719916, 1707439, 1529575, 1504944, 1686023, 1390573, 1737681, 1621054, 1543235, 1496141, 1477613, 1551120, 1561209, 1630940, 1542214, 1305409, 1470943, 1377238, 1239137, 1607886, 1301318, 1559716, 1201754, 1097892, 1441303, 1181845, 1515256, 1457724, 1206074, 1144422, 1322434, 1573087, 1180576, 1258447, 1153238, 994028, 1389194, 983696, 1253206, 1276755]
16441A276755j9474J89477j97624k85197L52725J3402j73835j49411J15820J45064
16431A267702J604k96113K08758j62821P7890E43048L91893J79955m1772q4009
16421I89115K73593l20687j76656K34633n8538L004Q0526l12111J51634j6484
16411H48029o156J28939L5743L80544k30108R936j08253l14164J36761m4707j84890
16400F51674K82294N9129K04415k39228q6166M28556m30224n963j50726j41104
16390E72657J94072j51769P4670r4172K9866P38150o63031j72313L84338k92102
16380F20366k28510M26986m7581J53115k14722R3077l47780J77583k38941K39504
16370F33097M02706j66768l35136J83070L19230k95417J16896k17380J12517O6802
$$ y = [1276755, 1257281, 1446758, 1249134, 963937, 1316662, 1330064, 1156229, 1006818, 1122638, 1267702, 1269306, 973193, 1181951, 1019130, 1097020, 543048, 934941, 1114896, 1073124, 989115, 1262708, 942021, 765365, 999998, 941460, 944464, 1024990, 712879, 864513, 848029, 841873, 970812, 1006555, 1387099, 1156991, 1166927, 1058674, 744510, 881271, 836564, 651674, 933968, 993097, 1197512, 958284, 872118, 1300674, 870450, 864487, 713761, 572657, 766729, 614960, 689630, 595458, 625324, 1363474, 700443, 528130, 912468, 620366, 391856, 818842, 771261, 924376, 709654, 802731, 454951, 632534, 393593, 633097, 1035803, 869035, 533899, 716969, 1036199, 740782, 857678, 640298, 752815, 819617]
16360H19617J59536D82720L36433l55912J64329J21541n1008j22032K30703p6380
16350G30394C13142L23247J45722l69117o6510K28947R1488O9898j76280J03046
16340F63583k21026J99609J59658l28255B17268M41969n6170r676J56388j91308
16330E58471A86715N79915B84076L20582j02749J46316j92188O427O26892l0951
16320A058405m44631j94329j77991M52553J6411j54758J43038l3559A23548J05962
16310B29510J11209K92092k72604K81632A99381M36443k81782N19121k02930k92349
16300C77884I4473N8115J17165L27550m5290J78089M7279l73289j31772L10872
16290E83192k1648A6042K58712K83208A74799K96995q0967p8735K7862J70959
$$ y = [819617, 979153, 482720, 819153, 463241, 627570, 749111, 698103, 576071, 806774, 730394, 313142, 636389, 782111, 412994, 346484, 575431, 666919, 736817, 560537, 663583, 442557, 642166, 801824, 473569, 217268, 659237, 603067, 593391, 749779, 558471, 186715, 766630, 284076, 604658, 501909, 648225, 456037, 462464, 1089356, 1058405, 613774, 419445, 241454, 694007, 710418, 555660, 698698, 665139, 123548, 229510, 340719, 632811, 360207, 641839, 199381, 635824, 354042, 873163, 670233, 377884, 94473, 152588, 269753, 597303, 552013, 730102, 777381, 404092, 272320, 583192, 561544, 16042, 274754, 557962, 174799, 471794, 390827, 312092, 339954, 510913]
16280E10913k18974J80226J1246O1426B13697J81022j36053K62615B27438M69868
16270F97306A76903L09892j14057l5093R015M47752B68675j19694L54561j81785
16260C21757j3559K38858A35041J91330e747D88085j50853K90644G3847K25530
16250B99377J86751p6119Q0346j41682N7901p9724a811I1544N63190B84089O5539
16239C49628K2179p5288J20979K4845j20209c1041B86550q837O8680B2900K15700
16228B38600L41660k15948N5779j86192M0755m9140j0564K91018A44723M2078
16218A86801K0570m247G7420K24408F4353L53745j45497k6234J7413n5014p1201
16207A37565g4814C27018k4448A07402J97610A14276H210K59517O233L07455j81290
$$ y = [510913, 291939, 472165, 483411, 544837, 213697, 394719, 258666, 521281, 227438, 697306, 176903, 486795, 372738, 337645, 346660, 794412, 268675, 148981, 503542, 321757, 308198, 547056, 135041, 326371, -5747, 488085, 337232, 627876, 73847, 299377, 486128, 410009, 490355, 348673, 406574, 326850, -1811, 91544, 654734, 284089, 349628, 371807, 296519, 417498, 442343, 322134, -31041, 286550, 277713, 346393, 22900, 238600, 580260, 364312, 420091, 233899, 274654, 225514, 214950, 505968, 144723, 186801, 207371, 203124, 77420, 301828, 64353, 418098, 272601, 246367, 263780, 208766, 137565, -74814, 327018, 302570, 107402, 305012, 114276, 8210, 267727, 273960, 581415, 400125]
16196D00125j29936J5411J80547p3474I7038a41927B39164J76570j59906J01355
16186C57183j34587n6330O1209K15661k05724F6911L35678i5532B45744b3690
16175D36559a53976A84018k4866K82543c7521A75618K35275j00227j07369K9653
16165B32950J19665l4056j34765j0355E0983M4375j0571M2536J23016P5335h5002
16153A20880K11934I2739J21116P6226j07567c0430A02954J54637L1229r9842
16143A88978m9989J5397a26592A53640l8076L06708I6988A3673P3719J00921j9582
16132A68731K24243h1037A19853L03437r3681O4814l8837m4528a71797B05807
16121A04112N745e09l7220A6308K5832K0826Q4295K19036a9484p2124A70310J75182
$$ y = [400125, 270189, 285600, 466147, 392673, 97038, -141927, 239164, 415734, 255828, 357183, 222596, 166266, 227475, 443136, 237412, 66911, 402589, -95532, 245744, -23690, 436559, -153976, 184018, 159152, 441695, -37521, 175618, 410893, 310666, 203297, 232950, 352615, 318559, 183794, 173439, 50983, 95358, 84787, 127323, 250339, 325674, -85002, 120880, 332814, 92739, 213855, 290081, 182514, -30430, 102954, 257591, 288820, 188978, 138989, 154386, -126592, 153640, 115564, 422272, 96988, 13673, 87392, 188313, 168731, 392974, -81037, 119853, 423290, 329609, 394423, 355586, 311058, -171797, 205807, 104112, 109857, -509, -37729, 16308, 42140, 62966, 147261, 366297, -19484, -91608, 170310, 345492]
16109C45492j63464J63085A26214K54130F3158L93457A70908b8740B52593K32460
16099D85053B34364a8352B30851K85587a58487F2305J6660L5547m5718k552J01852
16088A68094K30698a7081C60850D6135P934a16142F4993a83627e9238E2894A1268
16076a58083G2234h1433A56081J50164A39281l4998a33091B11859K30353b3585
16065A87048N1063j4341a8670A15642k5414c0179B48366j00063i452G7719J07869
16054A85588J61883O5658j8597C4320d8302B99047J8098r054E8692a0338A4408
16042B8110L56111j72909b48033O0951C27189B2099K3215f6696F3682K39927j46528
16031A57081l4015L0979L8683e6859j26738B6050c93150F8307a47011B62338j0809
$$ y = [345492, 182028, 345113, 126214, 380344, 63158, 456615, 170908, -28740, 252593, 485053, 234364, -18352, 230851, 516438, -158487, 62305, 78965, 114512, 68794, 66242, 168094, 398792, -17081, 360850, 46135, 54069, -116142, 64993, -183627, -59238, 52894, 11268, -158083, 72234, -81433, 156081, 306245, 139281, 104283, -133091, 211859, 442212, -23585, 187048, 238111, 223770, -18670, 115642, 90228, -30179, 248366, 148303, -9452, 77719, 185588, 347471, 413129, 394532, 34320, -48302, 299047, 317145, 308091, 58692, -10338, 14408, 28110, 384221, 211312, -248033, -187082, 327189, 22099, 45314, -66696, 63682, 303609, 157081, 123066, 154045, 192728, -56859, -183597, 26050, -393150, 68307, -147011, 262338, 251529]
16020B51529A309b55945A17241J5799J16492A7487J41567Q6167b19242B53075
16009b509A96356a5663k6918C1729K38682F5439J46424R2396F3545g9937m11750
15998d91687B49419n4685Q1141C4114K83276P0717r8895a3418A09048L03893J89012
15987F01953J44792P32404J27700j63939k93474K5377m80691B03906G2116J3751
15977H5867e7456k376j05798e7855A72066J75992e1078E5407a27665M7387J5253
15966f5025k40851A2417c793A24137J38693b84590A78206a154D726b24730B28953
15954D68354A89545a25980b4820A84541j9624L6351b73147e9867l3110H6726a87259
15942A92959q1906J09712h9775B10145a76870m3250J06279j05902J06987c4347
$$ y = [251529, 1309, -255945, 117241, 133040, 249532, 17487, 159054, 245221, -219242, 253075, -2509, 196356, -15663, -42581, 31729, 270411, 65439, 211863, 304259, 63545, -79937, -491687, 249419, 194734, 275875, 34114, 317390, 388107, 289212, -13418, 109048, 412941, 601953, 746745, 1479149, 1606849, 1442910, 1149436, 1174813, 694122, 203906, 72116, 85867, -57456, -59832, -165630, -57855, 172066, 348058, -51078, 55407, -127665, -80278, -65025, -305876, 12417, -3793, 124137, 262830, -284590, 178206, -1154, 4726, -224730, 228953, 468354, 189545, -125980, -24820, 184541, 164917, 201268, -273147, -59867, -92977, 86726, -187259, 192959, 111053, 220765, -89775, 210145, -176870, -220120, -113841, -219743, -112756, -34347]
15931g9917H9365b0326j96007Q0063j69284F5193b4699l3911D47151a81585A84267
15919a53688g4222j50624a9329l72889a02745M5685j72786l5179d4228j21294
15909a65522a2567H5192N9236d18874K02622A41312G0387Q3705a30184G6305J06281
15898A82586k3263j0996b40910j31009g618l89191A91090d3390J6981j13154J9605
15887a19958A21542p70c4010j02554A62086o054a4227E7572a03636A63884f6999
15875a17232J0962b2368B1033J50675B5538K5544a06537j01693I1015h2086A13384
15863a94253A59123G1655a7426k53919j39649C05016j40545J18768a37862A56617
15852C37101g3849A10754b88830A28671a30817j21592A81640a18401D58270C2839
$$ y = [-79917, 89365, -20326, -216333, -136270, -305554, 65193, -24699, -58610, 447151, -181585, 184267, -153688, -74222, -224846, -19329, -392218, -102745, -57060, -229846, -265025, -44228, -165522, -12567, 85192, 144428, -418874, -216252, 141312, 70387, 154092, -130184, 76305, 182586, 159323, 148327, -240910, -371919, -7618, -396809, 191090, -43390, -26409, -139563, -119958, 121542, 120772, -34010, -136564, 162086, 156032, -14227, 57572, -103636, 163884, -66999, -117232, -106270, -22368, 21033, 171708, 25538, 51082, -106537, -208230, 91015, -82086, 113384, -194253, 159123, 71655, -17426, -271345, -410994, 305016, 164471, 283239, -137862, 156617, 337101, -73849, 110754, -288830, 128671, -130817, -252409, 181640, -118401, 458270, 32839]
15841A36419b9836j96258H0291i4090C15797o799B4123a59097A67556e0680o6785
15830a17465A84059a33071L1304F5158P7254E7056h6402B50477F5902B439a26029
15818c33007J49055O0679A53992a78834B34521A0649b98491J03496h0411E453
15807d1481j26971j83770A85759D0060c292j29402b2984j43310h0340D9288a64954
15795h7222o8486k72091c3138k9634j0217B21326R6029b09716D3745K0054i095
15783B285K46883p3698a36564a8660j25084P0001B9128J00317b87622D47215b20829
15771G1371J0590L4789M4758D5126K1299P6018c2140k6409a8729l26504p8026
15760d23259A29274J16128K79310f9484B02332k8601M7115j6398J75477A74844
$$ y = [136419, -29836, -226094, 80291, -94090, 315797, 308998, 24123, -159097, 167556, -50680, -117465, 184059, -133071, -101767, 65158, 142412, 57056, -86402, 250477, 65902, 2439, -126029, -333007, -183952, -123273, 153992, -178834, 234521, 10649, -298491, -194995, -80411, 5453, -41481, -168452, -352222, 185759, 40060, -3292, -132694, -22984, -166294, -80340, 49288, -164954, -87222, -155708, -427799, -33138, -62772, -72989, 221326, 317355, -209716, 43745, 63799, -9095, 2285, 249168, 175470, -136564, -18660, -143744, -73743, 29128, 129445, -287622, 447215, -220829, 71371, 81961, 116750, 161508, 45126, 66425, 142443, -32140, -58549, -18729, -345233, -423259, 129274, 245402, 524712, -69484, 202332, 173731, 220846, 204448, 379925, 174844]
15749g9057A45206b5243C7954Q7979K04714h4495F7883a5187A45586a96308A79197
15737c68248B74955E7427h9041Q147J6828j93036c952A03324K6974g5770C9773
15725A89617e1958l97187d5020E6796a61705C6234J07524a50349J737A58713c9861
15713a40264L0599B74653a49301j5439l9990R4768B85611C0639a2911j57858O9152
15702a01617m2946N051B36887h6171R905C1890J47268a09856k897B01495B8890
15690E7961K91343a50490A52671c40881B03416a29909a6438j12843A50039e0036
15679f863A534J66539a8387E6622L27733D6659M6866a75844A19573k2417k7726
15668F9430R9595c6411A02465a34923q8677e038C2367f9693j32716b8833k37558
$$ y = [-79057, 145206, -25243, 37954, 125933, 330647, -84495, 67883, -15187, 145586, -196308, 179197, -368248, 274955, 57427, -89041, -80894, -64066, -257102, -3952, 103324, 130298, -75770, 39773, 189617, -51958, -449145, -45020, 56796, -161705, 36234, 143758, -150349, -148612, 158713, -39861, -140264, -109665, 274653, -149301, -164740, -204730, -109962, 285611, 30639, -12911, -170769, -101617, -144563, -139512, 236887, -86171, -76266, 31890, 179158, -109856, -112753, 201495, 28890, 57961, 349304, -150490, 152671, -340881, 203416, -129909, -16438, -129281, 150039, -50036, -6863, 1534, 168073, -18387, 56622, 384355, 46659, 93525, -175844, 119573, 97156, 69430, 169025, -36411, 102465, -134923, -223600, -5038, 32367, -69693, -202409, -28833, -266391]
15657b66391a17396B13377a1936k8604B66011a70054h3863b1519A30455a26543
15646B22620c40496F2771K8828L83895C4534c955k5845k64330K9147o4071J11458
15635b17596I0844O8202g7666K8505D81433b88244j03123b2060A5204b53335B28799
15623b64744f361D0101a95018F1038a65253o602p547A71385R660b27775N5394
15612a72381h6036B12673B5343A549N455K41341b83075d0362N390j57547A64097
15600G9163J06549N0512B9428J0928h7585c1185j37971M5963c0970m9801I446
15588b80938g4382b4608G1429N531c4805j65278P0806e7981f375E8445a1483j31172
15576a42655F2437J15256F6107B907e8116A17384b70110C42185a85322A19618
$$ y = [-266391, -117396, 213377, -11936, -40540, 266011, -170054, -83863, -21519, 130455, -126543, 222620, -340496, 62771, 91599, 475494, 34534, -3955, -29800, -294130, -264983, -329054, -217596, 90844, 159046, -77666, -49161, 481433, -288244, -391367, -22060, 15204, -253335, 228799, -264744, -6361, 40101, -195018, 61038, -165253, -171855, -179402, 171385, 181045, -227775, -172381, -86036, 212673, 25343, 1549, 7004, 248345, -283075, -40362, -34972, -192519, 164097, 79163, 185712, 236224, 29428, 40356, -87585, -31185, -169156, -123193, -30970, -80771, 9446, -280938, -74382, -24608, 71429, 76960, -34805, -200083, -129277, -57981, -6375, 58445, -11483, -142655, 62437, 177693, 66107, 2907, -58116, 117384, -270110, 342185, -185322, 119618]
15565d4378C08570d44370J84605J04858M2620a9271B27248r9287a48547A55393
15554A694f8541B71185a82918a606m4433j01503I7071b16692C18744j36143a22145
15542C01424b54736a02974L229q2439k76604A30724d47956H4078e2095E9980d9253
15530a03889G023L5708a09504A12263b3672G0899h63r4531A3927b4977I0715e6604
15517C51772K0796j20605L134A17612R3814K2790e874A59930O6687E3911K37314
15506B91225i0371C06521A38976K0283J81441L5495G0713K32325p1149c51167
15495C28410f1607B72360j6925C580J29114a97326A78503o5603J96253e5431B07406
15483C03055j03921M0002C5212L54989A23979c4759B40063l236L36295K6694J50921
$$ y = [-44378, 308570, -444370, -259765, -154907, -112287, -19271, 227248, 127961, -148547, 155393, 1694, -68541, 271185, -182918, -1606, -46039, -147542, 97071, -216692, 318744, 182601, -122145, 301424, -254736, -102974, -99745, -182184, -458788, 130724, -447956, 84078, -52095, 59980, -49253, -103889, 7023, 42731, -109504, 112263, -23672, 70899, -863, -95394, 13927, -24977, 90715, -56604, 351772, 372568, 251963, 255097, 117612, 211426, 234216, -5874, 159930, 226617, 53911, 291225, -90371, 306521, 138976, 159259, 340700, 376195, 70713, 303038, 231889, -351167, 328410, -61607, 272360, 255435, 3580, 132694, -197326, 178503, 112900, 309153, -55431, 207406, 303055, 199134, 239136, 35212, 390201, 123979, -34759, 240063, 236827, 573122, 599816, 750737]
15472G50737j55310k75432K05395j9934k49135n5424J9647C202K1644J00176O8646
15461A93668N0930L9456A27305E4102K3326M0378b64408h8154D0707K60700A40605
15449A02986K1909g3346m9358B34913A00930J69412O40659K48787L51431j35088
15439A376131k44142n29545r8456k26988O1497A03342l3925C0916h6115F3592
15428b9191j45597I14P2058c5813q3691a2128r4117B37010b93244H2547I334f4666
15415A30794L3735J23389A21948B8139b21723K493N0673A59886a16744c3049j6049
15404d9098A13429b074p3043j54183I308g588l15759h9884B2798J1424J9775f8258
15391A54253a4850A416a75618h1849p9724B34497D2565K81261a04644Q232L6733
$$ y = [750737, 595427, 319995, 525390, 505456, 256321, 200897, 220544, 3202, 24846, 125022, 193668, 244598, 284054, 127305, 54102, 77428, 117806, -264408, -88154, 40707, 301407, 140605, 102986, 124895, -73346, -122704, 234913, 100930, 270342, 911001, 1159788, 1511219, 1376131, 1131989, 602444, 503988, 277000, 338497, 103342, 69417, 30916, -86115, 63592, -29191, -174788, 914, 72972, -35813, -119504, -12128, -106245, 237010, -293244, 82547, 9334, -64666, 130794, 164529, 287918, 121948, 28139, -221723, -219230, -168557, 159886, -116744, -33049, -49098, 113429, -2074, -75117, -229300, 9308, -7588, -323347, -89884, 22798, 34222, 53997, -68258, 154253, -14850, 1416, -175618, -81849, -161573, 234497, 42565, 323826, -104644, -96412, -59679]
15380e9679j18418K3546q66C258J88605a53833C02429o7727J73081j00155I6100
15368B98456B6698J97225f8175A02115A6064p106g8349C59684N3375k01352i987
15356A25710K61273J6706A89627J08381A40227F9653K72221a1922B19196J12125
15346C31321E3833A6954K38925L08539J7727j18389k5367q276q9220J24324h6874
15334D085J47214o1691J73245p602q2222Q5539j28773M0683C7661L05795n1884
15323B91572p1386K8225p0467J30833g4351B81365l3188n6717a5428n0792C26782
15311I5115J16574L4120M3447Q5607l4580D4448b16093R2766B49114o4908F332
15299C63522j23523R4391F4038J14582a58186A8343N7182d9069j43815D90920
$$ y = [-59679, -178097, -154551, -155417, 3258, 191863, -153833, 302429, 234702, 407783, 307628, 96100, 298456, 26698, 223923, -68175, 102115, 16064, 8958, -78349, 359684, 413059, 211707, -9987, 125710, 386983, 403689, 189627, 298008, 140227, 69653, 341874, -11922, 219196, 331321, 53833, 16954, 255879, 564418, 582145, 463756, 438389, 430113, 340893, 465217, -86874, 4085, 151299, 89608, 262853, 255251, 173029, 258568, 129795, 170478, 37661, 343456, 291572, 220186, 248411, 177944, 308777, -74351, 281365, 248177, 191460, -15428, -66220, 326782, 95115, 211689, 245809, 289256, 374863, 340283, 44448, -216093, -123327, 249114, 184206, 6332, 363522, 239999, 334390, 64038, 178620, -158186, 18343, 75525, -49069, -192884, 490920]
15288C6492N0512b32638B8022K02735a44839E7182g3433p4724h778j07773p688
15277a24239A05202k8929d4220A41213J27740B1481L95993a52166D02986h9940
15266a55143d5537k2901C12163i0483c0135k51752A6963K45094O3102K9892m5763
15255C09288a19959C0931a82736C44787k840a77359a8667A26350J01934A4277
15244b06625C8943N80464Q78174K61877n06822O89501I41896C52817m5462a8561
15233B97848I2201g5559A62704K1465Q3601P7223q9837P4393j33434J3856b64038
15221A20514f0827B14271K8764a71419C50383E071K60804j9141e5104A09533a46410
15209B8318Q366K28004K19023B22116b3951B02461r6663O7007l1947K18195i3540
$$ y = [36492, 87004, -232638, 28022, 230757, -144839, 57182, -73433, -148157, -8778, -116551, -124239, 105202, 76273, -44220, 141213, 268953, 21481, 417474, -152166, 402986, -89940, -155143, -45537, -68438, 312163, -90483, -30135, -281887, 16963, 262057, 325159, 355051, 309288, -119959, 30931, -182736, 344787, 341947, -177359, -18667, 126350, 228284, 14277, -206625, 38943, 619407, 1497581, 1759458, 1252636, 1942137, 941896, 352817, 307355, -18561, 297848, 92201, -75559, 162704, 184169, 267770, 344993, 255156, 329549, 196115, 209971, -264038, 120514, -60827, 214271, 243035, -171419, 350383, 5071, 265875, 246734, -55104, 109533, -146410, 28318, 36684, 264688, 483711, 222116, -23951, 202461, 105798, 172805, 140858, 359053, -93540]
15197c47499J41858G5680c64253D30696k05431g8118R286B18291a20856B63521
15186B9479C985d77B07601H1153J92218A23644b37647a01703F2243a01612c7379
15174F9477a64977A81495J71242D8954R8082L4220K7418b14660A1506L85007j50270
15163B46243J20738a98986C9757K70101k9394I4720J6252J7754j0372K46662A44901
15151d5310A53917j3861H109M2500J59947A7989N7875Q5066J45993j0967A43163
15139B27801L8429A15744J97259a01290B23080k8758k7403G2474n532a13907M7294
15128f6613G6438a50295B12392o6982m4405k7676r652N15355A94028L56762k20986
15117C29804L40j07424J37201D7346k1163b73719C80516j21756I4745A6595M9109
$$ y = [-347499, -205641, 75680, -364253, 430696, 225265, -78118, -68832, 218291, -120856, 263521, 29479, 3985, -477, 207601, 81153, 273371, 123644, -237647, -101703, 62243, -101612, -37379, 69477, -164977, 181495, 352737, 48954, 147036, 181256, 208674, -214660, 11506, 396513, 246243, 366981, -198986, 39757, 309858, 280464, 94720, 110972, 128726, 118354, 365016, 144901, -45310, 153917, 140056, 8109, 50609, 210556, 17989, 75864, 160930, 306923, 295956, 143163, 227801, 266230, 115744, 313003, -101290, 223080, 194322, 166919, 72474, 66942, -113907, -66613, 76438, -150295, 212392, 145410, 101005, 73329, 63677, 579032, 194028, 550790, 329804, 330144, 222720, 359921, 47346, 26183, -273719, 380516, 258760, 94745, 16595, 65704]
15106F5704J18583q1231O4429j1131a86758B8818K76826p7295n8361F585R90K56981
15094B64556A17003J58266O3422j18646o3812P8482r5037K79396c4709A95835
15083B03392f178C35475B0859a3884E8453Q4548J61453a85484P7670a5521B68123
15071e383C10576J15331A69413O4505a6890A13453P8361n7864M9575J70720l5819
15060C18426m7367r001P7770J44231k27490K9828A39249n0997K58866Q8579F8564
15048C99894R9957K07727l52658K2025D3991K16953K72115K36545j86009k70678
15038C12917J9108B2567N30780k68562L60215j72856R89K34813J56614J18066
15028I82626O1279l17737K53019l70469J1355B03049L11588N9898K91059q496
$$ y = [65704, 184287, 103056, 167485, 156354, -186758, 28818, 305644, 228349, 169988, 6585, 7575, 264556, 117003, 275269, 338691, 220045, 156233, 234715, 139678, 419074, -34709, 195835, 203392, -6178, 335475, 20859, -13884, 58453, 143001, 304454, -185484, -107814, -15521, 268123, -5383, 310576, 425907, 169413, 233918, -16890, 113453, 191814, 133950, 183525, 354245, 318426, 271059, 262058, 339828, 484059, 256569, 286397, 139249, 88252, 347118, 435697, 68564, 399894, 499851, 707578, 354920, 376945, 43991, 260944, 533059, 769604, 583595, 312917, 332025, 22567, 553347, 284785, 645000, 472144, 473133, 707946, 864560, 982626, 1043905, 726168, 979187, 608718, 620073, 203049, 514637, 574535, 865594, 857098]
15018H57098l03494p4556A96269J17264A54236L30410A89284E5035M01595M70688
15008I27318B84651J8525K46835j17221j68369O5060j59381L92793k1998K26418
14998G67313M6842j75776k52531j91923L24312B46449Q6517J26256J61086p1771
14988E48537B70673J26914J63672J9442j58522L5632P81574j45083M8403l9236
14978A103469D87140j22125N44288C28919K29217J22746N0585l30011L54385k03093
14968E52748o627L9684k52964k0052A36354M23619k68320K50267j20899L7450
14958D58471M1671k15898k1168K29541k02583O443K71193n9150k12197J02542
14948C98865L6614j67377K43528K54834R9174l34217K22969k84941K69138J04984
$$ y = [857098, 553604, 479048, 196269, 313533, 154236, 484646, 189284, 55035, 456630, 927318, 284651, 303176, 550011, 432790, 264421, 329481, 170100, 562893, 540895, 767313, 814155, 638379, 385848, 193925, 518237, 246449, 332966, 459222, 620308, 548537, 270673, 397587, 561259, 580701, 422179, 457811, 1239385, 1094302, 1142705, 1103469, 487140, 365015, 909303, 328919, 558136, 680882, 731467, 401456, 755841, 552748, 546121, 585805, 332841, 312789, 136354, 559973, 291653, 541920, 421021, 458471, 500142, 284244, 263076, 492617, 290034, 296477, 567670, 508520, 296323, 398865, 435479, 268102, 511630, 766464, 865638, 531421, 754390, 469449, 738587, 843571]
14938H43571B18336L10329J48341R1735K83509N9895j79487l7815L90996M7795
14928A333634j59122O13729M18689j21610J05678l82539j76767L78474L9846J9292
14918B069304P60644J34578j70861n85697j68081k40944l63051m66287j10742
14909H58863K46296B82948M11356j39655j33844K29885j53108j59686J69398b880
14898C68008J8000K22890k35905J06207j87050K73985B48832m0905J89184K58446
14888F55557L25149l28358L78686J13716k02191L78261m64248M89515l80093J36734
14878A102728j11932k15019o0110P2374C71748J85659K84579l68980K44804l40154
14868C77656P1543K54177J12170j25620n9333r7623j03537n9053J80767j08569
$$ y = [843571, 218336, 528665, 677006, 768741, 1052250, 1112145, 932658, 894843, 1285839, 1333634, 1174512, 1788241, 2206930, 2085320, 2190998, 1808459, 1631692, 2010166, 2050012, 2069304, 2829948, 2964526, 2793665, 2207968, 2039887, 1798943, 1435892, 969605, 858863, 1105159, 282948, 694304, 554649, 420805, 650690, 497582, 337896, 507294, -2880, 368008, 386008, 608898, 372993, 479200, 292150, 566135, 248832, 207927, 397111, 655557, 980706, 652348, 1031034, 1144750, 942559, 1320820, 856572, 1346087, 965994, 1102728, 990796, 775777, 715667, 788041, 371748, 557407, 841986, 473006, 717810, 377656, 449199, 703376, 815546, 689926, 630593, 532970, 429433, 370380, 551147, 442578]
14858D42578J86905k2358O0448k42546J54553A62150K73088K53747C22443K03661
14848E26104O4172j18397M45296j15452K85826N05107l41261l9798o6416r2679
14838A052502n9429r2519K37208k17748m4528k02242r3312l5139n4630J96559
14828F86722k90638P4898A99293J21466L77723J01062p4674J7619B24083M12153
14818F36236K56539O902K74290l86482O5415L5289j88799l04680L88155K66951
14808A049816M285L56968m53749J05826J5145l67337K670k62627J43348p0788
14798E23557k58647J61908J38732J33855k07016L8569q9691p3726K38933j18280
14788D88194l4882j10521L454M40617L8982J05147l09786L706j6671J33876l6477
$$ y = [442578, 629483, 607125, 667573, 425027, 579580, 162150, 435238, 688985, 322443, 526104, 590276, 471879, 917175, 801723, 1087549, 1592656, 1251395, 1211597, 1145181, 1052502, 993073, 900554, 1137762, 920014, 875486, 673244, 579932, 544793, 490163, 686722, 396084, 470982, 199293, 320759, 698482, 799544, 724870, 742489, 224083, 636236, 892775, 899677, 1173967, 787485, 852900, 888189, 699390, 394710, 782865, 1049816, 1054101, 1411069, 957320, 1063146, 1078291, 710954, 713624, 450997, 594345, 523557, 264910, 426818, 565550, 699405, 492389, 530958, 441267, 367541, 606474, 488194, 453312, 342791, 346245, 786862, 825844, 930991, 621205, 624911, 608240, 742116, 705639]
14777G05639L40614j30436J15050l08229R5631l3873k23681R7609n4779J46498
14767G50043K57253l03758q7432J94096k77705o8040O5849k42224L37981m0159
14757E85904J10986j10022N0993J39811L9613k45092P7673K9788k53997K01321
14747F26978j11199K04879J06245l66138K28404J19326J85484p2153j39095L32235
14737A114966k02446P09o6440Q3440j08409K06108L40850p6630P48541M87901
14727B528590l10156m00978M8126l35450m53670J12847m76250K40384k38806L93260
14717A107897Q2950l94151J61193j50962K91087J0612k90252R2624L67494m20467
14707H58025K27287J27659K91919J36158J01879N72908m4628m0466l58721k72483
$$ y = [705639, 1046253, 915817, 1030867, 722638, 818269, 784396, 560715, 658324, 603545, 750043, 1007296, 703538, 616106, 810202, 532497, 464457, 530306, 288082, 626063, 585904, 696890, 586868, 637861, 777672, 817285, 572193, 649866, 679654, 425657, 626978, 515779, 720658, 826903, 460765, 689169, 808495, 993979, 921826, 782731, 1114966, 912520, 913229, 846789, 930229, 821820, 1027928, 1368778, 1292148, 2040689, 2528590, 2218434, 1817456, 1865582, 1530132, 1076462, 1189309, 713059, 953443, 714637, 1107897, 1190847, 796696, 957889, 806927, 1098014, 1108626, 818374, 910998, 1278492, 858025, 1085312, 1212971, 1504890, 1641048, 1742927, 2315835, 2271207, 2230741, 1872020, 1599537]
14697A599537l72630r520J5534m17771J52280j90757j77703M60018m10015p8015
14687E70958M38066j9351k37262q9237J70407J82348j45604M2260j40935J59802
14677I31452P2594N9942l30859K85697j09469J28511k44856L76272J2729j34552
14667A047461k14271P5046R7868J50429n06976J76940j4167N20813l82904j37793
14657H12446M72175k4328j00865j70650J89557L24663k16012j19528n9479N0402
14647A158381j01514L44984l85862R8400o6611o6615J33314k16591L12120k64772
14637I45234M55089m39585O84117o29154L92546j36097j54566K20032k81284K6360
14627A082692O8954m2621L2447J88030J145J24043l46749L26876o3517J20538
$$ y = [1599537, 1226907, 1217387, 1232921, 815150, 967430, 776673, 598970, 1058988, 648973, 570958, 1009024, 989673, 752411, 663174, 833581, 1015929, 870325, 912585, 771650, 931452, 1004046, 1063988, 733129, 1018826, 909357, 1037868, 793012, 1169284, 1182013, 1047461, 833190, 908236, 1006104, 1156533, 649557, 826497, 812330, 1333143, 950239, 812446, 1284621, 1260293, 1159428, 988778, 1178335, 1502998, 1286986, 1167458, 1107979, 1158381, 1056867, 1401851, 1015989, 1114389, 1047778, 981163, 1114477, 897886, 1210006, 945234, 1400323, 960738, 1644855, 1015701, 1408247, 1272150, 1117584, 1337616, 1056332, 1082692, 1151646, 1109025, 1141472, 1329502, 1330647, 1454690, 1107941, 1434817, 1371300, 1491838]
14617A491838R3754j74279k00908K55392l34289M55787p2113k74438L442j664
14607A242522Q8131m9409K08576J13694J35548m85474J18456K99008m6648o7735
14597A556669P2975l5856L0442p0584j05443K01980J6186K69835l55418n106K28716
14586A804396J60113m44920P4087K78594K73401l02376L20731o8744j90473j9329
14576A885480o83M5027q8883J93672J45644q2131K27483l71071r7535M76322j54979
14565B178346J15049L9607L05504J64634m71287L19305K95714l47495L42868J17749
14555C059994j60875N97038N40625j14680M76700J002659J691129L015777R660540
14546A9768907J8419762J2986802B1000848H184607l785763j625564k77076K04843
$$ y = [1491838, 1585592, 1411313, 1210405, 1465797, 1131508, 1587295, 1515182, 1240744, 1244186, 1242522, 1330653, 1281244, 1489820, 1603514, 1739062, 1253588, 1372044, 1671052, 1624404, 1556669, 1629644, 1593788, 1624230, 1553646, 1448203, 1650183, 1666369, 1936204, 1580786, 1575680, 1804396, 1964509, 1519589, 1593676, 1872270, 2145671, 1843295, 2164026, 2095282, 1904809, 1885480, 1884797, 1929824, 1840941, 2034613, 2180257, 2098126, 2325609, 1954538, 1857003, 2333325, 2178346, 2293395, 2333002, 2638506, 2803140, 2331853, 2651158, 2946872, 2599377, 2942245, 3059994, 2899119, 3496157, 4036782, 3922102, 4398802, 5401461, 7092590, 10108367, 19768907, 38188669, 51175471, 21000848, 8184607, 4398844, 2773280, 2496204, 2701047]
14538B701047J445834J111027k185110q42558o17454M41886j82193K10728J13934
14529B197141J29810k612j72154r1098M9182j1154L82336l4265l6311Q6407J29979
14518B627261k52635K80673n6996J06688k83295L40166j89922J55651K05633q1234
14508B851990Q289k91793L94803L9187n3214k1201P5876q0033L64933l63629N0877
14497B976085J12629J3895K69014P6616l03062n3096K32530K51485l50835L84763
14487C610024l4811Q326J10422k51154K57268L0127j3691j51581O33757n31013
14477C667674L49690m5307J29886j32336J24482l40153M25677Q6034R8014j20547
14467D243114R5197M20536q2394N0727l98614N00334K99192l22264p91214N66718
$$ y = [2701047, 4146881, 5257908, 3072798, 2230240, 1612786, 2054672, 1872479, 2083207, 2197141, 2326951, 2324339, 2152185, 2061087, 2110269, 2099115, 2481451, 2447186, 2410875, 2497282, 2627261, 2374626, 2655299, 2598303, 2704991, 2421696, 2761862, 2571940, 2727591, 2933224, 2851990, 2860279, 2568486, 2963289, 3002476, 2949262, 2928061, 3003937, 2923904, 3288837, 2925208, 2976085, 3088714, 3102609, 3371623, 3448239, 3145177, 3092081, 3324611, 3576096, 3225261, 3610024, 3575213, 3583539, 3693961, 3442807, 3700075, 3730202, 3716511, 3564930, 4198687, 3667674, 4017364, 3972057, 4101943, 3969607, 4094089, 3753936, 4179613, 4265647, 4363661, 4243114, 4338311, 4758847, 4676453, 4727180, 4328566, 4828900, 5128092, 4805828, 4014614, 4581332]
14457D581332k9965P65890k72453q2180J24578j362M0891L99911Q1195J99748
14447E807585l30331p0386L38568r7301P8071L41060Q1754n4556p8892O2468J00640
14436F178680l078M56907k56853J70648p2069K73521m1848K58252o0807Q4731
14426F988084k020P26819j96890M99694L18853K94202m46155J14474j43197J44816
14416H298680L22018n5457K18837m3680j9239L18269O7065M1370M60523K66256
14406I874642M38737j25066K47100j59259j80560J98624J34547L80201j99900
14397A0609066Q4998J37538L78561J15577M34279L59874j15415N48442j59178
14388A2393742M31374P3409M79009L28530J26371L96507O36257L37158m36967
$$ y = [4581332, 4551367, 5317257, 5044804, 4962624, 5087202, 5085840, 5126731, 5526642, 5607837, 5807585, 5477254, 5406868, 5745436, 5648135, 5726206, 6067266, 6149020, 6094464, 6015572, 6078040, 6178680, 6175602, 6632509, 6375656, 6546304, 6474235, 6747756, 6705908, 6964160, 6903353, 6988084, 6986064, 7712883, 7515993, 8015687, 8334540, 8628742, 8182587, 8297061, 8153864, 8298680, 8620698, 8565241, 8784078, 8740398, 8721159, 9039428, 9106493, 9147863, 9608386, 9874642, 10313379, 10188313, 10435413, 10276154, 10095594, 10294218, 10428765, 10808966, 10609066, 10694064, 10831602, 11210163, 11325740, 11760019, 12119893, 12004478, 12552920, 12393742, 12825116, 12898525, 13377534, 13706064, 13832435, 14228942, 14865199, 15202357, 14765390]
14379A4765390L59300N91935n95231Q75793K33445Q5845L81761L55784O53927
14370A7707949K00420N29507K53972M94817N92278J99098L39587k522O00831R3862
14360B1009799J092480K62842O95074K90279N01221M24342Q00622O71208M15540
14351B6163407M53967J243701l2219J084113Q62222L66664O99519R04959J004126
14342C2750459P96927J244346J159180O42931R79943P98117J365671J171002J264432
14333D2173008J263668J132577J195974J828037J199796J808961J600313J210724
14325E3413058K488636J739736J820255K153406K357696K272809K593209J924314
14317G0763119K687534K392221L011256L219072L060520L443908L261085M251608
$$ y = [14765390, 15124690, 15716625, 15121394, 15997187, 16230632, 16316477, 16698238, 17054022, 17707949, 17908369, 18437876, 18691848, 19186665, 19778943, 19978041, 20317628, 20315106, 20915937, 21009799, 22102279, 22365121, 23060195, 23350474, 23851695, 24276037, 25076659, 25747867, 26163407, 26617374, 27861075, 27828856, 28912969, 29775191, 30141855, 30841374, 31746333, 32750459, 33547386, 34791732, 35950912, 36593843, 37573786, 38371903, 39737574, 40908576, 42173008, 43436676, 44569253, 45765227, 47593264, 48793060, 50602021, 52202334, 53413058, 55901694, 57641430, 59461685, 61615091, 63972787, 66245596, 68838805, 70763119, 73450653, 75842874, 78854130, 82073202, 85133722, 88577630, 91838715, 96090323]
14309I6090323L719828M676922M424170M199282N587530N150765N643713O210920
14301A35703453O147646O634673O936977P593468Q067268P829460R017318R524268
14293A97454531R926338J0547940J1031741J1583307J2153340J2573175J3536321
14286B78806693J3351396J4507958J4609637J4720990J5034523J5401393J5345201
14279C81777791J4942398J4343830J4041528J2776527J1810870J0180183Q204613
14272D68077740M339805j62686k076945J707758j874192m039063n506418q738525
14264D51727474j0833445j2803957j4262162j5045879j6066457j5928168j6539500
14257C50247906j5995791j5875698j5303451j5131655j4112883j4023894j3136695
$$ y = [96090323, 99810151, 104487073, 108911243, 113110525, 118698055, 123848820, 129492533, 135703453, 141851099, 148485772, 155422749, 163016217, 171083485, 178912945, 187930263, 197454531, 207380869, 217928809, 228960550, 240543857, 252697197, 265270372, 278806693, 292158089, 306666047, 321275684, 335996674, 351031197, 366432590, 381777791, 396720189, 411064019, 425105547, 437882074, 449692944, 459873127, 468077740, 472417545, 472254859, 470177914, 471885672, 470011480, 465972417, 460465999, 451727474, 440894029, 428090072, 413827910, 398782031, 382715574, 366787406, 350247906, 334252115, 318376417, 303072966, 287941311, 273828428, 259804534, 246667839]
14250B46667839j2604878j1923662r633000j0444085j0350558r438058q646375
14243A73627223q087205p559419p612372o977199o683727o035584n623473n378948
14235A19669296n229209n324839m558383l938293l536871m348178l488954l850891
14227H5393678l135604l052193l194930k615432k604378k686642k237022k238643
14219F3628834j848059k420329k160164j657460j908635j334407j182263j876220
14211D9241297j892641j466445j099915j616304k47725j312746j347025j335062
14203C8923434j311518r67359m55990m26591j329946j193384r94623q18426o47112
14194C0778485m75497q03507j044339p55037o82920m37615n80420q48808p60881
$$ y = [246667839, 234062961, 222139299, 212506299, 202062214, 191711656, 182273598, 173627223, 165540018, 157980599, 150368227, 143391028, 136707301, 130671717, 125048244, 119669296, 114440087, 109115248, 104556865, 100618572, 97081701, 92733523, 89244569, 85393678, 82258074, 79205881, 76010951, 73395519, 70791141, 68104499, 65867477, 63628834, 61780775, 59360446, 57200282, 55542822, 53634187, 52299780, 51117517, 49241297, 47348656, 45882211, 44782296, 43165992, 42918267, 41605521, 40258496, 38923434, 37611916, 36644557, 36188567, 35761976, 34432030, 33238646, 32244023, 31425597, 30778485, 30302988, 29499481, 28455142, 27700105, 27017185, 26579570, 25999150, 25150342, 24389461]
14185B4389461q861n80926n69698o51745n81399m23910n44499r1773n50072n34961
14175A9851617k37163n37507j56951l60136n13603j34400o32764l94507j53419
14166A6731167n62471l77064j14100j41219m74050M60984n87247o05478j03604
14157A4226918k31895l83647k61973J32690l73111k08381j74058j48718k23869
14148A2353956l54132l0399n88385K4101P6457o27529K33374m17037n7715J96115
14138A0808806n88382k6001N9959l67419k9518j23499m67421j19268M47048o82063
14128H912242j23067K65154m51920k52962J66804k2534j64280J653j7468m92681
14118G820941k75008k2687j71520J10330j37849K68857k73277j95353L33981k69150
$$ y = [24389461, 24380600, 23799674, 23229976, 22578231, 21996832, 21572922, 21028423, 20936650, 20386578, 19851617, 19614454, 19076947, 18919996, 18559860, 18046257, 17911857, 17279093, 16884586, 16731167, 16168696, 15791632, 15677532, 15536313, 15062263, 15523247, 14936000, 14330522, 14226918, 13995023, 13611376, 13349403, 13482093, 13108982, 12900601, 12726543, 12577825, 12353956, 11999824, 11969425, 11381040, 11405141, 11481598, 10854069, 11087443, 10670406, 10612691, 10808806, 10220424, 10194423, 10254382, 9886963, 9857445, 9733946, 9266525, 9147257, 9594305, 8912242, 8789175, 9054329, 8602409, 8349447, 8516251, 8493717, 8329437, 8331090, 8313622, 7820941, 7545933, 7523246, 7351726, 7462056, 7324207, 7593064, 7319787, 7124434, 7458415, 7189265]
14108G189265j98335k85488L54593m31867j20533J36782m34515J79171j72292
14099F216781J40032R0420n33749p7746J63391k48146O8436J7078m78715L40336
14089E698118N1772r7081n29886K48269j30986j44665j59923P7999J73786k19790
14079D967613R6042m02586N79268n16117p0470K07467j92203j25870k65727K71288
14069D548705m39785L34576P628K6159j3830m51131K37694J52338p4471R5992
14059D423875j89119j31558j35043L12391j71287J81046n85269K87330m33564
14050C558802M71332o23678P5259L01155n23247P5979K68027m18555M30152L3182
14040C648408l07824J62694m8193o680K3675k37770J06988k19988j86785N10331
$$ y = [7189265, 6990930, 6705442, 7060035, 6628168, 6507635, 6644417, 6209902, 6389073, 6216781, 6356813, 6447233, 5913484, 5835738, 5999129, 5750983, 5819419, 5836497, 5357782, 5698118, 5749890, 5652809, 5122923, 5371192, 5240206, 5095541, 4935618, 5013617, 5187403, 4967613, 5063655, 4661069, 5240337, 4724220, 4653750, 4861217, 4669014, 4543144, 4277417, 4548705, 4108920, 4443496, 4451124, 4477283, 4463453, 4012322, 4250016, 4402354, 4327883, 4423875, 4234756, 4103198, 3968155, 4280546, 4109259, 4290305, 3705036, 3992366, 3558802, 4030134, 3406456, 3481715, 3782870, 3259623, 3335602, 3603629, 3185074, 3615226, 3648408, 3340584, 3503278, 3455085, 3448405, 3472080, 3234310, 3341298, 3121310, 2934525, 3444856]
14030C444856k66249J0300j17628k90915K14259J7764j88144k16876O5030K97040
14020B969437m06934L66262l07319O2003j27187N3054N91671n06268J5311j41759
14010B568271k10891J41676r4496L33737l41270J9411L0921j13777k76546K72387
14000B329423l20476L48976k39654J82774k79940K93832k67682Q1242L03360n6339
13990B375516K37354N27571J961829O750800J7007883K4478550k3221254A4501924
13981H139225k430214j083873p53446k99433n0189l08695k85805K54499k48440
13972B933629k58984l70022M14061j96586J1534k51471K3559j81257m5375J81393
13962B260481K4451M33484n61732K779n1330Q8311j19740l1021j93294L99897
$$ y = [3444856, 3178607, 3188907, 3071279, 2780364, 2994623, 3012387, 2824243, 2607367, 2672397, 2969437, 2562503, 2928765, 2621446, 2683449, 2556262, 2609316, 3200987, 2694719, 2710030, 2568271, 2357380, 2499056, 2404560, 2738297, 2397027, 2416438, 2447359, 2333582, 2057036, 2329423, 2008947, 2357923, 2118269, 2301043, 2021103, 2314935, 2047253, 2128495, 2431855, 2375516, 2612870, 3140441, 5102270, 11853070, 28860953, 53339503, 30118249, 14501924, 8139225, 5709011, 4625138, 3871692, 3572259, 3522070, 3213375, 2927570, 3182069, 2933629, 2674645, 2304623, 2718684, 2522098, 2533632, 2282161, 2305720, 2124463, 2079088, 2260481, 2284932, 2718416, 2156684, 2159463, 2108133, 2196444, 2076704, 2045683, 1852389, 2252286]
13952B252286j32678k28782K64749n11131M10875L2855o5790l16805N02150j37698
13942B070031r4150N008l85565J42309P9113K0789J47630J03067j71254k49165
13932A667813K02690j33445r2103r4307N0970Q2460K19898m33653K06605J83620
13922A860548m09574K22857k17056J76386o8212K33832k06900k84920m9552L51180
13912A608589j85524l9258J2461J99538m3441j37859j76718R9970J36417J08383
13902A582558k24556K81662p0556K09103l01785M14106o69518K64375o6679j03666
13892A315044K11749m07674J39835K3651J42717k37171M22124j65232j19898k49404
13882A075741J29953r6246K34335p3067J59003l47860N7627n1782M65108o53361
$$ y = [2252286, 2119608, 1890826, 2155575, 1644444, 2055319, 2088174, 2022384, 1705579, 2207729, 2070031, 1975881, 1980889, 1595324, 1737633, 1816746, 1837535, 1985165, 2088232, 1916978, 1667813, 1870503, 1737058, 1644955, 1550648, 1601618, 1684078, 1903976, 1470323, 1676928, 1860548, 1450974, 1673831, 1456775, 1633161, 1564949, 1798781, 1591881, 1306961, 1257409, 1608589, 1423065, 1383807, 1396268, 1595806, 1552365, 1414506, 1237788, 1337758, 1474175, 1582558, 1358002, 1639664, 1569108, 1778211, 1476426, 1890532, 1221014, 1485389, 1418710, 1315044, 1526793, 1119119, 1258954, 1282605, 1425322, 1188151, 1610275, 1445043, 1325145, 1075741, 1205694, 1109448, 1343783, 1270716, 1429719, 1081859, 1139486, 1087704, 1552812, 899451]
13872H99451M02388l11503K30319q303k26731M3717O81437m43955k80170Q8032
13862A074682R3996K9638k14599L87168K41197j05085m06766J03095P8266L22088
13852A603680m62266J27739K35262n07221L27673k63502M6801r6088j55370L38076
13842A194784P7835m61598K48875K03601j57907k24304J55660l33028M15775l53984
13832G65709Q8531K72136k4895l71933J73191j21146J42204K1861O43n2102J5534
13821I09733k30413L62233j80978J89618j51310q650j58799K22662M4986J05948
13811A105030m20412M91537J0647l27835N7093j13086J63630R3356k65346K38024
13801A032638o1482j82079k05090M95509J7368k02501p1237l05446M40465L35104
$$ y = [899451, 1301839, 990336, 1220655, 1212352, 985621, 1029338, 1710775, 1266820, 986650, 1074682, 1168678, 1198316, 983717, 1370885, 1612082, 1506997, 1100231, 1203326, 1281592, 1603680, 1141414, 1269153, 1504415, 997194, 1324867, 1061365, 1108166, 1012078, 856708, 1194784, 1272619, 811021, 1059896, 1263497, 1105590, 881286, 1036946, 703918, 1119693, 765709, 854240, 1126376, 1101481, 729548, 902739, 781593, 923797, 945658, 946301, 894199, 909733, 679320, 1041553, 860575, 1050193, 898883, 890233, 731434, 954096, 999082, 1105030, 684618, 1176155, 1186802, 858967, 916060, 802974, 966604, 1059960, 794614, 1032638, 971156, 789077, 583987, 1079496, 1096864, 894363, 823126, 517680, 958145, 1293249]
13791A293249n75962j66608K73516J71522k76866l07877K82109Q9167k02821K04790
13781G84219R5990j93370j2304J53563J14698k26728j62263P0997n1897O2622
13771F35527J60165K27206k70127K01806j08308k57562j64111L03985r1151J57665
13761G95095k73118J05709J23034J23164q0673j5592k24533N79648n34647J37826
13751G35913j71474K21848q9105l17826Q4018L13119k92783M49158k142l49025
13741E81701K93903n386k96860k2508J99415p0300j41386m1962K06116K17218
13731I19951k49353p5566P0515j45853K18637O8814m8023k72032j31464M35670
13721G91296j67584N5855p0268j45180n6787p7175M37398l05831J70520k83044
$$ y = [1293249, 717287, 550679, 824195, 995717, 718851, 410974, 693083, 782250, 579429, 784219, 880209, 686839, 674535, 828098, 942796, 716068, 553805, 624802, 572905, 635527, 795692, 1022898, 752771, 954577, 846269, 588707, 424596, 728581, 637430, 795095, 521977, 627686, 750720, 873884, 793211, 777619, 553086, 1132734, 598087, 735913, 564439, 786287, 697182, 379356, 463374, 776493, 483710, 932868, 930726, 581701, 875604, 870218, 573358, 550850, 750265, 679965, 538579, 496617, 702733, 919951, 670598, 595032, 665547, 519694, 738331, 807145, 759122, 487090, 355626, 791296, 623712, 679567, 609299, 464119, 407332, 330157, 767555, 461724, 632244, 349200]
13711C49200K70970k6342r612K65778j94991j87695r0278K21842O2019J12574
13701G73465j3623j69112j98475j38638K14250K85356n6596j73619k03880J56051
13691D75179K10904j13423A77206K58976K10041K993k31746L05385B95251M01773
13681F97024C34682M48945l37583n5267K37724n863B48252J51161j08412O4155
13671C55156J67249J334o601M1260B66175J02748O7237K67098K33884l72480J05578
13660F70240K1629B30305J50339K08580p6235j95222K6870q7238K47522A63187
13649A60246M84687p8215k76684P1703J06168M71242k53350k81930m5539J44023
13639E02351J4881A71794P51355C38480q5268l5636M43017k21834k2917J89047
$$ y = [349200, 620170, 593828, 584216, 849994, 655003, 467308, 377030, 598872, 660891, 773465, 759842, 590730, 392255, 253617, 467867, 753223, 696627, 523008, 319128, 475179, 686083, 572660, 177206, 436182, 646223, 649216, 417470, 722855, 295251, 697024, 334682, 783627, 446044, 390777, 628501, 622638, 248252, 399413, 291001, 355156, 522405, 523739, 517138, 558398, 266175, 368923, 436160, 703258, 937142, 564662, 670240, 691869, 230305, 380644, 589224, 512989, 317767, 344637, 257399, 504921, 163187, 160246, 644933, 566718, 290034, 361737, 467905, 939147, 685797, 403867, 358328, 502351, 517232, 171794, 923149, 338480, 253212, 217576, 660593, 438759, 415842, 604889]
13629F04889G9599M47602N7339n2370p7538B16045K53933j19039L7523K03286
13619E91748k10369j2986L11906B41291J87896N0040j24101M7836H9224K92194
13609C81418l3128P3899q2176J14828C0948L55959j22745m6464K49015k22403
13599B44310A2876O35023j82003J974k8855M1943M7895B64276r4155M11017B79821
13587C77359A45688J19842N0131K47374j79447j60301m6473K17183A29924L82870
13577E12794j49469L48482l09108R1583j68275J57320r5262A51108L62065A67692
13566B1532L04945j41539N04052I6599J71103j14522L26363K0340j34427R9700
13556D65156j12253A07702a48954M8813E30074j59662K3670A715c2173C14816
$$ y = [604889, 79599, 527201, 584540, 532170, 454632, 216045, 469978, 350939, 388462, 591748, 381379, 368393, 680299, 241291, 429187, 479227, 355126, 402962, 89224, 381418, 348290, 422189, 340013, 454841, 30948, 386907, 264162, 217698, 466713, 244310, 12876, 647899, 465896, 467870, 439015, 480958, 528853, 264276, 170121, 581138, 279821, 377359, 145688, 265530, 315661, 563035, 383588, 223287, 176814, 393997, 129924, 512794, 363325, 711807, 402699, 494282, 326007, 483327, 388065, 151108, 513173, 167692, 21532, 326477, 184938, 688990, 96599, 267702, 153180, 479543, 499883, 365456, 465156, 352903, 107702, -148954, -100141, 530074, 370412, 394082, 1715, -32173, 314816]
13545C60809A29942m834B8587L99408J84876j78648k5521O6778J05420I5214L19884
13534D15098P731j50399P2393q9011r4129K55694k1701J35746A27512Q3032L50448
13523E60992j03222B14839J88256B6952L73201j01262L4943J78337j53456C6653
13512B82508h457D77979I6864L02716j72735b5492B48892K25408O3641H1264M79817
13501E61081A45534A9440J19517J58524c5344D01194j17330L20214B66706n661
13491B61045m480P3437e5635A43319J59455h9765C13590A6074P28213H5537Q1794
13480A67331M01974L0576F6331J19817P5700J5144L8395K9092K8548j44982n5769
13469A72276p404j1542K53059p2997q2325k4995m5991P6159A05566R2151P74J21895
$$ y = [360809, 129942, 125108, 28587, 427995, 612871, 434223, 408702, 475480, 580900, 95214, 415098, 422829, 272430, 344823, 255812, 161683, 417377, 395676, 531422, 127512, 210544, 560992, 457770, 214839, 403095, 26952, 400153, 298891, 333834, 512171, 358715, 36653, 282508, -8457, 477979, 96864, 399580, 226845, -25492, 248892, 474300, 537941, 81264, 561081, 145534, 19440, 138957, 297481, -35344, 401194, 283864, 604078, 266706, 261045, 256565, 330002, -55635, 143319, 302774, -89765, 313590, 16074, 744287, 85537, 167331, 569305, 599881, 66331, 186148, 261848, 276992, 315387, 344479, 373027, 228045, 172276, 164872, 153330, 406389, 333392, 251067, 226072, 180081, 256240, 105566, 197717, 198491, 320386]
13457C20386A05513N1598j601F1106J4359J15991K88189P1620a9073A20008J02608
13446B22616n6131K68128h017B33768J89878I6290R7235J21029j17137J71949
13436C69366c2224A03629K0039g3443C70380A32841l5520f8746a9741B12605K75795
13425D88400A77541K31597A24036L2976j6566b6875j181B04364d0947B94044j12920
13414A81124R3804M9680J30433k12266O1281a54090C35598m2294A11235J76928
13404B88163M5422A21376J12180r0741J87249C7357d6343C08110L9839o5691g6047
13392A69627K12130P4289A83103P3030J4084P4017A38909j5500K18624j07364
13382B34669i2759D24695I8760J03699m6267L08471A71950n5155P8685J3162L67441
$$ y = [320386, 105513, 157111, 155510, 61106, 75465, 191456, 479645, 551265, -19073, 120008, 222616, 166485, 434613, -8017, 233768, 423646, 96290, 193525, 314554, 197417, 369366, -32224, 103629, 123668, -73443, 370380, 132841, 97321, -68746, -19741, 212605, 488400, 177541, 409138, 124036, 157012, 140446, -26875, -28056, 204364, -40947, 294044, 181124, 274928, 324608, 455041, 242775, 304056, -154090, 335598, 293304, 111235, 288163, 333585, 121376, 233556, 142815, 330064, 37357, -46343, 308110, 347949, 282258, -76047, 169627, 381757, 456046, 183103, 256133, 270217, 344234, 138909, 123409, 342033, 234669, -92759, 424695, 98760, 202459, 156192, 464663, 171950, 116795, 195480, 208642, 576083]
13371E76083A48385K24328A34899K56046A52375J56504h6693B48944a69451C60443
13360C65869A38723K65336I6J60166n8535Q3936P3953J69221J39725A02751e6257
13348c4637A61398R952L45540E6102a74301B56978r0416Q0654m1200J89718A96228
13336D56163A28030J09435N46992C83777j62770A01543K07887n762j07006M1014
13326B37676J17068G8339C0900K97461i488B07347p8546K59234p7439A02435L49112
13315D51547J12005I7329L306F445K05303k6981E3280J34016P6939c692D4868
13303A5413P6072J56704a49759A53177p3202J62017A1274L28193J90899E1310
13292D21188g6683B59909E3658K73619g6395c6698E5011j4469K7816l078K99158
$$ y = [576083, 148385, 372713, 134899, 390945, 152375, 308879, -86693, 248944, -169451, 360443, 365869, 138723, 404059, 96, 160262, 101727, 185663, 259616, 428837, 568562, 102751, -56257, -34637, 161398, 171350, 516890, 56102, -174301, 256978, 166562, 247216, 206016, 395734, 196228, 456163, 128030, 237465, 784457, 383777, 221007, 101543, 309430, 303668, 196662, 237676, 354744, 78339, 30900, 328361, -9488, 207347, 128801, 388035, 310596, 102435, 451547, 563552, 97329, 100635, 6445, 211748, 184767, 53280, 187296, 264235, -3692, 44868, 15413, 91485, 248189, -149759, 153177, 79975, 241992, 11274, 339467, 530366, 51310, 421188, -76683, 259909, 53658, 327277, -76395, -36698, 55011, 40542, 68358, 65280, 364438]
13281C64438Q3913j37900l5936p5251P9446G6463J57746I88g497A60063K7793
13270A87856q0712a82137A66991K12680A47210C091c9908E1230J62318c1883B01788
13258B52341B4670O9919L3978J23600P381q5337J32002a31634A48839b5686A07314
13246G3893J46097o2495b4265A38146a7121A43478f5834B93899e4324A08007J1258
13235A19265p677p68Q5196G1140k8383O2679K25320Q5123C9199J92560J52315
13224C84074j70860I0118l7241R4921a29924n7883A62192G003a71699D83570g131
13212C8067M9465M5499K05518P0238j39535G8885N5868N7552J3215K38675e76140
13200A29528O6376j8314P0515G9146b33521B11944K1704M9407Q7880B5428R9066
$$ y = [364438, 448351, 310451, 274515, 199264, 278710, 76463, 234209, 988, -7497, 160063, 187856, 107144, -182137, 166991, 379671, 147210, 3091, -39908, 51230, 213548, -31883, 201788, 252341, 24670, 94589, 128567, 252167, 259548, 174211, 306213, -131634, 148839, -25686, 107314, 73893, 219990, 157495, -24265, 138146, -17121, 143478, -65834, 293899, -54324, 108007, 119265, 111588, 110820, 196016, 71140, 42757, 105436, 330756, 415879, 39199, 231759, 384074, 213214, 90118, 52877, 147798, -129924, -187807, 162192, 7003, -171699, 483570, -7131, 38067, 87532, 133031, 338549, 408787, 269252, 78885, 134753, 192305, 205520, 444195, -576140, 129528, 195904, 177590, 248105, 79146, -233521, 211944, 233648, 283055, 370935, 25428, 124494]
13189A24494j6660J85014Q2682A38551J23839m3690F0477R7888C8387J04188F44
13177a31630a69l60946A13781c5213B41269j08617F5129J38256E2162J17287B5546
13165e3386j59919F0315k8089L1862a60830E7403K29388j38084f1168B40140d5122
13153C76418G2410L28604H9232e5810A25350J2233J925F5924i1654j57182A7902
13141A79874M2368f0356k4760A73935p6801a73568e0796C4481Q920f5087D7563
13129d8947D4155K69744C3279e168A59183A8567K98122a46324A96402O5929k9263
13118B33068i4998L1549B06292N1593A13475A4645J51619b3346F7934K4793h3566
13106b06675B29047m5866H1652P7233p2178a20462A80166o2947c52974d6011C57116
$$ y = [124494, 107834, 292848, 375530, 138551, 262390, 218700, 60477, 158365, 38387, 142575, 644, -131630, -169, -361115, 113781, -35213, 241269, 132652, 65129, 203385, 52162, 169449, 25546, -53386, -213305, 60315, 32226, 64088, -160830, 57403, 286791, 148707, -61168, 240140, -45122, 376418, 72410, 401014, 89232, -55810, 125350, 137583, 139508, 65924, -91654, -248836, 17902, 179874, 222242, -60356, -85116, 173935, 97134, -173568, -50796, 34481, 43401, -65087, 47563, -48947, 44155, 313899, 33279, -5168, 159183, 18567, 316689, -146324, 196402, 262331, 233068, -94998, -63449, 206292, 257885, 113475, 14645, 166264, -23346, 67934, 92727, -83566, -206675, 229047, 183181, 81652, 158885, 86707, -120462, 180166, 117219, -352974, -46011, 357116]
13094A48076a68767A61663a13435C03408j7745a77269B862g0430A76644O9125
13084B45769K91025g834A44591E9869L1988a85523C29397A42335b26851o9217
13074b96068O5415D2438a4986B73980j25433o5389J13086a33248B22944c8482
13063C45178a01464B69254D88K65100g0917B4572a4265B07974D6297A1549g5289
13051C29120j18957A437f9702j99915a15817B42132m4048n3995K1289a01636j79413
13040b81049C00973k5689K44434j28325e4051C74034F7112L7732b10334G3406
13029a04704A76705b5082q4514I682b48791H107J51439m7791f1171A80480R4798
13018B75278b07797E65151k36952o8275L79511A22162l298J23873J2618i2835
$$ y = [148076, -168767, 161663, -113435, 303408, 285663, -177269, 2862, -70430, 176644, 245769, 536794, -7834, 144591, 59869, 91857, -185523, 329397, 142335, -226851, -296068, -230653, 42438, -14986, 273980, 148547, 83158, 196244, -133248, 222944, -38482, 345178, -101464, 269254, 488, 265588, -70917, 24572, -14265, 207974, 46297, 11549, -75289, 329120, 210163, 1437, -69702, -269617, -115817, 242132, 198084, 144089, 165378, -101636, -281049, 300973, 275284, 519718, 391393, -54051, 374034, 67112, 104844, -210334, 73406, -104704, 176705, -25082, -109596, 9682, -248791, 8107, 159546, 111755, -61171, 180480, 275278, -207797, 565151, 328199, 259924, 639435, 122162, 118864, 242737, 255355, -92835]
13007C42130l2392j08813R4199A17544j8295a8687A9807K33084a28031A00347
12996D38321A53214l7338C2675K76536a92221d9169E3461a38261q9934A0035C491
12984F6063L42664a03560B1304Q5641a83396e9364J5141J9940F9836b55006c0580
12972B34836r5673a20331C47060f732m1153A52259J70923b6030E200d8282A33765
12960A14753D39h0733G7875O2886K43728b7252l7074B49578E6445e9913B52217
12948c31B01408e5581C7176M2986h5022I436a37153N9353C287K93393j29162a22559
12935a23002l15119D449a18203G1008c85765B17833d6939N251k26514C4601l611
12924C0990K05130h3486B10246b64935I0980Q8627C4456J67834Q6484j04652G8803
$$ y = [342130, 309738, 200925, 295124, 117544, 99249, -18687, 19807, 252891, -128031, 100347, 438321, 153214, 115876, 32675, 309211, -192221, -49169, 53461, -138261, -228195, 10035, 3491, 66063, 408727, -103560, 21304, 106945, -183396, -59364, -44223, -24283, 69836, -255006, -30580, 234836, 139163, -120331, 347060, -6732, -47885, 152259, 323182, -26030, 5200, -48282, 133765, 114753, 439, -80733, 77875, 140761, 384489, -27252, -64326, 249578, 56445, -59913, 252217, -331, 201408, -55581, 37176, 80162, -85022, 9436, -137153, -77800, 3287, 296680, 167518, -122559, -123002, -438121, 4449, -118203, 71008, -385765, 217833, -46939, -41688, -268202, 34601, 30990, 236120, -83486, 210246, -264935, 90980, 179607, 34456, 202290, 288774, 184122, 78803]
12912B98370n5000h9815A20905M8635J32860b32287a8251j35729j3795A07675
12901a34909D721P7927a38794j1822N4183A08863a43770l049q3538C66977E3207
12889F6209m863b11456P2605B4679b3263n379C5218i178n381o2578E0228R2645
12877A42873g0709b1757E9777g2196o4269B2240a86859L6341D8684L89513i5689
12865A33812E1033h649B63584J3475a42693L4902r4675j4663B29154c31709C8206
12853g4330A02216K92408I8025J35231m0057b99876B6595F134J81003a23671B81367
12841i151F6200M1736L6107E4781c7018j42423k41659B5937e2051l3564B63953
12829a58654A270L8087a64039f1455k12409e4793a6415I9720J07177d9880j14538
$$ y = [298370, 243370, -89815, 120905, 169540, 302400, -232287, -18251, -153980, -167775, 107675, -134909, 4721, 82648, -138794, -150616, -96433, 108863, -143770, -146819, -230357, 366977, 53207, 66209, 61346, -211456, -138851, 24679, -23263, -28642, 35218, -9178, -14559, -77137, 50228, 142873, -70709, -21757, 59777, -72196, -136465, 22240, -186859, -150518, 48684, 438197, -95689, 133812, 51033, -8649, 263584, 277059, -142693, -107791, -202466, -217129, 229154, -331709, 38206, -74330, 102216, 394624, 98025, 233256, 193199, -299876, 26595, 6134, 187137, -123671, 281367, -9151, 66200, 107936, 144043, 54781, -37018, -179441, -421100, 25937, -52051, -85615, 263953, -158654, 1270, 39357, -164039, -61455, -273864, -54793, -16415, 99720, 206897, -49880, -164418]
12818a64418H8014a63978f8961B15302a35084e3175G0291a37286k5184G8337J52285
12807B30622f0363j6477G9929a29094F3211M2385a05063p7928A6624a99279A69884
12795a26959B81037j31367l7600a77302J0542N1412m4607f5332E0850M4755g9771
12783C0947g3461C14890c1801A20820a46641m3847a0765j87169h734k7126C3813
12771b314A79497O0935g3522A4238L44275c2106p0568d752B52532J6733o5224
12760B04041C2484J14468k1077E5914h2570A35244a0468r0501j40150A38695j6299
12749A22396e4092R995B12138m8695f3258D2013J12428f9863E8044P3241o3615
12738F7670J72000I3980e1035C8723a64497B51204A17204J90380H7122L2277J77494
$$ y = [-164418, 88014, -163978, -68961, 215302, -135084, -53175, 70291, -137286, -162470, 78337, 230622, -60363, -76840, 79929, -129094, 63211, 105596, -105063, -182991, 16624, -199279, 169884, -126959, 281037, 149670, 112070, -177302, -166760, -115348, -159955, -65332, 50850, 95605, -79771, 30947, -73461, 314890, -31801, 120820, -146641, -190488, -10765, -197934, -8734, -35860, 33813, -2314, 179497, 240432, -73522, 14238, 358513, -32106, -102674, -4752, 252532, 269265, 204041, 32484, 146952, 125875, 55914, -82570, 135244, -10468, -100969, -241119, 138695, 122396, -54092, -44097, 212138, 163443, -63258, 42013, 154441, -69863, 58044, 131285, 67670, 239670, 93980, -51035, 38723, -164497, 251204, 117204, 307584, 87122, 119399, 296893]
12727B96893a37346E2472c6021a1240B30698k4709j02678b87409L5033M8663e4763
12715B47214b98467b6465A95440D4346a42908A89591q1344r628J65254a03506
12704B35403b30343A02735K63451a94792C3302a83996I2978c4041A22418J54819
12694B77237a18208j41705C48912a74642B77791J2839a19590m0878A51037a20642
12683B55261j05419h96C5182J21925K33046l2998B8858J8824L77246n9196D9351
12671A00080a55035P680a1249B14255r9142K60908A57466f2854F7930a87504h1490
12659B16754F9871J19227p4745R5492A6525g6851m7971m8466A48941a51608B04789
12647H5816J26149c6110A37720A2904J59381B7094K33637c9275j83307C25758
$$ y = [296893, -137346, 52472, -36021, -11240, 230698, 205989, 103311, -287409, -252376, -203713, -54763, 247214, -298467, -26465, 195440, 44346, -142908, 189591, 108247, 98619, 263873, -103506, 235403, -230343, 102735, 366186, -194792, 33302, -183996, 92978, -34041, 122418, 277237, -118208, -259913, 348912, -174642, 277791, 290630, -119590, -160468, 151037, -120642, 255261, 149842, -896, 35182, 157107, 390153, 357155, 28858, 47682, 424928, 365732, 49351, 100080, -155035, -147355, -11249, 214255, 115113, 376021, 157466, -62854, 67930, -187504, -81490, 216754, 69871, 189098, 114353, 209845, 16525, -76851, -124822, -173288, 148941, -151608, 204789, 85816, 211965, -36110, 137720, 12904, 172285, 27094, 260731, -39275, -222582, 325758]
12636c00960B89281h3911K4554C2124K5812L57013a91012C50589d1829E14297
12625i0765D8179L28871j09309b08252B43198E3032e2901B28610p1861n3009O7252
12614A70992a04964A12965M5214l5226f2038C02567a71702C114b28498A59758
12603B32218j02979h0363r0724a6446q7652j4953A4995a66993P0050C558M0679
12592D4237a01545B1854b67044A33048j2294C3180K24546E510e2291l8879j99783
12581b90953L0438A93792i6462C82272A1470J39666f9442j86946B82306r5622
12571A86684k8905h3149A15378n863Q1297K8177J28004a64589P9691j04416c3007
12559A2518R1261p223J6881A5325J81732a17038a401A7936M5897P6775K72615
$$ y = [-300960, 289281, -83911, -59357, 32124, 57936, 414949, -191012, 350589, -41829, 514297, -90765, 48179, 377050, 267741, -208252, 243198, 53032, -52901, 228610, 156749, 103740, 170992, -104964, 112965, 158179, 122953, -62038, 302567, -171702, 3114, -228498, 159758, 232218, 129239, -80363, -171087, -16446, -104098, -119051, 14995, -166993, -96943, 3558, 44237, -101545, 21854, -267044, 133048, 120754, 33180, 257726, 5510, -52291, -91170, -290953, -260515, 193792, -96462, 382272, 11470, 151136, -69442, -256388, 282306, 186684, 157779, -83149, 115378, 109515, 190812, 218989, 346993, -164589, -84898, -189314, -33007, 12518, 103779, 96556, 113437, 15325, 197057, -117038, -1401, 17936, 63833, 140608, 413223]
12548D13223A24826N7852P5821c83300H788N469K8514b54387h6478D2141a27366
12536C49424e1043j32032k3496A73913a5979F7956A2321a22959N9484r9903B48343
12524B74580G8540a5775E3149N9775N801J2426b07439B841L83567J5485j90270
12513B11623d5014k0454C7919a71411A16306a15539a62o5807a9193l3118j92711
12502b45022B04771D9586e64112K40642c0467k7299r5659B0560d69089A40599
12491B67102n8971c6824e306l8696I6077k793J10812b33428k4510k3841a03113
12479b14324d1335p0413e5428D55871A4015a17357L0832j35224g5424A34049j4177
12468A19872Q3239a56617j35768A3565O0591J25833J84991a35621F4179a7594
$$ y = [413223, 124826, 182678, 258499, -383300, 8788, 14257, 42771, -254387, -86478, 42141, -127366, 349424, -51043, -183075, -206571, 173913, -15979, 67956, 12321, -122959, -63475, -163378, 248343, 274580, 78540, -15775, 53149, 112924, 118725, 131151, -207439, 2841, 386408, 401893, 211623, -45014, -65468, 37919, -171411, 116306, -115539, -162, -65969, -19193, -52311, -245022, 204771, 49586, -564112, -323470, -30467, -57766, -153425, 20560, -469089, 140599, 267102, 208131, -36824, -5306, -44002, 96077, 93284, 204096, -233428, -257938, -281779, -103113, -214324, -41335, -111748, -55428, 455871, 14015, -117357, -86525, -221749, -75424, 134049, 119872, 203111, -156617, -292385, 13565, 74156, 199989, 384980, -135621, 64179, -17594]
12457a42929F7990b00983R9035E1804J97853F6850j7634d37762J92746C01638
12446A10590a12197A05632f7781C41479b7699k7214r4990a0659A066O3497C1291
12434A13997D1656c25190d1765r9767L083A30087K425K41690h4948A63355o5064
12423I8291a13352k8608j43505e9638B6942a97348A71396g5553D48182H4576a33590
12411A45530R076f5422j07536B10969l2423d9556K3214j32161f2398C3311f0703
12399a74004h5854A9376K77605I4949C1854q447o020L14776B593a24881B02834
12387A75423h062B4994J55819q0404b0920m8212A19259a05416K1040A36599h415
12375A91857q7839b0926A81385m5828C8981a08606j45741e024k6152B37823p0840
$$ y = [-142929, 67990, -200983, -101948, 51804, 249657, 66850, 49216, -437762, -245016, 301638, 110590, -112197, 105632, -67781, 341479, -27699, -54913, -149903, -10659, 1066, 64563, 31291, 113997, 41656, -325190, -41765, -141532, -138449, 130087, 132512, 374202, -84948, 163355, 98291, -113352, -141960, -285465, -59638, 26942, -197348, 171396, -75553, 448182, 84576, -133590, 145530, 154606, -65422, -172958, 210969, 178546, -49556, -26342, -158503, -62398, 33311, -60703, -174004, -85854, 19376, 296981, 94949, 31854, 23407, 17387, 332163, 2593, -124881, 202834, 175423, -8062, 24994, 180813, 100409, -20920, -69132, 119259, -105416, -84376, 136599, -8415, 191857, 104018, -20926, 181385, 135557, 38981, -108606, -254347, -5024, -31176, 237823, 166983]
12364A66983c06478A75455q0750j6941l3448b00170j67456E5505c0238A9593J66600
12353A86193b9836o9211m4066I4754a54517K5802a457H1143g9429k4305n3040
12342a56774M7678J9223r1867b7781C66928a62102e7352B50976b04974B17211
12331B76517C4554g8383H5170J07974e1048n8373C3154R8860K55341a34363A89947
12319E84398G9012K50135j669j29265c4445m1090D21881k09125b6713A7665K82326
12308B99991J09755A1465J03072J67556j40205b8539k98983A75678C2863L9264
12298G2127A5663L88689a33194C15619n3194a34682I6768p965A7158L59595a37875
12286A6773K24045c2599B4110J89151E7906c48193E1327K73333f2049K4765J038
$$ y = [166983, -306478, 175455, 94705, 77764, 44316, -200170, -367626, 55505, -30238, 19593, 186193, -29836, -99047, -143113, 94754, -154517, -128715, -1457, 81143, -79429, -103734, -156774, -109096, -89873, -181740, -27781, 366928, -162102, -57352, 250976, -204974, 217211, 276517, 34554, -78383, 85170, 193144, -51048, -109421, 33154, 132014, 387355, -134363, 189947, 584398, 79012, 329147, 327478, 198213, -34445, -75535, 421881, 212756, -26713, 17665, 299991, 409746, 11465, 114537, 282093, 141888, -28539, -327522, 175678, 32863, 72127, 15663, 404352, -133194, 315619, 262425, -134682, 96768, 88803, 17158, 376753, -137875, 16773, 240818, -32599, 24110, 213261, 57906, -348193, 51327, 324660, -62049, -37284, -36246]
12275c6246k18937C43342m9900J85608A64900J58831j8991I4369P4318K57221
12265D25908j2272A92678L8079F5947K35052P8500A24258K4025K18360A04146
12254D16868o8056A15978K31143b05185B63990R8286j49495F6198B9123J61128
12244A90251J35386D3730Q3539R3459c4145C57748j19583j10643P7094n4760J56444
12233C06300H5900K4144a93270i5092A11651l932j1445L1250a640A69396K3783
12222A93179n0842R0318C0584K06910a0216A52627n7787J65788J49655c0402E60254
12210G4016N7279B0301L19318m1773e6499C50745A35132L2662a69492d7308C3634
12198E16862A65720b113D1982J09726m1853K1638J03935f3348B46899J38621j55447
$$ y = [-36246, -255183, 343342, 293442, 479050, 164900, 323731, 304740, 94369, 168687, 425908, 413636, 192678, 230757, 65947, 300999, 379499, 124258, 148283, 366643, 104146, 416868, 348812, 115978, 347121, -205185, 263990, 362276, 212781, 66198, 29123, 190251, 325637, 43730, 127269, 220728, -34145, 357748, 238165, 127522, 204616, 149856, 306300, 85900, 110044, -193270, -95092, 111651, 107719, 96274, 127524, -1640, 169396, 193179, 142337, 232655, 30584, 237494, -10216, 152627, 94840, 260628, 410283, -30402, 560254, 74016, 131295, 20301, 339619, 297846, -56499, 350745, 135132, 167794, -169492, -47308, 33634, 516862, 165720, -2113, 41982, 151708, 109855, 131493, 235428, -63348, 246899, 385520, 230073]
12187B30073J04742B5729J07250J46450J28964f5620B81493k9945p7780a42189
12176C43842R0161i7879A67258K00670M1793j63254J6276q7001q1940M8128L76104
12165E18034r214e0961C58069p6068R4809C8626R48j1487L79359A92018J53405
12154C45423e154B90645M640b9888A51662O5220k7603i773D34809k8581A76399
12142F5218A6276L52231A58872J2841i9379A12076m5177k4252j4626K25184H6010
12130c1507B88429b6123E99L00810N4758a605D30824f1321A39654F4305a908A56624
12117A98945A7913N2758k1328a69406b0478C96027J65003a75213g8983j40188
12107b19171A20541b3787j35369c2611j35528f5595k17783H7949Q6956e8651A5356
$$ y = [230073, 334815, 25729, 132979, 279429, 408393, -65620, 281493, 251548, 173768, -142189, 343842, 434003, -97879, 167258, 367928, 409721, 246467, 262743, 175742, 93802, 141930, 518034, 508820, -50961, 358069, 282001, 376810, 38626, 39574, 28087, 407446, 192018, 345423, -5154, 290645, 295285, -29888, 151662, 216882, 189279, -9773, 434809, 406228, 176399, 65218, 16276, 368507, 158872, 171713, -99379, 112076, 66899, 42647, 28021, 253205, 86010, -31507, 288429, -26123, 599, 301409, 356167, -1605, 430824, -61321, 139654, 64305, -1908, 156624, 198945, 17913, 70671, 49343, -169406, -20478, 396027, 561030, -175213, -78983, -219171, 120541, -23787, -159156, -32611, -168139, -65595, -283378, 87949, 174905, -58651, 15356]
12095E4467A9543d190G3416L23557A65172k4504n3949b4864G3892a78615A83527
12083D20070p5294j57254l9166K02977a48709E32120I7296L20044A14073m9988
12073F4085R8219b7812C61877E3669L6070M48978k41314J29376j21911M6833A37284
12061A06582J96048a3256A85811D6486a3233j7066B95988j21604k1137C1303K3357
12050E4660f5085j94246M7499g5220D3542a79789P1823c6300n6178F7574O1204
12039A28778J59297A16994a42057B98511E2349K33849J7717a36442j05570L4370
12029b07642C5745a41917B4532L5070K29827F1812b3387H0267Q6939Q1854A15998
12017a27656o6775c6629j50526a9382m6818C30748a81469E4200a05133j25153
$$ y = [54467, 19543, -4190, 73416, 396973, 165172, 140668, 86719, -24864, 73892, -178615, 183527, 420070, 344776, 187522, 148356, 351333, -148709, 532120, 97296, 417340, 114073, 64085, 162304, -27812, 361877, 53669, 89739, 538717, 297403, 426779, 304868, 351701, 137284, 106582, 302630, -13256, 185811, 46486, -13233, -30299, 295988, 174384, 153247, 31303, 54660, -65085, -259331, -211832, -75220, 43542, -179789, -107966, -36300, -92478, 67574, 128778, 288075, 116994, -142057, 298511, 52349, 286198, 303915, -136442, -242012, -207642, 35745, -141917, 24532, 59602, 289429, 61812, -23387, 80267, 167206, 249060, 115998, -127656, -194431, -36629, -187155, -19382, -66200, 330748, -181469, 54200, -105133, -230286]
12007b30286B8013J66833P3470n1442a25037A25546B7673M8055J35688F1291P0005
11996A31296L2308D8661e0056j69492A13215a62963A50307b42173P5057f7750
11985d443j73552k6277F0748b0477A13180b18940C3371L1817f7443I8671L012
11974A01683a25942n7613n7855l9581f3168k1251a5097j69743L7918k26865d337
11962b64247a2623l83474H324K48410f4678B13799a82764A77341h2982A44945
11951B57524b40337f1069A53702K66824a93666L7555G2536d51980B27213D9031
11940i7160a0877E3022J73657I172e9327b1424B69822l8174a64172q9812A63124
11928A85094a89079m5296C4410a80287a9268G3732c8839E32587B7572a29335j9652
$$ y = [-230286, 28013, 194846, 268316, 216874, -125037, 125546, 27673, 75728, 211416, 61291, 131296, 163604, 48661, -50056, -219548, 113215, -162963, 150307, -242173, -167116, -67750, -4443, -177995, -204272, 60748, -20477, 113180, -218940, 33371, 65188, -67443, 98671, 101683, -125942, -183555, -241410, -280991, -63168, -84419, -15097, -184840, -146922, -373787, -4337, -264247, -12623, -396097, 8324, 256734, -64678, 213799, -182764, 177341, -82982, 144945, 257524, -240337, -61069, 153702, 420526, -193666, -156111, 72536, -451980, 227213, 49031, -97160, -10877, 53022, 226679, 9172, -59327, -21424, 269822, 231648, -164172, -253984, 163124, 185094, -189079, -234375, 34410, -180287, -19268, 73732, -38839, 532587, 27572, -129335, -148987]
11917a48987A44441d3959D6773J6067K906m713A9981K20571r6951j5707c14203
11905G3976K14149E5507a83613F455R473a16348B71647P8409l6060a59974O7008
11894i2966B27283c3581A7749J10459c28742A52907d66340A80249a10274A50820
11883A94587M273c40451A31687a71195M814E1016K41636e5269H53g713F534K216
11871H750d0258B3181b9697j72010g6329b6223l40774l4067a58162O6844n9089
11860a50407N8430A04096e56282g9653I6637d26556C82887d1284l38676a50621
11849a69760j483a0601j36359A11575J4309a40870N4795p5838O1670d7447o7853
11838a15300H2242a03693q9603A68395F0822J05405f0195J2031j77823e2641a6012
$$ y = [-148987, 144441, -43959, 46773, 62840, 65746, 61033, 19981, 240552, 143601, 127894, -314203, 73976, 288125, 55507, -183613, 6455, 15928, -116348, 271647, 350056, 313996, -159974, -92966, 227283, -33581, 17749, 128208, -328742, 152907, -466340, 180249, -110274, 150820, 194587, 198860, -340451, 131687, -171195, -166381, 51016, 292652, -55269, 853, -7713, 6534, 8750, -40258, 23181, -29697, -201707, -76329, -26223, -366997, -401064, -158162, -91318, -150407, -91977, 104096, -556282, -79653, 96637, -426556, 382887, -41284, -379960, -150621, -169760, -171243, -10601, -146960, 111575, 125884, -140870, -86075, -161913, -100243, -47447, -115300, 82242, -103693, -193296, 168395, 60822, 166227, -60195, -48164, -225987, -52641, -16012]
11826a3655p5033p9683A24919a6007B35778I5363c86776A61410p0768D4325c99812
11814a13446m30035a30834M8083j00590r330C59747j63547M5764p092M6049h3572
11802F8455J8409B2789c24408O7517h840l5907k49194A56415l0967g8639E5348
11790b38057R8424k3391B32232C0356b69280D7735b38715h3377B03501J463a20121
11778b53387D0361Q5853c3638r161j91849e5953A4666R8032J2311a66454g3285
11766a07110I7756b57129b4029B363N4048J5538B5217L1773J58384C3294a76140
11754A07622l415b3605D9120K34203a5145m0779A68276a28528D9840M19216d5390
11742a08657b2997p9718A47296G1822M2864k010a86450a7722l57673A72203J9137
$$ y = [-13655, -88688, -168371, 124919, -16007, 235778, 95363, -386776, 161410, 90642, 44325, -399812, -113446, -543481, -130834, -82751, -183341, -192671, 359747, 196200, 241964, 234872, 280921, -83572, 68455, 86864, 22789, -324408, -256891, -8840, -44747, -293941, 156415, 125448, -78639, 55348, -238057, -139633, -163024, 232232, 30356, -269280, 47735, -238715, -83377, 203501, 204964, -120121, -253387, 40361, 126214, -33638, -42799, -234648, -55953, 14666, 112698, 125009, -166454, -73285, -107110, 97756, -257129, -24029, 2363, 56411, 71949, 25217, 56990, 215374, 33294, -176140, 107622, 104207, -23605, 49120, 283323, -15145, -55924, 168276, -128528, 49840, 469056, -45390, -108657, -22997, -102715, 147296, 71822, 114686, 112676, -186450, -17722, -375395, 172203, 191340]
11731A91340A0488O7414g9316M723j45240P2203E1466J33581a41082H3682D366
11719e6001C31361A61949h5919j57603H6533A5480c1365k90996C6339i0342k52020
11708c42362O9461B2146D553J74152J22977D6158j7835K19283G6255J03865a19757
11696A76024a58494A82526p9039J2513a31886A10326k6540j8249J19901C8892
11685g0722A06309J51755a77907P2949A16271E1804K3536j9677A6803b19271N7835
11674a61436A79775l0778J6246o3773c65694A44620g9000l7596a1700p8797k4482
11663a14979C8932Q378b35493H3057c1185C52216b82820h5563D2060J22952b24161
11651A46302g0136J7465A43977F124J19507l1363A0733a69614K4971N348A71774
$$ y = [191340, 10488, 77902, -79316, -74593, -219833, -147630, 51466, 185047, -141082, 83682, 4366, -56001, 331361, 161949, -85919, -243522, 86533, 15480, -31365, -322361, 36339, -90342, -342362, -272901, 22146, 4553, 178705, 301682, 46158, 28323, 247606, 76255, 180120, -119757, 176024, -158494, 182526, 103487, 116000, -131886, 110326, 83786, 65537, 185438, 38892, -70722, 106309, 258064, -177907, -104958, 116271, 51804, 75340, 55663, 16803, -219271, -161436, 179775, 148997, 165243, 101470, -365694, 144620, -79000, -116596, -11700, -90497, -114979, 38932, 47310, -235493, 83057, -31185, 352216, -282820, -85563, 42060, 165012, -224161, 146302, -70136, -52671, 143977, 6124, 125631, 94268, 10733, -169614, -144643, -139295, 171774]
11639a07083m3138M7310C16786q497A38652c0293j51952j0092A40321k4845a5259
11627D5106i2316F8129g5640l8852A85248J8463g7772k5116B77439j10891L0730
11616A97278C5959K19341e5901F5084J63447C931b43825P9176G2524c10286f4325
11604h6306G0151h4642n5217G0501a57944I4557G068f7249A83416a43573F6149
11592b02453G6358K2244Q8693a60813k93058A94937A3077J92851B3680P3823J20656
11581B18159l5896E1415b0294m8271C03306H0785b4676q7128l9742a7181o3920
11570h1101o917D00460j84249L22685B18325J46648G0326L6412i1033A83354M0143
11559B23497J7455m5845F2788Q4302L9502n7720h8313n1129G6593a6790D0470
$$ y = [-107083, -150221, -102911, 316786, 308289, 138652, -30293, -182245, -192337, 140321, 115476, -15259, 45106, -92316, 68129, -75640, -114492, 185248, 203711, -77772, -102888, 277439, 166548, 197278, 35959, 255300, -55901, 65084, 228531, 3931, -243825, -164649, 72524, -310286, -64325, -86306, 70151, -84642, -139859, 70501, -157944, 94557, 7068, -67249, 183416, -143573, 66149, -202453, 76358, 98602, 187295, -160813, -453871, 194937, 13077, 205928, 23680, 97503, 218159, 182263, 51415, -20294, -68565, 303306, 80785, -24676, -111804, -151546, -17181, -81101, -88018, 400460, 216211, 538896, 218325, 364973, 70326, 106738, -91033, 183354, 223497, 240952, 195107, 62788, 147090, 186592, 128872, -88313, -139442, 76593, -16790, 40470]
11547B71948A121K17243a26963A80870J69957j12202l4093K01537f8205F63541
11536C49024d51480B61627a40852A72003a87315l6372f9800D89071j92212i8478
11525A14635a20308a8496j96907B71807J4626i217m30258A03621O733J34095K3595
11514B68044G6242i5363A90994G276J55259J04706A28876B6224e9295C8085K6627
11503F4712C832J65767J12571D7914J48826j4373a63944o578O9384F3344O4534
11492A27878j3293L70374A93672C6419K32864b20962M7792b6549k3167A2435K42055
11481B54490I6967K87520b03218A72510R0398m4277b23230D35940A30769E9383
11470c1660B80666k6215k1808f2286A71816H1603a58540I2639J82494k1802B8546
$$ y = [271948, 1121, 218364, -126963, 180870, 350827, 238625, 204532, 406069, -68205, 663541, 349024, -451480, 261627, -140852, 172003, -187315, -223687, -69800, 489071, 296859, -98478, 114635, -120308, -18496, -215403, 271807, 286433, -9217, -439475, 103621, 110354, 244449, 268044, 76242, -95363, 190994, 7276, 162535, 267241, 128876, 26224, -59295, 38085, 64712, 3832, 169599, 282170, 47914, 196740, 182367, -163944, -170522, -101138, 63344, 127878, 114585, 484959, 193672, 36419, 269283, -220962, -173170, -26549, -49716, 12435, 254490, 96967, 384487, -203218, 172510, 262908, 218631, -223230, 435940, 130769, 59383, -31660, 280666, 254451, 232643, -62286, 171816, 81603, -158540, 92639, 275133, 253331, 28546]
11458a76393A90249f8622k30393D4676h759D0435L72021H8191K43405b61528R7244
11447a64284F4620L11729b08860Q4703C15265H1769Q548a56953N4594A89493a6335
11435B99923a38173b3908A18904n64c97136A54300o9383Q8393J83132f3910I5717
11423C66467E1654e0139n7952E4140c83715C1052c7689B86386a12132n6268n8782
11412b27182A95913b30323E6886c0216j20638j06823A92533a67090C8502a73751
11401A39777J30164h3705A2536J52599k4760l3719N5856E0713R9669f5638j2122
11390g7760j23003B6996K39289c9571D8593E665J0184a46570l00322D8566Q6911
11379A35477J33179b9578C37475F0187b04385j9964B99263C9005N9754J13157
$$ y = [-176393, 190249, -68622, -299015, 44676, -8759, 40435, 412456, 88191, 331596, -261528, -164284, 64620, 376349, -208860, -124157, 315265, 81769, 90317, -156953, -102359, 189493, -16335, 299923, -138173, -23908, 118904, 118340, -397136, 154300, 84917, 173310, 356442, -63910, 95717, 366467, 51654, -50139, -108091, 54140, -383715, 31052, -37689, 286386, -112132, -168400, -227182, 195913, -230323, 56886, -30216, -150854, -257677, 192533, -167090, 38502, -173751, 139777, 269941, -83705, 12536, 165135, 140375, 106656, 162512, 50713, 150382, -65638, -77760, -200763, 26996, 266285, -39571, 48593, 5665, 15849, -146570, -446892, 48566, 135477, 268656, -29578, 337475, 60187, -204385, -224349, 299263, 39005, 98759, 211916]
11369B11916i0919C2797i4715L5868n5529j68697h8866a7460E3403b0116m88937
11358e09053J95659B11696h3470J4403k29686g5164E0011d5008J790m97321a90678
11346H8230c64029G5747a40005j30232B2369g494l19556A03196b68896J16731
11336a52165c0114o4689q8208Q4011E0328K8502K06775J01189B9481D014J13641
11325A17655a48078d3480j7322k20411A92111E0055J75819a261A93388E9586d01823
11313G4129C1776i8318i492m411k50511g5936N173c0265B63645i7144q771I560
11300g2501k67126a40453o1293g414j81655F429J18965c8851p751j34931g5704
11288g9408c7020r348A6649e0371G0389j2540O8071a53426A06810k255N5869e7692
$$ y = [211916, -90919, 32797, -94715, -58847, -114376, -283073, -88866, -17460, 53403, -20116, -509053, -313394, 211696, -83470, -69067, -298753, -75164, 50011, -45008, -43218, -540539, -190678, 88230, -364029, 75747, -140005, -270237, 22369, -7494, -327050, 103196, -268896, -152165, -30114, -94803, -183011, -99000, 50328, 78830, 285605, 386794, 29481, 4014, 117655, -148078, -43480, -60802, -281213, 192111, 50055, 225874, -1261, 193388, 59586, -401823, 74129, 31776, -98318, -9492, -13903, -264414, -75936, -70763, -30265, 263645, -97144, -105915, 9560, -72501, -339627, -140453, -201746, -7414, -189069, 6429, 125394, -38851, -46602, -181533, -75704, -79408, -37020, -46368, 16649, -50371, 70389, 57849, 125920, -153426, 106810, 104555, 160424, -57692]
11275a8044g243r6168q8488j43879A55184a69501A60742D3712J29622b58662B84255
11263A54021b036C18708h2147C0900j1620P092c37l81085i2093m9308j08126J01660
11251a47867d6136p2944f053F182P5732i2951A4413i5095C684L35529d3348j67613
11239b10961F3465a21185c4555D9981b02240A98266a35299D1932f6468A75959
11228b56281A87780a69553o2950c6309j62954m1672R1805F2849a67343h892C77383
11216e4107G2555h8481q0593P6758P787A76480b81540F2137J4450J221K00711
11205B78519g8309A2873c72842C3471h4275c9397l12022a38966M0298E2054b33055
11193F2839c87367h7855L8617A19905j1319M6303b42163d9089j82189a01801d9496
$$ y = [-18044, -7243, -103411, -191899, -335778, 155184, -169501, 160742, 43712, 173334, -258662, 284255, 154021, -2036, 318708, -82147, 30900, 19280, 26372, -337, -381422, -92093, -141401, -249527, -147867, -46136, -119080, -6053, 6182, 81914, -92951, 14413, -95095, 3684, 339213, -43348, -210961, 63465, -121185, -34555, 49981, -202240, 198266, -135299, 41932, -66468, 175959, -256281, 187780, -169553, -232503, -36309, -199263, -240935, -149130, 62849, -167343, -8892, 377383, -54107, 72555, -88481, -169074, -92316, -84529, 176480, -281540, 62137, 76587, 77808, 278519, -78309, 12873, -372842, 33471, -84275, -39397, -351419, -138966, -98668, 52054, -233055, 62839, -387367, -87855, -49238, 119905, 108586, 154889, -242163, -49089, -231278, -101801, -49496]
11181c04847i8460G8842a34878L2102J8825C532a83959k17638B69346a16685L5894
11170h0791a1500B54117F0318b07501A47983a02027j81998N3830A10395b6359
11159a1291k13761A40365O7754a35154f5877q9381f2352e403H9451C9546A4971
11147A95384C3732c8110H7483a83203M253C1717K9801c106r077k78478B88097
11135b25293f288p4265I8161a63546a1241H2610f0319K9680n5280J3104B04442
11123g9805D3986a31385j6343M5948A17303C8290L34346A44793a07577E3199g7246
11111C4954b41490D6503i0825A51387p1362B7717R2191L7485f3450B7163k958
11100B4205J08335B4265b76186G1922B1789J96037K02864A68559a3474A01441
$$ y = [-304847, -98460, 78842, -134878, -102776, -83951, 3532, -183959, -401597, 269346, -116685, -80791, -11500, 254117, 60318, -207501, 147983, -102027, -284025, -230195, 110395, -26359, -11291, -225052, 140365, 208119, -135154, -65877, -155258, -62352, -5403, 89451, 39546, 14971, 195384, 33732, -38110, 87483, -183203, -178950, 31717, 61518, -3106, -12183, -290661, 288097, -225293, -6288, -80553, 98161, -163546, -11241, 82610, -60319, -30639, -85919, -72815, 204442, -79805, 43986, -131385, -147728, -101780, 117303, 38290, 372636, 144793, -107577, 53199, -77246, 34954, -241490, 46503, -90825, 151387, 80025, 27717, 119908, 157393, -63450, 27163, 24205, 132540, 24265, -276186, 71922, 21789, 217826, 420690, 168559, -13474, 101441]
11089A66063k5829N320e987D01381A38472L33306D9097k3504P2022B5432N08075
11078E33507I8108D3356J5249J83600J55684j34989j04557M67197k11025A46755
11067A95132K38335j8505Q3320A93588J32136A4823L94624b49492D78440j10742
11057C67698J25733q318j75588M0145P6714J22261B14733L47781L62989j69121
11047G56382k73952L04471J11796k48006R6128J48340n8792r2702O6081p6217
11037G33529J3376P4168k1089k2284l8448j38211j91665N20868j51640j78476
11027F00128J37008K98571C63734K39604Q8005K34156k91059J52204j54714k19462
11017D12468J39602j23939K30905k1814J92633k91106K31996C37214L39794r8359
$$ y = [166063, 140234, 145554, -5987, 401381, 138472, 471778, 49097, 25593, 97615, 25432, 533507, 98108, 43356, 58605, 242205, 397889, 262900, 158343, 625540, 414515, 146755, 195132, 433467, 414962, 498282, 193588, 325724, 14823, 409447, -249492, 478440, 367698, 493431, 485113, 309525, 349670, 426384, 548645, 214733, 562514, 925503, 756382, 482430, 786901, 898697, 650691, 746819, 895159, 836367, 743665, 809746, 733529, 746905, 821073, 799984, 777700, 739252, 601041, 409376, 930244, 778604, 600128, 737136, 1035707, 363734, 603338, 691343, 925499, 634440, 786644, 631930, 412468, 552070, 428131, 659036, 637222, 829855, 538749, 770745, 337214, 677008, 578649]
11007E78649J96633p7308p6772L18017l35274j54819O2501j4888j7542J45479
10997F24676J03187J0966k14559J0984l1886J38128J37692l77876L66803l57164
10987D10951j7131L63519J13091n1112j81197M48111k99481O48484m20794n883
10977A008558K04964J17972j16620j1529N00576q8448K29796K43799L41039J84338
10967B614445K0264j88289k9795J97103k70505q6093q4922j89989k9514k12759
10957A739946J46384P9920j93588M41670J7723j67530o1295l51907q9606j39451
10947A422266n0121F62953L69336l40574k9016k23117J23806l4958A81047J4885
10937A95932J83470m7548a21894J5828a609C00472i3893E5605h8217G1391b9923
$$ y = [578649, 775282, 697974, 621202, 939219, 603945, 449126, 511627, 496739, 479197, 624676, 727863, 738829, 524270, 535254, 503368, 641496, 779188, 401312, 768115, 410951, 393820, 757339, 870430, 819318, 638121, 1086232, 786751, 1435235, 1014441, 1008558, 1213522, 1331494, 1214874, 1203345, 1703921, 1615473, 1845269, 2089068, 2430107, 2614445, 2634709, 2446420, 2416625, 2613728, 2343223, 2257130, 2172208, 1982219, 1952705, 1739946, 1886330, 1966250, 1772662, 2214332, 2232055, 2064525, 2003230, 1651323, 1561717, 1422266, 1372145, 662953, 1032289, 691715, 662699, 439582, 563388, 528430, 181047, 195932, 379402, 331854, -121894, -106066, -1609, 300472, -93893, 55605, -88217, 71391, -29923]
10925A69059c11370B86618j19186b80087I0657b0377B41934A16720a77830Q5626
10915i2204E8203c02354p504L7293I906J50767q0195l0690K90943j31678k4382
10904A84671N0442E7579d5827E055J66518b94436c2472C1078N8119h3499o4939
10893a48438a9310j52482P0246B63826J85274f6151B24749B2737i284F8988Q7790
10882A56778H32a11863l2421A62496n8983b7806B9731e30822a55234G7898J38503
10871B16401K3012D3168a72730k13577M8947E6824A9472J00959f9723H2849K53583
10860C36432A33220J13807J4534A22263a77172N0828E2667J28990a04207L57I0877
10848A1230c95k16748g8363k00058A62786B6193a7488A32385a42013j3788g4876
$$ y = [169059, -311370, 286618, 167432, -280087, 90657, -20377, 241934, 116720, -177830, -92204, 58203, -302354, -309858, -272565, 9906, 160673, 80478, 49788, 340731, 209053, 184671, 235113, 57579, -45827, 5055, 171573, -294436, -32472, 31078, 89197, -83499, -148438, -19310, -171792, -101546, 263826, 449100, -66151, 224749, 22737, -9284, 68988, 156778, 832, -111863, -144284, 162496, 103513, -27806, 29731, -530822, -155234, 77898, 216401, 239413, 43168, -172730, -386307, -337360, 56824, 19472, 120431, -69723, 82849, 336432, 133220, 247027, 261561, 122263, -177172, -126344, 52667, 181657, -104207, -103850, 90877, 11230, -395, -217143, -78363, -278421, 162786, 26193, -17488, 132385, -142013, -155801, -74876]
10836b95176D8688j0846q532a66746f2185A20217J43151a34460O3005k35705J18373
10825a88787C585i9015A16558k4376J1560A2688a82775K7497c4444j21538F5158
10813E9455a43121l1848A21298H253K6033R273R8918C4658J01193a58191d1220
10801a1736k66615H5403f2108j4904n7842j40836H777R0761J03453b03368M3287
10790a60081K155c1439A43818c15673A65030o2648b08860B0055a78660F6532f2480
10778a83995L6066m3839l0161A71278b66252A1363e2603L672A63070p9894K0747
10767A03923K4373m8716c10483d7984p1080K5172I8758a27326A46634E8270a43110
10755g7107k65863a36719A187c92926a07481a332A04446M1897J14046b32174j26803
$$ y = [-295176, 48688, 37842, 29310, -166746, -62185, 120217, 263368, -134460, -71455, -307160, -188787, 3585, -99015, 116558, 92182, 103742, 12688, -182775, -155278, -34444, -155982, 65158, 59455, -143121, -174969, 121298, 8253, 34286, 43559, 142477, 34658, 135851, -158191, -41220, -11736, -278351, 85403, -62108, -77012, -134854, -275690, 8777, 99538, 202991, -203368, -160081, -157926, -31439, 143818, -315673, 165030, 102382, -208860, 20055, -178660, 66532, -62480, -183995, -147929, -191768, -221929, 171278, -266252, 11363, -52603, -48931, 163070, 83176, 103923, 128296, 79580, -310483, -47984, -119064, -93892, 98758, -127326, 146634, 58270, -143110, -77107, -342970, -136719, 1187, -392926, -107481, -1332, 104446, 146343, 260389, -232174, -358977]
10744c58977B35331c7272k86573a02927A16888B9298b012A34218a02297r15M2336
10733f0876F9030J63424d2627B83055b51937F572f2249j13578A20877c60701a38867
10721h0350j94755N3366M361b7383A58312l5736K11201c43730a59273d7919B9427
10709I381d50130a69963A5127g4031A28026E2587a36579k0804A22890b8595G7276
10697h1409d047j64555B41201i8217d5727j1876A05255E638e79171f7081j74727
10686b41808G6718a2581k57090i0553L9468k88179g1681j45192M4616F8554a67377
10674a82207f3726B07178C9051P1740J3119a25347A11331d3565j10414J6968k64901
10663d01912D8391b95851H3517j3900e7581A0453M8304O7020g3752K5637h151
$$ y = [-358977, 235331, -37272, -323845, -102927, 116888, 29298, -2012, 134218, -102297, -103212, -60876, 69030, 232454, -42627, 283055, -251937, 6572, -62249, -175827, 120877, -360701, -138867, -80350, -275105, -221739, -217378, -27383, 158312, 122576, 333777, -343730, -159273, -47919, 29427, 9381, -450130, -169963, 15127, -74031, 128026, 52587, -136579, -157383, 122890, -28595, 77276, -81409, -4047, -168602, 241201, -98217, -45727, -57603, 105255, 5638, -579171, -67081, -241808, 76718, -12581, -269671, -90553, -51085, -339264, -71681, -216873, -172257, 68554, -167377, -182207, -63726, 207178, 39051, 110791, 123910, -125347, 111331, -43565, -153979, -137011, -401912, 48391, -295851, 83517, 69617, -57581, 10453, 58757, 125777, -73752, -48115, -8151]
10651c21371d8161p1194A2515b53000C5142f7717A42268A0205a05326C8171b0477
10639A46522d93354e6597j09854j31865i7004E0422b08681b3699j94457b6781
10628A67026a41274k3310k61941a69978g2061j96245A77782C8154f3436k60702
10618c24138a51594A77633a24555j56225l2829P0190A76207a19490A05185f7402
10607D0556i6978a1881A21247D9930b02889J9046D8914I840a19838C0824J11921
10596A42745c7111j23950a3085k28501C0019c70295J62262j07058B13234D1890
10585C60870a92713O4362D2057b01604l138q2571a18807N8607k53381A8528d3626
10573A40109J04868a01405A47428a76017f8811C09629c06077A31989b02449C8194
$$ y = [-321371, -48161, -119355, 12515, -253000, 35142, -67717, 142268, 10205, -105326, 38171, -20477, 146522, -493354, -56597, -166451, -298316, -97004, 50422, -208681, -23699, -218156, -26781, 167026, -141274, -164584, -426525, -169978, -72061, -268306, 177782, 38154, -63436, -324138, -151594, 177633, -124555, -280780, -313609, -243419, 176207, -119490, 105185, -67402, 40556, -96978, -11881, 121247, 49930, -202889, -183843, 48914, 9840, -119838, 30824, 142745, -37111, -161061, -13085, -241586, 30019, -370295, -208033, -315091, 213234, 41890, 360870, -192713, -128351, 42057, -201604, -204742, -287313, -118807, -60200, -313581, 18528, -43626, 140109, 244977, -101405, 147428, -176017, -68811, 309629, -306077, 131989, -202449, 38194]
10562G553a6453j05903L0502J9395j96123a4033B74167c74543A21788i2357Q636
10551h3721l7143d7297b3135C64454J38390G234a55795E1626d8314B4449a20121
10539B03979f9383j17207l1226a9954F9925O3442J84121a53299A19460a94068
10528A50891b66003H2520i031j8270j77468G8848c3833D0608c3466j32744O979
10517a59231A48388D2770c3982j15333e7346B01474M912F3276a03028A52245a55534
10505f4768B84182A10893a06678M6139G9153a77318e3616j72302c1463j04129
10495a35592M3368m8234m249A28053C1673c4280k32809I0145e3705j7307B08183
10483A73571H0933B19R8981l6656A2431J12745g7150D31213A0795M13485j33513
$$ y = [7553, -16453, -122356, -91854, -72459, -268582, -14033, 274167, -374543, 121788, -92357, -83721, -120864, -47297, -23135, 364454, 502844, 7234, -155795, 51626, -48314, 24449, -120121, 203979, -69383, -186590, -217816, -19954, 69925, 133367, 317488, -153299, 119460, -194068, 150891, -266003, 82520, -9031, -27301, -204769, 78848, -33833, 40608, -33466, -166210, -159231, 148388, 42770, -33982, -149315, -57346, 201474, 206386, 63276, -103028, 152245, -155534, -64768, 284182, 110893, -106678, -60539, 79153, -177318, -53616, -225918, -31463, -135592, -92224, -140458, -144707, 128053, 31673, -34280, -267089, 90145, -53705, -71012, 208183, 173571, 80933, 219, 99200, 62544, 12431, 125176, -77150, 431213, 10795, 424280, 290767]
10472B90767K10780a27296D83624h6772B51158J66527A74794G5283K7743M9985
10462A53011a32000d7865E8171J6179k2592a80142o4499l5350G0631b2551l6487
10451e9038j36476a3433B38668i8093K7542e520j9197A87117N1742m3218A1579
10439d22923A34758g3192l73643e9553j64942A17692a04252b8216k56922B86834
10428B27446a28448A12509d2959r1669H124b19339R524A12230k4756h4578D3508
10416a13513D661e9237l7323B772K1841J4119e602j05803j45574Q2869H100b68888
10403a76569N6966l021B78415b41354B56224g2674q2407A25519E077e2059O25
10392e1434A34944a23990B00080R3630M766M0441i4880j05221j03544f6258A96931
$$ y = [290767, 501547, -127296, 483624, -86772, 251158, 417685, 174794, 75283, 103026, 153011, -132000, -47865, 58171, 74350, 51758, -180142, -244641, -279991, 70631, -22551, -59038, -195514, -13433, 238668, -98093, -70551, -5520, -24717, 187117, 238859, 195641, 11579, -422923, 134758, -73192, -446835, -59553, -224495, 117692, -104252, -28216, -285138, 286834, 227446, -128448, 112509, -42959, -134628, 8124, -219339, -209815, 112230, 87474, -84578, 43508, -113513, 4661, -59237, -96560, 2772, 24613, 38732, -5602, -111405, -256979, -174110, 8100, -268888, -176569, -119603, -122624, 278415, -241354, 256224, -72674, -155081, 125519, 5077, -52059, -51434, 134944, -123990, 200080, 293710, 298476, 338917, -94880, -200101, -303645, -66258, 196931]
10380B2532J74564b7938j03848H8684a03249B26879l9696K9408C2055K46898j18345
10369A60608J66949A18200R8226J71674J27061C2852L89174j8428l3504A60688
10358C64404E7469Q3397M5307K1813a45575B49159P6306b15907L9735B05035g9740
10346E83188k86449L13187j09087k18794k8468q3623k091D039L11103q4857K4283
10335B54568J2521K03806A9461J88231J4779A3546K21012N8527i5972l2950k0779
10324a49701j26063B08158F8497j5404J38994C3522f0476B4736b03733C97514
10313A0458M64557j81961a7585B8164K16296b4997E2842b23644a00968F5922j3866
10302E2056h3242B69030d2750k5896A48492o0403D1086a9880I2622a75898l1179
$$ y = [22532, 197096, -27938, -131786, 88684, -103249, 226879, 187183, 216591, 32055, 278953, 160608, 327557, 118200, 216426, 388100, 515161, 32852, 422026, 403598, 370094, 160688, 364404, 57469, 140866, 186173, 207986, -145575, 249159, 325465, -215907, -176172, 205035, -79740, 583188, 296739, 609926, 500839, 282045, 253577, 169954, 167863, 4039, 315142, 230285, 254568, 267089, 470895, 19461, 207692, 222471, 13546, 234558, 293085, -95972, -128922, -149701, -275764, 208158, 68497, 53093, 192087, 33522, -60476, 24736, -203733, 397514, 10458, 475015, 293054, -17585, 28164, 244460, -24997, 52842, -223644, -100968, 65922, 52056, -83242, 269030, -42750, -68646, 148492, 88089, 41086, -19880, 92622, -175898, -207077]
10291b07077a272C13167c65482J50021P5974l0668A17153a72319H4000e9185A58909
10279B42342b22625c8653C0675R9989C9797b79249A90229a65426P5955n7765C2567
10267b89021B32541a10082A36087d3145n9945k32611J4388d3099B50104p1504
10257A78600j7067a97930G1450L48203Q2649k12173J81696k01006J21662j3799
10247C78682d3233m6081A90260p0708e2177k83835a071j3667o0068B06826B2020
10235f3532l10674A53041L5795b34738G1953b05039l2836Q1530m13I353c46512
10223f9117l7729H7185c90197J35678B4972b9062m0307L3738H1006b8930j83648
10212b12578k0277H3999a75812a1798n2044A48517N6900A0221K38471j23613c36283
$$ y = [-207077, -1272, 313167, -365482, -215461, -139487, -170155, 117153, -172319, 84000, -59185, 158909, 242342, -222625, -38653, 30675, 130664, 39797, -279249, 190229, -165426, -89471, -147236, 32567, -289021, 232541, -110082, 136087, -43145, -103090, -335701, -321313, -43099, 250104, 178600, 161533, -197930, 71450, 419653, 502302, 290129, 471825, 270819, 392481, 378682, -43233, -89314, 190260, 119552, -52177, -336012, -1071, -14738, -74806, 206826, 22020, -63532, -374206, 153041, 188836, -234738, 71953, -205039, -237875, -156345, -156758, 9353, -346512, -69117, -106846, 87185, -390197, -254519, 24972, -29062, -69369, -35631, 81006, -28930, -212578, -232855, 83999, -175812, -11798, -63842, 148517, 205417, 10221, 248692, 125079, -336283]
10200D7843a74094G0632b53894l1178E2815R6539f4931o8080B02597D1248b72548
10188B29840i0921A55602c35875P2820j49011D7223h890j07141j27276J03616
10178a39691n5791l66606A07358K23625B5825c6090A46063L74902a40227B40461
10167B7836J75816a8240l9273j18811j77709f8091r4369G2486f5998l02976a7283
10155a82730f8423B29881p2686a17103E0948d10007a17561A74323H3238c59531
10144A55636d4588F2396b13199J6648J7729H6900J3320f9153o0576k5582l65897
10133e21208c8065G78R8428C0402J1785c41123a24192A5120a46619B59986D0937
10121H0988h1855j25517F5296i6576o8649K2163d3473j4931B2708H637K3261P4798
$$ y = [47843, -174094, 70632, -253894, -285072, 52815, 149354, -64931, -133011, 202597, 41248, -272548, 229840, -90921, 155602, -335875, -263055, -412066, 47223, -8890, -116031, -243307, -139691, -195482, -562088, 107358, 330983, 25825, -36090, 146063, 520965, -140227, 240461, 27836, 203652, -18240, -57513, -176324, -354033, -68091, -162460, 72486, -65998, -368974, -17283, -182730, -68423, 229881, 157195, -117103, 50948, -410007, -117561, 174323, 83238, -359531, 155636, -44588, 62396, -213199, -196551, -178822, 86900, 100220, -69153, -129729, -155311, -521208, -38065, 778, 99206, 30402, 42187, -341123, -124192, 15120, -146619, 259986, 40937, 80988, -81855, -207372, 65296, -96576, -165225, -143062, -43473, -58404, 22708, 8637, 31898, 106696]
10109A06696N0460n0757a84859j52902A88280G876K31420i6683k74000h7438F0757
10097b06973D1219J0156a89214p263o946r1542C3510g4920A08550a49176e3488
10085B0816c03124a19918A12021e5430E569e125A38934d13390a0363d446j1000
10074a5446C9638i5949H0569B8312a18347j64812A12532h9359A10987a93180A78701
10062A97060c74749a15457a1152j26626E7274a98122j11177G8098l1652d54483
10051a01794K6058j06251A74481d208a151m8290D4777b30295J02405A44496c69027
10039B69700A7711J42221b7117A5054h7060B18132i1432K170k66283d3256j18329
10028a61585A02061a79453B84925c188A24378a7051A40426D7590b70489k083m8412
$$ y = [106696, 157156, 106399, -184859, -337761, 188280, 7876, 239296, -96683, -370683, -87438, 60757, -206973, 41219, 51375, -189214, -196477, -203423, -294965, 33510, -74920, 108550, -149176, -53488, 20816, -303124, -119918, 112021, -55430, 5569, -5125, 138934, -413390, -10363, -4446, -15446, 39638, -95949, 80569, 28312, -118347, -283159, 112532, -89359, 110987, -193180, 178701, 197060, -374749, -115457, -11152, -137778, 57274, -198122, -309299, 78098, 46446, -454483, -101794, -75736, -181987, 174481, -4208, -1151, -49441, 44777, -230295, -127890, 144496, -369027, 269700, 17711, 159932, -27117, 15054, -87060, 218132, -91432, -89262, -355545, -43256, -161585, 102061, -179453, 284925, -3188, 124378, -17051, 140426, 47590, -270489, -272572, -320984]
10017c20984c6633j14532N8015K6363j18458p7741k89538h2298K6003A74454b15587
10005C10876C667J0320m251a57733j98170A25632c26314B32833D5108c88801B00422
9993a12851k05609A99180c63515R3620B73921a62493j09614A1967a67487C3523
9982e9190A54418o1318h6697D54510c1646p951j38596O0402L1645A11844a24964
9970A51846h4652j99551O3401E1579c76382A28928a76336B580a79763F3266c2040
9958A93320b24589A34818h7786A0392d2140r1076A0768J05624l3230c84177a35897
9946D1392d8874B21086a01688j30130B970i0299B65559D0671J6921c37603A04963
9934a54185k43195J34652P6733k00813a41393O5194q9873j86296F7480b8219E7376
$$ y = [-320984, -36633, -151165, -93150, -66787, -185245, -262986, -552524, -82298, -56295, 174454, -215587, 310876, 3667, 13987, 9736, -157733, -355903, 125632, -326314, 232833, 45108, -388801, 200422, -112851, -318460, 199180, -363515, -269895, 273921, -162493, -272107, 11967, -167487, 33523, -59190, 154418, 93100, -86697, 454510, -31646, -39597, -178193, -117791, -86146, 111844, -124964, 151846, -84652, -284203, -220802, 51579, -376382, 128928, -176336, 2580, -179763, 63266, -32040, 193320, -224589, 134818, -87786, 10392, -42140, -133216, 10768, 116392, 83162, -384177, -135897, 41392, -48874, 221086, -101688, -231818, 2970, -90299, 265559, 40671, 57592, -337603, 104963, -154185, -397380, -262728, -185995, -386808, -141393, -76199, -166072, -352368, 67480, -28219, 57376]
9922i4840L4953A29429j0660d7754m5238q3010H990b81617c3072D2313J0173B1818
9909e882j133r1635D8217J05139g4856A3905a22560K8616A82697Q2585d87667
9897d28479b8708l54692f7554j92222h8284B9536h7366A25263n6731N1549a22729
9885i5979F3150e96193A50981o4640c88q1196L049J1793j19289O1814r1341L5159
9873a80399n7940q4111N5556G7733b00566k6130j7470R9375e3147k82672J63018
9862a72801N7096D432a85388K2831J2619B78823d40250a60454P3972K6483A01522
9850A58466a16507k1954j45482A38285a62643M9463n7201n3971a6302l77577D11811
9838b55963k33326F8312e0186j33646e7343a5748A19762a71746k68238H0552b0431
$$ y = [-94840, -59887, 129429, 118769, -47754, -92992, -176002, 8990, -281617, -33072, 42313, 52486, 21818, -5882, -7015, -98650, 48217, 153356, -74856, 13905, -122560, -93944, 182697, 265282, -487667, -428479, -28708, -383400, -67554, -259776, -88284, 29536, -87366, 125263, 68532, 120081, -122729, -95979, 63150, -596193, 150981, 86341, -388, -81584, -78535, -66742, -186031, -124217, -215558, -180399, -238339, -322450, -266894, 77733, -200566, -226696, -244166, -144791, -53147, -335819, -172801, -115705, 4432, -185388, -162557, -149938, 278823, -440250, -160454, -86482, -59999, 101522, 158466, -116507, -138461, -283943, 138285, -162643, -113180, -170381, -224352, -16302, -393879, 411811, -255963, -489289, 68312, -50186, -183832, -57343, -15748, 119762, -171746, -439984, 80552, -20431]
9826E54517c7503D7600a22496j8527A87624g5194E9539c08730l1749A49494o1344
9815H8150C9897J34769j673A8234M5288C151a25419r8043a09213j9233a4004j61959
9803a75963p4808A37852a53830B3461a24782p2242i2271C7715a07235k3985e7813
9791d4236j51818l9790P2750J6335k8332a6365B59700a18693q4926h2569j61338
9780b43907A90681f9211C48987a09416E4693J90461a49216E8356a22940K2975
9770i9965k02537M9362C7138J4702J39019a80486c5896j36994l9354m5991R2523
9759a65712e7661j14638K8635A68710f321j0349l9547j4424A0371Q0008a12516
9747b44064J06274A03126K7254n7370c3762k14885e7338j693K4507F0619J08472
$$ y = [554517, -37503, 47600, -122496, -141023, 187624, -75194, 59539, -308730, -340479, 149494, 88150, 39897, 174666, 172993, 18234, 63522, 3151, -125419, -223462, -109213, -128446, -14004, -175963, -250771, 137852, -153830, 23461, -124782, -197024, -92271, 37715, -107235, -131220, -57813, -44236, -196054, -235844, -163094, -146759, -175091, -16365, 259700, -118693, -203619, -82569, -243907, 190681, -69211, 348987, -109416, 54693, 245154, -149216, 58356, -122940, -99965, -302502, -253140, 37138, 51840, 190859, -180486, -35896, -172890, -212244, -258235, -165712, -57661, -172299, -143664, 168710, -6321, -16670, -56217, -70641, 10371, 90379, -112516, -244064, -137790, 103126, 130380, 73010, -33762, -248647, -57338, -59031, -34524, 60619, 169091]
9736A69091g9855m1894k6704F9370N8718c72271B51383j21900E9976b19288R4499
9725a24789E6089a69583B51231b3648q6351j73551A35230g0527m3236l68537J11900
9714c70400d5075l6127L3233m23962A30242L7400A7503c10544L3451J33938j57072
9703c00227k3413M3616b7855F8318Q1021a925o5817A06464a35195B5013N9036
9692H4049R5006F3552g0112A3739b03057E2170c025J424A04116a34919c8963A8637
9679e8609g540j34107A24013e3923A41200A2528d18625I2697c35807J61611C6231
9667b88954C3778i7202L304E1428a91252f2255F9516O0293i0745J1694j77871
9656b56922A52663a84536j96623C09448b94820E6964K93379b19529K2356A9209
$$ y = [169091, -79855, -121749, -148453, 69370, 128088, -372271, 251383, 129483, 59976, -219288, -124789, 56089, -169583, 251231, -23648, -109999, -283550, 135230, -70527, -113763, -482300, -370400, -45075, -81202, -47969, -471931, 130242, 167642, 17503, -310544, -277093, -143155, -300227, -323640, -280024, -27855, 68318, 149339, -1925, -67742, 106464, -135195, 25013, 84049, 179055, 63552, -70112, 13739, -203057, 52170, -3025, -1601, 104116, -134919, -38963, 18637, -58609, -7540, -141647, 124013, -53923, 141200, 12528, -418625, 92697, -335807, -174196, 36231, -288954, 33778, -97202, -93898, 51428, -191252, -62255, 69516, 129809, -90745, -79051, -256922, 152663, -184536, -381159, 309448, -294820, 56964, 350343, -219529, -197173, 19209]
9645b16263E4782K8573i0475j01643j9557e5122a5870g902C6097a06750A20791
9633b8421n3210D3578c04090J35674k31885D3658J02741b81009b5895A8242a38745
9621b91560a7575G8354J55606J01946H5815b17866g7432b4064F1878g4127k14204
9610b88331a10349C21580e1457J9391I9988a00690c6247A51360D0471a97578H3201
9598f8394m7681m8871k36004i0319k17b3816q0948E7207P6121d8924m0056B83560
9585b66333a29672F9575e0480j38032F8615c27875a07579L0723H8000a43872m80706
9574f24578b02426a0151B20419g1808B22470a63704B7982e4204o6147k18370J62669
9563a76052A4329L0156P3264J5972a4365A97895c340j75466o7142C4296P4703
$$ y = [-216263, 54782, 83355, -90475, -192118, -211675, -55122, -15870, -7902, 36097, -106750, 120791, -28421, -81631, 43578, -304090, -168416, -400301, 43658, 146399, -281009, -25895, 18242, -138745, -291560, -17575, 78354, 233960, 335906, 85815, -217866, -77432, -24064, 61878, -74127, -288331, -110349, 321580, -51457, -32066, 99988, -100690, -36247, 151360, 40471, -197578, 83201, -68394, -116075, -164946, -400950, -90319, -90536, -23816, -104764, 57207, 133328, -48924, -88980, 283560, -266333, -129672, 69575, -50480, -188512, 68615, -327875, -107579, -76856, 88000, -143872, -624578, -202426, -10151, 220419, -71808, 222470, -163704, 27982, -54204, -120351, -338721, -176052, 14329, 44485, 117749, 133721, -14365, 197895, -3340, -178806, -245948, 34296, 108999]
9552A08999O9385a37785A98881d1683m8965B37488a23662F7289b06436J4493E3776
9540C01776i2344l56192A87259P5221c64891A15525k1247c1228q6274A31901a98200
9528b61511a14853J360k88864a09458L9983I207h5649l81758c6684Q947A43337
9516c37571E0237a32296A17000M1354b58821J13319L7158a7563k61234J28614
9506a50183j59170B6691O78R4480G39K03943a67674J6104H2395b45355o7785p5394
9494c88534i0754c7718C7291a06257o8340q7732o5194a5305k34065I5829N5609
9483A51438m0745b97278A16751a97842G8343J45447B4556O490c99165Q1020d0897
9471a26890p3559h8709j1309j4099e07k76497j49239n2457J33917B05886a70385
$$ y = [108999, 178384, -137785, 198881, -41683, -90648, 237488, -123662, 67289, -206436, -191943, 53776, 301776, -92344, -448536, 187259, 262480, -364891, 115525, 94278, -31228, -117502, 131901, -198200, -261511, -114853, -113493, -402357, -109458, -69475, 9207, -85649, -467407, -36684, -27737, 143337, -337571, 50237, -132296, 117000, 158354, -258821, -145502, -108344, -17563, -278797, -150183, -309353, 26691, 27369, 121849, 739, 204682, -167674, -151570, 82395, -245355, -313140, -388534, -90754, -37718, 37291, -106257, -174597, -262329, -327523, -15305, -249370, 95829, 151438, 110693, -297278, 116751, -197842, 78343, 223790, 24556, 31046, -399165, -318145, -40897, -126890, -200449, -88709, -100018, -114117, -507, -277004, -426243, -478700, -344783, 205886, -170385]
9459a96696h0921j49890C20527A23524i4245j243c9811E3100b24091h6249A38436
9447c20087J58031A26387j2471i0885k9081E5665a02206A3604b4504A39638g7367
9435a13076l05841a65464C7115a15160j55071J26997A1162a76433D7175E810J46313
9424A52123k4028A43b55318J01754c0775C09601E6907Q840J0745C1484N9452f5405
9411b8471A59644K168a17842M9841A47892o9756B0509a56109N3699A20330c32279
9399B0472d05439h9357A4354a62430B1703d07460i5595j16620f907A92918i8420
9387d01772a35865j14964Q4446M2369A01895B0828a95720l9080R8572D9145a55994
9375a63240k3624B6212b47740d9343C5282b00554f9058B82412a34533j00925m08442
$$ y = [-196696, -80921, -230811, 320527, 123524, -94245, -95488, -39811, 53100, -224091, -86249, 138436, -320087, -162056, 126387, 113916, -90885, -119966, 55665, -102206, 13604, -24504, 139638, -77367, -113076, -418917, -165464, 37115, -115160, -270231, -143234, 11162, -176433, 47175, 5810, 152123, 128095, 143, -255318, -153564, -30775, 309601, 56907, 65747, 76492, 31484, 90936, -65405, -28471, 159644, 161812, -117842, -68001, 147892, 78136, 20509, -156109, -102410, 120330, -332279, 20472, -405439, -89357, 14354, -162430, 21703, -407460, -95595, -212215, -6907, 192918, -98420, -401772, -135865, -250829, -166383, -124014, 101895, 20828, -195720, -234800, -136228, 49145, -155994, -163240, -186864, 26212, -247740, -49343, 35282, -200554, -69058, 282412, -134533, -235458, -643900]
9364f43900C3579h3832m1050Q14M3428A08562b35130A23795b53963n5024Q050
9353c00937J38216A99054a18048L8470A02393A5397L06834A001a77402A10915
9342B13334q2757g8008J5406l1206L3840e176j11146L9895A82866b238j94777
9331a97015A5283f89B50079i1665k12773J22882l2572N2016q0302J13425c2159
9319A27551c9921B34721b00108B82511b13182H8220K16024A0821d1826j44825
9309a86651N6815q0075A77616a02505M9543r8198c7715m7090D1424L3547F477
9297D8263a780m9070I9268a31408e0960A12057b24471B03662a75692P7948j2476
9286a10220G892i7739m0339B04408l6095D3121h7737H224b44067B09533c63994
$$ y = [-643900, 33579, -83832, -124882, -124068, -80640, 108562, -235130, 123795, -253963, -308987, -300937, -162721, 199054, -118048, -79578, 102393, 15397, 322231, 1001, -177402, 110915, 213334, 130577, -78008, -62602, -93808, -59968, -5176, -116322, -76427, 182866, -2238, -197015, 15283, -689, 250079, -91665, -304438, -181556, -214128, -162112, -242414, -128989, -32159, 127551, -39921, 234721, -200108, 282511, -213182, 88220, 304244, 10821, -41826, -186651, -129836, -209911, 177616, -102505, -52962, -151160, -37715, -84805, 41424, 74971, 6477, 48263, -1780, -50850, 99268, -131408, -50960, 112057, -224471, 203662, -175692, -97744, -110220, 7892, -97739, -138078, 204408, 168313, 43121, -87737, 8224, -244067, 209533, -363994]
9274a19851N9430C5985b21736O2980p5579k00344a05829K2712j470j47305Q145
9263b23747I2115E407c84073a01095J1663B57557a84998J3052k35769A44253g9168
9251e2927A58831a10482A3012b12061L0510e3850a9164I8494e52822b59007e8967
9239b65497A76938b45822E2596b20365K1326R980g1524j13344p1046A14614f3105
9227E4143i4501n4171j14445J16804A50099c98192a28117D27744c08859C1453
9216a86140M2941A15539D7761f0638m22484A85239H5446L7708a93278H1957c08162
9204c5518A09891a89958D3946J33855i7738A31915d41069O2256a15159J2973j84376
9193b86562a15397B98092r0073b5672j98789k3863I4371c32643j53762d6560F8446
$$ y = [-119851, -60421, 35985, -221736, -158756, -234335, -434679, -105829, -83117, -84587, -231892, -223747, 92115, 5407, -384073, -101095, -89432, 257557, -184998, -171946, -407715, 144253, -79168, -52927, 158831, -110482, 13012, -212061, -181551, -53850, -19164, 98494, -552822, -259007, -58967, -265497, 176938, -245822, 52596, -220365, -199039, -189059, -71524, -184868, -255914, 114614, -63105, 54143, -94501, -148672, -263117, -146313, 150099, -398192, -128117, 427744, -308859, 31453, -186140, -143199, 115539, 47761, -60638, -483122, 185239, 85446, 123154, -193278, 81957, -308162, -35518, 109891, -189958, 43946, 177801, -97738, 131915, -441069, -378813, -115159, -102186, -286562, -115397, 298092, 208019, -25672, -224461, -248324, 94371, -332643, -486405, -46560, 68446]
9181b1846j86933P6344A18211a03089j97287C36250B8186c72342A70181d4811
9170C15495a15109H8190a01240B05248a45985I8678r645e2222D23572d5658K2178
9159b3480B44236c32995e4366j59452A55361a90263c7217m9738D3949c59583R454
9148c50129a52587j78233a26033a3191A11604C4569a87099l352K0196A50707c7351
9136a74536r362A9872d65267f412l57735e8653I0540c1367j03601C256J21683
9125A24939g9177k81874B22929a57612j32553F9616b32872A73057G639b85189
9114a67315B6835b05228D2766A1894h8066O269H0556a24682k6059B52994a79454
9102i3892F5506B7774c26667a25480A35889d19279R3111J38471I3195a24907A08967
$$ y = [-21846, -208779, -132435, 118211, -103089, -300376, 336250, 28186, -372342, 170181, -44811, 315495, -115109, 88190, -101240, 205248, -145985, 98678, 89033, -52222, 423572, -45658, -23480, 244236, -332995, -54366, -213818, 155361, -190263, -37217, -86955, 43949, -359583, -350129, -152587, -330820, -126033, -13191, 111604, 34569, -187099, -190451, -170255, 150707, -37351, -174536, -183898, 19872, -465267, -6412, -364147, -58653, 90540, -31367, -134968, 3256, 124939, -79177, -361051, 222929, -157612, -290165, 69616, -232872, 173057, 7639, -285189, -167315, 26835, -205228, 42766, 11894, -88066, -81797, 80556, -124682, -150741, 252994, -179454, -93892, 65506, 27774, -326667, -125480, 135889, -419279, -326168, -187697, 93195, -124907, 108967]
9090i1050l3970A31168a88699C6326J15786a4943A97544b70268a0470j56352k44010
9079d10832h4940q4036O7294k61384A39913P6399A0922c5553k01782P2873A67194
9067A1839a17523e5431n2141A37400j3987e3841n1817G2334a49472I4684d8392
9055A28664d8224B8232A177a78730j1911A25115g6760D5997b54074i5912j22666
9044b18578b9549j65519D6134b51162a05322j13415B09496F1603a86407q7132
9034b73539k5668b6048B2048a34897A33291j267b0316A91709b0659j67679A2860
9022c14750J19687b1084k40555f8196I0510a42152C34095a34054F2959b29142
9011a44796C8069f2538a6115p1008o6652d7487I1841f3588j27717o2504k31328
$$ y = [-91050, -125020, 131168, -188699, 36326, 152112, -14943, 197544, -270268, -10470, -166822, -410832, -84940, -168976, -101682, -363066, 139913, 216312, 10922, -35553, -237335, -164462, 167194, 11839, -117523, -55431, -107572, 137400, 123413, -53841, -105658, 72334, -149472, 94684, -48392, 128664, -48224, 28232, 1177, -178730, -190641, 125115, -76760, 45997, -254074, -95912, -218578, -29549, -195068, 46134, -251162, -105322, -218737, 209496, 61603, -186407, -273539, -299207, -26048, 22048, -134897, 133291, 132024, -20316, 191709, -20659, -188338, 12860, -314750, -195063, -21084, -261639, -68196, 90510, -142152, 334095, -134054, 62959, -229142, -144796, 38069, -62538, -16115, -87123, -153775, -47487, 91841, -63588, -191305, -253809, -485137]
9000d85137D4447L77419H9027b71A10612J2126a63648N2726p3550j71949L4264
8989c22157H601a10661K7038d0008a5071j83502B22325A01680a46977b1907n20579
8978e42486B09785a83950m2518O3211f6212j21334A88046b77610B27205a89412
8967B40160H39a23918g898r0941K5366G8065a89092j47842a7495q59n699k03492
8955b27545n9336g4410l01180L392A93671n1356R8951B7611c31217J45352m4489
8944b30354O0036L5566A00313P2691a25042C0536a20137c378m2270k44714B4004
8932A69507J17426J43207j07341j43401d0099F3890a08594I2863J03341j9304
8922A76900o1517N92124K577331O101581N36757B805703G22247k53403A07612
$$ y = [-485137, 44447, 421866, 89027, -271, 110612, 122738, -163648, -110922, -184472, -356421, -322157, 8601, -110661, -83623, -40008, -15071, -198573, 222325, 101680, -146977, -21907, -542486, 209785, -183950, -226468, -163257, -66212, -187546, 188046, -277610, 227205, -189412, 240160, 839, -123918, -7898, -98839, -73473, 78065, -189092, -336934, -17495, -18354, -24053, -227545, -286881, -74410, -375590, -372198, 193671, 142315, 241266, 27611, -331217, -185865, -230354, -170318, -134752, 100313, 173004, -125042, 30536, -120137, -3378, -45648, -290362, 24004, 169507, 286933, 430140, 322799, 179398, -40099, 63890, -108594, 92863, 196204, 176900, 115383, 707507, 3284838, 9386419, 9923176, 2805703, 722247, 468844, 107612]
8912C04050A06538L8958e73303f2071E7333P2859K81567j36836n9150H0020j1675
8901F8345b19949A67984b15898D6607l759f851A53634h3631k0106m7618A76423
8889a86100d11o9930o5151H5441h952p140j11656B0307f2395A0464J25758J72531
$$ y = [304050, 106538, 145496, -573303, -62071, 57333, 130192, 411759, 274923, 215773, 80020, 68345, -219949, 167984, -215898, 46607, 42848, -6851, 153634, -83631, -103737, -151355, 176423, -186100, -411, -70341, -135492, 85441, -8952, -16092, -127748, 20307, -62395, 10464, 136222, 308753]
$$ [...]
##END NTUPLES=NMR SPECTRUM
##END=
