
##TITLE=AC1361_QARH12183_7155206_JLfaZ40g7r
##JCAMPDX= 6.0         $$ Bruker NMR JCAMP-DX V2.0
##DATA TYPE= NMR SPECTRUM
##DATA CLASS= NTUPLES
##ORIGIN= BRUKER
##OWNER= Administrator
$$ 1.72 TOPSPIN		Version 2.1
$$ 2012-12-01 11:16:04.770 -0500  Administrator@X
$$ Compression mode = diff/dup
##.OBSERVE FREQUENCY= 400.02188249412
##.OBSERVE NUCLEUS= ^1H
##.ACQUISITION MODE= SIMULTANEOUS (DQD)
##.ACQUISITION SCHEME= undefined
##.AVERAGES= 64
##.DIGITISER RES= 22
##SPECTROMETER/DATA SYSTEM= spect
##.PULSE SEQUENCE= noesygpps1d.comp
##.SOLVENT NAME= COFFEE_meoh
##.SHIFT REFERENCE= INTERNAL, COFFEE_meoh, 1, 14.96275
##AUDIT TRAIL= $$ (NUMBER, WHEN, WHO, WHERE, PROCESS, VERSION, WHAT)
$$ ##TITLE= Audit trail, TOPSPIN		Version 2.1
$$ ##JCAMPDX= 5.01
$$ ##ORIGIN= Bruker BioSpin GmbH
$$ ##OWNER= Administrator
$$ $$ E:\/data/COFFEE/nmr/AC1361_QARH12183_7155206_JLfaZ40g7r/12/pdata/1/auditp.txt
$$ ##AUDIT TRAIL=  $$ (NUMBER, WHEN, WHO, WHERE, PROCESS, VERSION, WHAT)
(   1,<2012-12-01 11:15:59.161 -0500>,<Administrator>,<X>,<go>,<TOPSPIN 2.1>,
      <created by zg
	started at 2012-12-01 11:04:28.692 -0500,
	POWCHK enabled, PULCHK disabled,
       configuration hash MD5:
       86 BA 57 50 F2 9D 5C 9B 26 00 A9 28 5F 66 2E 89
       data hash MD5: 64K
       12 AF 27 43 42 48 8A 29 EB 0B AE 6B 87 A3 0D 1A>)
(   2,<2012-12-01 11:16:02.102 -0500>,<Administrator>,<X>,<proc1d>,<TOPSPIN 2.1>,
      <Start of raw data processing
       efp LB = 0.3 FT_mod = 6 PKNL = 1 PHC0 = 0 PHC1 = 0 SI = 128K 
       data hash MD5: 128K
       6A B0 7B 90 93 F1 BD F9 88 4F A5 B5 4C 25 8D 06>)
(   3,<2012-12-01 11:16:03.133 -0500>,<Administrator>,<X>,<proc1d>,<TOPSPIN 2.1>,
      <pk PHC0 = -78.16223 PHC1 = 0 
       data hash MD5: 128K
       79 D2 6A FD B7 E2 06 06 2F 19 98 6C 8C 5A 64 AB>)
(   4,<2012-12-01 11:16:03.769 -0500>,<Administrator>,<X>,<proc1d>,<TOPSPIN 2.1>,
      <abs ABSG = 1 
       data hash MD5: 128K
       91 38 22 AF FC DF AF 9D 0F 0D 8B A1 43 F7 54 6D>)
(   5,<2012-12-01 11:16:03.921 -0500>,<Administrator>,<X>,<proc1d>,<TOPSPIN 2.1>,
      <abs ABSG = 2 
       data hash MD5: 128K
       64 1C 94 66 CA 26 84 B7 46 5E 67 1C C4 DF A5 75>)
(   6,<2012-12-01 11:16:04.103 -0500>,<Administrator>,<X>,<proc1d>,<TOPSPIN 2.1>,
      <abs ABSG = 3 
       data hash MD5: 128K
       87 1C 23 1C 7A A1 B3 BB 95 0E 1E 19 F0 6E 24 F0>)
(   7,<2012-12-01 11:16:04.270 -0500>,<Administrator>,<X>,<proc1d>,<TOPSPIN 2.1>,
      <abs ABSG = 4 
       data hash MD5: 128K
       BB 79 78 C1 2F C2 15 0B D6 FD 02 13 1E B6 97 A9>)
(   8,<2012-12-01 11:16:04.452 -0500>,<Administrator>,<X>,<proc1d>,<TOPSPIN 2.1>,
      <abs ABSG = 5 
       data hash MD5: 128K
       D8 2D E6 1A 88 EE E8 78 53 C4 AE 0E F4 54 8B 95>)
$$ ##END=
$$ 
$$ $$ hash MD5
$$ $$ D1 00 C0 2D E9 47 38 24 1E 33 B8 B1 2A E4 21 87
##$RELAX= 
##$RELAX= 
##$RELAX= 
##$RELAX= 
##$RELAX= 
##$RELAX= 
##$RELAX= 
##$RELAX= 
$$ Bruker specific parameters
$$ --------------------------
##$DU= <E:\>
##$EXPNO= 12
$$ [...]
##$TP07= 0
##$TPNAME0= <>
##$TPNAME1= <>
##$TPNAME2= <>
##$TPNAME3= <>
##$TPNAME4= <>
##$TPNAME5= <>
##$TPNAME6= <>
##$TPNAME7= <>
##$TPOAL= (0..7)
0.5 0.5 0.5 0.5 0.5 0.5 0.5 0.5
##$TPOFFS= (0..7)
0 0 0 0 0 0 0 0
##$TUNHIN= 0
##$TUNHOUT= 0
##$TUNXOUT= 0
##$USERA1= <user>
##$USERA2= <user>
##$USERA3= <user>
##$USERA4= <user>
##$USERA5= <user>
##$V9= 5
##$VALIST= <valist>
##$VCLIST= <CCCCCCCCCCCCCCC>
##$VD= 0
##$VDLIST= <DDDDDDDDDDDDDDD>
##$VPLIST= <PPPPPPPPPPPPPPP>
##$VTLIST= <TTTTTTTTTTTTTTT>
##$WBST= 1024
##$WBSW= 4
##$XGAIN= (0..3)
0 0 0 0
##$XL= 0
##$YL= 0
##$YMAX_a= 9183547
##$YMIN_a= -19570199
##$ZGOPTNS= <>
##$ZL1= 120
##$ZL2= 120
##$ZL3= 120
##$ZL4= 120
##$ABSF1= 14.96275
##$ABSF2= -5.595431
##$ABSG= 5
##$ABSL= 3
##$ALPHA= 0
##$AQORDER= 0
##$ASSFAC= 0
##$ASSFACI= 0
##$ASSFACX= 0
##$ASSWID= 0
##$AUNMP= <proc_prof1d_extract.lims>
##$AXLEFT= 0
##$AXNAME= <>
##$AXNUC= <1H>
##$AXRIGHT= 0
##$AXTYPE= 0
##$AXUNIT= <>
##$AZFE= 0.1
##$AZFW= 0.1
##$BCFW= 0
##$BC_mod= 0
##$BYTORDP= 0
##$COROFFS= 0
##$CY= 15
##$DATMOD= 1
##$DC= 0
##$DFILT= <>
##$DTYPP= 0
##$F1P= 0
##$F2P= 0
##$FCOR= 0.5
##$FTSIZE= 131072
##$FT_mod= 6
##$GAMMA= 0
##$GB= 0
##$INTBC= 1
##$INTSCL= 1
##$ISEN= 128
##$LB= 0.3
##$LEV0= 0
##$LPBIN= 0
##$MAXI= 10000
##$MC2= 0
##$MEAN= 0
##$ME_mod= 0
##$MI= 0
##$NCOEF= 0
##$NC_proc= -2
##$NLEV= 6
##$NOISF1= 0
##$NOISF2= 0
##$NSP= 0
##$NTH_PI= 0
##$NZP= 0
##$OFFSET= 14.96275
##$PC= 1
##$PHC0= -78.16223
##$PHC1= 0
##$PH_mod= 1
##$PKNL= yes
##$PPARMOD= 0
##$PPDIAG= 0
##$PPIPTYP= 0
##$PPMPNUM= 2147483647
##$PPRESOL= 1
##$PSCAL= 4
##$PSIGN= 0
##$PYNMP= <proc.py>
##$REVERSE= no
##$SF= 400.020008936281
##$SI= 131072
##$SIGF1= 0
##$SIGF2= 0
##$SINO= 400
##$SIOLD= 131072
##$SPECTYP= <>
##$SREGLST= <1H.CDCl3>
##$SSB= 0
##$STSI= 131072
##$STSR= 0
##$SW_p= 8223.68421052631
##$SYMM= 0
##$S_DEV= 0
##$TDeff= 65536
##$TDoff= 0
##$TI= <>
##$TILT= no
##$TM1= 0
##$TM2= 0
##$TOPLEV= 0
##$USERP1= <user>
##$USERP2= <user>
##$USERP3= <user>
##$USERP4= <user>
##$USERP5= <user>
##$WDW= 1
##$XDIM= 131072
##$YMAX_p= 471087201
##$YMIN_p= -26618
##$CURPLOT= <Network HP LaserJet P1505>
##$CURPRIN= <$Network HP LaserJet P1505>
##$DFORMAT= <normdp>
##$LAYOUT= <+/1D_H.xwp>
##$LFORMAT= <normlp>
##$PFORMAT= <normpl>
##$SURQMSG= 1
$$ End of Bruker specific parameters
$$ ---------------------------------
##NTUPLES= NMR SPECTRUM
##VAR_NAME=  FREQUENCY,     SPECTRUM/REAL,   SPECTRUM/IMAG
##SYMBOL=    X,             R,               I
##VAR_TYPE=  INDEPENDENT,   DEPENDENT,       DEPENDENT
##VAR_FORM=  AFFN,          ASDF,            ASDF
##VAR_DIM=   131072,        131072,          131072
##UNITS=     HZ,            ARBITRARY UNITS, ARBITRARY UNITS
##FACTOR=    0.0627417313425164, 1,          1
##FIRST=     8223.62146879497, 1968,         -65420
##LAST=      0,             4445,            -65159
##MIN=       0,             -26618,          0
##MAX=       8223.62146879497, 471087201,    0
$$ Real data points
##PAGE= N=1
##DATA TABLE= (X++(R..R)), XYDATA
$$ [...]
64371 92620 94190 95405 95433 94041 91684 89181 87398 86835 87235 87836 88260 88924 90339 92342 94295 95697
64355 95697 96333 96217 95757 95661 96245 97065 97525 97566 97409 96954 95875 94161 92272 90952 91014 92853 95812 98430
64337 98430 99748 100111 100376 100844 101379 102075 103050 103876 103949 103416 103091 103450 104173 104716 104896 104891 104976 105278 105605 105650
64317 105650 105509 105713 106484 107314 107665 107716 107909 108136 108056 107964 108558 109866 111168 112031 112740 113470 113749 113167 112140
64298 112140 111543 111819 112798 114167 115699 117091 117961 118177 118086 118267 119103 120602 122605 124951 127380 129507
64282 129507 131197 132872 135141 138201 141914 146270 151191 155916 159361 161433 163276 165759 168281 169637
64268 169637 169601 168914 168074 166892 165139 162956 160566 158095 155686 153356 150800 147792 144752 142468 141265
64253 141265 140802 140643 140572 140412 139981 139310 138536 137601 136405 135280 134857 135356 136331 137235 138011 139084 140963 143837
64235 143837 147361 150891 154096 157259 160798 164730 168825 173011 177266 181397 185314 189250 193161 196181
64221 196181 197364 196847 195613 194166 192204 189635 187003 184592 181859 178314 174384 170898 168103 165780
64207 165780 163978 162894 162137 160868 158999 157715 158334 160771 163553 165349 166121 166610 167142 167443 167429 167490 167863
64190 167863 168336 168919 170204 172525 175189 177239 178733 180520 182827 184878 186070 186807 187751 188760 189043
64175 189043 188258 187103 186837 188298 191244 194580 197393 199803 202772 207173 213252 220829 229619 239301 249617
64160 249617 260558 272286 284851 298208 312466 327776 343838 359842 375004 388935 401250
64149 401250 411052 417117 418719 416204 410709 403288 394278 383596 371541 359035 346939 335449 324389
64136 324389 313815 304010 295032 286665 278785 271551 265269 260217 256395 253243 249836 245665 241048 236519
64122 236519 232176 228047 224698 222803 222266 222321 222411 222354 221903 220894 219879 219805 220887 222389 223684 224842 226051
64105 226051 227200 228395 230229 233070 236676 240927 246357 253330 261089 268379 274877 281509 289425 299081
64091 299081 310239 322378 334994 347726 360282 372281 383368 393554 403070 411638 418297 422323
64079 422323 424045 424223 422842 419114 412704 404366 395239 385991 376894 368258 360338 353017 346089 339840
64065 339840 334960 331739 329688 328151 327034 326596 326756 327109 327681 329170 332174 336495 341468 346723 352364
64050 352364 358717 366303 375798 387506 400885 415053 429759 445438 462331 480059 498316 517499
64038 517499 538256 560631 584020 607892 632167 656758 680980 703680 723951 741506 756223
64027 756223 767549 774730 777610 776768 772764 765669 755555 743056 729090 714371 699538 685338 672170
64014 672170 659793 648094 637889 630287 625370 622218 620260 619918 621835 626117 632477 640567 649922 660104
64000 660104 671150 683562 697706 713592 731205 750473 770871 791802 813700 838149 866466
63989 866466 898505 933190 969794 1008406 1049622 1094248 1142974 1195845 1252232 1311628 1374330
63978 1374330 1441103 1512476 1588693 1670147 1757547 1851854 1954326 2066488 2189850 2325926
63968 2325926 2476898 2646167 2838068 3057318 3309117 3599749 3936743 4328360 4782925
63959 4782925 5308537 5913017 6603496 7385037 8258610 9219996 10260891 11371296 12540867
63950 12540867 13758316 15009906 16278001 17539658 18765808 19922537 20974915 21891594
63942 21891594 22648198 23228785 23625187 23834156 23853776 23681908 23317735 22764517 22031533
63933 22031533 21135435 20101331 18961851 17752693 16506721 15250519 14004766 12786319
63925 12786319 11609867 10488781 9435372 8460341 7571454 6772320 6062090 5436301 4888405
63916 4888405 4411182 3997273 3638987 3328436 3058386 2822949 2617313 2437091 2278286
63907 2278286 2137694 2012900 1901795 1802222 1712056 1629505 1553412 1483319 1418991 1359727 1304332
63896 1304332 1251880 1202199 1155473 1111633 1070341 1031198 993558 956461 919179 881774 844818
63885 844818 808699 773574 739796 707968 678489 651291 626101 602762 581306 561747 543799
63874 543799 526807 510144 493701 477792 462646 448350 435319 424244 415287 407716 400628 393737
63862 393737 387239 381385 376521 373033 370740 368718 366329 364141 363265 363960 365540 367532 370272 374232 379241
63847 379241 384518 389203 392844 395598 397899 399734 400399 399243 396389 392297 386873 379546 370156 359247
63833 359247 347490 335371 323445 312381 302493 293592 285374 277578 269729 261276 252369 244143 237728
63820 237728 233036 228868 224245 219372 215128 211824 208851 205576 202227 199509 197603 195948 193966 191496
63806 191496 188542 185200 182015 179770 178509 177257 175230 172907 171391 171011 171110 171021 170711 170483 170499 170574 170149
63789 170149 168595 165836 162544 159475 156834 154567 152856 151850 151182 150277 149019 147699 146534 145661 145355
63774 145355 145691 146149 146039 145174 143763 141917 139840 138220 137681 137924 138022 137508 136629 135725 135037 135028 136125 138040
63756 138040 139989 141593 142945 143828 143736 142808 141950 141750 141901 141940 141922 142068 142380 143026 144554 147257 150668 154033
63738 154033 157047 159970 163329 167627 172968 178805 184491 190226 196974 205268 214592 224168 233862 243944
63724 243944 254300 264199 272646 278853 282710 284858 285928 285676 283443 279459 274949 270681 266130 260516
63710 260516 253950 247052 240040 232870 225846 219400 213492 207794 202247 196950 191751 186476 181402 177054
63696 177054 173663 171186 169671 169099 169048 168922 168466 167805 167159 166896 167553 169338 171726 174028 176274 179198
63680 179198 183429 189083 195954 203632 211504 219171 226910 235330 244464 253492 261357 267365 271182 272698
63666 272698 272085 269755 266050 261060 254766 247272 238936 230364 222210 214804 208052 201792 196091 191025
63652 191025 186429 182124 178263 175125 172687 170744 169350 168729 168769 168999 169181 169569 170483 171916 173710 175801
63636 175801 178081 180255 182183 184301 187388 191816 197143 202596 207926 213641 220396 228329 237210 247078
63622 247078 258300 270916 284317 297909 311860 326835 343091 360183 377574 395182 413123
63611 413123 431035 447718 461479 470989 476036 477502 476562 474016 470463 466801 464061 462685 462270 462189
63597 462189 462170 462085 461388 459146 454721 448262 440407 431582 421738 410738 398914 387120 376263 366793
63583 366793 358442 350362 341636 331993 322081 312862 304758 297588 291332 286535 283718 282614 282340 282231 282331
63568 282331 283123 285070 288421 293239 299456 306870 315166 324056 333601 344352 356963 371587 387852
63555 387852 405407 424239 444313 465232 486406 507219 526776 543781 557093 566336 571826 574300
63543 574300 575090 576078 578655 582623 586711 590269 593915 598397 603443 608027 611163 611887 608909 601062 588184
63528 588184 571208 551283 529110 505102 479914 454650 430615 408758 389141 371025 353698
63517 353698 337200 322129 308857 297271 287162 278370 270544 263239 256560 251284 247959 246176 245091
63504 245091 244408 244355 244932 245832 247101 249234 252377 255963 259473 263167 267714 273439 280256 287974 296250
63489 296250 304501 312423 320472 329342 338965 348472 357090 364619 371056 376318 380540 384094 386944 388266
63475 388266 387079 383086 376768 368885 360124 350974 341591 331929 322215 313121 305145 298008 291098 284476
63461 284476 279005 275258 272585 269608 265605 261193 257560 255207 253639 252246 251203 251246 252708 255106 257699
63446 257699 260174 262689 265571 269267 274367 281249 289635 298766 308131 317875 328479 340220 353103
63433 353103 367081 382126 398121 414957 432861 452360 473682 496299 519321 542387 565923
63422 565923 590429 615643 640392 662977 681614 694869 702112 703620 700207 692921 683190 672821
63410 672821 663285 654953 647299 639724 631891 623408 613757 602622 589931 575492 559040 540769 521410
63397 521410 501578 481419 461085 441204 422549 405539 390339 377196 366320 357588 350671 345353
63385 345353 341490 338853 337331 337148 338484 340988 344088 347840 353063 360444 369836 380667 392731 406224
63371 406224 421093 436806 452992 470045 488756 509377 531286 553596 575767 597433 617920
63360 617920 636355 652236 665466 675727 682147 683939 681289 675363 667437 658206 647984 637405 627652
63347 627652 619802 613977 609230 604263 598122 590271 580340 568069 553434 536632 518091 498568 479058
63334 479058 460307 442503 425577 409574 394461 379896 365694 352468 341235 332349 325260 319390
63322 319390 314684 311102 308124 305209 302457 300399 299252 298760 298684 299088 300082 301489 302872 303839 304309 304504
63306 304504 304654 304692 304273 303151 301527 299950 298826 298016 297056 295867 295075 295279 296103 296474 296008 295510 295797
63289 295797 296546 296903 296764 296784 297391 298577 300504 303437 307005 310250 312615 314324 315730 316997 318487 320670
63273 320670 323323 325563 327094 328772 331412 334521 336788 337611 337667 338204 340076 343231 346900 350414 353944
63258 353944 358162 363157 368201 372684 376682 380328 383284 385335 387079 389461 392861 396977 401393 405910
63244 405910 410550 415527 421096 427326 434291 442467 452384 463836 476021 488668 502343 517431 533658
63231 533658 551033 570388 592279 615980 640237 664443 688351 711225 732308 751858 770831
63220 770831 789702 808277 826581 845226 864952 886277 909383 933833 958590 982772 1006074
63209 1006074 1028007 1047214 1062305 1072956 1079360 1080872 1076207 1064982 1048235 1027428 1003634 977792
63197 977792 951023 924485 899278 876330 855854 837123 819569 804041 792318 785374 782802 783862
63185 783862 788306 796104 807093 821149 838190 857872 879761 903770 929859 957393 985449 1013807
63173 1013807 1042990 1073262 1104274 1135828 1168298 1202071 1236976 1272303 1306827 1338916 1367395
63162 1367395 1392362 1414383 1432757 1445322 1450146 1446684 1435180 1415985 1389881 1358209 1322048 1281886
63150 1281886 1238631 1194302 1151084 1110113 1071600 1035570 1001983 970669 941803 916097 893908
63139 893908 874499 856792 840570 826299 814030 803198 793429 784822 777283 770206 763155 756512 751049
63126 751049 746955 743612 740318 737005 734032 731464 728959 726418 724368 723397 723469 724091 724897 725777 726669 727700
63110 727700 729326 731882 735198 739116 744119 750755 758630 766692 774480 782378 790635 798906 806829 814286
63096 814286 821041 826986 832947 840238 848995 857782 865339 871894 878229 884307 889658 894514 899602 905055
63082 905055 910305 914874 918675 921724 924132 926265 928397 930286 931477 931981 932290 932865 933891 935341 936943
63067 936943 938312 939524 941457 945190 951072 958612 967183 976707 987783 1001251 1017503 1036183 1056831
63054 1056831 1079758 1105826 1135352 1167804 1202718 1240269 1280648 1323578 1368868 1416760 1467139
63043 1467139 1518997 1571394 1624511 1679047 1734926 1791330 1847704 1903970 1960006 2015699 2071453
63032 2071453 2127859 2184772 2241237 2296229 2348859 2397883 2441694 2478897 2508316 2528381 2537189
63021 2537189 2533530 2517450 2489611 2450599 2401192 2343004 2278507 2210484 2141565 2073978 2009322
63010 2009322 1948473 1891863 1840098 1794384 1756271 1726782 1705879 1693018 1688114 1691457 1702745 1720941
62998 1720941 1745449 1776752 1815250 1860031 1909563 1963240 2021326 2083487 2148360 2214713 2282184
62987 2282184 2350565 2419140 2487242 2554887 2622132 2687955 2750221 2806685 2855630 2895546 2924585
62976 2924585 2940580 2941588 2926434 2894867 2847415 2785274 2710276 2624701 2530824 2430690 2326427
62965 2326427 2220595 2115888 2014463 1917653 1826216 1740569 1660818 1586846 1518555 1455933 1398885
62954 1398885 1347120 1300297 1258201 1220813 1188132 1159866 1135245 1113240 1093024 1074117 1056184
62943 1056184 1039089 1023200 1009193 997173 986316 975741 965483 956199 948128 940877 934102 927791
62931 927791 921794 915616 908994 902404 896720 892452 889339 886462 882794 877958 872558 867487 862810 857665
62917 857665 851425 844570 838016 831847 825197 817390 808738 800026 791645 783533 775723 768440 761598 754751
62903 754751 747861 741791 737540 735001 732875 729921 726033 721945 718156 714331 709655 703614 696474 689057
62889 689057 681963 675040 667786 660169 652754 645998 639767 633755 628074 623136 619132 615914 613289 611183
62875 611183 609548 608338 607616 607522 608037 608805 609330 609432 609486 610054 611243 612652 614050 615765 618141 620918 623588
62858 623588 626153 629022 632224 635313 637997 640354 642378 643928 645192 646621 648216 649453 650111 650613 651316
62843 651316 652037 652580 653098 653613 653758 653441 653189 653332 653316 652427 650781 649023 647415 645756 643880 641592 638430
62826 638430 634128 629184 624285 619310 613466 606439 598871 591650 585124 579049 572974 566679 560504 555157
62812 555157 550941 547338 543623 539722 536196 533679 532694 533655 536439 540030 543166 545461 547591 550440 554378
62797 554378 559312 565098 571805 579725 589090 599743 611260 623496 636717 651112 666516 682868
62785 682868 700529 719931 741309 765068 791920 822271 855874 892495 932463 976253 1024103
62774 1024103 1076521 1134454 1198204 1266678 1338443 1413007 1490215 1568882 1647091 1723556 1797473
62763 1797473 1867055 1929271 1981242 2021202 2048118 2061321 2060765 2046922 2020230 1981234 1931331 1872611
62751 1872611 1806848 1735327 1659752 1582497 1505667 1430501 1357904 1288815 1223697 1162252 1104067
62740 1104067 1049225 998092 950915 907806 868727 833383 801465 772936 747628 724651 702959
62729 702959 682576 664546 649433 636485 624514 613035 602313 592897 585446 580469 577804 576643
62717 576643 576227 576209 576419 576931 578507 582249 588480 596492 605664 616228 628632 642869 658976 677651
62703 677651 699729 725325 754094 786165 822266 862994 908341 958090 1012489 1072495 1139332
62692 1139332 1213764 1295820 1385236 1481805 1584911 1692893 1803288 1913609 2021513 2124417
62682 2124417 2219550 2304313 2376052 2431605 2467852 2482942 2476631 2449670 2403580 2340864 2264443
62671 2264443 2176628 2079300 1975143 1867658 1759695 1652823 1548429 1448401 1354135 1265773
62661 1265773 1183118 1106684 1037153 974376 917590 866205 819832 777983 740294 706629 676478
62650 676478 648714 622472 597785 574944 553735 533910 515810 499826 485636 472657 460855
62639 460855 450405 440933 431830 423009 414675 406632 398580 390819 383857 377496 371120 364851 359538 355535
62625 355535 352230 348968 345731 342658 339559 336299 333286 331133 330048 329814 330171 330951 331908 332648 332859 332687
62609 332687 332810 333981 336438 339879 344004 348796 354217 360006 366055 372720 380508 389672 400333 412645
62595 412645 426594 441947 458783 477794 499633 524216 551148 580674 613624 650407 690465
62584 690465 732782 776470 820647 864010 904838 941515 973080 999246 1019810 1033993 1040565 1038701
62572 1038701 1028615 1011372 988366 961026 930644 898158 864240 829696 795559 762617 731176
62561 731176 701467 673977 649037 626315 605059 584822 565778 548419 532992 519045 505464
62550 505464 491301 476701 462743 450249 439086 428765 419199 410537 402632 395221 388413 382607 377989
62537 377989 374440 371837 370297 370164 371785 375038 379039 382702 385800 389105 393373 398598 404440 410829
62523 410829 417713 424743 431821 439689 449419 461431 475391 490958 508210 527522 549403 574495
62511 574495 603394 636484 673980 715955 762202 812290 865890 922828 982668 1044467 1106906
62500 1106906 1168257 1226139 1277916 1321639 1356230 1380633 1393479 1393999 1382766 1361084 1330096 1290882
62488 1290882 1244932 1193985 1139654 1083575 1027457 972610 919812 869999 824484 783968 747863
62477 747863 715137 685406 658709 634851 613708 595649 580866 568599 557832 548462 541037 535613
62465 535613 531639 528767 527069 526628 527515 529955 533786 538072 541982 545845 550605 556491 563141 570753 580069
62450 580069 591130 602913 614319 624761 633753 640774 645700 648661 649287 646805 641018 632603 622254
62437 622254 610177 596490 581463 565215 547822 529893 512401 495772 479777 464534 450909
62426 450909 439642 430662 423621 418503 415255 413333 412196 412022 413496 416952 422014 428036 434761 442513
62412 442513 451752 462368 473584 484661 495470 506141 516454 526028 534807 542803 549448 553793 555402
62399 555402 554624 552039 548075 543136 537619 531728 525521 519029 512041 504082 495075 485804 477213 469556
62385 469556 462795 457409 454000 452333 451727 452343 455177 460722 468470 477881 489028 502138 517310 534933
62371 534933 555675 579750 606822 636785 669970 706435 745687 787230 830691 875246 919690
62360 919690 963258 1005678 1046273 1083904 1118029 1148884 1176118 1198095 1213025 1220158 1219571 1211726
62348 1211726 1197866 1180008 1159707 1137316 1112927 1087366 1061487 1035093 1007442 978526 949168
62337 949168 920134 891842 864710 839181 815472 793742 774272 757038 741346 726275 711326
62326 711326 696452 681878 668254 656444 646664 638259 630755 624606 620251 616939 613323 608892 603981
62313 603981 598651 592510 585648 578731 571841 563953 554001 542086 529289 516701 504906 494138 484491
62300 484491 475980 468655 462743 458567 456234 455325 455004 454661 454534 455496 458100 462013 466544 471546 477532
62285 477532 485002 493855 503475 513257 523013 532915 543068 553285 563412 573742 584801 596731 609145
62272 609145 621625 634123 646900 660348 674836 690414 706650 723133 740167 758597 779036
62261 779036 801814 827651 857637 892181 930512 971535 1014605 1059018 1103199 1144972 1182360
62250 1182360 1213682 1237240 1251694 1256902 1253995 1244463 1229251 1208638 1182740 1152144 1118133 1082231
62238 1082231 1045459 1008175 970626 933452 897559 863791 832808 805028 780544 759228 740858
62227 740858 724933 710515 696775 683725 671896 661286 651287 641789 633591 627275 622281 617616 613025
62214 613025 608936 605660 603239 601798 601481 602155 603591 605851 609112 613305 618245 623984 630708 638431 647001
62199 647001 656267 666096 676564 688335 702403 719089 737601 756969 777085 798414 821034 844502
62187 844502 868392 892382 915877 938080 958402 976386 991252 1002030 1008391 1011177 1012058 1012667 1013943
62174 1013943 1016099 1019248 1024116 1031970 1043847 1060040 1080372 1104551 1132101 1162282 1194294 1227238
62162 1227238 1259764 1290190 1317210 1340170 1358615 1372218 1381458 1387674 1391879 1393917 1393216 1389734 1383610
62149 1383610 1374544 1362456 1348348 1333618 1318677 1303176 1287442 1272650 1259371 1246862 1234136
62138 1234136 1221032 1207814 1194347 1180259 1165679 1151325 1137949 1125860 1114859 1104462 1094389
62127 1094389 1085015 1077230 1071712 1068422 1066904 1066889 1068414 1071474 1075874 1081448 1088229 1096176 1104913 1114013
62113 1114013 1123454 1133474 1143943 1154407 1164992 1176752 1190613 1206346 1223176 1240998 1260244
62102 1260244 1280854 1302421 1325355 1350800 1379096 1409291 1440580 1473362 1508441 1546116 1586677
62091 1586677 1630790 1678348 1727496 1775797 1822205 1867307 1912127 1957485 2004180 2052880 2103823
62080 2103823 2157043 2212409 2268709 2323094 2372473 2415602 2453352 2487231 2518420 2548025 2577293
62069 2577293 2607289 2638811 2672562 2708734 2746404 2783965 2820375 2855651 2890091 2923387 2954553
62058 2954553 2982439 3006417 3026873 3044945 3061602 3077205 3092065 3106752 3121328 3134866 3146593
62047 3146593 3157225 3168420 3181112 3195119 3210198 3226659 3244979 3265554 3288797 3314866 3343301
62036 3343301 3373485 3405302 3438669 3472731 3506373 3539410 3572321 3604805 3635573 3663689 3689179
62025 3689179 3712095 3731910 3748228 3761227 3770985 3777114 3779543 3779009 3776229 3771167 3763671 3754317 3743962
62012 3743962 3732729 3720092 3705943 3691121 3676826 3663760 3651962 3641432 3632741 3626826 3624178 3624579
62000 3624579 3627855 3634371 3644209 3656206 3668562 3680225 3690975 3700250 3706836 3709927 3709794 3707206 3702926
61987 3702926 3698015 3693818 3691054 3689383 3688336 3688364 3690512 3695223 3701710 3708398 3713913 3717923 3721084 3723926
61973 3723926 3725874 3725704 3722819 3717481 3709834 3699470 3686150 3670293 3652357 3632250 3609742 3585060
61961 3585060 3558767 3531302 3502894 3473585 3443149 3411380 3378692 3346146 3314700 3284677 3256078
61950 3256078 3228982 3203558 3180053 3158934 3140656 3125212 3112321 3102029 3094562 3089602 3086516 3085535
61938 3085535 3087930 3094534 3104816 3117923 3134012 3153833 3177551 3204856 3235960 3271557 3311686 3355410
61926 3355410 3401912 3451512 3505354 3564487 3629670 3702007 3783335 3875783 3981189 4101381 4239034
61915 4239034 4397658 4580510 4790119 5029640 5304422 5621486 5987596 6408679 6891195
61906 6891195 7443034 8072394 8785925 9587498 10476806 11446807 12480925 13551341 14618148
61897 14618148 15628978 16520740 17225881 17683320 17850807 17714094 17289359 16618335 15758745
61888 15758745 14773832 13723507 12658124 11615634 10622223 9694712 8842302 8067557 7368277
61879 7368277 6740425 6179883 5682017 5240871 4849810 4502832 4194905 3921406 3677853
61870 3677853 3460191 3265090 3090030 2933148 2792816 2667327 2555113 2455037 2366025 2286586
61860 2286586 2215341 2151919 2096523 2048542 2006491 1969523 1938041 1912333 1891506 1874376 1860568
61849 1860568 1849976 1841834 1835221 1830017 1826476 1824120 1821857 1818999 1815519 1811567 1807431 1803763 1801091 1799190
61835 1799190 1797539 1796333 1796414 1798242 1801478 1805644 1810660 1816629 1823391 1830357 1836614 1841396 1844777 1847612
61821 1847612 1850450 1852832 1854218 1855350 1857981 1863298 1871259 1881535 1894428 1910632 1930593 1954479 1982491
61808 1982491 2014853 2051564 2092479 2137742 2188106 2244691 2308238 2378687 2455664 2539322 2630389
61797 2630389 2729463 2836844 2953289 3080330 3219467 3371475 3537057 3717913 3916698 4136288
61787 4136288 4379648 4650299 4952381 5290428 5669599 6096191 6577639 7122293 7739739
61778 7739739 8441314 9239845 10148776 11181612 12351435 13669344 15141642 16766730 18531998
61769 18531998 20410061 22354402 24295929 26142455 27783039 29099063 29982030 30354150
61761 30354150 30184594 29495284 28354596 26862032 25129593 23265396 21362753 19494808
61753 19494808 17713378 16050909 14524564 13140655 11897827 10789066 9803729 8929853
61745 8929853 8155736 7470211 6862465 6322417 5841518 5413002 5031160 4690340 4384786
61736 4384786 4109478 3860870 3636562 3434389 3252151 3088035 2940672 2808516 2689539
61727 2689539 2581767 2483821 2394750 2313622 2239535 2171708 2109346 2051635 1998068 1948474 1902637
61716 1902637 1860237 1821345 1786531 1756235 1730379 1708708 1690967 1676466 1664106 1653330 1644440
61705 1644440 1637462 1631216 1624220 1616067 1607233 1597956 1588131 1577967 1567757 1557015 1544771 1530782 1515732
61692 1515732 1500100 1483629 1466154 1448250 1430583 1413072 1395086 1376244 1356717 1336943 1317269
61681 1317269 1297794 1278507 1259651 1241874 1225754 1211218 1197665 1184604 1171962 1159934 1148856
61670 1148856 1139173 1131252 1125245 1121336 1119843 1120723 1123220 1126455 1130184 1134510 1139136 1143604 1148140 1153454
61656 1153454 1159613 1165831 1171604 1177294 1183282 1189198 1194489 1199234 1203801 1208035 1211348 1213440 1214342 1213857
61642 1213857 1211555 1207460 1202283 1196697 1190619 1183579 1175717 1168077 1161745 1156892 1152894 1149371 1146803 1146016
61628 1146016 1147246 1149841 1152802 1155422 1157478 1159031 1160127 1160744 1160973 1161145 1161611 1162452 1163609 1165226 1167610
61613 1167610 1170872 1174867 1179401 1184107 1188220 1191134 1193337 1196189 1200424 1205380 1210001 1214002 1217504 1220101
61599 1220101 1221082 1220334 1218369 1215485 1211484 1206149 1199564 1192040 1184084 1176312 1168957 1161685 1154322 1147497
61585 1147497 1142014 1137790 1134077 1130631 1128034 1126956 1127819 1131198 1137709 1147231 1158896 1172236 1187862
61572 1187862 1206689 1228931 1254245 1282422 1313434 1347009 1382640 1420021 1459117 1499720 1541194
61561 1541194 1582795 1624131 1665119 1705534 1744853 1782719 1819357 1855228 1890340 1924233 1956548
61550 1956548 1987173 2015733 2041433 2063501 2081333 2094118 2101022 2102038 2097930 2088930 2074307 2053972
61538 2053972 2029744 2003972 1977379 1949372 1920156 1891300 1864143 1838872 1815478 1794528 1776436
61527 1776436 1760803 1747289 1736630 1730098 1728168 1730307 1736071 1746027 1761459 1783313 1811531 1845458
61515 1845458 1884938 1930914 1984970 2048558 2122787 2208616 2306851 2418267 2544184 2686796 2848538
61504 2848538 3031333 3236831 3467077 3724190 4009178 4321176 4657415 5013078 5380894
61495 5380894 5750964 6110716 6444866 6736419 6969496 7132523 7219616 7230204 7168545 7043279
61485 7043279 6865986 6649087 6404634 6144041 5877481 5613002 5356620 5113183 4886452
61476 4886452 4678419 4489560 4320130 4170733 4041677 3932669 3843417 3773738 3722767 3688684
61466 3688684 3669693 3664851 3673684 3695415 3728767 3772079 3823421 3880975 3943303 4008846 4075370 4140622
61454 4140622 4203465 4263625 4320414 4372764 4420626 4465292 4508061 4549579 4590927 4634236 4681547
61443 4681547 4733809 4791475 4855064 4924288 4997431 5072489 5148402 5224365 5298567 5368535 5432309
61432 5432309 5488272 5534141 5567211 5585715 5589287 5578130 5552480 5512983 5461057 5398717 5328410
61421 5328410 5253004 5175505 5098587 5024405 4954715 4890925 4834167 4785484 4745715 4715011 4692800
61410 4692800 4678594 4672580 4675018 4685186 4701236 4720943 4742278 4763325 4782046 4796316 4804287 4804915
61398 4804915 4798232 4785029 4766409 4743922 4719985 4697610 4679593 4668355 4666526 4677039 4702454 4744818
61386 4744818 4806462 4890351 4999226 5134897 5298742 5492355 5717183 5973819 6262021 6580908
61376 6580908 6928486 7300908 7692064 8093152 8492156 8874278 9223657 9525075 9764931
61367 9764931 9932580 10022548 10035668 9977602 9856230 9680194 9458382 9198938 8908307 8591741
61357 8591741 8254773 7903810 7545495 7186060 6831089 6485231 6152004 5834213 5534447
61348 5534447 5254769 4996084 4758333 4541279 4344796 4168627 4012453 3876125 3759387
61339 3759387 3661343 3580569 3515768 3466106 3431034 3410067 3402538 3407280 3422746 3447726 3481714 3524238
61327 3524238 3574131 3629856 3690141 3753730 3818809 3883412 3946341 4007159 4065343 4120017 4170559
61316 4170559 4216924 4259285 4297768 4332674 4364558 4393992 4421432 4447196 4471125 4492215 4508936
61305 4508936 4520161 4525679 4525901 4521195 4511375 4495568 4472658 4442101 4404190 4359366 4307528 4248424
61293 4248424 4182557 4111298 4036136 3958188 3878518 3798691 3720878 3647367 3579723 3518349 3463076
61282 3463076 3414300 3373189 3340606 3316276 3299307 3289003 3284662 3284915 3287851 3291701 3295047 3296684 3295798
61269 3295798 3292075 3285163 3274282 3258954 3239909 3218648 3196230 3173068 3149764 3127491 3107671 3092072
61257 3092072 3083316 3084500 3097911 3124544 3165038 3220494 3292031 3380087 3484708 3606248 3745214
61246 3745214 3901260 4072411 4255030 4444109 4633341 4815012 4980012 5118291 5219780
61237 5219780 5275605 5279430 5228729 5125457 4975598 4787899 4572706 4341069 4103596 3869070
61227 3869070 3643800 3432065 3236605 3058510 2897328 2752067 2622104 2506913 2405253
61218 2405253 2315228 2235138 2163968 2101194 2046442 1999312 1959198 1925338 1897175 1874489 1857002
61207 1857002 1844156 1835584 1831538 1832510 1838541 1849139 1863606 1881075 1900420 1920439 1939998 1957822
61195 1957822 1972578 1983598 1991383 1997052 2001463 2005041 2008038 2010490 2012035 2012126 2010271 2005949 1998648 1988296
61181 1988296 1975278 1959838 1941855 1921423 1899091 1875223 1849766 1823037 1796013 1769263 1742372
61170 1742372 1715048 1687969 1661612 1634965 1606525 1576069 1544326 1511460 1477256 1442572 1409049
61159 1409049 1377243 1346248 1315380 1285069 1255796 1227158 1198408 1168991 1138253 1105546 1071147
61148 1071147 1036445 1002899 971360 942500 917001 894923 875611 858567 843826 831280 820399
61137 820399 811019 803675 798751 795840 794302 793853 794336 795612 798089 802681 809743 818494 827935 837886 848702
61122 848702 860505 873199 886914 902029 918961 938086 959446 982318 1005536 1028448 1051109
61111 1051109 1073405 1094622 1114180 1132091 1148166 1161286 1170100 1174203 1174238 1171134 1165580 1157996 1148640
61098 1148640 1137834 1126210 1114479 1102915 1091405 1079967 1068724 1057322 1045100 1032032 1018850
61087 1018850 1005987 993017 979466 965515 951538 937657 924195 911920 901228 891570 882200 873056
61075 873056 864414 856224 848338 840937 834146 827624 821082 814808 809093 803515 797369 790510 783259 775823
61061 775823 768342 761143 754422 748021 742036 737186 733950 731736 729661 727820 727032 727589 729074 731290 734591
61046 734591 739321 745566 753434 762915 773500 784529 795919 807989 820598 833078 845021 856529
61034 856529 867650 878048 887344 895402 902346 908680 915222 922409 929797 936749 943469 950792 959106 968172
61020 968172 977917 988739 1001045 1015073 1031040 1048797 1067452 1086154 1105230 1125794 1148360 1172712
61008 1172712 1199105 1228416 1260943 1296136 1333934 1375397 1421491 1472044 1526175 1582847 1640830
60997 1640830 1699487 1760343 1826831 1901755 1985903 2079594 2184048 2300187 2427406 2564880
60987 2564880 2713174 2873855 3049526 3246196 3474297 3745620 4071361 4466078 4951910
60978 4951910 5555790 6304724 7228269 8362475 9742899 11394104 13334202 15580725 18111744
60969 18111744 20779057 23262927 25168470 26233558 26481265 26184530 25694129 25296194 25180351
60960 25180351 25442544 26032095 26688414 26994899 26575220 25292298 23291578 20878632 18357690
60951 18357690 15944582 13761498 11860372 10243558 8884523 7749064 6805973 6025585
60943 6025585 5378320 4838973 4389258 4013973 3697215 3424083 3183723 2968769 2773463
60934 2773463 2593866 2428253 2275534 2134117 2003276 1884118 1777712 1683207 1598810 1523347
60924 1523347 1455536 1392799 1332438 1273495 1216377 1161459 1109169 1060635 1016816 977444 941875
60913 941875 910315 883030 859027 836933 816736 799333 784674 771660 759687 749025 739736 731311
60901 731311 723393 715943 708779 701725 695027 688909 683089 677561 673333 671387 671391 672573 675326 680586 687862
60886 687862 695371 702151 708842 716359 724971 734710 745473 756558 767199 777725 789172 801688 814348
60873 814348 826554 838480 849981 860172 868312 874141 877250 877173 874253 869389 862784 853923 842875
60860 842875 830569 817728 804705 792406 782013 773469 765511 757574 750481 744968 740913 738458 738517
60847 738517 741469 746543 753233 762186 773975 788069 803752 820984 839510 858128 875832 892850
60835 892850 909702 926039 941332 956025 971028 986554 1002200 1017661 1032672 1046757 1059691
60824 1059691 1071712 1082759 1092168 1099737 1106428 1113293 1120251 1126592 1132107 1137042 1141487 1145460 1149127
60811 1149127 1152292 1154135 1154032 1152118 1148554 1142786 1134142 1122627 1108592 1092128 1073293 1052394 1029624
60798 1029624 1005058 979436 954214 930315 907665 886492 868093 853464 842012 832565 824973 819768
60786 819768 816930 816051 817211 820620 825741 831746 838589 846799 856446 867078 878374 890089 901642
60773 901642 912496 922827 933247 944085 955291 966561 977084 985792 992470 998081 1003389 1007927
60761 1007927 1011072 1013402 1016133 1019855 1024771 1031610 1041122 1053029 1066407 1080856 1096418 1112724 1129150
60748 1129150 1145528 1161844 1177533 1191892 1204845 1216476 1226234 1233536 1238794 1242862 1245838 1247456
60736 1247456 1248284 1249358 1250662 1250965 1249105 1244611 1237335 1227560 1216370 1204862 1192975 1179994 1166075
60723 1166075 1152219 1138753 1124937 1110349 1095650 1081667 1068473 1055663 1042850 1029603 1015477
60712 1015477 1000393 984628 968389 951763 935070 918807 903283 888683 875407 863998 854907
60701 854907 848552 845218 844557 845746 848643 854185 863024 874417 887260 901530 917635 934830 951379
60688 951379 966040 978454 988398 995645 1000234 1001854 999242 991326 978750 963292 946062 927334 907774
60675 907774 888471 869824 851634 834320 818906 805740 794330 784451 776356 769960 764953 761681
60663 761681 760630 761055 761354 760881 760067 758642 755254 749396 742437 736182 731370 727902 725440 723351 721093
60648 721093 719168 718755 720018 721664 722459 722205 721038 719026 716929 716089 716825 717984 718749 719906 722616 726910
60632 726910 732257 738789 747019 756958 768293 781006 795186 810693 827513 845949 865996 887080
60620 887080 908861 931704 955881 980852 1005793 1030267 1053916 1076014 1095866 1113246 1128143
60609 1128143 1140533 1150589 1158523 1164069 1166833 1167282 1166426 1164131 1158756 1149108 1135881 1120526 1103490
60596 1103490 1084416 1063491 1041711 1020119 999422 980076 962368 946706 934054 925390 920362 917212
60584 917212 914514 912366 911298 910821 909760 907493 904089 899716 894606 889274 884106 879088 874419 870962
60570 870962 869507 869924 871584 874133 877366 880846 884358 888320 893039 897852 901629 903955 905244 906017 906640
60555 906640 907491 908788 910365 912158 914793 919294 926353 936219 948977 964526 982555 1003106 1027030
60542 1027030 1055566 1089642 1129867 1176881 1231181 1292760 1361059 1434743 1510847 1584280 1648774
60531 1648774 1698571 1729404 1738711 1726018 1693458 1645529 1587893 1526016 1464331 1406112 1353756
60520 1353756 1309024 1272902 1245533 1226685 1216216 1213703 1217779 1226458 1238187 1252057 1267030 1281738
60508 1281738 1295382 1308347 1321833 1337433 1357113 1382727 1415155 1454634 1502423 1561581 1635653
60497 1635653 1727097 1837484 1968693 2123323 2304212 2513978 2754754 3027977 3334434 3674409
60487 3674409 4047273 4450638 4879755 5326352 5775693 6203709 6578399 6866455 7040595
60478 7040595 7083251 6987419 6757764 6411904 5978987 5494367 4992497 4501250 4039578 3618339
60468 3618339 3242326 2911787 2623633 2373362 2156838 1970327 1809574 1670273 1549517
60459 1549517 1445531 1355826 1277103 1207499 1147322 1096567 1052990 1013805 978182 946610 918573
60448 918573 892418 867174 843187 821008 800700 782151 765134 749046 733345 718157 703924
60437 703924 690703 678439 667563 658583 651329 645284 640318 636464 633300 630353 627783 625897 624253
60424 624253 622114 619680 618032 617911 619232 621702 625215 629616 634685 640394 646683 653096 659129 664834
60410 664834 670603 676489 682245 687842 693442 698979 704263 709384 714557 719676 724445 728823 733017 737170
60396 737170 741338 745509 749471 753008 756467 760595 765469 770187 774013 777225 780270 782802 784284 784995
60382 784995 785619 786271 786686 786877 786829 785953 783828 781175 779136 777738 776006 773569 771280 770088 770045 770616 771410
60365 771410 772402 773718 775325 776856 777967 778997 780813 783719 787047 790197 793521 797690 802837 808913
60351 808913 816208 824786 833958 843118 852632 863080 874134 885076 895862 906645 916629 924545 930131
60338 930131 934151 937157 939190 940555 941809 943003 943838 944652 946392 949549 953820 958877 964745 971503 979239
60323 979239 988183 998107 1007747 1015577 1020992 1023958 1023783 1019398 1010965 1000268 989231 978809 969415 961502
60309 961502 955256 950334 946357 943383 941735 941535 942394 943408 943718 943393 943419 944476 946203 948101 950450 953614
60293 953614 957038 959872 962078 963869 964561 963261 960413 957341 954313 950368 945228 940134 936479 934672
60279 934672 934706 936782 940827 946161 952243 959262 967682 977580 988674 1000613 1013258 1027066 1043033
60266 1043033 1061727 1082603 1104926 1129100 1156186 1186374 1218992 1254015 1292463 1335081 1381676
60255 1381676 1432188 1487541 1548960 1617027 1691837 1773596 1862801 1960212 2066794 2183260 2309609
60244 2309609 2445401 2590326 2743929 2904889 3071092 3240249 3409839 3576671 3737231
60235 3737231 3888424 4027457 4151362 4257430 4343929 4409721 4453572 4474727 4473863 4452615 4412573
60224 4412573 4355852 4286231 4208390 4126139 4042581 3961771 3888523 3826297 3776514 3740143 3718601
60213 3718601 3712841 3723016 3749627 3793885 3856484 3937131 4035744 4152922 4288545 4440714 4606478
60202 4606478 4782550 4964769 5147892 5326705 5496729 5653564 5792505 5909464 6001555 6066450
60192 6066450 6102060 6107379 6082928 6030050 5950622 5847758 5725793 5589115 5441927 5289524
60182 5289524 5138513 4994873 4862442 4743831 4641817 4559054 4497165 4456967 4439057 4443587
60172 4443587 4470023 4517638 4585724 4672929 4776943 4894922 5023214 5156270 5286955 5408814
60162 5408814 5517537 5609987 5683111 5734706 5764390 5772821 5760563 5728613 5679584 5617667 5547889
60151 5547889 5475908 5407805 5349161 5304372 5276994 5269996 5285300 5323814 5386381 5473946 5586462
60140 5586462 5722801 5882594 6067409 6279477 6520301 6791409 7095487 7435343 7811976
60131 7811976 8224391 8670621 9147796 9651390 10175089 10711077 11249859 11780518 12292193
60122 12292193 12775250 13220696 13619232 13961955 14241718 14453248 14592513 14656797 14645012 14557087
60112 14557087 14393502 14156268 13850288 13483355 13065463 12608778 12127476 11636204 11148404
60103 11148404 10676183 10230725 9821476 9455089 9136070 8868167 8654250 8495248 8390404
60094 8390404 8338681 8339038 8389243 8485118 8620921 8789675 8982984 9191180 9403926 9610601
60084 9610601 9800585 9964112 10093238 10182195 10227498 10228404 10186860 10106194 9989812 9841278 9664796
60073 9664796 9464490 9243418 9004139 8750075 8485450 8214131 7939616 7666206 7399197
60064 7399197 7143516 6902852 6680266 6478799 6300954 6148131 6021101 5920713 5847705 5802104
60054 5802104 5783371 5791284 5826478 5889867 5981387 6099276 6240573 6402099 6580585 6771743
60044 6771743 6969591 7166860 7355837 7528922 7679245 7801589 7892723 7950492 7972696 7957280
60034 7957280 7903608 7813238 7689420 7536072 7357370 7158254 6945015 6724918 6504775 6289878
60024 6289878 6084337 5891986 5716334 5559832 5423871 5309547 5217932 5149705 5105268 5085355
60014 5085355 5090892 5122225 5179250 5262455 5373120 5512189 5679490 5874048 6094201 6336942
60004 6336942 6597656 6870563 7148617 7422941 7683557 7921480 8129759 8302747 8435718
59995 8435718 8525858 8572597 8576220 8536874 8455483 8334741 8178596 7991678 7780071 7551875
59985 7551875 7315997 7080685 6853422 6641196 6449759 6283033 6143814 6034480 5956497 5910060
59975 5910060 5894936 5910930 5956810 6029636 6125977 6243054 6377794 6525570 6681035 6839746
59965 6839746 6998101 7152461 7299492 7436938 7562867 7674354 7767960 7841457 7894494 7927958
59955 7927958 7943482 7943196 7929148 7903251 7868447 7829553 7792294 7762050 7744210 7745007 7770797 7826791
59943 7826791 7917363 8047247 8221418 8443992 8718042 9046275 9430993 9873387 10373188 10928295
59933 10928295 11533589 12179884 12854063 13539377 14214895 14855506 15433870 15923060 16298380
59924 16298380 16539472 16633607 16577993 16379021 16050183 15611025 15085945 14500919 13880096 13245010
59914 13245010 12615050 12006393 11430591 10895668 10408378 9974134 9595309 9271586 9002430
59905 9002430 8788164 8628830 8523500 8471027 8470358 8519909 8617650 8761867 8950659 9180320
59895 9180320 9444870 9736962 10048026 10367141 10680530 10972468 11226411 11426019 11556781
59886 11556781 11607713 11571952 11446865 11234959 10944514 10588209 10180711 9737408 9273889 8804539
59876 8804539 8341140 7893263 7469190 7075158 6714275 6387697 6096578 5841504 5620524
59867 5620524 5429665 5265405 5125046 5004703 4898936 4802816 4712844 4625591 4537424 4446519
59857 4446519 4353804 4261126 4169737 4081260 3998703 3925276 3862868 3812390 3774612 3749654 3736130
59846 3736130 3731523 3732906 3736761 3738707 3734246 3719855 3693427 3654381 3603751 3543774 3477161 3406989
59834 3406989 3336946 3270666 3210510 3157550 3112769 3077482 3052521 3037895 3033575 3039910 3057077 3084849
59822 3084849 3123194 3172495 3232836 3303339 3382146 3466720 3554545 3644333 3736292 3830423 3924740
59811 3924740 4015922 4101136 4177958 4242892 4291703 4321810 4333524 4329040 4311534 4285313 4255300
59800 4255300 4225533 4198835 4177990 4166100 4165504 4177555 4203917 4247124 4309590 4393239 4500613
59789 4500613 4635327 4801016 5000914 5239114 5521318 5853590 6240810 6686120 7190158
59780 7190158 7749159 8353057 8984038 9614510 10205614 10710220 11081967 11286548 11309929 11161021
59770 11161021 10868579 10473155 10017203 9537757 9063480 8614277 8201860 7831565 7504947
59761 7504947 7221196 6977329 6769306 6594218 6450909 6338281 6254078 6195883 6162284 6152363
59751 6152363 6164858 6198493 6252601 6326914 6421351 6536367 6672901 6831704 7013378 7219316
59741 7219316 7451916 7713712 8007046 8334717 8700035 9106043 9555521 10051826 10598690
59732 10598690 11198895 11853793 12563702 13327066 14138589 14988981 15866349 16756321 17640794
59723 17640794 18498869 19310916 20062096 20743384 21352440 21895449 22386980 22846721 23296466
59714 23296466 23759413 24258940 24814917 25440763 26143940 26927116 27786747 28710886 29679394
59705 29679394 30665592 31637102 32557051 33387523 34093821 34647224 35027163 35224246 35242243
59696 35242243 35096779 34812291 34419797 33954946 33454648 32953604 32482878 32069809 31737444
59687 31737444 31504135 31384627 31391614 31536096 31827300 32273370 32881795 33658420 34606175 35724486
59677 35724486 37007725 38441618 39999737 41642252 43315610 44951725 46468955 47777780
59669 47777780 48790124 49429195 49638936 49392868 48699542 47601396 46167674 44484688 42645511
59660 42645511 40739997 38846937 37029733 35334442 33788604 32401052 31163008 30049153
59652 30049153 29018647 28019410 26998083 25912645 24741859 23488242 22174644 20835833
59644 20835833 19508188 18222144 16999822 15855734 14797653 13827640 12944100 12143647
59636 12143647 11421487 10771487 10187196 9662685 9192202 8770026 8391505 8053467 7752908
59627 7752908 7486131 7249984 7042951 6863900 6710439 6579541 6469001 6377122 6301462 6238928
59617 6238928 6186495 6140730 6097155 6051295 6000082 5941377 5872675 5791472 5696668 5588778 5469160
59606 5469160 5339891 5203923 5064361 4923819 4785035 4651336 4525467 4408507 4300806
59597 4300806 4203346 4117182 4042297 3978244 3925335 3883932 3853036 3830975 3817274 3812627 3817139 3829649
59585 3829649 3848588 3872432 3899506 3928400 3958580 3989764 4020875 4050479 4078165 4104838 4131968
59574 4131968 4161260 4194664 4233838 4279828 4333793 4397526 4472502 4559065 4657365 4768386 4893225
59563 4893225 5032247 5186156 5357228 5548170 5760310 5994129 6250930 6532550 6839766
59554 6839766 7172318 7530078 7912755 8318634 8744774 9188005 9644288 10107427 10570011
59545 10570011 11025683 11469451 11896408 12302042 12683962 13041962 13376558 13689177 13983691
59536 13983691 14265464 14537621 14799220 15047767 15282873 15507281 15725330 15940391 16152062
59527 16152062 16354442 16537000 16687036 16790975 16834399 16803289 16686867 16479352 16179510 15790009
59517 15790009 15317804 14774149 14173358 13531525 12865833 12193381 11529158 10884559 10267230
59508 10267230 9681665 9130200 8614427 8135975 7695724 7292835 6925599 6593069 6294995
59499 6294995 6030342 5796979 5592817 5416175 5264951 5136533 5028862 4940886 4871873 4821131
59489 4821131 4788458 4773937 4777036 4796793 4833172 4887540 4961528 5056000 5171320 5308084 5467394
59478 5467394 5650877 5860473 6097798 6363638 6658177 6981171 7331218 7705034 8097796
59469 8097796 8503398 8913448 9316389 9698525 10045731 10343792 10578451 10737287 10812236 10799984
59459 10799984 10700788 10518366 10260678 9939247 9567199 9158312 8726894 8286395 7847376
59450 7847376 7417466 7002971 6609247 6239594 5895270 5576986 5285365 5019955 4779146
59441 4779146 4561511 4366346 4192731 4039055 3903590 3784624 3680083 3588240 3508958 3443083
59431 3443083 3390381 3349084 3317621 3295622 3282905 3278614 3281769 3291702 3307564 3328302 3353427 3382931
59419 3382931 3416221 3452132 3490325 3531744 3577260 3626745 3679993 3737806 3801356 3870499 3942776
59408 3942776 4014169 4081678 4146299 4213561 4290541 4382449 4492363 4623127 4777970 4959583
59398 4959583 5170000 5411153 5684115 5988164 6322680 6690728 7099691 7558021 8072274
59389 8072274 8646845 9284154 9983498 10739925 11544194 12382615 13236826 14085440 14907432
59380 14907432 15684428 16401064 17045758 17612426 18100677 18513639 18856203 19134973 19357521
59371 19357521 19529631 19653073 19726131 19745243 19705540 19600764 19424022 19169327 18833413 18417919
59361 18417919 17931193 17388247 16808924 16215735 15631557 15076516 14565141 14105836 13701933
59352 13701933 13351758 13047881 12778071 12527998 12283043 12028793 11752370 11444858 11102243
59343 11102243 10724416 10314520 9879248 9427922 8970086 8514136 8067776 7638116 7230601
59334 7230601 6848608 6494261 6168748 5871908 5602746 5360677 5145337 4955243 4787864
59325 4787864 4641096 4513500 4403191 4307958 4226511 4158129 4101010 4052666 4012224 3980663 3958394
59314 3958394 3944276 3937440 3938353 3947396 3964053 3988270 4021068 4063086 4113947 4173852 4244257 4326107
59302 4326107 4418751 4521432 4634411 4757653 4889650 5028433 5172521 5320069 5468439 5615441
59292 5615441 5759735 5899223 6030663 6152143 6264808 6371133 6472842 6571753 6671343 6775772
59282 6775772 6887908 7009327 7141369 7284801 7438719 7600437 7765840 7929217 8083677
59273 8083677 8222665 8340606 8431815 8490038 8509883 8487959 8422378 8312913 8163054 7981014
59263 7981014 7777555 7563090 7346799 7136557 6938131 6755119 6590589 6448001 6329913
59254 6329913 6237131 6170067 6129808 6116810 6129891 6167781 6230656 6318829 6430967 6564983 6719891
59243 6719891 6895473 7090926 7305330 7539045 7793533 8070344 8371519 8700530 9061588
59234 9061588 9457986 9891477 10362063 10866747 11398074 11944095 12489020 13013290 13494106
59225 13494106 13907644 14231653 14446855 14537890 14494854 14314510 14000345 13562485 13017834 12388850
59215 12388850 11700536 10977785 10244174 9520515 8822843 8162046 7545612 6978576 6462614
59206 6462614 5996123 5576470 5201321 4867488 4570418 4306183 4072728 3868032 3688322
59197 3688322 3529355 3388257 3262871 3150504 3048708 2956321 2872343 2794631 2720983 2650781
59187 2650781 2584424 2521893 2462902 2407523 2355606 2306457 2260103 2217857 2180564 2147344 2117155
59176 2117155 2090493 2068336 2050497 2036369 2026305 2020868 2019590 2021819 2028041 2039106 2054901 2074872
59164 2074872 2099024 2127343 2159178 2194334 2233792 2278272 2327100 2379561 2436171 2497385 2562361
59153 2562361 2630414 2702453 2779527 2861190 2946916 3037918 3135790 3240358 3350478 3465857 3586265
59142 3586265 3709969 3834894 3960565 4087046 4212734 4334941 4451838 4562013 4663061
59133 4663061 4752725 4831005 4899324 4958255 5008010 5050660 5089954 5129387 5172195 5222732 5285907
59122 5285907 5365524 5464856 5588285 5740384 5923527 6137990 6383796 6660367 6964429 7289792
59112 7289792 7628699 7971349 8304253 8610981 8874864 9080182 9212330 9260283 9220354 9096835
59102 9096835 8899408 8641374 8339556 8012745 7678316 7350113 7038561 6750830 6490698
59093 6490698 6259591 6057943 5884738 5736452 5608263 5496374 5398118 5310233 5228519 5148992
59083 5148992 5068142 4982493 4889304 4787475 4676669 4556212 4426104 4288240 4145043 3997637
59073 3997637 3847084 3696480 3549776 3409010 3274646 3148093 3031695 2926475 2831950 2748040
59063 2748040 2675215 2612819 2559129 2513083 2474230 2441130 2411391 2383005 2353908 2320695 2279949
59052 2279949 2230886 2175127 2114265 2049481 1983018 1917633 1854589 1794153 1737838 1687976 1645072
59041 1645072 1607753 1575281 1547997 1525265 1505385 1487925 1474162 1464846 1459404 1457501 1459419 1464709
59029 1464709 1472374 1482618 1496468 1513479 1531621 1549484 1566627 1581869 1593477 1601302 1606625 1609723
59017 1609723 1609752 1607235 1604366 1602529 1601759 1602894 1607650 1615966 1625680 1635725 1647374 1661593 1677375 1693641
59003 1693641 1710569 1727955 1744217 1758198 1770192 1780341 1787885 1793024 1797668 1803189 1808992 1814349
58991 1814349 1820034 1827109 1835572 1845218 1856462 1869377 1883228 1897759 1913726 1931504 1950496 1970496
58979 1970496 1992156 2015555 2039840 2065029 2092652 2123938 2158733 2196815 2238757 2284857 2334691
58968 2334691 2388323 2446517 2509115 2574594 2641644 2709638 2777125 2841704 2902183 2959441 3014700
58957 3014700 3068546 3122061 3177077 3234588 3294631 3358362 3428518 3507083 3594244 3690328 3796929
58946 3796929 3915298 4045398 4187554 4343321 4513885 4699277 4900221 5119227 5358845
58937 5358845 5620281 5904573 6213784 6550334 6916701 7316487 7754290 8233841 8757894
58928 8757894 9330626 9958321 10646840 11399925 12220527 13111536 14073672 15103756 16195332
58919 16195332 17338637 18518153 19711153 20889182 22019329 23063601 23979981 24727345
58911 24727345 25270779 25584386 25653464 25477228 25069068 24453142 23660809 22728930 21697190
58902 21697190 20603251 19479520 18353524 17248531 16182276 15166554 14209181 13315225
58894 13315225 12486282 11721080 11018303 10377512 9796820 9271921 8798449 8373278 7992371
58885 7992371 7649394 7337735 7052134 6787375 6537711 6299204 6070893 5852448 5642622
58876 5642622 5441315 5250935 5073838 4909932 4758205 4618760 4491846 4376651 4272658
58867 4272658 4180486 4099771 4027924 3962627 3904095 3853465 3810663 3775332 3747980 3728500 3715236
58856 3715236 3707242 3705878 3712540 3726479 3746575 3773559 3808668 3851745 3902502 3962080 4031447 4109770
58844 4109770 4196319 4292634 4400852 4521235 4653227 4797728 4956485 5130384 5320009 5526539
58834 5526539 5750546 5991433 6250034 6530398 6837124 7172270 7536820 7933807 8367889
58825 8367889 8843096 9363256 9933784 10560921 11249699 12003917 12826800 13719568 14679848
58816 14679848 15702498 16780268 17901246 19045919 20187739 21295266 22332576 23259841
58808 23259841 24037016 24628385 25005030 25147066 25047423 24713615 24164687 23427294 22534819
58799 22534819 21526321 20441544 19315606 18178206 17054839 15965507 14922992 13934655
58791 13934655 13005379 12137524 11329932 10579823 9885346 9244936 8655587 8113859 7617479
58782 7617479 7164060 6749400 6369032 6020308 5701128 5407967 5137282 4887635 4658257
58773 4658257 4446597 4249372 4064907 3892357 3729851 3575718 3430526 3295659 3170725
58764 3170725 3054389 2946718 2848539 2759390 2678217 2605226 2540992 2484656 2434822 2391235 2353728
58753 2353728 2320682 2290530 2263516 2240040 2218643 2197732 2177819 2159772 2142310 2123735 2104773
58742 2104773 2087094 2070269 2052771 2034708 2016833 1998036 1976756 1953905 1931553 1909508 1885940
58731 1885940 1860547 1834321 1806987 1777627 1747184 1717444 1687948 1656630 1623112 1588795 1554192
58720 1554192 1518870 1483607 1450032 1418408 1388128 1359885 1334874 1312398 1290787 1270225 1252236
58709 1252236 1236963 1223459 1212054 1203758 1197789 1192318 1187357 1184391 1183531 1183386 1183221 1182802 1180727 1175546
58695 1175546 1168097 1160206 1151416 1139453 1123498 1104696 1084116 1062643 1042184 1024318 1008252 992452
58683 992452 977524 965002 954403 944301 935341 929118 924882 920607 916660 915152 916107 917487 918583
58670 918583 920160 921669 921757 921381 923158 927608 933079 939251 947545 958084 969335 980652 992242 1002859
58656 1002859 1010823 1017255 1025168 1035363 1046295 1057691 1070943 1086018 1101474 1117616 1136278 1157422
58644 1157422 1179428 1202909 1230699 1263763 1300618 1341076 1386905 1438367 1493836 1553617 1620589
58633 1620589 1696160 1779009 1868813 1967890 2078157 2199853 2334596 2486728 2660227 2856820
58623 2856820 3078041 3326332 3602887 3906628 4235853 4588119 4957438 5333657 5704752
58614 5704752 6057074 6373344 6634133 6823153 6929824 6947823 6875513 6719281 6493499 6215569
58604 6215569 5902434 5570972 5237243 4913066 4605056 4317371 4052925 3811774 3591651
58595 3591651 3391165 3210176 3046827 2897264 2758976 2631702 2514732 2406361 2306569 2217261
58585 2217261 2139203 2071335 2013184 1964774 1923909 1886854 1852032 1819778 1788358 1754177 1716579
58574 1716579 1678567 1641862 1605022 1567471 1531551 1499046 1469146 1441312 1416883 1396381 1378137
58563 1378137 1360845 1344622 1328622 1310735 1290722 1270640 1251308 1231497 1211387 1193388 1178551
58552 1178551 1165566 1154374 1147273 1145131 1145793 1147439 1150445 1154883 1159402 1163660 1168746 1174333 1178568 1181324
58538 1181324 1184036 1185744 1183177 1175454 1164847 1152173 1135743 1115813 1095588 1076376 1056020 1033592
58526 1033592 1011328 990336 968754 945925 924231 904938 886386 868070 852234 839503 827271
58515 827271 814500 803825 796794 791280 785860 782360 781540 780578 777594 774692 773848 773689 773009 773550 776500
58500 776500 779911 782229 784780 788263 790548 790518 790375 791649 792713 792668 793692 796976 800412 802950 807066
58485 807066 814098 821384 827093 833741 843733 855577 867736 882128 900231 919586 937715 955691
58473 955691 974277 990217 1000062 1004301 1004315 998809 986783 970547 952328 931219 906778 881984 859269
58460 859269 837208 814511 793533 776360 761263 746662 734711 727114 721229 714287 707780 703687
58448 703687 700166 695245 691194 690758 692278 692868 693362 695896 699630 702964 707132 713641 720901 727034 733037
58433 733037 739770 745137 747756 749914 753386 756101 756621 757927 762732 769081 774773 782087 793637 807397
58419 807397 820472 834044 850031 866488 880921 894463 908207 919235 925006 927917 930846 932110
58407 932110 929656 926102 924357 922101 916039 907897 900875 893847 884536 874850 867576 861294 853935 847705
58393 847705 845071 843570 840202 837116 837222 838137 836528 834642 836199 839417 840498 840593 842867 845997 847025
58378 847025 847446 850115 853333 854393 855655 860614 867234 871727 875534 881886 888885 893056 896462 903111
58364 903111 911318 916778 920379 925811 932346 937031 941215 947747 954589 958336 961127 966880 973709 977355
58350 977355 979098 982790 987187 988829 989412 992524 996120 996204 995001 997392 1002207 1005214 1007773 1014048 1022465
58335 1022465 1028456 1033074 1040443 1049376 1056130 1062610 1073048 1085217 1093944 1100663 1110407 1121993 1130560
58322 1130560 1137448 1148062 1162044 1174857 1186908 1201875 1218254 1231902 1244579 1260705 1278240
58311 1278240 1292185 1304153 1318648 1333024 1341660 1347153 1356578 1369386 1379947 1389288 1402854 1419178
58299 1419178 1432509 1444457 1461226 1481447 1498725 1514201 1534318 1558014 1578503 1596052 1616558
58288 1616558 1639178 1658107 1675011 1696807 1722546 1745454 1766447 1792460 1822938 1851471 1879181
58277 1879181 1912659 1950126 1983866 2014997 2051421 2092542 2130794 2166979 2208855 2255642 2299379
58266 2299379 2340546 2386611 2436286 2481466 2523617 2571567 2624220 2672778 2719036 2773440 2835726
58255 2835726 2896051 2954846 3022458 3099254 3175570 3251526 3336793 3430362 3521170 3609510 3706877
58244 3706877 3813730 3918989 4022608 4136532 4262001 4388564 4516869 4658999 4814805
58235 4814805 4972183 5132529 5310835 5508677 5713056 5923893 6155518 6408712 6669687
58226 6669687 6939388 7234445 7556363 7890626 8239268 8621800 9040499 9479183 9940468
58217 9940468 10448224 11008578 11606699 12247468 12959124 13750693 14608569 15542095 16587556
58208 16587556 17760221 19051461 20482015 22106932 23960608 26055276 28445129 31231928
58200 31231928 34499631 38315973 42814992 48208864 54718793 62598780 72255195 84247181
58192 84247181 99154992 117562122 140149296 167589292 200270859 238270675 281408115
58185 281408115 328454004 375439609 414974610 438513595 440620917 421777239 387485250
58178 387485250 344956551 300297257 257565400 219011076 185523854 157079484 133226005
58171 133226005 113414949 97071540 83600509 72474358 63295415 55746330 49539018
58164 49539018 44444460 40319196 37063330 34581556 32804330 31711825 31308161 31586132
58156 31586132 32533162 34161453 36499200 39480893 42752010 45566696 47005689 46463908
58148 46463908 44000752 40223219 35860318 31455626 27339170 23695784 20582502 17953605
58140 17953605 15739831 13896374 12375072 11104314 10025336 9115048 8354032 7704910
58132 7704910 7139861 6657175 6251651 5896429 5570382 5276329 5016005 4772472 4532902
58123 4532902 4304900 4095296 3895000 3698871 3518746 3362733 3221521 3088101 2971322
58114 2971322 2877079 2794753 2714594 2640623 2574658 2505351 2425194 2342036 2262754 2181703 2095953
58103 2095953 2015689 1948290 1887166 1826756 1773451 1731273 1691577 1647648 1605465 1569803 1533519
58092 1533519 1490992 1448841 1413045 1378263 1340003 1304857 1278462 1255122 1229136 1204898 1186232
58081 1186232 1167124 1142646 1118227 1098771 1079269 1055336 1032547 1016051 1001135 983120 966712
58070 966712 956464 947585 935149 923135 915603 908120 896605 885679 879568 873571 863214 853209
58058 853209 848570 845071 837220 827748 820687 812797 800491 787910 779784 773267 764742 757659 755720 755340
58044 755340 752667 751153 754428 758597 759525 760961 767481 775835 781258 786097 794360 803719 810622 817440
58030 817440 826888 835139 838049 838648 841058 842640 839569 834635 831973 829373 823230 815870 810592 804629
58016 804629 794530 783509 775963 769529 759996 749422 741847 735495 726661 717161 710482 704652 696184
58003 696184 687258 681815 678308 673251 668154 665985 664570 660579 656465 656328 658360 658451 658032 661265 667446
57988 667446 673076 678564 686046 693389 697264 699695 704878 711808 716470 719044 722644 727074 730014 732266
57974 732266 735831 738828 738117 734905 732205 728929 722057 712371 702535 691884 678698 665158 654421
57961 654421 645159 634682 625015 619945 618297 616051 613089 611913 611697 609621 606455 605023 604675 602952
57947 602952 601143 602474 606113 608442 608950 609599 609817 607488 603594 600631 597707 592359 585787 581167 578116
57932 578116 573960 569062 565709 563069 558488 552594 547986 544170 538956 533604 531297 531550 531374 530980 533086
57917 533086 537492 541590 545561 551872 560201 567819 574533 582489 591632 600090 608420 618765 630317 640205
57903 640205 648269 656387 663805 667852 668709 668871 668454 665582 660718 655940 650551 642152 631601 622153 614147
57888 614147 605225 595364 586842 579511 570983 561530 554134 549537 545700 542144 540420 540276 539793 539407 541397
57873 541397 545345 548472 550600 554404 560556 567021 573433 581748 591989 601477 608990 615928 622931 629002
57859 629002 634203 639448 643441 643651 640655 637776 636166 633882 629935 625462 620751 614932 608834 604398
57845 604398 601023 596175 589728 583945 579192 573627 567280 562296 558744 554220 548142 542510 537849 532321
57831 532321 525539 519415 514430 508726 501648 494638 487911 479775 469977 460320 451318 441663 431626 423474
57817 423474 417795 412747 407526 403240 399842 395743 391060 387814 386209 384183 381278 379468 379486 379842 380237
57802 380237 382398 386658 391126 395243 400819 408659 417445 426835 438342 452057 465592 477165 486843
57789 486843 494174 497949 499087 500458 502922 504642 504866 505004 505241 503694 499947 496026 492836 489015 484265
57774 484265 480351 477690 474507 470566 468295 468805 470149 470974 472577 475863 479470 482570 486395 491334 495396
57759 495396 497227 497908 498305 497351 494370 490436 486136 480661 474327 469239 466341 464594 464007 466265 471252
57744 471252 476290 480332 485585 493438 502054 509762 517588 526486 535219 543098 551884 562816 574499 585812
57730 585812 598168 612701 627888 642283 657221 674494 693508 712867 732670 753264 773915
57719 773915 794762 818020 845204 875096 906308 939767 976865 1017221 1060211 1106727 1157579
57708 1157579 1212144 1270529 1335193 1408546 1490801 1581886 1683587 1798043 1926135 2069258
57698 2069258 2230841 2414200 2620550 2850790 3107265 3391663 3702513 4036135 4387955
57689 4387955 4750700 5112484 5458232 5771786 6035862 6232849 6349000 6378413 6323252 6192406
57679 6192406 6000836 5767398 5510504 5245981 4988634 4752697 4548824 4382526 4256997
57670 4256997 4175538 4139610 4145287 4180853 4224475 4244441 4208335 4098660 3920922 3696733 3451254
57659 3451254 3206476 2979362 2779515 2608562 2464496 2346060 2251926 2178532 2121985 2080843
57649 2080843 2054848 2042585 2042617 2055247 2080859 2118159 2166237 2226766 2301906 2391765 2496178 2617263
57637 2617263 2757811 2918747 3100616 3305839 3536677 3792040 4068536 4363103 4671631
57628 4671631 4985583 5292149 5576873 5824411 6018554 6144938 6194498 6163955 6055141 5876019
57618 5876019 5640658 5365201 5063780 4748877 4432898 4126174 3834281 3559542 3304244
57609 3304244 3070376 2857626 2664264 2489406 2332499 2191629 2064419 1949774 1847020
57600 1847020 1754495 1670839 1596362 1531128 1473003 1419620 1370942 1327767 1289050 1252978 1219412
57589 1219412 1189028 1161283 1135511 1112735 1093949 1077857 1062642 1048721 1037234 1027136 1016594
57578 1016594 1006192 997888 991651 985990 981112 978598 978371 978785 979586 982344 987989 996095 1006375 1018855
57564 1018855 1032901 1047931 1064601 1083483 1103447 1123386 1144655 1169575 1198357 1229782 1264096
57553 1264096 1302740 1345962 1393186 1445187 1503508 1568353 1639577 1719176 1810273 1914112 2030583
57542 2030583 2161087 2308186 2472689 2653731 2851393 3066453 3297492 3540491 3790740
57533 3790740 4042212 4284922 4505668 4691814 4832590 4917736 4938863 4893666 4787105 4628179
57523 4628179 4427468 4197259 3950611 3698531 3449022 3208553 2982195 2772186 2578628
57514 2578628 2402092 2243841 2103677 1979824 1871158 1777464 1697500 1629063 1571131 1523702
57504 1523702 1485376 1453567 1427494 1408577 1397341 1392193 1391831 1396527 1406237 1419646 1436081 1456523
57492 1456523 1481785 1511471 1545614 1585775 1633546 1689264 1752966 1825425 1907735 2001028 2107025
57481 2107025 2227715 2364283 2517381 2688225 2877842 3085157 3307165 3540555 3781135
57472 3781135 4021356 4250045 4454708 4622732 4741288 4799399 4791792 4719871 4589186 4407899
57462 4407899 4187483 3941792 3683555 3422486 3166602 2922918 2695806 2486384 2294596
57453 2294596 2120778 1964719 1824939 1699888 1588765 1490535 1403390 1325809 1257117 1196511
57443 1196511 1142586 1094214 1050950 1012391 978042 947674 920768 895805 871415 848001 826874
57432 826874 808110 790735 774609 760292 747342 734649 722385 711656 702289 693005 683813 676124
57420 676124 670303 665142 660033 655663 652245 649078 646160 644226 642860 640655 637694 635813 635865 636710 637424
57405 637424 638526 640448 642673 645017 647876 650776 652541 653364 654703 656754 658210 658994 660861 664546 668606
57390 668606 672001 675503 679555 683027 685403 688131 692401 697346 701734 705744 709866 713694 716992 720372
57376 720372 723852 726262 727156 727774 729242 731396 734146 738092 742810 746498 748508 750376 753227 756132 758294
57361 758294 760767 764442 768244 771149 774296 779275 785726 792423 799359 806972 814531 821176 827568 834814
57347 834814 842600 849976 857168 865034 873463 881714 889761 898009 906282 914222 922134 930481 939187 948159
57333 948159 957724 967848 977876 987736 998280 1009690 1020770 1030622 1039843 1049238 1058750 1068601 1079998
57320 1079998 1093480 1107831 1121850 1135987 1151131 1167028 1183172 1200052 1218130 1236563 1254257
57309 1254257 1271410 1289026 1307796 1328312 1351195 1376007 1401191 1426091 1451854 1479477 1508314
57298 1508314 1537541 1567637 1599253 1632083 1666180 1702923 1743157 1785674 1828948 1873141 1918969
57287 1918969 1965993 2013661 2062759 2113829 2165039 2213419 2257595 2297822 2333978 2365007 2389720
57276 2389720 2406881 2415229 2414644 2406714 2393227 2374991 2353009 2329459 2306274 2283942 2262882 2244673
57264 2244673 2230564 2220175 2213161 2210717 2213720 2220792 2230093 2241754 2256551 2273428 2290671 2308668
57252 2308668 2329207 2352585 2377512 2403374 2430526 2458785 2487611 2517533 2549532 2583261 2617526
57241 2617526 2652135 2687589 2723361 2758428 2793284 2829689 2868467 2909018 2950763 2993512 3036656
57230 3036656 3079535 3122442 3165857 3209013 3250706 3291157 3331517 3371826 3411110 3449212 3486910
57219 3486910 3524440 3561571 3599029 3638156 3679063 3720628 3762455 3805436 3850294 3896821 3944641
57208 3944641 3993486 4042649 4091239 4139080 4186499 4233503 4280044 4326562 4373085 4418322 4461065
57197 4461065 4502201 4543944 4587305 4631606 4676188 4721131 4766421 4811832 4857655 4904290 4951275
57186 4951275 4997917 5044738 5092929 5142414 5191779 5240236 5288460 5337436 5387566 5438979 5491712
57175 5491712 5545526 5600390 5657070 5716380 5778015 5840896 5904331 5967943 6030893 6092286 6152137
57164 6152137 6210976 6268752 6325111 6380342 6435057 6489257 6542697 6595861 6649473 6703271 6756192
57153 6756192 6807557 6857442 6906370 6955477 7006328 7059540 7113957 7167910 7220554 7271168 7318099
57142 7318099 7359639 7395279 7425005 7448059 7463606 7471944 7473846 7469500 7459517 7446471 7434162 7425752
57130 7425752 7423663 7430609 7449358 7481682 7528263 7588884 7661711 7743049 7828839 7915889 8001296 8082193
57118 8082193 8157467 8228884 8299609 8372651 8451468 8540334 8642621 8759846 8893686 9047803
57108 9047803 9226825 9435280 9678911 9965592 10303994 10703451 11176906 11742648 12422515
57099 12422515 13241027 14227988 15420106 16859421 18593522 20678783 23179661 26161834
57091 26161834 29686259 33805168 38551057 43920264 49867316 56311553 63134553 70165501
57083 70165501 77191303 84011422 90487278 96519402 101969087 106617455 110213088 112555517
57075 112555517 113534135 113111137 111295637 108140382 103751134 98290285 91969799 85034293
57067 85034293 77736645 70315382 62982593 55918828 49266686 43124841 37549921 32564853
57059 32564853 28166075 24328306 21010938 18165270 15738662 13676627 11926480 10441011
57051 10441011 9178838 8103165 7182424 6391188 5708562 5116231 4599013 4145549 3746453
57042 3746453 3392791 3077518 2796636 2546969 2324071 2123816 1944275 1784008 1639969
57033 1639969 1509093 1390605 1284697 1190064 1104675 1027720 958807 896355 838797 786365 739801
57022 739801 698250 660255 625880 595971 570110 546969 525917 506868 489626 474919 464899
57011 464899 460860 461547 465419 473534 488540 512026 544984 590032 651108 731437 833741 962196
56999 962196 1122010 1314858 1531965 1748518 1925325 2022303 2017808 1918539 1752005 1550741
56989 1550741 1341968 1144998 970786 822419 698628 597833 518500 457405 409963 371578
56979 371578 337142 300838 259146 213469 167808 124608 84691 49755 21951 1432 -13258 -22704
56967 -22704 -26618 -25764 -21556 -14019 -2262 13388 31858 53522 79905 111474 147641 188220 232142
56954 232142 274550 307601 324985 324779 308674 280723 246686 212093 179902 150940 126199 106974
56942 106974 93023 82751 75593 72662 74844 81842 93364 109878 131870 159538 193371 233971
56930 233971 280888 331817 382090 424267 449767 453216 435548 402243 359411 312378 266048 223806
56918 223806 186260 152834 124204 101541 84199 70207 58558 49041 40490 31610 23262 17672
56906 17672 15361 14866 15382 17511 21372 26090 31404 37936 45681 54036 63453 75283 89832 106220
56892 106220 124181 144367 166923 191553 219001 250578 286103 323868 362338 399790 432180
56881 432180 453780 460765 453028 432759 403284 369377 336167 306535 280685 258485 240726 228036
56869 228036 220537 219064 225141 239289 260947 290401 329280 378820 439230 510954 594474 687375
56857 687375 782036 866367 926668 951710 937627 890404 822548 746560 671454 603369 546070
56846 546070 500214 464543 438879 424668 422590 431686 451471 483248 528919 590051 668361 765391
56834 765391 881264 1014873 1163960 1321102 1468501 1580281 1633886 1620847 1548317 1433273
56824 1433273 1295758 1153617 1019010 898174 794010 707947 639626 587069 548610 523830
56814 523830 512355 513292 526617 553772 596003 653207 725010 811624 912251 1022184 1130533
56803 1130533 1219925 1270559 1269156 1216731 1127323 1018877 905656 797197 699600 615364 543918
56792 543918 484373 437122 402312 378559 364239 358774 361891 373151 392944 422351 461240 508033
56780 508033 561694 621411 682614 735090 767214 772016 749272 703906 643929 578215 513658 453794
56768 453794 399966 352795 312229 277649 248795 225561 206655 190010 175048 162964 154127 146957
56756 146957 140120 134098 129548 125786 122054 118784 116447 114412 112071 109830 108044 106126 103593 100807
56742 100807 97917 94385 90231 86344 82900 79026 74706 71303 69389 67805 65795 64246 63776 63419 62385
56727 62385 61331 60684 59551 57588 56148 56083 56173 55279 54391 54788 55737 55836 55324 55290 55734 56078 56467 57067 57154
56708 57154 56370 55717 55912 55955 54800 53159 52156 51513 50642 50203 50805 51339 50529 49178 49120 50696 52909 55238
56690 55238 57780 60338 62887 66143 70315 74162 76661 78644 81393 84544 86836 87949 88204 87465 85786
56675 85786 84182 83289 82225 80192 78108 77107 76530 75007 72597 70226 67956 65487 63518 62967 63534
56660 63534 64453 65785 67578 68746 68346 67017 65726 64107 61522 58575 55955 52967 48951 44935 41997
56645 41997 39098 34601 28969 23958 20087 16950 15074 15153 16118 16259 15738 15869 16443 16023 14648 14043 15151
56628 15151 17264 19551 21749 23450 24356 25164 26763 28721 29858 29973 29820 29919 30651 32764 36295 39715
56612 39715 41667 42852 44726 47202 49312 51251 53833 56562 58097 58216 57735 57064 56405 56584 57996 59473
56596 59473 59880 59978 61002 62376 62817 62733 63400 64570 65125 65422 66753 69040 71183 73176 75737 78473 80545
56579 80545 82535 85422 88381 89993 91022 93439 97156 100367 102899 106569 112178 118677 125477 133238
56565 133238 142137 151521 161454 172569 184319 195319 205489 215928 226815 237386 247781 258711
56553 258711 269443 278281 285011 290779 295691 298703 299761 299762 298496 294924 289500 283844 278026 270500 260940
56538 260940 250906 241513 232544 223945 215974 207839 198431 188555 180219 173631 167167 160338 154411 149908
56524 149908 145893 141937 138466 134967 130298 125029 121075 118692 116229 113125 110634 109185 107588 105448
56510 105448 103969 103753 104045 104632 106149 108115 109011 108838 109234 110680 112001 113027 115042 118017 120039 120263
56494 120263 119998 120114 119934 119398 119702 120893 121319 120453 119861 120533 121590 122486 123944 125856 126866 127084 128544
56477 128544 131827 134817 136132 137195 139464 142078 143914 145726 148541 151843 154837 157702 160272 161447
56463 161447 161216 161374 162988 164983 166373 167866 170041 171979 173053 174110 175557 176235 175550 174845 175282 176161
56447 176161 176632 177225 178363 179120 178774 177998 177424 176645 175584 175003 174695 173137 169960 166723 164261 161366
56431 161366 157186 152692 148608 144104 138897 134439 131567 129037 125832 122935 121485 121117 121403 122888 125424
56416 125424 127598 129084 131365 134896 137955 139665 141665 145087 148325 149633 149690 149739 149472 148784 149394 152497
56400 152497 156661 160021 162859 166142 169417 172055 174798 178163 181054 182744 184477 187372 190528 192961
56386 192961 195488 198963 202580 205746 209685 215280 221232 226115 230192 233291 233153 228292 220590 212769
56372 212769 205070 196639 188366 181771 176576 171721 167573 165042 163787 163124 163382 164652 165785 166366 167914
56357 167914 171348 175055 177343 178953 181214 183634 185425 187530 190908 194529 197259 200083 204333 209343
56343 209343 213927 218599 224335 230759 237438 245184 254212 262861 270110 277346 285819 294519 302556 311248
56329 311248 321520 331566 339553 346461 353812 360848 366578 372201 378698 384266 387100 388560 390597 392184
56315 392184 391532 389792 389183 389140 387629 384806 382238 379951 377303 375291 375009 375274 374624 374129 375415 377656
56299 377656 379458 381848 386286 391648 396414 401903 409905 418972 426752 434252 444020 455656 467033 478531
56285 478531 492071 507172 521986 537279 555380 575963 596754 617876 641720 668977 698309
56274 698309 729601 764154 802087 842771 887393 938018 994635 1056108 1123400 1198866 1283205
56263 1283205 1376115 1479176 1594995 1724193 1866135 2021716 2192413 2377421 2574612 2783309
56253 2783309 3003248 3231808 3464998 3699873 3933114 4158740 4370239 4563534 4735131
56244 4735131 4879593 4992555 5074576 5128581 5155550 5156468 5136226 5100963 5053044 4992888 4923950
56233 4923950 4851043 4774972 4693441 4606089 4513840 4414402 4303537 4180388 4047072 3903743
56223 3903743 3748806 3583648 3412538 3238000 3060494 2882196 2706760 2535618 2368564
56214 2368564 2207480 2055488 1913108 1779381 1655844 1545030 1445905 1355203 1272406 1198958
56204 1198958 1133621 1073484 1018702 971412 930677 893427 859557 831044 806776 783483 761198
56193 761198 742621 727653 713824 701479 693047 687594 681709 675514 672271 672289 672812 673680 677300 683077
56179 683077 687712 691093 696098 702467 706841 709088 712603 717891 721784 723471 725387 727541 726920 723224
56165 723224 719471 716390 711988 706998 704646 704558 703155 700630 701144 705462 709981 713909 720587 730530 740076
56150 740076 748540 760037 776382 794594 813315 835430 862444 892508 925978 967006 1017819 1077343
56138 1077343 1147051 1232001 1334202 1450729 1579522 1720464 1869005 2015235 2151421 2274872
56128 2274872 2382760 2471559 2543647 2607427 2668255 2724883 2775604 2820393 2855320 2872868 2871088
56117 2871088 2856171 2834065 2806232 2774780 2743073 2708087 2659763 2591502 2505030 2403292 2286765
56106 2286765 2159675 2031621 1909031 1791719 1680475 1580206 1492547 1413248 1340404 1277666
56096 1277666 1226144 1181165 1140459 1107435 1082749 1060926 1039232 1021720 1010486 1001208 991421 984805
56084 984805 982963 981414 978204 977968 982812 987733 989858 993573 1001567 1009573 1015160 1022916 1035426 1047829
56070 1047829 1056905 1066841 1080345 1092890 1101670 1111466 1125633 1140047 1151951 1165776 1184001 1201395
56058 1201395 1214777 1229328 1248670 1267939 1283430 1299659 1319877 1339069 1353678 1368775 1388264
56047 1388264 1407602 1423823 1442928 1469298 1497476 1522546 1548917 1580579 1612628 1641050 1671024
56036 1671024 1706766 1743036 1775426 1809016 1848075 1887585 1924007 1963784 2011857 2062479 2110735
56025 2110735 2161827 2219190 2275126 2323706 2371342 2424009 2476032 2522582 2570942 2627692 2687067
56014 2687067 2743924 2805701 2879212 2958333 3037271 3122774 3220150 3320884 3417784 3518509 3630135
56003 3630135 3744905 3856077 3972842 4103929 4241599 4378112 4522353 4683150 4852199
55994 4852199 5021384 5200537 5399419 5609029 5820118 6042672 6286731 6542281 6799835
55985 6799835 7072268 7373677 7695987 8030040 8389442 8788379 9217153 9666456 10153888
55976 10153888 10698378 11291628 11924931 12619814 13400220 14260268 15193730 16227978 17392543
55967 17392543 18684523 20105738 21703013 23529634 25603300 27951141 30659681 33830405
55959 33830405 37532190 41861076 47005866 53199509 60676943 69774491 81019071 95036040
55951 95036040 112443902 133922558 160229907 191950733 229320458 272380715 320717399
55944 320717399 371945342 419997109 455787297 471087201 462873745 434501790 393128107
55937 393128107 346103559 298938670 255048260 216145801 182684734 154381639 130703338
55930 130703338 111065737 94831899 81374733 70191955 60899502 53147484 46623611
55923 46623611 41111047 36461988 32523937 29146233 26233475 23729681 21563112 19656304
55915 19656304 17972138 16499086 15203526 14039899 12992768 12065423 11238804 10481053
55907 10481053 9785716 9162602 8601399 8079685 7596639 7164607 6776130 6411383 6069743
55898 6069743 5763234 5486538 5222938 4972877 4748468 4546143 4351451 4164740 3996345
55889 3996345 3842189 3689005 3538446 3402184 3278164 3154632 3032818 2923167 2823462 2722487
55879 2722487 2621574 2531580 2452033 2373292 2296031 2229066 2170912 2112109 2052883 2000571 1952806
55868 1952806 1900995 1847424 1801419 1761352 1717539 1670467 1629498 1595928 1563676 1534455 1515983
55857 1515983 1506827 1498520 1491011 1490888 1495917 1496154 1488962 1478794 1464049 1438734 1405693 1373845 1343351
55844 1343351 1307166 1265936 1227477 1192616 1155292 1115897 1080950 1050068 1016574 980810 949928
55833 949928 924667 899066 873197 853437 839757 825239 808834 796618 789565 781779 771893 764859
55821 764859 761196 755257 745570 736756 730230 722855 715478 712868 714425 714556 712771 713794 717327 717596 713588
55806 713588 710007 707359 700861 690143 680581 673840 666184 657081 650400 645992 638903 628011 616913
55793 616913 605579 589903 570417 552711 538168 522816 506171 492505 482366 471533 459627
55782 459627 451162 446823 442162 436365 433855 435596 436950 435687 434023 431291 422841 408129 392129 377052
55768 377052 360414 342672 328581 319057 309651 299104 291546 288112 284322 278237 273567 272096 270492
55755 270492 267303 265804 267052 267191 264577 262841 263901 264473 262348 259765 257724 253301 245625 238490 234137
55740 234137 230142 225067 221384 220157 218562 215351 213254 213448 213269 211821 212168 215409 218174 218522 218669
55725 218669 219277 216787 209503 200983 194451 188826 183005 178945 177551 176329 173987 172863 174315 176364
55711 176364 178172 181990 188294 193975 197957 203720 213585 225218 236379 248320 261650 273436 281327
55698 281327 286412 289473 288705 283650 277121 270742 262781 252672 243231 236022 228980 221087 214975 212365
55684 212365 211290 210401 211628 215961 220941 225026 230242 237872 245699 252155 258874 266489 272117 273973
55670 273973 274439 275713 276403 275155 273667 273260 272368 270198 268920 269482 269290 266890 264933 265439 266109 264548
55654 264548 262325 261424 260295 256814 251951 247206 241482 233592 224855 216287 206263 193753 180894 169598
55640 169598 158761 147453 137641 130840 125172 118597 112082 106906 101971 96502 92325 90636 89514 87299
55626 87299 85367 84922 84220 81823 79502 79045 79177 78433 78057 79172 80077 79216 77960 77729 77256 75404 73631
55609 73631 72970 71667 68590 65809 64899 63906 61021 58056 57084 56743 55217 53905 54693 56342 56901 57051
55593 57051 57814 57742 55687 53714 53868 54666 54058 53219 54032 55414 55593 55523 56583 57400 56403 55104 55330 55667
55575 55667 54197 52388 52573 53851 54139 54060 55110 56177 55668 55063 56494 58735 59379 59091 59787 60533 59330
55558 59330 57419 57662 59888 61743 63014 65263 68154 69876 70501 71537 72964 73852 75012 77963 82185
55543 82185 86287 90675 96179 101491 105115 108476 113725 119803 124075 126691 129875 133898 137254 139923
55529 139923 143020 145924 146977 146440 145707 144383 141151 136711 132755 128765 122916 115443 108075 100818 92268
55514 92268 82447 72390 61643 49190 36195 24922 15499 6619 -1293 -6552 -9229 -10871 -11813
55501 -11813 -11583 -11301 -12720 -15354 -17302 -18387 -19784 -21218 -21358 -20475 -19872 -19242 -17311 -14615 -12852 -11971
55485 -11971 -10605 -8924 -8395 -9096 -9900 -10829 -12721 -15073 -16722 -18076 -20128 -21965 -21896 -20340 -18962 -17686
55469 -17686 -15343 -12562 -11045 -10436 -8860 -6184 -3956 -2497 -808 970 1776 1969 2797 3879 3829 2999 2890
55452 2890 3303 2818 1696 1492 2096 2013 1340 1626 2938 3791 3859 4129 4524 4037 3047 2894 3329 2995 2225
55433 2225 2643 4139 4861 4189 3194 2319 1065 -164 -401 -62 -179 -170 1170 3093 4013 4570 6491 8950
55415 8950 9357 7650 6518 7244 8473 9321 10627 12696 14671 16582 19389 22639 24665 25305 25892 26597
55399 26597 26473 25993 26571 27500 26475 23404 20654 19194 17585 15208 13301 12104 10106 7074 4992
55384 4992 4987 5789 6118 6112 5682 4002 1505 40 241 857 1126 1561 2081 1901 1638 2860 5031 5698 4315
55365 4315 3177 3800 5087 5896 6690 7604 7486 6024 4526 3593 2249 196 -1361 -2007 -2834 -4038 -4173
55348 -4173 -2765 -1418 -1306 -1689 -1767 -1862 -2004 -1514 -748 -1038 -2217 -2522 -1609 -1184 -1874 -2129 -1138 -243 -329
55329 -329 -342 361 660 -45 -512 23 477 109 -40 722 1321 904 235 -113 -879 -2195 -2688 -1797 -951 -1183 -1594
55308 -1594 -1422 -1486 -2211 -2294 -931 550 803 485 758 1476 2244 3583 5641 7323 7943 8236 8698 8681 8161
55289 8161 8527 10355 12189 12696 12313 11735 10690 9348 8928 9631 9900 8937 7981 7868 7465 5973 4636
55272 4636 4569 4919 4847 5354 7293 9389 10041 9504 8625 7184 5240 4365 5565 7429 8159 8037 8154 8225
55254 8225 7523 6656 6533 6774 6770 7055 8037 8725 8386 8111 9025 10311 10744 10786 11263 11304 9706 7304 5912
55235 5912 5685 5434 4839 4518 4502 4253 3770 3316 2670 1877 1941 3495 5552 6802 7326 7920 8632 9157 9738
55216 9738 10498 10845 10657 11059 12886 15385 17455 18984 19957 19713 18399 17729 18766 20235 20482 19818 19382
55199 19382 19019 18089 17209 17283 17676 17146 15879 15001 14721 14543 14613 15359 16339 16823 16996 17393 17775 17620 17067
55180 17067 16395 15429 14314 13847 14096 13925 12856 11982 11894 11294 9166 6804 5985 6443 6940 7594 9213 11296
55162 11296 12623 13088 13289 13070 12103 11112 10936 11109 10816 10424 10626 11007 10897 10678 10810 10633 9741 9325 10399
55143 10399 11828 12030 11610 12276 14023 15430 16032 16377 16406 15829 15564 16769 18813 20082 20410 20894 21741
55126 21741 22132 21937 21794 21742 21411 21233 21843 22623 22440 21525 21054 21273 21574 21935 22639 22994 22111 20691 20405
55107 20405 21708 23722 25913 28331 30527 31873 32730 33836 34861 35027 34745 35101 36131 37130 38195 39826
55091 39826 41481 42215 42383 42910 43293 42235 40106 38827 39296 40647 42073 43661 45245 46166 46471 46957
55075 46957 47765 48167 47865 47370 47014 46691 46450 46339 45906 44977 44488 45278 46517 46746 46056 45739 46153 46513 46544
55056 46544 46666 46698 46007 44925 44439 44482 44072 43132 42729 43389 44623 46160 48246 50547 52020 52110 51114 49418
55038 49418 47445 46063 45846 46072 45590 44438 43487 42879 42151 41548 41813 42944 44415 46253 48495 50060
55022 50060 49783 48259 47075 46547 45825 44911 44697 45104 45003 44095 43169 42418 41148 39333 37885 37137 36531
55005 36531 35899 35622 35438 34638 33602 33605 34922 36504 37698 38856 40099 40992 41673 42873 44508 45606 45908
54988 45908 46242 47005 47594 47619 47490 47470 47280 46931 46936 47491 48301 49261 50404 51377 51975 53001 55458 59060 62621
54969 62621 65637 68389 70964 73533 77177 82979 90534 98748 107674 118120 130012 142892 157552
54956 157552 175176 195070 215197 234704 253850 271436 284552 291230 291552 286057 275119 260218
54944 260218 243693 226585 208455 189743 172455 157856 145272 133785 123514 114555 106285 98467
54932 98467 91746 86482 82374 79508 78337 78306 78040 77332 77430 79006 81331 83878 87190 91796 97804 105852
54916 105852 116769 129898 143479 157124 172203 189256 206872 223650 239314 252987 262316 265574
54904 265574 263312 256957 247116 234126 218973 202646 185579 168434 152343 137860 124757 113187
54892 113187 103710 95860 88306 80991 75497 72575 70876 68874 66545 64371 62228 60183 59032 59045 59353
54877 59353 59347 59455 59819 59474 57665 54882 51911 48983 46436 44928 44391 43924 43236 42979 43282 43390 43096 43018
54859 43018 42998 41958 39876 38175 37474 36682 35033 33238 31834 30312 28824 28839 30894 33401 34882 35769
54843 35769 36804 37395 36932 36197 36005 35875 35364 35301 36311 37503 38041 38709 40481 42774 44515 45813 47203
54826 47203 48449 49430 50980 53424 55431 55803 55284 55197 55475 55613 56399 58905 62583 66055 69219 73126
54810 73126 78345 84748 92315 100919 109935 119219 129825 142760 157760 174182 192045 211076 229736
54797 229736 246434 260732 272264 279584 281498 278577 271981 261797 248007 232135 216336 201528
54785 201528 187758 175563 165453 156749 148463 140753 134212 128482 123011 118462 115818 114645 113719 112880
54771 112880 112822 113559 114552 115964 118427 121893 125975 131116 138195 147358 158280 171137 186221 203074
54757 203074 221063 240221 260423 280312 298164 313232 325156 332797 335046 332296 325898 316700
54745 316700 305213 292504 279543 266148 251769 236802 221996 207231 192206 177760 165162
54734 165162 154542 145221 137022 130045 123791 117851 112854 109420 106750 103590 100012 96903 94354 91992
54720 91992 90279 89865 90125 89850 88961 88152 87358 86122 84918 84452 84125 82916 81398 81063 81935 82677 82911
54703 82911 83544 84839 86032 87052 88755 91104 92805 93259 93382 93986 94690 94985 95158 95587 96097 96556 97251
54686 97251 98319 99496 100682 102013 103301 104150 104673 105299 105942 106183 106222 106762 107921 109077 109824 110381 111161
54669 111161 112631 115338 119322 123764 128027 132666 138566 145485 152443 159137 165895 172620 178949 185184
54655 185184 191815 198328 203699 207902 211735 215242 217580 218438 218498 218419 218476 219237 221509 225450 230563 236614
54639 236614 243791 252047 261094 270777 280540 288741 293470 293998 290662 283724 273359 260438 246231 231441
54625 231441 216442 202144 189608 178977 169740 161677 154697 148198 141750 136015 131905 129262 127480
54612 127480 126929 128399 131482 134830 137804 140685 143669 146889 150988 156273 161711 166114 169838 173814
54598 173814 177451 179251 179142 178280 176782 173613 168764 163562 158597 153203 147328 142057 137802 133636 129008
54583 129008 124624 120982 117423 113237 108559 103735 98895 94446 90807 87432 83372 78964 75624 73786
54569 73786 72493 71260 70745 71094 71192 70251 68778 67353 65705 63709 62122 61564 61697 62008 62488 63102 63449
54552 63449 63397 63236 62968 62346 61729 61798 62331 62401 61956 61947 62685 63463 64134 65707 68888 73200 77978 83040 88013
54533 88013 92269 96014 100252 105261 110247 114875 119833 125395 130680 134842 137819 139457 139187 137067 133861
54518 133861 129647 123645 115981 108228 101564 95705 90278 85816 82584 79785 76930 74802 74112 74220 74096
54503 74096 73580 72836 71591 69789 68146 67163 66414 65534 65028 65387 66281 67340 68820 70764 72386 73067 73216
54486 73216 73503 74070 75067 76967 79621 81935 83204 83965 84879 85733 86262 86975 88333 89930 91288 92645
54470 92645 94182 95310 95535 95247 94886 94084 92451 90489 88926 87691 86248 84406 82295 80161 78579
54455 78579 78082 78129 77349 75349 73317 72290 71886 71410 71103 71356 71622 71159 70186 69370 68764 68025 67137 66246
54437 66246 65312 64507 64298 64661 64887 64717 64772 65355 65734 65362 64963 65645 67585 70198 72851 74881 75788 76032
54419 76032 76823 78541 80184 80896 81081 81463 82116 83104 84905 87409 89528 90683 91682 93331 95244 96897
54403 96897 98694 100995 103217 105034 107452 111476 116618 121877 127314 133408 139764 145825 152112 159430
54389 159430 167407 175088 182353 189471 195785 200200 202625 203753 203826 202668 200474 197398 192816 186225 178506
54374 178506 171072 164109 156841 149256 142300 136475 131427 126951 123305 120433 117753 114902 112017 109242
54360 109242 106543 103974 101681 99708 98140 97146 96582 95998 95388 95360 96177 97305 98420 100078 102785 106181
54344 106181 109827 113985 118797 123446 127106 130131 133527 137857 143374 150385 158530 166438 173115 179033
54330 179033 184886 190027 193263 194548 194669 193799 191548 188088 184034 179449 173959 167626 160817 153538 145744
54315 145744 137928 130628 123765 117186 111285 106213 101125 95162 88747 83022 78577 75524 74083 74019 74137
54300 74137 73389 71975 70497 68806 66686 64796 63698 62743 61232 59894 59744 60236 60065 59216 58603 58227
54284 58227 57413 56455 56323 56943 57446 57847 58801 59854 59812 58867 58563 59412 60298 60563 60982 62106 63195 63543
54266 63543 63629 64201 65168 66034 66656 67107 67483 68130 69339 70669 71310 71148 70669 69883 68362 66402 65072 64848
54248 64848 65181 65573 66109 66699 66788 66211 65490 64952 64275 63230 62195 61640 61596 61767 61728 61041 59754 58703 58787
54229 58787 60028 61751 63273 63858 62689 59943 57443 57037 58533 60261 61302 61947 62292 61933 61073 60547
54213 60547 60530 60384 59944 59744 59808 59469 58629 58023 57946 57852 57521 57461 57820 57992 57767 57766 58265 58577 58115 57177 56224
54192 56224 55266 54493 54580 55642 56622 56403 55143 53937 53529 53781 54114 54132 53891 53675 53393 52543 51094 50009
54174 50009 50199 51260 51999 51927 51452 50857 50076 49361 49140 49197 48906 48291 48035 48417 49126 50144 51875 54292
54156 54292 56686 58297 58614 57411 55294 53779 53729 54086 53383 52120 52113 53678 55178 55510 55307 55250 54839 53601
54138 53601 52176 51331 50921 50552 50326 50289 50026 49439 49125 49462 49992 50175 50009 49525 48487 47029 45824 45248
54120 45248 45032 45002 45373 46002 46210 45733 45147 45050 45490 46376 47660 48928 49644 49990 50634 51577 52082 51871 51428
54101 51428 51050 50685 50782 52001 53820 54741 54309 53678 53633 53390 52077 50208 48807 48013 47461 47236 47593 48331
54083 48331 49152 50139 51363 52446 52983 52897 52181 50934 49789 49526 50054 50574 50875 51491 52524 53394 54067 55254
54065 55254 57006 58320 58676 58819 59448 60240 60809 61460 62354 62923 62909 63047 64035 65745 67965 70889 74214
54048 74214 76826 78170 78961 79931 80904 81749 83026 84866 86407 87325 88764 91717 95603 99594 104251 110455
54032 110455 117607 124326 130346 136437 142941 149698 156934 165029 173609 181860 189450 196296 201924 206088
54018 206088 209607 213547 217885 221861 225309 228632 231714 233859 234727 234547 233541 231812 229596 226945 223414
54003 223414 218753 213674 209269 205888 203052 200175 196755 192287 186721 180894 175944 172347 169828 167846
53989 167846 165929 163941 162328 161592 161314 160394 158571 156867 156063 155648 154870 153897 153058 151801 149394 146120
53973 146120 142851 139888 137019 134242 131662 129105 126555 124537 123415 122770 122056 121290 120556 119615 118674 118691
53957 118691 120053 121756 122811 123701 125421 127794 129907 131570 133130 134386 134980 135546 137230 140249 144034
53942 144034 148515 154128 160786 168029 176111 185781 196936 208446 219423 229713 239116 247022 253014
53929 253014 257096 259256 259521 258485 257105 255833 254511 253176 252473 253123 255370 258898 263018 267071 270959
53914 270959 275122 279830 284879 290197 296131 302761 309516 316085 323111 331383 340786 350572 360134 368902
53900 368902 376066 381157 384481 386412 386745 385310 382616 379250 375265 370771 366342 362059 356980 350451
53886 350451 343220 336232 329053 320576 310649 299891 288549 276777 265496 255620 246789 238098 229692
53873 229692 222380 216066 209960 204110 199271 195277 190936 185708 180256 175165 170206 165135 160236 155794
53859 155794 151770 148100 144690 141186 137449 134060 131614 129745 127659 125336 123255 121271 118800 115933
53845 115933 113275 110891 108432 106121 104467 103187 101592 99946 99222 99469 99660 99251 98680 98183 97396 96379
53829 96379 95900 96262 96783 96807 96355 95561 94367 93105 92519 92830 93470 93926 94175 94249 94177 94452 95679 97609 99325
53810 99325 100534 101806 103434 104999 106363 108174 111051 114897 119261 123782 128163 132367 136954 142575
53796 142575 149068 155729 162394 169478 176994 184410 191481 198343 204719 209925 213786 216704 218855 220174
53782 220174 221127 222453 224078 225218 225706 226155 226720 226758 225914 224437 222216 218623 213661 208224 202781 196892
53766 196892 190467 184380 179240 174510 169562 164738 160617 156955 153167 149380 146290 144227 142860 141606
53752 141606 140073 138383 137134 136677 136470 135644 134143 132642 131398 130104 128859 128226 128044 127193 125032 122246
53736 122246 119823 117889 116054 114227 112561 111104 109922 109183 108872 108779 108868 109185 109428 109291 109205 109992 111708
53719 111708 113642 115552 118034 121480 125538 129782 134048 137893 140614 142176 143401 145048 147462 151044
53705 151044 155979 161230 164989 166600 167088 167465 167626 167344 167114 167301 167405 167030 166697 166915 167182 166716 165561
53688 165561 164282 163116 162134 161718 162232 163572 165423 167524 169508 171106 172746 175164 178133 180518 181928
53673 181928 183269 185155 186883 187709 188072 188667 189214 189195 189039 189546 190651 191748 192715 193761 194770 195738 197377
53656 197377 200246 203580 205958 207083 208120 210330 213954 218228 221909 224021 224617 224698 224951 224907 223757 221506
53640 221506 218715 215595 212063 208400 205098 202248 199695 197593 196155 195014 193519 191588 189734 188261
53626 188261 186971 185673 184609 184281 185026 186665 188445 189537 189823 189992 190703 191940 193345 194793 196364
53611 196364 198039 199742 201492 203361 205454 207931 210770 213628 216427 219940 225002 231110 236606 240487
53597 240487 243309 246105 249247 252743 256774 261334 265976 270473 275158 280155 284855 288675 291810 294801
53583 294801 297855 300982 304226 307328 309763 311558 313454 315897 318482 320820 323216 325959 328703 331142
53569 331142 333630 336456 339186 341348 343194 345085 346748 347865 348880 350476 352678 355143 357843 360830
53555 360830 363808 366610 369692 373533 377953 382541 387263 392031 396293 399732 402915 406587 410798 415301
53541 415301 420261 425881 431872 437971 444392 451093 457266 462419 467282 472703 478231 482956 487253 492485
53527 492485 499111 506224 512893 519040 524923 530632 536164 541372 545929 549946 554447 560506 568016 575991
53513 575991 583965 592476 602242 613505 626036 639206 652160 664577 677185 691038 706417 722901
53501 722901 740301 758931 779083 800693 823388 846539 869591 892713 916660 941543 966340
53490 966340 990239 1013865 1038389 1063865 1089340 1114228 1138671 1162786 1186464 1209800 1232899
53479 1232899 1255318 1276418 1296212 1315283 1333960 1352251 1370386 1388786 1407497 1426142 1444318
53468 1444318 1461746 1478401 1494897 1512184 1530279 1547864 1563772 1578275 1592104 1604990 1616209
53457 1616209 1625968 1634887 1642489 1647543 1649843 1650353 1649619 1647266 1643142 1637673 1630729 1621296 1608821 1594044
53443 1594044 1578101 1561504 1544367 1526819 1508690 1489300 1468044 1444898 1420221 1394459 1368174
53432 1368174 1341874 1315573 1288889 1261738 1234603 1208104 1182642 1158496 1135918 1115064 1096066
53421 1096066 1079104 1064127 1050601 1037836 1025444 1013365 1001761 991115 981984 974302 967420 961242
53409 961242 956721 954731 954988 956735 959892 964774 971276 979205 988921 1000678 1013763 1027304 1041597
53396 1041597 1057601 1075502 1094885 1116056 1139896 1166393 1194462 1223355 1253338 1284948 1318563
53385 1318563 1354690 1393637 1434754 1476882 1519671 1563631 1608927 1655118 1702175 1750721 1801054
53374 1801054 1852795 1905530 1958821 2011554 2062501 2111932 2161548 2212284 2263003 2311941 2358626
53363 2358626 2403782 2447910 2490506 2530251 2565607 2595616 2620427 2640771 2656902 2668488 2675495
53352 2675495 2678539 2678181 2674397 2666791 2654861 2638186 2616968 2592367 2565647 2537015 2505846 2471908
53340 2471908 2435536 2396774 2355304 2311375 2266061 2220498 2175489 2131650 2089041 2046725 2003636
53329 2003636 1959862 1916197 1872640 1828485 1783868 1739936 1697399 1656148 1616428 1578908 1543269
53318 1543269 1508240 1473702 1441326 1412332 1385934 1360991 1337926 1317721 1299888 1282817 1265585
53307 1265585 1248247 1230757 1212806 1194671 1177266 1161352 1147372 1135903 1127461 1121751 1117734 1114639
53295 1114639 1112636 1112404 1114259 1117822 1122495 1128223 1135540 1144699 1155124 1166245 1178617 1193448 1211083
53282 1211083 1230748 1251758 1274103 1297728 1322300 1348037 1375803 1405819 1437047 1468328 1499305
53271 1499305 1529694 1558572 1585340 1610785 1636177 1661526 1685536 1707087 1726070 1742839 1757538
53260 1757538 1770121 1780706 1789698 1797605 1804567 1810065 1813312 1813957 1812169 1808040 1801426 1792435 1781595
53247 1781595 1769345 1755783 1741030 1725422 1709191 1692371 1675106 1657629 1639891 1621764 1603606
53236 1603606 1585996 1568799 1551166 1532605 1513362 1493617 1473136 1452074 1431312 1411413 1391786
53225 1391786 1371411 1350069 1328477 1307568 1287840 1269042 1250249 1230653 1210430 1190503 1171512
53214 1171512 1153554 1136767 1121349 1106902 1092587 1078134 1063920 1049914 1035444 1020319 1005254
53203 1005254 990762 976394 961475 945826 929471 912448 895316 878939 863324 847555 831365
53192 831365 815836 801917 789201 776806 764553 752434 739782 725947 711235 696279 680987
53181 680987 664931 648318 631790 615642 599878 584625 569801 554834 539368 523837 508886
53170 508886 494763 481757 470382 460332 450067 438534 426769 416698 408660 401200 393122 384665
53158 384665 376624 369244 362209 355137 347906 340920 334987 330562 327167 323924 320514 317382 315238 314655
53144 314655 315747 317873 319986 321685 323557 326277 329842 333966 338465 342780 345897 347465 348362 349326 349632
53129 349632 347999 344349 339683 334637 329147 323345 317672 312079 305965 298981 291323 283295 275233 267733
53115 267733 261160 254968 248186 240679 233308 226794 221038 215700 210872 206888 203774 201083 198205 194826
53101 194826 191178 187760 184780 182082 179562 177210 174669 171410 167653 164483 162602 161475 160180 158601
53087 158601 157202 156094 154962 153599 152028 150362 148942 148172 147850 147123 145555 143659 141993 140429 138920
53072 138920 138129 138365 138565 137421 135140 133072 131892 131118 130263 129444 128905 128721 128942 129286 128848 126872 123783
53055 123783 120807 118743 117699 117750 118937 120686 122081 122779 123076 123197 123234 123563 124452 125266 124924 123354 121729
53038 121729 121025 120941 120493 119204 117492 116216 115996 116755 117883 118910 119791 120432 120455 119885 119567 120250 121598
53021 121598 122703 123331 123989 125077 126612 128572 130851 133038 134817 136421 138125 139637 140609 141406 142675
53006 142675 144456 146416 148628 151303 154039 156244 158147 160554 163819 167880 173028 179609 187055 194326
52992 194326 201363 209136 218099 227484 236275 243957 250125 254341 256764 258162 258932 258689 257073 254294 250576
52977 250576 245751 239804 233275 226758 220440 214493 209432 205586 202440 198933 194461 189463 184997 181766
52963 181766 179572 177813 176342 175420 174799 173554 171241 168667 167054 166877 167911 169714 171460 172016 171150
52948 171150 170147 170314 171237 171516 170855 170261 170376 170745 170789 170507 170103 169771 169911 170786 171915 172598 172998 173912
52930 173912 175583 177532 179525 181759 184063 185822 186807 187323 187536 187452 187456 187997 188767 189124 189310 190279 192269
52913 192269 194526 196456 198084 199299 199842 200200 201390 203528 205637 207190 208759 210806 212919 214717 216443
52898 216443 218103 219001 218844 218480 218852 219899 221085 222322 223681 224828 225465 225938 226828 228213 229795 231443
52882 231443 233240 235284 237658 240335 242964 245201 247289 249838 252972 256374 260162 264993 271067 277741
52868 277741 284384 290924 297325 303233 308404 312803 316055 317531 317294 316207 314786 312661 309541 305934
52854 305934 302422 298871 294903 290663 286589 282818 279269 276051 273480 271868 271296 271270 270724 268940 266331
52839 266331 263696 260941 257466 253700 251071 250130 249714 248321 245423 241222 236172 231207 227450 225119 223405
52824 223405 221839 220884 220767 220735 220065 218929 217660 215995 213813 211846 210931 211014 211495 211875 211597 209935 206792
52807 206792 203089 199816 197195 195193 194098 193958 194046 193516 192251 190636 189069 187993 187745 187918 187460 185828
52791 185828 183439 180835 178244 176190 175345 175199 174032 171072 167717 165773 165295 165073 164412 163451 162476 161864
52775 161864 162160 163218 163823 163007 161253 159658 158556 157789 157559 157963 158243 157563 156116 154600 153121 151518
52759 151518 150163 149351 148414 146530 143978 141542 139156 136348 133639 132158 131954 131910 131325 130476 129608 128492
52743 128492 127176 126186 125651 124992 123806 122455 121619 121660 122462 123458 123896 123561 123151 123578 125103 127545 130870
52726 130870 134996 139429 143824 148550 154008 159763 165103 170078 175103 179824 183394 185699 187289 188049
52712 188049 186955 183420 178220 172742 167739 162932 157525 151125 144343 138255 133153 128350 123494 119235
52698 119235 116049 113334 110593 108628 108283 108631 107847 105533 102754 100035 96930 93563 90984 89561 88391
52683 88391 86781 85152 83929 82668 80953 79205 77938 76935 75809 74718 73907 73175 72354 71830 71972 72450
52667 72450 72683 72649 72780 73233 73664 73641 73053 72270 71924 72288 72882 73014 72675 72454 72589 72631 72145 71218 70128 69021
52647 69021 68099 67658 67690 67788 67657 67413 67317 67559 68399 70029 72154 74118 75626 76992 78524 80034 81125
52630 81125 81644 81663 81279 80616 79774 78660 77042 74920 72668 70771 69502 68817 68377 67800 67110 66825 67352
52613 67352 68418 69367 69937 70427 71157 72019 72523 72193 71119 70210 70461 71719 72677 72487 71875 72053 73061 73972
52595 73972 74425 74984 75986 76913 77171 76884 76671 77048 78137 79654 81121 82327 83504 84856 86218 87475
52579 87475 88891 90566 92001 92849 93657 95086 96760 97797 98257 99057 100538 102103 103391 104824 106690
52564 106690 108500 109616 109983 109981 110114 110949 112738 114951 116690 117768 118857 120503 122547 124632 126676 128609
52548 128609 130209 131428 132564 133963 135843 138277 140958 143133 144304 144893 145663 146620 147167 147158 147080 147261 147688
52531 147688 148532 149992 151573 152457 152697 153182 154212 155039 155090 154768 154666 154749 154745 154600 154184 153222 151954 151180 151205
52512 151205 151362 150981 150293 149891 149872 149951 150015 150122 150317 150704 151341 151838 151595 150622 149542 148579 147206 145166 143152
52493 143152 141977 141576 141321 140829 140016 138850 137586 136870 137105 137982 138986 140015 141144 142136 142662 142773 142825
52476 142825 143123 143873 145201 146991 148986 151151 153564 155871 157377 157897 157977 158009 157748 157148 157045 158332 160693
52459 160693 162794 163595 163139 162203 161619 161845 162880 164437 166265 168193 169951 171271 172244 173299 174752 176587
52443 176587 178684 180925 183126 185243 187630 190707 194403 198283 202081 205601 208312 209808 210633 211805
52429 211805 213365 214176 213339 211032 207770 203730 199195 194785 190716 186521 181984 177683 174072 170713 167091
52414 167091 163593 160964 159189 157584 155765 154000 152790 152438 152724 152729 151425 148853 146295 144896 144535 144414
52398 144414 144219 144130 144142 144013 143700 143376 143155 143119 143384 143858 144155 144036 143666 143343 143291 143855 145349 147487 149456
52379 149456 150768 151541 151872 151655 151272 151555 152598 153400 153248 152729 152756 153357 154173 155446 157588 160270 162858
52362 162858 165438 168593 172422 176449 180234 183449 185796 187506 189531 192471 195758 198643 201544 205359
52348 205359 209768 213376 215504 216875 218450 220534 223172 226433 229966 233028 235392 237719 240691 244217
52334 244217 247737 250905 253677 256056 258048 259762 261411 263276 265575 268195 270675 272720 274664 277125
52320 277125 280324 284041 288159 292887 298431 304674 311198 317519 323459 329410 335957 343064 349971 356210
52306 356210 362402 369644 378351 388132 398539 409448 420839 432672 444966 457704 470745 484053
52294 484053 497840 512208 526958 542072 558009 575150 593204 611643 630388 649617 669160
52283 669160 688709 708390 728502 748799 768666 787948 807018 826022 844602 862414 879399
52272 879399 895389 909925 922589 933220 941709 947958 952193 955088 957436 959793 962349 964880 966826
52259 966826 967682 967440 966615 965852 965531 965585 965609 965299 964847 964697 964980 965569 966721 969113 972996 977789 982828 988079
52241 988079 993829 1000230 1007529 1016204 1026307 1037157 1048310 1060412 1074389 1090068 1106330 1122429
52229 1122429 1138461 1154650 1170846 1186792 1202349 1217379 1231787 1245602 1258692 1270573 1280873
52218 1280873 1289798 1297768 1304858 1311057 1316708 1322068 1326630 1329549 1330586 1330103 1328324 1325316 1321507 1317498
52204 1317498 1313352 1308722 1303648 1298503 1293213 1287317 1280934 1274886 1269602 1264634 1259611 1255029 1251539 1248931
52190 1248931 1246413 1243710 1241351 1239910 1239323 1239025 1238530 1237768 1237005 1236588 1236741 1237389 1238026 1237892 1236554 1234306
52174 1234306 1231768 1229161 1226284 1223106 1219844 1216476 1212767 1208972 1205899 1203944 1202530 1200840 1198656 1196287
52160 1196287 1194131 1192541 1191424 1189724 1186119 1180694 1175142 1170729 1166912 1162660 1158156 1154109 1150193 1145515
52146 1145515 1140126 1134714 1129032 1122073 1113866 1105774 1098719 1092134 1085044 1077348 1069668 1062661 1056717 1051713
52132 1051713 1046852 1041318 1035264 1029596 1024778 1020398 1015930 1011183 1005961 1000066 993872 988230 983496 979111
52118 979111 974329 968953 963312 958000 953724 950938 949612 949627 951208 954396 958379 962062 965220 968394 971865
52103 971865 975595 980058 986151 994125 1003488 1014098 1026461 1040718 1056250 1072637 1090277 1109628
52091 1109628 1130470 1152277 1174742 1197627 1220666 1243913 1267687 1291865 1315705 1338542 1360187
52080 1360187 1380545 1399489 1417318 1434699 1451802 1467956 1482331 1494517 1504331 1511689 1516887 1520478
52068 1520478 1522693 1523497 1523241 1522592 1521605 1519572 1516041 1511370 1505981 1499753 1492489 1484481 1476307 1468409 1461011
52053 1461011 1453970 1446639 1438512 1430096 1422604 1416767 1412612 1410264 1409937 1410986 1412008 1412318 1412418 1412737 1412916
52038 1412916 1412860 1413388 1415058 1417200 1418927 1420326 1421827 1423070 1423450 1423347 1423811 1425185 1426778 1427760 1427754 1426716
52022 1426716 1424838 1422514 1419978 1417072 1413640 1409832 1405731 1401068 1395694 1389908 1383869 1377056 1368855 1359370
52008 1359370 1349203 1338736 1328107 1317490 1306816 1295421 1282496 1267770 1251391 1233440 1214037
51997 1214037 1193676 1172865 1151540 1129282 1106001 1081986 1057405 1032190 1006396 980268 953933
51986 953933 927256 900042 872302 844399 816944 790342 764387 738558 712818 687740 663785
51975 663785 640859 618805 597877 578456 560582 544020 528498 513723 499526 486192 474279
51964 474279 463906 454549 445682 437227 429231 421579 414284 407638 401791 396536 391625 386910 382058 376721
51950 376721 371190 366323 362551 359497 356754 354358 352189 349655 346454 343026 339783 336484 332859 329235
51936 329235 325933 322646 319075 315675 313076 311115 309088 306669 304066 301602 299619 298417 297777 296978 295777
51921 295777 294894 294979 295630 296130 296661 297926 299973 302197 304242 306032 307054 306570 304604 302032 299627 297509
51905 297509 295540 293653 291723 289596 287342 285119 282856 280382 277793 275296 272862 270426 268260 266673
51891 266673 265409 263836 261733 259565 257935 257051 256612 256041 254906 253348 251953 251069 250466 249847 249309 249088
51875 249088 249175 249423 249664 249528 248629 247222 246191 246046 246453 247033 247971 249340 250557 251197 251757 252824 253987
51858 253987 254414 254117 253850 254096 254972 256716 259328 261907 263372 263929 264999 267554 271144 274625 277277 279192
51842 279192 281108 283901 287790 292037 295775 298978 302271 306087 310518 315641 321325 326936 331883 336290
51828 336290 340512 344215 346623 347525 347388 346634 345423 343980 342440 340509 337951 335201 332799 330437 327373
51813 327373 323716 320458 318282 317111 316779 317266 318195 318888 319079 318997 318754 318367 318346 319435 321611 324051 326191
51796 326191 328187 330323 332684 335407 338431 340959 342088 342146 342511 343818 345206 345693 345413 344951 344224 342759
51780 342759 340638 338496 336806 335600 334737 334168 334004 334402 335205 335791 335653 335049 334634 334523 334282 333803 333524
51763 333524 333681 333992 334223 334474 334762 334983 335400 336472 337953 338843 338608 337898 337683 338229 339218 340364 341470
51746 341470 342341 343037 343897 345047 346251 347425 348852 350610 352263 353479 354567 356083 358267 361091 364528
51731 364528 368475 372717 377264 382471 388665 395849 403772 411824 418798 423315 424819 423826 421105 417014
51717 417014 411765 405783 399505 393210 387262 382169 378202 375276 373191 371569 369621 366674 362982 359270
51703 359270 355359 350147 343387 336523 331134 327160 323369 319049 314518 310327 306692 303509 300410 296967
51689 296967 293257 289980 287676 286151 285036 284401 284274 284090 283401 282832 283408 284911 285687 284399 281437 278320
51673 278320 276056 274394 272483 269954 267260 265066 263533 262456 261903 262300 263713 265565 267318 269125 271477
51658 271477 274532 278163 282422 287535 293538 300284 307746 316000 324911 334123 343319 352325 360911 368710
51644 368710 375287 380227 383169 383883 382334 378725 373494 367121 359784 351306 341735 331770 322286 313475
51630 313475 304913 296428 288402 281185 274662 268569 262788 257208 251813 247017 243426 240992 238921 236657
51616 236657 234468 232831 231790 231203 231024 230878 229953 227917 225539 223815 222793 221855 220834 220170 220020 219907
51600 219907 219296 218123 216672 215290 214226 213523 213087 213010 213602 214869 216251 217256 218130 219461 221307 223178
51584 223178 224727 225970 226944 227694 228682 230633 233826 237838 242106 246433 250888 255654 261184 268097 276543
51569 276543 285820 294979 303767 312777 322696 333657 345277 357018 368296 378459 386969 393607 398328
51556 398328 400917 401006 398528 393889 387663 380373 372610 365006 357825 350922 344428 339115 335696 334031 333517
51541 333517 333991 335647 338250 341173 344301 348266 353644 360504 368833 378829 390446 403066 415909 428499
51527 428499 440654 452341 463556 473960 482595 488443 491360 492071 491281 489345 486670 483634 479984 475119
51513 475119 469305 463872 459818 456912 454566 452848 452108 452286 453337 455772 460022 465445 470627 474491 476679
51498 476679 477143 475938 473270 469334 464217 458183 451748 445158 438086 430244 421949 413791 406069 398892
51484 398892 392442 386745 381527 376682 372475 368914 365387 361416 357375 353914 351069 348495 346271 344797
51470 344797 344085 343701 343277 342731 342236 342283 343362 345123 346405 346740 347349 349814 354105 358693 362386 365230
51454 365230 367805 370635 374333 379393 385516 391736 397481 403125 409456 417050 426093 436253 446603 456087
51440 456087 464130 470539 475080 477790 479486 481118 482452 482055 478874 473337 466808 460509 455156 450989
51426 450989 447721 444781 441979 439800 438907 439582 441689 444827 448286 451155 452740 452839 451582 449134 445523
51411 445523 440603 434134 426014 416385 405473 393607 381469 369891 359043 348244 337109 326536
51399 326536 317852 311147 305242 299330 293835 289416 285879 282555 279340 276860 275751 276110 277520 279445
51385 279445 281631 284207 287405 291305 296000 301774 308785 316678 324897 333339 342208 351116 358689 363303
51371 363303 364129 361446 356178 349133 340564 330412 318932 306812 294505 281845 268660 255446 242990
51358 242990 231615 221354 212597 205767 200426 195463 190347 185600 181819 178830 176055 173235 170410 167549
51344 167549 164548 161466 158493 155837 153694 152260 151651 151882 152810 153920 154409 153864 152829 152357 152921 154012
51328 154012 154720 154458 153300 151955 151323 151718 152632 153517 154451 155544 156180 155774 155117 155866 158423 161257 162805
51311 162805 163368 164514 167192 171090 175578 180530 186127 192302 198695 205175 212255 220758 230871 241727
51297 241727 252255 262193 271933 281556 290624 298777 305808 311133 313951 314215 312735 310011 305560 298878
51283 298878 290499 281544 272513 263074 252831 241943 231055 220888 211782 203461 195401 187492 180136
51270 180136 173651 167977 163069 159126 156160 153716 151272 148650 145857 142925 140176 138185 137107 136339
51256 136339 135210 133730 132322 131171 130244 129663 129516 129482 129146 128696 128854 130069 132065 134243 136219 137982
51240 137982 139763 141868 144462 147327 149906 151715 152853 154072 156107 158786 160970 161706 161292 160811 160665
51225 160665 160138 158523 156096 153664 151564 149623 147755 146142 144914 144017 143387 142958 142521 141807 140685 139179
51209 139179 137396 135567 134102 133417 133733 135016 136942 138868 140091 140332 139893 139335 139122 139572 140721 142062
51193 142062 142702 142074 140428 138539 137132 136626 137076 138159 139434 140821 142544 144437 145777 146104 145935 146140
51177 146140 146777 147029 146218 144519 142612 140952 139482 137857 135821 133528 131479 130116 129472 129289 129332 129516
51161 129516 129899 130696 132196 134427 136951 139158 140678 141389 141285 140636 140188 140762 142524 144823 146857 148339
51145 148339 149439 150252 150551 150015 148573 146529 144361 142376 140464 138214 135382 132239 129364 127061 125118
51130 125118 123247 121529 120222 119289 118484 117874 117818 118388 119298 120587 122807 126080 129443 131778 133189 134812
51114 134812 137370 140561 143866 147330 151267 155647 160072 164167 167837 171262 174619 177677 179769 180434
51100 180434 179835 178312 175855 172595 169496 167680 167086 166596 165546 164255 162941 161187 159042 157701 158166
51085 158166 159760 160801 160505 159462 158450 157542 156464 155205 154085 153483 153581 154181 154829 155312 155869 156690 157507
51068 157507 157964 158221 158755 159728 160919 162166 163386 164167 163841 162193 159854 157783 156445 155532 154398 152665
51052 152665 150487 148279 146306 144664 143576 143413 144255 145685 147233 148844 150684 152679 154596 156500 158730
51037 158730 161316 163754 165641 167369 169842 173432 177475 181071 184223 187777 192210 196909 200927 204066
51023 204066 206805 209417 211706 213454 214613 215068 214740 213978 213343 212882 212105 210805 209397 208247 207196 206085
51007 206085 205324 205516 206814 208972 211785 215129 218691 222036 224974 227760 230900 234727 239028 243224 247161
50992 247161 251572 257271 263982 270519 276240 281786 288254 296156 305404 315793 327172 339473 352824
50979 352824 367301 382564 398270 414944 433785 455368 479215 504951 533139 564508 599094
50968 599094 636757 677931 723168 772405 825346 882069 942520 1005846 1070953 1137411 1204952
50957 1204952 1272417 1338068 1400810 1460256 1515742 1566225 1611216 1650971 1685553 1714513 1737872
50946 1737872 1756816 1773051 1787822 1801859 1815876 1830747 1847281 1865899 1886358 1907776 1929124
50935 1929124 1949610 1968254 1983201 1991985 1992712 1984706 1967965 1942371 1907614 1863648 1810950 1750400
50923 1750400 1683021 1609839 1532053 1451277 1369384 1287965 1208153 1131131 1058478 991555 930647
50912 930647 875090 824200 777823 736159 699421 667647 640438 616832 595694 576389 558911
50901 558911 543475 530135 518745 509062 500868 494135 488996 485427 482990 480956 478644 475751 472750
50888 472750 470922 471460 474188 477598 480445 482946 486099 490321 495252 500510 506032 511921 518501 526279
50874 526279 535326 544949 554543 564557 576001 589170 603507 618628 634775 652266 671166 691672
50862 691672 714257 739358 767343 798864 834780 875604 921408 972402 1029285 1093013 1164514
50851 1164514 1244545 1333482 1431270 1537858 1653450 1777903 1910130 2048725 2192939 2342264
50841 2342264 2495004 2648023 2797971 2942068 3077502 3200939 3309263 3400620 3474633 3532090
50831 3532090 3574758 3605098 3625806 3639774 3650500 3662005 3677982 3701142 3733292 3775438 3827440
50820 3827440 3887754 3953613 4021016 4084449 4137293 4173326 4188069 4178863 4144183 4083323 3996517
50809 3996517 3884899 3750277 3595133 3422800 3237517 3044149 2847682 2652679 2462938
50800 2462938 2281571 2111180 1953731 1810309 1681175 1566087 1464487 1375517 1298153 1231310
50790 1231310 1173815 1124507 1082656 1048075 1020579 999417 983486 971820 963550 957634 953053 949170
50778 949170 945568 941715 937185 931959 926099 919370 911617 903151 894128 883916 871883 858648 845641
50765 845641 833465 821578 809616 798054 787302 777112 767354 758640 751607 746116 741740 738617 737396
50752 737396 738627 742559 749248 758506 769961 783388 798849 816478 836484 859326 885426 914613
50740 914613 946335 980582 1018250 1060568 1108651 1163469 1225594 1294833 1370765 1453617 1543802
50729 1543802 1640444 1741270 1844243 1948343 2052265 2153362 2248654 2336128 2414265 2481013
50719 2481013 2534176 2572506 2595732 2604022 2598257 2580528 2553640 2520486 2484495 2450056 2421265 2400233
50707 2400233 2387364 2383059 2388184 2402885 2425850 2454819 2487016 2518883 2546278 2565338 2572768 2565332
50695 2565332 2539967 2494937 2430555 2348630 2251773 2143508 2028291 1910571 1793772 1680289
50685 1680289 1572150 1471235 1379011 1296306 1223210 1159073 1102890 1054073 1012683 978714 951374
50674 951374 929489 912546 900976 895383 895804 901697 912259 926579 943780 963241 984555 1007069
50662 1007069 1029695 1051463 1072103 1091682 1109749 1125375 1138247 1149217 1159388 1168869 1176892 1183049
50650 1183049 1187962 1192730 1198065 1204086 1210643 1217637 1225197 1233751 1243966 1256596 1272361 1291860 1315497
50637 1315497 1343551 1376266 1413615 1454832 1498455 1543133 1588221 1633402 1677982 1720853 1760922
50626 1760922 1797190 1828752 1855206 1876963 1894651 1908404 1918252 1925056 1930371 1935402 1940781 1947369
50614 1947369 1956537 1969310 1985666 2004743 2025145 2044926 2062040 2075302 2084544 2089656 2090041 2085247
50602 2085247 2075497 2061145 2042048 2017887 1988575 1953900 1913179 1865852 1812254 1753459 1690610
50591 1690610 1624711 1556821 1488113 1419839 1353346 1289781 1229583 1172656 1119226 1069977 1025061
50580 1025061 983621 944841 909005 876983 849057 824927 804521 788059 775428 766167 760025 757026
50568 757026 756845 758686 761966 766868 774070 783972 796216 809920 824503 840265 857876 877397 898337
50555 898337 920786 945829 974359 1005973 1039549 1074483 1110816 1148467 1187026 1226107 1265270
50544 1265270 1303608 1339961 1373578 1404311 1432333 1458106 1482498 1506448 1530537 1555144 1580782
50533 1580782 1607836 1636220 1665827 1697231 1731467 1769212 1810704 1856351 1906792 1962283 2022572
50522 2022572 2087447 2156886 2230439 2306940 2385100 2464061 2543099 2620938 2695538 2764422 2825116
50511 2825116 2875422 2913489 2937724 2946967 2940924 2920238 2885780 2838079 2777853 2707092 2629147 2547680
50499 2547680 2465808 2386269 2311824 2245034 2187738 2141036 2105674 2082177 2070452 2069411 2077172 2091724
50487 2091724 2111383 2134704 2160185 2186240 2211184 2232741 2247560 2251693 2241901 2216560 2175611 2120185
50475 2120185 2052395 1974935 1890440 1801332 1710170 1619573 1531500 1447015 1366967 1292411 1224080
50464 1224080 1161959 1105787 1055502 1010854 971221 936428 907230 884228 866619 852749 841665
50453 841665 833412 828047 825297 825217 828311 834654 843503 854111 866527 881305 898659 918192 939364
50440 939364 962082 986727 1013432 1041437 1069611 1097773 1127028 1158387 1191543 1225374 1259141
50429 1259141 1292485 1324752 1355196 1383693 1410387 1434784 1456112 1474571 1491293 1506871 1520829
50418 1520829 1532854 1543740 1554624 1565962 1577791 1590473 1604648 1620806 1639404 1661027 1685847
50407 1685847 1713055 1741274 1769546 1797606 1825286 1852006 1876843 1898888 1917459 1932077 1942233
50396 1942233 1947128 1945721 1937166 1921191 1898024 1867899 1830629 1785619 1732467 1671769 1605365 1535706
50384 1535706 1464924 1394537 1325835 1260320 1199661 1145310 1098139 1058443 1026280 1001766 984906
50373 984906 975268 972140 975049 983763 997612 1015108 1034498 1054411 1073646 1090579 1103227 1109960
50361 1109960 1110081 1103758 1091523 1073746 1050645 1022987 992554 961422 930797 901035 872662 846476
50349 846476 822473 799703 777798 757861 741070 727067 714526 702773 692021 682468 674065 666899
50337 666899 660966 655893 651669 649304 649797 652713 656772 661652 668197 676858 686997 697875 709356 721457
50323 721457 734057 747351 761846 777611 794155 811192 828877 847195 865816 884797 904741
50312 904741 926036 948413 971357 994322 1016479 1036983 1055655 1072817 1088364 1101693 1112719
50301 1112719 1122246 1131102 1139517 1147437 1154772 1161153 1166112 1169730 1172499 1174478 1175276 1174971 1174193 1173101 1171049
50286 1171049 1167445 1162070 1154312 1143089 1128006 1109839 1089481 1067276 1043817 1020398 997946 976223
50274 976223 954764 933915 914150 894963 875317 854916 834464 814996 797458 782544 770348
50263 770348 760419 752478 746678 742881 740363 738739 738563 740325 743380 746597 749742 753585 758922 766029
50249 766029 774747 784544 794674 804738 814858 825067 834970 844295 853134 861194 867469 871330 873381
50236 873381 874570 874944 874021 871842 868817 864872 859617 853134 845830 837783 829027 820230 812230 804979 797755
50221 797755 790370 783507 777891 773818 771372 770411 770339 770614 771471 773565 777004 781392 786693 793192 800555
50206 800555 807788 814356 820618 826904 832902 838274 843206 847833 851612 853833 854522 854376 853858 852705 850308
50191 850308 846402 841274 835320 828465 820277 810751 800633 790648 780640 769881 758062 745504 732518
50178 732518 719111 705425 692012 679530 668412 658872 650961 644622 640020 637704 637973 640040 642269
50165 642269 643385 643153 641871 639622 636134 630941 623500 613636 602153 590676 580448 571433 562817 554177
50151 554177 545796 537984 530561 523139 515627 508241 501119 494131 487101 480078 473341 467181 461725 456885
50137 456885 452450 448277 444436 441085 438168 435475 433073 431442 430916 431311 432389 434382 437495 441162 444518
50122 444518 447651 451631 457125 463618 470178 476327 481910 486902 491861 497923 505699 514579 523586 532424
50108 532424 541108 549131 555844 561387 566479 571399 575833 579631 583094 586507 589940 593520 597391 601415
50094 601415 605311 609022 612579 615726 618219 620395 623045 626721 631548 637620 645107 653994 664079 675184
50080 675184 687058 699235 711389 723710 736475 749462 762283 775145 788690 803148 818158
50069 818158 833365 848669 863962 879151 894398 909738 924468 937644 949315 960672 972789
50058 972789 985744 999157 1012911 1026968 1040933 1054336 1067124 1079569 1091771 1103492 1114381
50047 1114381 1124245 1133158 1141319 1148665 1154739 1159124 1161886 1163316 1163395 1161890 1158875 1154674 1149324 1142527
50033 1142527 1134121 1124161 1112549 1099165 1084434 1069258 1054199 1039249 1024583 1010896 998520 986725
50021 986725 974512 961972 950300 940475 932385 925348 919138 914152 910737 908770 908125 909286 912961 919005
50007 919005 926146 933086 939604 946266 953329 960374 966861 972537 977285 980975 983576 985206 986031 986286 986265
49992 986265 986058 985461 984425 983467 983396 984801 988177 994263 1003793 1016983 1033638 1053518 1076056 1099874
49978 1099874 1123199 1144758 1163799 1179353 1190260 1196185 1198159 1197986 1197452 1198019 1200677 1205834 1213703
49965 1213703 1224600 1238197 1252360 1263473 1268299 1265191 1253544 1232908 1203185 1165222 1120684 1071567
49953 1071567 1020024 968180 917654 869405 824150 782549 744738 710183 678424 649691 624403
49942 624403 602332 582720 565086 549530 536226 524864 514650 504829 495282 486545 479086 472678
49930 472678 466824 461600 457561 454792 452731 451050 450012 449592 448989 447605 446005 445135 444883 444186 442450
49915 442450 440177 438106 436379 434772 433255 431933 430693 429249 427519 425696 423941 422185 420376 418854
49901 418854 418274 418977 420566 422304 423946 425982 428991 432953 437244 441192 444554 447586 450822 454735 459581
49886 459581 465416 472084 479158 486205 493357 501383 510901 521694 533150 545195 558358 573038 589219
49873 589219 606953 626751 649443 675967 707119 743026 782963 826303 873520 925481 981542
49862 981542 1039138 1095468 1148875 1198328 1242606 1281030 1314534 1345156 1374495 1403235 1431942
49851 1431942 1461546 1492925 1526244 1560546 1593472 1621617 1641831 1652386 1652667 1642049 1619876 1586643
49839 1586643 1544497 1496173 1443732 1388565 1332028 1275395 1219321 1163857 1109131 1055639 1003867
49828 1003867 954021 906358 861483 819932 781594 745930 712736 682391 655306 631470 610638
49817 610638 592556 576794 562657 549667 538008 528243 520648 514913 510212 505439 499744 493213 486731
49804 486731 480810 474899 468256 461111 454359 448423 443159 438650 435199 432517 429766 426644 423625 421016
49790 421016 418521 415999 413834 412133 410314 407982 405535 403321 400904 397917 395085 393453 392918 392435 391517
49775 391517 390673 390348 390330 390413 390821 391499 391667 390751 389476 389338 390962 393467 395604 397178 399126 402444 407282
49758 407282 412987 418696 423973 429236 435656 444333 455377 468054 481920 497489 515674 536988 561665
49745 561665 590123 622760 659502 699941 743627 789673 836290 881336 923264 961047 993492
49734 993492 1019516 1039236 1054175 1066256 1077152 1088500 1101839 1117886 1136403 1156844 1178384
49723 1178384 1198982 1215167 1223428 1221613 1208911 1185176 1150909 1107631 1057798 1004370 950375 898271
49711 898271 849398 804280 763479 727622 696515 669032 644283 622391 603727 587967 574352
49700 574352 562435 552124 543412 536439 531395 527954 525172 522289 519251 516231 513281 510797 509627 510069
49686 510069 511259 512190 512940 514304 516627 519557 522522 524825 525696 525024 523874 523646 524862 527111 529822
49671 529822 532527 534814 536677 538684 541240 543992 546541 549238 552507 555760 557988 559262 560686 562834
49657 562834 565128 566944 568465 570162 572023 573628 574534 574368 572975 570732 568354 566217 564038 561301 557772
49642 557772 553652 549506 546000 543388 541289 539246 537390 536264 536136 536774 537723 538461 538540 538058 537841 538663
49626 538663 540348 541936 542581 541945 540070 537523 535415 534596 534799 535171 535522 536400 537983 539642 540893 542111
49610 542111 543967 546552 549439 552417 555856 560370 566168 572836 579934 587807 597336 608635 620560 632000
49596 632000 643148 654853 667169 679396 691275 703194 715354 727770 741130 756601 774433
49585 774433 793695 813831 835714 860565 888394 918073 948606 979940 1012803 1048074 1086038
49574 1086038 1125993 1166887 1208455 1251376 1296219 1342760 1390561 1439652 1490210 1542097 1595237
49563 1595237 1650211 1707911 1768583 1831464 1895222 1958593 2020829 2081787 2141431 2198992 2252798
49552 2252798 2301199 2343499 2379674 2409233 2430673 2442254 2443315 2434711 2417978 2394191 2363865 2327866
49540 2327866 2287877 2245657 2202276 2158544 2115775 2075360 2037744 2002586 1970054 1941166 1916677
49529 1916677 1896360 1879847 1867606 1860599 1859370 1863901 1874002 1889354 1909457 1934065 1963535 1998296
49517 1998296 2037963 2081357 2127383 2175551 2225682 2277407 2330088 2382961 2435220 2486084 2534922
49506 2534922 2581286 2624609 2663763 2696985 2722465 2739070 2746338 2743738 2730317 2705359 2669146 2622655
49494 2622655 2566685 2501843 2429373 2351417 2270122 2186846 2102475 2018142 1935226 1854697 1776839
49483 1776839 1701704 1629642 1561317 1497230 1437345 1381251 1328638 1279456 1233586 1190626 1150178
49472 1150178 1112142 1076450 1042688 1010285 979047 949255 921283 895362 871643 850209 830970
49461 830970 813666 797967 783430 769573 756248 743872 732985 723609 715202 707204 699415 691960
49449 691960 685087 678919 673300 668001 663150 659021 655247 650810 645325 639896 636036 634005 632823 631707
49435 631707 630715 630107 629986 630704 632843 636463 640947 645848 651462 658365 666897 677347 690097 705018
49421 705018 720931 736017 748768 758549 765612 770791 775078 779254 783810 789026 794963 801573 809064
49408 809064 817943 828380 839773 851430 863479 876590 890889 905748 920645 935603 950697 965610
49396 965610 979863 993073 1004881 1015004 1023451 1030453 1036222 1041057 1045473 1049680 1053003 1054382 1053482
49383 1053482 1050945 1047748 1044801 1042953 1042603 1043278 1044239 1045429 1047223 1049503 1051892 1054815 1059281 1065429 1072373
49368 1072373 1079717 1088212 1098444 1109911 1122027 1135158 1149881 1165960 1182903 1201036 1221196 1243621
49356 1243621 1267775 1293071 1319239 1346241 1374382 1404357 1436783 1471681 1508624 1547251 1587567
49345 1587567 1630079 1675751 1725437 1779263 1836924 1898517 1964430 2034439 2107809 2184547 2265610
49334 2265610 2351385 2440789 2532496 2626305 2722640 2821411 2922223 3025141 3130316 3237052
49324 3237052 3343950 3449741 3553373 3653616 3749297 3839726 3924151 4000869 4067453 4121892
49314 4121892 4163216 4191316 4206732 4210471 4203506 4186411 4159765 4124753 4083128 4036816 3987843 3938200
49302 3938200 3889352 3842102 3797286 3756204 3719902 3688417 3661287 3638549 3620775 3608418 3601657
49291 3601657 3600600 3605101 3614620 3628816 3648113 3673200 3704220 3740923 3783300 3831388 3884626 3942080
49279 3942080 4003283 4068280 4136769 4207548 4278733 4348156 4413668 4473530 4526549 4571561 4606902
49268 4606902 4630649 4641287 4638033 4620852 4590501 4548220 4494962 4431069 4356946 4273714 4182965
49257 4182965 4086359 3985822 3883570 3781329 3679877 3579857 3482546 3389254 3300467 3216355
49247 3216355 3137558 3064588 2996815 2933183 2873838 2820088 2772661 2730846 2693420 2659509 2628350
49236 2628350 2599125 2571609 2546550 2524899 2506873 2491801 2478592 2466262 2454367 2443022 2432369
49225 2432369 2422195 2412407 2403600 2396562 2391244 2386714 2382112 2377180 2371985 2366660 2361383 2356074 2350122 2342884
49211 2342884 2334420 2325209 2315254 2304095 2291682 2278578 2265250 2251805 2238585 2226341 2215600 2206416
49199 2206416 2198922 2193583 2190533 2189188 2188904 2189783 2192480 2197388 2204154 2211891 2219795 2227774 2236438 2246307
49185 2246307 2257114 2268129 2278905 2289266 2298796 2307012 2313995 2320147 2325275 2328619 2329987 2330114 2329575
49172 2329575 2328046 2325221 2321879 2319318 2317940 2317056 2316058 2315227 2315296 2316777 2320009 2325526 2333874 2345041 2358441
49157 2358441 2373664 2390935 2410557 2432165 2455135 2479666 2506809 2537144 2569934 2603983 2638854
49146 2638854 2674827 2712152 2750928 2791361 2833222 2875015 2914331 2949365 2980018 3007613 3033843
49135 3033843 3059802 3085599 3110760 3135157 3159363 3183978 3208919 3233658 3257822 3281230 3303804
49124 3303804 3325889 3348294 3371427 3394737 3417610 3440433 3464115 3488891 3514388 3540545 3567566
49113 3567566 3595084 3622321 3649106 3675899 3702791 3729397 3755824 3782763 3810283 3837429 3863472
49102 3863472 3888828 3914128 3938940 3962072 3982929 4002027 4020220 4037827 4054642 4070725 4086838
49091 4086838 4103731 4121068 4137768 4153752 4170564 4189535 4210010 4230399 4250515 4271571 4294135
49080 4294135 4317489 4341184 4365884 4392237 4420060 4449137 4479730 4511616 4543561 4574544 4604848
49069 4604848 4635275 4665917 4696352 4726483 4756345 4785395 4812670 4837455 4859392 4878203 4893626
49058 4893626 4905314 4912537 4914459 4911060 4903246 4891642 4875784 4854972 4829436 4800082 4767516 4731901
49046 4731901 4693542 4652969 4610622 4566844 4522071 4476777 4431534 4387319 4345361 4306300 4269906
49035 4269906 4235985 4205089 4177849 4154069 4133126 4114991 4100211 4088948 4080601 4074445 4070334 4068728
49023 4068728 4070203 4074780 4081640 4089700 4098572 4108631 4120061 4132387 4145199 4158760 4173351 4188450
49011 4188450 4203118 4216939 4230156 4243063 4255693 4267806 4278795 4287858 4294742 4300098 4304704 4308552
48999 4308552 4311127 4312281 4312299 4311389 4309680 4307548 4305313 4302588 4298489 4292620 4285454 4277760 4270080 4262753 4255930
48984 4255930 4249330 4242309 4234399 4225590 4215940 4205100 4192406 4177358 4159795 4139564 4116177 4089067
48972 4089067 4058284 4024691 3989232 3952176 3913379 3873088 3831915 3790015 3746954 3702599 3657587
48961 3657587 3612579 3567554 3522301 3477292 3433598 3392096 3353119 3316743 3283078 3252349 3224873
48950 3224873 3200795 3179762 3161155 3144901 3131701 3122254 3116596 3114516 3116139 3121538 3130034 3140483
48938 3140483 3152253 3165469 3180291 3196399 3213283 3230716 3248771 3267575 3287184 3307636 3329007
48927 3329007 3351298 3374199 3397119 3419647 3441967 3464548 3487509 3510609 3533767 3557148 3580707
48916 3580707 3604243 3628080 3653176 3680236 3709125 3739507 3771668 3806303 3843821 3884202 3927284
48905 3927284 3972840 4020582 4070460 4122839 4178129 4236322 4296984 4359533 4423461 4488598 4555217
48894 4555217 4623480 4692656 4761381 4828852 4895282 4960971 5025501 5088217 5148940 5207733 5264395
48883 5264395 5318608 5370099 5418153 5461406 5498737 5530143 5556292 5577510 5593735 5605143 5612149
48872 5612149 5614842 5612920 5606147 5594544 5578288 5557699 5533188 5504976 5473102 5437854 5399829 5359227
48860 5359227 5315591 5268679 5219179 5168048 5115510 5061241 5005244 4948033 4890262 4832628 4775819
48849 4775819 4719906 4664088 4607609 4550718 4494246 4438542 4383479 4329262 4276492 4225556 4176510
48838 4176510 4129460 4084442 4041056 3998806 3957787 3918527 3881290 3846013 3812773 3781757 3752912
48827 3752912 3726120 3701513 3679056 3658093 3637978 3619017 3602064 3587434 3575032 3565387 3559487 3557350
48815 3557350 3557660 3559216 3562099 3567068 3574417 3583849 3595058 3607986 3622716 3639361 3657897 3678057 3699637
48802 3699637 3722872 3748157 3775450 3804314 3834492 3865868 3897903 3929743 3961122 3992626 4024839
48791 4024839 4057593 4090271 4122436 4153930 4184702 4214797 4244235 4272781 4300046 4325944 4350780
48780 4350780 4374906 4398615 4422418 4446888 4471975 4496858 4520845 4544242 4568091 4593130 4619169
48769 4619169 4645363 4670861 4695241 4718453 4740492 4761177 4780231 4797409 4812450 4824979 4834496
48758 4834496 4840357 4841812 4838425 4830463 4818525 4802690 4782391 4757284 4727653 4693688 4654972 4611147
48746 4611147 4562662 4510427 4455209 4397880 4339683 4281476 4223137 4164478 4106440 4050585 3997706
48735 3997706 3947819 3901304 3859112 3821882 3789738 3762950 3741961 3726707 3716708 3711915 3712612 3718428
48723 3718428 3728347 3741904 3759531 3781354 3806400 3833311 3861203 3889554 3917921 3946130 3974290
48712 3974290 4002329 4030006 4057441 4084976 4112341 4138668 4163538 4187281 4209950 4230749 4248959
48701 4248959 4264741 4278584 4290498 4300281 4308071 4314218 4319094 4323318 4327546 4331616 4334497 4335735 4336508
48688 4336508 4338660 4343106 4349709 4358290 4369048 4382154 4397516 4415030 4434850 4457662 4484827 4517797
48676 4517797 4556981 4601574 4650883 4705424 4766284 4833863 4907790 4987701 5073416 5164498 5260296
48665 5260296 5360316 5464015 5570249 5677436 5784199 5889494 5992136 6090686 6183766 6270052
48655 6270052 6347832 6414913 6469125 6508768 6532674 6540195 6531265 6506294 6465878 6410680 6341602 6260009
48643 6260009 6167746 6066885 5959299 5846403 5729396 5609694 5488919 5368440 5249167 5131788
48633 5131788 5016836 4904466 4794589 4687480 4583903 4484361 4388578 4296026 4206681 4120886
48623 4120886 4038723 3959960 3884485 3812361 3743537 3677912 3615644 3557049 3502174 3450781 3402761
48612 3402761 3358232 3317089 3278780 3242682 3208524 3176232 3145539 3116071 3087836 3061345 3036986
48601 3036986 3014426 2992920 2972182 2952592 2934375 2916975 2899540 2881835 2864280 2847210 2830565
48590 2830565 2814302 2798684 2783979 2770146 2756964 2744284 2732123 2720662 2710197 2700872 2692466 2684582
48578 2684582 2677084 2670163 2664091 2659066 2655209 2652426 2650372 2648830 2648090 2648685 2650877 2654660 2660073 2667049
48564 2667049 2675061 2683334 2691427 2699244 2706634 2713419 2719793 2726276 2733293 2741115 2749913 2759379 2768504 2776434
48550 2776434 2783426 2790244 2796802 2802253 2806444 2810254 2814224 2817791 2820309 2822064 2823720 2825390 2826777 2827786
48536 2827786 2828585 2829458 2830949 2833710 2837885 2843102 2849302 2857000 2866561 2877876 2891148 2907158 2926191
48523 2926191 2947322 2969375 2992026 3015372 3039085 3062804 3086851 3111652 3136656 3160645 3182903
48512 3182903 3203380 3221872 3237819 3250979 3261691 3270404 3277425 3283096 3287795 3291743 3295200 3298748 3303030
48499 3303030 3308327 3314817 3323206 3334650 3350056 3369695 3393435 3421068 3452554 3488336 3529267 3575887
48487 3575887 3627742 3683789 3743415 3806849 3874551 3946460 4021826 4099640 4179182 4260097 4341791
48476 4341791 4422792 4501026 4574618 4642021 4701523 4751423 4790932 4820169 4838899 4846042 4841020 4824924
48464 4824924 4799658 4766499 4726383 4681056 4632825 4583172 4532562 4481658 4431806 4384099 4338653
48453 4338653 4295195 4253722 4214138 4175587 4136629 4095961 4052709 4006072 3954980 3898359 3835839
48442 3835839 3768092 3696224 3620811 3541875 3459869 3376209 3292515 3209731 3128412 3049577 2974652
48431 2974652 2904581 2839466 2779120 2723562 2672870 2626847 2585092 2547314 2513421 2483240 2456229
48420 2456229 2431741 2409714 2390840 2375666 2363767 2354322 2347313 2343418 2342681 2344147 2347158 2352237 2360158
48407 2360158 2370690 2382804 2395743 2409386 2423968 2439789 2456890 2474724 2492558 2510433 2529096
48396 2529096 2548690 2568270 2587047 2605323 2623497 2640864 2656310 2669661 2681516 2692148 2701391
48385 2701391 2709190 2715391 2719355 2720636 2719760 2717537 2713904 2708314 2701012 2692990 2684891 2676858 2669220 2662337
48371 2662337 2655879 2649317 2643141 2638623 2636197 2634972 2634054 2633601 2634418 2637240 2642572 2650499 2660411 2671549
48357 2671549 2683975 2698501 2715627 2735181 2757057 2781574 2808981 2839246 2872469 2908877 2948193
48346 2948193 2989584 3032349 3076170 3120671 3165366 3210144 3255187 3300218 3344359 3386820 3427156
48335 3427156 3464846 3499280 3530311 3558238 3583122 3604607 3622481 3636849 3647704 3654925 3658732 3659560
48323 3659560 3657563 3652802 3645835 3637264 3626852 3614062 3599579 3585251 3572310 3560601 3549851 3540617
48311 3540617 3533484 3528291 3524834 3523589 3525102 3529270 3535729 3544290 3554462 3565309 3576549 3589208 3604418
48298 3604418 3621979 3640750 3660055 3679994 3700763 3722453 3745431 3770245 3797130 3825959 3856552
48287 3856552 3888704 3922091 3956521 3992178 4029384 4068377 4109505 4153216 4199454 4247381 4296110
48276 4296110 4345466 4395717 4446791 4498133 4549005 4598498 4645436 4688560 4726675 4758406 4782189
48265 4782189 4796797 4801603 4796014 4779052 4750058 4709536 4658884 4599489 4532559 4459617 4382528 4302979
48253 4302979 4222330 4142000 4063474 3987670 3914566 3843715 3775112 3709461 3647556 3589539 3534896
48242 3534896 3483182 3434505 3389110 3346646 3306230 3267180 3229380 3192970 3157973 3124213 3091274
48231 3091274 3058617 3026042 2993967 2962804 2932169 2901173 2869342 2836603 2802416 2765902 2727143
48220 2727143 2687601 2648694 2610419 2571773 2531997 2490925 2448564 2405014 2360653 2316003 2271474
48209 2271474 2227439 2184235 2141818 2099658 2057295 2014771 1972379 1930393 1889335 1850052 1812974
48198 1812974 1777496 1742499 1707448 1672777 1639316 1607657 1577860 1549484 1521874 1494571 1467515
48187 1467515 1441053 1415911 1392894 1372115 1352551 1332903 1312910 1293363 1274793 1256796 1238792
48176 1238792 1220784 1203110 1186018 1169790 1154723 1140618 1126828 1113130 1100106 1088323 1077646
48165 1077646 1067709 1058527 1050222 1042587 1035308 1028271 1021371 1014513 1008079 1002824 999014 996222 994249 993453
48151 993453 993746 994190 994297 994950 997205 1000736 1004450 1008071 1012181 1017100 1022769 1029454 1037487 1046403 1055261
48136 1055261 1063850 1072714 1082032 1091360 1100604 1110361 1121046 1132376 1143985 1155962 1168498 1181536
48124 1181536 1195022 1209071 1223609 1238234 1252676 1267177 1282264 1298331 1315434 1333308 1351549
48113 1351549 1370018 1389018 1408866 1429423 1450249 1470977 1491233 1510445 1528227 1544834 1560818
48102 1560818 1576335 1591184 1605432 1619559 1633982 1648803 1663908 1678955 1693433 1707161 1720668
48091 1720668 1734724 1749576 1765005 1780941 1797579 1815003 1833112 1851817 1870932 1890080 1909117
48080 1909117 1928492 1948720 1969745 1991372 2014056 2038515 2064665 2091684 2119217 2147823 2178082
48069 2178082 2209807 2242372 2275395 2309017 2343910 2380907 2420138 2460520 2500644 2540078 2579222
48058 2579222 2617987 2655511 2691317 2725827 2759273 2790840 2819420 2844725 2867112 2886749 2903561
48047 2903561 2917730 2929735 2939991 2948761 2956303 2962880 2968837 2974933 2982325 2991975 3004264 3019320 3036935
48034 3036935 3055158 3068923 3071086 3055990 3022769 2975634 2921129 2864811 2809710 2756981 2707241
48023 2707241 2661001 2618155 2577687 2538300 2499379 2461321 2425011 2391027 2359174 2328651 2298722
48012 2298722 2269293 2240815 2213577 2187192 2160935 2134539 2108497 2083461 2059453 2035903 2012448
48001 2012448 1989376 1967087 1945344 1923423 1900904 1878015 1855262 1833144 1812170 1792591 1773961
47990 1773961 1755482 1736968 1719071 1702333 1686493 1670992 1655693 1640806 1626609 1613632 1602517
47979 1602517 1593165 1584548 1576007 1568276 1562486 1558528 1555394 1552919 1552151 1553809 1557172 1560858 1564099 1566896
47965 1566896 1569431 1571759 1573818 1575461 1576533 1576963 1576676 1575442 1573015 1569299 1564245 1557780 1550120 1541813
47951 1541813 1533031 1523130 1511523 1498788 1486231 1474336 1462312 1449267 1435225 1420816 1406468 1392121
47939 1392121 1377357 1361649 1344776 1327065 1309009 1290737 1272183 1253625 1235499 1217690 1199586
47928 1199586 1180886 1161938 1143312 1125558 1109319 1094981 1082043 1069401 1056524 1043932 1032523
47917 1032523 1022890 1015263 1009396 1004342 999059 993570 988940 985878 983954 982475 981416 980957 980697 979991 978734
47902 978734 977229 975482 973102 969782 965552 960670 955505 950356 945227 940064 935327 931935 930332 929883
47888 929883 929517 928736 927833 927403 927914 929529 932157 935774 940665 946958 953995 960800 967383 974932 984338
47873 984338 995142 1006448 1018227 1030972 1044394 1057322 1068915 1079373 1089427 1099588 1109969
47862 1109969 1120423 1130710 1140717 1150532 1160193 1169556 1178594 1187603 1196768 1205694 1213781 1220946 1227605
47849 1227605 1233916 1239469 1243809 1247026 1249636 1252004 1253936 1254775 1253937 1251406 1247648 1242998 1237357 1230562
47835 1230562 1222781 1214283 1205007 1194761 1183769 1172670 1161838 1150960 1139426 1127048 1114226 1101394
47823 1101394 1088505 1075268 1061874 1049072 1037235 1025658 1013338 1000407 988184 977587 968052
47812 968052 958316 947818 936852 925760 914583 903409 892457 881737 870991 860113 849368 839159
47800 839159 829721 821045 812912 804964 797008 789282 782283 776238 770853 765650 760476 755688 751917 749645
47786 749645 748883 749109 749547 749698 749739 750457 752628 756431 761505 767590 774886 783742 794248 806295 819846
47771 819846 834869 851303 869435 890092 913924 940500 968637 997745 1028448 1061752 1097966
47760 1097966 1136568 1176774 1218038 1260242 1303533 1347754 1392000 1434983 1475861 1514360 1550176
47749 1550176 1582778 1611895 1637533 1659255 1676113 1687817 1695485 1700513 1702882 1701133 1693936 1681248
47737 1681248 1664040 1643481 1620519 1595784 1569565 1541991 1513370 1484336 1455618 1427725 1400885
47726 1400885 1375278 1351333 1329728 1311000 1295113 1281499 1269464 1258422 1247969 1238112 1229434 1222606
47714 1222606 1217608 1213785 1210809 1209191 1209518 1211539 1214336 1217225 1220161 1223374 1226897 1230385 1233152 1234352
47700 1234352 1233356 1230002 1224532 1217408 1209123 1199964 1189783 1178217 1165247 1151348 1136911 1121713 1105249
47687 1105249 1087534 1069398 1051892 1035437 1019596 1003715 987767 972468 958599 946479 936189
47676 936189 927840 921240 915691 910732 906949 905387 906221 908630 911974 916414 922289 929592 938331 948699
47662 948699 960531 973285 986962 1002441 1020294 1039754 1059451 1078828 1098205 1117729 1136931
47651 1136931 1155300 1172726 1189253 1204735 1218827 1231187 1241636 1250219 1257076 1262216 1265568 1267172
47639 1267172 1267143 1265506 1262433 1258558 1254619 1250766 1246757 1242881 1240056 1238769 1238666 1239573 1242355 1248231 1257653
47624 1257653 1270320 1285873 1304011 1324246 1346135 1369617 1394743 1421129 1447957 1474269 1499055
47613 1499055 1521360 1540644 1556806 1569683 1578892 1584308 1586228 1584726 1579328 1569638 1555807 1538020
47601 1538020 1516094 1490051 1460624 1428720 1394798 1359108 1321994 1283513 1243439 1202189 1161039
47590 1161039 1120783 1080869 1040687 1001113 963760 929165 896727 866095 837525 811035 786233
47579 786233 763010 741545 721674 703009 685658 670068 656188 643500 631756 621005 611080 601861
47567 601861 593849 587550 582435 577455 572519 568485 565689 563568 561823 560870 560917 561618 562985 565667 569958
47552 569958 575486 582285 591218 602636 615487 628444 641364 655007 669852 685873 703046 721408
47540 721408 740742 760569 780203 798659 814974 828954 841182 851976 860814 867076 870848 872535
47528 872535 872078 869057 863277 854862 844027 831104 816541 800564 783096 764260 744650 724881
47516 724881 705141 685411 665824 646579 627792 609635 592334 575960 560651 547086 536136
47505 536136 527724 520550 513339 505996 499236 493561 489057 485752 483605 482257 481193 480033 478557 476798
47491 476798 475305 474866 475606 476646 476925 476060 474253 471835 469292 467183 465544 463665 460910 457493 454100
47476 454100 451114 448593 446600 445056 443522 441661 439683 437963 436524 435294 434595 434800 435795 437210 438982
47461 438982 441210 443754 446447 449499 453141 457125 461146 465494 470642 476377 481987 487202 492284 497192
47447 497192 501427 504814 507789 510774 513784 516799 519963 523195 526097 528484 530548 532336 533574 534300
47433 534300 535206 536925 539293 541711 544018 546585 549758 553611 558210 563714 570087 577022 584384 592609
47419 592609 602365 613796 626363 639658 654287 671475 691714 714111 737335 760995 785835 812863
47407 812863 842588 874884 909092 944360 980258 1016990 1054587 1092010 1127606 1160465 1190707
47396 1190707 1218347 1242516 1262178 1277120 1287745 1294263 1296571 1294705 1288839 1278891 1264561 1245832
47384 1245832 1223223 1197544 1169675 1140455 1110523 1080236 1049939 1020316 992184 965916 941290
47373 941290 917992 896106 876097 858473 843512 831146 821059 813030 807162 803629 802218 802380 803774
47360 803774 806501 810672 816056 822406 829902 838931 849381 860390 870891 880314 888799 896706 903911
47347 903911 909589 912851 913655 912818 911009 907954 902843 895239 885246 873060 858926 843438 827366 811008
47333 811008 794137 776718 759307 742535 726595 711426 697015 683208 669549 655732 642042
47322 642042 628973 616557 604453 592658 581812 572661 565387 559466 554115 548911 544073 540050 536899
47309 536899 534244 531843 529850 528454 527674 527722 529009 531348 533552 534495 534490 535059 537325 540987 544832 547756
47293 547756 549298 549680 549527 549323 549007 548244 546950 545216 542878 539671 535813 531897 528058 523796 518895
47278 518895 514069 510302 507819 506077 504591 503419 502867 503071 503910 505126 506439 507670 508947 510808 513959
47263 513959 518762 524922 531779 538899 546224 553711 561200 568767 576898 586033 596069 606529 617006
47250 617006 627252 637143 646878 656925 667420 677789 687328 695881 703554 710061 714990 718598 721697
47237 721697 724686 727194 728743 729237 728725 727172 724690 721643 718399 715228 712450 710313 708621 706820 704486
47222 704486 701527 698011 694172 690516 687502 685135 683227 681918 681497 681899 682999 685307 689631 696014 703647
47207 703647 711920 720957 731048 742278 754850 769005 784315 799855 815441 832044 850433 869907
47195 869907 888824 905996 921186 934655 946674 957201 965748 971848 975760 978137 978873 976971 971954
47182 971954 964664 956100 946197 934504 921581 908815 897034 886109 875794 866221 857499 849434 841859
47169 841859 834882 828698 823462 819473 817273 817384 819919 824410 830142 836880 845190 855785 868544 882589
47155 882589 897329 912970 929915 948181 967630 988249 1009857 1031875 1053622 1074536 1094030
47144 1094030 1111615 1127275 1141200 1152981 1161736 1167243 1170216 1171142 1169674 1165650 1159849 1153036 1144929
47131 1144929 1135003 1123740 1112159 1100434 1087906 1074290 1060118 1046042 1032363 1019210 1006673
47120 1006673 994773 983685 973781 965126 957276 949889 943167 937257 931790 926592 922273 919435 917763
47107 917763 916678 916379 917352 919285 921511 924268 928420 933999 940105 946308 953110 960765 968485 975140 980087
47092 980087 983100 984045 982930 979874 974951 968389 960715 952170 942163 930042 916259 902004 887765
47079 887765 873131 858056 843316 829402 815803 801836 787637 773943 761355 750122 740244 731540
47067 731540 723907 717581 712778 709127 705910 702813 699935 697212 694602 692794 692855 694927 697982 701107 704380
47052 704380 708299 713007 718362 724113 729702 734488 738470 742285 746311 750369 754433 758896 763819 768652
47038 768652 773056 777304 781509 785161 787948 790347 792856 795249 797176 798994 801382 804583 808591 813611
47024 813611 819714 826411 833208 840270 847948 855948 863605 870781 877928 885451 893453 901864 910298 918084
47010 918084 925044 932059 940225 949548 959043 968040 976853 986164 996262 1006948 1017771 1028344 1038767
46997 1038767 1049640 1061260 1072940 1083640 1093160 1102139 1110841 1118644 1124923 1129835 1133843 1136988 1139124
46984 1139124 1140564 1141845 1142933 1143195 1142259 1140517 1138550 1136411 1133819 1130912 1128304 1126379 1124832 1123131
46970 1123131 1121239 1119673 1119096 1119996 1122524 1126328 1130728 1135363 1140472 1146178 1151786 1156394 1160195 1164522
46956 1164522 1170474 1178036 1186672 1196126 1206290 1216807 1227342 1237893 1248414 1258347 1266989 1274161 1280149
46943 1280149 1285154 1289187 1292408 1295093 1297240 1298500 1298573 1297446 1295224 1291929 1287602 1282521 1277205 1272115
46929 1272115 1267248 1262122 1256394 1250405 1244845 1239879 1235029 1230079 1225709 1222922 1222060 1222589 1223640 1224547 1225174
46914 1225174 1226070 1228108 1231664 1236307 1241472 1247146 1253488 1260074 1266179 1271790 1277802 1285000 1293309 1302217
46900 1302217 1311581 1321610 1332214 1342766 1352579 1361508 1369997 1378590 1387344 1395648 1402558 1407349 1409861
46887 1409861 1410405 1409385 1406972 1403132 1397939 1391792 1385256 1378783 1372656 1367155 1362545 1358914 1356311 1355176
46873 1355176 1356446 1360910 1368447 1378093 1388939 1400780 1413721 1427346 1440698 1453229 1465460 1478281
46861 1478281 1491732 1504847 1516713 1527231 1536743 1545411 1553252 1560416 1567074 1573279 1579257 1585525 1592324
46848 1592324 1599193 1605566 1611582 1617921 1625008 1632869 1641544 1651086 1661251 1671756 1682789 1694695 1707159
46835 1707159 1719363 1730998 1742563 1754485 1766474 1777902 1788265 1797109 1804078 1809363 1813718 1817744
46823 1817744 1821455 1824657 1827316 1829333 1830470 1830839 1831096 1831821 1832972 1834163 1835173 1836023 1836897 1838304 1840957
46808 1840957 1845172 1850582 1856630 1863166 1870439 1878897 1889167 1901879 1917185 1934650 1953786 1974420
46796 1974420 1996407 2019328 2042707 2066276 2089915 2113609 2137506 2161609 2185220 2207075 2226156
46785 2226156 2242073 2254659 2263903 2270462 2275527 2279714 2282529 2283302 2282091 2279271 2274843 2268811 2261837 2254825
46771 2254825 2247999 2240896 2233088 2224497 2215247 2205703 2196479 2187962 2179961 2172156 2164664 2157680 2150796 2143196
46757 2143196 2134475 2124987 2115514 2106932 2099945 2094698 2090685 2087371 2084729 2082892 2081581 2080428 2079702 2080222
46743 2080222 2082517 2086438 2091692 2098438 2107319 2119052 2133911 2151453 2170872 2191671 2213826 2237209
46731 2237209 2261270 2285513 2309895 2334425 2358731 2382392 2405342 2427471 2448128 2466577 2482803
46720 2482803 2497388 2510686 2522565 2532848 2541535 2548610 2554039 2558067 2561288 2564407 2568036 2572530 2577781
46707 2577781 2583360 2589044 2595060 2601699 2609070 2617445 2627457 2639469 2652962 2666863 2680288 2692723
46695 2692723 2703797 2713228 2720681 2725421 2726458 2723415 2716811 2707121 2693993 2676844 2655720 2630973 2602540
46682 2602540 2570259 2534594 2496398 2456278 2414812 2373039 2331931 2291562 2251508 2211799 2172772
46671 2172772 2134308 2096168 2058902 2023450 1989837 1957194 1925167 1894425 1865547 1838234 1811796
46660 1811796 1785727 1759614 1733282 1707268 1682454 1659013 1636491 1615111 1596060 1579991 1566037
46649 1566037 1552969 1540694 1530003 1521382 1514885 1510867 1509923 1512075 1516584 1522795 1530792 1541050 1553618
46636 1553618 1567863 1582931 1598217 1613209 1627104 1639056 1648928 1657292 1664324 1669250 1671402 1671358 1670193
46623 1670193 1667928 1663694 1657446 1650502 1644195 1638852 1634521 1631843 1631627 1634091 1639123 1646886 1657648 1671257
46609 1671257 1687207 1705107 1724807 1746251 1769376 1793989 1819592 1845487 1871034 1895499 1917850
46598 1917850 1937201 1953501 1967140 1977848 1984663 1987201 1986221 1982561 1976196 1966824 1954744 1940572 1924531
46585 1924531 1906648 1887317 1867170 1846658 1826197 1806348 1787320 1768626 1749827 1731351 1713979
46574 1713979 1697771 1682113 1666682 1651694 1637132 1622344 1606655 1590087 1573396 1557562 1543118
46563 1543118 1529714 1516442 1502916 1489879 1478347 1468309 1458793 1449275 1440545 1433926 1429867 1427451
46551 1427451 1425194 1422351 1419542 1417963 1417873 1418173 1417789 1417125 1417571 1419766 1423103 1426955 1431565 1437430 1444511
46536 1444511 1452565 1461710 1472044 1483108 1494405 1506196 1519107 1533092 1547548 1562442 1578545 1596313
46524 1596313 1615202 1634402 1653629 1672855 1691943 1711179 1731640 1754201 1778422 1803170 1828167
46513 1828167 1854152 1881614 1910203 1939569 1969927 2001519 2034211 2067970 2103129 2139742 2177203
46502 2177203 2214973 2253172 2292014 2331028 2369279 2405965 2440413 2471936 2500256 2525745 2548775
46491 2548775 2569105 2586270 2600144 2610702 2617740 2621439 2622671 2622067 2619227 2613671 2606177 2598235 2590415
46478 2590415 2582239 2573533 2564876 2556605 2548281 2539342 2529553 2518695 2506525 2493238 2479264 2464471 2448167
46465 2448167 2429983 2409978 2387804 2362627 2334153 2302995 2269667 2233970 2195770 2155668 2114407
46454 2114407 2072136 2028786 1984805 1941158 1898934 1859134 1822380 1788538 1757031 1727741 1701188
46443 1701188 1677735 1657281 1639972 1626584 1617805 1613653 1613843 1618085 1625653 1635313 1646236 1658565 1672688
46430 1672688 1688460 1705489 1723580 1742353 1760870 1778177 1793800 1807406 1818517 1827045 1833541 1838300
46418 1838300 1840697 1840040 1836640 1831442 1825053 1817793 1810270 1803134 1796466 1790105 1784339 1779625 1775874 1772769
46404 1772769 1770658 1770387 1772369 1776524 1783106 1792870 1806234 1822882 1842272 1864057 1887963 1913816 1941879
46391 1941879 1972721 2006529 2042860 2081176 2121243 2162798 2205074 2246928 2287493 2326675 2364965
46380 2364965 2402572 2438640 2471537 2500036 2523963 2543573 2558719 2568970 2574159 2574360 2569632 2560259
46368 2560259 2546978 2530472 2510849 2488083 2462752 2435797 2407818 2379247 2350999 2324114 2298676
46357 2298676 2273983 2250012 2228047 2209439 2194406 2182514 2173860 2169094 2168561 2172082 2179645 2191828
46345 2191828 2209356 2232414 2260478 2292734 2328747 2368970 2414605 2466650 2524825 2587562 2653231
46334 2653231 2721313 2792134 2865617 2940640 3015658 3089397 3160703 3228150 3290343 3346348 3395330
46323 3395330 3436016 3467121 3488174 3499251 3499999 3489727 3468632 3438069 3399269 3352532 3298141 3237409
46311 3237409 3172231 3104148 3034459 2964707 2896227 2829451 2764378 2701647 2642623 2588498 2539815
46300 2539815 2496722 2459206 2427165 2400706 2380311 2366248 2357959 2354540 2355800 2362390 2374802 2392617
46288 2392617 2414859 2440835 2470561 2504460 2542617 2584286 2628312 2674080 2721659 2770966 2821314
46277 2821314 2872115 2923405 2975109 3026306 3075893 3123519 3169056 3211409 3248832 3280410 3306433
46266 3306433 3327246 3342534 3351864 3355162 3352303 3342944 3327231 3306244 3281290 3252985 3221334 3186473
46254 3186473 3149077 3110202 3070938 3032091 2994109 2957440 2922870 2891207 2862636 2836766 2813436
46243 2813436 2793017 2775710 2760912 2747665 2735602 2725125 2716725 2710364 2705540 2701687 2698365 2695162
46231 2695162 2691640 2687534 2682899 2677931 2672601 2666567 2659354 2650485 2639575 2626644 2612329 2597374 2581789
$$ [...]
##END NTUPLES=NMR SPECTRUM
##END=
