
##TITLE=AC1362_CENAH12180_6945819_1wShrkrYKA
##JCAMPDX= 6.0         $$ Bruker NMR JCAMP-DX V2.0
##DATA TYPE= NMR SPECTRUM
##DATA CLASS= NTUPLES
##ORIGIN= BRUKER
##OWNER= Administrator
$$ 1.72 TOPSPIN		Version 2.1
$$ 2012-10-18 13:47:51.225 -0700  Administrator@X
$$ Compression mode = diff/dup
##.OBSERVE FREQUENCY= 400.02188249412
##.OBSERVE NUCLEUS= ^1H
##.ACQUISITION MODE= SIMULTANEOUS (DQD)
##.ACQUISITION SCHEME= undefined
##.AVERAGES= 8
##.DIGITISER RES= 22
##SPECTROMETER/DATA SYSTEM= spect
##.PULSE SEQUENCE= zg30
##.SOLVENT NAME= COFFEE_meoh
##.SHIFT REFERENCE= INTERNAL, COFFEE_meoh, 1, 14.98509
##AUDIT TRAIL= $$ (NUMBER, WHEN, WHO, WHERE, PROCESS, VERSION, WHAT)
$$ ##TITLE= Audit trail, TOPSPIN		Version 2.1
$$ ##JCAMPDX= 5.01
$$ ##ORIGIN= Bruker BioSpin GmbH
$$ ##OWNER= Administrator
$$ $$ C:\Bruker\TOPSPIN/data/COFFEE/nmr/AC1362_CENAH12180_6945819_1wShrkrYKA/10/pdata/1/auditp.txt
$$ ##AUDIT TRAIL=  $$ (NUMBER, WHEN, WHO, WHERE, PROCESS, VERSION, WHAT)
(   1,<2012-10-14 00:02:00.015 -0500>,<Administrator>,<TOPSPIN>,<go>,<TOPSPIN 2.1>,
      <created by zg
	started at 2012-10-14 00:00:53.031 -0500,
	POWCHK enabled, PULCHK disabled,
       configuration hash MD5:
       6B 1B 68 BB D9 2E 58 E2 7F 35 AD 54 07 DF 0E 41
       data hash MD5: 64K
       F3 10 50 03 0D 57 FC C1 52 38 7B 43 2A A9 C8 7A>)
(   2,<2012-10-14 00:02:02.609 -0500>,<Administrator>,<TOPSPIN>,<proc1d>,<TOPSPIN 2.1>,
      <Start of raw data processing
       efp LB = 0 FT_mod = 6 PKNL = 1 PHC0 = 0 PHC1 = 0 SI = 32K 
       data hash MD5: 32K
       23 C9 0E 79 8C 4F 55 B5 66 67 4B 57 5B A4 69 B8>)
(   3,<2012-10-14 00:02:02.984 -0500>,<Administrator>,<TOPSPIN>,<proc1d>,<TOPSPIN 2.1>,
      <pk PHC0 = 182.005 PHC1 = 0 
       data hash MD5: 32K
       84 A7 88 D3 4C 60 0A C8 E7 E6 1A 3F CB 7F 3E 35>)
(   4,<2012-10-14 00:02:03.093 -0500>,<Administrator>,<TOPSPIN>,<proc1d>,<TOPSPIN 2.1>,
      <abs ABSG = 1 
       data hash MD5: 32K
       92 CB 51 C3 F3 7A F5 1A 77 F3 AE BC ED 8A F2 08>)
(   5,<2012-10-14 00:02:03.125 -0500>,<Administrator>,<TOPSPIN>,<proc1d>,<TOPSPIN 2.1>,
      <abs ABSG = 2 
       data hash MD5: 32K
       AC C8 A5 A8 D6 5C 80 7B 92 C0 32 67 B5 C1 A1 D8>)
(   6,<2012-10-14 00:02:03.156 -0500>,<Administrator>,<TOPSPIN>,<proc1d>,<TOPSPIN 2.1>,
      <abs ABSG = 3 
       data hash MD5: 32K
       43 D0 3E E5 E7 DB BE 89 AE 82 BC EC 40 58 1F 28>)
(   7,<2012-10-14 00:02:03.187 -0500>,<Administrator>,<TOPSPIN>,<proc1d>,<TOPSPIN 2.1>,
      <abs ABSG = 4 
       data hash MD5: 32K
       55 19 88 4B 95 BF 98 E6 44 16 93 AB E2 C4 DE 32>)
(   8,<2012-10-14 00:02:03.218 -0500>,<Administrator>,<TOPSPIN>,<proc1d>,<TOPSPIN 2.1>,
      <abs ABSG = 5 
       data hash MD5: 32K
       9C B9 EE F2 F3 03 F2 F9 00 D0 2A 6A 96 0F 4D B7>)
(   9,<2012-10-14 00:02:06.843 -0500>,<Administrator>,<TOPSPIN>,<audit>,<TOPSPIN 2.1>,
      <user comment:
       ICON-NMR User ID: COFFEE
       data hash MD5: 32K
       9C B9 EE F2 F3 03 F2 F9 00 D0 2A 6A 96 0F 4D B7>)
$$ ##END=
$$ 
$$ [...]
150 150 150 150 150 150 150 150
##$TP07= 0
##$TPNAME0= <>
##$TPNAME1= <>
##$TPNAME2= <>
##$TPNAME3= <>
##$TPNAME4= <>
##$TPNAME5= <>
##$TPNAME6= <>
##$TPNAME7= <>
##$TPOAL= (0..7)
0.5 0.5 0.5 0.5 0.5 0.5 0.5 0.5
##$TPOFFS= (0..7)
0 0 0 0 0 0 0 0
##$TUNHIN= 0
##$TUNHOUT= 0
##$TUNXOUT= 0
##$USERA1= <user>
##$USERA2= <user>
##$USERA3= <user>
##$USERA4= <user>
##$USERA5= <user>
##$V9= 5
##$VALIST= <valist>
##$VCLIST= <CCCCCCCCCCCCCCC>
##$VD= 0
##$VDLIST= <DDDDDDDDDDDDDDD>
##$VPLIST= <PPPPPPPPPPPPPPP>
##$VTLIST= <TTTTTTTTTTTTTTT>
##$WBST= 2048
##$WBSW= 25
##$XGAIN= (0..3)
0 0 0 0
##$XL= 0
##$YL= 0
##$YMAX_a= 497925
##$YMIN_a= -639298
##$ZGOPTNS= <>
##$ZL1= 120
##$ZL2= 120
##$ZL3= 120
##$ZL4= 120
##$ABSF1= 14.98509
##$ABSF2= -5.573092
##$ABSG= 5
##$ABSL= 3
##$ALPHA= 0
##$AQORDER= 0
##$ASSFAC= 0
##$ASSFACI= 0
##$ASSFACX= 0
##$ASSWID= 0
##$AUNMP= <proc_prof1d_extract_pilot.lims>
##$AXLEFT= 0
##$AXNAME= <>
##$AXNUC= <1H>
##$AXRIGHT= 0
##$AXTYPE= 0
##$AXUNIT= <>
##$AZFE= 0.1
##$AZFW= 0.1
##$BCFW= 0
##$BC_mod= 0
##$BYTORDP= 0
##$COROFFS= 0
##$CY= 15
##$DATMOD= 1
##$DC= 0
##$DFILT= <>
##$DTYPP= 0
##$F1P= 0
##$F2P= 0
##$FCOR= 0.5
##$FTSIZE= 32768
##$FT_mod= 6
##$GAMMA= 0
##$GB= 0
##$INTBC= 1
##$INTSCL= 1
##$ISEN= 128
##$LB= 0
##$LEV0= 0
##$LPBIN= 0
##$MAXI= 10000
##$MC2= 0
##$MEAN= 0
##$ME_mod= 0
##$MI= 0
##$NCOEF= 0
##$NC_proc= -8
##$NLEV= 6
##$NOISF1= 0
##$NOISF2= 0
##$NSP= 0
##$NTH_PI= 0
##$NZP= 0
##$OFFSET= 14.98509
##$PC= 1
##$PHC0= 182.005
##$PHC1= 0
##$PH_mod= 1
##$PKNL= yes
##$PPARMOD= 0
##$PPDIAG= 0
##$PPIPTYP= 0
##$PPMPNUM= 2147483647
##$PPRESOL= 1
##$PSCAL= 4
##$PSIGN= 0
##$PYNMP= <proc.py>
##$REVERSE= no
##$SF= 400.02
##$SI= 32768
##$SIGF1= 0
##$SIGF2= 0
##$SINO= 400
##$SIOLD= 32768
##$SPECTYP= <>
##$SREGLST= <1H.CDCl3>
##$SSB= 0
##$STSI= 32768
##$STSR= 0
##$SW_p= 8223.68421052631
##$SYMM= 0
##$S_DEV= 0
##$TDeff= 65536
##$TDoff= 0
##$TI= <>
##$TILT= no
##$TM1= 0
##$TM2= 0
##$TOPLEV= 0
##$USERP1= <user>
##$USERP2= <user>
##$USERP3= <user>
##$USERP4= <user>
##$USERP5= <user>
##$WDW= 1
##$XDIM= 32768
##$YMAX_p= 445628054
##$YMIN_p= -697212
##$CURPLOT= <Network HP LaserJet P1505>
##$CURPRIN= <$Network HP LaserJet P1505>
##$DFORMAT= <normdp>
##$LAYOUT= <+/1D_H.xwp>
##$LFORMAT= <normlp>
##$PFORMAT= <normpl>
##$SURQMSG= 1
$$ End of Bruker specific parameters
$$ ---------------------------------
##NTUPLES= NMR SPECTRUM
##VAR_NAME=  FREQUENCY,     SPECTRUM/REAL,   SPECTRUM/IMAG
##SYMBOL=    X,             R,               I
##VAR_TYPE=  INDEPENDENT,   DEPENDENT,       DEPENDENT
##VAR_FORM=  AFFN,          ASDF,            ASDF
##VAR_DIM=   32768,         32768,           32768
##UNITS=     HZ,            ARBITRARY UNITS, ARBITRARY UNITS
##FACTOR=    0.250966925370066, 1,           1
##FIRST=     8223.43324360094, -123920,      -46603
##LAST=      0,             -84037,          -287103
##MIN=       0,             -697212,         0
##MAX=       8223.43324360094, 445628054,    0
$$ Real data points
##PAGE= N=1
##DATA TABLE= (X++(R..R)), XYDATA
$$ [...]
19548B79026F7758F430J67249j9639K1741a68994p4698c2473G3770a70191D62749
$$ 279026 67758 6430 173679 154040 175781 -168994 -243692 -32473 73770 -170191 462749
19536A4060K6749n57b43014a1715B8039K4055b8284A53983h7708K3552J3716C05097
$$ 14060 40809 40252 -243014 -11715 28039 52094 -28284 153983 -87708 -64156 -50440 305097
19523a40438G1601a64264g5736A90073g5667k22887c2964B2236b05909i5093k62290
$$ -140438 71601 -164264 -75736 190073 -75667 -298554 -32964 22236 -205909 -95093 -357383
19512c57383a48338M5276A53071D9341a90253q7988a07275H322L5051J8873a42564
$$ -357383 -148338 -103062 153071 49341 -190253 -278241 -107275 8322 43373 62246 -142564
19500g0274B3678c30177g0048a3309G498i6902p4183A52324e5007D5602b40767
$$ -70274 23678 -330177 -70048 -13309 7498 -96902 -171085 152324 -55007 45602 -240767
19488A14352a13718o4877m4943h5065B97436H7159B3022d8321B1024b72537e8581
$$ 114352 -113718 -178595 -223538 -85065 297436 87159 23022 -48321 21024 -272537 -58581
19476d6977q139j73797I2575b39655h819j01068d754k18337I3932a3129A64926
$$ -46977 -55116 -228913 92575 -239655 -8819 -109887 -4754 -223091 93932 -13129 164926
19464B67213b67471G0056O1855b8978k00159M0966F082O9541B4571b26687A59443
$$ 267213 -267471 70056 131911 -28978 -229137 -188171 6082 75623 24571 -226687 159443
19452b96167A15731b15067f7956A28730b6841j5155n6389K5214B290a69150P4387
$$ -296167 115731 -215067 -67956 128730 -26841 -41996 -98385 -73171 2290 -169150 -94763
19441i4763F8853c9560D6226J11410J9032J09264E804i2845a4873G602a77938
$$ -94763 68853 -39560 46226 157636 176668 285932 5804 -92845 -14873 7602 -177938
19429A38079a71221L8683D39269A4012a58712C5769b77234B04182C6383b94975
$$ 138079 -171221 -132538 439269 14012 -158712 35769 -277234 204182 36383 -294975
19418b93710k3997b8058m64793A46899d750B23694b46021d7037p961l12121a47792
$$ -293710 -317707 -28058 -492851 146899 -4750 223694 -246021 -47037 -54998 -367119 -147792
19406A49069E607J51997a97635p8197J03738j96599i5238E4870a65369p4045L4909
$$ 149069 5607 157604 -197635 -275832 -172094 -368693 -95238 54870 -165369 -239414 -204505
19395b04505d3526B2676F684b19494C7377a05266A94775B7057R7454j3963a30411
$$ -204505 -43526 22676 6684 -219494 37377 -105266 194775 27057 124511 110548 -130411
19383C9139c44525A88327b65383K263e5298j83477F8020h0733L8594k4737C01720
$$ 39139 -344525 188327 -265383 -263120 -55298 -238775 68020 -80733 -42139 -66876 301720
19371b74481a20347A39824a52001D3176a66259A77929J38659a18836H6912M5896
$$ -274481 -120347 139824 -152001 43176 -166259 177929 316588 -118836 86912 132808
19361A32808c6174I9588B6871r936K29285B4524b96328J18672J7786A21673n2495
$$ 132808 -36174 99588 26871 16935 246220 24524 -296328 -177656 -159870 121673 69178
19350F9178b46766j23534a4021D3609L465J8724A0571J83640e1278k24949Q5879
$$ 69178 -246766 -370300 -14021 43609 47074 65798 10571 194211 -51278 -276227 -190348
19339a90348k98725F1208d5362j18170c1695A22311c3305A55651a88706r6592
$$ -190348 -489073 61208 -45362 -163532 -31695 122311 -33305 155651 -188706 -285298
19329b85298c2494j12584m7464f3445a8019b784k83677i5722j63928B5759N1694
$$ -285298 -32494 -145078 -192542 -63445 -18019 -2784 -286461 -95722 -259650 25759 77453
19318G7453c01516c2156B94289c86473a24181L214M9198m1745j61186O7189R6742
$$ 77453 -301516 -32156 294289 -386473 -124181 -120967 -71769 -113514 -274700 -207511 -110769
19307a10769P889N924b3355A7552b4198B9184K08836a29349C47435j13342i8031
$$ -110769 -102880 -96956 -23355 17552 -24198 29184 238020 -129349 347435 234093 -98031
19295a25982j89900J33217A25497b80517M486f7499p9055A08788b23099F810a9302
$$ -125982 -315882 -182665 125497 -280517 -276031 -67499 -146554 108788 -223099 6810 -19302
19283A52059c27302B80472h7217B14893b14907f4125C13603r0826D3922k1072
$$ 152059 -327302 280472 -87217 214893 -214907 -64125 313603 222777 43922 22850
19273B2850c19283A14246b93329E3944B617c48378e6397o8225m7641C2979E761
$$ 22850 -319283 114246 -293329 53944 2617 -348378 -56397 -124622 -172263 32979 5761
19261a81860A38145f3994o8317d5453j8477A76440q4831b4872G5252J07112a64347
$$ -181860 138145 -63994 -132311 -45453 -63930 176440 91609 -24872 75252 182364 -164347
19249D2981i777B57793r6576N6519b84298J21180c2751f991A77318a98587e0381
$$ 42981 -9777 257793 161217 217736 -284298 -163118 -32751 -6991 177318 -198587 -50381
19237I7113a11525A93880E2199d4292A3388C4K6431o644K49331e28758a31678
$$ 97113 -111525 193880 52199 -44292 13388 34 26465 19821 269152 -528758 -131678
19225I6976P9758i2083p8242A43738E9090b46562j5698I841e7335G6099i7332
$$ 96976 176734 -92083 -170325 143738 59090 -246562 -262260 9841 -57335 76099 -97332
19213a61956o8493L7768a7014E7805B2823J04001A2567J45348l7231M5146c269
$$ -161956 -230449 -192681 -17014 57805 22823 126824 12567 157915 120684 165830 -3269
19201C8818a71537F805b8185L373D07829E4667a51279M2367b3406j01948A37047
$$ 38818 -171537 6805 -28185 -24812 407829 54667 -151279 -108912 -23406 -125354 137047
19189i5454L8920j51708j16881G3829d81484E4651L4142a05016B78515b69835
$$ -95454 -56534 -208242 -325123 73829 -481484 54651 88793 -105016 278515 -269835
19178A82332a16729I6691b54144G9153j1010J6024M3013D3542d6835a3706B08141
$$ 182332 -116729 96691 -254144 79153 68143 84167 127180 43542 -46835 -13706 208141
19166C9084a77564l3905c3741c309j51939f2538B60233a18032n0706N6875r8694
$$ 39084 -177564 -211469 -33741 -3309 -155248 -62538 260233 -118032 -168738 -111863 -210557
19155b10557j56754A85501i107j7636k66429E1175A5453h5392c8435k78751C09471
$$ -210557 -367311 185501 -9107 -26743 -293172 51175 15453 -85392 -38435 -317186 309471
19143I7136b03704P311f0583l166A32906j4017b7260A94424c44344J58111m0398
$$ 97136 -203704 -196393 -60583 -63749 132906 118889 -27260 194424 -344344 -186233 -226631
19132b26631l4851H8356h0012L1199C5120c5187k7657j00889j43971A21391Q0048
$$ -226631 -261482 88356 -80012 -48813 35120 -35187 -62844 -163733 -307704 121391 201439
19121B01439a40558A52942d5965j76717h5689A67164p6624j2091c01350C0653
$$ 201439 -140558 152942 -45965 -222682 -85689 167164 90540 78449 -301350 30653
19110A79547a36847F2933b90597C3977a95930f3309r554B38786c4958r9203A315
$$ 179547 -136847 62933 -290597 33977 -195930 -63309 -72863 238786 -34958 -134161 1315
19098b3052k88883a18341j30531l2860R5786E2602M51K06041b01657A10747b60031
$$ -23052 -311935 -118341 -248872 -281732 -185946 52602 53053 259094 -201657 110747 -260031
19086C8415b25339a07074A10854a50176E2046P0302a08232l3885o4724Q6700a2702
$$ 38415 -225339 -107074 110854 -150176 52046 122348 -108232 -142117 -206841 -120141 -12702
19074b64744a08499j6658G6355a81897N2040M9347m8905B74057E42J6039b16628
$$ -264744 -108499 -125157 76355 -181897 -129857 -80510 -129415 274057 542 16581 -216628
19062b51446H5585e4557o1701B7831L25540b72881e1885j68209M3714A30290f4470
$$ -251446 85585 -54557 -116258 27831 353371 -272881 -51885 -220094 -176380 130290 -64470
19050A28027a9389j30954F2029b12383i0950A73965o7368C8915a09652I1281A826
$$ 128027 -19389 -150343 62029 -212383 -90950 173965 106597 38915 -109652 91281 1826
19038a14283A8706a71302l39534N8317h6529D838J6103e6484B6872K4362J10131
$$ -114283 18706 -171302 -510836 -452519 -86529 4838 20941 -56484 26872 51234 161365
19027A61365L8322p314B5214a610H0159C3127d7260j27965C5503c54115E8766
$$ 161365 199687 192373 25214 -1610 80159 33127 -47260 -175225 35503 -354115 58766
19015A83713a95544A82228f3077M865l1122A65671b3869j17541A62295B1454a90852
$$ 183713 -195544 182228 -63077 -58212 -89334 165671 -23869 -141410 162295 21454 -190852
19003a47956a8584A03665c70026A86406E242J49838A0687J32125b1956o6352A63991
$$ -147956 -18584 103665 -370026 186406 5242 155080 10687 142812 -21956 -88308 163991
18991b8721j03469K5383D5743Q198a88045l73902a04499C41376E6450b24157B16643
$$ -28721 -132190 -106807 45743 53941 -188045 -561947 -104499 341376 56450 -224157 216643
18979G0286h0985B31017a9822m2746G9359a05267k2830D7912a19478A78380d33685
$$ 70286 -80985 231017 -19822 -62568 79359 -105267 -128097 47912 -119478 178380 -433685
18967B06809r0166b15913N4235j0551A2642h9096B4527b01850A29755D2309N5302
$$ 206809 116643 -215913 -161678 -172229 12642 -89096 24527 -201850 129755 42309 97611
18956I7611J01423f4991A03953b62377f4279n4193N6424k8503j27534j41575A82561
$$ 97611 199034 -64991 103953 -262377 -64279 -118472 -62048 -90551 -218085 -359660 182561
18944a11327A63945c74786g8816k9031A56398p0146b53802m6320D7182e23393
$$ -111327 163945 -374786 -78816 -107847 156398 86252 -253802 -300122 47182 -523393
18933A57750a07446A73021F9485J96583b01677A34833D7237O3708c5935A28527
$$ 157750 -107446 173021 69485 266068 -201677 134833 47237 110945 -35935 128527
18922e2748B48354H7867f505F9414h367j24944A40066A5772a56605L9388j03220
$$ -52748 248354 87867 -6505 69414 -8367 -133311 140066 15772 -156605 -117217 -220437
18911b20437J02944L4934B91729a57914H9830a48744d6210k01312E3096L2544
$$ -220437 -117493 -82559 291729 -157914 89830 -148744 -46210 -247522 53096 85640
18901H5640a14224b6582F3590d3629j43930k9464A83068e2097H1750M5110b26361
$$ 85640 -114224 -26582 63590 -43629 -187559 -217023 183068 -52097 81750 126860 -226361
18889f0031k84575F1985J82247D18d111j13689e5040A15210a16540j15965b472
$$ -60031 -344606 61985 244232 418 -4111 -117800 -55040 115210 -116540 -232505 -2472
18877A93715E4793a19630j04353g9169A47872e1420l4264j09769C07598a89121
$$ 193715 54793 -119630 -223983 -79169 147872 -51420 -85684 -195453 307598 -189121
18866B9866a86735E8528a18652L8808j54212J1782F5809a81921B5756K38745b224
$$ 29866 -186735 58528 -118652 -79844 -234056 -222274 65809 -181921 25756 264501 -2224
18854B71123A4402K7908J19606d8851A59909F5504b01643C7973K78409j06444
$$ 271123 14402 42310 161916 -48851 159909 65504 -201643 37973 316382 209938
18844B09938k0971a48292A55848C775N2767b00579k07716A76105E249J54812b55352
$$ 209938 188967 -148292 155848 3775 56542 -200579 -408295 176105 5249 160061 -255352
18832C47271a70473B8126K68659d8859p4578A70668B1760b4980I4580f9067m4741
$$ 347271 -170473 28126 296785 -48859 -123437 170668 21760 -24980 94580 -69067 -113808
18821a13808j14116H425L9039K31981a1023E5990A6918a15976C78755a62072M0399
$$ -113808 -227924 8425 47464 279445 -11023 55990 16918 -115976 378755 -162072 -121673
18810a21673D17583o1907A62495K60918e742k78858E88242a82320L0928A95125
$$ -121673 417583 355676 162495 423413 -5742 -284600 588242 -182320 -151392 195125
18799a83638a6571r5789B68775i3215G9404e8707A05205f9781j73877d0676H1405
$$ -183638 -16571 -112360 268775 -93215 79404 -58707 105205 -69781 -243658 -40676 81405
18787a72167A08013J86948h390I8154c29932G4585a74j64593l7526q2752O0357
$$ -172167 108013 294961 -8390 98154 -329932 74585 -174 -164767 -202293 -285045 -224688
18776b24688Q3061L4986k28434h2998k3306K1438j27961C282M718h7944k7497
$$ -224688 -141627 -106641 -335075 -82998 -106304 -84866 -212827 3282 8000 -87944 -115441
18765a15441B28219m8816c53967J72897m1030d2926p7808j87866a10495j27049
$$ -115441 228219 179403 -353967 -181070 -222100 -42926 -120734 -308600 -110495 -237544
18755b37544B7780h7336j62265C9479d0590q567A17211f0444k047J6753o7493
$$ -237544 27780 -87336 -249601 39479 -40590 -49157 117211 -60444 -62491 -45738 -113231
18744a13231J7203H1787i5528A05949b34917I3188k4281b16220c9409B8494K1816
$$ -113231 -96028 81787 -95528 105949 -234917 93188 68907 -216220 -39409 28494 50310
18733E0310M1433J08352b64431e6953j49519B9972J3363i9592k51581a14235B5622
$$ 50310 91743 200095 -264431 -56953 -206472 29972 43335 -99592 -351173 -114235 25622
18721g9820j42049J09129K4298A08341a83528c2327j42526K9920B54110a92983
$$ -79820 -221869 -112740 -88442 108341 -183528 -32327 -174853 -144933 254110 -192983
18710A7401E529a74256e8605j5194L0195j38789L9943o5649e4926j36011c4880
$$ 17401 5529 -174256 -58605 -73799 -43604 -182393 -142450 -208099 -54926 -190937 -34880
18698b82875R8923O3311D9261b09446A23624b12481A54381k3952A6878a84435
$$ -282875 -183952 -120641 49261 -209446 123624 -212481 154381 130429 16878 -184435
18687B53371c17882a33262p0279N6372K1791A79885p6456R642g4467p808B92645
$$ 253371 -317882 -133262 -203541 -147169 -125378 179885 103429 113071 -74467 -82275 292645
18675h3339j15992i8691B05868C7384i8436k16767A25407h9544j65078H4376h8798
$$ -83339 -199331 -98691 205868 37384 -98436 -315203 125407 -89544 -254622 84376 -88798
18663i657k17656A58325e6844B89290g1092C07182j39552d25212b02257a512G3019
$$ -9657 -227313 158325 -56844 289290 -71092 307182 167630 -425212 -202257 -1512 73019
18651H4866b4734R923D5337K64940h2536F4130g963A11785d6A92165a36176j94164
$$ 84866 -24734 -14811 45337 310277 -82536 64130 -7963 111785 -46 192165 -136176 -330340
18639c30340A84697a34266L9043D8062J80230a11020G55a18034B21299c43747
$$ -330340 184697 -134266 -95223 48062 228292 -111020 755 -118034 221299 -343747
18628A4722L2671i3929a210q7705J3244q9695E7667J00341f867j99693g7274j08744
$$ 14722 47393 -93929 -1210 -88915 -75671 -165366 57667 158008 -6867 -206560 -77274 -186018
18616a86018b8639r9280l71904D43781a40892k0090M5372J5677k71630J28221
$$ -186018 -28639 -127919 -499823 443781 -140892 -160982 -115610 -99933 -371563 -243342
18606b43342Q9163D1737b66899P5979C426K37050a11283K7777A63196b27298B54563
$$ -243342 -154179 41737 -266899 -190920 3426 240476 -111283 -83506 163196 -227298 254563
18594b1823k09303e5810A1579a05631j00432f4282B01519o3332a55977B65829
$$ -21823 -231126 -55810 11579 -105631 -206063 -64282 201519 138187 -155977 265829
18583A36382e1028k05786H9040c59522A21263d2751j74748R3987A85115d6004
$$ 136382 -51028 -256814 89040 -359522 121263 -42751 -217499 -123512 185115 -46004
18572A05310M4613e7792k2553l00234J27202A15126a36809b9128l5790B769O3857
$$ 105310 149923 -57792 -80345 -380579 -253377 115126 -136809 -29128 -64918 2769 66626
18561F6626l2176a37876A33012A2344c80095a81794I2357O3252K6676c6303A095
$$ 66626 34450 -137876 133012 12344 -380095 -181794 92357 155609 182285 -36303 1095
18549d6020j97891j21373C8297c26078J08622k10433A01296a72487d5622B8311
$$ -46020 -243911 -365284 38297 -326078 -217456 -427889 101296 -172487 -45622 28311
18538b47308O8402M9045a6998q8843A68407a11483q145j08726k5807F7020K17881
$$ -247308 -178906 -129861 -16998 -105841 168407 -111483 -119628 -228354 -254161 67020 284901
18527B84901b32225A76936G322K14020j08938i3156j06434e2294j97918k30982
$$ 284901 -232225 176936 7322 221342 112404 -93156 -199590 -52294 -250212 -481194
18517d81194a90989c0673l20I1526b02474i8985d1164j4234B618g0733n8865d7548
$$ -481194 -190989 -30673 -30993 91526 -202474 -98985 -41164 -55398 2618 -70733 -129598 -47548
18504a69729B8322A2013Q5649d6447p0188a7863q3783M0687l69447A99396b36869
$$ -169729 28322 12013 97662 -46447 -116635 -17863 -101646 -60959 -430406 199396 -236869
18492a64442k5432g1411j96815c3917I509j748b81075a8595j01947G1404k3256
$$ -164442 -189874 -71411 -268226 -33917 9509 7761 -281075 -18595 -120542 71404 48148
18481D8148J33050A6559b43233B7808e8509l78214A93478E0472R8467Q0703g5935
$$ 48148 181198 16559 -243233 27808 -58509 -436723 193478 50472 148939 229642 -75935
18469b43156h4420L9894C31070e3358l8090C6686K10574a84555P4831k09142J39649
$$ -243156 -84420 -44526 331070 -53358 -91448 36686 247260 -184555 -109724 -318866 -179217
18458a79217A2776c3826E3164a85870Q88A8377P7120j8575A0022J8840J20535
$$ -179217 12776 -33826 53164 -185870 -184982 18377 95497 76922 10022 28862 149397
18447A49397I206a37451a0214B2759j325a90324I5658J01189G789K2802a48231
$$ 149397 9206 -137451 -10214 22759 21434 -190324 95658 196847 7789 30591 -148231
18435b80275e3274o673g471j69672N9816A79905a50075C1767b88393L2941C20827
$$ -280275 -53274 -59947 -7471 -177143 -117327 179905 -150075 31767 -288393 -255452 320827
18423g9989l7264F131e1619A0523J6176h6485a5747A26460b3815k27593o3997
$$ -79989 -117253 6131 -51619 10523 26699 -86485 -15747 126460 -23815 -251408 -315405
18412c15405C4058a61165B10152B9303J18958p0599a8315C49263A40028b19889
$$ -315405 34058 -161165 210152 29303 148261 77662 -18315 349263 140028 -219889
18401C5669d9629m4598J4287G5060a99799Q2435A41442q111a465j58264D4639
$$ 35669 -49629 -94227 -79940 75060 -199799 -117364 141442 133331 -1465 -159729 44639
18389d6821A04406d5394j34070I2889J5025K35089m9283a54193C52350j34857
$$ -46821 104406 -45394 -179464 92889 107914 343003 293720 -154193 352350 217493
18379B17493b10104B21618a49839L7946j69838q2253a24970C9322L59754g2827
$$ 217493 -210104 221618 -149839 -111893 -281731 -363984 -124970 39322 399076 -72827
18368e9755j22742o3935h6873A28060d2288L607I5072b7270j55920A20675B4738
$$ -59755 -182497 -246432 -86873 128060 -42288 -38681 95072 -27270 -183190 120675 24738
18356f9532D3070a06402F4718J88511A22417a72578A5130a82364g5614A47753
$$ -69532 43070 -106402 64718 253229 122417 -172578 15130 -182364 -75614 147753
18345a26850d8055k30655A4613J70553m9852b66976a01837k04142G1356l1687
$$ -126850 -48055 -278710 14613 185166 135314 -266976 -101837 -305979 71356 39669
18335C9669j5102J44507d24107A6201b02019H5282K49721G7690c86356h743k22182
$$ 39669 24567 169074 -424107 16201 -202019 85282 335003 77690 -386356 -8743 -230925
18324b30925q9431A62860i5190b1565n1648l12099b0254C04298a2651E1483M1282
$$ -230925 -320356 162860 -95190 -21565 -73213 -385312 -20254 304298 -12651 51483 92765
18313I2765b97083C449d15848I1669i0290j93333B9724O4537c38786A72168k0712
$$ 92765 -297083 3449 -415848 91669 -90290 -283623 29724 94261 -338786 172168 151456
18302A51456b14961c9444n3383C2036K37538j12200a66714f0711A60909a89261
$$ 151456 -214961 -39444 -92827 32036 269574 157374 -166714 -60711 160909 -189261
18291a75398g4397I1032K23553j06434b06084J349A00592C8276b57293O4600N1669
$$ -175398 -74397 91032 314585 208151 -206084 -204735 100592 38276 -257293 -192693 -141024
18280a41024C772a77992B5965b88547f1683N520m245i727B53223b64675H4468
$$ -141024 3772 -177992 25965 -288547 -61683 -56163 -60408 -9727 253223 -264675 84468
18268b34376J01262e4543B33586i90A21230c82178a17245m4890q592Q2696j51983
$$ -234376 -133114 -54543 233586 -990 121230 -382178 -117245 -162135 -170727 -88031 -240014
18257b40014R3068J4044B88558C1101C401b25983p5024B03069E4614A8854a1923
$$ -240014 -146946 -132902 288558 31101 3401 -225983 -301007 203069 54614 18854 -11923
18245h6084A07794a26841j67076H4148a64826A5129J16642a88084M8103A95087
$$ -86084 107794 -126841 -293917 84148 -164826 15129 131771 -188084 -139981 195087
18234c34247C7656b75727h4358l9016E6369i3201q626C3664J255f6469j17668
$$ -334247 37656 -275727 -84358 -123374 56369 -93201 -101827 33664 34919 -66469 -184137
18223a84137O8928A99401H9449B2475a5859B4483J38951O406a84038D8154h8034
$$ -184137 -115209 199401 89449 22475 -15859 24483 163434 169840 -184038 48154 -88034
18211a22373k4230K2112B40717I8214c54986E9416h4343j41587f1136m4239c9103
$$ -122373 -146603 -124491 240717 98214 -354986 59416 -84343 -225930 -61136 -105375 -39103
18199B90869b04320Q9294j70068E2494a93510L7736A8655L7007a6849G3786c0976
$$ 290869 -204320 -115026 -285094 52494 -193510 -155774 18655 55662 -16849 73786 -30976
18187H5112a23845C95730j85039E0942J73728a22915N5522k8939B66606a02661
$$ 85112 -123845 395730 210691 50942 224670 -122915 -67393 -96332 266606 -102661
18176b43656a16695e6010G4450k0818N1466B5522b83827G0947f00j86492O7324
$$ -243656 -116695 -56010 74450 53632 105098 25522 -283827 70947 -600 -187092 -119768
18165a19768r7043M2604K6756J9845A32568a4544B42018m2059p1851O5533a37695
$$ -119768 -216811 -174207 -147451 -127606 132568 -14544 242018 199959 128108 193641 -137695
18153c88632J26001C65899G2210a60221k7928i1049n09526D6427b16258h4087
$$ -388632 -262631 365899 72210 -160221 -188149 -91049 -600575 46427 -216258 -84087
18142g5872j75006H6880e791o5787m4551k01843B59545b25901C44594h0377B36318
$$ -75872 -250878 86880 -5791 -71578 -116129 -317972 259545 -225901 344594 -80377 236318
18130b18021k16045C2923J642a82087h1340i562k58084D560c79156B7856K2257
$$ -218021 -434066 32923 34565 -182087 -81340 -9562 -267646 4560 -379156 27856 50113
18119E0113Q8264c72474J74574H9934a6104e28j83168C357B48a64235g6869k31019
$$ 50113 138377 -372474 -197900 89934 -16104 -528 -183696 3357 248 -164235 -76869 -307888
18107c07888J47071C46597D6003a05680B13220b6792m4187G4926a659D54179a30188
$$ -307888 -160817 346597 46003 -105680 213220 -26792 -70979 74926 -1659 454179 -130188
18095a87901M449j39940R7534e6900B91594D0359c17358A74483M0266F1753J24049
$$ -187901 -183452 -323392 -225858 -56900 291594 40359 -317358 174483 214749 61753 185802
18084A85802m3452f5005A06311a11677r7647I3583a02150L1721j25843j42944
$$ 185802 142350 -65005 106311 -111677 -209324 93583 -102150 -70429 -196272 -339216
18074c39216B16816a13672j4564m4206e4481k12183a08709l2237B17813b70050
$$ -339216 216816 -113672 -128236 -172442 -54481 -266664 -108709 -140946 217813 -270050
18063a4895A79448G1581b3139n7538A69402p9433A913b46378Q3575C9084M302
$$ -14895 179448 71581 -23139 -80677 169402 89969 1913 -246378 -162803 39084 43386
18052D3386a11522A82911F8072j5045a24320H8224A5680O2796a3008G5467a51130
$$ 43386 -111522 182911 68072 53027 -124320 88224 15680 78476 -13008 75467 -151130
18040B6140M1207K07651i5147A60417J35956a8343k54991A17324J992f993j02810
$$ 26140 67347 274998 -95147 160417 296373 -18343 -273334 117324 119316 -6993 -109803
18029a09803A06728N2244d07999A48045a19324A03895a23451e5593A7089J62332
$$ -109803 106728 158972 -407999 148045 -119324 103895 -123451 -55593 17089 179421
18019A79421i8918b4498A07882L6455a48975n8516E2188O7069D2866d6611C5412
$$ 179421 -98918 -24498 107882 144337 -148975 -207491 52188 119257 42866 -46611 35412
18007H7623h3943b5716k15869i6493l1339k21386a29715f3796k45443J25841A18780
$$ 87623 -83943 -25716 -241585 -96493 -127832 -349218 -129715 -63796 -309239 -183398 118780
17995f5246K9608k82717F8508g665A13269d5408A8674a00739A87449H7802M6503
$$ -65246 -35638 -318355 68508 -7665 113269 -45408 18674 -100739 187449 87802 134305
17984A34305f8248B12822f7971j0666D3925a22161H8434b56586A86797c0116k5887
$$ 134305 -68248 212822 -67971 -78637 43925 -122161 88434 -256586 186797 -30116 -56003
17973e6003k09127d3688k69809i0065j6518G1209L8947h4820K0018A64504a12157
$$ -56003 -265130 -43688 -313497 -90065 -106583 71209 110156 -84820 -64802 164504 -112157
17961a04908C8036J37664b80076E4957J1698J89861c22644a21472q6387a4900
$$ -104908 38036 175700 -280076 54957 66655 256516 -322644 -121472 -207859 -14900
17950b45182B09523d8293p9979A09141A0366b16127R7666d2027a2805F2985N59
$$ -245182 209523 -48293 -128272 109141 10366 -216127 -118461 -42027 -12805 62985 63544
17939F3544F234K16963i932A32268F3929b94127J15858F9103b90208a0950A17441
$$ 63544 6234 223197 -9932 132268 63929 -294127 -178269 69103 -290208 -10950 117441
17927a23639B1979b83871J14466H7611i8626A59819A9974J16566L8537b19286
$$ -123639 21979 -283871 -169405 87611 -98626 159819 19974 136540 175077 -219286
17916a14110I8062e1786B90023j09221H5824a71204m2028F1030e9553A84745b10350
$$ -114110 98062 -51786 290023 180802 85824 -171204 -213232 61030 -59553 184745 -210350
17904c99043C48659H5283O5203l5925a73761A53123c6460A49356f4025B75065
$$ -399043 348659 85283 150486 114561 -173761 153123 -36460 149356 -64025 275065
17893a95094l4289K893j35292J52307M799A56109a01030C0931J45005i0277A82566
$$ -195094 -229383 -226490 -361782 -209475 -204676 156109 -101030 30931 175936 -90277 182566
17881B44713c53568R5338a14715j84462A69714b12278j0633H2919b75309i6511
$$ 244713 -353568 -258230 -114715 -299177 169714 -212278 -222911 82919 -275309 -96511
17870B0409a66664b0619k13549i1416j16722b0209G1326J89320p7599G8299B1555
$$ 20409 -166664 -20619 -234168 -91416 -208138 -20209 71326 260646 183047 78299 21555
17858B3612J93203h9927m4814A75002h3482j65442q069K8948C5407a94396A19921
$$ 23612 216815 -89927 -134741 175002 -83482 -248924 -256993 -228045 35407 -194396 119921
17846A90598G5158P202b1519k90986c377j7814B2797a36859b1871A27655a51647
$$ 190598 75158 82360 -21519 -312505 -3377 -21191 22797 -136859 -21871 127655 -151647
17834c6213p0144D240Q6047K3242K8021b4062B4632K73365p07b81941E788J62121
$$ -36213 -106357 4240 90287 113529 141550 -24062 24632 297997 297290 -281941 5788 167909
17822A67909B0469J92056g9929j34271M6294A80844o8887B3243K28175f3029j81306
$$ 167909 20469 212525 -79929 -214200 -167906 180844 111957 23243 251418 -63029 -244335
17811b44335a8859G7946d07671m7433a44925c0961j04955A00001c21112B41729
$$ -244335 -18859 77946 -407671 -455104 -144925 -30961 -135916 100001 -321112 241729
17800A52486C7799g1898d890G1928a13846o7625o4618N0995B2000f6658o0324
$$ 152486 37799 -71898 -4890 71928 -113846 -181471 -246089 -195094 22000 -66658 -126982
17789a26982j555N3635p6197A06599a25757D70412E7061a22076j27052F0287A8514
$$ -126982 -128537 -74902 -151099 106599 -125757 470412 57061 -122076 -249128 60287 18514
17777A68359o9665a69530e6917j3181M456A73888A2327K32432J75674b5965l4948
$$ 168359 98694 -169530 -56917 -70098 -65642 173888 12327 244759 420433 -25965 -60913
17766f0913A7261J91716a04860a1006l14090c1485A75483J60989q9920o149A4705
$$ -60913 17261 208977 -104860 -11006 -325096 -31485 175483 336472 246552 240403 14705
17754a18021A28817Q3835a4233j69735A33687A1976Q8927b5736A88811C8848l693
$$ -118021 128817 212652 -14233 -183968 133687 11976 100903 -25736 188811 38848 35155
17743C5155g7592A52363c19691k08909C8606J45583L4487j03100i2526j83533
$$ 35155 -77592 152363 -319691 -528600 38606 184189 218676 115576 -92526 -276059
17733b76059F9646Q1961c22626A00827J2275a57366B5858b9813j1025C41045i2118
$$ -276059 69646 151607 -322626 100827 113102 -157366 25858 -29813 -40838 341045 -92118
17721C43056G7743g4558A85545d7719l0667j18449D0149K1684d08720C98498b59200
$$ 343056 77743 -74558 185545 -47719 -78386 -196835 40149 61833 -408720 398498 -259200
17709G7731K10919q0605d721A89604a63685A18577K11734j39555a12756j02843
$$ 77731 288650 208045 -4721 189604 -163685 118577 330311 190756 -112756 -215599
17699b15599A8628M0931J34867a22249a6868I6429G44R2971g9005b4974B46373
$$ -215599 18628 59559 194426 -122249 -16868 96429 744 93715 -79005 -24974 246373
17687A44219D80R2547a77160A49104b66306A78618b7003j55748C32019A26787
$$ 144219 480 93027 -177160 149104 -266306 178618 -27003 -182751 332019 126787
17676A18778C7118K11380d59480B74637h0072G1713E83L17771b22708B1060b76301
$$ 118778 37118 248498 -459480 274637 -80072 71713 583 318354 -222708 21060 -276301
17664H2215K6162b50207A16011J79164b05687H7096K8610j3830J8115D9044P527
$$ 82215 108377 -250207 116011 295175 -205687 87096 115706 101876 119991 49044 56571
17653E6571g0739b2753n5606B56452a5869A95851D1171K29986a12583A0514a29623
$$ 56571 -70739 -22753 -78359 256452 -15869 195851 41171 271157 -112583 10514 -129623
17641H5545c25523J17552H5497C0630j4004C123c3606A00285P9227i1144j55573
$$ 85545 -325523 -207971 85497 30630 16626 3123 -33606 100285 179512 -91144 -246717
17630b46717C29309g0735j2652A62350E5485a79005B63005h2886b8617H9414Q5299
$$ -246717 329309 -70735 -83387 162350 55485 -179005 263005 -82886 -28617 89414 174713
17619A74713c1749j4748C68981A63270f8091P126B67949q5922R0075A35744J11448
$$ 174713 -31749 -46497 368981 163270 -68091 -60965 267949 182027 272102 135744 247192
17608B47192n8989k6889D1534M4135i8349C570K40287E4826a056j30234j68970
$$ 247192 188203 161314 41534 85669 -98349 3570 243857 54826 -1056 -131290 -300260
17597c00260J28454h0815D2472e3332j9061B08559a04861C41843A54130M4289
$$ -300260 -171806 -80815 42472 -53332 -72393 208559 -104861 341843 154130 198419
17587A98419H9606L37813A01552k6596K37163g272F1584d7738j12728D9307b725
$$ 198419 89606 427419 101552 74956 312119 -7272 61584 -47738 -160466 49307 -2725
17575A3238a26030F9203H334a044r0763E7642K02840a44641A70824d31939a25167
$$ 13238 -126030 69203 8334 -1044 -91807 57642 260482 -144641 170824 -431939 -125167
17563H2944a87565A45345L2219K8190a90688C24858e2499j37381B52231E0122
$$ 82944 -187565 145345 177564 205754 -190688 324858 -52499 -189880 252231 50122
17552a01532a2146C2677f227k097C38301f4532B25781b4289A81459A2187P1004
$$ -101532 -12146 32677 -6227 -8324 338301 -64532 225781 -24289 181459 12187 83191
17541H3191k1439b9988m2113k0493c1574A09350a31610A29000J27687c03407B46004
$$ 83191 61752 -29988 -72101 -92594 -31574 109350 -131610 129000 256687 -303407 246004
17529g8176C23668A40086a29646L4020j25614A1284J2616L29157I062c0843B25268
$$ -78176 323668 140086 -129646 -95626 -221240 11284 23900 353057 9062 -30843 225268
17517H3670g9788D0027P4905j1993J24948a57660A29912a59534B96618q4686O9348
$$ 83670 -79788 40027 114932 102939 227887 -157660 129912 -159534 296618 211932 281280
17506B81280M1141a900B38052A5422L02548I8934D2067a32028e9475j51219k9331
$$ 281280 322421 -1900 238052 15422 317970 98934 42067 -132028 -59475 -210694 -240025
17495b40025A66423l7587d2961j66136C72590i6481C08838g890j88948I4203b16676
$$ -240025 166423 128836 -42961 -209097 372590 -96481 308838 -7890 -196838 94203 -216676
17483H9763L498K66416j60638j9540N4545Q3802A53604J38907K36640A82830F650
$$ 89763 93261 359677 199039 179499 234044 317846 153604 292511 529151 182830 6650
17471H0588A5507c1282D05705c9529H068J87882c0089j01440D42362j10160J25053
$$ 80588 15507 -31282 405705 -39529 8068 195950 -30089 -131529 442362 332202 457255
17460D57255A76673o547b1596B40115r0645L8891a8201j17273B41475J95805A78121
$$ 457255 176673 170126 -21596 240115 149470 188361 -18201 -135474 241475 437280 178121
17448C38744n1749k2670O0081I0023J58828G2011O8840M1247P4172H8203m935
$$ 338744 286995 264325 324406 90023 248851 72011 140851 182098 256270 88203 83268
17437H3268J99102b7720F6873L59259L4940A87461K51396M072j96960H6472M898
$$ 83268 282370 -27720 66873 426132 461072 187461 438857 442929 245969 86472 91370
17426I1370j9257Q5742O3555M5378j31685M99927H615J41130J61772q7268K45567
$$ 91370 72113 157855 221410 266788 135103 635030 8615 149745 311517 224249 469816
17415D69816A81776J15226q1620F8121f5605I9843g6680E5730a86372A04792K34348
$$ 469816 181776 297002 215382 68121 -65605 99843 -76680 55730 -186372 104792 339140
17404C39140m3390M0151A5762M11340A75449L11900c94206A68122H2360R1440
$$ 339140 295750 335901 15762 427102 175449 487349 -394206 168122 82360 173800
17394A73800a18645A79142J42517A57065b61046a12180D5295N3221O9365a3522
$$ 173800 -118645 179142 321659 157065 -261046 -112180 45295 98516 167881 -13522
17383A70970N6147A11839J72930q7332p3379j3115D2853N1746R6266n3872e3089
$$ 170970 227117 111839 284769 197437 124058 110943 42853 94599 190865 136993 -53089
17371A72387n0459e2886B23353I2087J64392F8587J93062q3620D7662M91232d859
$$ 172387 121928 -52886 223353 92087 256479 68587 261649 178029 47662 538894 -4859
17359A50400J81530j23098g9444C42868E3204L05918A0907M2188K2768J05577
$$ 150400 331930 208832 -79444 342868 53204 359122 10907 53095 75863 181440
17349A81440C4380K47203I0829a63015j7200g8069C00726A45982M6842J07552
$$ 181440 34380 281583 90829 -163015 -180215 -78069 300726 145982 192824 300376
17339C00376b80582D39653j86441j14645J41062F4987K01917D5101J13480b43698
$$ 300376 -280582 439653 253212 138567 279629 64987 266904 45101 158581 -243698
17328A67024M6231a08053B21461Q8858j02400p1586K47554E2017a1696H2865k9303
$$ 167024 213255 -108053 221461 310319 207919 136333 383887 52017 -11696 82865 53562
17317E3562c4049B49635H8049a15164K8126A25031K51626A04236J3334L6673M5817
$$ 53562 -34049 249635 88049 -115164 -87038 125031 376657 104236 117570 154243 200060
17306B00060b3132E3154J99772n6831b4217A36719M14435B30329K85270k54774
$$ 200060 -23132 53154 252926 196095 -24217 136719 551154 230329 515599 260825
17296B60825a63461B96526c6424C05736K3820A10584D6816L39893o5703A01826
$$ 260825 -163461 296526 -36424 305736 329556 110584 46816 386709 321006 101826
17285C38331e9233A26789J60836D9850K38875K57746a9046C17807C6531e8260
$$ 338331 -59233 126789 287625 49850 288725 546471 -19046 317807 36531 -58260
17274C64791B3685J92802q2855J69431f175A10819B7696R1880n7228J49699K04731
$$ 364791 23685 216487 133632 303063 -6175 110819 27696 119576 62348 212047 416778
17263D16778C9671K4402J11770J17780D2962J47566e8162A17397J59493r6388
$$ 416778 39671 64073 175843 293623 42962 190528 -58162 117397 276890 180502
17253A80502p4895J27755a53605A80148K78569a83360e9320k4013B44791e3517
$$ 180502 105607 233362 -153605 180148 458717 -183360 -59320 -83333 244791 -53517
17242A03268L42678j59480o8698P7217J6239j50859G3696A9221J54029J14123
$$ 103268 445946 286466 217768 294985 311224 160365 73696 19221 173250 287373
17232B87373g4419B96690F5455e9136A30724M9000o1763b16517D57402A96650
$$ 287373 -74419 296690 65455 -59136 130724 179724 117961 -216517 457402 196650
17221D16079A07845J49663A09137m2147J36149M0483a69844C90307A40599J68919
$$ 416079 107845 257508 109137 66990 203139 243622 -169844 390307 140599 309518
17211C09518j54615O3545J78366R574j32177I4275I509O3849R5069J56257j40517
$$ 309518 154903 218448 396814 406388 274211 94275 9509 73358 168427 324684 184167
17200A84167H9477L0786A2477K66413L3856I9097B3313K02850M21883C08689E9099
$$ 184167 89477 120263 12477 278890 312746 99097 23313 226163 648046 308689 59099
17188A40752J11978j7908B7982L99055k8066O6739j55092K9227j54308J46964
$$ 140752 252730 234822 27982 427037 398971 465710 310618 339845 185537 332501
17178C32501q8904e4499D04556d1921A07712k2485K00450J63584j66851K32327
$$ 332501 243597 -54499 404556 -41921 107712 85227 285677 449261 282410 514737
17168E14737j63762l4820m3768M02957A35174n590N8657N458b20596B64077F8410
$$ 514737 350975 316155 272387 675344 135174 129584 188241 193699 -220596 264077 68410
17156B39269A12766K36213A28311C3374L62181k0329b131D46578O3759k20415
$$ 239269 112766 348979 128311 33374 395555 375226 -2131 446578 510337 289922
17146B89922F3730A6487K00321K95504r3826m4194J48087n4811k22586q7042o6995
$$ 289922 63730 16487 216808 512312 418486 374292 522379 467568 244982 157940 90945
17135I0945L76080j07678j66398j4117L65466q9337j91963O7849J69307K5977
$$ 90945 467025 359347 192949 178832 544298 454961 262998 330847 500154 526131
17125E26131n7518E3727R4661K65227j47039C30K55598J74957e4294q5160C93996
$$ 526131 468613 53727 148388 413615 266576 330 255928 430885 -54294 -139454 393996
17113D95723j82835J6339J0844j14436O7113A41112K73480k03021M7462r7513
$$ 495723 312888 329227 340071 225635 292748 141112 414592 211571 259033 161520
17103A61520J65119I1469K36252o8715r7543J48393l2182L85367A42436J54157
$$ 161520 326639 91469 327721 259006 161463 309856 277674 663041 142436 296593
17093B96593A15735J58273P198K3247P9897L7851A99191l6691B8158N42775D1670
$$ 296593 115735 274008 281206 304453 384350 422201 199191 162500 28158 570933 41670
17081E64484k15440K62418j59693J334B16844L09408G1355L56244J07787J23316
$$ 564484 349044 611462 451769 453103 216844 526252 71355 427599 535386 658702
17071F58702k25673l3308M2845k03504L44037j66377J6792J65808j25083N7290
$$ 658702 433029 399721 442566 239062 583099 416722 433514 599322 474239 531529
17061E31529R9363j69788K5238N8555j84306O9292I9757N54202C13229a9310E02813
$$ 531529 630892 461104 486342 544897 360591 429883 99757 653959 313229 -19310 502813
17049D31653O0700R8372k63257M98886A11162K83311A59039M21994q6725K36188
$$ 431653 492353 590725 327468 826354 111162 394473 159039 581033 494308 730496
17039G30496k24455q6920k07497L13320J58223B32614L14883P7015j84623K326
$$ 730496 506041 419121 211624 524944 683167 232614 547497 624512 439889 442215
17029D42215K31266B84359j23136J34365K72976J39947B73466r7241M15354j6460
$$ 442215 673481 284359 161223 295588 568564 708511 273466 176225 591579 575119
17019E75119K16078n42k73088L74009J62364k67678j20550k57072J78657K31900
$$ 575119 791197 790655 517567 891576 1053940 786262 665712 408640 587297 819197
17009H19197r9112k57656L45860j39272K2640r4926J45844J49466A48556M50139
$$ 819197 720085 462429 808289 669017 691657 596731 742575 892041 148556 598695
16999E98695L16897r9961j79035K47289Q7785P016m61928J58407L34220C86568
$$ 598695 915592 815631 636596 883885 971670 978686 516758 675165 1009385 386568
16988F19021R2386Q5197q3847p4067J77924j86452P4749J39202j16174J19570
$$ 619021 711407 796604 712757 638690 816614 630162 704911 844113 727939 847509
16978H47509J66965P2677l47050l4476k14750J92308L03416m85302K00119J81288
$$ 847509 1014474 1087151 740101 705625 490875 683183 986599 501297 701416 882704
16968H82704j85389L00884K114J37905j93650l40317L90969k65775M74224E69694
$$ 882704 697315 998199 1000313 1138218 944568 604251 995220 729445 1203669 569694
16957A029245j52334J17076j78191J30421k40177J46990L50530l53832J88244
$$ 1029245 876911 993987 815796 946217 706040 853030 1203560 849728 1037972
16948A037972m172k71915L91781k11413K00579k7632K371j01711N6463J5523o6502
$$ 1037972 1033800 761885 1153666 942253 1142832 1115200 1117571 1015860 1072323 1087846 1021344
16937A021344m2169J57528j69350m9025j19817J09090O7536M77543j99532P0698
$$ 1021344 979175 1136703 967353 918328 798511 907601 975137 1452680 1253148 1323846
16927A323846j91999J20698k51584J72700j24450J08606K55157l95817r0526M30279
$$ 1323846 1131847 1252545 1000961 1173661 1049211 1157817 1412974 1017157 926631 1356910
16917A356910k35641K51161j08002n05317N00603j9118J51739n6776Q408R2001
$$ 1356910 1121269 1372430 1264428 759111 1259714 1240596 1392335 1335559 1343967 1435968
16907A435968J09987k81510M01458o14381K32425M0121Q6423J86153J21198j18785
$$ 1435968 1545955 1264445 1665903 1051522 1283947 1324068 1410491 1596644 1717842 1599057
16897A599057q0734M87091l51486K4870j5944j58465M8578L82542k47460Q4010
$$ 1599057 1518323 2005414 1653928 1678798 1662854 1504389 1552967 1935509 1688049 1772059
16887A772059J64790p0190l0330k31097K51453k48843J99600j01875J00647M44717
$$ 1772059 1936849 1866659 1836329 1605232 1856685 1607842 1807442 1705567 1806214 2250931
16877B250931l33260L38612L0676l69875o0016M00644j02551J57757k51168M33509
$$ 2250931 1917671 2256283 2286959 1917084 1857068 2257712 2155161 2312918 2061750 2495259
16867B495259m47509M48286l37051J69190m5158p0578K15315r9238L24558k41761
$$ 2495259 2047750 2496036 2158985 2328175 2283017 2212439 2427754 2328516 2653074 2411313
16857B411313m6195K81138L2358K02820l33919K82948K23153J56429m60440N01544
$$ 2411313 2365118 2646256 2678614 2881434 2547515 2830463 3053616 3210045 2749605 3251149
16847C251149l81392J65569J76634l0566K3677K15622k92249N04558j62779o657
$$ 3251149 2869757 3035326 3211960 3181394 3205071 3420693 3128444 3633002 3470223 3463566
16837C463566K17845l15147L89323j47318K47479K72013l87354K38834K33517
$$ 3463566 3681411 3366264 3755587 3608269 3855748 4127761 3740407 3979241 4212758
16828D212758K74506m80438J82096L23293P0537k24274L6434J86188J57915k31
$$ 4212758 4487264 4006826 4188922 4512215 4582752 4358478 4394912 4581100 4739015 4738784
16818D738784M28120k56308o7707N38537o8174l2683J58398K63262l58015L51779
$$ 4738784 5166904 4910596 4842889 5381426 5313252 5280569 5438967 5702229 5344214 5695993
16808E695993J79071K86171M53994p6458P4834K23816P1121K05414m073L70474
$$ 5695993 5875064 6161235 6615229 6538771 6613605 6837421 6908542 7113956 7109883 7480357
16798G480357J40997L56059m9964L06300J43653J2961K45852L46307J11447P01465
$$ 7480357 7621354 7977413 7927449 8233749 8377402 8390363 8636215 8982522 9093969 9795434
16788I795434N0130K48681r7150M16868N98290J1414L66334N56216J88661N78469
$$ 9795434 9845564 10094245 9997095 10413963 11012253 11023667 11390001 11946217 12134878 12713347
16778A2713347K87001M81415N5290O51427N15665P34279k6796P38445L55482O83379
$$ 12713347 13000348 13481763 13537053 14188480 14704145 15438424 15411628 16150073 16505555 17188934
16768A7188934P14811M78824R58895K98989J143126K75796J040823J101840Q49827
$$ 17188934 17903745 18382569 19341464 19640453 20783579 21059375 22100198 23202038 24051865
16759B4051865J263511M14909J534366J253268J292504J253099J144946J458865
$$ 24051865 25315376 25730285 27264651 28517919 29810423 31063522 32208468 33667333
16751C3667333J874166J686969J728920K013785K145588K442970K370413K575974
$$ 33667333 35541499 37228468 38957388 40971173 43116761 45559731 47930144 50506118
16743E0506118K892117K929183L135118L190188M061335L834582M533048M092182
$$ 50506118 53398235 56327418 59462536 62652724 66714059 70548641 75081689 79173871
16735G9173871M937084M979221N868834N895891N858794O382495P037453O876038
$$ 79173871 84110955 89090176 94959010 100854901 106713695 113096190 120133643 127009681
16727A27009681O869291P293913P532124P056732P029312P080455O176209N759656
$$ 127009681 133878972 141172885 148705009 155761741 162791053 169871508 176047717 181807373
16719A81807373M891158L777621K808335J294565o1648j409076k630498m202709
$$ 181807373 186698531 190476152 193284487 194579052 194517404 193108328 190477830 186275121
16711A86275121m687826o169570n918737p163778p332551p207648p311542p030956
$$ 186275121 181587295 175417725 169498988 162335210 155002659 147795011 140483469 133452513
16703A33452513o941506o951124o383406o127437n863033n530516n275909m599361
$$ 133452513 126511007 119559883 113176477 107049040 101186007 95655491 90379582 85780221
16695H5780221m940028m613561m070017l797926l664608l089908l357930k872531
$$ 85780221 80840193 76226632 72156615 68358689 64694081 61604173 58246243 55373712
16687E5373712k474288l189499k271712k217777j796819k134360j986905j810398
$$ 55373712 52899424 49709925 47438213 45220436 43423617 41289257 39302352 37491954
16679C7491954j838245j433711j521601j349651j567433j146191j249878r11506
$$ 37491954 35653709 34219998 32698397 31348746 29781313 28635122 27385244 26473738
16671B6473738j306039p35691j238825p79358r88356r51033j07744r78984p01239
$$ 26473738 25167699 24432008 23193183 22413825 21425469 20474436 20366692 19387708 18686469
16662A8686469r32259m79752p67365m78350o22688m98869o09848j42370r28539
$$ 18686469 17754210 17274458 16507093 16028743 15406055 14907186 14297338 14154968 13226429
16653A3226429j87256n33172m32601l03275l21026l85394o65830O3793j95607
$$ 13226429 13039173 12506001 12073400 11770125 11449099 11063705 10397875 10461668 10266061
16644A0266061l87784q14619r0569Q4119j10191o46276l75145r4828P595n1831
$$ 10266061 9878277 9063658 8973089 9057208 8947017 8300741 7925596 7830768 7838363 7786532
16634G786532p46607K86821m57742j79604k73101Q2756j20914j77009l52635K78593
$$ 7786532 7039925 7326746 6869004 6689400 6416299 6499055 6378141 6201132 5848497 6127090
16624F127090o52674r6127j82334k14411K14489j045l85243l24427m469l1841
$$ 6127090 5474416 5378289 5195955 4981544 5196033 5194988 4809745 4485318 4480849 4449008
16614D449008J38338l49382l743J86996m56738J45582l22243K56739J43396k56971
$$ 4449008 4587346 4237964 4234221 4421217 3964479 4110061 3787818 4044557 4187953 3930982
16604C930982j74487k13987q2887l5369l1341j62576K33468l14835j52785L26282
$$ 3930982 3756495 3542508 3459621 3424252 3392911 3230335 3463803 3148968 2996183 3322465
16594C322465k00815j21486o0870J11454l03623L16853k73181j55786J11178l12929
$$ 3322465 3121650 3000164 2939294 3050748 2747125 3063978 2790797 2635011 2746189 2433260
16584B433260J79270l9933j18013l87894K24125j20373L07898l99204K94085j89606
$$ 2433260 2612530 2572597 2454584 2066690 2290815 2170442 2478340 2079136 2373221 2183615
16574B183615K14273k72665o3857n3511N7307K01905q7351l52731J30586j18069
$$ 2183615 2397888 2125223 2061366 2007855 2065162 2267067 2179716 1826985 1957571 1839502
16564A839502K91321k0484l4718j72574k31837J2876K26710j21785k60136J52299
$$ 1839502 2130823 2110339 2075621 1903047 1671210 1684086 1910796 1789011 1528875 1681174
16554A681174J61729K741m46651O9096k86157M36099l01817J41481K93329m63938
$$ 1681174 1842903 1845644 1398993 1468089 1181932 1618031 1316214 1457695 1751024 1287086
16544A287086J22683P3838o9167M9258J17575J52538n16603K19500j48797L8029
$$ 1287086 1409769 1483607 1414440 1463698 1581273 1733811 1217208 1436708 1287911 1325940
16534A325940K24338l88436J70471q0453p1203J51532j37831l08315J35569J81137
$$ 1325940 1550278 1161842 1332313 1251860 1180657 1332189 1194358 886043 1021612 1202749
16524A202749k39193M10477l40628j604J05659j42277J07352q0286N4971k10567
$$ 1202749 963556 1374033 1033405 1031801 1137460 995183 1102535 1022249 1077220 866653
16514H66653k2434K82247o4928L6489J62982l82564l6357j07114J85578l4135
$$ 866653 844219 1126466 1061538 1098027 1261009 878445 842088 734974 920552 886417
16504H86417k1562L7820q5512J1848J40586j40902M6798q2813R8670J67685D33067
$$ 886417 864855 902675 817163 829011 969597 828695 875493 792680 891350 1059035 433067
16492A007845l05037r2905J76209J9410j46451J44593r1934r6221K21918J60515
$$ 1007845 702808 609903 786112 805522 659071 803664 711730 615509 837427 997942
16482I97942l53698r7951j08333Q294K50495P2900J23878l3236l42384M31471
$$ 997942 644244 546293 437960 446254 696749 769649 893527 860291 517907 949378
16472I49378k21991j94697K42700l53038L18605j6239K6749o2824j57746N3151
$$ 949378 727387 532690 775390 422352 740957 724718 751467 688643 530897 584048
16462E84048p6545K43955C69095K76697j56079N3871K14435j7914C21561K16807
$$ 584048 507503 751458 369095 645792 489713 543584 758019 740105 321561 538368
16452E38368j550k3663J96195J40777A43705O0135a5338C58392J45678j31937
$$ 538368 536818 513155 709350 850127 143705 203840 -15338 358392 504070 372133
16442C72133J99898B47836L52137k28249K39683k41050K39579n5214j83818Q9403
$$ 372133 572031 247836 599973 371724 611407 370357 609936 554722 370904 460307
16432D60307p2527K35413k5582j60202j02058n9165J41015M1728r3976Q4933A34714
$$ 460307 387780 623193 597611 437409 335351 276186 417201 458929 364953 449886 134714
16420C51060L10241A56502J29358M23032l07201A13247N23434j90186j1469j42788
$$ 351060 661301 156502 285860 708892 401691 113247 636681 446495 435026 292238
16410B92238R9678K1779K2022j78947c1333D59039j68892J87568A48547L23261
$$ 292238 391916 413695 435717 256770 -31333 459039 290147 477715 148547 471808
16400D71808A5519M32988F2863L09785G8128O03713C20782K2218j33132J90693
$$ 471808 15519 448507 62863 372648 78128 681841 320782 343000 209868 400561
16390D00561j3534N4711A87421I2461L18481K70090B10505K07474A34239M33446
$$ 400561 387027 441738 187421 92461 410942 681032 210505 417979 134239 567685
16380E67685k59681o3023L93044A59488A2156K38024R0665l5895k123n2611p8619
$$ 567685 308004 244981 638025 159488 12156 250180 340845 304950 302827 250216 171597
16369A71597L91385B20374J7505k4502r9790P6192g4120C03227j25224J55035
$$ 171597 562982 220374 237879 213377 113587 189779 -74120 303227 178003 333038
16359C33038p9436E2957L87952B14019K81264A64696J90038A48339J52078J91301
$$ 333038 253602 52957 440909 214019 495283 164696 354734 148339 300417 491718
16349D91718A89555J71341a44445M7333C16150J0035O9852I7395K82837L2647
$$ 491718 189555 360896 -144445 -97112 316150 326185 396037 97395 380232 412879
16339D12879I1560J43088j2852j1588M33716A30414L78265G6196R3511h6213B43771
$$ 412879 91560 234648 221796 210208 643924 130414 508679 76196 169707 -86213 243771
16327E04585b5951A89696J01716A40021L43152J62740k95847h9043C33368L040
$$ 504585 -25951 189696 291412 140021 483173 645913 350066 -89043 333368 336408
16317C36408A13733c95C15176G500J13703J19379H9035b6528C33883j55339f408
$$ 336408 113733 -395 315176 7500 121203 240582 89035 -26528 333883 178544 -6408
16305a21833A77365J94522A64290K48061e6202D26985I0035L3517M4231j2896
$$ -121833 177365 371887 164290 412351 -56202 426985 90035 123552 167783 154887
16295A54887h4905C8135K94626a12015D39842A11968a5981B91479J53922j19596
$$ 154887 -84905 38135 332761 -112015 439842 111968 -15981 291479 445401 325805
16285C25805j14586c7067r3589A59052K99050f9681A99084L50120g3833G7786
$$ 325805 211219 -37067 -130656 159052 458102 -69681 199084 549204 -73833 77786
16274B05074m0131J7871b54672c6361F0451O3995J90786a9424C28358r6884i3997
$$ 205074 164943 182814 -254672 -36361 60451 124446 315232 -19424 328358 231474 -93997
16262A80730k9276m9182P1220R7440B9297a81942D2041A4004K48075G9911P6969
$$ 180730 151454 102272 173492 270932 29297 -181942 42041 14004 262079 79911 156880
16251A56880a20567A77122K41665j33317b365E4382i5270A56855K36686d4227
$$ 156880 -120567 177122 418787 285470 -2365 54382 -95270 156855 393541 -44227
16240E7175N7784J55034f5897B7270i7522E5868c6233A81015J9301i3744G5958
$$ 57175 114959 269993 -65897 27270 -97522 55868 -36233 181015 200316 -93744 75958
16228C76568j72959a61050f3847A19140h1424r891D34053f9667m9959G0561J89391
$$ 376568 203609 -161050 -63847 119140 -81424 -91315 434053 -69667 -119626 70561 259952
16217B59952A05496J02650J05477A31168D5787a8036C8956R4859J2432m2992A6835
$$ 259952 105496 208146 313623 131168 45787 -18036 38956 133815 146247 103255 16835
16205C85346l0034A55501l0282K4491d5085C1308a3775A56167o3541N19a9244
$$ 385346 355312 155501 125219 149710 -45085 31308 -13775 156167 92626 93145 -19244
16193A79603c6239J6959C23247l9034e8426B26310k1201q7885a39686j88073C432
$$ 179603 -36239 -19280 323247 284213 -58426 226310 205109 117224 -139686 -327759 3432
16181f4759D18090H1222b07050H9245J43067d1381A73453o7390b41490f4039B36976
$$ -64759 418090 81222 -207050 89245 232312 -41381 173453 106063 -241490 -64039 236976
16169e1591I6833a38622A29906i141A67084P5883e0736F4427M3616N0470b46006
$$ -51591 96833 -138622 129906 -9141 167084 242967 -50736 64427 108043 158513 -246006
16157b82000J26674B11092b12175i3162A35505D831J24434m2825J67822g8912
$$ -282000 -155326 211092 -212175 -93162 135505 4831 129265 86440 254262 -78912
16146a16347I1134O5830L5380d3051B72861g2995K8318j08460A87611J0962l0514
$$ -116347 91134 156964 192344 -43051 272861 -72995 -44677 -153137 187611 198573 168059
16135A68059C4632e2241A191L2588N193b60167f7422A54775l2591b34529J13005
$$ 168059 34632 -52241 1191 33779 38972 -260167 -67422 154775 122184 -234529 -121524
16124a21524B86949A04293a10520a9836B85039e6921j29837d1212q5368C1166
$$ -121524 286949 104293 -110520 -19836 285039 -56921 -186758 -41212 -126580 31166
16113b08669L0663e3673l9025m7981d4016F7216B3195K73386a61418g423A34001
$$ -208669 -178006 -53673 -92698 -140679 -44016 67216 23195 296581 -161418 -7423 134001
16101F37d7215A64269p3613b41651c3478k392B9016M66765d08360b01623E7502
$$ 637 -47215 164269 90656 -241651 -33478 -35870 29016 495781 -408360 -201623 57502
16089C3800b49099a18897A6628f4591j16368B47447C1535K12336b0775k84263
$$ 33800 -249099 -118897 16628 -64591 -180959 247447 31535 243871 -20775 -305038
16079c05038D18534a71071A19702K5519C5640c6602j5866j58791A8233a05647
$$ -305038 418534 -171071 119702 145221 35640 -36602 -52468 -211259 18233 -105647
16068A7649c6478m83512d8281k5130a7884H5167b69280J734F0164L23456d3406
$$ 17649 -36478 -519990 -48281 -73411 -17884 85167 -269280 -267546 60164 383620 -43406
16056a75502A46841a23078K1697d4444j57518A50602h6362k96300J65576B9848
$$ -175502 146841 -123078 -101381 -44444 -201962 150602 -86362 -382662 -217086 29848
16045c22527C5830a14936e3373A6917a20635A82621c69397a15280l6341a8630
$$ -322527 35830 -114936 -53373 16917 -120635 182621 -369397 -115280 -151621 -18630
16034a01884F3487c56951i3959C18264b94131a00672h503j06208D8454d1656i598
$$ -101884 63487 -356951 -93959 318264 -294131 -100672 -8503 -114711 48454 -41656 -9598
16022a36421j4859b8062C4398a55200k174c6984g771q3005i914j72972g8567A9581
$$ -136421 -151280 -28062 34398 -155200 -157374 -36984 -7771 -90776 -9914 -182886 -78567 19581
16009b98058B13204A6978a72780L2615O7617k04345D9257a69737a2450B72496
$$ -298058 213204 16978 -172780 -140165 -72548 -276893 49257 -169737 -12450 272496
15998e6290A97005E152a84314B86003H7407c17090M5771F4975B6737a8096B310
$$ -56290 197005 5152 -184314 286003 87407 -317090 -271319 64975 26737 -18096 2310
15986B81353B742N6993k0379g0983l7095b0910B47053j10452K56975B0640J43316
$$ 281353 2742 59735 39356 -70983 -108078 -20910 247053 136601 393576 20640 163956
15975A63956p6198k8282b63880B45441A02342D4017b18418A90410Q8085E3773
$$ 163956 87758 59476 -263880 245441 102342 44017 -218418 190410 278495 53773
15964H6382g3486F4817a14091A41133h3060r3386R837A73875H905a27253I1626
$$ 86382 -73486 64817 -114091 141133 -83060 -176446 -166609 173875 8905 -127253 91626
15952a81731c4583j20762r2217m3318a31484q8100A51070b78070a25822b3829
$$ -181731 -34583 -155345 -247562 -290880 -131484 -219584 151070 -278070 -125822 -23829
15941b25868C06164A851L8368R5084J11123j04733a11659k28915a16305I9966
$$ -225868 306164 1851 40219 135303 246426 141693 -111659 -340574 -116305 99966
15930c76626E3728l024g3326j7852A35815b71748B41946E8818k2803J35821f97212
$$ -376626 53728 50704 -73326 -91178 135815 -271748 241946 58818 36015 171836 -697212
15918a02231L1414G0650a62343A70488g0736k97315J31029m16431I5833A2109
$$ -102231 -70817 70650 -162343 170488 -70736 -368051 -237022 -653453 95833 12109
15907b72984J20380A11188c14512P8633L9211k645d2734p4188A61725o1572a8073
$$ -272984 -152604 111188 -314512 -235879 -196668 -199313 -42734 -116922 161725 100153 -18073
15895c55224J06529e0165o8635d2019A2768c01435e1343A08490b18684E4266h9847
$$ -355224 -248695 -50165 -118800 -42019 12768 -301435 -51343 108490 -218684 54266 -89847
15883g8166A94293m6272e3768a7260q1028j22103A03602e311j44912A02146l5878
$$ -78166 194293 148021 -53768 -17260 -98288 -220391 103602 -5311 -150223 102146 66268
15872F6268J49414k5352f2727F032a19608B13921b42157I3110b68530D4239b30219
$$ 66268 215682 190330 -62727 6032 -119608 213921 -242157 93110 -268530 44239 -230219
15860G6846P1324c82588A7325i3112D7646k3737b31216i8317B35707j1032c2046
$$ 76846 148170 -382588 17325 -93112 47646 23909 -231216 -98317 235707 224675 -32046
15848H256K25352c66421J12160a24299N3856a1271F3494a38652A19621a62265
$$ 8256 233608 -366421 -254261 -124299 -70443 -11271 63494 -138652 119621 -162265
15837a80036l5376B1558R8078K1985f9968C1542f6864A5124L0791Q9721a52723
$$ -180036 -215412 21558 119636 141621 -69968 31542 -66864 15124 45915 135636 -152723
15825I4787J6880K5311c16712g2284A30005b25511O4298K6563C1730K72150g9032
$$ 94787 111667 136978 -316712 -72284 130005 -225511 -161213 -134650 31730 303880 -79032
15813c63684h2078B5960D816a726j97169I0147e07652J71002g473A98104c8550
$$ -363684 -82078 25960 4816 -1726 -198895 90147 -507652 -336650 -7473 198104 -38550
15801b1157r190H3917b20415B33296A4212J75811a12841P790A62464i2052L4774
$$ -21157 -30347 83917 -220415 233296 14212 190023 -112841 -105051 162464 -92052 -57278
15790e7278D1075M3949M7330g8710g006r1318b7038q5643m7472F7632Q54a19889
$$ -57278 41075 85024 132354 -78710 -7006 -98324 -27038 -112681 -160153 67632 68486 -119889
15777B52606a78871B22833m9187b27383g8610j85019Q1461B1190K34860H6523
$$ 252606 -178871 222833 173646 -227383 -78610 -263629 -182168 21190 256050 86523
15766F8986j5358a07220n3079O6570A71586N8092a32563A64716G0697c1191r3321
$$ 68986 53628 -107220 -160299 -93729 171586 229678 -132563 164716 70697 -31191 -124512
15755a24512H1115A0589N8494e5955C04921f873A78588i0668H0839e5279l0743
$$ -124512 81115 10589 69083 -55955 304921 -6873 178588 -90668 80839 -55279 -86022
15744h6022b6638B99524F7030b81088J5317A587a08212j87908F9677L03222j59531
$$ -86022 -26638 299524 67030 -281088 -265771 1587 -108212 -296120 69677 372899 213368
15733B13368b44027j51207a62475k18380K1539J54987i6334e610B3103P0434g0464
$$ 213368 -244027 -395234 -162475 -380855 -359316 -204329 -96334 -5610 23103 93537 -70464
15721b65453F1343K68197a37797k19440A8010M987a0151A67641K7722b01423C60498
$$ -265453 61343 329540 -137797 -357237 18010 22997 -10151 167641 195363 -201423 360498
15709c08413J22144g4678l15793a09290j51839F7615J25974B4991a09785D7151
$$ -308413 -186269 -74678 -390471 -109290 -261129 67615 193589 24991 -109785 47151
15698b71610j26665e2064k21443R6474C82504b03305A9490j507b36785A35972
$$ -271610 -398275 -52064 -273507 -177033 382504 -203305 19490 17983 -236785 135972
15687h4010j00169O0431a0866n2214A06546l072N0914k1344B8988c01335B10730
$$ -84010 -184179 -123748 -10866 -63080 106546 103474 154388 133044 28988 -301335 210730
15675A30049f6702B19667c06480A64755g5693f740B6491P3081C167R8434n0090
$$ 130049 -66702 219667 -306480 164755 -75693 -6740 26491 99572 3167 101601 51511
15664E1511J10315n2015a71750C09634E6032J15236a71502D3718m183P1570c33219
$$ 51511 161826 109811 -171750 309634 56032 171268 -171502 43718 39535 111105 -333219
15652c3582j12010b1987L352B00762a52404l5479b8737q0184F3681R1684g5981
$$ -33582 -145592 -21987 -18635 200762 -152404 -187883 -28737 -108921 63681 155365 -75981
15640b06783F4709J2448m409a20998d8534j01343f3026j00658k73161C008a921
$$ -206783 64709 77157 72748 -120998 -48534 -149877 -63026 -163684 -436845 3008 -1921
15628A84076a88578k51939F7040c7183B39599a26579e0993p2292B53673g5433
$$ 184076 -188578 -440517 67040 -37183 239599 -126579 -50993 -123285 253673 -75433
15617A82244q227o7732a00152j73832R2606F947K8706j2714e1034j52329j89006
$$ 182244 174017 106285 -100152 -273984 -181378 6947 35653 22939 -51034 -203363 -392369
15606c92369B48199j22963N6720h0921j24428c0390p8874E4681L1738J3809d26886
$$ -392369 248199 125236 181956 -80921 -205349 -30390 -109264 54681 86419 100228 -426886
15594A61445a11541B73509O7415H061a00289A36403j0102D8332b88073J21061
$$ 161445 -111541 273509 340924 8061 -100289 136403 126301 48332 -288073 -167012
15584a67012M0891k6631b0704L130A59039e030A9192N9812J23354d4843q4675
$$ -167012 -126121 -152752 -20704 -17574 159039 -5030 19192 79004 202358 -44843 -129518
15573a29518c1031B1676J24999b64122c174k7807k4104q3932B59425a3404k6047
$$ -129518 -31031 21676 146675 -264122 -3174 -30981 -55085 -139017 259425 -13404 -39451
15562c9451A67282m9659a02251M5965C96749C343K9445b61491A46761a69708j29468
$$ -39451 167282 117623 -102251 -56286 396749 3343 32788 -261491 146761 -169708 -299176
15551b99176J08773l05283a32700F3542a22899a2927B08457H6306c0224l02549
$$ -299176 -190403 -495686 -132700 63542 -122899 -12927 208457 86306 -30224 -332773
15541c32773B08820d1093j50154G5652C182d6439l7569b3966q0027A06702c6830
$$ -332773 208820 -41093 -191247 75652 3182 -46439 -84008 -23966 -103993 106702 -36830
15529A01795J64979a24422B35481j10997M305n3076a40605C7856Q6409e0011h926
$$ 101795 266774 -124422 235481 124484 128789 75713 -140605 37856 124265 -50011 -8926
15517d74419A59000i1596F46366A65913e2328D7477M8330d9873Q766m4831j89366
$$ -474419 159000 -91596 646366 165913 -52328 47477 95807 -49873 -41107 -85938 -275304
15506b75304d8193o481A62158b59934A67320c91279a82202B23167c8343A59327
$$ -275304 -48193 -54674 162158 -259934 167320 -391279 -182202 223167 -38343 159327
15495A57032R6896a54793E1535M747a87635A74518B4902c1457q2334I2129J25597
$$ 157032 253928 -154793 51535 56282 -187635 174518 24902 -31457 -113791 92129 217726
15484B17726a90522a3673k48494K4189g592I2481h7198n4086L6516c2898l59492
$$ 217726 -190522 -13673 -262167 -237978 -7592 92481 -87198 -141284 -104768 -32898 -392390
15473c92390A68115b27536A10703A211a77040h1934j53975Q9084A483a47680B0468
$$ -392390 168115 -227536 110703 1211 -177040 -81934 -235909 -146825 1483 -147680 20468
15461d2997l7080k15898J27619P8278A3774Q8375c24757C4022a15937c8512j61837
$$ -42997 -80077 -295975 -168356 -90078 13774 102149 -324757 34022 -115937 -38512 -200349
15450b00349A98993o9769c52634A95752d1106B9267F961g9935K1612j63800B3091
$$ -200349 198993 129224 -352634 195752 -41106 29267 6961 -79935 -58323 -222123 23091
15438I0005a92945Q821b7960I9520i0326A96888E6645R6672J75938f792D6001
$$ 90005 -192945 -184124 -27960 99520 -90326 196888 56645 153317 329255 -6792 46001
15426g9010L202b5466C01423b6934j84803j38496A06978c43384C72481A47744
$$ -79010 -75808 -25466 301423 -26934 -211737 -350233 106978 -343384 372481 147744
15415C23822b26545h5327B52515d8848K1948m4869k53969e6850j21721O408A22480
$$ 323822 -226545 -85327 252515 -48848 -26900 -71769 -325738 -56850 -178571 -172163 122480
15403A59807J46515J21050c68953A55065o4537b97082A73096b83429d9361C09072
$$ 159807 306322 427372 -368953 155065 90528 -297082 173096 -283429 -49361 309072
15392a29968M2295G2840J69313a33604f0367j12819C11293J15360A00032J78437
$$ -129968 -87673 72840 242153 -133604 -60367 -173186 311293 426653 100032 278469
15382B78469j07834a42236O8527q1754A47749K5890a50625F8187B0948i8536B70230
$$ 278469 170635 -142236 -73709 -155463 147749 173639 -150625 68187 20948 -98536 270230
15370I9118b57167A03378a76961I157a2408A17715J26606b0750q8632r9694A71704
$$ 99118 -257167 103378 -176961 9157 -12408 117715 244321 -20750 -109382 -209076 171704
15358h1409B36398D8681L28446b63314M6158M8145e604A4593c8125j27786I8408
$$ -81409 236398 48681 377127 -263314 -217156 -169011 -5604 14593 -38125 -165911 98408
15346B40178p6950j4018Q7013c5312C10270B7244g7678k09145A02649C4629a97620
$$ 240178 163228 149210 236223 -35312 310270 27244 -77678 -286823 102649 34629 -197620
15334B89087c18692d3909o4058c8855L367j1178K270j0211B1918f2553B68785
$$ 289087 -318692 -43909 -107967 -38855 -35488 -46666 -44396 -54607 21918 -62553 268785
15322G5143a73470f5227A5804h8725C49784b53981e738l0692I1055m2956O5860
$$ 75143 -173470 -65227 15804 -88725 349784 -253981 -5738 -36430 91055 48099 113959
15311A13959O0215G7840e7073A26811j5727R43P6693n8277P7044H1910Q6308b84387
$$ 113959 174174 77840 -57073 126811 111084 112027 188720 130443 207487 81910 168218 -284387
15298B01648a03984p4590A77709b74790G6860J77117c78219G4717b06862H593
$$ 201648 -103984 -178574 177709 -274790 76860 253977 -378219 74717 -206862 8593
15287d5324j84672i7385M7662B8656a44366C5219a48846L2888A65378f1794b9027
$$ -45324 -229996 -97385 -49723 28656 -144366 35219 -148846 -115958 165378 -61794 -29027
15275A45140O8524c12749P0753G6639c33255C19209o1252p8695M4836a91940A22474
$$ 145140 213664 -312749 -241996 76639 -333255 319209 257957 179262 224098 -191940 122474
15263b5126B74892n076B2605K27901l4732J12112q7111d4720J9233A06180e2467
$$ -25126 274892 269816 22605 250506 215774 327886 240775 -44720 -25487 106180 -52467
15251D9945K74063J65681N1460M69465M251p809J90636E69057j14282J4641c65701
$$ 49945 324008 489689 541149 1010614 1014865 1007056 1197692 569057 454775 469416 -365701
15239A75044J97170j44917b0453A50588d6581A36846h1572G0373J90330a13650
$$ 175044 372214 227297 -20453 150588 -46581 136846 -81572 70373 260703 -113650
15228D77543d4396m05710B59073h9481I1340O0672n7277J93888b633G8733J14096
$$ 477543 -44396 -450106 259073 -89481 91340 152012 94735 288623 -2633 78733 192829
15217A92829R045a10742b8646C03411P9819j8197k941A29983r544h3495B5288
$$ 192829 201874 -110742 -28646 303411 383230 365033 362092 129983 120439 -83495 25288
15205A78303i3940B064M2593C621c1588C22525b15824B90264a16599A42365a04507
$$ 178303 -93940 2064 44657 3621 -31588 322525 -215824 290264 -116599 142365 -104507
15193A62395m388J75273a73036B24820o221J59771G5857d3480B83878C796a47141
$$ 162395 158007 333280 -173036 224820 218599 378370 75857 -43480 283878 3796 -147141
15181a60995B4275a9568B11743A8636N83112A12958L1990l8522R2968H8914k9524
$$ -160995 24275 -19568 211743 18636 601748 112958 144948 106426 199394 88914 59390
15170E9390a7051C18177A35696c30541a19502B4073j0606f9748A63459c17548
$$ 59390 -17051 318177 135696 -330541 -119502 24073 13467 -69748 163459 -317548
15159h2459A40396j8462a00479c5731I2844M8358i8935p4957G7297b06318B67200
$$ -82459 140396 121934 -100479 -35731 92844 141202 -98935 -173892 77297 -206318 267200
15147a85986q294K5052h4254B354b99125a2280A06349K03959E4156P2308K5956
$$ -185986 -194280 -169228 -84254 2354 -299125 -12280 106349 310308 54156 126464 152420
15136A52420J67309G4556l4123L71387H2791J1166e4437A88685J3384f3512A33604
$$ 152420 319729 74556 40433 411820 82791 93957 -54437 188685 202069 -63512 133604
15124B9034K05717n9841k4852J04491J00289A00444p970L58766A51373K13939
$$ 29034 234751 174910 150058 254549 354838 100444 92474 451240 151373 365312
15114C65312e1237B32939n2473J9866Q3624b49862K8178f9755I8921J70345o9528
$$ 365312 -51237 232939 180466 200332 283956 -249862 -221684 -69755 98921 269266 199738
15103A99738D4277a07485E6217N90883G7419Q4771G1188c5114J2013o5246j08600
$$ 199738 44277 -107485 56217 647100 77419 162190 71188 -35114 -23101 -88347 -196947
15092a96947C4932L32255B5497b56802e8980G3274J52213O429A8176J97632k4176
$$ -196947 34932 367187 25497 -256802 -58980 73274 225487 231916 18176 215808 191632
15081A91632k6232a54251P5205B41999r3817c2017B73956r4265L69105b829A0238
$$ 191632 165400 -154251 -79046 241999 148182 -32017 273956 179691 548796 -2829 10238
15069D4832K51576F527K94155F8988N3948a00585D14717a00905C34362j19396
$$ 44832 296408 6527 300682 68988 122936 -100585 414717 -100905 334362 214966
15059B14966E2428a6100C53348D884L55009C8350b0485j8932B84561e5310B35153
$$ 214966 52428 -16100 353348 4884 359893 38350 -20485 -39417 284561 -55310 235153
15047B24609G6288P8425J47749k8902e0870A55770P1494j12821O6576L0252o6124
$$ 224609 76288 154713 302462 273560 -50870 155770 227264 114443 181019 211271 145147
15036A45147J02598n5027J01083J06852i7308D49751H7876J21062L5948K4794
$$ 145147 247745 192718 293801 400653 -97308 449751 87876 208938 244886 269680
15026B69680H3004b00400E60995a29603B29202J63832A06276J83334o8005L3186
$$ 269680 83004 -200400 560995 -129603 229202 393034 106276 289610 221605 254791
15016B54791m8662R8095D0592a2295B58789l045J44228j81265r4658a40070B20296
$$ 254791 206129 304224 40592 -12295 258789 255744 399972 218707 124049 -140070 220296
15004C15989J0498Q858A65474K2516K48504k07240E3117Q8459g75E54187B13089
$$ 315989 326487 335345 165474 187990 436494 229254 53117 141576 -775 554187 213089
14992A83975P7403A04418J28717N2318b34305B20111j7457g3116C53646N7463
$$ 183975 261378 104418 233135 285453 -234305 220111 202654 -73116 353646 411109
14982D11109b00633D11573J72976A34805P8705J23319N8183A83885f830B36944
$$ 411109 -200633 411573 584549 134805 213510 336829 395012 183885 -6830 236944
14971A23252C3645K71432A40922K63524A84705K65688j60605J09506A56291J50048
$$ 123252 33645 305077 140922 404446 184705 450393 289788 399294 156291 306339
14961C06339i0106a7610B17771P000L50299A74613j2262M1620H2711Q6940j3145
$$ 306339 -90106 -17610 217771 224771 575070 174613 162351 203971 82711 169651 156506
14950A56506L628K40311K58300H5220P8071K59454j88375q8731K84600j31356
$$ 156506 160134 400445 658745 85220 163291 422745 234370 145639 430239 298883
14940B98883J63920A63190O5983L61713k56150A30689L4891L66421A33445J17905
$$ 298883 462803 163190 229173 590886 334736 130689 165580 532001 133445 251350
14930B51350A1706J95576p5157L30148j20758J71929A25159J06447M8756J42311
$$ 251350 11706 207282 132125 462273 341515 513444 125159 231606 280362 422673
14920D22673H4597J90515K62141j83227I7251M10871j58808K955A09012K95614
$$ 422673 84597 275112 537253 354026 97251 508122 349314 352269 109012 404626
14910D04626A67354O8222J22937J66324r8971E152K3701N10783j89854K50800
$$ 404626 167354 235576 358513 524837 425866 5152 28853 539636 349782 600582
14900F00582k18694A50292C8654K71250J22556j0136J20941j36875A22622A6065
$$ 600582 381888 150292 38654 309904 432460 422324 543265 406390 122622 16065
14889E19181A0194M82878A40339L8263L36681m1640m8461J31060j06880r2176
$$ 519181 10194 493072 140339 178602 515283 473643 425182 556242 449362 357186
14879C57186J619j43505K07288f5430D20360l9948j06868l1042L21056r1065o2030
$$ 357186 358805 215300 422588 -65430 420360 380412 273544 242502 563558 472493 410463
14868D10463K33162k65681m2479M5984O9807m2504j17941K3296J53024j02762
$$ 410463 643625 377944 335465 381449 451256 408752 290811 314107 467131 364369
14858C64369o0325J87070R5761j19779o7451j22762P9695j64068K66482j63855
$$ 364369 304044 491114 586875 467096 399645 276883 356578 192510 458992 295137
14848B95137r9216N68503l40821J76106d8112B88268J31234n461j17698J74531
$$ 295137 195921 764424 423603 599709 -48112 288268 419502 414041 296343 470874
14838D70874l3766K10067j87606B28656M24112q0121p3976O0901l3192j37934
$$ 470874 437108 647175 459569 228656 652768 572647 498671 559572 526380 388446
14828C88446j26606J9437k0385K03145k61J55380j81081B15815J38064N6004p2752
$$ 388446 261840 281277 260892 464037 463776 619156 438075 215815 353879 409883 337131
14817C37131J22349K5075j33403K04759B49391J88026m4168M636N4043L5288j34120
$$ 337131 459480 484555 351152 555911 249391 437417 393249 397885 451928 487216 353096
14806C53096K48641k86203K59484j01307K82878l01589J99564l23116K05781j95053
$$ 353096 601737 315534 575018 473711 756589 455000 654564 331448 537229 342176
14796C42176L68076k13893j01749L67261j82703k39392j08835J26350M56016k55840
$$ 342176 710252 496359 394610 761871 579168 339776 230941 357291 813307 557467
14786E57467L1784m0063M2922J242R9783k83676K15674j91628J95813O4119l32010
$$ 557467 589251 549188 592110 593352 693135 409459 625133 433505 629318 693437 361427
14775C61427J43300L50648j71464O0214k69225j05969K42550j03602P8379K24643
$$ 361427 504727 855375 683911 744125 474900 368931 611481 507879 586258 810901
14765H10901l21560r9506K87485q2828Q2070m2723J78480k33187k18484M3665
$$ 810901 489341 389835 677320 594492 676562 633839 812319 579132 360648 404313
14755D04313K17423J28737k09971K32235j59110K0013J97904j45443p0523j52718
$$ 404313 621736 750473 540502 772737 613627 633640 831544 686101 615578 462860
14745D62860J17927q840k8660L66976j35288m6852r8898M4209K1783j14539K08023
$$ 462860 580787 571947 543287 910263 774975 728123 629225 673434 695217 580678 788701
14734G88701j03901J30877j51357j24255j35724L19296R3338Q9058l25759M95728
$$ 788701 684800 815677 664320 540065 404341 723637 816975 906033 580274 1076002
14724A076002l93049J79130k73096r9976N26542l0096j96801Q9012k70733J93441
$$ 1076002 682953 862083 588987 489011 1015553 985457 788656 877668 606935 800376
14714H00376Q6318J36718j40427j02443N4092K0025l08395N01293k89055R39K14179
$$ 800376 886694 1023412 882985 780542 834634 854659 546264 1047557 758502 759441 973620
14703I73620K1042k15979K57382j99992j18670L27600K5964l00018J86691j48036
$$ 973620 994662 778683 1036065 836073 717403 1045003 1070967 770949 957640 809604
14693H09604Q6114k63535J68236J41330J54938Q3300j04674l19537K14874K7490
$$ 809604 895718 632183 800419 941749 1096687 1179987 1075313 755776 970650 998140
14683I98140L1383K23209k69451j28071J18092r3941N032J69392j63726L60707
$$ 998140 1029523 1252732 983281 855210 973302 879361 884393 1053785 890059 1250766
14673A250766k56132J0581K3905Q2524J77602r7710m46638L25479j96755K42085
$$ 1250766 994634 1005215 1029120 1111644 1289246 1191536 744898 1070377 873622 1115707
14663A115707Q8367k99919J38272l67861N62283k66472M63487o79438K22023k6455
$$ 1115707 1204074 904155 1042427 674566 1236849 970377 1433864 754426 976449 949994
14653I49994L35312l02600j32819L03839j60523L25021L09867m04361J39438k53303
$$ 949994 1285306 982706 849887 1153726 993203 1318224 1628091 1223730 1363168 1109865
14643A109865K16145m3943k33770J90124j08017j7470N03242j69039l39858J66209
$$ 1109865 1326010 1282067 1048297 1238421 1130404 1112934 1616176 1447137 1107279 1273488
14633A273488J11015L07020m96659K56105j2095O172J6029n3271j15170N2164
$$ 1273488 1384503 1691523 1194864 1450969 1438874 1445046 1461075 1407804 1292634 1344798
14623A344798K26306j33139k36426L7219L91835k68122J53017j458K14447R8372
$$ 1344798 1571104 1437965 1201539 1238758 1630593 1362471 1515488 1514030 1728477 1826849
14613A826849j42489k50316J64147J01841k11569L27332p3982N3638o3159q0992
$$ 1826849 1684360 1434044 1598191 1700032 1488463 1815795 1741813 1795451 1732292 1651300
14603A651300K45463l63187M59013m10494P9928J9163J96k04751J321M49436k4675
$$ 1651300 1896763 1533576 1992589 1582095 1662023 1681186 1681382 1476631 1477952 1927388 1902713
14592A902713k32609L99051l18479L88511m06598L0279o2354K60894L40186k21476
$$ 1902713 1670104 2069155 1750676 2139187 1732589 1762868 1700514 1961408 2301594 2080118
14582B080118n1276J3051p0861K48625q0812k34879J47928J14068O4082m5116
$$ 2080118 2028842 2041893 1971032 2219657 2138845 1903966 2051894 2165962 2230044 2184928
14572B184928J12465j98142J25220r7375N76655n18309O24224l25840K79882K86085
$$ 2184928 2297393 2099251 2224471 2127096 2703751 2185442 2809666 2483826 2763708 3049793
14562C049793k14322l6920J10730P06172m52797N30552K95453Q7385M35747N39610
$$ 3049793 2835471 2798551 2909281 3615453 3162656 3693208 3988661 4076046 4511793 5051403
14552E051403M08967N15791J162778J324068L617785O059838R311188M212739
$$ 5051403 5460370 5976161 7138939 8463007 12080792 18140630 27451818 31664557
14544C1664557j2162756q354996m358946j940022o55504n93063j30072k48909
$$ 31664557 19501801 11146805 6787859 4847837 4192333 3599270 3469198 3220289
14536C220289o39406J04587J22880r7014J22221j92043N1229n039l8117l1357
$$ 3220289 2580883 2685470 2808350 2711336 2833557 2641514 2692743 2687704 2649587 2618230
14526B618230O2754J12108J09311m55510K4352j25028O11874k06637q0986J44523
$$ 2618230 2680984 2793092 2902403 2446893 2471245 2346217 2958091 2751454 2670468 2814991
14516B814991j54390J61243k6207k0736L36320J68290k95532O3378q9501J59915
$$ 2814991 2660601 2821844 2795637 2774901 3111221 3279511 2983979 3047357 2957856 3117771
14506C117771m5292k13086M32284K6265j49221j83663J80546K40395k15437L24204
$$ 3117771 3072479 2859393 3291677 3317942 3168721 2985058 3165604 3405999 3190562 3514766
14496C514766k00945J26595J07092J5579j08494J51530p9036L06809k09272Q4577
$$ 3514766 3313821 3440416 3547508 3563087 3454593 3606123 3527087 3833896 3624624 3709201
14486C709201N3151J14967p2501j5422n008j34234M23988j24421p2113L14811
$$ 3709201 3762352 3877319 3804818 3789396 3784388 3650154 4074142 3949721 3877608 4192419
14476D192419M0270n1239O4147j49904K26247K53748l33386L0537j33349Q9595
$$ 4192419 4232689 4181450 4245597 4095693 4321940 4575688 4242302 4272839 4139490 4229085
14466D229085J15207K49432P9703J74267p5684m12633M77210L31766k55113K57189
$$ 4229085 4344292 4593724 4673427 4847694 4772010 4359377 4836587 5168353 4913240 5170429
14456E170429L4366K5938K20282k39969K39821J91632R7835m28951M63899j03217
$$ 5170429 5204795 5230733 5451015 5211046 5450867 5642499 5740334 5311383 5775282 5672065
14446E672065k9389M02257k79178M87976n67106K38298j12893M77262k79669K22467
$$ 5672065 5642676 6044933 5765755 6253731 5686625 5924923 5812030 6289292 6009623 6232090
14436F232090J60723p2085M02140j58269J09604K62112J6944N4494M90140n41439
$$ 6232090 6392813 6320728 6722868 6564599 6674203 6936315 6953259 7007753 7497893 6956454
14426F956454K93660K35721k30761O12408p2277l4403K63352K20170j55594M72591
$$ 6956454 7250114 7485835 7255074 7867482 7795205 7760802 8024154 8244324 8088730 8561321
14416H561321O9905k53767L70349Q3940j85604N17868j21420J18539K72951K23531
$$ 8561321 8631226 8377459 8747808 8831748 8646144 9164012 9042592 9161131 9434082 9657613
14406I657613J72151J73968L06948k09889K32182M64485J4711l6590L28975J0363
$$ 9657613 9829764 10003732 10310680 10100791 10332973 10797458 10812169 10775579 11104554 11114917
14396A1114917J81210J61774L35613J48672K63183N2826J39465L33804N70090
$$ 11114917 11296127 11457901 11793514 11942186 12205369 12258195 12397660 12731464 13301554
14387A3301554J20920J62116Q8108M09774j68723N31065K60945N65268j37762
$$ 13301554 13422474 13584590 13672698 14082472 13913749 14444814 14705759 15271027 15133265
14378A5133265K44953M37457K85338M91407Q4255O74642j0477K26964P57919K42013
$$ 15133265 15378218 15815675 16101013 16592420 16676675 17351317 17340840 17567804 18325723 18567736
14368A8567736L65096J33654Q67769J91979O0691J033347M81284J27166J93715
$$ 18567736 18932832 19066486 19934255 20126234 20186925 21220272 21701556 21828722 22022437
14359B2022437P41248M13949O80290L22712N32954O89331L62707Q91603P15021
$$ 22022437 22763685 23177634 23857924 24180636 24713590 25402921 25765628 26657231 27372252
14350B7372252O30432P55809P74992N96705R00542P34141J021472M90168R39867
$$ 27372252 28002684 28758493 29533485 30130190 31030732 31764873 32786345 33276513 34216380
14341C4216380R09441J033902R16556R44528J442609O37352J537651Q68537J210809
$$ 34216380 35125821 36159723 37076279 38020807 39463416 40100768 41638419 42506956 43717765
14332D3717765J804482J334970J531518J534149J535564J744422J729000J679151
$$ 43717765 45522247 46857217 48388735 49922884 51458448 53202870 54931870 56611021
14324E6611021J851874K140493K032198K221403K097775K279892K831421K432786
$$ 56611021 58462895 60603388 62635586 64856989 66954764 69234656 72066077 74498863
14316G4498863L115454K807024K779942L825169L380187L550917L825629M290528
$$ 74498863 77614317 80421341 83201283 87026452 90406639 93957556 97783185 102073713
14308A02073713M495981M259712M950476M959856N278199N794255N934583O593125
$$ 102073713 106569694 110829406 115779882 120739738 126017937 131812192 137746775 144339900
14300A44339900O520782P409351P321118P920282Q758815Q889242R559578J0117962
$$ 144339900 150860682 158270033 165591151 173511433 182270248 191159490 200719068 210837030
14292B10837030J0269203J1303666J2079390J2309993J3108053J3500748J3111555
$$ 210837030 221106233 232409899 244489289 256799282 269907335 283408083 296519638
14285B96519638J3165926J2210613J1239850J0870602J0833615R458741R367175
$$ 296519638 309685564 321896177 333136027 344006629 354840244 364298985 373666160
14278C73666160J0063277J0530541R878149J0391988R878198R189364O322008
$$ 373666160 383729437 394259978 404138127 414530115 424408313 433597677 439919685
14271D39919685L568616J537274O02479m585997o268052q566057j2076076j2758756
$$ 439919685 443488301 445025575 445628054 441042057 434774005 426207948 414131872 401373116
14263D01373116j2535654j2521277j2358726j2923341j2874916j2366018j2194451
$$ 401373116 388837462 376316185 363957459 351034118 338159202 325793184 313598733
14256C13598733j1431945j1720414j0819253j1105410j0796803j0188224j0639574
$$ 313598733 302166788 290446374 279627121 268521711 257724908 247536684 236897110
14249B36897110j0530279r627335q854925q546128q125467q417816p388475p083356
$$ 236897110 226366831 216739496 207884571 199338443 191212976 182795160 175406685 168323329
14241A68323329p409102o173673o061791n895153n725964n653756n048953n150191
$$ 168323329 160914227 154740554 148678763 142783610 137057646 131403890 126354937 121204746
14233A21204746m895640l776225m403422m173049l710653l425560l523594l702885
$$ 121204746 116309106 112532881 108129459 103956410 100245757 96820197 93296603 89593718
14225H9593718l423865k588593l200663l065530k536898k886124k560409j923058
$$ 89593718 86169853 83581260 80380597 77315067 74778169 71892045 69331636 67408578
14217F7408578k430159k219402k108706j599642j981228k005239j806242j679906
$$ 67408578 64978419 62759017 60650311 59050669 57069441 55064202 53257960 51578054
14209E1578054j763169j082324j213979j444600j488649j598392j124626j208939
$$ 51578054 49814885 48732561 47518582 46073982 44585333 42986941 41862315 40653376
14201D0653376r13146j039412j213257j465863j023508j023987r23487o73654
$$ 40653376 39740230 38700818 37487561 36021698 34998190 33974203 33050716 32377062
14193C2377062o80812j275498n39358r28926q13493k58753r10481o69067p32403
$$ 32377062 31696250 30420752 29881394 28952468 28138975 27880222 26969741 26300674 25568271
14184B5568271l40963q66994p10980n11785K969j117702j5199p89769l98531k77446
$$ 25568271 25227308 24360314 23649334 23137549 23140518 22022816 22007617 21217848 20819317 20541871
14174B0541871p78760k60934l52897k55019n09922m51006K1711o71803l44841
$$ 20541871 19763111 19502177 19149280 18894261 18384339 17933333 17955044 17283241 16938400
14165A6938400j72047m22767l59589j48293k17905n55114N585j79328o68430j23754
$$ 16938400 16766353 16343586 15983997 15835704 15617799 15062685 15068270 14888942 14220512 14096758
14155A4096758j58866n75151O6576k78750k84859J28392m85002k81635p1090o0059
$$ 14096758 13937892 13362741 13429317 13150567 12865708 12994100 12509098 12227463 12156373 12096314
14145A2096314k11106k91480o3996k60511j10385J94730r48686J38555j62173
$$ 12096314 11885208 11593728 11529732 11269221 11158836 11353566 10404880 10543435 10381262
14136A0381262n44180J9491O9404l07846M9843k19300k28362j80468j4210p8943
$$ 10381262 9837082 9856573 9925977 9618131 9667974 9448674 9220312 9039844 9025634 8946691
14126H946691j50173o9160q1738n4617j36608L4269p8787m93067M2988j89047
$$ 8946691 8796518 8727358 8645620 8591003 8454395 8488664 8409877 7916810 7959798 7770751
14116G770751J5310l37987J6077j52143J87199m08316Q6813K7480l29471q9578
$$ 7770751 7786061 7448074 7464151 7312008 7499207 7090891 7177704 7205184 6875713 6786135
14106F786135j56990J09429K99926r34750J49588K8050j62751p4798L27585n35393
$$ 6786135 6629145 6738574 7038500 6103750 6253338 6281388 6118637 6043839 6371424 5836031
14096E836031M15932m22534R3291l84888M80917n51116J94279k46336k44362K13283
$$ 5836031 6251963 5829429 5922720 5537832 6018749 5467633 5661912 5415576 5171214 5384497
14086E384497J20439j68255j28094J22521l11579K25020k67006q3291L4688j33145
$$ 5384497 5504936 5336681 5208587 5331108 5019529 5244549 4977543 4894252 4928940 4795795
14076D795795n9016j69747K62411k36803J49163r2723j62298o1594k07412m9204
$$ 4795795 4736779 4567032 4829443 4592640 4741803 4649080 4486782 4425188 4217776 4168572
14066D168572K62326m8913O6300k63945r9400L12405j08315j83188J60807o6101
$$ 4168572 4430898 4381985 4448285 4184340 4084940 4397345 4289030 4105842 4266649 4200548
14056D200548j58462k37486J85651n57917K72895K08279m25201K32629L72L217
$$ 4200548 4042086 3804600 3990251 3432334 3705229 3913508 3488307 3720936 3721308 3724525
14046C724525j40071P7945J65713o09406K68003P312l92112N17449o50010R4939
$$ 3724525 3584454 3662399 3828112 3218706 3486709 3494021 3101909 3619358 2969348 3064287
14036C064287K10339o2715j26883p3819J21370P3308Q9335k54182k5279J2001
$$ 3064287 3274626 3211911 3085028 3011209 3132579 3205887 3295222 3041040 3015761 3027762
14026C027762J20056m56314J02144J10953k67086J21719R1503j52157K08749p18526
$$ 3027762 3147818 2691504 2793648 2904601 2637515 2759234 2850737 2698580 2907329 2188803
14016B188803N31764k62106K35321J23032m70040M30663j90162j59047p3794J8466
$$ 2188803 2720567 2458461 2693782 2816814 2346774 2777437 2587275 2428228 2354434 2372900
14006B372900O3516J45339l91053k1189L39567O0022n9618N1161O4211p3621M27024
$$ 2372900 2436416 2581755 2190702 2169513 2509080 2569102 2509484 2560645 2624856 2551235 2978259
13995B978259O16562l77938M3389K41770K72973P27589J154933K323405O124755
$$ 2978259 3594821 3216883 3260272 3502042 3775015 4502604 5657537 7980942 14105697
13986A4105697R374170P751033r821120p921785m194610k158538j575169m88488
$$ 14105697 23479867 31230900 21409780 13487995 9293385 7134847 5559678 5071190
13978E071190k28331m39883l92895m56805m3351K45676o30522K7570o6474n40867
$$ 5071190 4842859 4402976 4010081 3553276 3509925 3755601 3125079 3152649 3086175 2545308
13968B545308M23180j74970O1212m52747j84500M61207j0861n87925j1572K35267
$$ 2545308 2968488 2793518 2854730 2401983 2217483 2678690 2667829 2079904 2068332 2303599
13958B303599j17613j62201K04826K01909j24036j18925l9470l7l3952J23933
$$ 2303599 2185986 2023785 2228611 2430520 2306484 2187559 2148089 2148052 2114100 2238033
13948B238033k07529J52163j81205J00907m06416k49038N70054J80605m66266
$$ 2238033 2030504 2182667 2001462 2102369 1695953 1446915 2016969 2197574 1731308
13939A731308j3317N3865J27867o4463J53556l93875R7718k2975L47334Q3500
$$ 1731308 1717991 1771856 1899723 1835260 1988816 1594941 1692659 1669684 2017018 2100518
13929B100518m77341j20071m3658L66840j70115j42724L948o8077K90630j70928
$$ 2100518 1623177 1503106 1459448 1826288 1656173 1513449 1517397 1449320 1739950 1569022
13919A569022J53632j57489L63203m63836N5866O5861k72603L55537l17391J82756
$$ 1569022 1722654 1565165 1928368 1464532 1520398 1586259 1313656 1669193 1351802 1534558
13909A534558p1669k16695J68940j13595J88685j37908M6851l14047M33272m23433
$$ 1534558 1462889 1246194 1415134 1301539 1490224 1352316 1399167 1085120 1518392 1094959
13899A094959J49447K02306N0831J30875k32016l08054K09720r0360J81459j68266
$$ 1094959 1244406 1446712 1497543 1628418 1396402 1088348 1298068 1207708 1389167 1220901
13889A220901J33947k2300j32903L16328n49574L29824j68718J37410k3104Q6839
$$ 1220901 1354848 1332548 1199645 1515973 966399 1296223 1127505 1264915 1241811 1328650
13879A328650k14310k00018L03436P061J07007P6458l44686O5584K48562j28150
$$ 1328650 1114340 914322 1217758 1224819 1331826 1408284 1063598 1129182 1377744 1249594
13869A249594K35944l73527J29854j27955N9853Q4338k75903K64382j27859j17908
$$ 1249594 1485538 1112011 1241865 1113910 1173763 1258101 982198 1246580 1118721 1000813
13859A000813K63347k48272j79045K90642K55384k95648K7243j52919O8283J02943
$$ 1000813 1264160 1015888 836843 1127485 1382869 1087221 1114464 961545 1029828 1132771
13849A132771j36105M8169J73046J46105l52795k82857k79236O49249j74459M7942
$$ 1132771 996666 1044835 1217881 1363986 1011191 728334 449098 1098347 923888 971830
13839I71830j58180J1033J69769O7989P449l36801J94526j83296R8900k9680K20947
$$ 971830 813650 824683 994452 1062441 1069890 733089 927615 744319 843219 813539 1034486
13828A034486j88942K06314j99747J68108L7577n7625N2974E11868M3652M34578
$$ 1034486 845544 1051858 852111 1020219 1057796 1000171 1053145 511868 555520 990098
13818I90098k88165L86115k45016j82160K99756j46129J27153k33284L0971k19351
$$ 990098 701933 1088048 843032 660872 960628 814499 941652 708368 739339 519988
13808E19988K43779k5332K22767J08804j28992q5809N5492K69953k54559j24257
$$ 519988 763767 738435 961202 1070006 941014 855205 910697 1180650 926091 801834
13798H01834K42802k65439Q6344j26734J21915J54781l10745m6940q6017j65470
$$ 801834 1044636 779197 865541 738807 860722 1015503 704758 657818 571801 406331
13788D06331K42046J78972K06075j48749r8392q0035J43161l89005n5057L39192
$$ 406331 648377 827349 1033424 884675 786283 706248 849409 460404 405347 744539
13778G44539p8838J58873k9136j03278j51624K68823C92578M34703k86404Q7695
$$ 744539 665701 824574 795438 692160 540536 809359 392578 827281 540877 628572
13768F28572J5268o1172j19736K4713O3206L15332k24275J30221j46812L83942
$$ 628572 643840 582668 462932 487645 550851 866183 641908 772129 625317 1009259
13758A009259o9291q1257l08521M4852m4751O84745o13786K40826k73666B11462
$$ 1009259 939968 858711 550190 595042 550291 1235036 621250 862076 588410 211462
13747I83404l53945J45141j29468J09591J83422k72900k12299P3127K03301j97368
$$ 983404 629459 774600 645132 754723 938145 665245 452946 526073 729374 532006
13737E32006O6853J40684l8287J73466l78784K65289M3577j17132l4886J1855
$$ 532006 598859 739543 701256 874722 495938 761227 804804 687672 652786 664641
13727F64641M029B69710M92222L38066j68848k00683l7003k44902M20778m08729
$$ 664641 668670 269710 761932 1099998 931150 730467 693464 448562 869340 460611
13717D60611N852N1099P2972N1011l00045J25181J75015p5911R9893k7965j90375
$$ 460611 466463 517562 590534 641545 341500 466681 641696 565785 665678 637713 447338
13706D47338J05441j89125O6448J43398j45601K56666j57003q5814A00834L65984
$$ 447338 552779 363654 430102 573500 427899 684565 527562 441748 100834 466818
13696D66818O479O4414Q7047M0925k34395l8718A81912L92336J28653C23706J54271
$$ 466818 473297 537711 624758 665683 431288 392570 181912 574248 702901 323706 477977
13685D77977N3105q9889L9995r1361K80237j17203N5337N8524q6406B68996j23698
$$ 477977 531082 441193 481188 389827 670064 552861 608198 666722 580316 268996 145298
13674A45298R5786M7343Q83J85258n3152J28620R0312j58331K5731A57561M76293
$$ 145298 241084 288427 289310 474568 421416 550036 640348 482017 507748 157561 633854
13663F33854K1795k66132K96033j70082k6216Q0543j56941o8411L38818B78073
$$ 633854 655649 389517 685550 515468 489252 569795 412854 344443 683261 278073
13652D11995K28570B22217M72896C12527m6321O31611C43733n2279M0289j4248
$$ 411995 640565 222217 695113 312527 266206 897817 343733 291454 331743 317495
13642C17495l9442J13471K55843C21543K01522I8753K42339L56470R7621j25394
$$ 317495 278053 391524 647367 321543 523065 98753 341092 697562 795183 669789
13632F69789A94646D1272J97693O9446P296k42L2239L0601j46085J67885j55462
$$ 669789 194646 41272 238965 308411 315707 315465 347704 378305 232220 400105 244643
13621B44643K80095j32399J08207A95837K24960L4888j87188I6846M63420M4504
$$ 244643 524738 392339 500546 195837 420797 455685 268497 96846 560266 604770
13611F04770j92469j20786r1450N795K05060J1173B01089L8247K01117n5327K83615
$$ 604770 412301 291515 200065 205860 410920 422093 201089 239336 440453 385126 668741
13600F68741A40071K10792j49614J28829j3032A02177L46036n9270A16086K51471
$$ 668741 140071 350863 201249 330078 317046 102177 448213 388943 116086 367557
13590C67557A07415L67640j74552J82649K3783E6105K93095J51195D9356N60821
$$ 367557 107415 475055 300503 483152 506935 56105 349200 500395 49356 610177
13580F10177A76183R1771o9629J77734p8126r9874N1487q965M6655J19607j95556
$$ 610177 176183 267954 198325 376059 297933 198059 249546 240581 287236 406843 211287
13569B11287o1872a10619C76495R8111m1442B04083o786K47744K03304B31097
$$ 211287 149415 -110619 376495 474606 433164 204083 197297 445041 648345 231097
13558C13082C2720J70000N3132L03523A70276J8966o394a76682C66601k8596C5154
$$ 313082 32720 202720 255852 559375 170276 189242 182848 -176682 366601 338005 35154
13546D61123q68j68784p0930J40560A25999j5459K19741J41517j24960j4381A51634
$$ 461123 460255 291471 220541 361101 125999 110540 330281 471798 346838 332457 151634
13534B40565K8503J1629P7185j25226K10290j88382J32305r9024J65552j98391
$$ 240565 269068 280697 357882 232656 442946 254564 386869 287845 453397 255006
13524B55006F4467M25519A95967C4629a11099B14074j5486I7274a47921B87759
$$ 255006 64467 489986 195967 34629 -111099 214074 198588 97274 -147921 287759
13513A91314K39959h9127B95815K48783j25654J20431A63203N08320B30501A5913
$$ 191314 431273 -89127 295815 544598 418944 539375 163203 671523 230501 15913
13502D97807j44765A21411L07975B8911J47216L09579A90037L12491H0572J2491
$$ 497807 353042 121411 429386 28911 176127 485706 190037 502528 80572 93063
13492I3063J00080M8602Q3719j55689K94605b81173B49104k4407q8809J09651
$$ 93063 193143 241745 325464 169775 464380 -281173 249104 224697 135888 245539
13482B45539O1735r7095L31352A62951M04919G8655B2840J26304K02638K92540
$$ 245539 307274 210179 541531 162951 567870 78655 22840 149144 351782 644322
13472F44322j14393A76964G7232c4535D06577A2527K38855k3766a023B53237r1649
$$ 644322 529929 176964 77232 -34535 406577 12527 251382 227616 -1023 253237 161588
13461A61588j9406J60402n5410j3334P4324J10743A19203o327C7941M5540Q6743
$$ 161588 142182 302584 247174 233840 308164 418907 119203 112876 37941 83481 170224
13450A70224P4995J88335A98663C2073J40613J85265j23154Q859G0758J15836
$$ 170224 245219 433554 198663 32073 172686 357951 234797 243656 70758 186594
13440A86594L1991a60693D28431A75501a80631D8704J49862a58367C7014b8271
$$ 186594 218585 -160693 428431 175501 -180631 48704 198566 -158367 37014 -28271
13429A96478J58378A60347k637K07882A21454J87616O8204q8538n2972H131K36807
$$ 196478 354856 160347 157710 365592 121454 309070 377274 288736 235764 8131 244938
13418B44938f7557B82950H8875o722L22157j07432c8755F5939J87302A16279M9004
$$ 244938 -67557 282950 88875 82153 404310 296878 -38755 65939 253241 116279 165283
13407A65283O0869n099R9795Q8692A35832J73378m5709J11294j41766a32238C54836
$$ 165283 226152 221053 320848 409540 135832 309210 263501 374795 233029 -132238 354836
13395C62415F0318R5067M3060l3128R9509N9800J07406A60149N3150a09248B79178
$$ 362415 60318 155385 198445 165317 264826 324626 432032 160149 213299 -109248 279178
13383B48495a25862D31973A24604a22711a3071A72994J57355g833B85188J63600
$$ 248495 -125862 431973 124604 -122711 -13071 172994 330349 -7833 285188 448788
13373D48788C1588J61550L718j922O1697p5730L2468J03402A42006M61400e9492
$$ 448788 31588 193138 196856 194934 256631 180901 213369 316771 142006 603406 -59492
13361C05985A04175J58814J18869q8554A19799M961L95419k01388l5272e8428
$$ 305985 104175 262989 381858 293304 119799 124760 520179 318791 283519 -58428
13350A25616K75272m2463N1926K26733A50208L89482k23080J63790l2263A83483
$$ 125616 400888 358425 410351 637084 150208 539690 316610 480400 448137 183483
13339B01383G1100a2101B26867N9941A06674J16885l0938r5695Q2882O9726j01995
$$ 201383 71100 -12101 226867 286808 106674 223559 192621 96926 179808 249534 147539
13328A47539K34578j72917A02421L30452F3094J36208K63765A77669E6322J42620
$$ 147539 382117 209200 102421 432873 63094 199302 463067 177669 56322 198942
13318A98942K62380C5492r492R948H672J39160b12724g7623C37777r0918Q4812
$$ 198942 461322 35492 26000 35948 8672 147832 -212724 -77623 337777 246859 331671
13307C31671H981h3615G4059b88599A66032D2663J21073O6455b79704B19045e4645
$$ 331671 8981 -83615 74059 -288599 166032 42663 163736 230191 -279704 219045 -54645
13295G4289K71391A00069j215Q6353q3313L1213f5412A62820a76651A53668K52984
$$ 74289 345680 100069 98854 185207 101894 133107 -65412 162820 -176651 153668 406652
13284D06652j26733R7154j26096d04818e5093B719K97487E6592a95210C92040
$$ 406652 279919 377073 250977 -404818 -55093 2719 300206 56592 -195210 392040
13273D99769j68659q1064k0472K3105j13469b23195C71608n8999a3262B38031
$$ 499769 331110 250046 229574 252679 139210 -223195 371608 312609 -13262 238031
13262B22276H9249q641j3849b66403R7354f589B68381a8290q0255B07199O5741
$$ 222276 89249 80608 66759 -266403 -169049 -6589 268381 -18290 -98545 207199 272940
13251B72940N3000R9041F5659O9946Q2283J14224a23235A37377J63779e2432C4590
$$ 272940 325940 424981 65659 135605 217888 332112 -123235 137377 301156 -52432 34590
13239A54006b66547D099J83794k6835d41C41130C6662h0303A52880a95104F7700
$$ 154006 -266547 4099 187893 161058 -441 341130 36662 -80303 152880 -195104 67700
13227D78566B34575i3347j26138f7058A86817j2825j1680R3785j18297e7059k42880
$$ 478566 234575 -93347 -219485 -67058 186817 173992 162312 256097 137800 -57059 -299939
13216b99939E3388b3718A81671e1564E2757J57363a7659B02342f9698B66243G992
$$ -299939 53388 -23718 181671 -51564 52757 210120 -17659 202342 -69698 266243 7992
13204A98366h5274D6094J85487j5307J9982C1091h7442B494d5836m277n0749b5302
$$ 198366 -85274 46094 231581 216274 236256 31091 -87442 2494 -45836 -50113 -100862 -25302
13191C20301A33903N0639P7528a794B07534l4063m1479C3659K1195b59100a20055
$$ 320301 133903 184542 262070 -1794 207534 173471 131992 33659 54854 -259100 -120055
13179A27204l9841Q1590L5855b98684C5938K62096d2920A99656D0966A9631K70650
$$ 127204 87363 168953 204808 -298684 35938 298034 -42920 199656 40966 19631 290281
13168B90281A3106L44387C0463K14807Q1081A10990E384J01618i988B53807I0373
$$ 290281 13106 357493 30463 245270 326351 110990 5384 107002 -9988 253807 90373
13156I1223B1933L8791b30932L0441B80121e6577B43185a04752E2556K18402h7248
$$ 91223 21933 60724 -230932 -200491 280121 -56577 243185 -104752 52556 270958 -87248
13144b99261a14080J3010d747m2895r7661B07519q0226O5097B802M27256j56425
$$ -299261 -114080 -101070 -4747 -47642 -145303 207519 127293 192390 2802 430058 273633
13133B73633j00305d1900A97122a26018j7514B39818L8722g5407E4976K38435
$$ 273633 173328 -41900 197122 -126018 -143532 239818 278540 -75407 54976 293411
13123B93411a6663B6411d1338D58736A45432J15390h7514n499I6902C3278P4146
$$ 293411 -16663 26411 -41338 458736 145432 260822 -87514 -93013 96902 33278 107424
13112A07424g3718r2757C09032J03150m8632A35727F1536j8317b2670B3901M07507
$$ 107424 -73718 -166475 309032 412182 363550 135727 61536 43219 -22670 23901 431408
13101D31408j00527m5136J55991j58227L4350b79375d8891A01532m0027c7983
$$ 431408 330881 285745 441736 283509 317859 -279375 -48891 101532 61505 -37983
13090D9300O0947J46563l4314E8724O8820a86283A38558A2817K57670A33716K91218
$$ 49300 110247 256810 222496 58724 127544 -186283 138558 12817 270487 133716 424934
13079D24934j64847A10861b692B2648K96513j20540p4950J22055G7671J0761A6156
$$ 424934 260087 110861 -2692 22648 319161 198621 123671 245726 77671 88432 16156
13067d6729B2021b35121h3638A14599e2003C21421F4183L67840j73059J0407e7789
$$ -46729 22021 -235121 -83638 114599 -52003 321421 64183 432023 258964 269371 -57789
13055B99165a03471E9288a85501A97330a92890G9899g9736L5580A37882M9696
$$ 299165 -103471 59288 -185501 197330 -192890 79899 -79736 -44156 137882 187578
13045A87578H6559b54614C4591J20643F8340Q8801E0177j9845e6636A80866b05266
$$ 187578 86559 -254614 34591 155234 68340 157141 50177 30332 -56636 180866 -205266
13033C7550C134a27642A16248f3273n0482c1856K513I4768K7414e497p6898F7586
$$ 37550 3134 -127642 116248 -63273 -113755 -31856 -29343 94768 122182 -5497 -82395 67586
13020G6012J65928K1866K53550C3117a96394B28889K33600n5982h1935H5926f2883
$$ 76012 241940 263806 517356 33117 -196394 228889 462489 406507 -81935 85926 -62883
13008D06747B6068K3903A0031J61535j7205P683k0969L00257c7002C18629n0747
$$ 406747 26068 49971 10031 171566 154361 162044 141075 441332 -37002 318629 267882
12997B67882E7289K3916j9500b65630A16515b2815K686B02946A6556b1550B229
$$ 267882 57289 81205 61705 -265630 116515 -22815 -20129 202946 16556 -21550 2229
12985a8428C5426e3649D85919a79292F9688L17061A70400a83456f6091A21267
$$ -18428 35426 -53649 485919 -179292 69688 386749 170400 -183456 -66091 121267
12974a41985C7838J92943K75760a34212K4374G3673m910L7288a25477l10514I2224
$$ -141985 37838 230781 506541 -134212 -109838 73673 68763 106051 -125477 -435991 92224
12962a49314B06131C7015L26265b94032C62802A66257c61213A31907C0479a29090
$$ -149314 206131 37015 363280 -294032 362802 166257 -361213 131907 30479 -129090
12951B47639A5804F168O3390K77068a94552p1279J02963l2311b9960A2134K02785
$$ 247639 15804 6168 69558 346626 -194552 -265831 -162868 -195179 -29960 12134 214919
12940B14919G6121c6814l1824A14967K34957I2463a84473L4568c2209l5075A56992
$$ 214919 76121 -36814 -68638 114967 349924 92463 -184473 -149905 -32209 -67284 156992
12928g2448O55L2557I9098J46647H197M7206f7284A03835d7252A95899J12065
$$ -72448 -71793 -39236 99098 245745 8197 55403 -67284 103835 -47252 195899 307964
12917C07964I1391l3940e4563R582A31666a9954A64094G7218b0713A92270a79093
$$ 307964 91391 57451 -54563 -44981 131666 -19954 164094 77218 -20713 192270 -179093
12905B05934L6445A14414J21069L1483Q7628E1423L5621a67418O1765n4611f0133
$$ 205934 242379 114414 235483 266966 354594 51423 87044 -167418 -105653 -160264 -60133
12893A22083J1734P9288f9699k0290C54347e2161A6219L56967A37349J69431c9750
$$ 122083 133817 213105 -69699 -89989 354347 -52161 16219 373186 137349 306780 -39750
12881I7343b3910j25189B17581a27505N7000A09801a05793J4823j1796A9930J9422
$$ 97343 -23910 -149099 217581 -127505 -70505 109801 -105793 -90970 -102766 19930 39352
12870C9352a39866H6938P0983C642b07299i4894D68091k27959a920E236a83522
$$ 39352 -139866 86938 157921 3642 -207299 -94894 468091 240132 -1920 5236 -183522
12858b66733C9566M7056L17856e7695A76010E8217B3087J79419c5185B6501a01588
$$ -266733 39566 86622 404478 -57695 176010 58217 23087 202506 -35185 26501 -101588
12846f2696B43812q5146g3071G0478J51696d1850A60826J85347j33623a92452
$$ -62696 243812 158666 -73071 70478 222174 -41850 160826 346173 212550 -192452
12835g7522B14015a73451c3845C23866j56788e9124j61536A96259o5720c6280
$$ -77522 214015 -173451 -33845 323866 167078 -59124 -220660 196259 130539 -36280
12824F2368J5869J74737c5291j12824I9953K4425n0777f2413A4342L78219i1261
$$ 62368 78237 252974 -35291 -148115 99953 124378 73601 -62413 14342 392561 -91261
12812a9675I2175l8786b73220L5967J03962e0197l7023j2757H2168d4809j60910
$$ -19675 92175 53389 -273220 -237253 -133291 -50197 -87220 -99977 82168 -44809 -205719
12801b05719A67142D6519a08130A09355e6l83549i9914k37075a14135H3276B7635
$$ -205719 167142 46519 -108130 109355 -56 -383605 -99914 -336989 -114135 83276 27635
12789B49301E7170D874a83518g3633F3385a14601c2264B08888q9295a17865c5778
$$ 249301 57170 4874 -183518 -73633 63385 -114601 -32264 208888 119593 -117865 -35778
12777c8918q615k5868A08663A7644J29129M1337G1337i6016F4741k5057J52891
$$ -38918 -47533 -73401 108663 17644 146773 188110 71337 -96016 64741 39684 192575
12766A92575b1011B749c4386k02503a6347A09009d7116l49826G1817C281I07b76777
$$ 192575 -21011 2749 -34386 -236889 -16347 109009 -47116 -396942 71817 3281 907 -276777
12753A47894h9623M4570M014j68301G0097F510e9177J7061C51680h7156A28000
$$ 147894 -89623 -45053 -41039 -209340 70097 6510 -59177 -42116 351680 -87156 128000
12741c5537j04735b2330n9182l0615B61823J7390g749a833H3945J3504j8460B7396
$$ -35537 -140272 -22330 -81512 -112127 261823 279213 -7749 -1833 83945 97449 78989 27396
12728A92782a29347A05479c1082B02454r3646E3667K77013p6247a70420A26995
$$ 192782 -129347 105479 -31082 202454 108808 53667 330680 254433 -170420 126995
12717a25920j43559C912c55562a38113B91858E3856N4214J93281d2459a1082A27235
$$ -125920 -269479 3912 -355562 -138113 291858 53856 108070 301351 -42459 -11082 127235
12705F59839b6001B02306a30436C73724b73964D13418B00815h3417B87353a24593
$$ 659839 -26001 202306 -130436 373724 -273964 413418 200815 -83417 287353 -124593
12694d037B11391A9173K0356b5015C74096b77749A64930f0892b861A29960b15098
$$ -4037 211391 19173 39529 -25015 374096 -277749 164930 -60892 -2861 129960 -215098
12682E933J46296n3029J1769J54612J0731j5184E3091Q6061R3602c11550C95969
$$ 5933 152229 99200 110969 265581 276312 261128 53091 139152 232754 -311550 395969
12670A03128O457J77038A00591J6391K1102a22606B43693a15733B3592b77019
$$ 103128 109585 286623 100591 116982 138084 -122606 243693 -115733 23592 -277019
12659d9572a2648q1382F6192J4515a1000D7549e5316H8409P4607J93191d0876
$$ -49572 -12648 -94030 66192 80707 -11000 47549 -55316 88409 163016 356207 -40876
12647b33477A49048i0571B93323b31670n928I1195l9546J11228p7474d97463C7480
$$ -233477 149048 -90571 293323 -231670 -237598 91195 51649 162877 85403 -497463 37480
12635B44515J6151f8198k984j90536C0428J69094J0405r0699K40256A54739p4459
$$ 244515 260666 -68198 -71182 -261718 30428 199522 209927 119228 359484 154739 80280
12624H0280J02589j2553b3296A2486K43621b07510A48845g9713A21014m2798f3297
$$ 80280 182869 170316 -23296 12486 256107 -207510 148845 -79713 121014 78216 -63297
12612I5845C821d1478j72111B41553E8574Q1164c6097j52133F5375L3654O2475
$$ 95845 3821 -41478 -213589 241553 58574 139738 -36097 -188230 65375 99029 161504
12601A61504B3039a08734M7704B48392o4395f3682b2603f67n2204F1070e4701
$$ 161504 23039 -108734 -61030 248392 183997 -63682 -22603 -667 -52871 61070 -54701
12589c45991D20318E778B709L41134j07529n6387N3559C6289j1265a17209E8348
$$ -345991 420318 5778 2709 343843 236314 179927 233486 36289 25024 -117209 58348
12577A35825m4935M3925a29042B31729A2291K14880g2538F9598N0325b26975A36652
$$ 135825 90890 134815 -129042 231729 12291 227171 -72538 69598 119923 -226975 136652
12565I3319M9740Q48e4672j4948A09206D9443a39141f2540I6962E775a17609L1989
$$ 93319 143059 143907 -54672 -69620 109206 49443 -139141 -62540 96962 5775 -117609 -85620
12553h5620a2092D8681J5698Q548b6977k23063a7436A34058J7639e7299a0777
$$ -85620 -12092 48681 64379 72927 -26977 -250040 -17436 134058 151697 -57299 -10777
12541f9806k43164F5191P9784a3611C6827b179j8846r6599C37522n4352j18058
$$ -69806 -312970 65191 144975 -13611 36827 -2179 -21025 -117624 337522 283170 165112
12530A65112c5001j24489p2024B09079I3164L88819E1319J73376a67297B76948
$$ 165112 -35001 -159490 -231514 209079 93164 481983 51319 224695 -167297 276948
12519a3860l93562A1665a44492N6742k53295a296j71421A58373D2772c20035A2604
$$ -13860 -407422 11665 -144492 -87750 -341045 -1296 -172717 158373 42772 -320035 12604
12507B51194j19510a91021B22781o7550b05459R3390l7286B23496p1602C3952
$$ 251194 131684 -191021 222781 155231 -205459 -112069 -149355 223496 151894 33952
12496a26428J9147k3711A66598J90637a47863A34088e22915E8856j4890a56907
$$ -126428 -107281 -130992 166598 357235 -147863 134088 -522915 58856 43966 -156907
12485B48506j5301J16316o2415A18415E1217J21382J03525a08380A46446b27670
$$ 248506 233205 349521 287106 118415 51217 172599 276124 -108380 146446 -227670
12474d00354a36585p7394b8418k22982F3952c94985A6720K24244H363c00684G8773
$$ -400354 -136585 -213979 -28418 -251400 63952 -394985 16720 240964 8363 -300684 78773
12462I5821L09528a05302n7097j96833H000M7794b3888A6351a75287c4253j95125
$$ 95821 405349 -105302 -162399 -359232 8000 55794 -23888 16351 -175287 -34253 -229378
12451b29378l6406k07456A57021a58365j3087A52345a19134l5204C9339a23500
$$ -229378 -265784 -473240 157021 -158365 -171452 152345 -119134 -154338 39339 -123500
12440B15455a21741k2485j07146f6614l7329p5989a0768I9827a67823B62466a50276
$$ 215455 -121741 -144226 -251372 -66614 -103943 -179932 -10768 99827 -167823 262466 -150276
12428I2728a0296B70O7497J1699K26190I0185J7056a71615D5658R1575b46302
$$ 92728 -10296 270 67767 79466 305656 90185 107241 -171615 45658 137233 -246302
12416C1007a80618b3291C5146R9937M422b04354C19701e6830q3255I2428a4122
$$ 31007 -180618 -23291 35146 135083 139505 -204354 319701 -56830 -140085 92428 -14122
12404c28412a60002k23056A09392a21788B37532a176j85480M6348C949e62j26035
$$ -328412 -160002 -383058 109392 -121788 237532 -1176 -186656 -140308 3949 -562 -126597
12393a26597C29734d33708g0668J3729D4002J22337P174k3390a17485A5255K32045
$$ -126597 329734 -433708 -70668 -56939 44002 166339 173513 150123 -117485 15255 247300
12382B47300a18186j750B46035G6188K505c03397i0241p5965F00P2960b32721
$$ 247300 -118186 -119936 246035 76188 78693 -303397 -90241 -166206 600 73560 -232721
12370a74871q269g5156j33585I5279i0765k1822F41351e6608D32298B3450L5306
$$ -174871 -183140 -75156 -208741 95279 -90765 -112587 641351 -56608 432298 23450 58756
12359E8756J41187d164A49239J16791C2363K9477d24621a67781A98468b9098A9549
$$ 58756 199943 -4164 149239 266030 32363 61840 -424621 -167781 198468 -29098 19549
12347c0161B1158a25550A46499n5226l9566a77466o1059b8224I8906a58621K9731
$$ -30161 21158 -125550 146499 91273 51707 -177466 -238525 -28224 98906 -158621 -128890
12336a28890J9150j742E5334L42353d2131A25055a8013k6887A29894b44919a15833
$$ -128890 -109740 -111482 55334 397687 -42131 125055 -18013 -44900 129894 -244919 -115833
12324A07989J38248h2845r7139E7185c3384q0733A68172b84375B19696a14519
$$ 107989 246237 -82845 -179984 57185 -33384 -114117 168172 -284375 219696 -114519
12313B861J02984d4752a3416G4075M063J13612a0517E5813J60097f568q2188n2573
$$ 2861 105845 -44752 -13416 74075 78138 191750 -10517 55813 215910 -6568 -88756 -141329
12301a41329B21269G4302L2097i9577j99959a00347F3389g7118I1277A0918J47484
$$ -141329 221269 74302 106399 -99577 -299536 -100347 63389 -77118 91277 10918 158402
12290A58402f0250B88343j34345a19683B20543a58809A97636L7251m5227a78058
$$ 158402 -60250 288343 153998 -119683 220543 -158809 197636 234887 189660 -178058
12279A41934Q9823O2651A41622l037D9293A178L21416M1867c2154A75040e7162
$$ 141934 231757 294408 141622 138585 49293 1178 322594 364461 -32154 175040 -57162
12267B12518b8552k15956A50172F5072g4887L5728f8D12305A21684b4261A09494
$$ 212518 -28552 -244508 150172 65072 -74887 -39159 -68 412305 121684 -24261 109494
12255A79621m5364K5769F4658K733l2295K51867J21266j31975b8310m3366l5969
$$ 179621 134257 160026 64658 67391 35096 286963 408229 276254 -28310 -71676 -107645
12244a07645K28k5641I6087m4276a05829K0601c7584D8882H212N3341J33957a81309
$$ -107645 -107417 -133058 96087 51811 -105829 -85228 -37584 48882 8212 61553 195510 -181309
12231F9219J68847c61943a11690B62106a2490B7139a18007G5260J15610L6271
$$ 69219 238066 -361943 -111690 262106 -12490 27139 -118007 75260 190870 227141
12221B27141j00105A4517P6259a74753A88472o6093d488A28793a17465k0940A49578
$$ 227141 127036 14517 90776 -174753 188472 122379 -4488 128793 -117465 -138405 149578
12209A38405e1253C38087a73451C26242E4987m107K26156J06068A75933B2860
$$ 138405 -51253 338087 -173451 326242 54987 50880 277036 383104 175933 22860
12198C26944A10500K9860J37145n8152p0985L47041I6387O6842j7561b4657k4954
$$ 326944 110500 140360 277505 219353 148368 495409 96387 163229 145668 -24657 -49611
12187d9611E5939L34881A45488a35723A55875a5952A42338J21781j00541k6487
$$ -49611 55939 390820 145488 -135723 155875 -15952 142338 264119 163578 137091
12177A37091K10085a90465A3595N1291K07830j14214F4415a98657C34999j23585
$$ 137091 347176 -190465 13595 64886 272716 158502 64415 -198657 334999 211414
12167B11414d9510J5701A1599J41598J80284C1250K70675h5710d73A42900o557
$$ 211414 -49510 -33809 11599 153197 333481 31250 301925 -85710 -473 142900 136343
12156A36343k5543d23239A3552R6078f5476B13001e6691k06935I0908f0552C77804
$$ 136343 110800 -423239 13552 109630 -65476 213001 -56691 -263626 90908 -60552 377804
12144A12524a7611m5488C11258r8090a71304H8a14062C17845A13842D9757J95498
$$ 112524 -17611 -63099 311258 213168 -171304 88 -114062 317845 113842 49757 245255
12133B45255a18275d6663F1785c2471j17527B0715a04978k06902E2597f1360A64192
$$ 245255 -118275 -46663 61785 -32471 -149998 20715 -104978 -311880 52597 -61360 164192
12121D56436a42682r199B09786H9002m244B5913J35796f2609K9945k786j0157
$$ 456436 -142682 -151881 209786 89002 84758 25913 161709 -62609 -32664 -35450 -45607
12110d5607k29108G6648K17412M7077A59756g0604H1380i1657j15272E1086c2129
$$ -45607 -274715 76648 294060 341137 159756 -70604 81380 -91657 -206929 51086 -32129
12098B02176L05900a24673F123J1033J22099J31556q9803a67975j10042a06722
$$ 202176 508076 -124673 6123 17156 139255 270811 181008 -167975 -278017 -106722
12087a6001k21826A67872l3077l2a74455B80858g972B4056J09471J26174A03731
$$ -16001 -237827 167872 134795 134763 -174455 280858 -7972 24056 133527 259701 103731
12075B62811g4404G6448K07196J02007J39073J46647K04768l92176E5799R1472
$$ 262811 -74404 76448 283644 385651 524724 671371 876139 483963 55799 147271
12065A47271i2983A2574a13993A84754e8790G5828c10603a05843C85632a11052
$$ 147271 -92983 12574 -113993 184754 -58790 75828 -310603 -105843 385632 -111052
12054D9842J07546b22338B25348j08856B9782j4535i339m3605A32299d18325e5144
$$ 49842 157388 -222338 225348 116492 29782 15247 -9339 -52944 132299 -418325 -55144
12042E7059J62601a61487o7145L5610J0755I3776j6960L3901K80717G6776J52434
$$ 57059 219660 -161487 -228632 -193022 -182267 93776 76816 110717 391434 76776 229210
12031B29210a78794I0432i0192A92054B3814b61708K5803O2225A20526J80018
$$ 229210 -178794 90432 -90192 192054 23814 -261708 -235905 -173680 120526 300544
12021C00544o3822l8086J03400A37792b9556A91114C4778b995I0803f6670N054
$$ 300544 236722 198636 302036 137792 -29556 191114 34778 -2995 90803 -66670 -61616
12010f1616I4800Q2069a05646E3086a19717L3821j6371A60372b90473a7354D5046
$$ -61616 94800 176869 -105646 53086 -119717 -85896 -102267 160372 -290473 -17354 45046
11998a92713E349R7433d33641h152k51146C5170c39917E8827K93556a35856k8058
$$ -192713 5349 102782 -433641 -8152 -259298 35170 -339917 58827 352383 -135856 -163914
11987a63914A49997b4022j84803A00726a94357j00343A6980e5886B52555c66300
$$ -163914 149997 -24022 -208825 100726 -194357 -294700 16980 -55886 252555 -366300
11976a99645j44343B04639A00631a21150E8488a44441L7086c9694C62550a33836
$$ -199645 -343988 204639 100631 -121150 58488 -144441 -107355 -39694 362550 -133836
11965c4101A16236D7620r083J06464C4072a023j67382B21954C1686b15194P1664
$$ -34101 116236 47620 38537 145001 34072 -1023 -168405 221954 31686 -215194 -143530
11954a43530A18047B4294b6128I4564A5037b22451A5427d3211B65824b92895A99133
$$ -143530 118047 24294 -26128 94564 15037 -222451 15427 -43211 265824 -292895 199133
11942d5068n1696j9331r6195d9822A12163c2595j49427A65177A4136g6915A26383
$$ -45068 -96764 -116095 -212290 -49822 112163 -32595 -182022 165177 14136 -76915 126383
11930a66354d3531A17091A8896g1209j61507d5737a5993I6561C7417b83157H7147
$$ -166354 -43531 117091 18896 -71209 -232716 -45737 -15993 96561 37417 -283157 87147
11918a42798k7459r0091B18078c6689A39082d2831G5690j0452J65785i1143F7064
$$ -142798 -170257 -260348 218078 -36689 139082 -42831 75690 65238 231023 -91143 67064
11906a39552A7606d2041F1061b67893C9915j3310a67344F7831A3786b31370a4689
$$ -139552 17606 -42041 61061 -267893 39915 26605 -167344 67831 13786 -231370 -14689
11894c60418J02451b8183E0667J81372c32367a38292E057a14309a6221j31763
$$ -360418 -257967 -28183 50667 232039 -332367 -138292 5057 -114309 -16221 -147984
11884a47984j3805A6948c17362h8051j72522A02630e41607a12359G5364B9173
$$ -147984 -161789 16948 -317362 -88051 -260573 102630 -541607 -112359 75364 29173
11873a88967r2628d3572A09659b34657O7313p6900B45131b11379K1311A33473
$$ -188967 -281595 -43572 109659 -234657 -167344 -244244 245131 -211379 -190068 133473
11862a47167D246i1809I7003J39007a63789B52863b20403D84898b9179k96727
$$ -147167 4246 -91809 97003 236010 -163789 252863 -220403 484898 -29179 -325906
11852c25906A08812J23073a50474q0514A27689C4287J19848d75l21230A77206
$$ -325906 108812 231885 -150474 -230988 127689 34287 154135 -475 -321705 177206
11841f5778A26154n8317E878N5657b08186C9937b51838a24024E2869b61567M1466
$$ -65778 126154 67837 5878 61535 -208186 39937 -251838 -124024 52869 -261567 -220101
11830b20101l4635D24585d6545A27258B2951P1509a40813I4922A1707c0007F6309
$$ -220101 -254736 424585 -46545 127258 22951 94460 -140813 94922 11707 -30007 66309
11818H1526C3834J60094a94676c2714k8726j4421L4554m65j8800G3950l1057K61401
$$ 81526 33834 193928 -194676 -32714 -61440 -75861 -41307 -41772 -60572 73950 42893 304294
11806C04294d6961C0986c33203J37190k55342A24670L8285K8555K3343F5219g4919
$$ 304294 -46961 30986 -333203 -196013 -451355 124670 162955 191510 214853 65219 -74919
11794A36307O9860g9479r0157D6694b5411j73804e6980j01530A18932M35238k60003
$$ 136307 206167 -79479 -169636 46694 -25411 -199215 -56980 -158510 118932 554170 294167
11783B94167B9718a0331H3786a54341A94702c78424e9014b2086j30401C5832J09685
$$ 294167 29718 -10331 83786 -154341 194702 -378424 -59014 -22086 -152487 35832 145517
11772A45517M6914e1622n5429l5844f6089A8308J50616f2905q0071l264j37787
$$ 145517 192431 -51622 -107051 -142895 -66089 18308 168924 -62905 -142976 -146240 -284027
11761b84027I7796i4661q6460C6528H622d8675A06545E020a33117m8262P8859
$$ -284027 97796 -94661 -181121 36528 8622 -48675 106545 5020 -133117 -181379 -102520
11750a02520j66096B37476a87398d5721A83681B0304M1955J58706a34428k9555
$$ -102520 -268616 237476 -187398 -45721 183681 20304 62259 220965 -134428 -163983
11740a63983C9306b55861B12902b12007A22515E7014a24405D1493j4978J17178
$$ -163983 39306 -255861 212902 -212007 122515 57014 -124405 41493 26515 143693
11730A43693j7032a13689A20803K56725A69906e2219n9199j63215o1890A78977
$$ 143693 126661 -113689 120803 377528 169906 -52219 -111418 -274633 -336523 178977
11719B15911j07407a68119A52568F5188g8971A50194E4736c9239k4961j64580
$$ 215911 108504 -168119 152568 65188 -78971 150194 54736 -39239 -64200 -228780
11709b28780A87383J63123C9669O7965a77l19675A08064M7058i294k088l0810
$$ -228780 187383 350506 39669 107634 -177 -319852 108064 155122 -9294 -11382 -42192
11698d2192B91098r5677b47647A24272P9758n6300a79184a7148k4887k36671M9717
$$ -42192 291098 195421 -247647 124272 204030 147730 -179184 -17148 -42035 -278706 -228989
11687b28989G6809K67282d126B5709a64597C4951a25441f202F2777g0322k30443
$$ -228989 76809 344091 -4126 25709 -164597 34951 -125441 -6202 62777 -70322 -300765
11676c00765A09159a48042H7901b25310f4303C34178j46440F166N2284a4791A40379
$$ -300765 109159 -148042 87901 -225310 -64303 334178 187738 6166 58450 -14791 140379
11664A72056p473J26028H6512b6033C75221E1810J00798L7362a20058C67938H5254
$$ 172056 164583 290611 86512 -26033 375221 51810 152608 189970 -120058 367938 85254
11652a78017A94627e2385C71912a32313j60501A06306a1959D3541b4868A80674
$$ -178017 194627 -52385 371912 -132313 -292814 106306 -11959 43541 -24868 180674
11641A78558a61575j54447B53405L9977k3816H0294a10949E5956h2286B79872
$$ 178558 -161575 -316022 253405 293382 269566 80294 -110949 55956 -82286 279872
11630B67114c1150B52832G8706M3680J40573b6987F7387c46609A12957B429L246
$$ 267114 -31150 252832 78706 122386 262959 -26987 67387 -346609 112957 2429 5675
11619E675f8554J922B34105a46732E5680K8980J05879a86020I0439P2029i6949
$$ 5675 -68554 -66632 234105 -146732 55680 84660 190539 -186020 90439 162468 -96949
11607E8193a22233A17715b08447A49164b25517A0803b01758A41018K89379m2260
$$ 58193 -122233 117715 -208447 149164 -225517 10803 -201758 141018 430397 388137
11597C88137b16140a03553F0244J659d7119C2834J32754a32184A77259N4587e1452
$$ 388137 -216140 -103553 60244 61903 -47119 32834 165588 -132184 177259 231846 -51452
11585F3229a09512C31361A26785m8586B8715J97240a96331D69633A28597n0760
$$ 63229 -109512 331361 126785 78199 28715 225955 -196331 469633 128597 77837
11575G7837M0727A6748N6927a6438C16911F2851K26571d5349j7434B92607d7966
$$ 77837 118564 16748 73675 -16438 316911 62851 289422 -45349 -62783 292607 -47966
11563A17384E2320e9605C8006a06472C00953C8611J92298a79976d2403A27622
$$ 117384 52320 -59605 38006 -106472 300953 38611 230909 -179976 -42403 127622
11552A5160L04196A07821a93903D9935b51199C01006A23357O9178K21789n3712
$$ 15160 319356 107821 -193903 49935 -251199 301006 123357 192535 414324 360612
11542C60612j25890Q7688D5250J77317a31571C41727A5007K90316c6588B51582
$$ 360612 234722 322410 45250 222567 -131571 341727 15007 305323 -36588 251582
11531B42388K1617a7161D6054a33417H9779a52230B08278e4797A05497J6394J32554
$$ 242388 264005 -17161 46054 -133417 89779 -152230 208278 -54797 105497 121891 254445
11520B54445H6956B6919K0756a19015A83432O2501b50372c4449B66416G9372a83332
$$ 254445 86956 26919 47675 -119015 183432 245933 -250372 -34449 266416 79372 -183332
11508B06951A1587K09946i1323C32334L3481A14340J33310I2893k1915K05815
$$ 206951 11587 221533 -91323 332334 365815 114340 247650 92893 70978 276793
11498B76793j04123b38465A34688d5992a2625C30567L357B4657i3717A62080b22932
$$ 276793 172670 -238465 134688 -45992 -12625 330567 333924 24657 -93717 162080 -222932
11486C67718C1803K20985A25852J05517j09245P0555l8742N6909b55311A28939
$$ 367718 31803 252788 125852 231369 122124 192679 153937 210846 -255311 128939
11475a98647A86134K4118n5862e7809A72219O9317j01876l1617M2736J0686B7006
$$ -198647 186134 210252 154390 -57809 172219 241536 139660 108043 150779 161465 27006
11463C03084B437i3084j03087A95646q735J2802D4544O0996J35260b32686e0732
$$ 303084 2437 -93084 -196171 195646 186911 199713 44544 105540 240800 -232686 -50732
11451B95814A30114l424h9966A36209r167J67210k1568g3888B54867a92059A75276
$$ 295814 130114 126690 -89966 136209 127042 294252 272684 -73888 254867 -192059 175276
11439A82565d6456l029B99208b6179j19562K6289I6029c0553j55356B06480d0973
$$ 182565 -46456 -49485 299208 -26179 -145741 -119452 96029 -30553 -185909 206480 -40973
11427B47177d208k12861c5474A53933b09832e4185e747m9054J9465l1965k0014
$$ 247177 -4208 -217069 -35474 153933 -209832 -54185 -5747 -54801 -35336 -67301 -87315
11416h7315j79991C66868D4284J96722P4423b50511D3920b5736j35865D2680A5878
$$ -87315 -267306 366868 44284 241006 315429 -250511 43920 -25736 -161601 42680 15878
11404e0703C33860R401B6888N7069J06131C9299a91158i402A34614j8073D7305
$$ -50703 333860 343261 26888 83957 190088 39299 -191158 -9402 134614 116541 47305
11392H0546M47645f5383b6764A83088a21539H3085j405B1746d05291a06464A9841
$$ 80546 528191 -65383 -26764 183088 -121539 83085 81680 21746 -405291 -106464 19841
11380f1730o8027q667d1778b860A57500b88979Q2445j45991B39668H4010f2679
$$ -61730 -129757 -138424 -41778 -2860 157500 -288979 -206534 -352525 239668 84010 -62679
11368b14013C81798b86286j15920e5293D0199J33540a25886B93449G171a82281
$$ -214013 381798 -286286 -402206 -55293 40199 173739 -125886 293449 7171 -182281
11357c5817I2106l7234b6188A00702l8073k1876e5731C54191i6994B88220F9270
$$ -35817 92106 54872 -26188 100702 62629 40753 -55731 354191 -96994 288220 69270
11345g3701l8248C728J7815c8626l81704a4511o4892A03884m1609g70B04458h8669
$$ -73701 -111949 3728 21543 -38626 -420330 -14511 -79403 103884 62275 -770 204458 -88669
11332A104K26116o1913a55079m8968B521b38370L4031K7111q713l8890n0010Q0536
$$ 1104 227220 165307 -155079 -204047 2521 -238370 -204339 -177228 -185941 -224831 -274841 -194305
11320a94305C72913j22463n8881a88837j17480a09261j16799N3971A36086a50864
$$ -194305 372913 250450 191569 -188837 -306317 -109261 -226060 -172089 136086 -150864
11309H4959d2165J0629H1181d05976I5418a13336q6683A48351h6653o7118f1955
$$ 84959 -42165 -31536 81181 -405976 95418 -113336 -200019 148351 -86653 -153771 -61955
11297a60957b9911k57497h2800A96608b08932j477C7830M3212C0747b84395b1844
$$ -160957 -29911 -287408 -82800 196608 -208932 -210409 37830 81042 30747 -284395 -21844
11285a7982A19187a42779I589I25c3032I7507c89875E0839J6127a17537l7805
$$ -17982 119187 -142779 9589 925 -33032 97507 -389875 50839 66966 -117537 -155342
11274a55342a5155G0124L0941K4028e12063C1300e4729C9861a17208B94813a38506
$$ -155342 -15155 70124 101065 125093 -512063 31300 -54729 39861 -117208 294813 -138506
11262c5914B4484b15541O567D4376f2440j53210A215K64126h8506k70688b1227
$$ -35914 24484 -215541 -208974 44376 -62440 -215650 1215 265341 -88506 -359194 -21227
11250B47563I992c66131C9184O612j6768Q5534h2723I5636Q247c64690C9549a48302
$$ 247563 9992 -366131 39184 45796 29028 114562 -82723 95636 103883 -364690 39549 -148302
11237a63996B24877a47353B93443a86260I9114J74846E4264a52490B6109b02721
$$ -163996 224877 -147353 293443 -186260 99114 273960 54264 -152490 26109 -202721
11226f0074A2228K73974c01139I787a79660d3229A35461D4046J72594a39989j72722
$$ -60074 12228 286202 -301139 9787 -179660 -43229 135461 44046 216640 -139989 -312711
11215c12711J40227A73474c8485c914G3156c9009k70658E5324J97867b27764C52822
$$ -312711 -172484 173474 -38485 -3914 73156 -39009 -309667 55324 253191 -227764 352822
11203a90660A89318e6164k12062A09277d2700r4607p8854c5545m2846C87444E3612
$$ -190660 189318 -56164 -268226 109277 -42700 -137307 -216161 -35545 -78391 387444 53612
11191b50050k3576L1459i0955A04267C9205P7472i9863j61365C51583a43169j02149
$$ -250050 -273626 -242167 -90955 104267 39205 116677 -99863 -261228 351583 -143169 -245318
11180b45318J02089j14093B02726A2502l612a57780d1231j76211G3578K40528
$$ -245318 -143229 -257322 202726 12502 8890 -157780 -41231 -217442 73578 314106
11170C14106A14436a79587a2904l03787a57704C1517J05734O6237G3276a38024
$$ 314106 114436 -179587 -12904 -316691 -157704 31517 137251 203488 73276 -138024
11159B0056h9726A15195b90451F6510c77862j30955a27750k4323A28873a02802
$$ 20056 -89726 115195 -290451 66510 -377862 -508817 -127750 -152073 128873 -102802
11148A68106b32315r7090o7175C73P8128b09264m1739h8358A21523a75166n8111
$$ 168106 -232315 -329405 -396580 373 78501 -209264 -251003 -88358 121523 -175166 -233277
11137b33277R2029p6172C28677j39491o914g9164n1485l5243D2996O8106b74071
$$ -233277 -141248 -217420 328677 189186 182272 -79164 -130649 -165892 42996 111102 -274071
11125D6590K14756m7540N8984a53617A09462J28097F6122J44684q5499O470a67589
$$ 46590 261346 213806 272790 -153617 109462 237559 66122 210806 125307 131777 -167589
11113e3699A62125a29752A05927b413H3553D869K64477b93010D48444A9438A588
$$ -53699 162125 -129752 105927 -2413 83553 4869 269346 -293010 448444 19438 1588
11101A70566l5047Q5008J26502A26963L3580a98167C55465A06901j1714f6081
$$ 170566 135519 220527 347029 126963 160543 -198167 355465 106901 95187 -66081
11090C62719A12662f8639E6169b7084A06977K41676k7586q2670G5249a2701A5196
$$ 362719 112662 -68639 56169 -27084 106977 348653 321067 238397 75249 -12701 15196
11078A97334Q4613P3672e69B22502J45967m9597N7288p6342j15395J60281J8984
$$ 197334 281947 355619 -569 222502 368469 318872 376160 299818 184423 344704 363688
11067C63688J19259r5484J49620n4463I5498K16306J98860B48109L4947L23692
$$ 363688 482947 387463 537083 482620 95498 311804 510664 248109 283056 606748
11057F06748j98616J26257B53335J15613q235M97824l06597J98037j57154L65581
$$ 606748 408132 534389 253335 368948 360713 858537 551940 749977 592823 958404
11047I58404j63383K7054l20090K39008O9003N0035k41785J40721K78256k64267
$$ 958404 795021 822075 501985 740993 809996 860031 618246 758967 1037223 772956
11037G72956Q8355k9068j96982K35961l43687J95472j11626J47849J2521j35536
$$ 772956 861311 832243 635261 871222 527535 723007 611381 759230 771751 636215
11027F36215j19532M21706C27462K20925L7046j38855J63372k67908N6228K52546
$$ 636215 516683 938389 327462 548387 585433 446578 609950 342042 398270 650816
11017F50816k5943K35402j75211p2348O6529C01312J00263K36929K40072l06092
$$ 650816 624873 860275 685064 612716 679245 301312 401575 638504 878576 572484
11007E72484j41678K57147C38311L51464q9902J85261k45538J62919j53644j12049
$$ 572484 430806 687953 338311 689775 599873 785134 539596 702515 548871 436822
10997D36822O9961L25700k00472J17115j16732J02210o3140O6693j21930L31221
$$ 436822 506783 832483 632011 749126 632394 734604 671464 738157 616227 947448
10987I47448l1885R9309J26506m38833L14691j84897M01906O5070K17069J6946
$$ 947448 915563 1014872 1141378 702545 1017236 832339 1234245 1299315 1516384 1533330
10977A533330K27383j016L93827k48998K73733J42419J79422j87687j16686n6140
$$ 1533330 1760713 1759697 2153524 1904526 2178259 2320678 2500100 2312413 2195727 2139587
10967B139587j75189Q1935k55561k39779O2472J88624m80373K29730L15991k43057
$$ 2139587 1964398 2046333 1790772 1550993 1613465 1802089 1321716 1551446 1867437 1624380
10957A624380J8359Q3785p0460k27997j0052o0125j70700K3177m26557k44824
$$ 1624380 1642739 1726524 1656064 1428067 1418015 1357890 1187190 1210367 783810 538986
10947E38986J61263C15727M78618j98011k14513j5975L6432B00591J50133q2935
$$ 538986 700249 315727 794345 596334 381821 365846 402278 200591 350724 267789
10937B67789K43653j95191g1012B60502I7505h5229l0986C07654g4303L6580k7264
$$ 267789 511442 316251 -71012 260502 97505 -85229 -116215 307654 -74303 -37723 -64987
10926f4987A73676C2075N4710K05382a24009A34415b96494E6796J59788A6496
$$ -64987 173676 32075 86785 292167 -124009 134415 -296494 56796 216584 16496
10915H7179M53611b2790n9985A05664a83628A21682J26943B0230f6068D22239
$$ 87179 540790 -22790 -82775 105664 -183628 121682 248625 20230 -66068 422239
10904B47783q7106M7255A939e8362F5301c5556A12531a28955O4468k1082A16743
$$ 247783 160677 207932 1939 -58362 65301 -35556 112531 -128955 -64487 -85569 116743
10892a70699e2775A06748l9018J63407c14132e877A77236A7891L13690A09491
$$ -170699 -52775 106748 67730 231137 -314132 -5877 177236 17891 331581 109491
10881a65331H5905i6171B64992o5373c14950D3989K40264d01614A57978F579J59831
$$ -165331 85905 -96171 264992 199619 -314950 43989 284253 -401614 157978 6579 166410
10870A66410a67168J636D1670L4124a82254M1953e2177A12865J9414C8525a45615
$$ 166410 -167168 -165532 41670 75794 -182254 -140301 -52177 112865 132279 38525 -145615
10858A73078a46622K6963F8020K10129a45056D5123d301o3207B50176G0427i4833
$$ 173078 -146622 -119659 68020 278149 -145056 45123 -4301 -67508 250176 70427 -94833
10846A62572o8061j5040p164b10475A23391d4487j38438B28031d32394a96172
$$ 162572 94511 79471 72307 -210475 123391 -44487 -182925 228031 -432394 -196172
10835D4351J21353g5374j95011d840j08371A70311K3431n2883D5124d65785a46749
$$ 44351 165704 -75374 -270385 -4840 -113211 170311 193742 140859 45124 -465785 -146749
10823B0617K2671J74939f0444a1617B16878H1951L4977E1156j6505b58055A55648
$$ 20617 43288 218227 -60444 -11617 216878 81951 116928 51156 34651 -258055 155648
10811A64092g6362j53080O5705A9944a82665A7147h7826n6366e4296B11698q9039
$$ 164092 -76362 -229442 -163737 19944 -182665 17147 -87826 -144192 -54296 211698 122659
10800A22659e2321a9437B00632J5261C3878c38794a58635j23767J22283A55420
$$ 122659 -52321 -19437 200632 215893 33878 -338794 -158635 -282402 -160119 155420
10789a4866j87420A84645e0106j14426C5436h0051D440a67637a6963A26274c02719
$$ -14866 -202286 184645 -50106 -164532 35436 -80051 4440 -167637 -16963 126274 -302719
10777A2568d2784A8701c88689g8342I5472O0229b75323B8668a6778k63524E6024
$$ 12568 -42784 18701 -388689 -78342 95472 155701 -275323 28668 -16778 -280302 56024
10765i1880A51435a48274O6009H557b98900g057k8261l25110a27461A77047a01073
$$ -91880 151435 -148274 -82265 8557 -298900 -7057 -35318 -360428 -127461 177047 -101073
10753e4411k98849F3368b26649f1935p2677j63899B3133J02038c3719c964H67
$$ -54411 -353260 63368 -226649 -61935 -134612 -298511 23133 125171 -33719 -3964 867
10741a94452A5714J35031f3235A96061f3289A05950o056b06408E8177f7621B94709
$$ -194452 15714 150745 -63235 196061 -63289 105950 99894 -206408 58177 -67621 294709
10729a62132J7865A05381a92962G2439a61942C33420G0953K26171b2357r2199
$$ -162132 -144267 105381 -192962 72439 -161942 333420 70953 297124 -22357 -114556
10719a14556j85248J16052g0635A17143m1594A1350J54587b70468c1606C1839
$$ -114556 -299804 -183752 -70635 117143 75549 11350 165937 -270468 -31606 31839
10708i603A09058K7787a13340E7541M7012J1190c1415j90576J00060A36825J38058
$$ -9603 109058 136845 -113340 57541 104553 115743 -31415 -221991 -121931 136825 274883
10697B74883A06724k9475J05371b31482n8620A19693a20870j3177N0186j87226
$$ 274883 106724 77249 182620 -231482 -290102 119693 -120870 -134047 -83861 -271087
10687b71087B00275b3137l77192B94531F1790a16786o1367j59977L6981e7732
$$ -271087 200275 -23137 -400329 294531 61790 -116786 -178153 -338130 -301149 -57732
10676b75375P3554B44784a80663h9502A80148i7415j07509q0246e0600j62890
$$ -275375 -201821 244784 -180663 -89502 180148 -97415 -204924 -285170 -50600 -213490
10666b13490r9492A36736b97947C42341B3918h5081A60546J2215a29403k65214
$$ -213490 -312982 136736 -297947 342341 23918 -85081 160546 172761 -129403 -394617
10656c94617B58552d18000f4865r0304j23113J4435B49639b43169k9480i8287
$$ -394617 258552 -418000 -64865 -155169 -278282 -263847 249639 -243169 -272649 -98287
10645A4197c04347a32782B2370h917l4791j43312b2166r5975b493D6218J5013
$$ 14197 -304347 -132782 22370 -8917 -43708 -187020 -22166 -118141 -2493 46218 61231
10634F1231J5714J75954c12052l3710J61517p822d1820I6040b3906j50050P1237
$$ 61231 76945 252899 -312052 -345762 -184245 -192067 -41820 96040 -23906 -173956 -102719
10623a02719c8383n3278E3814a6432A24168k4926a52296F1497J50327J64596D9375
$$ -102719 -38383 -91661 53814 -16432 124168 99242 -152296 61497 211824 376420 49375
10611A8215J14131d84619a93794A30074i1363k43420a35689E1560a82F8745a88634
$$ 18215 132346 -484619 -193794 130074 -91363 -334783 -135689 51560 -182 68745 -188634
10599f8206l3962k3533A418b85631d7346K3434l21470C0510g394D3442f3233k12628
$$ -68206 -102168 -125701 1418 -285631 -47346 -23912 -345382 30510 -7394 43442 -63233 -275861
10587b75861e4592G2577a87107B55978a26839j21180B16998A1907J8971H5a04841
$$ -275861 -54592 72577 -187107 255978 -126839 -248019 216998 11907 30878 85 -104841
10575a92891i0409i314j55194D8231R7711B2470L59446j81914a31740B06830a38045
$$ -192891 -90409 -9314 -164508 48231 145942 22470 381916 200002 -131740 206830 -138045
10563E5511e2247j17820O8126k2055B04103q2358c63324A43009C2924j1553i3566
$$ 55511 -52247 -170067 -101941 -123996 204103 121745 -363324 143009 32924 21371 -93566
10551h8614A0254g8483R293A3340i8476j42l3054A26021b42349a8357k89958D7663
$$ -88614 10254 -78483 -69190 13340 -98476 -98618 -131672 126021 -242349 -18357 -308315 47663
10538A5650L30022a546j73014n2369B38810b4902A79443n7877J194i5415j91542
$$ 15650 345672 -1546 -174560 -226929 238810 -24902 179443 121566 122760 -95415 -286957
10527b86957i6923k2233J688j29953B04691e361B17288J30464A66764g940C07630
$$ -286957 -96923 -119156 -117468 -247421 204691 -5361 217288 347752 166764 -7940 307630
10515c17679i3232k35614J23975k165p071R7060j10136a5301j85042j52326a46918
$$ -317679 -93232 -328846 -204871 -207036 -214107 -117047 -227183 -15301 -200343 -352669 -146918
10503b09077O1252c5370r687A3204a31029E9151J05296i6373K2929A12820j4638
$$ -209077 -147825 -35370 -45057 13204 -131029 59151 164447 -96373 -73444 112820 98182
10492I8182a23451j5702o978B5269L8449K19318g4843A22651E8629L03520R9018
$$ 98182 -123451 -139153 -146131 25269 63718 283036 -74843 122651 58629 362149 461167
10481D61167K54314k65439J90886A70844m1199J99161N9521A33088N8092g7114
$$ 461167 715481 450042 640928 170844 129645 328806 388327 133088 191180 -77114
10470A66744b50208j22519d5360A05241Q6623a37609p1214B60954a85345L4793
$$ 166744 -250208 -372727 -45360 105241 191864 -137609 -208823 260954 -185345 -150552
10460a50552L1899L5703A07390J71214c2265j0665k68540J38829H0608J16869
$$ -150552 -118653 -82950 107390 278604 -32265 -42930 -311470 -172641 80608 197477
10450A97477e2485F5975h8874r228A74552a27210b3370r6019e8054q8831B66089
$$ 197477 -52485 65975 -88874 -98102 174552 -127210 -23370 -119389 -58054 -146885 266089
10438b65951N9112A54628a40397E8665b86632J04464h529j94086C5627L1668C2986
$$ -265951 -206839 154628 -140397 58665 -286632 -182168 -8529 -202615 35627 67295 32986
10426c77359N7989a27683C2136I367K36199a37209E3419f4764F2847c58191d5505
$$ -377359 -319370 -127683 32136 9367 245566 -137209 53419 -64764 62847 -358191 -45505
10414e98101a90620E4364a92865A16881N5244a445H7866N9225a81443c0349A30886
$$ -598101 -190620 54364 -192865 116881 172125 -1445 87866 147091 -181443 -30349 130886
10402d6620l1365k11680i7041A43791a2633l20986F6796N3876M1468m9158l4899
$$ -46620 -77985 -289665 -97041 143791 -12633 -333619 66796 120672 162140 112982 78083
10391G8083K0646c2810l0813B49643k83a60443c2645B63295a51374A57496a3271
$$ 78083 98729 -32810 -63623 249643 249360 -160443 -32645 263295 -151374 157496 -13271
10379A70397R0566E0897M40979I7523J52024n168j16050a02016B73056J91461
$$ 170397 260963 50897 491876 97523 249547 244379 128329 -102016 273056 464517
10369D64517B24290o1217L55643j70244A72459K00674A84095m5235P4649L28077
$$ 464517 224290 163073 518716 348472 172459 373133 184095 138860 213509 541586
10359E41586B21335J20623n7827R5090p2188J75225B04715K23643k04603L76780
$$ 541586 221335 341958 284131 379221 307033 482258 204715 428358 223755 600535
10349F00535k50138n8042J96841B37789j01464J45317J64378I1387K55975A24115
$$ 600535 350397 292355 489196 237789 136325 281642 446020 91387 347362 124115
10338C6475K37594j29979O7736I3609L1848J37999E6067Q4089N3691L5267J17542
$$ 36475 274069 144090 211826 93609 125457 263456 56067 140156 193847 229114 346656
10327C46656A39846Q0264g3135c775I4460k4999K98950a05227a8898H3512K98701
$$ 346656 139846 220110 -73135 -3775 94460 69461 368411 -105227 -18898 83512 382213
10316C82213a97185A35036N686L9441c48040F2959J17831R0843e03529I3805b22325
$$ 382213 -197185 135036 140722 180163 -348040 62959 180790 271633 -503529 93805 -222325
10304i3417d4217n8643j4988n9792k49643a96740b9270k35908a28785A87370i793
$$ -93417 -44217 -102860 -117848 -177640 -427283 -196740 -29270 -265178 -128785 187370 -9793
10292C13404a02311K4772B1321b93881B2072b81469B23574i8231j97721G3719
$$ 313404 -102311 -77539 21321 -293881 22072 -281469 223574 -98231 -295952 73719
10281B59865A12781P6884f9686j86473A44074a38869m0173H1231c4224B5906J88013
$$ 259865 112781 189665 -69686 -256159 144074 -138869 -179042 81231 -34224 25906 213919
10270B13919C8474b03844A64135b04748G5b9114N839I3561C7973M5413J85847
$$ 213919 38474 -203844 164135 -204748 75 -29114 -23275 93561 37973 83386 269233
10259B69233K15755A53972n274C2021K14383D9047R2565N9878F3137K13455c15524
$$ 269233 484988 153972 148698 32021 246404 49047 141612 201490 63137 276592 -315524
10247a68658a6796A76154B5215M3369b59885M9642a4720q0025F4844c51451a09496
$$ -168658 -16796 176154 25215 68584 -259885 -210243 -14720 -94745 64844 -351451 -109496
10235b19307A6602J08715a05983p4912l34632d8640d307k48574A91487p9941k0887
$$ -219307 16602 125317 -105983 -180895 -515527 -48640 -4307 -252881 191487 111546 90659
10224I0659k2832Q6303a28912B96568a54921B29855j3786a83701l2938f3473k77633
$$ 90659 67827 154130 -128912 296568 -154921 229855 216069 -183701 -216639 -63473 -341106
10213c41106J36382I7160d9294m32376a87575A8560e8522A7593b175A0492P8522
$$ -341106 -204724 97160 -49294 -481670 -187575 18560 -58522 17593 -2175 10492 89014
10202H9014R9932b24012q8320j13403B36625b16502O6110c5372n11844a15991
$$ 89014 188946 -224012 -312332 -425735 236625 -216502 -150392 -35372 -547216 -115991
10191a81709L7385j35120P7959d828F5237a03649M54p1834C00226b92007r2293
$$ -181709 -144324 -279444 -201485 -4828 65237 -103649 -103195 -175029 300226 -292007 -384300
10180c84300H5435a03247n1621N5992L5699j87488P7508B05087C7353a22958c5596
$$ -384300 85435 -103247 -154868 -98876 -63177 -250665 -173157 205087 37353 -122958 -35596
10168a06775j41894f360m4353H1907c58579a36717O1092j09665q495K4800H8145
$$ -106775 -248669 -6360 -50713 81907 -358579 -136717 -75625 -185290 -193785 -168985 88145
10156A0541Q6104c32605I5527c20232B35275b5112A59721a5709B4701b59023C5560
$$ 10541 96645 -332605 95527 -320232 235275 -25112 159721 -15709 24701 -259023 35560
10144D7187b13231A42293i0468H2803c8298j36112r7522A3662J29791L01798G3365
$$ 47187 -213231 142293 -90468 82803 -38298 -174410 -271932 13662 143453 445251 73365
10132c63101g4875A34825a95795a1615C50152E5698B3495I756c02773J21907l5201
$$ -363101 -74875 134825 -195795 -11615 350152 55698 23495 9756 -302773 -180866 -216067
10121b16067C0643c34922F12a23098J368b2103k35907a04774j01961E3772b8351
$$ -216067 30643 -334922 612 -123098 -121730 -22103 -258010 -104774 -206735 53772 -28351
10109H9137a34263A06185e6559o9755n0687D7791Q8563a87074e1449k14513C45494
$$ 89137 -134263 106185 -56559 -126314 -177001 47791 136354 -187074 -51449 -265962 345494
10097d4614j09254j56024b3890E5277Q520B7790L28895B8789b19953C7991e1695
$$ -44614 -153868 -309892 -23890 55277 63797 27790 356685 28789 -219953 37991 -51695
10085A44341b165n29455a08616n6855C6774a40434k97862H123J0183B484b22738
$$ 144341 -2165 -531620 -108616 -165471 36774 -140434 -438296 8123 18306 2484 -222738
10073b52916A33479k0469i6385B04026a13630n6381L6762m0614L3224A05696a88174
$$ -252916 133479 113010 -96385 204026 -113630 -170011 -133249 -173863 -140639 105696 -188174
10061D9014a82663Q2496m7325A49554b65342f2017q0975n4265J1469A03680J04119
$$ 49014 -182663 -100167 -147492 149554 -265342 -62017 -142992 -197257 -185788 103680 207799
10050B07799b65640C69390A79202c4460k9567q9251A05897b05380M9207k1338
$$ 207799 -265640 369390 179202 -34460 -64027 -153278 105897 -205380 -156173 -177511
10040a77511P9598b9527J871k67721n5885o3598J36861A22617D477L4513b54633
$$ -177511 -97913 -29527 -27656 -295377 -351262 -414860 -277999 122617 4477 38990 -254633
10028h0074b5870k4074K0203l8956H801b49809J02581D3787d63827b09320j11013
$$ -80074 -25870 -49944 -29741 -68697 8801 -249809 -147228 43787 -463827 -209320 -320333
10017c20333F5197e0584j29874l0018A14285a52733A64246d06170C27345b77053
$$ -320333 65197 -50584 -180458 -210476 114285 -152733 164246 -406170 327345 -277053
10006b65176o8299f9173l1734K2801R854K9372j59520j0751k3311C38189a99833
$$ -265176 -333475 -69173 -100907 -78106 -68252 -38880 -198400 -209151 -232462 338189 -199833
9994B37876i362A42412c10438e8778r773j85976G2392g2779B4936K16807b20504
$$ 237876 -9362 142412 -310438 -58778 -68551 -254527 72392 -72779 24936 241743 -220504
9982b33516H3051l0752e0096A6041a86129o9998g5382B82629C5752a32442r0044
$$ -233516 83051 52299 -50096 16041 -186129 -256127 -75382 282629 35752 -132442 -222486
9971b22486B10489a55567N762e5998D0190f8124C2126b5462K638j91351d6219
$$ -222486 210489 -155567 -149805 -55998 40190 -68124 32126 -25462 -22824 -214175 -46219
9959B70890a56745j60732J34311A0089K18612n5345G5157B0152a22592C1148h1638
$$ 270890 -156745 -317477 -183166 10089 228701 173356 75157 20152 -122592 31148 -81638
9947B3322c7118B40894E7186J58629D9772P2717h0326c9067m16199D8932J16791
$$ 23322 -37118 240894 57186 215815 49772 122489 -80326 -39067 -455266 48932 165723
9936A65723D0897a65507m1839a01207D5600K3642g0750j18388Q6490o3175j75910
$$ 165723 40897 -165507 -207346 -101207 45600 69242 -70750 -189138 -102648 -165823 -341733
9925c41733a7452E1280a2728k25702P1560o9540a3170l23531A3338N9358O5218
$$ -341733 -17452 51280 -12728 -238430 -166870 -236410 -13170 -336701 13338 72696 137914
9914A37914f7069l85328J71865G86J48116A5674J64189p0831a23142I9936c94383
$$ 137914 -67069 -452397 -280532 786 148902 15674 179863 109032 -123142 99936 -394383
9902a26252A4376d008l25571h8651l58286A20309g3193J6322C7508b31330d8688
$$ -126252 14376 -4008 -329579 -88651 -446937 120309 -73193 -56871 37508 -231330 -48688
9890A25526g5912C1144A2306J39431c76066d101I2963e7534B37915A2818a93738
$$ 125526 -75912 31144 12306 151737 -376066 -4101 92963 -57534 237915 12818 -193738
9878a66146L8256k47667M3804B5846a31041A92135c05927R8668B0198J26137g8641
$$ -166146 -127890 -375557 -331753 25846 -131041 192135 -305927 -207259 20198 146335 -78641
9866A93992i7318j46053d6237o1132b976A2392c44370a07636j85492f7683D16655
$$ 193992 -97318 -243371 -46237 -107369 -2976 12392 -344370 -107636 -293128 -67683 416655
9854g3135l636j87916e187m05991K9342J7966J45238e970j42108D8233i3597C5334
$$ -73135 -76771 -264687 -5187 -411178 -381836 -363870 -218632 -5970 -148078 48233 -93597 35334
9841b5512A89616b60113D9435L8074e3470l6206H3064b67690a10685c9878B94813
$$ -25512 189616 -260113 49435 87509 -53470 -89676 83064 -267690 -110685 -39878 294813
9829a63385B6466a02303l24322b05233G8672B3459a11626A77900a07004j16574
$$ -163385 26466 -102303 -426625 -205233 78672 23459 -111626 177900 -107004 -223578
9819b23578E696K01972b31225B13877J13845n1601b36494d7167k0655j05358M7929
$$ -223578 5696 207668 -231225 213877 327722 276121 -236494 -47167 -67822 -173180 -125251
9808a25251l3847J9286O4171l4614k96544a71914B58979h5898r8770C32279b54614
$$ -125251 -159098 -139812 -75641 -110255 -406799 -171914 258979 -85898 -184668 332279 -254614
9796i204C720a87842d6715A97950p1448l1640b02651a311A88061G374i8937m8396
$$ -9204 3720 -187842 -46715 197950 126502 94862 -202651 -1311 188061 7374 -98937 -147333
9784a47333E0817J93401B4584c0097H9254a97313C4209a8557j74701Q8883m93404
$$ -147333 50817 244218 24584 -30097 89254 -197313 34209 -18557 -193258 -104375 -597779
9773e97779A98860l8703b67584a0191A96729I0695h1609j49774C1102c4841a653
$$ -597779 198860 160157 -267584 -10191 196729 90695 -81609 -231383 31102 -34841 -1653
9761A84276a52499F8237Q6704o4698D0246j8876J59356a59935A42296b31430A04354
$$ 184276 -152499 68237 154941 90243 40246 21370 180726 -159935 142296 -231430 104354
9749B36991b64978A98356G3358b5480j70490B09849b11181D9038b60733M5052
$$ 236991 -264978 198356 73358 -25480 -195970 209849 -211181 49038 -260733 -215681
9739b15681A9559J82221c45389a21160N5266m24666a27242j59074g7634j23692
$$ -215681 19559 201780 -345389 -121160 -65894 -490560 -127242 -286316 -77634 -201326
9729b01326A8602l20f9618p8578k7936j13558C18757A22300b10275c793j3436
$$ -201326 18602 18282 -69618 -148196 -176132 -289690 318757 122300 -210275 -3793 -17229
9718a7229j84080p0847P2096a6084k6579l17920A3896a67146r081G0566a57833
$$ -17229 -201309 -272156 -200060 -16084 -42663 -360583 13896 -167146 -176227 70566 -157833
9706f7261o1064D4175d1493k4994f181n8328o9693c9560j59847P2971A2221N0316
$$ -67261 -128325 44175 -41493 -66487 -6181 -64509 -134202 -39560 -199407 -126436 12221 62537
9694F2537J10866b23359a6866j02310C8674N6909d2371b0489D9439d03720c6927
$$ 62537 173403 -223359 -16866 -119176 38674 95583 -42371 -20489 49439 -403720 -36927
9682B1053c62476A48845d42896b7272k48356a18888r4588e7440j47938L6880C71420
$$ 21053 -362476 148845 -442896 -27272 -275628 -118888 -213476 -57440 -205378 -168498 371420
9670a53873K7139q1j20076L5493e6184j05225i504j98621R1100K7577C1290b4411
$$ -153873 -126734 -126815 -246891 -211398 -56184 -161409 -9504 -208125 -117025 -89448 31290 -24411
9657A34414k7125e2599B11124a39901f178m59356f2244B26640g419B6381b16305
$$ 134414 107289 -52599 211124 -139901 -6178 -465534 -62244 226640 -7419 26381 -216305
9645b1750k6828n6679q1927B46145i6853B31650F6117a91767A68732L2827B1401
$$ -21750 -48578 -105257 -187184 246145 -96853 231650 66117 -191767 168732 201559 21401
9633G3495C4008M7136J2164a18664p3111Q5588j53777B7132f1665o0764L3000
$$ 73495 34008 81144 93308 -118664 -191775 -106187 -259964 27132 -61665 -122429 -89429
9622h9429c2099a925A50034c96445I672J03406b914B19052Q472o4665B0033i5215
$$ -89429 -32099 -1925 150034 -396445 9672 113078 -2914 219052 227524 162859 20033 -95215
9609D0431O4190h1632D6741M0993a3105D8825h9439o5486A43367c80413B14748
$$ 40431 104621 -81632 46741 87734 -13105 48825 -89439 -154925 143367 -380413 214748
9597C084J93905d169k57267E4888a55048c4269A33413e9520m5228A94218b4520
$$ 3084 196989 -4169 -261436 54888 -155048 -34269 133413 -59520 -104748 194218 -24520
9585i4075L2731j65807M9428P6068c7542m21543r039a46794H7019d2324A66402
$$ -94075 -61344 -227151 -177723 -101655 -37542 -459085 -468124 -146794 87019 -42324 166402
9573h1886F4623a30528B15506k2501a43817m6666K9337F0444a75986E8159J8000
$$ -81886 64623 -130528 215506 193005 -143817 -190483 -161146 60444 -175986 58159 76159
9562G6159a46728E87913A21858c7851G3091k3495k3180J07587j5893a95999E264
$$ 76159 -146728 587913 121858 -37851 73091 49596 26416 134003 118110 -195999 5264
9550a93667A38900b90946A49283a10331F1074b9671C24984a1425j54168O4878
$$ -193667 138900 -290946 149283 -110331 61074 -29671 324984 -11425 -165593 -100715
9540a00715D650a43350j70688H2552a35176k16987j635I4699i2595k35710p3510
$$ -100715 4650 -143350 -314038 82552 -135176 -352163 -353798 94699 -92595 -328305 -401815
9529d01815a23134A7053i07A00280i4861A93900c50425b7998a3248A4441Q804
$$ -401815 -123134 17053 -907 100280 -94861 193900 -350425 -27998 -13248 14441 23245
9518B3245i7011I1174e0299n044p7270r9774q2779B8763K01835b05967q4531k28590
$$ 23245 -97011 91174 -50299 -55343 -132613 -232387 -315166 28763 230598 -205967 -290498 -519088
9506e19088C5070c88037A03724C1501a11257B19284M1269A0095b97736D108J9994
$$ -519088 35070 -388037 103724 31501 -111257 219284 260553 10095 -297736 4108 24102
9495B4102g9448D8329K64227B0488a41661C1574P6816a3184B03433N1445F9229
$$ 24102 -79448 48329 312556 20488 -141661 31574 108390 -13184 203433 254878 69229
9483b26692K2019H2335h540l36220C5953a48670H5723c1068A08768k1901f8923
$$ -226692 -204673 82335 -8540 -344760 35953 -148670 85723 -31068 108768 86867 -68923
9471a71157O5709E36705C1706M4397Q2866g2619c1577A34969c0654p0323j35448
$$ -171157 -105448 536705 31706 76103 158969 -72619 -31577 134969 -30654 -100977 -236425
9460b36425E8799a1065I6470a02632C0698A3066c64864B288b96436e0120A59804
$$ -236425 58799 -11065 96470 -102632 30698 13066 -364864 2288 -296436 -50120 159804
9448B66009f9555o9886d1449j22244B44901F8447k9256d65567a3486p7402c2864
$$ 266009 -69555 -139441 -41449 -163693 244901 68447 39191 -465567 -13486 -90888 -32864
9436h0298j15227i749D7125j6955c07460D8066A1096a50602A84711C4547M929
$$ -80298 -195525 -9749 47125 30170 -307460 48066 11096 -150602 184711 34547 39476
9425C9476J6598i8166B4050b9696A54327a07509A0122J17065a22544K1087L1953
$$ 39476 56074 -98166 24050 -29696 154327 -107509 10122 127187 -122544 -101457 -69504
9414f9504k13369C6513c45067A61300a74315A9676b12070L4463h3429j01726D1078
$$ -69504 -282873 36513 -345067 161300 -174315 19676 -212070 -177607 -83429 -185155 41078
9402b13549c8351B07980b15034B89724A07095b8674k00557C80483c59437c6113
$$ -213549 -38351 207980 -215034 289724 107095 -28674 -229231 380483 -359437 -36113
9391A08480D9561a72780M4154b8261l04425c6832j97904O6255A84899a9080D8449
$$ 108480 49561 -172780 -128626 -28261 -332686 -36832 -234736 -168481 184899 -19080 48449
9379A53411c57310A16816a2318A67091O981h8900B9742a21007m5710H1118i7576
$$ 153411 -357310 116816 -12318 167091 174072 -88900 29742 -121007 -166717 81118 -97576
9367A71260D9834b66129e9102o0694j03101B8456a11929R967m7967L8272m90621
$$ 171260 49834 -266129 -59102 -119796 -222897 28456 -111929 -101962 -149929 -111657 -602278
9356f02278I3935a08092a9523q5018r626G5728b03868B63826c37138h3854j82872
$$ -602278 93935 -108092 -19523 -104541 -114167 75728 -203868 263826 -337138 -83854 -266726
9345b66726a06243j0131j5709b8811C02142A6954b43162c1181B10820b31735c7250
$$ -266726 -106243 -116374 -132083 -28811 302142 16954 -243162 -31181 210820 -231735 -37250
9333c09358A41141b74716m909r4076i5033k13306A55308i7437r0881A68117a55563
$$ -309358 141141 -274716 -279625 -373701 -95033 -308339 155308 -97437 -188318 168117 -155563
9321c6652B1178a1497C21581b97709J10377C8201h7620r2818b0732l0423l33523
$$ -36652 21178 -11497 321581 -297709 -187332 38201 -87620 -180438 -20732 -51155 -384678
9310c84678H1358d1975k20442A39132a9784j06633e5729q9725L394p7122i327
$$ -384678 81358 -41975 -262417 139132 -19784 -126417 -55729 -145454 -142060 -219182 -9327
9298D2083a93914C15619c2392A82621E561K63387f7809r1483B92934F2489d3709
$$ 42083 -193914 315619 -32392 182621 5561 268948 -67809 -159292 292934 62489 -43709
9286a48052C0644b36185M1652M7889N3495F5656a93160A29844a40676m1563j43350
$$ -148052 30644 -236185 -194533 -146644 -93149 65656 -193160 129844 -140676 -182239 -325589
9275c25589J14992C5713d11499f3232j11958J8837j18922P3313Q1902A9668J291
$$ -325589 -210597 35713 -411499 -63232 -175190 -156353 -275275 -201962 -120060 19668 20959
9264B0959b22484D3411a2372j58286C9880b72466Q8681J3945L0772B6164a36371
$$ 20959 -222484 43411 -12372 -170658 39880 -272466 -183785 -169840 -139068 26164 -136371
9252i2918l0966B28662d54563A1328d9204j21925H7152k2073b9494A13785J85892
$$ -92918 -123884 228662 -454563 11328 -49204 -171129 87152 65079 -29494 113785 299677
9241B99677a07244C4539J38886e21806b30340a13884A53534a74530A37985e8722
$$ 299677 -107244 34539 173425 -521806 -230340 -113884 153534 -174530 137985 -58722
9230c44401O2797J9900R4027M7662m5867b2255o1254M1012n5755c2807j00681
$$ -344401 -281604 -261704 -167677 -120015 -165882 -22255 -83509 -42497 -98252 -32807 -133488
9219a33488E417K59930a62181f2512A9112K93620c4690k2562q1467B17429f6440
$$ -133488 5417 265347 -162181 -62512 19112 312732 -34690 -57252 -138719 217429 -66440
9207H9863c32422A68137c9997j58688j36815A49177a96237b0531j47442O1838
$$ 89863 -332422 168137 -39997 -198685 -335500 149177 -196237 -20531 -167973 -106135
9197a06135j7175B30119A08395a75470R977A24614k6843a58750A30431b81442
$$ -106135 -123310 230119 108395 -175470 -165493 124614 97771 -158750 130431 -281442
9186A24629a86579H1567a88202c0974j49096K8946M5876k02461L7226A36873A5623
$$ 124629 -186579 81567 -188202 -30974 -180070 -151124 -105248 -307709 -270483 136873 15623
9174h8351q4831D7622a18275o0601q3041C4322b24358e7210n5649A3268a20025
$$ -88351 -173182 47622 -118275 -178876 -261917 34322 -224358 -57210 -112859 13268 -120025
9162a40911L1358I9847J26332c5799a0397k51661G5600J14856H1101J42030h5151
$$ -140911 -109553 99847 226179 -35799 -10397 -262058 75600 190456 81101 223131 -85151
9150A44840b99963A13846b99978C8165O0190c21241b6586r4082N0538A2833c63853
$$ 144840 -299963 113846 -299978 38165 98355 -321241 -26586 -120668 -70130 12833 -363853
9138d6993A89320b2947m9294k60783A02525a57493p8413B9761c44155J36270M2136
$$ -46993 189320 -22947 -72241 -333024 102525 -157493 -235906 29761 -344155 -207885 -165749
9127a65749l11437a01861j02935K1855d8414j67976N1296J1746d8820j60271F3771
$$ -165749 -477186 -101861 -204796 -182941 -48414 -216390 -165094 -153348 -48820 -209091 63771
9115D814b31215a2401r353H2554c97136J88627E1049K6938b8017o7109H6172O9373
$$ 4814 -231215 -12401 -21754 82554 -397136 -208509 51049 77987 -28017 -95126 86172 155545
9103A55545a27380j3959Q11j709l4629l3682d9216p7880N8772l0067m1193j37704
$$ 155545 -127380 -141339 -140528 -142237 -176866 -210548 -49216 -127096 -68324 -98391 -139584 -277288
9091b77288I7497a39092j1515C67569b59073i9112j59865i5766m113n159E1632
$$ -277288 97497 -139092 -150607 367569 -259073 -99112 -258977 -95766 -99879 -105038 51632
9079h6444l2439o7938A18976a09389j66600J27524k26615A2367c84824A9708M2960
$$ -86444 -118883 -186821 118976 -109389 -275989 -148465 -375080 12367 -384824 19708 62668
9068F2668b72931C8960b77978a34393A54596b01589R5387j1372a2984p2205H7834
$$ 62668 -272931 38960 -277978 -134393 154596 -201589 -106202 -117574 -12984 -85189 87834
9056b09384A8421g4017a3838k81495I794L20054a22660j06403a2800l53543J05862
$$ -209384 18421 -74017 -13838 -295333 9794 329848 -122660 -229063 -12800 -366343 -260481
9045b60481A15704a01476A08552K04703H4741b46295b2900j00324A02029a57275
$$ -260481 115704 -101476 108552 313255 84741 -246295 -22900 -123224 102029 -157275
9034f259C1547Q369H552J11821n9812K67917C9769J3018J27655d7796l12222J57399
$$ -6259 31547 39916 8552 120373 60561 328478 39769 52787 180442 -47796 -360018 -202619
9022b02619j59302A51861F0340j087c54537M3053m760J29882C5881i624A38831
$$ -202619 -361921 151861 60340 59253 -354537 -311484 -316244 -186362 35881 -9624 138831
9010G1348c25318a12918k13813B28631b997A11830a02860j95021A68165d13372
$$ 71348 -325318 -112918 -326731 228631 -2997 111830 -102860 -297881 168165 -413372
8999a9239E5229a89934K6865f6474k16442O0062a6737j10011m3936D8690c9872
$$ -19239 55229 -189934 -163069 -66474 -282916 -222854 -16737 -126748 -170684 48690 -39872
8987D0360K1348a52802B52488a8949j33968k22040J37007k9068J27352n0078I2113
$$ 40360 61708 -152802 252488 -18949 -152917 -374957 -237950 -267018 -139666 -189744 92113
8975a60807L7800J790j74278J1595i9102a7903A5962a49558A31264K45596e75188
$$ -160807 -123007 -121217 -295495 -283900 -99102 -17903 15962 -149558 131264 376860 -575188
8963I8761b3359j16754A39443Q2428c5951k12141O7515q5880J19993H8502J24634
$$ 98761 -23359 -140113 139443 221871 -35951 -248092 -180577 -266457 -146464 88502 213136
8952B13136a22319H970b3035H089b03935d736D57539A86620d2908j80318g5059
$$ 213136 -122319 8970 -23035 8089 -203935 -4736 457539 186620 -42908 -223226 -75059
8940a98773A65918k6894N6804d6962B85431j11678K14591f976B8739J69464J51551
$$ -198773 165918 139024 195828 -46962 285431 173753 388344 -6976 28739 198203 349754
8929C49754j13358J65066q8517N90799K44263Q74346J818721M453812k812462
$$ 349754 236396 401462 312945 903744 1148007 2022353 3841074 8294886 5482424
8920E482424B220508j009717l63338C80044P9887P376A39383c9340A73479o2525
$$ 5482424 2220508 1210791 847453 380044 459931 467307 139383 -39340 173479 110954
8910A10954C7198J77358c8892B67807a29184a1224j54840A81814h6206j6779C90693
$$ 110954 37198 214556 -38892 267807 -129184 -11224 -166064 181814 -86206 -102985 390693
8898A20925m298b78521f0495h931m23576A82259i372A24765a31743A06238b0544
$$ 120925 116627 -278521 -60495 -8931 -432507 182259 -9372 124765 -131743 106238 -20544
8886C57884a60145A19390B679h9959b5027k8719r3291A11436a48177a8219A81828
$$ 357884 -160145 119390 2679 -89959 -25027 -53746 -147037 111436 -148177 -18219 181828
8874e9927E6346j9054b10955q1070B26717l4684J37115a33261e0595j42482J5607
$$ -59927 56346 37292 -210955 -292025 226717 192033 329148 -133261 -50595 -193077 -177470
8863a77470F1637a47576A63536h1150j24747K4076A1204d18162i5938j30180A36183
$$ -177470 61637 -147576 163536 -81150 -205897 -181821 11204 -418162 -95938 -226118 136183
$$ [...]
##END NTUPLES=NMR SPECTRUM
##END=
