
##TITLE=AC1362_CENAH12180_6945819_1wShrkrYKA
##JCAMPDX= 6.0         $$ Bruker NMR JCAMP-DX V2.0
##DATA TYPE= NMR SPECTRUM
##DATA CLASS= NTUPLES
##ORIGIN= BRUKER
##OWNER= Administrator
$$ 1.72 TOPSPIN		Version 2.1
$$ 2012-10-18 13:47:58.007 -0700  Administrator@X
$$ Compression mode = diff/dup
##.OBSERVE FREQUENCY= 400.02188249412
##.OBSERVE NUCLEUS= ^1H
##.ACQUISITION MODE= SIMULTANEOUS (DQD)
##.ACQUISITION SCHEME= undefined
##.AVERAGES= 64
##.DIGITISER RES= 22
##SPECTROMETER/DATA SYSTEM= spect
##.PULSE SEQUENCE= noesygpps1d.comp
##.SOLVENT NAME= COFFEE_meoh
##.SHIFT REFERENCE= INTERNAL, COFFEE_meoh, 1, 14.96072
##AUDIT TRAIL= $$ (NUMBER, WHEN, WHO, WHERE, PROCESS, VERSION, WHAT)
$$ ##TITLE= Audit trail, TOPSPIN		Version 2.1
$$ ##JCAMPDX= 5.01
$$ ##ORIGIN= Bruker BioSpin GmbH
$$ ##OWNER= Administrator
$$ $$ C:\Bruker\TOPSPIN/data/COFFEE/nmr/AC1362_CENAH12180_6945819_1wShrkrYKA/12/pdata/1/auditp.txt
$$ ##AUDIT TRAIL=  $$ (NUMBER, WHEN, WHO, WHERE, PROCESS, VERSION, WHAT)
(   1,<2012-10-14 00:15:07.203 -0500>,<Administrator>,<TOPSPIN>,<go>,<TOPSPIN 2.1>,
      <created by zg
	started at 2012-10-14 00:03:36.984 -0500,
	POWCHK enabled, PULCHK disabled,
       configuration hash MD5:
       6B 1B 68 BB D9 2E 58 E2 7F 35 AD 54 07 DF 0E 41
       data hash MD5: 64K
       C2 27 76 6E 7F E3 90 29 36 BC 12 0B 5C 13 B6 33>)
(   2,<2012-10-14 00:15:09.906 -0500>,<Administrator>,<TOPSPIN>,<proc1d>,<TOPSPIN 2.1>,
      <Start of raw data processing
       efp LB = 0.3 FT_mod = 6 PKNL = 1 PHC0 = 0 PHC1 = 0 SI = 128K 
       data hash MD5: 128K
       13 7B 5E 10 72 8E 9F C1 61 A4 39 BE 46 A5 4C 4C>)
(   3,<2012-10-14 00:15:11.062 -0500>,<Administrator>,<TOPSPIN>,<proc1d>,<TOPSPIN 2.1>,
      <pk PHC0 = 4.454956 PHC1 = 0 
       data hash MD5: 128K
       03 16 20 0E 88 68 92 5E DA 88 F5 6E 5C 5F 5C 7C>)
(   4,<2012-10-14 00:15:11.296 -0500>,<Administrator>,<TOPSPIN>,<proc1d>,<TOPSPIN 2.1>,
      <abs ABSG = 1 
       data hash MD5: 128K
       37 EC EF BF 6D 3A 6A 85 CA 40 04 C5 88 DD C6 11>)
(   5,<2012-10-14 00:15:11.375 -0500>,<Administrator>,<TOPSPIN>,<proc1d>,<TOPSPIN 2.1>,
      <abs ABSG = 2 
       data hash MD5: 128K
       37 3E F2 57 FF 2D A8 B2 DB 0B 7A D5 26 56 A2 D9>)
(   6,<2012-10-14 00:15:11.421 -0500>,<Administrator>,<TOPSPIN>,<proc1d>,<TOPSPIN 2.1>,
      <abs ABSG = 3 
       data hash MD5: 128K
       78 42 27 8C AC 75 EA BA FB 30 CB 37 D3 A6 39 6F>)
(   7,<2012-10-14 00:15:11.640 -0500>,<Administrator>,<TOPSPIN>,<proc1d>,<TOPSPIN 2.1>,
      <abs ABSG = 4 
       data hash MD5: 128K
       2F A8 D8 1C EF C3 E7 AE E6 D5 31 08 C6 EA 5F 55>)
(   8,<2012-10-14 00:15:11.734 -0500>,<Administrator>,<TOPSPIN>,<proc1d>,<TOPSPIN 2.1>,
      <abs ABSG = 5 
       data hash MD5: 128K
       FB 37 D9 77 F4 0B 0F 7B 58 F9 59 CC E2 D2 14 3F>)
(   9,<2012-10-14 00:15:11.953 -0500>,<Administrator>,<TOPSPIN>,<audit>,<TOPSPIN 2.1>,
      <user comment:
       ICON-NMR User ID: COFFEE
       data hash MD5: 128K
$$ [...]
##$TP07= 0
##$TPNAME0= <>
##$TPNAME1= <>
##$TPNAME2= <>
##$TPNAME3= <>
##$TPNAME4= <>
##$TPNAME5= <>
##$TPNAME6= <>
##$TPNAME7= <>
##$TPOAL= (0..7)
0.5 0.5 0.5 0.5 0.5 0.5 0.5 0.5
##$TPOFFS= (0..7)
0 0 0 0 0 0 0 0
##$TUNHIN= 0
##$TUNHOUT= 0
##$TUNXOUT= 0
##$USERA1= <user>
##$USERA2= <user>
##$USERA3= <user>
##$USERA4= <user>
##$USERA5= <user>
##$V9= 5
##$VALIST= <valist>
##$VCLIST= <CCCCCCCCCCCCCCC>
##$VD= 0
##$VDLIST= <DDDDDDDDDDDDDDD>
##$VPLIST= <PPPPPPPPPPPPPPP>
##$VTLIST= <TTTTTTTTTTTTTTT>
##$WBST= 2048
##$WBSW= 25
##$XGAIN= (0..3)
0 0 0 0
##$XL= 0
##$YL= 0
##$YMAX_a= 12738014
##$YMIN_a= -9339793
##$ZGOPTNS= <>
##$ZL1= 120
##$ZL2= 120
##$ZL3= 120
##$ZL4= 120
##$ABSF1= 14.96072
##$ABSF2= -5.597462
##$ABSG= 5
##$ABSL= 3
##$ALPHA= 0
##$AQORDER= 0
##$ASSFAC= 0
##$ASSFACI= 0
##$ASSFACX= 0
##$ASSWID= 0
##$AUNMP= <proc_prof1d_extract.lims>
##$AXLEFT= 0
##$AXNAME= <>
##$AXNUC= <1H>
##$AXRIGHT= 0
##$AXTYPE= 0
##$AXUNIT= <>
##$AZFE= 0.1
##$AZFW= 0.1
##$BCFW= 0
##$BC_mod= 0
##$BYTORDP= 0
##$COROFFS= 0
##$CY= 15
##$DATMOD= 1
##$DC= 0
##$DFILT= <>
##$DTYPP= 0
##$F1P= 0
##$F2P= 0
##$FCOR= 0.5
##$FTSIZE= 131072
##$FT_mod= 6
##$GAMMA= 0
##$GB= 0
##$INTBC= 1
##$INTSCL= 1
##$ISEN= 128
##$LB= 0.3
##$LEV0= 0
##$LPBIN= 0
##$MAXI= 10000
##$MC2= 0
##$MEAN= 0
##$ME_mod= 0
##$MI= 0
##$NCOEF= 0
##$NC_proc= -2
##$NLEV= 6
##$NOISF1= 0
##$NOISF2= 0
##$NSP= 0
##$NTH_PI= 0
##$NZP= 0
##$OFFSET= 14.96072
##$PC= 1
##$PHC0= 4.454956
##$PHC1= 0
##$PH_mod= 1
##$PKNL= yes
##$PPARMOD= 0
##$PPDIAG= 0
##$PPIPTYP= 0
##$PPMPNUM= 2147483647
##$PPRESOL= 1
##$PSCAL= 4
##$PSIGN= 0
##$PYNMP= <proc.py>
##$REVERSE= no
##$SF= 400.020009749963
##$SI= 131072
##$SIGF1= 0
##$SIGF2= 0
##$SINO= 400
##$SIOLD= 131072
##$SPECTYP= <>
##$SREGLST= <1H.CDCl3>
##$SSB= 0
##$STSI= 131072
##$STSR= 0
##$SW_p= 8223.68421052631
##$SYMM= 0
##$S_DEV= 0
##$TDeff= 65536
##$TDoff= 0
##$TI= <>
##$TILT= no
##$TM1= 0
##$TM2= 0
##$TOPLEV= 0
##$USERP1= <user>
##$USERP2= <user>
##$USERP3= <user>
##$USERP4= <user>
##$USERP5= <user>
##$WDW= 1
##$XDIM= 131072
##$YMAX_p= 299743536
##$YMIN_p= -10158
##$CURPLOT= <Network HP LaserJet P1505>
##$CURPRIN= <$Network HP LaserJet P1505>
##$DFORMAT= <normdp>
##$LAYOUT= <+/1D_H.xwp>
##$LFORMAT= <normlp>
##$PFORMAT= <normpl>
##$SURQMSG= 1
$$ End of Bruker specific parameters
$$ ---------------------------------
##NTUPLES= NMR SPECTRUM
##VAR_NAME=  FREQUENCY,     SPECTRUM/REAL,   SPECTRUM/IMAG
##SYMBOL=    X,             R,               I
##VAR_TYPE=  INDEPENDENT,   DEPENDENT,       DEPENDENT
##VAR_FORM=  AFFN,          ASDF,            ASDF
##VAR_DIM=   131072,        131072,          131072
##UNITS=     HZ,            ARBITRARY UNITS, ARBITRARY UNITS
##FACTOR=    0.0627417313425164, 1,          1
##FIRST=     8223.62146879497, 1906,         -62285
##LAST=      0,             4038,            -62194
##MIN=       0,             -10158,          0
##MAX=       8223.62146879497, 299743536,    0
$$ Real data points
##PAGE= N=1
##DATA TABLE= (X++(R..R)), XYDATA
$$ [...]
64018D00754n164m689l906l132k875k989k870k436k218k463k848l114l305l310
$$ 400754 395590 390901 386995 383863 380988 377999 375129 372693 370475 368012 365164 362050 358745 355435
64004C55435k880k202j812j734j416p30l01n23q56n88L34J611L113M562N252M863
$$ 355435 352555 350353 348541 346807 345391 344661 344360 343837 342981 342393 342727 344338 347451 352013 357265 362128
63988C62128M178M254N115N981O576P376Q514R356R455R305R628J0407J1129J1679
$$ 362128 366306 370560 375675 381656 388232 395608 404122 413478 422933 432238 441866 452273 463402 475081
63974D75081J2410J3419J4319J4805J5063J5405J5892J6490J7335J8479J9636
$$ 475081 487491 500910 515229 530034 545097 560502 576394 592884 610219 628698 648334
63963F48334K0530K1382K2614K4114K5350K6340K7894L0560L3809L6809L9664
$$ 648334 668864 690246 712860 736974 762324 788664 816558 847118 880927 917736 957400
63952I57400M3212M7787N2973N8592O5206P3314Q2640R2581J02917J13602J24303
$$ 957400 1000612 1048399 1101372 1159964 1225170 1298484 1381124 1473705 1576622 1690224 1814527
63941A814527J34589J44269J53111J60511J65971J69595J71555J71183J67311
$$ 1814527 1949116 2093385 2246496 2407007 2572978 2742573 2914128 3085311 3252622
63932C252622J59468J48044J33321J15184R4065P1303M7947K3804j667k7935n3631
$$ 3252622 3412090 3560134 3693455 3808639 3902704 3974007 4021954 4045758 4044091 4016156 3962525
63921C962525p7859j00334j20375j36745j48810j57136j62549j65209j65039j62445
$$ 3962525 3884666 3784332 3663957 3527212 3378402 3221266 3058717 2893508 2728469 2566024
63911B566024j57962j51568j43075j32932j22069j11069j00083q9528q0092p1937
$$ 2566024 2408062 2256494 2113419 1980487 1858418 1747349 1647266 1557738 1477646 1405709
63901A405709o4429n7006m9866m3566l8355l4114l0675k7815k5332k3368k2372
$$ 1405709 1341280 1284274 1234408 1190842 1152487 1118373 1087698 1059883 1034551 1011183 988811
63890I88811k2386k2628k2251k1350k0759k0910k1275k0968j9568j7365j5073
$$ 988811 966425 943797 921546 900196 879437 858527 837252 816284 796716 779351 764278
63879G64278j3333j2153j0898r030o807m910l417j706N55K817M384N292O042O828
$$ 764278 750945 738792 727894 718864 712057 707147 703730 702024 702579 705396 709780 715072 721114 727942
63865G27942P455P942Q618R582J0471J0853J0624R934Q986P959O924N736M285
$$ 727942 735397 743339 751957 761539 772010 782863 793487 803421 812407 820366 827290 833026 837311
63852H37311K837J770Q95n29k832n358p333q957j1017j3524j5432j6085j6257
$$ 837311 840148 841918 842813 842284 839452 834094 826761 817804 806787 793263 777831 761746 745489
63839G45489j7264j9245k0967k1316k0544j9783j9673j9852j9756j9438j9285
$$ 745489 728225 708980 688013 666697 646153 626370 606697 586845 567089 547651 528366
63828E28366j9174j8438j6819j4954j3584j2642j1619j0601j0235j0580j0767
$$ 528366 509192 490754 473935 458981 445397 432755 421136 410535 400300 389720 378953
63817C78953j0050q666p365o528o123o021n859n094l743k768l046m197n061n084
$$ 378953 368903 360237 352872 346344 340221 334200 328341 323247 319504 316736 313690 309493 304432 299348
63803B99348m649m104l387k607k239k467k871k978k693k095j411j218k032l391
$$ 299348 294699 290595 287208 284601 282362 279895 277024 274046 271353 269258 267847 266629 264597 261206
63789B61206m091l612k773k562k931l173k958k436j825j427j620k183k124r03
$$ 261206 257115 253503 250730 248168 245237 242064 239106 236670 234845 233418 231798 229615 227491 226588
63775B26588N08O34n79j658j483m69L17M90L98L25J22m19j190j781j864j508j088
$$ 226588 227096 227730 227151 225493 224010 223541 223858 224348 224746 225071 225193 224774 223584 221803 219939 218431 217343
63758B17343q09n47j93L5n4k32j18K45M50K40k75q21j078p78m6M83L60l7O7P93
$$ 217343 216534 215987 215794 215829 215775 215543 215425 215670 216120 216360 216085 215264 214186 213408 213362 213845 214205 214168 214235 215028
63738B15028J487J679J591J620J702J517J012N22M78R89J623J691J073N74J079
$$ 215028 216515 218194 219785 221405 223107 224624 225636 226158 226636 227625 229248 230939 232012 232586 233665
63723B33665K387L411L508L114K930L003K934K572K149J922J861J636Q15n85j833
$$ 233665 236052 239463 242971 246085 249015 252018 254952 257524 259673 261595 263456 265092 265907 265322 263489
63708B63489k113j486q06n76m69j65K7j90m13j40L18K86j60k74J93O29N55L22
$$ 263489 261376 259890 259084 258508 258039 257874 257901 257711 257298 257158 257476 257762 257602 257328 257521 258150 258705 259027
63690B59027M67R32J287J408J465J454J229R14Q72J189J593J938K333K622K220
$$ 259027 259494 260426 261713 263121 264586 266040 267269 268183 269055 270244 271837 273775 276108 278730 280950
63675B80950Q96n46r68k83M36L28k73n10o7P35J548K113K112J393L04o85j510
$$ 280950 281846 281300 280332 280049 280485 280813 280540 280030 279963 280698 282246 284359 286471 287864 288168 287483 285973
63658B85973k279k686k314j451r39j124j487j486j190q98o49m20l03k22J07O72
$$ 285973 283694 281008 278694 277243 276304 275180 273693 272207 271017 270119 269470 269050 268747 268525 268632 269304
63642B69304J026R77R21J167J390J260J125J505K244K769K985L254L617L766L734
$$ 269304 270330 271307 272228 273395 274785 276045 277170 278675 280919 283688 286673 289927 293544 297310 301044
63627C01044L947M524N124N597O195O916P250O975O710P190Q321R440J0263J1092
$$ 301044 304991 309515 314639 320236 326431 333347 340597 347572 354282 361472 369793 379233 389496 400588
63613D00588J2144J3227J4143J5041J6191J7660J9340K1064K2532K3365K3425
$$ 400588 412732 425959 440102 455143 471334 488994 508334 529398 551930 575295 598720
63602E98720K2988K2371K1430J9682J6890J3304R361N356J605j389l147l696l652
$$ 598720 621708 644079 665509 685191 702081 715385 724746 730102 731707 730318 727171 723475 719823
63589G19823l839m772o381q179r737j1099j2616j4354j5866j6651j6691j6348
$$ 719823 715984 711212 704831 696652 686915 675816 663200 648846 632980 616329 599638 583290
63577E83290j5895j5356j4631j3580j2095j0293q520o944n383l803k637k141j686
$$ 583290 567395 552039 537408 523828 511733 501440 492920 485976 480593 476790 474153 472012 470326
63564D70326l47J791L600M311M409M754N456O013O283O692P587Q749R690J0266
$$ 470326 469979 471770 475370 479681 484090 488844 494300 500313 506596 513288 520875 529624 539314 549580
63550E49580J0879J2057J3822J5654J7181J8626K0333K2088K3445K4446K5284
$$ 549580 560459 572516 586338 601992 619173 637799 658132 680220 703665 728111 753395
63539G53395K5291K3119J8331J2185O439J904j544m122n867o880p318p360p403
$$ 753395 778686 801805 820136 832321 838760 840664 839120 834998 829131 822251 814933 807573 800170
63526H00170p964r131j0582j2362j4975j8351k1372k3050k3612k3791k3710k3194
$$ 800170 792206 783075 772493 760131 745156 726805 705433 682383 658771 634980 611270 588076
63514E88076k2611k2389k2078k0857j8780j6618j4675j2731j0973r895r296q428
$$ 588076 565465 543076 520998 500141 481361 464743 450068 437337 426364 416469 407173 398745
63502C98745p293o684o716o391n102l624l013l196l306k887k188j599j285j162
$$ 398745 391452 384768 378052 371661 366559 362935 359922 356726 353420 350533 348345 346746 345461 344299
63488C44299r43m43J30M64O90J055J222O98OL61J866L077K917K001J423J175O98
$$ 344299 343356 342913 343043 343507 344197 345252 346474 347172 347178 347539 349405 352482 355399 357400 358823 359998 360696
63471C60696J78J36L10J33j36J12M89q3j674l140l658l511l148k501j574q34m90
$$ 360696 360874 361010 361320 361453 361317 361429 361918 361835 360161 357021 353363 349852 346704 344203 342629 341795 341305
63454C41305n9Q07J689K030J986K119K593L181L793M537N312N781N734N338N033
$$ 341305 341246 342053 343742 345772 347758 349877 352470 355651 359444 363981 369293 375074 380808 386146 391179
63439C91179N343O583Q521J0416J1565J1955J2253J3188J4891J6868J8528J9626
$$ 391179 396522 403105 411626 422042 433607 445562 457815 471003 485894 502762 521290 540916
63427E40916K0064J9480J7489J4465J1616R947R497R836J0867J2588J4544J6259
$$ 540916 560980 580460 597949 612414 624030 633977 643474 653310 664177 676765 691309 707568
63415G07568J7974K0238K2821K4896K6131K6744K6450K4447K0710J6304J2004
$$ 707568 725542 745780 768601 793497 819628 846372 872822 897269 917979 934283 946287
63404I46287P495K536k010n192p206q767r850j0133j0209j1205j3286j5632j7799
$$ 946287 953782 956318 954308 949116 941910 933143 923293 913160 902951 891746 878460 862828 845029
63391H45029k0097k2478k4132k4574k4308k3980k3535k2669k1452k0018j8117
$$ 845029 824932 802454 778322 753748 729440 705460 681925 659256 637804 617786 599669
63380E99669j5583j2903j0761r238p885o418m940l543k123n77J062K688M175N453
$$ 599669 584086 571183 560422 551184 543299 536881 531941 528398 526275 525698 526760 529448 533623 539076
63366E39076O628P899R265J0507J1540J2547J3654J4807J6111J7877K0067K2013
$$ 539076 545704 553603 562868 573375 584915 597462 611116 625923 642034 659911 679978 701991
63354G01991K3198K3971K5032K6370K7210K6896K5312K2533J8640J4010R292M884
$$ 701991 725189 749160 774192 800562 827772 854668 879980 902513 921153 935163 944455 949339
63342I49339P63l042o151q230r362r931j0346j1004j2159j3710j5386j7233j9544
$$ 949339 950102 947060 940909 932679 923317 913386 903040 892036 879877 866167 850781 833548 814004
63329H14004k2192k4429k5615k5786k5212k3819k1541j8945j6929j5818j5091
$$ 814004 791812 767383 741768 715982 690770 666951 645410 626465 609536 593718 578627
63318E78627j3958j1890q900n735l764m003o134q784j0786j1774j1770j0934r913
$$ 578627 564669 552779 543879 538144 534380 530377 524243 515459 504673 492899 481129 470195 460282
63305D60282r606j0064j0219r232p644o466n690m558l117k348k634l072k805k174
$$ 460282 450676 440612 430393 421161 413517 407051 401361 396803 393686 391338 388704 385632 382827 380653
63291C80653j855j630r23j01j54j145j976j937j624j871k512k818k630k305j834
$$ 380653 378798 377168 376245 376144 375990 374845 372869 370932 369308 367437 364925 362107 359477 357172 355338
63276C55338q93K24N27m39j776k102j018O22J759K097K042K049K226K461K684
$$ 355338 354445 354669 355196 354757 352981 350879 349861 350483 352242 354339 356381 358430 360656 363117 365801
63261C65801K879L006L000K929K984L300L820M393M934N422N873O280O607O791
$$ 365801 368680 371686 374686 377615 380599 383899 387719 392112 397046 402468 408341 414621 421228 428019
63247D28019O880P185P995R167J0258J1135J2128J3396J4557J5339J6123J7395
$$ 428019 434899 442084 450079 459246 469504 480639 492767 506163 520720 536059 552182 569577
63235E69577J8955K0296K1546K3253K5291K6758K7138K6881K6582K6281K5850
$$ 569577 588532 608828 630374 653627 678918 705676 732814 759695 786277 812558 838408
63224H38408K5411K4923K4017K2774K2106K2679K3897K4643K4641K4349K3772
$$ 838408 863819 888742 912759 935533 957639 980318 1004215 1028858 1053499 1077848 1101620
63213A101620K2324J9837J6809J3519R612M807n65o020j1387j6561k1256k5288
$$ 1101620 1123944 1143781 1160590 1174109 1183721 1188528 1187963 1181943 1170556 1153995 1132739 1107451
63201A107451k8708l1440l3117l3574l3147l2215l0719k8403k5270k1596j7767
$$ 1107451 1078743 1047303 1014186 980612 947465 915250 884531 856128 830858 809262 791495
63190G91495j4310j1649r614p422m649j833K02J406K421L673N093O591Q191R560
$$ 791495 777185 765536 755922 748500 743851 742018 742220 743626 746047 749720 754813 761404 769595 779155
63176G79155J0063R591Q885Q693Q860Q696Q011P314O944O567N703M401K943J133
$$ 779155 789218 798809 807694 816387 825247 833943 841954 849268 856212 862779 868482 872883 875826 876959
63162H76959j580n171q742j1400j3174j4770j6580j8376j9818k0862k1563k1823
$$ 876959 875379 870208 861466 850066 836892 822122 805542 787166 767348 746486 724923 703100
63150G03100k1495k0588j9216j7560j5893j4511j3480j2581j1523j0187q618p015
$$ 703100 681605 661017 641801 624241 608348 593837 580357 567776 556253 546066 537448 530433
63138E30433n729n064m980n051m808l990k596r23M04Q17L61k86n06k54K22Q61
$$ 530433 524704 519640 514660 509609 504801 500811 498215 497292 497696 498513 498874 498588 498082 497828 498050 498911
63122D98911J753K825L811M515M885M929M746M584M645M832M846M559M193M015
$$ 498911 500664 503489 507300 511815 516700 521629 526375 530959 535604 540436 545282 549841 554034 558049
63108E58049L923L494K570J683J605K389L205L336L019K939L177L242L004K923
$$ 558049 561972 565466 568036 569719 571324 573713 576918 580254 583273 586212 589389 592631 595635 598558
63094E98558L211L424L143K547K044J784J887K605L843M863N049M666M504M904
$$ 598558 601769 605193 608336 610883 612927 614711 616598 619203 623046 627909 632958 637624 642128 647032
63080F47032N618O368P072P664Q090Q502R118R984J1107J2535J4052J5097J5411
$$ 647032 652650 659018 666090 673754 681844 690346 699464 709448 720555 733090 747142 762239 777650
63067G77650J5518J6089J7073J7984J8815K0056K1896K4018K6189K8452L0755
$$ 777650 793168 809257 826330 844314 863129 883185 905081 929099 955288 983740 1014495
63056A014495L2958L5183L7662M0240M2641M5215M8644N2768N6462N8954O0537
$$ 1014495 1047453 1082636 1120298 1160538 1203179 1248394 1297038 1349806 1406268 1465222 1525759
63045A525759O1698O2287O2108O1637O1403O1143O0279N8977N7978N7530N7181
$$ 1525759 1587457 1649744 1711852 1773489 1834892 1896035 1956314 2015291 2073269 2130799 2187980
63034B187980N6582N5837N4884N3106M9878M5101L8975L1490K2469J2025O73j1080
$$ 2187980 2244562 2300399 2355283 2408389 2458267 2503368 2542343 2573833 2596302 2608327 2609000 2597920
63022B597920k3065l5241m7088n7503o5464p0780p3988p5625p5863p4765p2498
$$ 2597920 2574855 2539614 2492526 2435023 2369559 2298779 2224791 2149166 2073303 1998538 1926040
63011A926040o9106o4488n8713n2133m5032l7579l0242k3796j8564j3983r306
$$ 1926040 1856934 1792446 1733733 1681600 1636568 1598989 1568747 1544951 1526387 1512404 1503098
63000A503098m456R1L974P058R181J0387J1209J2175J3110J3394J2921J2257J1866
$$ 1503098 1498642 1498733 1502707 1509765 1518946 1529333 1540542 1552717 1565827 1579221 1592142 1604399 1616265
62987A616265J1662J1333J0640R308P112M178Q44k884p269j2196j7138k1903k6811
$$ 1616265 1627927 1639260 1649900 1659208 1666320 1670498 1671342 1668458 1661189 1648993 1631855 1609952 1583141
62974A583141l1797l5989l8667m0170m1275m2060m2041m1222m0215l9284l7999
$$ 1583141 1551344 1515355 1476688 1436518 1395243 1353183 1311142 1269920 1229705 1190421 1152422
62963A152422l5940l3259l0362k7534k5068k3248k1883k0373j8540j7072j6646
$$ 1152422 1116482 1083223 1052861 1025327 1000259 977011 955128 934755 916215 899143 882497
62952H82497j6948j6973j6227j5109j4225j3800j3756j3931j4041j3748j2972
$$ 882497 865549 848576 832349 817240 803015 789215 775459 761528 747487 733739 720767
62941G20767j1959j1006j0280r892r814r732r264q416p543o869o398o228o459
$$ 720767 708808 697802 687522 677630 667816 658084 648820 640404 632861 625992 619594 613366 606907
62928F06907o692o272n334m845n166n283m231k629j802j863j812j387j428k165
$$ 606907 600215 593943 588609 583764 578598 573315 569084 566455 564653 562790 560978 559591 558163 555998
62914E55998k542j887j174j657l040l977l912l413l038k864k975l485l938l569
$$ 555998 553456 551569 550395 548738 545698 541721 537809 534396 531358 528494 525519 522034 518096 514527
62900E14527k427j528j624k358k931l055k937k669k191j621j323j479j828j818
$$ 514527 512100 510572 508948 506590 503659 500604 497667 494998 492807 491186 489863 488384 486556 484738
62886D84738j153k50J15k60o09j82O65R15L89L0N05J253J362Q40L84K53M8m92
$$ 484738 483585 483335 483450 483190 482581 482399 483064 483979 484368 484398 484903 486156 487518 488358 488742 488995 489043 488551
62868D88551j081j376j438j548j826k145k285k064j439n88J65N60N17J61k15k86
$$ 488551 487470 486094 484656 483108 481282 479137 476852 474788 473349 472761 472926 473486 474003 474164 473949 473663
62852D73663O9O68J183J385J227Q38M88M25O61R77J149J063O16j75r48j128n29
$$ 473663 473732 474400 475583 476968 478195 479033 479521 479946 480607 481584 482733 483796 484412 484237 483289 482161 481632
62835D81632M04J105J446J582J534J243Q82P55R61J390J941K497K848K910L002
$$ 481632 482036 483141 484587 486169 487703 488946 489828 490583 491544 492934 494875 497372 500220 503130 506132
62820E06132L470M206M813N243N758O347O677O723O939P551Q185Q510Q810R394
$$ 506132 509602 513808 518621 523864 529622 535969 542646 549369 556308 563859 572044 580554 589364 598758
62806E98758R881R678R103R280J0716J2540J3493J3419J3314J4064J5524J6929
$$ 598758 608639 618317 627420 636700 647416 659956 673449 686868 700182 714246 729770 746699
62794G46699J7876J8607J9479K0601K2015K3947K6573K9636L2657L5517L8622
$$ 746699 764575 783182 802661 823262 845277 869224 895797 925433 958090 993607 1032229
62783A032229M2399M6869N1749N6831O2113O7676P3481P9163Q4045Q7641R0133
$$ 1032229 1074628 1121497 1173246 1230077 1292190 1359866 1433347 1512510 1596555 1684196 1774329
62772A774329R2052R3303R2927Q9960Q4269P6254O6078N3636L9117K3167O624
$$ 1774329 1866381 1959684 2052611 2142571 2226840 2303094 2369172 2422808 2461925 2485092 2491716
62761B491716r643k4863l8777n1710o3699p3749q0728q4924q7800r0031r0676
$$ 2491716 2482073 2457210 2418433 2366723 2303024 2229275 2148547 2063623 1975823 1885792 1795116
62750A795116q8835q5315q1786p8764p5329p0697o5222n9786n4852n0411m6356
$$ 1795116 1706281 1620966 1539180 1460416 1385087 1314390 1249168 1189382 1134530 1084119 1037763
62739A037763m2623l9121l5708l2188k8460k4847k2008k0229j8910j7248j5178
$$ 1037763 995140 956019 920311 888123 859663 834816 812808 792579 773669 756421 741243
62728G41243j3202j1473r735q161p324p107o438m666k608j565j697k040j858j281
$$ 741243 728041 716568 706833 698672 691348 684241 677803 673137 670529 668964 667267 665227 663369 662088
62714F62088n56N95K606N294P818R422J0169J0857J2136J3847J5558J7487K0235
$$ 662088 661532 662127 664733 670027 677845 687267 697436 708293 720429 734276 749834 767321 787556
62701G87556K3552K6272K7968K9855L3175L7230M0154M1363M2099M3459M5066
$$ 787556 811108 837380 865348 895203 928378 965608 1005762 1047125 1089224 1132683 1177749
62690A177749M6007M6029M5071M2495L7688L1070K3735J6223Q319r9q661j6929
$$ 1177749 1223756 1269785 1314856 1357351 1395039 1426109 1449844 1466067 1474386 1474287 1465626 1448697
62678A448697k4690l1672l7425m1710m4751m6926m8330m8786m8228m6931m5338
$$ 1448697 1424007 1392335 1354910 1313200 1268449 1221523 1173193 1124407 1076179 1029248 983910
62667I83910m3624m1581l8999l6048l3099l0269k7483k4984k3219k2155k1071
$$ 983910 940286 898705 859706 823658 790559 760290 732807 707823 684604 662449 641378
62656F41378j9388j7274j5180j3152j1046r113p838p326p317p621q083q242p554
$$ 641378 621990 604716 589536 576384 565338 556225 548387 541061 533744 526123 518040 509798 502244
62643E02244o077m556l699l651m111m583m514l615k219j035m47k40ON12J280K084
$$ 502244 496167 491611 487912 484261 480150 475567 471053 467438 465219 464184 463737 463497 463503 464015 465295 467379
62627D67379K454K033J100M16M26Q94J324J529J663J969K560L195L406L142L167
$$ 467379 469833 471866 472966 473382 473808 474702 476026 477555 479218 481187 483747 486942 490348 493490 496657
62612D96657M239N879O729O341N960P005R328J1555J2783J3337J4016J5259J7014
$$ 496657 500896 506775 513504 519845 525805 532810 542138 553693 566476 579813 593829 609088 626102
62599F26102J8955K0761K2469K4564K7452L0888L4239L7154L9702M1951M3786
$$ 626102 645057 665818 688287 712851 740303 771191 805430 842584 882286 924237 968023
62588I68023M5051M5568M4995M3011L9645L5143K9567K2786J4904O407k121j0287
$$ 968023 1013074 1058642 1103637 1146648 1186293 1221436 1251003 1273789 1288693 1295100 1292979 1282692
62576A282692j7883k4800l0914l5944l9545m1734m2958m3522m3167m1663l9502
$$ 1282692 1264809 1240009 1209095 1173151 1133606 1091872 1048914 1005392 962225 920562 881060
62565H81060l7483l5688l3498l0678k7856k5720k4159k2517k0422j8099j6042
$$ 881060 843577 807889 774391 743713 715857 690137 665978 643461 623039 604940 588898
62554E88898j4496j3154j1427r154o992n779n667o124o583o618n738l777j559
$$ 588898 574402 561248 549821 540667 533675 527896 522229 516105 509522 502904 497166 493389 491830
62541D91830l48m31q86r92j091j594j998j605o88j09l8J24P00J399K025K847M042
$$ 491830 491482 491051 490165 489173 488082 486488 484490 482885 482197 482088 482050 482174 482874 484273 486298 489145 493187
62524D93187N265O033O269O336O744P845R657J1885J4213J6411J8220J9441K0389
$$ 493187 498452 504485 510754 517090 523834 531679 541336 553221 567434 583845 602065 621506 641895
62511F41895K1852K4195K6751K8530K9302K9442K9013K7624K5187K2129J8740
$$ 641895 663747 687942 714693 743223 772525 801967 830980 858604 883791 905920 924660
62500I24660J4852J0356N617J145k801o151q895j1153j3082j4530j5128j4779
$$ 924660 939512 949868 955485 956630 953829 947678 938783 927630 914548 900018 884890 870111
62488H70111j3797j2391j0413p778m857k171J42K329M634P040R347J1391J3224
$$ 870111 856314 843923 833510 825732 820875 818704 818846 821175 825809 832849 842196 853587 866811
62475H66811J5049J6865J8258J8646J7729J5555J2301Q291M046J3l768p504j1275
$$ 866811 881860 898725 916983 935629 953358 968913 981214 989505 993551 993564 989796 982292 971017
62462I71017j5044j8798k2298k4980k6560k7503k8271k8440k7334k5399k3903
$$ 971017 955973 937175 914877 889897 863337 835834 807563 779123 751789 726390 702487
62451G02487k3142k1970j9552j6627j4380j2863j1225r012o501m155k365j403
$$ 702487 679345 657375 637823 621196 606816 593953 582728 573716 567215 563060 560695 559292
62439E59292j058o10L30J412K287L206M208M478L426J873J076Q31k73k669n126
$$ 559292 558234 557624 557954 559366 561653 564859 569067 573545 576971 578844 579920 580751 580478 577809 572683
62424E72683o491p075p801q830r619r845r638r193q613p992p360o700o121n772
$$ 572683 566192 559117 551316 542486 532867 523022 513384 504191 495578 487586 480226 473526 467405 461633
62410D61633n513n012m246l581l239l041k772k458k122j713j354j293j433j291
$$ 461633 456120 451108 446862 443281 440042 437001 434229 431771 429649 427936 426582 425289 423856 422565
62396D22565o42K12R94J839K781L298K881J821J048J182J958K595K533J979J720
$$ 422565 421923 422135 423129 424968 427749 431047 433928 435749 436797 437979 439937 442532 445065 447044 448764
62381D48764K300L417M320M737N000N297N442N495O046P411R004R919R888R304
$$ 448764 451064 454481 458801 463538 468538 473835 479277 484772 490818 498229 507233 517152 527040 536344
62367E36344Q713Q654R640J1646J3889J5561J6705J7896J9304K0713K2312K4770
$$ 536344 545057 553711 563351 574997 588886 604447 621152 639048 658352 679065 701377 726147
62355G26147K8335L2334L5853L8552M0594M2066M2693M2017L9672L5627L0228
$$ 726147 754482 786816 822669 861221 901815 943881 986574 1028591 1068263 1103890 1134118
62344A134118K3946J7201J0436M233j051n627r994j4288j8256k1825k5221k8408
$$ 1134118 1158064 1175265 1185701 1189934 1188883 1183256 1173262 1158974 1140718 1118893 1093672 1065264
62332A065264l0776l1733l1320k9975k8009k5614k3190k1142j9364j7343j4952
$$ 1065264 1034488 1002755 971435 941460 913451 887837 864647 843505 824141 806798 791846
62321G91846j2804j1606j1378j1554j1743j2064j2791j3917j5173j6189j6614
$$ 791846 779042 767436 756058 744504 732761 720697 707906 693989 678816 662627 646013
62310F46013j6232j5192j3996j3050j2356j1711j1025j0206q988p249n422m188
$$ 646013 629781 614589 600593 587543 575187 563476 552451 542245 533257 526008 520586 516398
62298E16398l749l656l407k847k008r26J52P72P23L08N8K87R54J723K174K255
$$ 516398 512649 508993 505586 502739 500731 499805 499957 500729 501452 501760 501818 502105 503059 504782 506956 509211
62282E09211K478L262M131M198L543L328M198N308N533N019M720M967N353N794
$$ 509211 511689 514951 519082 523280 526823 530151 534349 539657 545190 550209 554929 559896 565249 571043
62268E71043O652P831Q680R006R401J0337J1621J2988J4608J6651J8898K1216
$$ 571043 577695 585526 594206 603212 612613 622950 634571 647559 662167 678818 697716 718932
62256G18932K3901K7140L0454L3210L5386L7464L9691M1739M2956M2699M0610
$$ 718932 742833 769973 800427 833637 869023 906487 946178 987917 1030873 1073572 1114182
62245A114182L6839L1844K5886J9077J1981N656N54m169r716j6181k2607k8280
$$ 1114182 1151021 1182865 1208751 1227828 1239809 1245465 1246019 1241850 1232134 1215953 1193346 1165066
62233A165066l3265l7642m0942m2622m2674m1478l9439l7123l5182l3705l1797
$$ 1165066 1131801 1094159 1053217 1010595 967921 926443 887004 849881 814699 780994 749197
62222G49197k8446k3788j9191j5974j4305j3364j2252j0627q791p339o571o038
$$ 749197 720751 696963 677772 661798 647493 634129 621877 611250 602459 595120 588549 582511
62210E82511m914k968r81M6k7m53m80Q5J065K227L244L715L452K669J858J555
$$ 582511 577597 574629 573648 573694 573667 573214 572734 572819 573884 576111 579355 583070 586522 589191 591049 592604
62194E92604K127L363M334M173L158K539L040M020M457M249M023M046M093M211
$$ 592604 594731 598094 602428 606601 609759 612298 615338 619358 623815 628064 632087 636133 640226 644437
62180F44437M786N776O501O462N857N163M614M376M673N451O222O714P436R181
$$ 644437 649223 654999 661500 667962 673819 678982 683596 687972 692645 698096 704318 711032 718468 727649
62166G27649J2026J5155J7731J9682K1573K3897K6602K9203L1136L1911L1136
$$ 727649 739675 754830 772561 792243 813816 837713 864315 893518 924654 956565 987701
62155I87701K8636K4665J9822J4660R499M656N19k814n790q980j2522j6146j9524
$$ 987701 1016337 1041002 1060824 1075484 1084983 1089639 1090158 1087344 1081554 1072574 1060052 1043906 1024382
62142A024382k2292k3993k4474k4129k3454k2388k0579j8074j5284j2415r485
$$ 1024382 1002090 978097 953623 929494 906040 883652 863073 844999 829715 817300 807815
62131H07815o843n015l974l077j941q08kL97L38j43m46K17J667K755K896K908
$$ 807815 800972 795957 791983 788906 786965 786157 786155 786552 786890 786747 786301 786518 788185 790940 793836 796744
62115G96744L694M743M754L280J023j199k953l855l636k667j781j471j671k302
$$ 796744 800438 805181 809935 813215 814238 813039 810086 806231 802595 799928 798147 796676 795005 792703
62101G92703l445m930o188o758o584n811m628l368k373j571n51Q30K128K811K912
$$ 792703 789258 784328 778140 771382 764798 758987 754359 750991 748618 747047 746496 747326 749454 752265 755177
62086G55177L015L616M546N088M772M088M112N270O738P417P237P123P775Q993
$$ 755177 758192 761808 766354 771442 776214 780302 784414 789684 796422 803839 811076 818199 825974 834967
62072H34967J0221J1257J2214J3108J3759J4028J4043J4210J4969J6422J8182
$$ 834967 845188 856445 868659 881767 895526 909554 923597 937807 952776 969198 987380
62061I87380J9706K0740K1329K1528K1248K0389J8931J6841J4010J0282N681O30
$$ 987380 1007086 1027826 1049155 1070683 1091931 1112320 1131251 1148092 1162102 1172384 1178065 1178695
62049A178695m096p942j1071j4101j7343k0651k3962k7367l0522l2565l3102l2785
$$ 1178695 1174599 1166657 1155586 1141485 1124142 1103491 1079529 1052162 1021640 989075 955973 923188
62037I23188l2457l2085l1068k9255k7073k4923k2966k1346k0111j9032j7928
$$ 923188 890731 858646 827578 798323 771250 746327 723361 702015 681904 662872 644944
62026F44944j6854j5626j3659j0980q846q416r090r224q329p404p082o748n944
$$ 644944 628090 612464 598805 587825 578979 570563 561473 552249 543920 536516 529434 522686 516742
62013E16742n393n832o671o763n955n074m610m179l227j758l03M76L30l17p71
$$ 516742 511349 505517 498846 492083 486128 481054 476444 472265 469038 467280 466977 467453 467783 467466 466695
61998D66695q56r64j184q96L76K028K882K485J563J061J055P83l27j798k577k381
$$ 466695 465839 464875 463691 462795 463171 465199 468081 470566 472129 473190 474245 475028 474701 472903 470326 467945
61982D67945k107k591l416l666l363l284l471l152k293j973k697l441l159k320
$$ 467945 465838 463247 459831 456165 452802 449518 446047 442895 440602 438629 435932 432491 429332 427012
61968D27012k042k361k511k356k447k779k662j869j087r67j323j510j164m40J67
$$ 427012 424970 422609 420098 417742 415295 412516 409854 407985 406898 405931 404608 403098 401934 401494 401661
61953D01661K36j10k29K75J050J520J653J747J818J703J569J748K238K899L954
$$ 401661 401897 401787 401558 401833 402883 404403 406056 407803 409621 411324 412893 414641 416879 419778 423732
61938D23732N606P332Q225Q118P742P746Q061Q289Q195P762P158O716O516O103
$$ 423732 429338 436670 444895 453013 460755 468501 476562 484851 493046 500808 507966 514682 521198 527301
61924E27301M998L385J844O24l23q67j008j407k703m338n052m600l990l762l167
$$ 527301 532299 535684 537528 538152 537829 536962 535954 534547 531844 527506 522454 517854 513864 510102 506935
61909E06935j542N47K220L501M770N723N818N380N260N571N564M764L493K288
$$ 506935 505393 505940 508160 511661 516431 522154 527972 533352 538612 544183 549747 554511 558004 560292
61895E60292J317M73m37j616l051m276m739m396l708l134k923l222l948m660m896
$$ 560292 561609 562082 561645 560029 556978 552702 547963 543567 539859 536725 533802 530580 526632 521972 517076
61880E17076m668m290l867l334k995l398m562n730o200o013n645n260m669l854
$$ 517076 512408 508118 504251 500917 497922 494524 489962 484232 478032 472019 466374 461114 456445 452591
61866D52591l121k655k188j340j87P84J277J541J969K582L236M162N779P917R713
$$ 452591 449470 446815 444627 443287 443100 443884 445161 446702 448671 451253 454489 458651 464430 472347 482060
61851D82060J0536J0716J1016J1719J2556J3305J3958J4421J4519J4260J3817
$$ 482060 492596 503312 514328 526047 538603 551908 565866 580287 594806 609066 622883
61840F22883J3159J2019J0251P956N309K550J06j616k659l441m229m904n301n418
$$ 622883 636042 648061 658312 666268 671577 674127 674233 672617 669958 666517 662288 657384 652083 646665
61826F46665n211m491l174j470L40K020L218L579L211K774K748K734J818m47l571
$$ 646665 641454 636963 633789 632319 632659 634679 637897 641476 644687 647461 650209 652943 654761 654314 650743
61811F50743o589q799j0194j1279j2412j3313j3395j2652j1820j1455j1246j0589
$$ 650743 644154 635355 625161 613882 601470 588157 574762 562110 550290 538835 527589 517000
61799E17000r483q373p378o378n694n826o407o303n098l765l305l372k949j944
$$ 517000 507517 499144 491766 485388 479694 473868 467461 461158 456060 452295 448990 445618 442669 440725
61785D40725j163r89j015j024j389k133k426j621l31J68n47j638j977j209J51
$$ 440725 439562 438573 437558 436534 435145 433012 430586 428965 428634 428802 428255 426617 424640 423431 423582
61770D23582J268J594J164M49j29m56n73m23P9Q13J496J845J724J216P23P75J542
$$ 423582 424850 426444 427608 428057 427928 427472 426899 426476 426555 427368 428864 430709 432433 433649 434372 435147 436689
61753D36689K617L395L520K961J886P21J0o5K4k92r70j483j553j388j232j064
$$ 436689 439306 442701 446221 449182 451068 451789 451799 451734 451758 451466 450496 449013 447460 446072 444840 443776
61737D43776q49p64r13j067r16n35l67p29j395j797j596j016n31l09j38J99O82
$$ 443776 442927 442163 441250 440183 439267 438732 438365 437636 436241 434444 432848 431832 431301 430992 430854 431053 431735
61720D31735J207J727K070J906J132J44m61m07J57Q66J329J323R51N75L51J28
$$ 431735 432942 434669 436739 438645 439777 439921 439460 439053 439210 440076 441405 442728 443679 444254 444605 444733
61704D44733k32o35j068j724k586l221l326l099k841k492k041j900k362k974l083
$$ 444733 444501 443866 442798 441074 438488 435267 431941 428842 426001 423509 421468 419568 417206 414232 411149
61689D11149k725k360k044j585j260j537k128k222j746j500j801j910j171k9N91
$$ 411149 408424 406064 404020 402435 401175 399638 397510 395288 393542 392042 390241 388331 387160 387131 387722
61674C87722L59m00j251j796j720j125n43l84n90r77j393j503j003k95k99j162
$$ 387722 388081 387681 386430 384634 382914 381789 381246 380862 380272 379295 377902 376399 375396 375101 374802 373640
61658C73640j863j578q34o24r51r75l19N08R53J025J119J597K450L098K766J407
$$ 373640 371777 370199 369365 368741 367790 366815 366496 367004 367957 368982 370101 371698 374148 377246 380012 381419
61642C81419Qm36N4P65J266J492J238L03r16j631j500r26n00n33r68j423j418
$$ 381419 381427 380991 381045 381810 383076 384568 385806 386109 385193 383562 382062 381136 380636 380103 379135 377712 376294
61625C76294r50o64j063j770k027j768j603j783j839j374p45o65j317k119k304
$$ 376294 375344 374680 373617 371847 369820 368052 366449 364666 362827 361453 360708 360043 358726 356607 354303
61610C54303j765j290j688k774l563l595l386l425l413l079k939l414l841l367
$$ 354303 352538 351248 349560 346786 343223 339628 336242 332817 329404 326325 323386 319972 316131 312764
61596C12764k441k196k662k765k162j743k091k565k403j784j230p85l73l41r49
$$ 312764 310323 308127 305465 302700 300538 298795 296704 294139 291736 289952 288722 287937 287564 287223 286274
61581B86274j846k511k794k667j991r66l24m98j002j141r12p10n94l71j23n7q7
$$ 286274 284428 281917 279123 276456 274465 273499 273175 272677 271675 270534 269622 268912 268318 267947 267824 267767 267680
61564B67680k5K5p8r8K01N42N07K77L79Q34J031N52l04q76p66o5P93J417J823
$$ 267680 267655 267680 267602 267504 267705 268247 268754 269031 269410 270244 271275 271827 271523 270647 269881 269816 270609 272026 273849
61545B73849K290K748K695J894Q60J87j91o25r54p43j29K60J36k87q86j660k147
$$ 273849 276139 278887 281582 283476 284336 284523 284332 283707 282753 282010 281881 282141 282277 281990 281104 279444 277297
61528B77297j645l47N30J57q61j375j082m92K6M06M18j88j047j405j087o72n37
$$ 277297 275652 275305 275835 275992 275131 273756 272674 272182 272208 272614 273032 272844 271797 270392 269305 268633 268096
61511B68096l64J30N58M14j63o38p82o94l65K72R44J238J173J090J037P62L02
$$ 268096 267732 267862 268420 268834 268671 268033 267251 266557 266192 266464 267408 268646 269819 270909 271946 272708 273010
61494B73010J3k6j52m64o16m00PO09J644K765K894J556k05j000p46l70l06j76
$$ 273010 273023 272997 272845 272381 271765 271365 271372 271981 273625 276390 279284 280840 280635 279635 278889 278519 278213 278037
61476B78037K46O95J087J626K149K169J681J207R82P62N88Q01J178R63J54k23
$$ 278037 278283 278978 280065 281691 283840 286009 287690 288897 289879 290641 291229 292030 293208 294171 294325 294102
61460B94102L71J059Q82K28K5J91k4n31m97J70N43J57k10K66J165J363N17n11
$$ 294102 294473 295532 296414 296642 296667 296858 296834 296303 295806 295976 296519 296676 296466 296732 297897 299260 299777 299266
61442B99266o74J99J335J774J212K06l97j66O05J251J305Q04K11qK77Q70J528
$$ 299266 298592 298791 300126 301900 303112 303318 302921 302755 303360 304611 305916 306720 306931 306923 307200 308070 309598
61425C09598K003J950J177J03l49L43J634K439K244J538J098J124J135O65n0l31
$$ 309598 311601 313551 314728 314831 314482 314825 316459 318898 321142 322680 323778 324902 326037 326702 326652 326321
61409C26321R4P26J034J185J581K000J797R42J26k52m79p40o75j70J74o1l48J3
$$ 326321 326415 327141 328175 329360 330941 332941 334738 335680 335806 335554 335075 334335 333660 333490 333664 333603 333255 333268
61391C33268P73J147R21M78qo13j073r55m02QJ95O81J615K340K200J371N76L04
$$ 333268 334041 335188 336109 336587 336579 335966 334893 333938 333536 333544 333739 334420 336035 338375 340575 341946 342522 342826
61373C42826N02Q38J045J111J201J322J254R24N95M57L21R5J31N95Q49K67n47
$$ 342826 343328 344166 345211 346322 347523 348845 350099 351023 351618 352075 352396 352491 352622 353217 354066 354333 353786
61356C53786l32J068K447K962L111L545L866L397K533K345L101M061M577M687
$$ 353786 353454 354522 356969 359931 363042 366587 370453 373850 376383 378728 381829 385890 390467 395154
61342C95154M515L871K763J739J328J406J460J295J142J198J404J660J956K159
$$ 395154 399669 403540 406303 408042 409370 410776 412236 413531 414673 415871 417275 418935 420891 423050
61328D23050K031J689J729K494L358L297K200J076P83J063J190J069J162J659
$$ 423050 425081 426770 428499 430993 434351 437648 439848 440924 441707 442770 443960 445029 446191 447850
61314D47850K418L467M867O119O489O106O083P236R143J0788J1672J1975J1998
$$ 447850 450268 453735 458602 464721 471210 477316 483399 490635 499778 510566 522238 534213 546211
61301E46211J1917J1772J1345J0200Q273O181M650L655K520P35j560l848n652
$$ 546211 558128 569900 581245 591445 599718 605899 610549 614204 616724 617459 615899 612051 606399
61288F06399o732p152p294p564q061q608r024r141q739p753o588n858n614n215
$$ 606399 599667 592515 585221 577657 569596 560988 551964 542823 534084 526331 519743 513885 508271 503056
61274E03056m179k953k395k639k818k082n71Q08J369J228R64R89J257J482J524
$$ 503056 498877 495924 493529 490890 488072 485990 485419 486227 487596 488824 489788 490777 492034 493516 495040
61259D95040J595K060L012M077M735M760M316L723L242K978K795K424J769J122
$$ 495040 496635 498695 501707 505784 510519 515279 519595 523318 526560 529538 532333 534757 536526 537648
61245E37648Q60J048J430J693J638J281R97J326K263L038K996K485K272K317J993
$$ 537648 538508 539556 540986 542679 544317 545598 546595 547921 550184 553222 556218 558703 560975 563292 565285
61230E65285J390J445K451L447L641L596M257N473O348O622O828P276P730P974
$$ 565285 566675 568120 570571 574018 577659 581255 585512 590985 597333 603955 610783 618059 625789 633763
61216F33763P975P563O689N892N832O301O352N564M495L778L366K962K590K421
$$ 633763 641738 649301 655990 661882 667714 674015 680367 685931 690426 694204 697570 700532 703122 705543
61202G05543K406K424K516K763L108L497L991M583N122N530N883O164O150N687
$$ 705543 707949 710373 712889 715652 718760 722257 726248 730831 735953 741483 747366 753530 759680 765367
61188G65367M934M201L575K819J703L67p73j619k651m214n752o336o026n903o564
$$ 765367 770301 774502 778077 780896 782599 782966 782193 780574 777923 773709 767957 761621 755595 749692 743128
61173G43128p283p288o997p217p733p688p048o664o941p397p523p233o481n276
$$ 743128 735845 728557 721560 714343 706610 698922 691874 685210 678269 670872 663349 656116 649635 644359
61159F44359m241m270n374o544o948o647o003n134m233l705l616l459k769j609
$$ 644359 640118 635848 630474 623930 616982 610335 604332 599198 594965 591260 587644 584185 581416 579807
61145E79807k21J167K061J772K02j818l246l664l336k825k580k529k084r60J90
$$ 579807 579586 580753 582814 584586 584788 582970 579724 576060 572724 569899 567319 564790 562706 561746 561936
61130E61936N29K77L98J151J919K459L306M574N504N686N901P061R018J1045J2745
$$ 561936 562465 562742 563140 564291 566210 568669 571975 576549 582053 587739 593640 600701 609719 620764 633509
61115F33509J3930J4292J3982J3956J4922J6282J6902J6649J6383J6623J6936
$$ 633509 647439 661731 675713 689669 704591 720873 737775 754424 770807 787430 804366
61104H04366J6616J5471J3821J2162J0927J0204R607Q551O726M247J496j195l734
$$ 804366 820982 836453 850274 862436 873363 883567 893174 901725 908451 912698 914194 912999 909265
61091I09265o166q368j0053j1191j2079j2734j2722j2041j1616j2158j2964j2842
$$ 909265 903099 894731 884678 873487 861408 848674 835952 823911 812295 800137 787173 774331
61079G74331j1811j0825j0157r271q214p660p439o588n115m251m327l983k236
$$ 774331 762520 751695 741538 732267 724053 716393 708954 702366 697251 693000 688673 684690 682454
61066F82454o1J156J600K410L926N707P483R175J0479J1328J2279J3792J5607
$$ 682454 682393 683549 685149 687559 691485 697192 704675 713850 724329 735657 747936 761728 777335
61053G77335J7369J9100K0700K1777K2533K3884K6157K8632L0838L3149L5583
$$ 777335 794704 813804 834504 856281 878814 902698 928855 957487 988325 1021474 1057057
61042A057057L7342L8381L9979M2850M6050M8780N1655N4971N7356N7808N7783
$$ 1057057 1094399 1132780 1172759 1215609 1261659 1310439 1362094 1417065 1474421 1532229 1590012
61031A590012N9401O2708O6352O9840P3388P6548P8935Q1308Q4196Q6505Q7443
$$ 1590012 1649413 1712121 1778473 1848313 1921701 1998249 2077184 2158492 2242688 2329193 2416636
61020B416636Q8597R2049R7558J03809J11184J20667J31213J41243J51870J65687
$$ 2416636 2505233 2597282 2694840 2798649 2909833 3030500 3161713 3302956 3454826 3620513
61010C620513J83166K03615K28768K61815L03604L53934M15802M93516N86751
$$ 3620513 3803679 4007294 4236062 4497877 4801481 5155415 5571217 6064733 6651484
61001F651484O91635Q06991R32497J061363J185938J312060J448469J563962J567764
$$ 6651484 7343119 8150110 9082607 10143970 11329908 12641968 14090437 15654399 17222163
60992A7222163J367577R66844M92734J09019r9660j53461j08095K461J40557K15290
$$ 17222163 18589740 19556584 20049318 20158337 20058677 19905216 19797121 19799582 19940139 20155429
60982B0155429J09268k22124o90917j132842j423479j539358j526684j439931
$$ 20155429 20264697 20042573 19351656 18218814 16795335 15255977 13729293 12289362
60974A2289362j315116j176150j040252r14398p97311o88312n90213n04526m29710
$$ 12289362 10974246 9798096 8757844 7843446 7046135 6357823 5767610 5263084 4833374
60965D833374l65046l11863k69961k36347k08476j85891j67971j52752j38842
$$ 4833374 4468328 4156465 3886504 3650157 3441681 3255790 3087819 2935067 2796225
60956B796225j26313j15134j04648r4934q6737p9706p2678o5918o0978n8039n5448
$$ 2796225 2669912 2554778 2450130 2355196 2268459 2188753 2116075 2050157 1989179 1931140 1875692
60945A875692n2367m9765m8138m6296m3322l9972l7164l4645l2056k9850k8247
$$ 1875692 1823325 1773560 1725422 1679126 1635804 1595832 1558668 1524023 1491967 1462117 1433870
60934A433870k6590k4654k3362k3246k3347k2511k0890j9267j7833j6383j4952
$$ 1433870 1407280 1382626 1359264 1336018 1312671 1290160 1269270 1250003 1232170 1215787 1200835
60923A200835j3588j2160j0932j0437j0412r790q250o777o100n617m460k727j016
$$ 1200835 1187247 1175087 1164155 1153718 1143306 1133516 1125266 1118489 1112389 1106772 1102312 1099585 1098569
60910A098569M11J304J226L19n27q97j396k382l161l230l316m312n897p206q086
$$ 1098569 1098980 1100284 1101510 1101829 1101302 1100405 1099009 1096627 1093466 1090236 1086920 1082608 1076711 1069505 1061419
60895A061419q837r384r716j0446j1892j3165j3294j2747j2808j3719j4585j4868
$$ 1061419 1052582 1043198 1033482 1023036 1011144 997979 984685 971938 959130 945411 930826 915958
60883I15958j4890j4932j4824j4500j4118j3582j2702j1851j1717j2320j2904
$$ 915958 901068 886136 871312 856812 842694 829112 816410 804559 792842 780522 767618
60872G67618j2887j2361j1635j0871j0209r726r186q332p446p069p150p027o346
$$ 767618 754731 742370 730735 719864 709655 699929 690743 682411 674965 667896 660746 653719 647373
60859F47373n485m973m911n146n536n896o056o182o621p259p390o470m804l236
$$ 647373 641888 636915 632004 626858 621322 615426 609370 603188 596567 589308 581918 575448 570644 567408
60845E67408k452k657l716n194o467p010o765o113n582n558o105o852p196o802
$$ 567408 564956 562299 558583 553389 546922 539912 533147 527034 521452 515894 509789 502937 495741 488939
60831D88939n946n194m815m602m297l897l453k831j942j064n76m18j61K98N01
$$ 488939 482993 477799 472984 468382 464085 460188 456735 453904 451962 450898 450322 449904 449743 450041 450542
60816D50542Q2p00j311j529j474j346j411j880k420k185r27K85J54j164k246k214
$$ 450542 450624 449924 448613 447084 445610 444264 442853 440973 438553 436368 435441 435726 435880 434716 432470 430256
60800D30256j562j079q49o81p89j411k224k678k681k508k324k177k260k664l086
$$ 430256 428694 427615 426766 426085 425296 423885 421661 418983 416302 413794 411470 409293 407033 404369 401283
60785D01283l103k724k365k326k578k917l171l258l198l012k570j771r03n33q41
$$ 401283 398180 395456 393091 390765 388187 385270 382099 378841 375643 372631 370061 368290 367387 366854 366013
60770C66013j338j499j410j447j562j347p34k63m14r47j080l65P78J471J290O38
$$ 366013 364675 363176 361766 360319 358757 357410 356676 356413 355999 355052 353972 353607 354385 355856 357146 357784
60754C57784J45k7r3r7J52O53J162J627K266L074L618L497K759J720O34l15r76
$$ 357784 357929 357902 357809 357712 357864 358517 359679 361306 363572 366646 370264 373761 376520 378240 378874 378559 377583
60737C77583j448k047k890l646l839l367k615k176k428l223l990m294m232m072
$$ 377583 376135 374088 371198 367552 363713 360346 357731 355555 353127 349904 345914 341620 337388 333316
60723C33316l757l122k478k324k562k540k013j467j325j346j092n08J39N21L03
$$ 333316 329559 326437 323959 321635 319073 316533 314520 313053 311728 310382 309290 308782 308921 309442 309745
60708C09745n41j379j451r54q88j585k143j748p56J03Q36J688K133J471R4p48
$$ 309745 309204 307825 306374 305420 304532 302947 300804 299056 298300 298403 299239 300927 303060 304531 304625 303877
60692C03877m71L50R13R62O58L38M79J270K212K641K607K623K722K474J938J778
$$ 303877 303406 303756 304669 305631 306289 306627 307106 308376 310588 313229 315836 318459 321181 323655 325593 327371
60676C27371K230K782L100L565M360M818M321L394L107L549L673K662R32m59q94
$$ 327371 329601 332383 335483 339048 343408 348226 352547 355941 359048 362597 366270 368932 369864 369405 368511
60661C68511n22J73O79N36m60j957l142l341k540j319l47N2pj45o8J29O6l48o51
$$ 368511 367989 368162 368841 369377 368917 366960 363818 360477 357937 356618 356271 356323 356316 356171 356103 356232 356298 355950 355299
60642C55299l75K58N27J04o54j320j896k496l012l319l490l527l182k374j482
$$ 355299 354924 355182 355709 355813 355159 353839 351943 349447 346435 343116 339626 336099 332917 330543 329061
60627C29061r26o58m19k21k20l10k49l3K34O61J365K057K260J942J479J038M10
$$ 329061 328135 327477 327058 326837 326617 326307 326058 326025 326259 326920 328285 330342 332602 334544 336023 337061 337471
60610C37471m45j142j370j288j212j146q49k32N07J074J289J159Q58O11N47O32
$$ 337471 337026 335884 334514 333226 332014 330868 330019 329787 330294 331368 332657 333816 334674 335285 335832 336464
60594C36464P61Q83J058J342J648J757J590J320J084P04%o86o71J80J114J271
$$ 336464 337225 338108 339166 340508 342156 343913 345503 346823 347907 348611 348611 347925 347254 347434 348548 349819
60578C49819O47J4J15J114K571L770M220M136M286N109O180O805O989P403Q371
$$ 349819 350466 350480 350595 351709 354280 358050 362270 366406 370692 375801 381981 388786 395775 403178 411549
60563D11549R325R485Q800P921P268O434M797K458K50j245k259l212l990m268
$$ 411549 420874 430359 439159 447080 454348 460782 465579 468037 468287 467042 464783 461571 457581 453313
60549D53313m078l530k332l17J792L071L723M825O694Q475R554J0285J1001J1432
$$ 453313 449235 445705 443373 443056 444848 447919 451642 456467 463161 471636 481190 491475 502476 513908
60535E13908J1641J2407J3815J4469J3192J0726Q621P030M868J754j448l912n487
$$ 513908 525549 537956 551771 566240 579432 590158 598779 605809 610677 612431 610983 607071 601584
60522F01584o143n842n090m717m886n024m698l891k608j021J10J54k39K79J895
$$ 601584 595441 589599 584509 579792 574906 569882 565184 561293 558685 557664 557774 557928 557689 557968 559863
60507E59863L343L686L482L863N297P627J0476J3229J5293J6875J8893K1762K4813
$$ 559863 563206 566892 570374 574237 579534 587161 597637 610866 626159 643034 661927 683689 708502
60494G08502K7201K8793K9791L0211L0057K9478K8305K5975K2271J7649J2495
$$ 708502 735703 764496 794287 824498 854555 884033 912338 938313 960584 978233 990728
60483I90728O739M70n795j1837j7978k4021k8828l1689l3416l5104l6389l6021
$$ 990728 997467 997937 992142 980305 962327 938306 909478 877789 844373 809269 772880 736859
60471G36859l3835l1019k8494k6098k3539k1142j9223j7507j5601j3640j2012
$$ 736859 703024 672005 643511 617413 593874 572732 553509 536002 520401 506761 494749
60460D94749j0827r964r319q752p991o979o064n531n093m323l445l210l832m537
$$ 494749 483922 473958 464639 455887 447896 440917 434853 429322 424229 419906 416461 413251 409419 404882
60446D04882m500l818l122k546j824j269j688k977l664k582m26J080J194M81m53
$$ 404882 400382 396564 393442 390896 389072 387803 386115 383138 379474 376892 376466 377546 378740 379221 378768
60431C78768j531k483k718k170j501j145q12l19j30n84j204j353j085q77q20o71
$$ 378768 377237 374754 372036 369866 368365 367220 366408 366089 365959 365375 364171 362818 361733 360856 360036 359365
60415C59365l75q8J65M43P35J041J377J509J076K60j34K74Q08O54P9M9Q25J614
$$ 359365 358990 358902 359067 359510 360245 361286 362663 364172 365248 365508 365374 365648 366456 367110 367189 367238 368063 369677
60397C69677J674J175P99Q76J177J397J537J793K128K173J711J096R13J283J836
$$ 369677 371351 372526 373325 374201 375378 376775 378312 380105 382233 384406 386117 387213 388126 389409 391245
60382C91245K289K659K860K671K174J779J620J468J376J753K545L024K851K627
$$ 391245 393534 396193 399053 401724 403898 405677 407297 408765 410141 411894 414439 417463 420314 422941
60368D22941K872L016K205O60n79r74q30m63J48R17J535J930K298K663K811K754
$$ 422941 425813 428829 431034 431694 431115 430141 429311 428848 428996 429913 431448 433378 435676 438339 441150 443904
60352D43904K739K769K575K157J988K480L506M537N083M960M322L423K335R87
$$ 443904 446643 449412 451987 454144 456132 458612 462118 466655 471738 476698 481020 484443 486778 487765
60338D87765m64j565k123k437k826l102k938k407j836j387j183j476k280l063
$$ 487765 487301 485736 483613 481176 478350 475248 472310 469903 468067 466680 465497 464021 461741 458678
60324D58678l383l528l945m325l987l061k452k562k761k314j252p6R06J654K222
$$ 458678 455295 451767 447822 443497 439510 436449 433997 431435 428674 426360 425108 425032 425938 427592 429814
60309D29814K734L321L956M652N733P491R501J0912J1485J1801J2123J1690R679
$$ 429814 432548 435869 439825 444477 450210 457701 467202 478114 489599 501400 513523 525213 534892
60296E34892O454L247P12j669m689q334j1680j3701j3987j2911j1268r755q613
$$ 534892 541346 544593 545305 543636 538947 530613 518933 505232 491245 478334 467066 457311 448698
60283D48698p592o233m347k321q85m95r75j753k308k358j901j247q44q80j135
$$ 448698 441106 434873 430526 428205 427320 426825 425850 424097 421789 419431 417530 416283 415439 414559 413424
60268D13424j372j649k100k580k745k406j671q70m58p07j382j917k035j886j533
$$ 413424 412052 410403 408303 405723 402978 400572 398901 398031 397573 396866 395484 393567 391532 389646 388113
60253C88113q10N6L48j35n46q7P44Q30N1o54o97m34k41J53J011J858J899R69j60
$$ 388113 387303 387359 387707 387572 387026 386939 387683 388513 388564 387910 387213 386779 386538 386691 387702 389560 391459 392428 392268
60234C92268l61Q13K491L102K077N97K20R51J455R73J16k47o2K94P00J151J553
$$ 392268 391907 392720 395211 398313 400390 400987 401207 402158 403613 404586 404702 404455 404393 404687 405387 406538 408091
60217D08091J944K482K949K851K342K322L224M264M480M050L870M205M469M254
$$ 408091 410035 412517 415466 418317 420659 422981 426205 430469 434949 438999 442869 447074 451543 455797
60203D55797L886L835M034M044L756L619M100M931N212M451L230K501K370K222
$$ 455797 459683 463518 467552 471596 475352 478971 483071 488002 493214 497665 500895 503396 505766 507988
60189E07988J873J807K130K150J393M01o5j13l98j132j984k673l130l262l097
$$ 507988 509861 511668 513798 515948 517341 517742 517677 517564 517166 516034 514050 511377 508247 504985 501888
60174E01888k929k920k750k165j536j336j368j196j078j632k597k865k036j082
$$ 501888 498959 496039 493289 491124 489588 488252 486884 485688 484610 482978 480381 477516 475480 474398
60160D74398r95j486j679j520j667k184k283j529n53j47j81M1O84J212J297J252
$$ 474398 473403 471917 470238 468718 467051 464867 462584 461055 460502 460355 460174 460215 460899 462111 463408 464660
60144D64660J428J667J622J341J173J258J442J565J595J594J714K105K683L163
$$ 464660 466088 467755 469377 470718 471891 473149 474591 476156 477751 479345 481059 483164 485847 489010
60130D89010L497L976M600M730L869K530J710J622J599J222Q37Q21R90J018R14
$$ 489010 492507 496483 501083 505813 509682 512212 513922 515544 517143 518365 519202 520023 521013 522031 522945
60115E22945P89O55P53J564L081M425M691L966L159K928L087K968K121P31n40
$$ 522945 523734 524389 525142 526706 529787 534212 538903 542869 546028 548956 552043 555011 557132 557863 557323
60100E57323j212j480j898k604l251l616l830l890l473k516j493q53n66m97p65
$$ 557323 556111 554631 552733 550129 546878 543262 539432 535542 532069 529553 528060 527207 526641 526144 525379
60085E25379j366j854j869j635j514j369r19m14l88q50j278j374j341j345j250
$$ 525379 524013 522159 520290 518655 517141 515772 514853 514439 514051 513201 511923 510549 509208 507863 506613
60070E06613j057j233k305m149n910o672o245n267m484m074l816l727m052m609
$$ 506613 505556 504323 502018 497869 491959 485287 479042 473775 469291 465217 461401 457674 453622 449013
60056D49013m738m128l277k763k478j922j027j99K18K15k3j94L2P20J497J909
$$ 449013 444275 440147 436870 434107 431629 429707 428680 428481 428699 428914 428891 428697 428729 429449 430946 432855
60040D32855J808J332P99O98J414K625L319K817J551N23K17L89O50Q47R19Q00
$$ 432855 434663 435995 436794 437492 438906 441531 444850 447667 449218 449741 449958 450347 450997 451844 452763 453563
60024D53563L93l90j476k436k825k821l063l640l866l395k843k802k839k290j516
$$ 453563 453956 453566 452090 449654 446829 444008 440945 437305 433439 430044 427201 424399 421560 419270 417754
60009D17754j426k011k433k442k727l651m480m291l091j666o98l01j94r1Po9k96
$$ 417754 416328 414317 411884 409442 406715 403064 398584 394293 391202 389536 388838 388537 388343 388252 388259 388190 387894
59992C87894l92l19l65n36k95O16J592J975K015K261K504K232J770J868K335K231
$$ 387894 387502 387183 386818 386282 385987 386603 388195 390170 392185 394446 396950 399182 400952 402820 405155 407386
59976D07386J479J079J491J915J609Q88K92k90j053j638j767j816k058j974j065
$$ 407386 408865 409944 411435 413350 414959 415847 416139 415849 414796 413158 411391 409575 407517 405543 404478
59961D04478K16J058J418J751K053J932J399Q87O03M75N43P81P79K67k06R2Q76
$$ 404478 404694 405752 407170 408921 410974 412906 414305 415192 415795 416270 416813 417594 418373 418640 418434 418526 419402
59944D19402J073M02j26M18J653K511K558K176J729J176M71j55m79n10k78L31
$$ 419402 420475 420877 420751 421169 422822 425333 427891 430067 431796 432972 433443 433288 432809 432299 432021 432352
59928D32352J281K129K446K413K619L168L486L273L142L764M683M772L771K640
$$ 432352 433633 435762 438208 440621 443240 446408 449894 453167 456309 460073 464756 469528 473299 475939
59914D75939K263K525K987L621M365M597L834K591J791J473Q82k21j109j202r17
$$ 475939 478202 480727 483714 487335 491700 496297 500131 502722 504513 505986 506868 506647 505538 504336 503419
59899E03419r95j446j659j360r07o35m01J6L98L48j5n3N52J365J849K135K724
$$ 503419 502424 500978 499319 497959 497052 496417 496016 496032 496430 496778 496763 496710 497262 498627 500476 502611 505335
59882E05335L599M221M399M483M631M485L964L667L971M200L487K081J024O48
$$ 505335 508934 513155 517554 522037 526668 531153 535117 538784 542755 546955 550442 552523 553547 554195
59868E54195K64n28j211j352j444k078k832k858k282k147k920l793l773k853j720
$$ 554195 554459 553931 552720 551368 549924 547846 545014 542156 539874 537727 534807 531014 527241 524388 522668
59853E22668p93k9O36J223J904K818L738M386M901N484N622M446K069j19r63p82
$$ 522668 521875 521846 522482 523705 525609 528427 532165 536551 541452 546936 552558 557004 559073 558954 557991 557209
59837E57209o37p76n82J91Q86O26r02l323n751p121o928n786m817m453m199l603
$$ 557209 556572 555796 555214 555405 556291 556917 556015 552692 546941 539820 532892 527106 522289 517836 513637 510034
59821E10034k875k456k452k718l041l108k632j804j185r71p24j17M72M32l04j352
$$ 510034 507159 504703 502251 499533 496492 493384 490752 488948 487763 486792 486068 485951 486423 486855 486551 485199
59805D85199k410l354l957l967l458k796k198j589q88l01j78n72j036r49k17N34
$$ 485199 482789 479435 475478 471511 468053 465257 463059 461470 460582 460281 460103 459531 458495 457546 457329 457863
59789D57863O77L55K31N88J042J151R00M39j85q49j265j249r57o47m51l43j56
$$ 457863 458540 458895 459126 459714 460756 461907 462807 463246 463061 462212 460947 459698 458741 458094 457643 457300 457144
59772D57144L51J128J636J460R75Q97J211J251Q64P13J190J838K144K186K091
$$ 457144 457495 458623 460259 461719 462694 463591 464802 466053 466917 467630 468820 470658 472802 474988 477079
59757D77079J654J013R52J821K808L054K908L209L878M176M045M130M609M993
$$ 477079 478733 479746 480698 482519 485327 488381 491289 494498 498376 502552 506597 510727 515336 520329
59743E20329N083N204N389N142M287L341K808K637K505K200J660J044Q10J131
$$ 520329 525412 530616 536005 541147 545434 548775 551583 554220 556725 558925 560585 561629 562439 563570
59729E63570J376Q00k73p55l53qm72j303j707j635j435j016j44P63Q95N5j073
$$ 563570 564946 565746 565473 564718 564365 564357 563885 562582 560875 559240 557805 556789 556645 557408 558303 558358 557285
59712E57285j694j568j005n25n00q21r76o41r4K28L86Q21J644K424K758K703K503
$$ 557285 555591 554023 553018 552493 551993 551172 550196 549555 549461 549689 550075 550896 552540 554964 557722 560425 562928
59695E62928K207J810J573J818K414K793K620K200K002K001J814J306P21J96l76
$$ 562928 565135 566945 568518 570336 572750 575543 578163 580363 582365 584366 586180 587486 588207 588403 588027
59680E88027r92j481j909k573l371l657l115k343k175k702l430l983m181l724
$$ 588027 587035 585554 583645 581072 577701 574044 570929 568586 566411 563709 560279 556296 552115 548391
59666E48391k532j288r68j726k707l031k581j838j304j114q79n2J242K004J523
$$ 548391 545859 544571 543603 541877 539170 536139 533558 531720 530416 529302 528423 528371 529613 531617 533140
59651E33140M31j2M84J172J609K056K428J967M75r98j446j274j618k709l754m207
$$ 533140 533571 533559 534043 535215 536824 538880 541308 543275 543750 542752 541306 540032 538414 535705 531951 527744
59635E27744m384m718n024m846m175l491l118k862k450k114k337k997l275k699
$$ 527744 523360 518642 513618 508772 504597 501106 497988 495126 492676 490562 488225 485228 481953 479254
59621D79254j801j255r01l32j0p69k316l361l386l211l502l759l382k733k416
$$ 479254 477453 476198 475297 474965 474955 474186 471870 468509 465123 461912 458410 454651 451269 448536 446120
59606D46120k255j784j124o42k41K20L46j75q03q38n06n02p76p31l42j62k85k15
$$ 446120 443865 442081 440957 440315 440074 440294 440640 440465 439662 438824 438318 437816 437040 436309 435967 435805 435520 435305
59588D35305J53L98M52P27J178J119K79o53r97r24r46j122j184j101j061j150
$$ 435305 435458 435856 436308 437035 438213 439332 439611 438958 437961 437037 436091 434969 433785 432684 431623 430473
59572D30473j404j866k351k447j983j293p50l44J14N33O48L49k18p96j137j116
$$ 430473 429069 427203 424852 422405 420422 419129 418379 418035 418149 418682 419330 419679 419461 418665 417528 416412
59556D16412q51n71l82l07l94m54J05J609L350M124L726L225L478M092M249L986
$$ 416412 415561 414990 414608 414301 413907 413453 413558 415167 418517 422641 426367 429592 433070 437162 441411 445397
59540D45397L995M584N548O682P873Q915R836J1055J2447J2570R812M435j370
$$ 445397 449392 453976 459524 466206 474079 482994 492830 503885 516332 528902 538714 543149 541779
59527E41779n558p670q166p454o086m934m342l603k122n68k2k83p0J132K328K400
$$ 541779 536221 528551 520385 512931 506845 501911 497569 493966 491844 491276 491254 490971 490901 492033 494361 496761
59511D96761J357j13j627l091m210m652m543m335m281m308m298m224m074l823
$$ 496761 498118 498005 496378 493287 489077 484425 479882 475547 471266 466958 462660 458436 454362 450539
59497D50539l354k406r00N46R38J36p39o30R6L00j52k05P56J948K258J618Q95
$$ 450539 447185 444779 443879 444425 445363 445499 444760 444130 444226 444526 444374 444169 444925 446873 449131 450749 451644
59480D51644Q25J489K561L580M204M482M749N109N199M704L853L089K504J862
$$ 451644 452469 453958 456519 460099 464303 468785 473534 478643 483842 488546 492399 495488 497992 499854
59466D99854J056K20m50p48n47k7L67M59O32J272K119K586K582K548K766L049
$$ 499854 500910 501130 500680 499932 499385 499358 499725 500184 500816 502088 504207 506793 509375 511923 514689 517738
59450E17738L206L427M043N079O172O781O562N700M787M152L387J858l79k503
$$ 517738 520944 524371 528414 533493 539665 546446 553008 558708 563495 567647 571034 572892 572513 570010
59436E70010l779m179m142m058m092m202m183l892l493l192k772j795l56P88J175
$$ 570010 566231 562052 557910 553852 549760 545558 541375 537483 533990 530798 528026 526231 525875 526663 527838
59421E27838J221J639K579L816N355P286R235J0621J1485J2382J3453J4351J5177
$$ 527838 529059 530698 533277 537093 542448 549734 558969 569590 581075 593457 606910 621261 636438
59408F36438J6578J8180J7739J3087M927l300q442r940r108p237n024k830n21
$$ 636438 653016 671196 688935 702022 706949 703649 695207 685267 676159 668922 663898 661068 660547
59395F60547K462N770P137L976l566j2003j7408j8518j6821j4418j2421j0915
$$ 660547 663009 668779 675916 679892 676326 664323 646915 628397 611576 597158 584737 573822
59383E73822r572q162o751n510m345l041j796j157j176j110l43Q90K031K987L802
$$ 573822 564250 556088 549337 543827 539482 536441 534645 533488 532312 531202 530859 531749 533780 536767 540569
59368E40569M092L586K908K945L578L879L584L430L870M395M472M438M883N706
$$ 540569 544661 548247 551155 554100 557678 561557 565141 568571 572441 576836 581308 585746 590629 596335
59354E96335O368O727P107P732Q499R154R403R121Q694Q831R635J0275R970R064
$$ 596335 602703 609430 616537 624269 632768 641922 651325 660446 669140 677971 687606 697881 707851 716915
59340G16915Q576Q829R155Q889Q037O859N389L720K265J307N08p06k313l681m393
$$ 716915 725491 734320 743475 752364 760401 767260 772649 776369 778634 779941 780449 779743 777430 773749 769356
59325G69356m812n619o953q229q804q646q272q124q078p650o613n371m591m463
$$ 769356 764544 758925 751972 743743 734939 726293 718021 709897 701819 694169 687556 682185 677594 673131
59311F73131m442l900k950k307k312k415j892p08O74K153M043O309Q281R484J0221
$$ 673131 668689 664789 661839 659532 657220 654805 652913 652205 652879 655032 659075 665384 673665 683149 693370
59296F93370J0898J1052R590O034J148l730p670j0435j2123j2856j2745j1973
$$ 693370 704268 715320 724910 730944 732092 728362 720692 710257 698134 685278 672533 660560
59284F60560j0837r689q779q058p206n962m419l003k130j856j790j397m24Q59
$$ 660560 649723 640034 631255 623197 615991 610029 605610 602607 600477 598621 596831 595434 595010 595869
59270E95869J972K724L345M064M778N282N646O038O260N795M509K928J578L08
$$ 595869 597841 600565 603910 607974 612752 618034 623680 629718 635978 641773 646282 649210 650788 651096
59256F51096j397l587n707p216p935p865p050n791m607l834l419l216l127k933
$$ 651096 649699 646112 640405 633189 625254 617389 610339 604548 599941 596107 592688 589472 586345 583412
59242E83412k341j471r12j025j421j485j132p43m86j13N77J358J745J425N93j48
$$ 583412 581071 579600 578688 577663 576242 574757 573625 572882 572396 572283 572860 574218 575963 577388 577981 577833
59226E77833l12j3K75L59M21M45P5p56j596k127k526k778k352j089O9J72l81m74
$$ 577833 577521 577508 577783 578142 578563 579008 579083 578327 576731 574604 572078 569300 566948 565859 565928 566100 565719 565245
59208E65245L0K30k03n19k01K25J18k80l54J6N34R85J207J028O73P41J402K054
$$ 565245 565275 565505 565302 564783 564582 564807 564925 564645 564291 564307 564841 565826 567033 568061 568734 569475 570877 572931
59190E72931K149J994K152K483K369J668R00N81Q04J376K001K375K424K376K364
$$ 572931 575080 577074 579226 581709 584078 585746 586646 587227 588031 589407 591408 593783 596207 598583 600947
59175F00947K211J811J492J614K020K280K244K030J696J374J546K520L745M195
$$ 600947 603158 604969 606461 608075 610095 612375 614619 616649 618345 619719 621265 623785 627530 631725
59161F31725L642K974L080L716L912L179J975J022N40K36j05l79m79o50j261k258
$$ 631725 635367 638341 641421 645137 649049 652228 654203 655225 655765 656001 655896 655517 655038 654388 653127 650869
59145F50869l117l367l071k770l030l962n113n824n889n712n682n650n381n130
$$ 650869 647752 644385 641314 638544 635514 631552 626439 620615 614726 609014 603332 597682 592301 587171
59131E87171n233n355m858l877l184k906k285j041j9L4l75k55N76J600K508L234
$$ 587171 581938 576583 571725 567848 564664 561758 559473 558432 558413 558447 558072 557817 558393 559993 562501 565735
59115E65735L522L243K862K937L365L673L743L684L375K739K103J668J071K04
$$ 565735 569257 572500 575362 578299 581664 585337 589080 592764 596139 598878 600981 602649 603720 603924
59101F03924j43N87J548J515O78J12j78j060k268k414j311n67j158j983j821j253
$$ 603924 603781 604368 605916 607431 608109 608221 608043 606983 604715 602301 600990 600423 599265 597282 595461 594208
59085E94208j397j890j652r15r46k049l207l661l688l779l996m253m482m491m206
$$ 594208 592811 590921 589269 588354 587408 585359 582152 578491 574803 571024 567028 562775 558293 553802 549596
59070E49596l999m102m034l326k565k659l260l092k010j455k335l533l375j885
$$ 549596 545597 541495 537461 534135 531570 528911 525651 522559 520549 519094 516759 513226 509851 507966
59056E07966o10o14j432j939j558o14R8J5o13r53n41J58L70l8o01r80j151j000
$$ 507966 507356 506742 505310 503371 501813 501199 501297 501312 500699 499746 499205 499363 499733 499695 499094 498114 496963 495963
59038D95963l32O48J349J468J333J355J398J082M97K32O94J652K598L358M084
$$ 495963 495631 496279 497628 499096 500429 501784 503182 504264 504761 504993 505687 507339 509937 513295 517379
59023E17379M781N188N213N310N994P084P757P468O590N933N823N891N653M955
$$ 517379 522160 527348 532561 537871 543865 550949 558706 566174 572764 578697 584520 590411 596064 601019
59009F01019L840K374O81r63k211k735k358j273j54L42K93M84J436K710L399L118
$$ 601019 604859 607233 607914 606951 604740 602005 599647 598374 598220 598562 598855 599339 600775 603485 606884 610002
58993F10002K283J562J292J424J685J833J888K095K500K783K716K560K654K810
$$ 610002 612285 613847 615139 616563 618248 620081 621969 624064 626564 629347 632063 634623 637277 640087
58979F40087K680K527L012M141N099N400N533O134P148Q180R196J0212J0780J0486
$$ 640087 642767 645294 648306 652447 657546 662946 668479 674613 681761 689941 699137 709349 720129 730615
58965G30615R681R069Q728Q200P421O770O225N209L531J795O00j48q78j788k972
$$ 730615 740296 749365 758093 766293 773714 780484 786709 791918 795449 797244 797844 797696 796818 795030 792058
58950G92058m595o538q201r060r309r579j0249j1128j1654j1268r962q541p901
$$ 792058 787463 780925 772724 763664 754355 744776 734527 723399 711745 700477 690515 681974 674073
58937F74073p877p322n709m050l628m239m512l624k013m34P88J534J696J524J543
$$ 674073 666196 658874 653165 649115 645487 641248 636736 633112 631099 630665 631453 632987 634683 636207 637750
58922F37750J818J791J159L90J8n3j02L4N65J093J036N28K40M23P37J005J414
$$ 637750 639568 641359 642518 642908 642926 642873 642771 642805 643370 644463 645499 646027 646267 646690 647427 648432 649846
58905F49846J914K146K233K899M396N923O712P123P945R022R436Q950Q336Q130
$$ 649846 651760 653906 656139 659038 663434 669357 676069 683192 691137 700159 709595 718545 726881 735011
58891G35011P966P480P130P518Q399R027R242R550J0194J0705J0467R342P675
$$ 735011 742977 750457 757587 765105 773504 782531 791773 801323 811517 822222 832689 842031 849706
58878H49706N938M478L396K513J539K81j334l299n422p234q195q035o935n518
$$ 849706 855644 860122 863518 866031 867570 867851 866517 863218 857796 850562 842367 834332 827397 821879
58864H21879m655m904n865o386n795m733m357m845n284n020m592m981o308p696
$$ 821879 817224 812320 806455 800069 794274 789541 785184 780339 775055 770035 765443 760462 754154 746458
58850G46458q241p840p046o350n791n265m965n203n775o001n665n473o087p014
$$ 746458 738217 730377 723331 716981 711190 705925 700960 695757 689982 683981 678316 672843 666756 659742
58836F59742p124o244n406n418n901o075n870n732n685n258m141k511p97N56J220
$$ 659742 652618 646374 640968 635550 629649 623574 617704 611972 606287 601029 596888 594377 593580 594136 595356
58821E95356J280J242J451J676J702K019L272N042N917N126L523K498K371K399
$$ 595356 596636 597878 599329 601005 602707 604726 607998 613040 618957 624083 627606 630104 632475 634874
58807F34874K075J662J397R64R6q91j556k028k647l271l492l411l513l895m221
$$ 634874 636949 638611 640008 640972 641068 640177 638621 636593 633946 630675 627183 623772 620259 616364 612143
58792F12143m567n415o599p124o532n723n680n963n384l764k049q68L8R39J594
$$ 612143 607576 602161 595562 588438 581906 576183 570503 564540 559156 555392 553343 552475 552513 553452 555046
58777E55046J845J956K126K238K286K331J955N63j474k869l044k913l450m232
$$ 555046 556891 558847 560973 563211 565497 567828 569783 570346 568872 566003 562959 560046 556596 552364
58763E52364m247l574l217l513l690l138k305j985k256k485k143j318m98j3J90
$$ 552364 548117 544543 541326 537813 534123 530985 528680 526695 524439 521954 519811 518493 517995 517982 518172
58748E18172K95L07J82J53N12J028J033L63k49L4J178K407K967K614J651Q25Q61
$$ 518172 518467 518774 518956 519109 519621 520649 521682 522045 521796 521830 523008 525415 528382 530996 532647 533472 534333
58731E34333J790K911L618L872L744L062J957J156J113J335J202J032J475K182
$$ 534333 536123 539034 542652 546524 550268 553330 555287 556443 557556 558891 560093 561125 562600 564782
58717E64782K118J165M20P03J595K278K533K525K252J737J336J266J180O66o5
$$ 564782 566900 568065 568485 569188 570783 573061 575594 578119 580371 582108 583444 584710 585890 586556 586491
58702E86491n29q42j660l233m971o127o634o986p474p862p876p698p709p852p595
$$ 586491 585962 585120 583460 580227 575256 569129 562495 555509 548035 540173 532297 524599 516890 509038 501443
58687E01443o670n516m707m205l525k582j901j913k342k608k496k250k029j663
$$ 501443 494773 489257 484550 480345 476820 474238 472337 470424 468082 465474 462978 460728 458699 457036
58673D57036r57k7Q60J579K036J942J155K49K48J453K972L819M108M530M937M434
$$ 457036 456079 456052 456912 458491 460527 462469 463624 463873 464121 465574 468546 472365 476473 481003 485940 490374
58657D90374K857J208L21j71r71j941k430k323k147k303k730l108l020k207j039
$$ 490374 493231 494439 494760 494589 493618 491677 489247 486924 484777 482474 479744 476636 473616 471409 470370
58642D70370l75o13j170j325j153j116j147q76m24k56l65k93P8M25N85P86J185
$$ 470370 469995 469382 468212 466887 465734 464618 463471 462595 462171 461915 461550 461257 461335 461760 462345 463131 464316
58625D64316J673K093K244J873J040L72M20R80J553K112K861L495L573L418L731
$$ 464316 465989 468082 470326 472199 473239 473611 474031 475011 476564 478676 481537 485032 488605 492023 495754
58610D95754M404M598M093L624L680L854L700L470L553L836M043M146M065L512
$$ 495754 500158 504756 508849 512473 516153 520007 523707 527177 530730 534566 538609 542755 546820 550332
58596E50332K478J463Q25L70j04k48L81J568K539K662J982J239J376K696M418
$$ 550332 552810 554273 555098 555468 555364 555116 555497 557065 559604 562266 564248 565487 566863 569559 573977
58581E73977N389N264M643M198M175M606N209N186L936K183J483K322L536M044
$$ 573977 579366 584630 589273 593471 597646 602252 607461 612647 616583 618766 620249 622571 626107 630151
58567F30151M218M937O159P220P980Q759R545J0106J0603J1405J2386J3080J3343
$$ 630151 634369 639306 645465 652685 660665 669424 678969 689075 699678 711083 723469 736549 749892
58554G49892J3297J2752J1348R180O765M370J938l66k045k762k657k088j449j189
$$ 749892 763189 775941 787289 796469 803234 807604 809542 809176 807131 804369 801712 799624 798175 796986
58540G96986j622k649l861n001o137p407q844j0339j1575j2092j1728j0962j0495
$$ 796986 795364 792715 788854 783853 777716 770309 761465 751126 739551 727459 715731 704769 694274
58527F94274j0443j0182r096p263n367m030l386l107k757k142j482j238j661k381
$$ 694274 683831 673649 664553 657290 651923 647893 644507 641400 638643 636501 635019 633781 632120 629739
58513F29739k651k204j709j978k763k905j821l05N32N37J86m00j296k052k033
$$ 629739 627088 624884 623175 621197 618434 615529 613708 613403 613935 614472 614658 614258 612962 610910 608877
58498F08877j378p73l24L92J249J511J122J026J829K948L543L537L302L004K778
$$ 608877 607499 606726 606402 606794 608043 609554 610676 611702 613531 616479 620022 623559 626861 629865 632643
58483F32643K938L505M090M626N588P014Q017P971P527P742Q593R181R043Q509
$$ 632643 635581 639086 643176 647802 653390 660404 668421 676392 683919 691661 700254 709435 718478 726987
58469G26987P863O936N506L588J290j163l248m322m098k873j393n22o40j150r09
$$ 726987 734850 741786 747292 750880 752170 751007 747759 743437 739339 736466 735073 734551 733911 732761 731852
58454G31852N76K622M224N082N565N992O355O492O289N689M612K801J7l204n374
$$ 731852 732428 735050 739274 744356 749921 755913 762268 768760 775049 780738 785350 788151 788168 784964 779590
58439G79590n443m286l889m900n977n743m372k710r87Q69K422L195L414L540L518
$$ 779590 774147 769861 765972 761072 755095 749352 744980 742270 741283 742152 744574 747769 751183 754723 758241
58424G58241L163K835L080L914N000O071O738O447N275M237M117M417M046K701
$$ 758241 761404 764239 767319 771233 776233 782304 789042 795489 800764 805001 809118 813535 817581 820282
58410H20282R65n69j680k406l012l763m403m290l405k521k011j340j97O47M60
$$ 820282 821247 820678 818998 816592 813580 809817 805414 801124 797719 795198 793187 791847 791650 792297 792757
58395G92757k48l85L83J657L037M138M540M364M291M529M544M284M535N321N261
$$ 792757 792509 792124 792507 794164 797201 801339 805879 810243 814534 819063 823607 827891 832426 837747 843008
58380H43008L694K174K467M053N155N400N721O319O508O240O138O211O035O014
$$ 843008 846702 848876 851343 855396 860551 865951 871672 877991 884499 890739 896877 903088 909123 915137
58366I15137O913Q275Q765Q171P667Q067R054J0098J0899J0998J0135R006Q618
$$ 915137 922050 930325 939090 947261 954928 962995 972049 982147 993046 1004044 1014179 1023185 1031803
58353A031803Q967R362R660J0024R973R078Q265Q754R964J0086Q794P656P778
$$ 1031803 1040770 1050132 1059792 1069816 1079789 1088867 1097132 1105886 1115850 1125936 1134730 1142386 1150164
58340A150164Q610R406J0166J0891J1242J1437J2207J3495J4386J4549J4646J5125
$$ 1150164 1158774 1168180 1178346 1189237 1200479 1211916 1224123 1237618 1252004 1266553 1281199 1296324
58328A296324J5725J6312J7032J7573J7447J7057J7235J7765J7659J6822J6004
$$ 1296324 1312049 1328361 1345393 1362966 1380413 1397470 1414705 1432470 1450129 1466951 1482955
58317A482955J5282J4136J3017J3075J4148J4775J4479J4361J5093J6088J7052
$$ 1482955 1498237 1512373 1525390 1538465 1552613 1567388 1581867 1596228 1611321 1627409 1644461
58306A644461J8606K0733K2240K2503K2363K2682K3342K4157K5409K6904K7867
$$ 1644461 1663067 1683800 1706040 1728543 1750906 1773588 1796930 1821087 1846496 1873400 1901267
58295A901267K8264K9044L0571L2094L3125L4095L5337L6646L8032L9650M1011
$$ 1901267 1929531 1958575 1989146 2021240 2054365 2088460 2123797 2160443 2198475 2238125 2279136
58284B279136M1649M2390M4306M6611M7625M7649M8678N1193N3706N5687N8432
$$ 2279136 2320785 2363175 2407481 2454092 2501717 2549366 2598044 2649237 2702943 2758630 2817062
58273B817062O2368O6064O8760P1451P4633P7305P9279Q2119Q6687R1808R6536
$$ 2817062 2879430 2945494 3014254 3085705 3160338 3237643 3316922 3399041 3485728 3577536 3674072
58262C674072J01674J07999J15023J22447J30951J40638J50646J60916J72121
$$ 3674072 3775746 3883745 3998768 4121215 4252166 4392804 4543450 4704366 4876487
58253D876487J83462J93161K01780K12142K25276K39510K54425K72103K92992
$$ 4876487 5059949 5253110 5454890 5667032 5892308 6131818 6386243 6658346 6951338
58244F951338L14088L33025L50726L68166L83994L97542M11037M26424M42973
$$ 6951338 7265426 7598451 7949177 8317343 8701337 9098879 9509916 9936340 10379313
58235A0379313M60246M80256N04383N31156N59415N90437O24476O58263O88318
$$ 10379313 10839559 11319815 11824198 12355354 12914769 13505206 14129682 14787945 15476263
58226A5476263P13601P33231P45931P54588P66943P88243Q16828Q49967Q89555
$$ 15476263 16189864 16923095 17669026 18423614 19190557 19978800 20795628 21645595 22535150
58217B2535150R38410R95460J058701J128843J206003J287259J371922J464988
$$ 22535150 23473560 24469020 25527721 26656564 27862567 29149826 30521748 31986736
58209C1986736J571449J692011J828498J987972K177354K400652K666288K989355
$$ 31986736 33558185 35250196 37078694 39066666 41244020 43644672 46310960 49300315
58201D9300315L380689L842323M381109N018582N781163O692168P780577R079402
$$ 49300315 52681004 56523327 60904436 65923018 71704181 78396349 86176926 95256328
58193I5256328J0597240J2300086J4128725J6011265J7846065J9510823K0907983
$$ 95256328 105853568 118153654 132282379 148293644 166139709 185650532 206558515
58186B06558515K1905280K2095356K0650668J6685805J0046910J801002o202017
$$ 206558515 228463795 250559151 271209819 287895624 297942534 299743536 293541519
58179B93541519j2417743j6385489j8588489j9727182k0175725j9979467j9137817
$$ 293541519 281123776 264738287 246149798 226422616 206246891 186267424 167129607
58172A67129607j7778831j6120266j4360747j2631249j1009002r539969q245627
$$ 167129607 149350776 133230510 118869763 106238514 95229512 85689543 77443916
58165G7443916p125189o164696n347835m658922m080131l592131l178914k828995
$$ 77443916 70318727 64154031 58806196 54147274 50067143 46475012 43296098 40467103
58157D0467103k531805k276825k056947j868602j707100j565498j439328j328413
$$ 40467103 37935298 35658473 33601526 31732924 30025824 28460326 27020998 25692585
58149B5692585j231969j145541j064954r89987r21705q59162q01110p48196p00982
$$ 25692585 24460616 23315075 22250121 21260134 20338429 19479267 18678157 17929961 17228979
58140A7228979o57931o17516n80321n47217n17626m91165m68774m50359m33502
$$ 17228979 16571048 15953532 15373211 14825994 14308368 13817203 13348429 12898070 12464568
58131A2464568m16281l99320l83472l67728l51246l35248l20964l07532k93793
$$ 12464568 12048287 11648967 11265495 10897767 10546521 10211273 9890309 9582777 9288984
58122I288984k80256k67642k55293k42873k31804k23121k15515k07351j99106
$$ 9288984 9008728 8741086 8485793 8242920 8011116 7787995 7572480 7365129 7166023
58113G166023j92065j86061j80269j74831j70001j64857j58510j51467j44515
$$ 7166023 6973958 6787897 6607628 6432797 6262796 6097939 5939429 5787962 5643447
58104E643447j37490j30378j24245j19610j15364j10584j06109j02899j00315
$$ 5643447 5505957 5375579 5251334 5131724 5016360 4905776 4799667 4696768 4596453
58095D596453r7487r4948r3391r2051q9899q7248q4776q2145p9014p6116p3935
$$ 4596453 4498966 4404018 4310627 4218576 4128677 4041429 3956653 3874508 3795494 3719378 3645443
58084C645443p1540o8225o5064o3303o2415o1285o0072n9293n8267n6226n3970
$$ 3645443 3573903 3505678 3440614 3377311 3314896 3253611 3193539 3134246 3075979 3019753 2965783
58073B965783n2697n2097n1191n0194m9838m9707m8837m7375m6102m5067m4014
$$ 2965783 2913086 2860989 2809798 2759604 2709766 2660059 2611222 2563847 2517745 2472678 2428664
58062B428664m3421m3691m4037m3494m2233m0719l8629l6065l4575l5212l6481
$$ 2428664 2385243 2341552 2297515 2254021 2211788 2171069 2132440 2096375 2061800 2026588 1990107
58051A990107l6146l4194l2312l1169l0200k9374k9043k8525k6921k5018k4385
$$ 1990107 1953961 1919767 1887455 1856286 1826086 1796712 1767669 1739144 1712223 1687205 1662820
58040A662820k4793k4522k3185k2227k2436k2962k3067k3116k3267k2847k1700
$$ 1662820 1638027 1613505 1590320 1568093 1545657 1522695 1499628 1476512 1453245 1430398 1408698
58029A408698k0850k1095k1929k2327k1907k0943k0012j9758k0300k0775k0250
$$ 1408698 1387848 1366753 1344824 1322497 1300590 1279647 1259635 1239877 1219577 1198802 1178552
58018A178552j8996j8090j7844j7576j6874j6128j5791j5857j6170j6478j6340
$$ 1178552 1159556 1141466 1123622 1106046 1089172 1073044 1057253 1041396 1025226 1008748 992408
58007I92408j5637j4966j4835j4807j4258j3545j3403j3582j3269j2507j2081
$$ 992408 976771 961805 946970 932163 917905 904360 890957 877375 864106 851599 839518
57996H39518j2045j1654j0649r616r014q849r195j0030j0636j0225r120q302p980
$$ 839518 827473 815819 805170 795554 786540 777691 768496 758466 747830 737605 728485 720183 712203
57983G12203p629p282p493q105q374q347q789r632r798q894p858p415p088o344
$$ 712203 704574 697292 689799 681694 673320 664973 656184 646552 636754 627860 620002 612587 605499 599155
57969E99155n662n775o503p006o778o022n340n299n875o333o034n190m410l840
$$ 599155 593493 587718 581215 574209 567431 561409 556069 550770 544895 538562 532528 527338 522928 519088
57955E19088l428l586m564n574n657n160n141n486n045l705k715k651k564j707
$$ 519088 515660 512074 507510 501936 496279 491119 485978 480492 475447 471742 469027 466376 463812 462105
57941D62105p40m18l65J1L77L03K82J015K209K991L074K805K393J808J116M01
$$ 462105 461365 460947 460582 460593 460970 461273 461555 462570 464779 467770 470844 473649 476042 477850 478966 479367
57925D79367l62j054j408j621k367l780n011n359n332n859o856p307o736n871
$$ 479367 479005 477951 476543 474922 472555 468775 463764 458405 453073 447214 440358 433051 426315 420444
57911D20444n685o176o421n745m573l891l966m026l422k560k246k513k873l288
$$ 420444 414759 408583 402162 396417 391844 387953 383987 379961 376539 373979 371733 369220 366347 363059
57897C63059m046m802m782l977l191k750k103j070m75r98k032k370j534l2J333
$$ 363059 359013 354211 349429 345452 342261 339511 337408 336338 335863 334865 332833 330463 328929 328897 330230
57882C30230J979J784J151O42L35j58r34j497j448j018p57r66j518k003k017j617
$$ 330230 332209 333993 335144 335786 336121 335963 335029 333532 332084 331066 330309 329343 327825 325822 323805 322188
57866C22188j324j371j297p83m43r56j789j872j255r07r70o48N3N8q52j335n02
$$ 322188 320864 319493 318196 317413 316970 316014 314225 312353 311098 310191 309221 308573 308626 308684 307832 306497 305995
57849C05995O91J028Q28R51J047K31j108j548o58M54N77m06j806k911l358l250
$$ 305995 306686 307714 308542 309493 310540 310771 309663 308115 307457 307911 308488 308082 306276 303365 300007 296757
57833B96757l014k872k589j912j035l12J29L07K54K28N85J167J307P38J4k80j63
$$ 296757 293743 290871 288282 286370 285335 285023 285152 285459 285713 285941 286526 287693 289000 289738 289752 289472 289309
57816B89309J89Q63J635J779J101M89P23J200P06r25k737l867m124l577k489j493
$$ 289309 289498 290361 291996 293775 294876 295365 296088 297288 297994 297069 294332 290465 286341 282764 280275 278782
57800B78782j154j375j674j893k074j992j479r62r70j223j008l47j7l76q59q39
$$ 278782 277628 276253 274579 272686 270612 268620 267141 266179 265209 263986 262978 262631 262614 262238 261379 260540
57784B60540l62J92O98J218J699J912J669J011L76L52J045J844K062J692J171
$$ 260540 260178 260370 261068 262286 263985 265897 267566 268577 268953 269305 270350 272194 274256 275948 277119
57769B77119O98K10k14m36o80j339k279k837k660k177k028k228k158j368k12M37
$$ 277119 277817 278027 277813 277377 276697 275358 273079 270242 267582 265405 263377 261149 258991 257623 257411 257848
57753B57848J90l82n09k14p1j14L04J384K361K470J833R87J23o94j089q65m95
$$ 257848 258038 257656 257147 256933 256862 256748 257052 258436 260797 263267 265100 266087 266210 265516 264427 263562 263067
57736B63067n25q10q96q07q07p11j91M27M22l29j197j619j541j112n10k8J45K13
$$ 263067 262542 261732 260836 260029 259222 258511 258320 258747 259169 258840 257643 256024 254483 253371 252861 252833 252978 253191
57718B53191M38N80J74p63j667k019j634o60L32N47k55j386k131k622l243l535
$$ 253191 253629 254209 254383 253620 251953 249934 248300 247640 247972 248519 248264 246878 244747 242125 238882 235347
57702B35347k697r82L43N64J94l8q3j92l26l18j58J33N05O99M72J08R8K92Np70
$$ 235347 232650 231668 232011 232575 232769 232731 232648 232456 232130 231812 231654 231787 232292 232991 233463 233571 233669 233961 233966 233196
57682B33196j007Q1J945L391L976M282M987O193P650R269J1319J4100J7439K0641
$$ 233196 232189 232270 234215 237606 241582 245864 250851 257044 264694 273963 285282 299382 316821 337462
57668C37462K3125K5095K7238K9714L1554L1042K6553J7426M731q768j9909k6895
$$ 337462 360587 385682 412920 442634 474188 505230 531783 549209 553940 545172 525263 498368
57656D98368k9794k9669k7682k4934k2295j9976j7568j4834j2199j0248r012q041
$$ 498368 468574 438905 411223 386289 363994 344018 326450 311616 299417 289169 280157 272116
57644B72116o935n570m009k479j406j184j851k901l546l268k257j200n23k5N88
$$ 272116 265181 259611 255602 253123 251717 250533 248682 245781 242235 238967 236710 235510 234987 234962 235550
57629B35550J121J196Q43L70j83r01j502j557j235j201j716k351k692k745k572
$$ 235550 236671 237867 238710 239080 238897 237996 236494 234937 233702 232501 230785 228434 225742 222997 220425
57614B20425k092j513j347j738k151k115j782j473j159p84o32q68j008n04L72
$$ 220425 218333 216820 215473 213735 211584 209469 207687 206214 205055 204271 203639 202771 201763 201259 201631
57599B01631P77L99k31n16m32k30J2K62K22m43j600k613k930k534j818j173q17
$$ 201631 202408 202807 202576 202060 201628 201398 201410 201672 201894 201451 199851 197238 194308 191774 189956 188783 187966
57582A87966q82j305j697j664j317j182j389j341m81Q50J725J674J050M00j38
$$ 187966 187084 185779 184082 182418 181101 179919 178530 177189 176708 177558 179283 180957 182007 182407 182269
57567A82269p45j541k356k765k419j469n63j86j69q7P0nl39n91n41k30K88R16
$$ 182269 181524 179983 177627 174862 172443 170974 170411 170225 170056 169969 170039 170034 169695 169104 168563 168333 168621 169537
57549A69537J252Q53j32r34r80l89L42Q64J074J040R73J064J267J387J350J256
$$ 169537 170789 171642 171510 170576 169596 169207 169549 170413 171487 172527 173500 174564 175831 177218 178568 179824
57533A79824J193J203J257J092L57p18j204n59M64O37j40q46q61n55l19O9P22
$$ 179824 181017 182220 183477 184569 184926 184208 183004 182445 182909 183546 183406 182560 181699 181144 180825 180894 181616
57516A81616J113Q59M19M31Q19J134J362J762K180K166J712J314J239J204Q21
$$ 181616 182729 183588 184007 184438 185257 186391 187753 189515 191695 193861 195573 196887 198126 199330 200151
57501B00151R7o59j185j425j401j061l76L77O76L04k90m95l48l96q39j182r38
$$ 200151 200248 199589 198404 196979 195578 194517 194141 194518 195194 195498 195208 194713 194365 193969 193130 191948 191010
57484A91010k50L42M93K27k04n04n35l74q9M18J054J266P08q1k64%k59j256j949
$$ 191010 190760 191102 191595 191822 191618 191114 190579 190205 190116 190534 191588 192854 193562 193481 193217 193217 192958 191702 189753
57465A89753j571q39r20j710j984j018N44J517J344M35l81o04l94j35J06M17N74
$$ 189753 188182 187343 186423 184713 182729 181711 182255 183772 185116 185551 185170 184566 184172 184037 184143 184560 185134
57448A85134K73j48P1Q95J254M51p59j041l0J574K970L753L756L071K131J309
$$ 185134 185407 185259 185330 186225 187479 187930 187171 186130 186100 187674 190644 194397 198153 201224 203355 204664
57432B04664N87n0k20L20J044J209Q48O26Q60J258J586J932K329K634K863L054
$$ 204664 205251 205201 204981 205301 206345 207554 208402 209028 209888 211146 212732 214664 216993 219627 222490 225544
57416B25544K855J872N31j02L25R55R76P58J116J883K085J424P21O77R29P99M49
$$ 225544 228399 230271 230802 230700 231025 231980 232956 233714 234830 236713 238798 240222 240943 241620 242549 243348 243797
57399B43797O00J323J840J632J122J020J432J917K109J937J597J534K106K964
$$ 243797 244397 245720 247560 249192 250314 251334 252766 254683 256792 258729 260326 261860 263966 266930
57385B66930L235K793K712L829N296N544M383L133K693K629K371K201K524L056
$$ 266930 270165 272958 275670 279499 284795 290339 294722 297855 300548 303177 305548 307749 310273 313329
57371C13329L361L540L763L727L178K543K396K673K936L078L273L505L673L909
$$ 313329 316690 320230 323993 327720 330898 333441 335837 338510 341446 344524 347797 351302 354975 358884
57357C58884M329M684M679M475M487M816N258N705O199O728P170P362P192O801
$$ 358884 363213 367897 372576 377051 381538 386354 391612 397317 403516 410244 417414 424776 431968 438769
57343D38769O682P119P613P426O780O686P390P894P475O845P058P977Q702Q932
$$ 438769 445451 452570 460183 467609 474389 481075 488465 496359 503834 510679 517737 525714 534416 543348
57329E43348R015R066Q896Q613Q570Q820R268J0062J1213J2048J1876J1030J0600
$$ 543348 552363 561429 570325 578938 587508 596328 605596 615658 626871 638919 650795 661825 672425
57316F72425J1139J2238J3281J4002J4364J4432J4422J4471J4461J4407J4687
$$ 672425 683564 695802 709083 723085 737449 751881 766303 780774 795235 809642 824329
57305H24329J5462J6194J6235J5756J5444J5593J5960J6376J6919J7623J8494
$$ 824329 839791 855985 872220 887976 903420 919013 934973 951349 968268 985891 1004385
57294A004385J9647K1017K2259K3291K4553K6232K7741K8537K8964K9565L0202
$$ 1004385 1024032 1045049 1067308 1090599 1115152 1141384 1169125 1197662 1226626 1256191 1286393
57283A286393L0603L1216L2531L4055L5031L5735L6848L7875L7618L6105L4766
$$ 1286393 1316996 1348212 1380743 1414798 1449829 1485564 1522412 1560287 1597905 1634010 1668776
57272A668776L4477L4659L4485L3819L2701L1049K9288K8292K8284K8592K8764
$$ 1668776 1703253 1737912 1772397 1806216 1838917 1869966 1899254 1927546 1955830 1984422 2013186
57261B013186K9016K9391K9366K8792K8360K8698K9702L1035L2557L3992L4957
$$ 2013186 2042202 2071593 2100959 2129751 2158111 2186809 2216511 2247546 2280103 2314095 2349052
57250B349052L5630L6581L7773L8558L8924L9693M1118M2351M2813M3115M3964
$$ 2349052 2384682 2421263 2459036 2497594 2536518 2576211 2617329 2659680 2702493 2745608 2789572
57239B789572M5052M5767M6187M6690M7122M7147M6821M6369M5924M5880M6698
$$ 2789572 2834624 2880391 2926578 2973268 3020390 3067537 3114358 3160727 3206651 3252531 3299229
57228C299229M7929M8338M7639M7059M7407M7614M6276M3814M1829M0944M0602
$$ 3299229 3347158 3395496 3443135 3490194 3537601 3585215 3631491 3675305 3717134 3758078 3798680
57217C798680M0507M0818M1112M0579L9405L8660L8581L8126L6628L4896L4000
$$ 3798680 3839187 3880005 3921117 3961696 4001101 4039761 4078342 4116468 4153096 4187992 4221992
57206D221992L3682L2766L0764K8389K6602K5678K5233K4887K4656K4730K5173
$$ 4221992 4255674 4288440 4319204 4347593 4374195 4399873 4425106 4449993 4474649 4499379 4524552
57195D524552K5949K7161K8896L0825L2359L3310L4080L4976L5766L6125L6185
$$ 4524552 4550501 4577662 4606558 4637383 4669742 4703052 4737132 4772108 4807874 4843999 4880184
57184D880184L6312L6624L6994L7243L7064L6043L4103L1713K9489K7834K7038
$$ 4880184 4916496 4953120 4990114 5027357 5064421 5100464 5134567 5166280 5195769 5223603 5250641
57173E250641K7288K8315K9499L0619L2000L3650L4825L4980L4635L4734L5502
$$ 5250641 5277929 5306244 5335743 5366362 5398362 5432012 5466837 5501817 5536452 5571186 5606688
57162E606688L6486L7442L8559M0085M2306M5721N0730N7259O5150P4695Q6251
$$ 5606688 5643174 5680616 5719175 5759260 5801566 5847287 5898017 5955276 6020426 6095121 6181372
57151F181372R9316J12244J22915J29671J32183J31858J31218J32423J36477J43599
$$ 6181372 6280688 6392932 6515847 6645518 6777701 6909559 7040777 7173200 7309677 7453276
57141G453276J53456J64454J73587J77935J76207J68485J55224J37452J17561
$$ 7453276 7606732 7771186 7944773 8122708 8298915 8467400 8622624 8760076 8877637
57132H877637R8672Q2868P0471O0828N3226M7122M2130L7890L3590K7736J8854
$$ 8877637 8976309 9059177 9129648 9190476 9243702 9290824 9332954 9370844 9404434 9432170 9451024
57121I451024O311r618k7855m6289o2188p3886q1802q7141r0153r0726r0144r0595
$$ 9451024 9457335 9447717 9419862 9373573 9311385 9237499 9155697 9068556 8978403 8887677 8797533 8706938
57109H706938r2650r4315r3047q7810p8791o5903m8096k3693Q999N1083J02804
$$ 8706938 8614288 8519973 8426926 8339116 8260325 8194422 8146326 8122633 8131632 8182715 8285519
57098H285519J63898K33749L10711L91875M74528N57872O42726P30300Q22699
$$ 8285519 8449417 8683166 8993877 9385752 9860280 10418152 11060878 11791178 12613877
57089A2613877R23997J038097J163765J292388J411034J506819J568277J584821
$$ 12613877 13537874 14575971 15739736 17032124 18443158 19949977 21518254 23103075
57081B3103075J547101J447712J281069J044692P43948L96668L1790l18303o26265
$$ 23103075 24650176 26097888 27378957 28423649 29167597 29564265 29596055 29277752 28651487
57072B8651487q74879j058737j183164j259838j300343j311802j297168j258245
$$ 28651487 27776608 26717871 25534707 24274869 22974526 21662724 20365556 19107311
57064A9107311j197716j119182j026751r25097q19405p14702o15076n23317m40909
$$ 19107311 17909595 16790413 15763662 14838565 14019160 13304458 12689382 12166065 11725156
57055A1725156l67999l03604k46414j95798j52017j15322q5040n9763l8280j9890
$$ 11725156 11357157 11053553 10807139 10611341 10459324 10344002 10258962 10199199 10160919 10141029
57045A0141029l890J0637K4298L6992M8312N7955O5612P0887P3759P4890P5117
$$ 10141029 10137139 10147776 10172074 10209066 10257378 10315333 10380945 10451832 10525591 10600481 10675598
57034A0675598P4865P4415P4411P5530P7858Q1104Q5188Q9971R4600R8158J00943
$$ 10675598 10750463 10824878 10899289 10974819 11052677 11133781 11218969 11308940 11403540 11501698 11602641
57023A1602641J03747J04983R9721Q3483N7438K8963O543n669q707n956n66N121
$$ 11602641 11706388 11811371 11911092 11994575 12052013 12080976 12087519 12081850 12073143 12067187 12066621 12071742
57011A2071742R454J1612J1570R535N663N35m489p844q760p593n202k141J572
$$ 12071742 12081196 12092808 12104378 12113913 12119576 12120111 12115622 12107778 12099018 12091425 12086223 12084082 12085654
56998A2085654N993J0719J4974J8242K0636K2492K3816K4409K4315K3793K2911
$$ 12085654 12091647 12102366 12117340 12135582 12156218 12178710 12202526 12226935 12251250 12275043 12297954
56987A2297954K1641K0311J9476J9322J9609K0340K1841K3947K5692K6271K5943
$$ 12297954 12319595 12339906 12359382 12378704 12398313 12418653 12440494 12464441 12490133 12516404 12542347
56976A2542347K5562K5473K5372K4942K4147K3038K1741K0600J9975J9853J9931
$$ 12542347 12567909 12593382 12618754 12643696 12667843 12690881 12712622 12733222 12753197 12773050 12792981
56965A2792981J9987J9916J9449J8169J5785J2320Q159M050P45j578l415n292
$$ 12792981 12812968 12832884 12852333 12870502 12886287 12898607 12906766 12910816 12911561 12909983 12906568 12901276
56953A2901276p339r658j2485j5566j7829j8407j7787j7257j7210j6760j5028
$$ 12901276 12893937 12884279 12871794 12856228 12838399 12819992 12802205 12784948 12767738 12750978 12735950
56942A2735950j2238r270o731m728l162j865n88P28J748J936J066n69k567n095
$$ 12735950 12723712 12714442 12707711 12702983 12699821 12697956 12697368 12698096 12699844 12701780 12702846 12702277 12699710 12694615
56928A2694615r031j5101k2833l0625l6938m1224m3772m5174m6128m7187m8323
$$ 12694615 12685584 12670483 12647650 12617025 12580087 12538863 12495091 12449917 12403789 12356602 12308279
56917A2308279m9072m9331m9603n0225n0948n1709n3125n5568n8373o0677o2502
$$ 12308279 12259207 12209876 12160273 12110048 12059100 12007391 11954266 11898698 11840325 11779648 11717146
56906A1717146o4232o5551o5989o6139o7139o9065p1002p2774p5392p9515q4476
$$ 11717146 11652914 11587363 11521374 11455235 11388096 11319031 11248029 11175255 11099863 11020348 10935872
56895A0935872q9215r3246r6315r7968r8011r6786r4556r1160q6633q1543p6333
$$ 10935872 10846657 10753411 10657096 10559128 10461117 10364331 10269775 10178615 10091982 10010439 9934106
56884I934106p0990o5776o1683n9531n9079n9480o0298o1590o3409o5694o8348
$$ 9934106 9863116 9797340 9735657 9676126 9617047 9557567 9497269 9435679 9372270 9306576 9238228
56873I238228p1026p3126p4391p5265p6348p7733p9162q0434q1286q1222q0027
$$ 9238228 9167202 9094076 9019685 8944420 8868072 8790339 8711177 8630743 8549457 8468235 8388208
56862H388208p8287p6887p6017p5051p3498p1954p1897p4516p9564q5386r0218
$$ 8388208 8309921 8233034 8157017 8081966 8008468 7936514 7864617 7790101 7710537 7625151 7534933
56851G534933r3374r5095r5588r4717r2535q9476q5957q2184p8467p5147p2099
$$ 7534933 7441559 7346464 7250876 7156159 7063624 6974148 6888191 6806007 6727540 6652393 6580294
56840F580294o8832o5225o1649n8258n4702n0820m6999m3678m1238m0815m4491
$$ 6580294 6511462 6446237 6384588 6326330 6271628 6220808 6173809 6130131 6088893 6048078 6003587
56829F003587n3746o7747q3553r7878j08581j15055j17966j18601j17978j16356
$$ 6003587 5949841 5882094 5798541 5700663 5592082 5477027 5359061 5240460 5122482 5006126
56819E006126j13568j09616j04876r9904r5174r0815q6547q2151p8035p4969p3243
$$ 5006126 4892558 4782942 4678066 4578162 4482988 4392173 4305626 4223475 4145440 4070471 3997228
56808C997228p2382p1726p0922p0076p0066p2552p8650q7254r5411j00834j03381
$$ 3997228 3924846 3853120 3782198 3712122 3642056 3569504 3490854 3403600 3308189 3207355 3103974
56797C103974j03921j02711r9630r5220r0464q5803q1088p6256p1393o6412o1197
$$ 3103974 3000053 2897342 2797712 2702492 2612028 2526225 2445137 2368881 2297488 2231076 2169879
56786B169879n5998n1137m6519m1911l7520l3805l0943k8962k8304k9736l3639
$$ 2169879 2113881 2062744 2016225 1974314 1936794 1902989 1872046 1843084 1814780 1785044 1751405
56775A751405l9532m6215n2273n6757n9614o1294o1823o0757n8106n4716n1331
$$ 1751405 1711873 1665658 1613385 1556628 1497014 1435720 1373897 1313140 1255034 1200318 1148987
56764A148987m7916m4317m0946l8186l5657l2869l0124k8096k6744k5514k4340
$$ 1148987 1101071 1056754 1015808 977622 941965 909096 878972 850876 824132 798618 774278
56753G74278k3694k3587k3345k2437k1040j9710j8929j8908j9340j9405j8504
$$ 774278 750584 726997 703652 681215 660175 640465 621536 602628 583288 563883 545379
56742E45379j6998j5791j5232j4877j4294j3587j3017j2549j1948j1110j0193
$$ 545379 528381 512590 497358 482481 468187 454600 441583 429034 417086 405976 395783
56731C95783r489r076q639p854p054p039p923q719q465p366o340n839n745n984
$$ 395783 386294 377218 368579 360725 353671 346632 338709 329990 321525 314159 307819 301980 296235 290251
56717B90251o501o846o576n935n478n090m208k937k126k145k417k412k413k850
$$ 290251 283750 276904 270328 264393 258915 253825 249617 246680 244554 242409 239992 237580 235167 232317
56703B32317l474l752l682l660l734l493k757j957j701k065k526k537k114j748
$$ 232317 228843 225091 221409 217749 214015 210522 207765 205808 204107 202042 199516 196979 194865 193117
56689A93117j817k243k660k708k248j472q78p52p55l40L51N63pp36r35o79m17
$$ 193117 191300 189057 186397 183689 181441 179969 179091 178339 177584 177244 177595 178158 178151 177415 176480 175801 175384
56672A75384k34lJ39L8q7M2K42J80l5k9K20L78L09J96K11L34M34L64J57J22M52
$$ 175384 175150 175147 175286 175324 175237 175279 175521 175701 175666 175637 175857 176235 176544 176740 176951 177285 177719 178083 178240 178362 178814
56651A78814O87J34j007j672j397j003j250j622j229l15K4o40j679k293k074j001
$$ 178814 179501 179635 178628 176956 175559 174556 173306 171684 170455 170140 170164 169524 167845 165552 163478 162477
56635A62477L67R18nj735k920k904j957o15N43Q69K30n94q39p74j062j497j365
$$ 162477 162844 163762 163757 162022 159102 156198 154241 153626 154169 155038 155268 154674 153835 153061 151999 150502 149137
56618A49137p33l94n84p60n90k73N2L40K41m15q76k75Q46J050Q0p57n66l5j02
$$ 149137 148404 148010 147426 146666 146076 145803 145855 146195 146436 146021 145145 144870 145716 146766 146846 146089 145523 145488 145386
56599A45386n20m74J12O01N64J89j9L24J052J428J002L14J81M70L79j86m31PN51
$$ 145386 144866 144392 144504 145105 145669 145858 145839 146163 147215 148643 149645 149959 150140 150610 150989 150803 150372 150379 150930
56580A50930O94O01M59J30k13pP30J176R33N93P21J028J128J335K022K832L201
$$ 150930 151624 152225 152684 152814 152601 152594 153324 154500 155433 156026 156747 157775 158903 160238 162260 165092 168293
56563A68293L199L266L507L779M063M314M344M256M468M949M886L642J647j08
$$ 168293 171492 174758 178265 182044 186107 190421 194765 199021 203489 208438 213324 216966 218613 218505
56549B18505j073j295r84m70k44n23r70j125j035j114j627k417k939k564j239
$$ 218505 217432 216137 215153 214683 214439 213916 212946 211821 210786 209672 208045 205628 202689 200125 198886
56534A98886R8L05o16j477j357n75L0J75R8l9k44n02p68r45p95k51K24K8p71j543
$$ 198886 198984 199289 198673 197196 195839 195264 195294 195469 195567 195528 195284 194782 194014 193069 192274 192023 192247 192275 191504 189961
56514A89961j982k224k107j216J42R17O30k3k90k57k40j59rj64n98n80J91Q19
$$ 189961 187979 185755 183648 182432 182574 183491 184121 184098 183808 183551 183311 183152 183143 182979 182381 181801 181992 182811
56496A82811M47m19o40l4O30Q44P20L82j29m67k46K96N00J66k48k90N7N41Q63
$$ 182811 183258 182839 182199 182165 182795 183639 184359 184741 184612 184145 183899 184195 184695 184861 184613 184323 184380 184921 185784
56477A85784P83L19j60k96o7L62Q58J234J207P76L68L32N11N71N02M69M65L30
$$ 185784 186567 186886 186726 186430 186363 186725 187583 188817 190024 190800 191168 191500 192011 192582 193084 193553 194018 194348
56459A94348k7n85j205j509j114j16Q70J311J176P26L08L10Q31J342J179N14K62
$$ 194348 194321 193736 192531 191022 189908 189792 190662 191973 193149 193875 194183 194493 195324 196666 197845 198359 198621
56442A98621Q40J607J761J246N37K1j11J34L62J35l14k91K84O34L04j63j15K70
$$ 198621 199461 201068 202829 204075 204612 204633 204522 204656 205018 205153 204839 204548 204832 205466 205770 205607 205492 205762
56424B05762M16K45Q1J16L67P97J145J023M83Q6J36K97K03l5j47m1L80J174J962
$$ 205762 206178 206423 206504 206620 206987 207784 208929 209952 210435 210521 210657 210954 211157 211122 210975 210934 211314 212488 214450
56405B14450K137J648J040N95J35k32q5M15N03k0m39l08o3l5J89Q92J572J731
$$ 214450 216587 218235 219275 219870 220005 219773 219688 220103 220606 220586 220147 219839 219776 219741 219930 220822 222394 224125
56387B24125J486J033L09l65k99L66N56p2l91M79J812K414K222J843J444J028
$$ 224125 225611 226644 226953 226588 226289 226655 227211 227139 226748 227227 229039 231453 233675 235518 236962 237990
56371B37990J025J636K266K422K401K352J635L8j301j314m89J27N38J218J805
$$ 237990 239015 240651 242917 245339 247740 250092 251727 251765 250464 249150 248661 248788 249326 250544 252349
56356B52349J665J180J166J517J601J480J605J785J663J638K194K813K758K302
$$ 252349 254014 255194 256360 257877 259478 260958 262563 264348 266011 267649 269843 272656 275414 277716
56342B77716K066J726P58j26J35J140J500R23L74L84N77P77J198J658J847K157
$$ 277716 279782 281508 282266 282140 282275 283415 284915 285838 286212 286596 287173 287950 289148 290806 292653 294810
56326B94810L031L789L488K733K987M241M934M310L257K562J941J247J177K067
$$ 294810 297841 301630 305118 307851 310838 315079 320013 324323 327580 330142 332083 333330 334507 336574
56312C36574L080L297K794K185J895K241L414M900N722N599N299N519O078O440
$$ 336574 339654 342951 345745 347930 349825 352066 355480 360380 366102 371701 377000 382519 388597 395037
56298C95037O499O559O932P635Q231Q112P337O807P110P645P605P298P603Q581
$$ 395037 401536 408095 415027 422662 430893 439005 446342 453149 460259 467904 475509 482807 490410 498991
56284D98991R574J0381J1213J1820J1835J1765J2501J3903J5000J5523J6105J6995
$$ 498991 508565 518946 530159 541979 553814 565579 578080 591983 606983 622506 638611 655606
56272F55606J7778J8393J9346K0677K1768K2380K3060K4271K5913K7716K9473
$$ 655606 673384 691777 711123 731800 753568 775948 799008 823279 849192 876908 906381
56261I06381L0977L2428L4711L8361M2537M5965M8786N2417N7748O4464P1980
$$ 906381 937358 969786 1004497 1042858 1085395 1131360 1180146 1232563 1290311 1354775 1426755
56250A426755P9960Q7913R5332J02443J09956J17996J25873J32779J38032J40991
$$ 1426755 1506715 1594628 1689960 1792403 1902359 2020355 2146228 2279007 2417039 2558030
56240B558030J41477J39910J36279J29560J19038J05414Q9586P1143M9522K5921
$$ 2558030 2699507 2839417 2975696 3105256 3224294 3329708 3419294 3490437 3539959 3565880
56230C565880K404k0308m2464o3282q1160r5681j07538j16679j22415j25268j26732
$$ 3565880 3568284 3547976 3505512 3442230 3361070 3265389 3157851 3041172 2918757 2793489 2666757
56219B666757j27034j25048j20630j15245j09902j04282r8246r2480q7075q1186
$$ 2666757 2539723 2414675 2294045 2178800 2068898 1964616 1866370 1773890 1686815 1605629
56209A605629p4651o8512o3391n8725n4080m9801m6004m2249l8602l5666l3266
$$ 1605629 1530978 1462466 1399075 1340350 1286270 1236469 1190465 1148216 1109614 1073948 1040682
56198A040682l0462k7184k4446k2634k1013j9176j7530j6056j4174j2068j0659
$$ 1040682 1010220 983036 958590 935956 914943 895767 878237 862181 848007 835939 825280
56187H25280r967r125q140p902q185p601n952m697m467m125l025k228k479k749
$$ 825280 815313 806188 798048 790146 781961 774360 768408 763711 759244 755119 752094 749866 747387 744638
56173G44638j975p02J20O52J406K160K508K556K415K029J952K937M514N387N588
$$ 744638 742663 741961 742081 742733 744139 746299 748807 751363 753778 755807 757759 760696 765210 770597 776185
56158G76185O507Q322R342Q710P861Q370R884J1321J2593J4104J5761J7504J9683
$$ 776185 782692 791014 800356 809066 816927 825297 835181 846502 859095 873199 888960 906464 926147
56145I26147K2236K4608K6966L0257L4688L9468M4292M9500N4603N8469O1213
$$ 926147 948383 972991 999957 1030214 1064902 1104370 1148662 1198162 1252765 1311234 1372447
56134A372447O3684O4814O2005N4974M6843M0325L5250L0945K8367K7970K7580
$$ 1372447 1436131 1500945 1562950 1617924 1664767 1705092 1740342 1771287 1799654 1827624 1855204
56123A855204K4514J8563J1341M109k329p058r992j2332j5112j8449k2868k9511
$$ 1855204 1879718 1898281 1909622 1913731 1911402 1904344 1894352 1882020 1866908 1848459 1825591 1796080
56111A796080l7948m5599n0498n3003n3800n2279m8250m3246l8617l3941k8709
$$ 1796080 1758132 1712533 1662035 1609032 1555232 1502953 1454703 1411457 1372840 1338899 1310190
56100A310190k3886k0272j7128j3748j0819q739o384l034O4J559J925K243K637
$$ 1310190 1286304 1266032 1248904 1235156 1224337 1215598 1209214 1206180 1206244 1207803 1209728 1211971 1214608
56087A214608L124M328O087P091P064P496R106J0556J0940J1327J2539J3557J3605
$$ 1214608 1217732 1222060 1228147 1235238 1242302 1249798 1258904 1269460 1280400 1291727 1304266 1317823 1331428
56074A331428J3631J4259J4475J3921J4085J5672J7086J7285J7658J9275K0688
$$ 1331428 1345059 1359318 1373793 1387714 1401799 1417471 1434557 1451842 1469500 1488775 1509463
56063A509463K0583K0142K0813K1921K2599K3707K5815K7528K7910K8289K9713
$$ 1509463 1530046 1550188 1571001 1592922 1615521 1639228 1665043 1692571 1720481 1748770 1778483
56052A778483L0981L1204L1694L3241L4208L3606L3276L4723L6443L6916L7388
$$ 1778483 1809464 1840668 1872362 1905603 1939811 1973417 2006693 2041416 2077859 2114775 2152163
56041B152163L9200M1207M2473M4493M8002N0616N0756N0855N3531N7488O0422
$$ 2152163 2191363 2232570 2275043 2319536 2367538 2418154 2468910 2519765 2573296 2630784 2691206
56030B691206O3024O6731P0445P3032P6173Q1233Q6182Q9208R2386R8113J04948
$$ 2691206 2754230 2820961 2891406 2964438 3040611 3121844 3208026 3297234 3389620 3487733 3592681
56019C592681J10804J17195J26262J36582J46004J55702J67284J78933J88621
$$ 3592681 3703485 3820680 3946942 4083524 4229528 4385230 4552514 4731447 4920068
56010D920068J98166K10073K23487K37325K53745K74051K94759L12354L28209
$$ 4920068 5118234 5328307 5551794 5789119 6042864 6316915 6611674 6924028 7252237
56001G252237L44281L58232L68141L77685L91082M06906M22603M40667M64124
$$ 7252237 7596518 7954750 8322891 8700576 9091658 9498564 9921167 10361834 10825958
55992A0825958M90320N15731N42546N73687O05564O32634O54766O73500O86467
$$ 10825958 11316278 11832009 12374555 12948242 13553806 14186440 14841206 15514706 16201173
55983A6201173O93328P01873P19794P45436P74711Q11047Q59148R15218R73652
$$ 16201173 16894501 17596374 18316168 19061604 19836315 20647362 21506510 22421728 23395380
55974B3395380J037384J110835J189365J267623J351939J451875J566245J691142
$$ 23395380 24432764 25543599 26732964 28000587 29352526 30804401 32370646 34061788
55966C4061788J834834K010259K220325K466439K763584L129364L566342M074320
$$ 34061788 35896622 37906881 40127206 42593645 45357229 48486593 52052935 56127255
55958E6127255M672038N387756O239870P248609Q450082R865639J1465437J3187212
$$ 56127255 60799293 66187049 72426919 79675528 88125610 97991249 109456686 122643898
55950A22643898J4967753J6719624J8312444J9628612K0558045K0772138J9507251
$$ 122643898 137611651 154331275 172643719 192272331 212830376 233602514 253109765
55943B53109765J5844757R498199J372333o785865j3385717j7723244j9938686
$$ 253109765 268954522 278452721 279825054 273039189 259653472 241930228 221991542
55936B21991542k0538178k0037536j8864706j7343560j5675747j3970339j2306021
$$ 221991542 201453364 181415828 162551122 145207562 129531815 115561476 103255455
55929A03255455j0749408r334704q068644o958242o011032n214759m542176l974374
$$ 103255455 92506047 83171343 75102699 68144457 62133425 56918666 52376490 48402116
55921D8402116l501513l106596k768384k477305k231948k023331j837817j671806
$$ 48402116 44900603 41794007 39025623 36548318 34316370 32293039 30455222 28783416
55913B8783416j528863j405364j292397j188590j097975j017964r41816q70457
$$ 28783416 27254553 25849189 24556792 23368202 22270227 21252263 20310447 19439990
55905A9439990q09906p59079p11356o66210o28270n96368n64069n30266m99677
$$ 19439990 18630084 17871005 17159649 16493439 15865169 15268801 14704732 14174466 13674789
55896A3674789m73525m48609m24859m05237l88767l71542l53981l39633l27638
$$ 13674789 13201264 12752655 12327796 11922559 11533792 11162250 10808269 10468636 10140998
55887A0140998l13711k97820k83847k72317k60183k47053k35219k24461k13151
$$ 10140998 9827287 9529467 9245620 8973303 8713120 8466067 8230848 8006387 7793236
55878G793236k03465j99041j98247j95962j91225j87030j83630j78401j71663
$$ 7793236 7589771 7390730 7192483 6996521 6805296 6618266 6434636 6256235 6084572
55869F084572j66317j62086j56004j48314j41953j36611j29237j20241j13290
$$ 6084572 5918255 5756169 5600165 5451851 5309898 5173287 5044050 4923809 4810519
55860D810519j08826j03654r7264r2839r1349q9978q7351q5305q4564q3353q1297
$$ 4810519 4701693 4598039 4500775 4407936 4316587 4226609 4139258 4053953 3969389 3886036 3804739
55849C804739q0286q0493p9610p6867p4025p1704o8538o4513o1485n9788n7870
$$ 3804739 3724453 3643960 3564350 3487483 3413458 3341754 3273216 3208703 3147218 3087430 3029560
55838C029560n5646n4679n4727n3641n1111m9045m8061m6872m5406m5014m5461
$$ 3029560 2973914 2919235 2864508 2810867 2759756 2710711 2662650 2615778 2570372 2525358 2479897
55827B479897m5065m3944m3706m3951m2751m0592m0046m1270m1649m0314l9157
$$ 2479897 2434832 2390888 2347182 2303231 2260480 2219888 2179842 2138572 2096923 2056609 2017452
55816B017452l8834l7675l5370l3968l4114l3812l2095l0484k9715k8307k5737
$$ 2017452 1978618 1940943 1905573 1871605 1837491 1803679 1771584 1741100 1711385 1683078 1657341
55805A657341k3808k3445k3040k1495k0121j9977j9834j8476j6791j6135j6407
$$ 1657341 1633533 1610088 1587048 1565553 1545432 1525455 1505621 1487145 1470354 1454219 1437812
55794A437812j7058j8096j9139j9181j8199j7316j6761j5600j3991j3591j4862
$$ 1437812 1420754 1402658 1383519 1364338 1346139 1328823 1312062 1296462 1282471 1268880 1254018
55783A254018j6032j5702j4736j4741j6092j8193k0236k1276k0850j9736j8814
$$ 1254018 1237986 1222284 1207548 1192807 1176715 1158522 1138286 1117010 1096160 1076424 1057610
55772A057610j7499j4963j2273j1144j0802q894n565m069o652j2086j7774k2097
$$ 1057610 1040111 1025148 1012875 1001731 990929 982035 976470 972401 965749 953663 935889 913792
55760I13792k4270k4165k2960k2156k1541j9918j7739j6777j7147j7126j6152
$$ 913792 889522 865357 842397 820241 798700 778782 761043 744266 727119 709993 693841
55749F93841j5452j5333j4557j2950j2022j2212j2051j0861r835r587r072p846
$$ 693841 678389 663056 648499 635549 623527 611315 599264 588403 578568 568981 559909 552063
55737E52063p065p243p346p052p487q728r002p683o691p469q802r098q802q901
$$ 552063 544998 537755 530409 523357 515870 507142 498140 490457 483766 476297 467495 458397 449595 440694
55723D40694q986q429p903q083q258p643o746o218n664m705l861l362k523j244
$$ 440694 431708 423279 415376 407293 399035 391392 384646 378428 372764 368059 364198 360836 358313 357069
55709C57069n97r03q84J90J099N48j057k787m519o045o504n914n746o764p783
$$ 357069 356472 355569 354685 354875 355974 356522 355465 352678 348159 342114 335610 329696 323950 317186 309403
55694C09403p735p313p263o834n405m156m284m936m581l398k559k163j547q61
$$ 309403 301668 294355 287092 280258 274853 270697 266413 261477 256896 253498 250939 248776 247229 246368
55680B46368p70j132j289j209j253j405j620k202l012l168k350j524j560k056
$$ 246368 245598 244466 243177 241968 240715 239310 237690 235488 232476 229308 226958 225434 223874 221818
55666B21818k305k344k281j705p17k60o18p58j67N9r01k014k024j398j224j314
$$ 221818 219513 217169 214888 213183 212466 212206 211588 210830 210663 210722 209821 207807 205783 204385 203161 201847
55650B01847r44m86p35j407j789k107k845l371k792j568q78r08j014j171j846
$$ 201847 200903 200417 199682 198275 196486 194379 191534 188163 185371 183803 182925 182017 181003 179832 177986
55635A77986k837l467l730m130m589m510l752k795k125k031k590l323l441k940
$$ 177986 175149 171682 167952 163822 159233 154723 150971 148176 146051 144020 141430 138107 134666 131726
55621A31726k715l073l084k053o93j4lk30p70j553j824j335j079j784k553k261
$$ 131726 129011 125938 122854 120801 120108 120094 120091 119861 119091 117538 115714 114379 113300 111516 108963 106702
55605A06702j326q81r67r32q40j086j242o99K7k0o77j018q82q11q03m46J9l1n06
$$ 106702 105376 104495 103528 102596 101756 100670 99428 98729 98756 98736 98059 97041 96159 95348 94545 94099 94118 94087 93581
55586I3581q06q56r46p98M6J204J797J690J414J186Q50N50N04M12j3k81K20J147
$$ 93581 92775 91919 90973 90175 90221 91425 93222 94912 96326 97512 98362 98912 99416 99828 99815 99534 99754 100901
55568A00901J674J719J771J834J538J002O21K95k47o52m79k44q82k265l265l238
$$ 100901 102575 104294 106065 107899 109437 110439 111060 111355 111108 110456 109977 109733 108851 106586 103321 100083
55552A00083k654k216k158k371k663k822k844k874k733j982q31k31n27q30m30
$$ 100083 97429 95213 93055 90684 88021 85199 82355 79481 76748 74766 73935 73704 73177 72347 71917
55537G1917O4j35n64l41L24O35O35Q61J118Q38L47M28R38J037N03k69j252k524
$$ 71917 71981 71846 71282 70941 71265 71900 72535 73396 74514 75352 75699 76127 77065 78102 78605 78336 77084 74560
55519G4560l310k720j348p99j504k209j809o06M55Q49N79K4k06N3Q0p42j800k029
$$ 74560 71250 68530 67182 66383 64879 62670 60861 60255 60710 61559 62138 62162 61956 62009 62089 61347 59547 57518
55501E7518j542j310j441j129l62j99r23j288l12J108J379L24o89n43L61P56P8
$$ 57518 55976 54666 53225 52096 51734 51535 50612 49324 49012 50120 51499 51823 51134 50591 50952 51708 51786
55484E1786q81r62r7O90P25M34L46K00l39q01o06j36r9l15r8M17M56l5k25L06
$$ 51786 50905 49943 49846 50536 51261 51695 52041 52241 51902 51101 50495 50359 50260 49945 49847 50264 50720 50685 50460 50766
55464E0766J019J193O20l90j159r34K14J175J104N72N73R18O77j81q01q97r00
$$ 50766 51785 52978 53598 53208 52049 51115 51329 52504 53608 54180 54753 55671 56348 56167 55366 54469 53569
55447E3569q03j72O25N82k62o52JP30N98O8M1M15M21r4n70n84k17K30M99M11o
$$ 53569 52766 52594 53219 53801 53539 52887 52888 53618 54216 54284 54325 54740 55161 55067 54497 53913 53696 53926 54425 54836 54830
55426E4830n23q74r13o80m05k78j40K79P20N14k88o62NR15J032O07N62R35J057
$$ 54830 54307 53433 52520 51840 51435 51157 51017 51296 52016 52530 52242 51580 51585 52500 53532 54139 54701 55636 56693
55407E6693R19J091J433J114pj105j686k085k519k608k074j187k84M58O64N4q61
$$ 56693 57612 58703 60136 61250 61243 60138 58452 56367 53848 51240 49166 47979 47695 48153 48817 48871 48010
55390D8010j108m26N72J385J996K239J769P59j34o28r18r17l37M59O07q6r54j550
$$ 48010 46902 46476 47048 48433 50429 52668 54437 55196 55062 54434 53516 52599 52262 52721 53328 53242 52288 50738
55372E0738j954j988j202O1O96L55o9J46O03P46P74R53R20L63k17j98K31M31J92
$$ 50738 48784 46796 45594 45655 46351 46706 46637 46783 47386 48132 48906 49859 50779 51142 50925 50727 50958 51389 51581
55353E1581k51p01j009r74o26k77k3L64Q49R49M89m4j81q7l8J08M76O62K75l33
$$ 51581 51330 50629 49620 48646 48020 47743 47720 48084 48933 49882 50371 50327 50146 50059 50021 50129 50605 51267 51542 51209
55333E1209m49L0M80M10Pk47k12j52k41k84o5K19K41J11K55O14O59L08J52L99
$$ 51209 50760 50790 51270 51680 51687 51440 51228 51076 50835 50551 50486 50705 50946 51057 51312 51926 52585 52893 53045 53444
55313E3444M20m4j54P47J860J984J227M68j83j082j665j028K29L91r02k106k037
$$ 53444 53864 53820 53666 54413 56273 58257 59484 59952 59769 58687 57022 55994 56223 56614 55712 53606 51569
55296E1569j244o54j90M77R56Q19M55M77P65P80L61k07n66m91k7M24N96P71J182
$$ 51569 50325 49671 49481 49958 50914 51733 52188 52665 53430 54210 54571 54364 53798 53307 53280 53704 54300 55071 56253
55277E6253J302O03l19m39P2K19M7N58J631J717K00j494j932j434r67n43J66P43
$$ 56253 57555 58158 57839 57400 57472 57691 57738 58296 59927 61644 61844 60350 58418 56984 56017 55474 55640 56383
55259E6383P00M57N70O50P6q18j211j035q55r13r44o70O2J171K011J815Q23J87
$$ 56383 57083 57540 58110 58760 58836 58018 56807 55772 54917 54004 53060 52390 52452 53623 55634 57449 58272 58459
55241E8459L23L44l46r39o00J12K66J24M67J043R42J49n46q50j100j257r35k99
$$ 58459 58782 59126 58780 57841 57241 57353 57619 57743 58210 59253 60195 60344 59798 58948 57848 56591 55656 55357
55223E5357k1k02k69P3M77O19N50L77J39NJ16K32j4o00j193j600j777j618j075
$$ 55357 55336 55134 54865 54938 55415 56034 56584 56961 57100 57105 57221 57453 57439 56839 55646 54046 52269 50651 49576
55204D9576l47M02J208J921K083J559Q69M78K13j36j76M48J236J373Q11J90j25
$$ 49576 49229 49631 50839 52760 54843 56402 57271 57749 57962 57826 57650 58098 59334 60707 61518 61708 61583
55187F1583k81l94l85l01l05m11n29o51p03m67J5K70J0l87l05L39J123J581J415
$$ 61583 61302 60908 60523 60222 59917 59506 58977 58326 57623 57156 57171 57441 57451 57064 56759 57098 58221 59802 61217
55168F1217O14l05o09j77L43M20K22O2r1k56k20l8j01l52j71M70O19k29j138r67
$$ 61217 61831 61526 60917 60740 61083 61503 61725 61787 61696 61440 61220 61182 61081 60729 60558 61028 61647 61418 60280 59313
55148E9313M8P92P71K52m86j142j113j78Q77J178R30Q59Q98M61k88n16k3M99M92
$$ 59313 59361 60153 60924 61176 60690 59548 58435 58257 59134 60312 61242 62101 62999 63460 63172 62656 62633 63132 63624
55129F3624J68L3L71J131J843J789P96l80r17q41o26l97j48k23p71j157p41R9
$$ 63624 63792 63825 64196 65327 67170 68959 69755 69375 68458 67617 66991 66594 66446 66223 65452 64295 63554 63653
55111F3653N18M14K62J16l12q47j046r56q28m07N79J517J565R55O69Q70Q00J93
$$ 63653 64171 64585 64847 64963 64651 63804 62758 61802 60974 60567 61146 62663 64228 65183 65852 66722 67522 67715
55093F7715k74r9L81O40N78L49J63K53M86L04l99p83k25N72O14K69N40J193J140
$$ 67715 67441 67342 67723 68363 68941 69290 69453 69706 70192 70496 70097 69314 69089 69661 70275 70544 71084 72277 73417
55074G3417N19O33J586J824N82p67p43J26L26m55j212j149l54O23J189R49Q2o92
$$ 73417 73936 74569 76155 77979 78561 77794 77051 77177 77503 77048 75836 74687 74333 74956 76145 77094 77176 76484
55056G6484q45m93n2J99J05k46l25L28J260J426N57n06r67r01o44k18K88M76K05
$$ 76484 75639 75146 75094 75293 75398 75152 74827 75155 76415 77841 78398 77892 76925 76024 75380 75162 75450 75926 76131
55037G6131j40l17o21j270j961k272k049j171L08J641J823R00K8j30j77p04j170
$$ 76131 75991 75674 75053 73783 71822 69550 67501 66330 66638 68279 70102 71002 71030 70900 70723 70019 68849
55020F8849q56r9L11M25Q19J426J575J038L07j09n9M29J141J595J445Q93K91m15
$$ 68849 67993 67894 68205 68630 69449 70875 72450 73488 73795 73686 73627 74056 75197 76792 78237 79130 79421 79006
55002G9006j370k164k127j231j65N19R15J300J619J561J052M29J32K30L32Q1l73
$$ 79006 77636 75472 73345 72114 71949 72468 73383 74683 76302 77863 78915 79344 79476 79706 80038 80119 79746
54985G9746n82l57J60Q46J565J857J256M9q39r39o98o76p65o40l63j31J64O15
$$ 79746 79164 78807 78967 79813 81378 83235 84491 84540 83701 82762 82064 81388 80623 79983 79620 79489 79653 80268
54967H0268Q78O19Q7k47l71n75p67n84o9K89K79K50N10Q20P39K87m9R9N41Q01
$$ 80268 81146 81765 81852 81605 81234 80659 79892 79308 79239 79528 79807 80057 80567 81387 82126 82413 82364 82463 83004 83805
54947H3805P11N07L18p4p46j200r10j76J58j63m83k15L94P54P35N97M41K01mJ05
$$ 83805 84516 85023 85341 85267 84521 83321 82411 82235 82393 82230 81747 81532 81926 82680 83415 84012 84453 84654 84650 84755
54927H4755N45R52Q96K80n02q12l09P46J836K782L659M276M228L555K891K717
$$ 84755 85300 86252 87148 87428 86926 86114 85805 86551 88387 91169 94828 99104 103332 106887 109778 112495
54911A12495K836K838K682K489K112J275P6r81j430j197p07o96j643l168m246
$$ 112495 115331 118169 120851 123340 125452 126727 126803 125822 124392 123195 122488 121792 120149 116981 112735
54896A12735m258l625l143k944k501j565o47l73o63q77o69l49k86k56J87Q83J196
$$ 112735 108477 104852 101709 98765 96264 94699 94052 93679 93016 92139 91470 91121 90835 90579 90766 91649 92845
54879I2845J052J172J935K627K408J616J350J977K810L218L308L394L434L231
$$ 92845 93897 95069 97004 99631 102039 103655 105005 106982 109792 113010 116318 119712 123146 126377
54865A26377K783K183J498P67p8j209k529l513l840l852l894l667k906k298k614
$$ 126377 129160 131343 132841 133608 133530 132321 129792 126279 122439 118587 114693 111026 108120 105822 103208
54850A03208l190k554o41Q21N61p40j708j976j990j970j902j913k014j844j249
$$ 103208 100018 97464 96823 97644 98205 97465 95757 93781 91791 89821 87919 86006 83992 82148 80899
54835H0899o12j86K71P85Q18J75m33m05j58l09n97m54p3J3o6J47M63L77R7K28
$$ 80899 80287 80101 80372 81157 81975 82150 81717 81312 81154 80845 80248 79794 79721 79734 79668 79815 80278 80655 80752 80980
54815H0980O50O66K24K4L14N45M13M13R34J479J267K81p27j018m54M46R52O88
$$ 80980 81630 82296 82520 82544 82858 83403 83816 84229 85163 86642 87909 88190 87463 86445 85991 86437 87389 88077
54797H8077p4p58r73o31J82J106J558J249O05K60L03L43J55r2k36k87l02l81o37
$$ 88077 88003 87245 86272 85641 85823 86929 88487 89736 90341 90601 90904 91247 91402 91310 91074 90787 90485 90104 89467
54778H9467r22p33J51J160J512J191Q56Q87J090J330J775K418K859K853K663K635
$$ 89467 88545 87812 87963 89123 90635 91826 92682 93569 94659 95989 97764 100182 103041 105894 108557 111192
54762A11192K720K695K528K391K456K778L232L453L085K180J189M20k05q64j533
$$ 111192 113912 116607 119135 121526 123982 126760 129992 133445 136530 138710 139899 140319 140114 139250 137717
54747A37717k112k647l199l643l782l580l095k318j297m15k53r26j726j735q83
$$ 137717 135605 132958 129759 126116 122334 118754 115659 113341 112044 111629 111376 110450 108724 106989 106106
54732A06106j11k57j021j434j165q24r27j078n69O37J862K544K708K678K644K583
$$ 106106 105995 105738 104717 103283 102118 101294 100367 99289 98720 99357 101219 103763 106471 109149 111793 114376
54716A14376K476K418K541K760K759K357J853J662J681J265M0j595k871l382l338
$$ 114376 116852 119270 121811 124571 127330 129687 131540 133202 134883 136148 136188 134593 131722 128340 125002
54701A25002l254l468l801l655k750j690j423k052k638k353j409o06l35l67l61
$$ 125002 121748 118280 114479 110824 108074 106384 104961 102909 100271 97918 96509 95903 95568 95201 94840
54686I4840k89l75p41j067p90J33Q83P23O2r6L49M98r1p72r53q71p88l57N40J194
$$ 94840 94551 94176 93435 92368 91578 91711 92594 93317 93379 93283 93632 94130 94039 93267 92314 91443 90655 90298 90838 92032
54666I2032J056O24N03L31m39j306j375q02m97o09m89L1L56J68j80m09n46m17
$$ 92032 93088 93712 94215 94546 94107 92801 91426 90624 90127 89518 89029 89060 89416 89584 89404 88995 88449 88032
54648H8032K22R43R67L73Q9M58P45L98m4J18O40Q20N48L35N01Q87J169J093O11
$$ 88032 88254 89197 90164 90537 90626 91084 91829 92227 92183 92301 92941 93761 94309 94644 95145 96032 97201 98294 98905
54629I8905k1m09m47l36j50K08N16K45o68j461j418p53k62l28o56p84n47n2M22
$$ 98905 98884 98475 98028 97692 97542 97750 98266 98511 97843 96382 94964 94211 93949 93621 92965 92181 91634 91582 92004
54610I2004N46K31j83k32J40N35O13N06N52P04M24o01j795k120j225J24J001J272
$$ 92004 92550 92781 92598 92366 92506 93041 93654 94160 94712 95416 95840 95239 93444 91324 90099 90223 91224 92496
54592I2496J359J379J063M47K8J55O34J031J066O71m7p53j095j055q52n68j24
$$ 92496 93855 95234 96297 96744 96772 96927 97561 98592 99658 100329 100282 99529 98434 97379 96527 95959 95835
54575I5835L30M33J31j39l8J84J1o15j223j343r77n18l26m51o60o85l90K12R67
$$ 95835 96165 96598 96729 96590 96552 96736 96747 96132 94909 93566 92589 92071 91745 91294 90634 89949 89559 89771 90738
54556I0738J567J741J492J101Q17O31L98M8l12l83J92J339K300K242J174j29j066
$$ 90738 92305 94046 95538 96639 97456 98087 98485 98533 98221 97838 98030 99369 101669 103911 105085 104956 103890
54539A03890j564j444m20J045J686R95J10K71J055J116K74l39j45J49j01n27o04
$$ 103890 102326 100882 100462 101507 103193 104188 104298 104569 105624 106740 107014 106675 106530 106679 106578 106051 105447
54522A05447o02r85j541j722j469j143q87n55j18K70N53P51P59M24j93p84j033
$$ 105447 104845 103860 102319 100597 99128 97985 97098 96543 96425 96695 97248 97999 98758 99182 98989 98205 97172
54505I7172q35l57N0J40j3j24k9J76L27L70L22K09P3qR2M41Q52Q81K80n43q84
$$ 97172 96337 95980 96030 96170 96157 96033 96004 96180 96507 96877 97199 97408 97481 97473 97565 98006 98858 99739 100019 99476 98592
54484I8592o03k31r6Q2M61N81J15m17l67M2J83J52N59J329J650J204O25N41P99
$$ 98592 97989 97758 97662 97744 98205 98786 98901 98484 98117 98159 98342 98494 99053 100382 102032 103236 103861 104402 105201
54465A05201R28P35J97o97j682k151j713n89O08J282J145N16K19P24J412J242
$$ 105201 106129 106864 107061 106364 104682 102531 100818 100229 100837 102119 103264 103780 103999 104723 106135 107377
54449A07377J42q83j102q30o92q00r04q63n83N0P89J081P41K69J64L48N13O23
$$ 107377 107519 106636 105534 104704 104012 103212 102308 101445 100862 100912 101701 102782 103523 103792 103956 104304 104817 105440
54431A05440P40P17M43J46N3L8j15l26l96l83m36m35j29M78J112J538J718J647
$$ 105440 106180 106897 107340 107486 107539 107577 107462 107136 106740 106357 105921 105486 105357 105835 106947 108485 110203 111850
54413A11850J280O53l0m64n28m21m62o22n73k64j36m10n42J16J286K009J837J255
$$ 111850 113130 113783 113753 113289 112761 112340 111878 111256 110683 110419 110283 109873 109331 109447 110733 112742 114579 115834
54395A15834Q95R15J176J491J531J015K35j22J95P15R25Q08N42J57k76n31n54
$$ 115834 116729 117644 118820 120311 121842 122857 123092 122970 123165 123880 124805 125613 126155 126312 126036 125505 124951
54378A24951n85o98o34l27k50q23j685j955j197Q2R78J144J128J609K406K641
$$ 124951 124366 123668 123034 122707 122457 121634 119949 117994 116797 116879 117857 119001 120129 121738 124144 126785
54362A26785J994J226J072J162P50P8M0O76J062P99O39J298K422L197L321K971
$$ 126785 128779 130005 131077 132239 132989 133067 133107 133783 134845 135644 136283 137581 140003 143200 146521 149492
54346A49492K324J488N66m11j314j681j217m92m76j287k099k435k673l051l071
$$ 149492 151816 153304 153870 153459 152145 150464 149247 148755 148279 146992 144893 142458 139785 136734 133663
54331A33663k408j577j161r71n53RL44M11L25L5l79n61m38m36p48r36p18n01o27
$$ 133663 131255 129678 128517 127546 126993 127002 127346 127757 128082 128117 127738 127177 126739 126303 125555 124619 123901 123400 122773
54312A22773p36m92l43q14j543j775j462j056o39j3N67N83J15j94l6L09N30N68
$$ 122773 122037 121545 121202 120388 118845 117070 115608 114552 113913 113900 114467 115050 115165 114971 114935 115244 115774 116342
54294A16342M24J69J06M42Q59Q78N12J83N4m4j44p9Q5Om30q47p56m6Q61J249P44
$$ 116342 116766 116935 117041 117483 118342 119220 119732 119915 119969 119925 119781 119702 119787 119793 119363 118516 117760 117714 118575 119824 120568
54273A20568k04o49j93N96R56Q07N83N41N98N58K81k26n75k19Q33J795J939J395
$$ 120568 120364 119715 119522 120118 121074 121881 122464 123005 123603 124161 124442 124216 123641 123422 124255 126050 127989 129384
54255A29384Q74Q13J055J041K41j211k201j592K59J620J418M27j47l77j009j814
$$ 129384 130258 131071 132126 133167 133408 132197 129996 128404 128663 130283 131701 132128 131981 131604 130595 128781
54239A28781j773p69Q5j01r82j636j549p99K19R95J191R17M66q9p70j301j228
$$ 128781 127008 126239 126324 126223 125241 123605 122056 121257 121476 122471 123662 124579 125045 124956 124186 122885 121657
54222A21657m62N76J291J314O82j02m31k39l1j24k17l1J41q7n27p90r27j162j273
$$ 121657 121195 121771 123062 124376 125058 124956 124525 124286 124255 124131 123914 123883 124024 123937 123410 122620 121693 120531 119258
54203A19258q47J9P28Q37L41m62j024q83k82o3n02p65n2J191J918J815J298N72
$$ 119258 118411 118430 119158 119995 120336 119874 118850 117967 117685 117622 117120 116355 116303 117494 119412 121227 122525 123097
54185A23097l44r56o96O5L52m9l34O9P46J008P10J88j87k16J0J68J31J83M22L71
$$ 123097 122753 121797 121101 121166 121518 121469 121135 121204 121950 122958 123668 123856 123669 123453 123463 123631 123762 123945 124367 124738
54165A24738l17j104j175n90r0J8L1N9r8l47l44j60j83l58l11j67m11q73p92k8
$$ 124738 124421 123317 122142 121552 121462 121480 121511 121570 121472 121125 120781 120621 120438 120080 119769 119602 119191 118318 117526 117498
54145A17498O10N48J84Q5J80J95K65O52J190J415J058K74l80k67O29J438J268
$$ 117498 118108 118656 118840 118925 119105 119300 119565 120217 121407 122822 123880 124154 123774 123507 124136 125574 126842
54128A26842L12m80o28m02rO21J226J278Q54O57Q93R18L27l84o56o23o07n16k90
$$ 126842 127154 126674 126046 125644 125635 126256 127482 128760 129614 130271 131164 132082 132409 132025 131369 130746 130139 129623 129333
54109A29333l02p38j039o02K96Q17O59K74K07M94P67O91L56K13M93P88O02J78
$$ 129333 129031 128293 127254 126652 126948 127765 128424 128698 128905 129399 130166 130857 131213 131426 131919 132707 133309 133487
54091A33487J70N43N52m8n03k28K91L31J05L23R49J144M94l11k73P43J834K018
$$ 133487 133657 134200 134752 134704 134201 133973 134264 134595 134700 135023 135972 137116 137610 137299 137026 137769 139603 141621
54073A41621J295O09P46J454J912J820J565J410J138N97J00M2N48J591L011M287
$$ 141621 142916 143525 144271 145725 147637 149457 151022 152432 153570 154167 154267 154309 154857 156448 159459 163746
54057A63746M768M350L474K343Q12q21j620j235o26q78j628j564k90J108J534
$$ 163746 168514 172864 176338 178681 179493 178672 177052 175817 175191 174313 172685 171121 170831 171939 173473
54042A73473J183R78J207J308Q89M18O58J683K839L557L902M207M485M411L734
$$ 173473 174656 175634 176841 178149 179038 179456 180114 181797 184636 188193 192095 196302 200787 205198 208932
54027B08932K592J528J188J730K497K597J909J099O07K09j61qP75J256N81q05
$$ 208932 211524 213052 214240 215970 218467 221064 222973 224072 224679 224888 224727 224719 225494 226750 227331 226526
54011B26526j828k277k674l070l043k726k714l011l069k965l421m458m990m181
$$ 226526 224698 222421 219747 216677 213634 210908 208194 205183 202114 199149 195728 191270 186280 182099
53997A82099k445p70K21K69o17j816k374k007j341r31o28j94J78K73K03on02j046
$$ 182099 179654 178884 179105 179374 178757 176941 174567 172560 171219 170288 169660 169466 169644 169917 170120 170114 169612 168566
53979A68566j006k93L28K80l1Q7O61J218J462J385J067P19O03P29Q92J122J590
$$ 168566 167560 167267 167595 167875 167844 167931 168592 169810 171272 172657 173724 174443 175046 175775 176667 177789 179379
53962A79379K086K141J747J374J177Q68M42K48K41K6k82j01M64N74P8j36L70Q03
$$ 179379 181465 183606 185353 186727 187904 188772 189214 189462 189703 189729 189447 189346 189810 190384 190462 190326 190696 191499
53944A91499N33K02O23J486K111K639L505M382M633M329L900L284K313J514J546
$$ 191499 192032 192234 192857 194343 196454 199093 202598 206980 211613 215942 219842 223126 225439 226953 228499
53929B28499K177K630K670K582K462K291K391K981L573L678L763M607N935O774
$$ 228499 230676 233306 235976 238558 241020 243311 245702 248683 252256 255934 259697 264304 270239 277013
53915B77013P009P565Q874J0075J0140R088P693O435N079L098L41k481m173m163
$$ 277013 284022 291587 300461 310536 320676 329764 337457 343892 348971 352069 352410 349929 345756 341593
53901C41593l228k730l226m144m721m842m845m932m981m848m631m580m760m957
$$ 341593 338365 335635 332409 328265 323544 318702 313857 308925 303944 299096 294465 289885 285125 280168
53887B80168n008m996m926m540l849l527m056m808m762m046l704l948l806k786
$$ 280168 275160 270164 265238 260698 256849 253322 249266 244458 239696 235650 231946 227998 224192 221406
53873B21406j743j515j769j845j828k023k179k021j810j722j388p60n72j163j738
$$ 221406 219663 218148 216379 214534 212706 210683 208504 206483 204673 202951 201563 200803 200231 199068 197330
53858A97330j695j764k700l729l589k474j557j109n28J13Q0m87n60R1M70q3r19
$$ 197330 195635 193871 191171 187442 183853 181379 179822 178713 178185 178298 178378 177891 177331 177422 177892 177809 176890
53841A76890j113n85J00M19J11o19j072p09O6M06K26K25P51J319J406J039N58
$$ 176890 175777 175192 175292 175711 175822 175203 174131 173422 173488 173894 174120 174345 175096 176415 177821 178860 179418
53824A79418K64L48P17Q68M52k17n63n12l48j13L11P66J071J411J884K023J457
$$ 179418 179682 180030 180747 181615 182067 181850 181287 180775 180427 180314 180625 181391 182462 183873 185757 187780 189237
53807A89237P81Q75J620K123K050J919K151K626L129L501L522L231L165L614L971
$$ 189237 190018 190893 192513 194636 196686 198605 200756 203382 206511 210012 213534 216765 219930 223544 227515
53792B27515L600K891K559K359J556M00j93j98m72j175j499j071n16l52m74q88
$$ 227515 231115 234006 236565 238924 240480 240880 240687 240489 240017 238842 237343 236272 235756 235404 234930 234042
53776B34042j827k929l330k934k588k703k761k518k576l253l838l589k785k206
$$ 234042 232215 229286 225956 223022 220434 217731 214970 212452 209876 206623 202785 199196 196411 194205
53762A94205k153k346k376j961j252q35r92j075m86J25l07j384j594n84L79M68
$$ 194205 192052 189706 187330 185369 184117 183282 182290 181215 180729 180854 180547 179163 177569 176985 177364 177832
53746A77832L45O50R31Q05P87J115R64j16j144j105m58j62j36J60M58K51o1J87
$$ 177832 178177 178827 179758 180563 181350 182465 183429 183313 182169 181064 180606 180444 180308 180468 180926 181177 181116 181303
53728A81303O04M25L2M29J432J771J106N89J023J608J202O9m16M23J741K267J817
$$ 181303 181907 182332 182364 182793 184225 185996 187102 187691 188714 190322 191524 191593 191177 191600 193341 195608 197425
53711A97425J369J676K263K204J535J211J641K121J943J400J180J333J404J192
$$ 197425 198794 200470 202733 204937 206472 207683 209324 211445 213388 214788 215968 217301 218705 219897
53697B19897R12Q41J174J912K622K723K327K298L047L815L646K614J541Q47L54
$$ 219897 220809 221650 222824 224736 227358 230081 232408 234706 237753 241568 245214 247828 249369 250216 250570
53682B50570n8k67l11m50p61j097j329j421j271q47l44m6o4l65p91r74n63K28
$$ 250570 250512 250245 249934 249484 248723 247626 246297 244876 243605 242758 242414 242368 242304 241939 241148 240174 239611 239839
53664B39839O06N6r59j432q62K97J103R95K60l13l62l12n80p94l61M44P81N57
$$ 239839 240445 240501 239542 238110 237248 237545 238648 239643 239903 239590 239228 238916 238336 237542 237181 237625 238406 238963
53646B38963N71J168J714J684J441J464J569J374R69O23L67L16Q36J907K804K925
$$ 238963 239534 240702 242416 244100 245541 247005 248574 249948 250917 251540 251907 252223 253059 254966 257770 260695
53630B60695K463J896J289N97J36K19O95J230J738K108K058J671J597K261L230
$$ 260695 263158 265054 266343 266940 267076 267295 267990 269220 270958 273066 275124 276795 278392 280653 283883
53615B83883L787L809L658L607L692L847L853L540L204L314L691L606K921K361
$$ 283883 287670 291479 295137 298744 302436 306283 310136 313676 316880 320194 323885 327491 330412 332773
53601C32773K361K477K291K075J985J588Q05L94P09Q66J00q50q74l36n00j552
$$ 332773 335134 337611 339902 341977 343962 345550 346355 346749 347458 348324 348424 347574 346700 346364 345864 344312
53585C44312k406k375j848j353r61p66j032j593j754j139k50jq21k121k617j569
$$ 344312 341906 339531 337683 336330 335369 334603 333571 331978 330224 329085 328835 328834 328013 325892 323275 321706
53569C21706K12J188J104J268K412L345K699J091L03Q55J712K054K018J804J303
$$ 321706 321918 323106 324210 325478 327890 331235 333934 335025 335328 336183 337895 339949 341967 343771 345074
53554C45074Q24J078K176L378M053M182L868L179K567K657L388L953L861L483
$$ 345074 345898 346976 349152 352530 356583 360765 364633 367812 370379 373036 376424 380377 384238 387721
53540C87721L417L811M491N288O045O629P021P278P418P497P608P677P542P451
$$ 387721 391138 394949 399440 404728 410773 417402 424423 431701 439119 446616 454224 461901 469443 476894
53526D76894P954R068J0041J0364J0397J0553J0649J0668J1292J2830J4377J5028
$$ 476894 484848 493916 503957 514321 524718 535271 545920 556588 567880 580710 595087 610115
53514F10115J5260J5983J6903J7167J7101J7729J8843J9139J8365J7804J8324
$$ 610115 625375 641358 658261 675428 692529 710258 729101 748240 766605 784409 802733
53503H02733J9265J9626J9286J8551J7530J6437J5739J5578J5596J5513J5300
$$ 802733 821998 841624 860910 879461 896991 913428 929167 944745 960341 975854 991154
53492I91154J4831J4124J3766J4236J4898J4695J3763J3268J3596J3906J3637
$$ 991154 1005985 1020109 1033875 1048111 1063009 1077704 1091467 1104735 1118331 1132237 1145874
53481A145874J3206J2948J2542J1832J1107J0186Q399N857L609K121P60p52j745
$$ 1145874 1159080 1172028 1184570 1196402 1207509 1217695 1226094 1231951 1235560 1237681 1238441 1237689 1235944
53468A235944k080k867m806o919p952q040q028q048p865p824q327q972r277r683
$$ 1235944 1233864 1230997 1226191 1219272 1211320 1203280 1195252 1187204 1179339 1171515 1163188 1154216 1144939 1135256
53454A135256j0827j2339j3305j3483j3153j2313j1053j0180j0342j0830j0397
$$ 1135256 1124429 1112090 1098785 1085302 1072149 1059836 1048783 1038603 1028261 1017431 1007034
53443A007034r025p705o712n263l001p24O74J103R44O30P32J753L436M944N884
$$ 1007034 998009 990304 983592 978329 975328 974604 975278 976381 977325 977955 978687 980440 983876 988820 994704
53428I94704O685P764Q869R500R522R169Q908R398J0981J3067J4488J4820J4912
$$ 994704 1001389 1009153 1018022 1027522 1037044 1046213 1055121 1064519 1075500 1088567 1103055 1117875 1132787
53415A132787J5763J7273J8589J9368K0130K1394K2941K4139K4734K5104K5871
$$ 1132787 1148550 1165823 1184412 1203780 1223910 1245304 1268245 1292384 1317118 1342222 1368093
53404A368093K7389K9612L2179L4542L6164L6838L6879L6873L7199L7857L8686
$$ 1368093 1395482 1425094 1457273 1491815 1527979 1564817 1601696 1638569 1675768 1713625 1752311
53393A752311L9529M0171M0351L9947L9087L8033L7081L6467L6104L5359L3448
$$ 1752311 1791840 1832011 1872362 1912309 1951396 1989429 2026510 2062977 2099081 2134440 2167888
53382B167888L0278K6753K3982K2244K0808J8728J5675J2040Q396M958J559j985
$$ 2167888 2198166 2224919 2248901 2271145 2291953 2310681 2326356 2338396 2346792 2351750 2353309 2351324
53370B351324n657r392j3225j7167k1067k4704k7846l0218l1702l2627l3532l4436
$$ 2351324 2345667 2336275 2323050 2305883 2284816 2260112 2232266 2202048 2170346 2137719 2104187 2069751
53358B069751l4863l4788l4908l5533l5824l4916l3279l1986l1018k9448k7236
$$ 2069751 2034888 2000100 1965192 1929659 1893835 1858919 1825640 1793654 1762636 1733188 1705952
53347A705952k5608k5375k5852k5910k5285k4364k3341k2125k0679j9061j7422
$$ 1705952 1680344 1654969 1629117 1603207 1577922 1553558 1530217 1508092 1487413 1468352 1450930
53336A450930j6109j5337j4721j3678j2300j1197j0512r869r387r710j0798j1711
$$ 1450930 1434821 1419484 1404763 1391085 1378785 1367588 1357076 1347207 1337820 1328110 1317312 1305601
53324A305601j2016j2295j2732j2377j0687q819q199q556q535p783p124o960o728
$$ 1305601 1293585 1281290 1268558 1256181 1245494 1236675 1228476 1219920 1211385 1203602 1196478 1189518 1182790
53311A182790n974m961l987k947j762n63P02K251L892M989N238N120N425O545
$$ 1182790 1176816 1171855 1167868 1164921 1163159 1162596 1163298 1165549 1169441 1174430 1179668 1184788 1190213 1196758
53297A196758Q287J0096J1463J2408J3447J4965J6656J7854J8145J7471J5955
$$ 1196758 1205045 1215141 1226604 1239012 1252459 1267424 1284080 1301934 1320079 1337550 1353505
53286A353505J3998J2323J1438J1098J0600R412P375M619J691n98j937k968m527
$$ 1353505 1367503 1379826 1391264 1402362 1412962 1422374 1429749 1434368 1436059 1435461 1433524 1430556 1426029
53273A426029o632q679j0378j1953j3553j5010j6171j7078j7860j8672j9601k0400
$$ 1426029 1419397 1410718 1400340 1388387 1374834 1359824 1343653 1326575 1308715 1290043 1270442 1250042
53261A250042k0608k0292k0246k0997k1927k2045k1354k0746k0658k0567j9880
$$ 1250042 1229434 1209142 1188896 1167899 1145972 1123927 1102573 1081827 1061169 1040602 1020722
53250A020722j8729j7682j7149j7114j7247j7237j7210j7511j7903j7441j5732
$$ 1020722 1001993 984311 967162 950048 932801 915564 898354 880843 862940 845499 829767
53239H29767j3806j2981j3155j3088j2260j1386j1051j0831j0134r041p991p241
$$ 829767 815961 802980 789825 776737 764477 753091 742040 731209 721075 712034 704043 696802
53227F96802p082p860r326j0467j0619j0270j0336j0989j1748j2349j2912j3362
$$ 696802 689720 681860 672534 662067 651448 641178 630842 619853 608105 595756 582844 569482
53215E69482j3342j2761j2014j1490j1168j0786j0195r380q400p500p158p725
$$ 569482 556140 543379 531365 519875 508707 497921 487726 478346 469946 462446 455288 447563
53203D47563q905r841r980r650r507r562r260q523q033q137q108p113n510m513
$$ 447563 438658 428817 418837 409187 399680 390118 380858 372335 364302 356165 348057 340944 335434 330921
53189C30921m666n347n685n374m526l410k496k238k486k569k135j678j817k449
$$ 330921 326255 320908 315223 309849 305323 301913 299417 297179 294693 292124 289989 288311 286494 284045
53175B84045k884k728k339k397l091l803l752k935k178k031k008j393m42o7l95
$$ 284045 281161 278433 276094 273697 270606 266803 263051 260116 257938 255907 253899 252506 252064 251997 251602
53160B51602n61j22J53n28j657k062j557j164j703k787l383k987j970j036o64
$$ 251602 251041 250919 251072 250544 248887 246825 245268 244104 242401 239614 236231 233244 231274 230238 229574
53145B29574r31j577k082j923j011J00O94O15L79M42O71O81M09P3k32m24j82O40
$$ 229574 228643 227066 224984 223061 222050 222150 222844 223459 223838 224280 224951 225632 226041 226114 225882 225458 225276 225916
53127B25916J440J301J97p89p52J5N66M92J13k04m11n45n96o23p03p07m66j46
$$ 225916 227356 228657 228854 228065 227313 227328 227894 228386 228499 228295 227884 227339 226743 226120 225417 224710 224244 224098
53109B24098j48n38q22n49O4L53Oo46j134j397j650j887j811j267n58j68k54n16
$$ 224098 223950 223412 222590 222041 222105 222458 222464 221818 220684 219287 217637 215750 213939 212672 212114 211946 211692 211176
53091B11176o02n32o03q98j057p01j5M32N07P48J534K337K285J292J34n13o75
$$ 211176 210574 210042 209439 208541 207484 206783 206768 207200 207707 208455 209989 212326 214611 215903 216037 215524 214849
53074B14849o29m64k51j61j65n3P8k09r17j383j183p98q61j126q48k2N42K83m24
$$ 214849 214220 213756 213505 213344 213179 213126 213204 212995 212078 210695 209512 208714 207853 206727 205879 205857 206399 206682 206258
53055B06258q49o89j63L85P57R34R25O63J19m63o63m20j75k96n83n85j76L80P04
$$ 206258 205409 204720 204557 204942 205699 206633 207558 208221 208340 207877 207214 206794 206619 206323 205740 205155 204979 205359 206063
53036B06063M54m12j273j176N8J402J767J177L45l89j056j356q54J54Q70J020
$$ 206063 206517 206105 204832 203656 203714 205116 206883 208060 208405 208016 206960 205604 204750 204904 205774 206794
53020B06794J024J085Q54J78m97o74l17L15Q62Q19n3j183j540p98L99J306J723
$$ 206794 207818 208903 209757 209935 209438 208764 208447 208762 209624 210443 210390 209207 207667 206869 207268 208574 210297
53003B10297J677J179N09J28L2k68p96q86k47M31M40R5J08M17L70j22m43k28J86
$$ 210297 211974 213153 213662 213790 213822 213554 212758 211872 211625 212056 212496 212591 212699 213116 213486 213364 212921 212693 212879
52984B12879L57K91J76J6k34m10k56K92J065J810K322K474K198J530O42j08l29
$$ 212879 213236 213527 213703 213719 213485 213075 212819 213111 214176 215986 218308 220782 222980 224510 225152 225044 224715
52967B24715J46J052J821J942J360N35Lj54k66m96n61j85M26Q64R99Q52K84p12
$$ 224715 224861 225913 227734 229676 231036 231571 231574 231420 231154 230658 230097 229912 230338 231202 232201 233053 233337 232625
52949B32625j578j664j128q00j066j428j382j149j219j574j795j640j140l16P87
$$ 232625 231047 229383 228255 227455 226389 224961 223579 222430 221211 219637 217842 216202 215062 214746 215533
52934B15533J817K232J790P69l07j051j305j038l50L73N84J54l38k95k4l67j270
$$ 215533 217350 219582 221372 222141 221834 220783 219478 218440 218090 218463 219047 219201 218863 218568 218544 218177 216907
52917B16907j546n42O76O27n68j471j383r85r15q70m96j65k62l82J8P00R78P18
$$ 216907 215361 214819 215495 216122 215554 214083 212700 211715 210800 209930 209434 209269 209007 208625 208643 209343 210321 211039
52899B11039M02L00J38l61r48j041m43K79L68j29l15K70Q63N77j66k78J97J31
$$ 211039 211441 211741 211879 211518 210570 209529 209086 209365 209733 209604 209289 209559 210422 210999 210833 210555 210752 210883
52881B10883p47j266o16M33Q31P69R19J037M76m45p71l38J46L45O11R73Q59P9
$$ 210883 210136 208870 208254 208687 209518 210287 211206 212243 212719 212274 211503 211165 211311 211656 212267 213240 214099 214178
52863B14178o34n05L20J089J364J307J209J109Q01J87n04q89q54o84o76p80p94
$$ 214178 213544 213039 213359 214448 215812 217119 218328 219437 220238 220425 219921 219032 218178 217494 216818 216038 215244
52846B15244p63r74j591k323k545j844o47p4p72k027k518j910j044n83k53K63
$$ 215244 214481 213507 211916 209593 207048 205204 204557 204483 203711 201684 199166 197256 196212 195629 195376 195639
52830A95639N56J98m67q67r69r39n48K81Q47M17o25j187q52j48L88O93P80O28
$$ 195639 196195 196393 195926 195059 194090 193151 192603 192884 193731 194148 193523 192336 191484 191336 191724 192417 193197 193825
52812A93825M36M14L24j51o98o65%P65J374J933K191J614L42q00j420j931k489
$$ 193825 194261 194675 194999 194848 194150 193485 193485 194250 195624 197557 199748 201362 201704 200904 199484 197553 195064
52795A95064k455j498m28k27p24r92p47n25o50p34l90J60M80N78P98J192J306
$$ 195064 192609 191111 190683 190456 189732 188740 187993 187468 186818 186084 185694 185854 186334 186912 187710 188902 190208
52778A90208P51j95p44m42L02P29N92K74J63K62M18N71O18K91n16j429j864j584
$$ 190208 190959 190764 190020 189578 189880 190609 191201 191475 191638 191900 192318 192889 193507 193798 193282 191853 189989 188405
52760A88405q43k1P04J278J543J343Q57N49O27P39N14J92K74O26N82N1k32J70
$$ 188405 187562 187541 188245 189523 191066 192409 193266 193815 194442 195181 195695 195887 196161 196787 197369 197420 197188 197358
52742A97358O59O22M84R08J484J217J82m05J85J417K496L192L367K705J421M82
$$ 197358 198017 198639 199123 200031 201515 202732 202914 202509 202694 204111 206607 209799 213166 215871 217292 217774
52726B17774M80Q44P85L95J82P2k81o25m42K4o3r45j971k522k580k249j477m93
$$ 217774 218254 219098 219883 220278 220460 220532 220251 219626 219184 219208 219145 218200 216229 213707 211127 208878 207401 206908
52708B06908J18P6k64n32p72j009r89o70m77n81m02M55J308J186L49L7P00J371
$$ 206908 207026 207102 206838 206306 205534 204525 203536 202866 202389 201808 201406 201861 203169 204355 204704 204741 205441 206812
52690B06812J160M97L41P30Q86M50j15k18K73J101J818J874J022k16q58m50M22
$$ 206812 207972 208469 208810 209540 210426 210876 210761 210543 210816 211917 213735 215609 216631 216415 215557 215107 215529
52673B15529P40Q7j017j687j524r74p11p39m30M06R74N32m23p06k8P30Q74O85
$$ 215529 216269 216356 215339 213652 212128 211154 210443 209704 209274 209680 210654 211186 210763 210057 210029 210759 211633 212318
52655B12318O51O68M99M23Q13J407J578J164N96L02L24M54M75L18R0j79p69j886
$$ 212318 212969 213637 214136 214559 215372 216779 218357 219521 220117 220419 220743 221197 221672 221990 222080 221901 221132 219246
52637B19246k967k973j622O9R58R74P78O90N74M57N18N25Q1n64n92K70J229J294
$$ 219246 216279 213306 211684 211753 212711 213685 214463 215153 215727 216184 216702 217227 217308 216744 216152 216422 217651 218945
52619B18945L78p16j232j138r11q01n27J89R51R87J50p72r72m65K32Q00J107R79
$$ 218945 219323 218607 217375 216237 215326 214525 213998 214187 215138 216125 216275 215503 214531 214066 214298 215098 216205 217184
52601B17184M75O4Q6K21N7k36k82k70n57q15l77O01J197J025O88Q02J236J620
$$ 217184 217659 217723 217809 218030 218087 217851 217569 217299 216742 215927 215550 216151 217348 218373 219061 219863 221099 222719
52583B22719J857J830J209L2r57j039l40M06O21K18n13j052r90n16k71m92o39
$$ 222719 224576 226406 227615 227647 226690 225651 225311 225717 226338 226556 226043 224991 224001 223485 223214 222722 222083
52566B22083j75N73Q06L29k45l52j78k56p33j245j439j308r55k70P80J697J694
$$ 222083 221908 222481 223287 223616 223371 223019 222841 222585 221852 220607 219168 217860 216905 216635 217415 219112 220806
52549B20806N96q67j825k045j739j076k88J73J43J37O46J226J037J24n75n08n
$$ 220806 221402 220535 218710 216665 214926 213850 213562 213735 213878 214015 214661 215887 216924 217048 216473 215965 215960
52532B15960N70J287K036K254J754J183J125J258R04J9q91j477j685j445q24k30
$$ 215960 216530 217817 219853 222107 223861 225044 226169 227427 228331 228350 227459 225982 224297 222852 222028 221798
52516B21798p3k66m29l96j70L25J047J565J492J096J004J376J815K051K215K304
$$ 221798 221725 221459 221030 220634 220464 220789 221836 223401 224893 225989 226993 228369 230184 232235 234450 236754
52500B36754J890O63r87k228k573k217j631j032l58L44P53O63L70L26M63K21n63
$$ 236754 238644 239307 238320 236092 233519 231302 229671 228639 228281 228625 229378 230041 230411 230737 231200 231421 230858
52483B30858j240j165n68k01k21l2O93J361J191K54n45n10K18J007J384J232O22
$$ 230858 229618 228453 227885 227684 227463 227431 228124 229485 230676 230930 230385 229875 230093 231100 232484 233716 234338
52466B34338j76o92n58J14R18J669K434L000K773J571J85k96L04J095J125K47
$$ 234338 234162 233470 232912 233026 233944 235613 238047 241047 243820 245391 245576 245280 245584 246679 247804 248051
52450B48051j006k019k507k564k453k244j739r16k86m03j089j534j284p30m91
$$ 248051 247045 245026 242519 239955 237502 235258 233519 232603 232317 231914 230825 229291 228007 227277 226786
52435B26786o42p87o64m12k90l20k19L15J128J616J363O88K46K10K04M2L0M44
$$ 226786 226144 225357 224693 224281 223991 223671 223452 223767 224895 226511 227874 228562 228808 229018 229222 229264 229294 229738
52417B29738J109J738K247K543K350J625R30R59J779K695K963K460J784J718K564
$$ 229738 230847 232585 234832 237375 239725 241350 242280 243239 245018 247713 250676 253136 254920 256638 259202
52402B59202L854M792M940M336L164J625J59o61p22o03r74j911k923l458l253
$$ 259202 263056 267848 272788 277124 280288 281913 282072 281411 280689 280086 279112 277201 274278 270820 267567
52387B67567k363j139n5O15R34J110J251J312J217R84Q44J162J991K770K790K053
$$ 267567 265204 264065 264010 264625 265559 266669 267920 269232 270449 271433 272277 273439 275430 278200 280990 283043
52371B83043J382J509K283K980L219L293L693M439N028M952M237L285K406J675
$$ 283043 284425 285934 288217 291197 294416 297709 301402 305841 310869 315821 320058 323343 325749 327424
52357C27424J301J612K470L070K812K021J444J336J552K130L076L879M043M036
$$ 327424 328725 330337 332807 335877 338689 340710 342154 343490 345042 347172 350248 354127 358170 362206
52343C62206M759O039O612N911M908M774N466O234O840P563Q441R219R854J0561
$$ 362206 366965 373004 379616 385527 390435 395209 400675 406909 413749 421312 429753 438972 448826 459387
52329D59387J1458J2511J3707J4974J6111J7008J7714J8234J8561J8963J9827
$$ 459387 470845 483356 497063 512037 528148 545156 562870 581104 599665 618628 638455
52318F38455K1063K2114K2658K2796K2476K1441K0050J9288J9493J9778J9278
$$ 638455 659518 681632 704290 727086 749562 771003 791053 810341 829834 849612 868890
52307H68890J8352J7828J7613J6894J5361J3512J1904J0786J0179R705Q603O568
$$ 868890 887242 905070 922683 939577 954938 968450 980354 991140 1001319 1011024 1019627 1026195
52295A026195M369K977K278J338k08j817l032m099n350o611p424p545p033o188
$$ 1026195 1030564 1033541 1035819 1037157 1036949 1035132 1032100 1028001 1022651 1016040 1008616 1001071 994038 987850
52281I87850n407m861m275l244j753j40J318K618L980N705P795R638J0465J0479
$$ 987850 982443 977582 973307 970063 968310 968170 969488 972106 976086 981791 989586 999224 1009689 1020168
52267A020168J0932J2592J4610J5522J4972J3806J2831J2242J1995J1914J1481
$$ 1020168 1031100 1043692 1058302 1073824 1088796 1102602 1115433 1127675 1139670 1151584 1163065
52256A163065J0354Q992Q122P617O692N152L701K883K408J704M83j369l797o382
$$ 1163065 1173419 1182411 1190533 1198150 1204842 1209994 1213695 1216578 1218986 1220690 1221173 1219804 1216007 1209625
52242A209625q584j0378j2079j3597j4489j4789j5061j5582j6097j6512j6955
$$ 1209625 1201041 1190663 1178584 1164987 1150498 1135709 1120648 1105066 1088969 1072457 1055502
52231A055502j6995j5822j3623j1877j1625j2093j1763j0219q260o650n593n158
$$ 1055502 1038507 1022685 1009062 997185 985560 973467 961704 951485 943225 936575 930982 925824
52219I25824n339n667n468m637l738l224k881k091n49J331K614K625J663P62N83
$$ 925824 920485 914818 909350 904713 900975 897751 894870 892779 892230 893561 896175 898800 900463 901225 901808
52204I01808P77P25N11P18J422J996J957J573J427J625J736J389P90N78J168K237
$$ 901808 902585 903310 903821 904539 905961 907957 909914 911487 912914 914539 916275 917664 918454 919032 920200 922437
52188I22437K948K750J915J139P66N64K39j47m30p55j392k230k781k915l187m140
$$ 922437 925385 928135 930050 931189 931955 932519 932758 932611 932181 931426 930034 927804 925023 922108 918921 914781
52172I14781n404n953n295l975k839k154j658j113m22M87J533K337K561K311K021
$$ 914781 909377 903424 898129 894154 891315 889161 887503 886390 885968 886455 887988 890325 892886 895197 897218
52157H97218K004K355L048L864M402M458M293M184L967L397K745K533K834L249
$$ 897218 899222 901577 904625 908489 912891 917349 921642 925826 929793 933190 935935 938468 941302 944551
52143I44551L531L760L914L841L696L949M768N795O651P382Q276R490J0932J2282
$$ 944551 948082 951842 955756 959597 963293 967242 972010 977805 984456 991838 1000114 1009604 1020536 1032818
52129A032818J3176J3636J4274J5698J7791J9918K1715K3268K4592K5558K6334
$$ 1032818 1045994 1059630 1073904 1089602 1107393 1127311 1149026 1172294 1196886 1222444 1248778
52118A248778K7319K8451K9131K9048K8541K7887K6765K4799K2277J9890J7939
$$ 1248778 1276097 1304548 1333679 1362727 1391268 1419155 1445920 1470719 1492996 1512886 1530825
52107A530825J6080J3768J0750P322M106J496o97k752m385n137n346o059p643
$$ 1530825 1546905 1560673 1571423 1578745 1582851 1584347 1583650 1580898 1576513 1571376 1566030 1559971 1552328
$$ [...]