
##TITLE=AC1362_CENAH12180_7155162_ooGzdNBeBk
##JCAMPDX= 6.0         $$ Bruker NMR JCAMP-DX V2.0
##DATA TYPE= NMR SPECTRUM
##DATA CLASS= NTUPLES
##ORIGIN= BRUKER
##OWNER= Administrator
$$ 1.72 TOPSPIN		Version 2.1
$$ 2012-12-01 11:39:18.702 -0500  Administrator@X
$$ Compression mode = diff/dup
##.OBSERVE FREQUENCY= 400.02188249412
##.OBSERVE NUCLEUS= ^1H
##.ACQUISITION MODE= SIMULTANEOUS (DQD)
##.ACQUISITION SCHEME= undefined
##.AVERAGES= 8
##.DIGITISER RES= 22
##SPECTROMETER/DATA SYSTEM= spect
##.PULSE SEQUENCE= zg30
##.SOLVENT NAME= COFFEE_meoh
##.SHIFT REFERENCE= INTERNAL, COFFEE_meoh, 1, 14.98509
##AUDIT TRAIL= $$ (NUMBER, WHEN, WHO, WHERE, PROCESS, VERSION, WHAT)
$$ ##TITLE= Audit trail, TOPSPIN		Version 2.1
$$ ##JCAMPDX= 5.01
$$ ##ORIGIN= Bruker BioSpin GmbH
$$ ##OWNER= Administrator
$$ $$ E:\/data/COFFEE/nmr/AC1362_CENAH12180_7155162_ooGzdNBeBk/10/pdata/1/auditp.txt
$$ ##AUDIT TRAIL=  $$ (NUMBER, WHEN, WHO, WHERE, PROCESS, VERSION, WHAT)
(   1,<2012-12-01 11:39:12.723 -0500>,<Administrator>,<X>,<go>,<TOPSPIN 2.1>,
      <created by zg
	started at 2012-12-01 11:38:04.196 -0500,
	POWCHK enabled, PULCHK disabled,
       configuration hash MD5:
       86 BA 57 50 F2 9D 5C 9B 26 00 A9 28 5F 66 2E 89
       data hash MD5: 64K
       D0 55 30 AE 18 CE 34 A8 71 E3 67 AC 5C 03 3C 48>)
(   2,<2012-12-01 11:39:14.955 -0500>,<Administrator>,<X>,<proc1d>,<TOPSPIN 2.1>,
      <Start of raw data processing
       efp LB = 0 FT_mod = 6 PKNL = 1 PHC0 = 0 PHC1 = 0 SI = 32K 
       data hash MD5: 32K
       33 18 E9 2D 61 D7 65 55 C2 C2 43 EA D1 7F 8D 32>)
(   3,<2012-12-01 11:39:15.308 -0500>,<Administrator>,<X>,<proc1d>,<TOPSPIN 2.1>,
      <pk PHC0 = 98.37158 PHC1 = 0 
       data hash MD5: 32K
       CB A2 07 BE 2D E7 98 A5 29 45 3C 1F 5A 27 CF F4>)
(   4,<2012-12-01 11:39:15.485 -0500>,<Administrator>,<X>,<proc1d>,<TOPSPIN 2.1>,
      <abs ABSG = 1 
       data hash MD5: 32K
       1F CE 00 0A CF 42 6E 21 39 17 E3 6E 6A E1 CB 89>)
(   5,<2012-12-01 11:39:15.585 -0500>,<Administrator>,<X>,<proc1d>,<TOPSPIN 2.1>,
      <abs ABSG = 2 
       data hash MD5: 32K
       6D D0 CA 20 BC E5 84 8E 38 68 2A A4 00 4F 82 36>)
(   6,<2012-12-01 11:39:15.695 -0500>,<Administrator>,<X>,<proc1d>,<TOPSPIN 2.1>,
      <abs ABSG = 3 
       data hash MD5: 32K
       B6 1B 40 55 BB F9 36 C6 30 1D 07 67 06 70 33 80>)
(   7,<2012-12-01 11:39:15.805 -0500>,<Administrator>,<X>,<proc1d>,<TOPSPIN 2.1>,
      <abs ABSG = 4 
       data hash MD5: 32K
       61 29 27 40 80 F5 06 39 F2 B6 A4 AA 0A 5A 3F B4>)
(   8,<2012-12-01 11:39:15.927 -0500>,<Administrator>,<X>,<proc1d>,<TOPSPIN 2.1>,
      <abs ABSG = 5 
       data hash MD5: 32K
       C3 BE A6 D5 DF 55 EC D1 EE 68 BD DE 32 01 06 45>)
$$ ##END=
$$ 
$$ $$ hash MD5
$$ $$ 98 BF A5 5B 8E 8C 3B E4 B5 60 49 91 3E 0F D9 A1
##$RELAX= 
##$RELAX= 
##$RELAX= 
##$RELAX= 
##$RELAX= 
##$RELAX= 
##$RELAX= 
$$ Bruker specific parameters
$$ --------------------------
##$DU= <E:\>
##$EXPNO= 10
##$NAME= <AC1362_CENAH12180_7155162_ooGzdNBeBk>
$$ [...]
##$TP= (0..7)
150 150 150 150 150 150 150 150
##$TP07= 0
##$TPNAME0= <>
##$TPNAME1= <>
##$TPNAME2= <>
##$TPNAME3= <>
##$TPNAME4= <>
##$TPNAME5= <>
##$TPNAME6= <>
##$TPNAME7= <>
##$TPOAL= (0..7)
0.5 0.5 0.5 0.5 0.5 0.5 0.5 0.5
##$TPOFFS= (0..7)
0 0 0 0 0 0 0 0
##$TUNHIN= 0
##$TUNHOUT= 0
##$TUNXOUT= 0
##$USERA1= <user>
##$USERA2= <user>
##$USERA3= <user>
##$USERA4= <user>
##$USERA5= <user>
##$V9= 5
##$VALIST= <valist>
##$VCLIST= <CCCCCCCCCCCCCCC>
##$VD= 0
##$VDLIST= <DDDDDDDDDDDDDDD>
##$VPLIST= <PPPPPPPPPPPPPPP>
##$VTLIST= <TTTTTTTTTTTTTTT>
##$WBST= 1024
##$WBSW= 4
##$XGAIN= (0..3)
0 0 0 0
##$XL= 0
##$YL= 0
##$YMAX_a= 618909
##$YMIN_a= -522801
##$ZGOPTNS= <>
##$ZL1= 120
##$ZL2= 120
##$ZL3= 120
##$ZL4= 120
##$ABSF1= 14.98509
##$ABSF2= -5.573092
##$ABSG= 5
##$ABSL= 3
##$ALPHA= 0
##$AQORDER= 0
##$ASSFAC= 0
##$ASSFACI= 0
##$ASSFACX= 0
##$ASSWID= 0
##$AUNMP= <proc_prof1d_extract_pilot.lims>
##$AXLEFT= 0
##$AXNAME= <>
##$AXNUC= <1H>
##$AXRIGHT= 0
##$AXTYPE= 0
##$AXUNIT= <>
##$AZFE= 0.1
##$AZFW= 0.1
##$BCFW= 0
##$BC_mod= 0
##$BYTORDP= 0
##$COROFFS= 0
##$CY= 15
##$DATMOD= 1
##$DC= 0
##$DFILT= <>
##$DTYPP= 0
##$F1P= 0
##$F2P= 0
##$FCOR= 0.5
##$FTSIZE= 32768
##$FT_mod= 6
##$GAMMA= 0
##$GB= 0
##$INTBC= 1
##$INTSCL= 1
##$ISEN= 128
##$LB= 0
##$LEV0= 0
##$LPBIN= 0
##$MAXI= 10000
##$MC2= 0
##$MEAN= 0
##$ME_mod= 0
##$MI= 0
##$NCOEF= 0
##$NC_proc= -8
##$NLEV= 6
##$NOISF1= 0
##$NOISF2= 0
##$NSP= 0
##$NTH_PI= 0
##$NZP= 0
##$OFFSET= 14.98509
##$PC= 1
##$PHC0= 98.37158
##$PHC1= 0
##$PH_mod= 1
##$PKNL= yes
##$PPARMOD= 0
##$PPDIAG= 0
##$PPIPTYP= 0
##$PPMPNUM= 2147483647
##$PPRESOL= 1
##$PSCAL= 4
##$PSIGN= 0
##$PYNMP= <proc.py>
##$REVERSE= no
##$SF= 400.02
##$SI= 32768
##$SIGF1= 0
##$SIGF2= 0
##$SINO= 400
##$SIOLD= 32768
##$SPECTYP= <>
##$SREGLST= <1H.CDCl3>
##$SSB= 0
##$STSI= 32768
##$STSR= 0
##$SW_p= 8223.68421052631
##$SYMM= 0
##$S_DEV= 0
##$TDeff= 65536
##$TDoff= 0
##$TI= <>
##$TILT= no
##$TM1= 0
##$TM2= 0
##$TOPLEV= 0
##$USERP1= <user>
##$USERP2= <user>
##$USERP3= <user>
##$USERP4= <user>
##$USERP5= <user>
##$WDW= 1
##$XDIM= 32768
##$YMAX_p= 474558683
##$YMIN_p= -676910
##$CURPLOT= <Network HP LaserJet P1505>
##$CURPRIN= <$Network HP LaserJet P1505>
##$DFORMAT= <normdp>
##$LAYOUT= <+/1D_H.xwp>
##$LFORMAT= <normlp>
##$PFORMAT= <normpl>
##$SURQMSG= 1
$$ End of Bruker specific parameters
$$ ---------------------------------
##NTUPLES= NMR SPECTRUM
##VAR_NAME=  FREQUENCY,     SPECTRUM/REAL,   SPECTRUM/IMAG
##SYMBOL=    X,             R,               I
##VAR_TYPE=  INDEPENDENT,   DEPENDENT,       DEPENDENT
##VAR_FORM=  AFFN,          ASDF,            ASDF
##VAR_DIM=   32768,         32768,           32768
##UNITS=     HZ,            ARBITRARY UNITS, ARBITRARY UNITS
##FACTOR=    0.250966925370066, 1,           1
##FIRST=     8223.43324360094, 197348,       -47226
##LAST=      0,             -52989,          88404
##MIN=       0,             -676910,         0
##MAX=       8223.43324360094, 474558683,    0
$$ Real data points
##PAGE= N=1
##DATA TABLE= (X++(R..R)), XYDATA
$$ [...]
19476e2128P372k30809b2006C8713e4859l4215c8038j75827F8568b97433G9998
19464b44688k13360a49926B51318a6729j41152q914B20831b8283H275b78696F6282
19452E9907J66378b19022d7807k24375p9745J72748n2004A9529a92192P1226d9158
19440e5710m9857C7254b63678E2682b3110o4675B20078g2927C353b37282C7274
19428e9997H8716c72911a30554B29892e8493p4289f728j47429j28222D5L43824
19417C43869F1058a26381q325A85187c39398B65357a46443I3699B2251g8282g477
19405c45599J52679l42783a0669j03539n1557P7191a5647G6480a63784J6385k1380
19394a68779L7757M8948b4996l85859I6389a50025j27246e9209G3481c45780E6953
$$ plain form
19476 -52128 -44756 -275565 -22006 38713 -54859 -89074 -38038 -213865 68568 -297433 79998
19464 -244688 -458048 -149926 251318 -16729 -157881 -166795 220831 -28283 8275 -278696 66282
19452 59907 226285 -219022 -47807 -272182 -351927 -179179 -231183 19529 -192192 -120966 -49158
19440 -55710 -105567 37254 -263678 52682 -23110 -87785 220078 -72927 3353 -237282 37274
19428 -59997 88716 -372911 -130554 229892 -58493 -132782 -6728 -154157 -282379 45 343869
19417 343869 61058 -126381 -134706 185187 -339398 265357 -146443 93699 22251 -78282 -7477
19405 -345599 -192920 -535703 -10669 -114208 -165765 -88574 -15647 76480 -163784 -147399 -168779
19394 -168779 -131022 -82074 -24996 -410855 96389 -150025 -277271 -59209 73481 -345780 56953
19382a25799h02k15919m15929e6381k8654j07132q5168C7602n18e263k9117k21130
19370b55510C3735i8931A44859D7262k1437a06839d8347F9091l1035J47943c24532
19358a16690o1291r1602A43304h5541G4762R4782a89864G7435b42774A24697d07689
19346b88888J17326F8852c49798J30741p9414a41802f3193b6574n4542l4981F3236
19334i9814B13659a71290a0866A86454b07444e6377k20495J21674r5183R2877
19324a57504r348L1515l2820C40690A0573a6369j69849A90627p7745d09930J58959
19313b50971J14747M8673f892k36094A08473b13048M5846a8554B11820o7156J5430
19302A60094J45440M8906b55196I7685b82297P2663e4177j71657a06265A14071
$$ plain form
19382 -125799 -802 -216721 -632650 -56381 -85035 -192167 -277335 37602 37084 -5263 -34380 -255510
19370 -255510 33735 -98931 144859 47262 25825 -106839 -48347 69091 38056 185999 -324532
19358 -116690 -177981 -269583 143304 -85541 74762 169544 -189864 77435 -242774 124697 -407689
19346 -288888 -171562 68852 -349798 -219057 -298471 -141802 -63193 -26574 -81116 -116097 63236
19334 -99814 213659 -171290 -10866 186454 -207444 -56377 -276872 -155198 -250381 -157504
19324 -157504 -166852 -135337 -168157 340690 10573 -16369 -186218 190627 112882 -409930 -250971
19313 -250971 -136224 -87551 -6892 -242986 108473 -213048 -167202 -18554 211820 144664 160094
19302 160094 305534 354440 -255196 97685 -282297 -209634 -54177 -225834 -106265 114071
19291A01928Q7235C1129J25202b51512E7822c37461a25519o7513M9851k51343
19281c94524P4972A11419b66705A08455d47334a06378A94253b05801l3664D478
19270c08156J52418A66569h7117l38843I7120A1990d0291j61471a0870E5396a24241
19258a31845B61206a9040j30197H5586J50443J5536G208b59320e5832j91263D06532
19246c27972A48944a34451B35928a99399h9389p0332g6016j67056J6589F53c16070
19234b39462h2335A00847b47713B55527a03666n6351E0045e8715A05023a94281
19223c59295B7792h182m22972g0337k7346k6856A91570b20785A2041d7788H6987
19211h0310r1653b7193B06053E461c57525a11894k25396a35050j77569a35770
$$ plain form
19291 101928 189163 31129 156331 -251512 57822 -337461 -125519 -193032 -143181 -394524
19281 -394524 -319552 111419 -266705 108455 -447334 -106378 194253 -205801 -239465 4478
19270 -308156 -155738 166569 -87117 -425960 97120 11990 -40291 -201762 -10870 55396 -124241
19258 -131845 261206 -19040 -149237 85586 236029 251565 7208 -259320 -55832 -247095 406532
19246 -327972 148944 -134451 235928 -199399 -89389 -159721 -76016 -243072 -226483 653 -316070
19234 -239462 -82335 100847 -247713 255527 -103666 -160017 50045 -58715 105023 -194281
19223 -359295 27792 -8182 -431154 -70337 -97683 -124539 191570 -220785 12041 -47788 86987
19211 -80310 -171963 -27193 206053 5461 -357525 -111894 -337290 -135050 -312619 -135770
19200A02204c1845D7993c62880F2552a56714M3670I1059c7717J7574p0200A17165
19188b2449k1436k32962c6647I867a67335f1809A45657a93040C3275J5324O1212
19177A09811b6886A31079m1652j7523b68378B8083b83694L1613a11228D1470c02494
19165A57696a4886k07281j01356a45159C6010g7491j8150l0494A23173a13177
19154a23426G0341R5362c8046H4678g8064F1624a50914j30730a12358r4040b9959
19142B7482b01295A95770J06763b73489J15402J9202A27077b76683A41337e5279
19131D05918b38234o819R6986D4493e8171j29026o150i41l3924k184l11733a51481
19118b44096B4164c00070A52981b05285D6685K7872a08837B38641b62136n849
$$ plain form
19200 102204 -31845 47993 -362880 62552 -156714 -113044 91059 -37717 -20143 -90343 117165
19188 -22449 -43885 -276847 -36647 9867 -167335 -61809 145657 -193040 33275 48599 109811
19177 109811 -26886 131079 89427 71904 -268378 28083 -283694 -252081 -111228 41470 -302494
19165 157696 -14886 -222167 -323523 -145159 36010 -77491 -95641 -126135 123173 -113177
19154 -123426 70341 165703 -38046 84678 -78064 61624 -150914 -281644 -112358 -206398 -29959
19142 27482 -201295 195770 302533 -273489 -158087 -138885 127077 -276683 141337 -55279
19131 405918 -238234 -245053 -148067 44493 -58171 -187197 -193347 -941 -34865 -37049 -348782 -151481
19118 -244096 24164 -300070 152981 -205285 46685 74557 -108837 238641 -262136 -267985
19108b67985a03661q0641h7490D0163d5222j99755H3876A0656d3952o1210o6689
19097a71851B11630F7682K10477a3012r1281K8909q1584J7978A14911a97770p4067
19086b71837c3884k4910E9097c31341a04838B29918A06193a07535r6201R7043
19076a06693q8785d0446o4547A57234a86175P6848d282F6209A5153L54966C470
19064a77654i803j7086l0929A6472A121R6136b19010B08344p0795J52388F3301
19052b8781B1040a09650A6702Q8156R6570f9961A31172R3939a88446K6977F37
19040b13747B7296R4954c04528A17459b66846C5442K13209c59380a14604A45442
19029G6965a59017C6761J75723L12080a15095M9889B9325J89658k3050B9893a61066
$$ plain form
19108 -267985 -103661 -184302 -87490 40163 -45222 -244977 83876 10656 -43952 -105162 -171851
19097 -171851 211630 67682 278159 -13012 -104293 -75384 -156968 -138990 114911 -197770 -271837
19086 -271837 -33884 -58794 59097 -331341 -104838 229918 106193 -107535 -203736 -106693
19076 -106693 -195478 -40446 -104993 157234 -186175 -109327 -4282 66209 15153 370119 3470
19064 -177654 -9803 -26889 -57818 16472 1121 97257 -219010 208344 137549 289937 63301
19052 -28781 21040 -109650 16702 104858 201428 -69961 131172 225111 -188446 -161469 637
19040 -213747 27296 122250 -304528 117459 -266846 35442 248651 -359380 -114604 145442
19029 76965 -159017 36761 212484 524564 -115095 -65206 29325 218983 195933 29893 -161066
19017H50c15474J23676B80512B3625J49957i8068O449A11970d7170F7579b68330
19005A55538b03385j69805n027I1883J45567h7729k3864n9662C5197a22009G9588
18993i7347j77054B99756g6074C49198a22070B29603r8435D1985b5296q1878l9832
18982a47006L3214B6735M9014b21669A47504a55208m4740A51959f5982A8013d4142
18970B24600K18018J70324A72735A4314J59021G73L6373J20379J40924A664a0185
18958b04737A13750a94775g6459m3801b2583l00941E8007a06075G1675N6483a72041
18946i4326B76733B9095b60921d3959k63267h3852a5751A26081d2817H5290N3540
18935A38830c50987b1493C1918J66138g0850D9025J75743g1779A94754a67051
$$ plain form
19017 850 -315474 -191798 280512 23625 173582 -98068 -91619 111970 -47170 67579 -268330
19005 155538 -203385 -373190 -378217 91883 237450 -87729 -111593 -171255 35197 -122009 79588
18993 -97347 -274401 299756 -76074 349198 -122070 229603 131168 41985 -25296 -107174 -147006
18982 -147006 -113792 26735 75749 -221669 147504 -155208 -199948 151959 -65982 18013 -44142
18970 224600 442618 612942 172735 14314 173335 773 37146 157525 298449 1664 -10185
18958 -204737 113750 -194775 -76459 -120260 -22583 -323524 58007 -106075 71675 128158 -172041
18946 -94326 276733 29095 -260921 -43959 -307226 -83852 -15751 126081 -42817 85290 138830
18935 138830 -350987 -21493 31918 198056 -70850 49025 224768 -71779 194754 -167051
18924A75354j3527b52800Q2397K0214a4451C0767a11373k85669E3290g2750b6760
18912a53367f7652P978o059L1793C63366L1197L07861j83906A82235A6373M31637
18901D48010A62520d94832a10577d3521A08868b33067A21868E1239o066a05365
18890A22549a94477E5166d0738k27795B00515A2297N1921O6129b23176k09471
18880d32647a3798j47540A02627B8969A1823a10390j96157J38969g9378C25255
18869a58788j9245k9418B95621i1086r4247I8569a38997B2617J52199e7368m5698
18858a03066H8388a75918A30993J54082b07628P2433B36309c08692I7234L1370
18848A28604B3740J71439P7026B1769a81888B39342e5464J2263A6673K0177a13117
$$ plain form
18924 175354 161827 -252800 -170403 -150189 -14451 30767 -111373 -397042 53290 -72750 -26760
18912 -153367 -67652 -59674 -65733 -33940 363366 394563 702424 518518 182235 16373 448010
18901 448010 162520 -494832 -110577 -43521 108868 -233067 121868 51239 45173 -105365
18890 122549 -194477 55166 -40738 -268533 200515 12297 64218 130347 -223176 -432647
18880 -432647 -13798 -161338 102627 28969 11823 -110390 -306547 -167578 -79378 325255
18869 -158788 -178033 -207451 295621 -91086 -185333 98569 -138997 22617 174816 -57368 -103066
18858 -103066 88388 -175918 130993 285075 -207628 -135195 236309 -308692 97234 128604
18848 128604 23740 195179 272205 21769 -181888 239342 -55464 -43201 16673 36850 -113117
18836B36592j16427c60607J68674g1837j82481d1612A47048J80772d5640l21433
18826c67073C2098b3354j34688A2456a60056O8059k3106o908A01458b19828A27069
18814h9791A53620P4797J31882b57646B85204c70744B044R5343M14990k21152
18804B91225D1108N2469a14390m3523d22j71467A5432a96193G0136G373e9575
18792d73174H6256a3853k42322N8045C6253a50286B2946a53772a4481D07654G4334
18780c57860H1486a37698A899c96664N1126A74849i3899J530A05973D1678a8937
18768i1198A40012i6886M7868q5668k18924a61763j22d999b279C2610a68737r714
18756a78451L0210r3207A27632a22721p4572A28806O8872b80210J36029A35144
$$ plain form
18836 236592 120165 -360607 -191933 -71837 -254318 -41612 147048 327820 -45640 -367073
18826 -367073 32098 -23354 -158042 12456 -160056 -91997 -115103 -122011 101458 -219828 127069
18814 -89791 153620 228417 360299 -257646 285204 -370744 2044 97387 512377 291225
18804 291225 41108 93577 -114390 -157913 -422 -171889 15432 -196193 70136 7373 -59575
18792 -473174 86256 -13853 -256175 -198130 36253 -150286 22946 -153772 -14481 407654 74334
18780 -357860 81486 -137698 1899 -396664 -345538 174849 -93899 -92369 105973 41678 -18937
18768 -91198 140012 -96886 -49018 -134686 -353610 -161763 -161885 -4999 -2279 32610 -168737 -178451
18756 -178451 -148241 -241448 127632 -122721 -197293 128806 197678 -280210 -144181 135144
18745c14363B7040a8774l28952A47716C6342a8690k43451N3357g800j39258m6016
18734a93074n0635g9525B20136c8319D003f3169C32311a70815n1184c8521p7231
18723a15752j38969E0098c31971F9762e7154j24029N5506B44078E6568c5092l8217
18712g3309j83940A44777J25565A13836m56m0749j5135J33670a06237j11647A28221
18700a78027J6680A81145j9237a28741O0484A22473g3750A77932d372C11602g5089
18688A14821a31710k68662B6562h7689j9960j70263E3636J33259a35174k55543
18678c90717I5083f9423A66857m1890K26369a08687K9243A75399b10795o7961
18668b78756J20284F1571k38k8432N6808b33440F3945B0159h2162B73934d6984
$$ plain form
18745 -314363 27040 -18774 -347726 147716 36342 -18690 -262141 -208784 -7800 -147058 -193074
18734 -193074 -243709 -79525 220136 -38319 4003 -63169 332311 -170815 -221999 -38521 -115752
18723 -115752 -254721 50098 -331971 69762 -57154 -181183 -125677 244078 56568 -35092 -73309
18712 -73309 -257249 144777 270342 113836 113380 72631 57496 191166 -106237 -217884 128221
18700 -178027 -161347 181145 161908 -128741 -68257 122473 -73750 177932 -4372 311602 -75089
18688 114821 -131710 -400372 26562 -87689 -107649 -277912 53636 186895 -135174 -390717
18678 -390717 95083 -69423 166857 124967 351336 -108687 -79444 175399 -210795 -278756
18668 -278756 -158472 61571 61333 32901 89709 -233440 63945 20159 -82162 273934 -46984
18656a09798E2071f22413i4303j38792g203j94607j41413a39956B2166i5806O786
18645h9020A70983c90240d705B03478a37658A77534q4268b8454m5290j71486B2108
18633b27504F9107J14383a87682f0369j32740A47351b49587B89064B8220j3744
18623A4476a33234j07117J6372a02259A19716B8955q437b37029F3195d55526e4614
18611A02315m4333a9561n3167j1693o9068K2545C5876a9816C4794j4927b29914
18599e1805J0603l50402d1653k49622B9194h7641j23845l2419k5497A07355m8359
18588E8996p158J23246B072J21549D5735J6633d05167H4678f5249E7582e237k9379
18576c4616k81660F86L9269a40287q7116h0562b52j08477E5278B146J23450a26899
$$ plain form
18656 -109798 52071 -622413 -94303 -233095 -7203 -201810 -343223 -139956 22166 -95806 -89020
18645 -89020 170983 -390240 -4705 203478 -137658 177534 93266 -28454 -73744 -245230 22108
18633 -227504 69107 183490 -187682 -60369 -193109 147351 -249587 289064 28220 14476
18623 14476 -133234 -240351 -223979 -102259 119716 28955 20518 -237029 63195 -455526 -54614
18611 102315 57982 -19561 -72728 -84421 -153489 -130944 35876 -19816 34794 19867 -229914
18599 -51805 -41202 -391604 -41653 -291275 29194 -87641 -211486 -243905 -269402 107355 58996
18588 58996 51838 175084 2072 123621 45735 62368 -405167 84678 -65249 57582 -5237 -34616
18576 -34616 -316276 686 39955 -140287 -227403 -80562 -252 -108729 55278 2146 125596 -126899
18563a16373F4697a347A87560c63489g3315L1192O360A00979d89885b07295a682
18551c10828a41392A2075b32797a05064j56901d7101l25642N3221A8415L6787
18541E5202a17507c7102q5300b8780j72183e395m25226B8876b28697O9141A2247
18529G5840d1759k25900b1885l53488R7482l2329d7408C08898A9250f389E8817
18517A77505O2774f1156C3590h0962b8826q4887a7137C27138a84412A71094a05448
18505c48194J40485E0328b86098A09007M9109D7355c10485E5042c28797e004A10338
18493a32181j95399a50590N4239m43490A91060Q1568A35592j3756J37803b96931
18482A5976J99761A2203f3519A00662J12096a22364j02980p4361A5136a97948
$$ plain form
18563 -116373 64697 -1347 187560 -363489 -73315 -42123 -35763 100979 -489885 -207295 -1682
18551 -310828 -141392 12075 -232797 -105064 -261965 -47101 -372743 -319522 18415 55202
18541 55202 -117507 -37102 -122402 -28780 -200963 -5395 -430621 28876 -228697 -159556 12247
18529 75840 -41759 -267659 -21885 -375373 -277891 -310220 -47408 308898 19250 -6389 58817
18517 177505 240279 -61156 33590 -80962 -28826 -113713 -17137 327138 -184412 171094 -105448
18505 -348194 -207709 50328 -286098 109007 158116 47355 -310485 55042 -328797 -5004 110338
18493 -132181 -327580 -150590 -96351 -539841 191060 272628 135592 121836 259639 -296931
18482 15976 215737 12203 -63519 100662 212758 -122364 -225344 -299705 15136 -197948
18471c64710J19954h9548a2420A40117C4443a47936j71510B33575d0957I4568
18460g3232A44360c48422A37339a7556M271l23726B82395e6930k01041j5597P7892
18449a95676l7688a03815B08186R9620g4292I1418d8020o7083c03n1247B57296
18437b44523L9536N8905J6759L4643P253H8771b14637j02872c4033j03679J9305
18426a18407n3064j40326g7174A55970a3220k3091B6454N6994a20797H2508b05210
18414a73797d9693F1233e1294I8401C8213a10591o2352B59821a75553b474A65229
18402B19933D3700J35539a49748I880a31614B77470a75477I6882R1287d487j79165
18391a83652C45h4506K5314B00672c17764h9613k08134B31172b49965h5144A50313
$$ plain form
18471 -364710 -244756 -89548 -12420 140117 34443 -147936 -319446 233575 -40957 94568
18460 -73232 144360 -348422 137339 -17556 -13285 -337011 282395 -56930 -257971 -273568 -195676
18449 -195676 -233364 -103815 208186 307806 -74292 91418 -48020 -115103 -303 -51550 257296
18437 -244523 -204987 -146082 -129323 -94680 -87427 88771 -214637 -317509 -34033 -137712 -118407
18426 -118407 -171471 -311797 -77174 155970 -13220 -36311 26454 83448 -120797 82508 -205210
18414 -173797 -49693 61233 -51294 98401 38213 -110591 -172943 259821 -175553 -2474 165229
18402 219933 43700 179239 -149748 9880 -131614 277470 -175477 96882 188169 -4487 -183652
18391 -183652 345 -84506 -59192 200672 -317764 -89613 -297747 231172 -249965 -85144 150313
18379b10738B59806a75319j7999A93274a43321H9815L3168a75643D4240K24616
18369B68856E7316a53822j3836B8112b69191h175A33232l3382m0517i2091A89455
18357i4795B00425J7599b12626A52465c05451D2941R7753c5703k67801a593r8251
18346i9844m4563j8911L7967o3359N5991D7069c98669i3946k69733c1831A74082
18334A12870a38790A8795e5948o6465j36784G3397d701B15872c50103J02691b1627
18322a54287N7427j44476Q3238o4546E2791c37186i7794L8365j16793P4755M5888
18311e5579b4497l74713A11502d1236A12185J39671b47716N7121o7162C37318
18300b53308A78581c4937C2579M571a41242A94589f6012j56550k7555Q5593p717
$$ plain form
18379 -210738 259806 -175319 -193318 193274 -143321 89815 122983 -175643 44240 268856
18369 268856 57316 -153822 -167658 28112 -269191 -8175 133232 99850 59333 -92091 189455
18357 -94795 200425 218024 -212626 152465 -305451 42941 140694 -35703 -303504 -1593 -99844
18346 -99844 -144407 -163318 -125351 -188710 -132719 47069 -398669 -93946 -363679 -31831 174082
18334 112870 -138790 18795 -55948 -122413 -259197 73397 -4701 215872 -350103 -247412 -21627
18322 -154287 -96860 -241336 -158098 -222644 52791 -337186 -97794 -59429 -176222 -101467 -55579
18311 -55579 -24497 -399210 111502 -41236 112185 251856 -247716 -190595 -257757 337318
18300 -253308 178581 -34937 32579 37150 -141242 194589 -66012 -222562 -250117 -164524 -172241
18289a72241C142N7671n437J18471b41875B27981J9181A21651a1401C3243J02811
18278A36054b70048J7417a23973q2253A28732b29026b685D0832b92992B48039
18267b66928B8392a64178F3018h6599A22093l8937P7110n7920M7470i3637H5264
18255d6906D57296e2900j34643I4598C4981b92974B05773c4654A11742A8091a4310
18243C57986A21941a37054C0337d0809K60j65526g4381m2827B55768a06133q5851
18232a91984I4397a04473q3996g0917G6882a49312A05742L96080B11244p9227
18222A32017b39786J13821B3670A1795a09459B42130f836n1032j58022b405A50936
18210C7166e7802B03159c14874c8994j25572k1671a8227c226l40459J09244F1374
$$ plain form
18289 -172241 3142 60813 55376 173847 -241875 227981 247162 121651 -11401 33243 136054
18278 136054 -270048 -252631 -123973 -206226 128732 -229026 -2685 40832 -292992 248039
18267 -266928 28392 -164178 63018 -86599 122093 83156 160266 102346 149816 -93637 85264
18255 -46906 457296 -52900 -187543 94598 34981 -292974 205773 -34654 111742 18091 -14310
18243 357986 121941 -137054 30337 -40809 -40549 -206075 -74381 -117208 255768 -106133 -191984
18232 -191984 94397 -104473 -188469 -70917 76882 -149312 105742 501822 211244 132017
18222 132017 -239786 -125965 23670 11795 -109459 242130 -6836 -57868 -215890 -2405 150936
18210 37166 -57802 203159 -314874 -38994 -164566 -186237 -18227 -3226 -343685 -234441 61374
18198a18011l59826B24801E5508a0558D9382b20774B2636O0036f0273C9218a66524
18186H5803o785c4261j10481b2982A83852F4763f30B03921c82780J15635H398
18174a78730c1506A30944b27085c0236A85855F7172k7829J4196a91006e8315j51043
18163b09358B87879L0056B909d15252A39889c11016J39982A10562a41778D8392
18152C6254c93707A62317J24481a0359A38736c38976e6206K3913k1406G6512b3587
18140A66544b06051d3471H8308P0200a27662p7685F4776i347m6863D40838c28281
18128e11071b15206e0837q6475A11501b03178i1596o825b9742E1347l597a88571
18116a54040C7772a69039A35787a00728f538m5402C0116f0421j86696H03Q3060
$$ plain form
18198 -118011 -477837 224801 55508 -10558 49382 -220774 22636 82672 -60273 39218 -166524
18186 85803 79018 -34261 -144742 -22982 183852 64763 -630 203921 -382780 -267145 8398
18174 -178730 -31506 130944 -227085 -30236 185855 67172 39343 53539 -191006 -58315 -209358
18163 -209358 287879 317935 2909 -415252 139889 -311016 -171034 110562 -141778 48392
18152 36254 -393707 162317 286798 -10359 138736 -338976 -56206 -32293 -53699 76512 -23587
18140 166544 -206051 -43471 88308 158508 -127662 -205347 64776 -9347 -56210 440838 -328281
18128 -511071 -215206 -50837 -137312 111501 -203178 -91596 -98421 -29742 51347 47750 -188571
18116 -154040 37772 -169039 135787 -100728 -6538 -51940 30116 -60421 -247117 803 83863
18105H3863a7192j78628a1259A16287n7818a46785k95551a40500d6838J5022D0548
18093F6812R4638a08362d050B89602F0633J2055a01702H5451a28477N5425j42691
18082b15743h3006j61257R6610Q719A03317A6512P3818J45755C0232K4023J72493
18071B26748B3550b38780j2158Q0864I3492a95972B08723i4776C7130b17869k88409
18060e06278e1632C5019P3835c19032G8194b13309i9495j7874e921A20611J39118
18049B59729j20695l4562a65289k0502m7433A82758B8389N1372b21847J04597
18039a17250A84497F3355A5185a1458m099j4155A6700a5261p534C63909b75297
18027g5859A21127l9067k727K9221h7964L5529j67040H1575J08920R7466c52061
$$ plain form
18105 83863 -17192 -195820 -11259 116287 58469 -146785 -442336 -140500 -46838 -31816 40548
18093 66812 161450 -108362 -4050 289602 60633 72688 -101702 85451 -128477 -73052 -215743
18082 -215743 -83006 -244263 -147653 -138934 103317 16512 90330 236085 30232 54255 226748
18071 226748 23550 -238780 -250938 -170074 93492 -195972 208723 -94776 37130 -217869 -506278
18060 -506278 -51632 35019 108854 -319032 78194 -213309 -99495 -117369 -5921 120611 259729
18049 259729 139034 104472 -165289 -185791 -233224 182758 28389 79761 -221847 -117250
18039 -117250 184497 63355 15185 -11458 -15557 -29712 16700 -15261 -22795 363909 -275297
18027 -75859 121127 82060 79333 108554 -87964 -52435 -219475 81575 190495 287961 -352061
18015b29994B9149d06945B54908g3706C07731A21097a91291L6472d2599m5294
18005h7893l58894B16507l9509D0970a46095o9114j3764A41459k8828b1964B50954
17993c99722d6589B40033a86891C4126a43185n2844N9986a9789C9832K65949d0846
17981d5281A28802c63285C3616J53214a51703A36169a6783C06910I2163A5244
17970b36407a03377k63287a40872j8152A81234p1218b24976A02955e03472a59270
17959G2168b69841R5607B52603r2335a77285J9991D7890R673c09533J51670I8022
17947B59552B9527R0724D9646j0577K40351c2528h563B25621f4635F317h3066
17935A29532i7050l26647g8707o9941F7235B4653b67500a31444C9364J1749M3394
$$ plain form
18015 -229994 29149 -406945 254908 -73706 307731 121097 -191291 -154819 -42599 -87893
18005 -87893 -446787 216507 176998 40970 -146095 -215209 -228973 141459 112631 -21964 250954
17993 -399722 -46589 240033 -186891 34126 -143185 -196029 -136043 -19789 39832 305781 -40846
17981 -45281 128802 -363285 33616 186830 -151703 136169 -16783 306910 92163 15244
17970 -236407 -103377 -366664 -140872 -159024 181234 110016 -224976 102955 -503472 -159270
17959 72168 -269841 -174234 252603 160268 -177285 -157294 47890 57563 -309533 -157863 98022
17947 259552 29527 120251 49646 39069 279420 -32528 -8563 225621 -64635 6317 -83066
17935 129532 -97050 -423697 -78707 -148648 67235 24653 -267500 -131444 39364 51113 94507
17924I4507a5179j49507E1981B954b3537j06585A60473a36353A16095J17505E3423
17912h110B09188a08726j52051A97914a2891A17654p02c03216a11471B176b05706
17900c9056m2108j0862I0007a50231O8012C98861H3546N7549b18546d3069A48164
17888a97985A60304a23668D6806a99241O0154M6271j9052B21557a03772j77217
17878b80989b2964B9978b30357B80185H411P701J02382g575j09200B07916H1850
17866b5097m2034k40083A87192a47767k4475P6285m1647C88637a08986j69927
17856b78913B07720A866Q6193l9220R8023O3540J0739c4243C3139J20125N52463
17845G05727c571j91013c3034k1888A82020a30336B1126K538K19593b5805p0613
$$ plain form
17924 94507 -15179 -164686 51981 2954 -23537 -130122 160473 -136353 116095 233600 53423
17912 -8110 209188 -108726 -260777 197914 -12891 117654 116952 -303216 -111471 2176 -205706
17900 -39056 -81164 -92026 90007 -150231 -82219 398861 83546 141095 -218546 -43069 148164
17888 -197985 160304 -123668 46806 -199241 -139087 -92816 -111868 221557 -103772 -280989
17878 -280989 -22964 29978 -230357 280185 8411 16112 118494 -7575 -116775 207916 81850
17866 -25097 -67131 -307214 187192 -147767 -172242 -95957 -137604 388637 -108986 -278913
17856 -278913 207720 1866 88059 48839 146862 210402 221141 -34243 33139 153264 705727
17845 705727 -3571 -194584 -33034 -54922 182020 -130336 21126 23664 243257 -25805 -96418
17834i6418A96830g1969A40125j1909M5649k4794Q32A5716J14624a85146h1593
17822b690r0274A06649k2571B6345M9725K86888E2331J13907m3284b34395b9544
17810g9278q403B14481H899L42361H1600a46051b9345G285L18929j15534H2871
17798A65302a20501j8325D4353P6454Q9270a21182j32514I2649K08770h6052m0740
17787a26792B5545a27046F9445J95308b87457a08672J666A11422K9474k7204b10048
17775B18032a81652A58039J74383a93047e335B3749J71334m6338M6442j9889K36973
17764D12271a80758A79123L7108a43262B80168h6003A67786J38385a26497C0702
17753A87203a30291A22051K16132H6840J61083D0162a23251N597e0614A30054
$$ plain form
17834 -96418 196830 -71969 140125 128216 173865 149071 149903 15716 130340 -185146 -81593
17822 -2690 -92964 106649 84078 26345 76070 362958 52331 166238 122954 -234395 -29544
17810 -79278 -87681 214481 8899 351260 81600 -146051 -29345 7285 326214 210680 82871
17798 165302 -120501 -138826 44353 120807 210077 -121182 -253696 92649 301419 -86052 -126792
17787 -126792 25545 -127046 69445 264753 -287457 -108672 -107006 111422 140896 113692 -210048
17775 218032 -181652 158039 332422 -193047 -5335 23749 195083 148745 195187 175298 412271
17764 412271 -180758 179123 216231 -143262 280168 -86003 167786 306171 -126497 30702
17753 187203 -130291 122051 338183 86840 247923 40162 -123251 -117654 -50614 130054
17742a12231D10912a93560Q2835A41162c38041A29285h2931C9257i2136A85535
17731c78481R4782n2857C51335a35371F9340J40844l745d0412r5534a3102A5750
17719A34912F0630N1264a34749r896A05829J12831Q8010e7526I9327J61068D9093
17707b4763B29559I9474f5061C712J47185k3829Q941K41808e5855M246F0389J13562
17695A73951b24532A99423c143C45081A52010K42937b4501j1792j67798B46454
17684b86636A75261J30986a17404o238A13678i926A30393c2906C2837f2368D7349
17672B51584c1140C64590j06513e188A46898B5216a32194c1266A46817N2798c2803
17660A31662b9442j18251A82810a97304A55087j0258E3580a50615f3098A27454
$$ plain form
17742 -112231 410912 -193560 -110725 141162 -338041 129285 -82931 39257 -92136 185535
17731 -378481 -283699 -336556 351335 -135371 69340 210184 206439 -40412 -135946 -13102 15750
17719 134912 60630 111894 -134749 -144645 105829 218660 306670 -57526 99327 260395 49093
17707 -24763 229559 99474 -65061 3712 150897 127068 136009 377817 -55855 -51609 60389 173951
17695 173951 -224532 199423 -3143 345081 152010 394947 -24501 -36293 -204091 246454
17684 -286636 175261 306247 -117404 -123642 113678 -9926 130393 -32906 32837 -62368 47349
17672 251584 -31140 364590 258077 -5188 146898 25216 -132194 -31266 146817 199615 -32803
17660 131662 -29442 -147693 182810 -197304 155087 144829 53580 -150615 -63098 127454
17649e93A60352a20713B76406b9535A64765E7041k2068H377N6295J15193H9473
17637F0720R6362E2005A9275a55158c8431A39989K89740h2254d0000B95392a64665
17625C6164R6522a45854B01921r6138K96895j15501A42253j6297J86891A33298
17614b67445H4037M05657F5685a0873n4077H3542K43219H1921k2390n333c6491
17602A87922K41575a943o9000q6950C22882A44865J062a33703B6099L45520b06953
17590b9381B28763n8741b1676j55106C05727C6191K9022b06814f336A80116J39084
17579C19200a03433F3041K15091N225e7962B45987C0777J77410K2088k9481q579
17568A92215J2539a05892C61306F4857L5387a75346A52948P4582a71655B29162
$$ plain form
17649 -593 160352 -120713 276406 -29535 164765 57041 34973 8377 64672 179865 89473
17637 60720 157082 52005 19275 -155158 -38431 139989 429729 -82254 -40000 295392 -164665
17625 36164 132686 -145854 201921 105783 402678 287177 142253 125956 312847 133298
17614 -267445 84037 489694 65685 -10873 -64950 83542 326761 81921 59531 54198 -36491
17602 187922 429497 -1943 -70943 -157893 322882 144865 145927 -133703 26099 371619 -206953
17590 -29381 228763 170022 -21676 -176782 305727 36191 65213 -206814 -6336 180116 319200
17579 319200 -103433 63041 278132 283357 -57962 245987 30777 208187 230275 200794 192215
17568 192215 204754 -105892 361306 64857 100244 -175346 152948 227530 -171655 229162
17557a75103F2320L0068b2899C58537A17567a16368B02677J22292A30013N7523
17547A87536K23808D2826J92358j5673I9015K30363c2865A14535k6753N7578F667
17535A16486K18682j38176n9534K92967j65034M1070J6939A0886O97924J54480
17525H63290Q0887j00082k70908N2795K19744A76491J27146A02077P5460J64379
17515C41916j50899J65599M2532Q4922N57686R8026k03922O5308m55227n6702
17505D89239J6083A04071J00581J88924j53114o8099K40803K18280A88020J83028
17495C71048A06051J05806Q6017P1192L8807K76R1727j49151J75060A80301M5665
17484B25966n275a16417A79358M8065J439j09750L47430R5772A82366P3702J92273
$$ plain form
17557 -175103 62320 92388 -22899 358537 117567 -116368 202677 324969 130013 187536
17547 187536 411344 42826 235184 219511 99015 329378 -32865 114535 87782 145360 6667
17535 116486 335168 196992 137458 430425 265391 306461 323400 10886 708810 863290
17525 863290 944177 844095 573187 625982 845726 176491 303637 102077 177537 341916
17515 341916 191017 356616 399148 484070 1041756 1139782 935860 1001168 545941 489239
17505 489239 505322 104071 204652 393576 240462 172363 413166 631446 188020 371048
17495 371048 106051 211857 297874 369066 407873 408149 499876 350725 525785 180301 225966
17484 225966 220691 -116417 179358 227423 228862 119112 466542 562314 182366 256068 448341
17473D48341j80723O3096a12999A37701K00058I5669J38441Q8768J5689q8259
17463B50308R730m9080J80757j73026J25670K44797B15397H7306L42244j14684
17453C14866K43068E7384L39851j73497K19956J7041j06577J53644A84024M56321
17443F40345k13810Q9422J9945k1368k0726J9727j50232Q9741p3929J8359p6473
17432C21001J70255k35847J01799N8869F33M89666j07119q8578q0303H2310K47043
17421C29353j29708J02333N60163B73830F7771K77885q3783J3258L20846j80392
17411D15585O6671j86882J47104J67532A77753M33729B23165L21077A05004b4209
17400D86897c5894F9857O22541k03928A51210Q4671j14621l159J33663j17170
$$ plain form
17473 448341 267618 330714 -112999 137701 337759 95669 234110 322878 338567 250308
17463 250308 260038 210958 391715 218689 344359 589156 215397 87306 429550 314866
17453 314866 557934 57384 397235 223738 443694 460735 354158 507802 184024 640345
17443 640345 426535 515957 535902 514534 493808 513535 363303 453044 379115 397474 321001
17432 321001 491256 255409 357208 416077 633 490299 383180 294602 214299 82310 329353
17421 329353 199645 301978 862141 273830 67771 345656 261873 275131 595977 415585
17411 415585 482256 295374 442478 610010 177753 611482 223165 544242 105004 -24209
17400 486897 -35894 69857 692398 488470 151210 235881 121260 118101 251764 134594
17390A34594j610o2828J54453A11957K04423R2378E4688M54393p7769j61291k6946
17379B43075F6000j6534M12678A47360F9477P4748p834k5169J20547J555L1295
17368B64619j1585J1043Q6544I8442P2542G6283a71269A50317J99096j24774A04664
17356B91688J55780e1229C46105A45323B1860J47608J91915k1768L5328A64369
17345B59387A10699B1230L33474A42338M8346J41101A59657k2923L5022P5268
17335B47024q8752K24741R9002F9747L97341j66927j12126C7211M05949A12551
17324C19643F8639b0995B79041K93264k81384M1930a16518C17638p4314L4753
17314B78077p1893n2810O8797N33983l36572j01563p3433J1244M725J73053j11420
$$ plain form
17390 134594 132984 70156 224609 111957 316380 408758 54688 509081 431312 270021 243075
17379 243075 66000 49466 462144 147360 69477 144225 136391 111222 231769 233324 264619
17368 264619 253034 264077 350621 98442 170984 76283 -171269 150317 349413 224639 104664
17356 291688 447468 -51229 346105 145323 21860 169468 361383 339615 374943 164369
17345 259387 110699 21230 354704 142338 190684 331785 159657 136734 171756 247024
17335 247024 158272 383013 482015 69747 467088 300161 188035 37211 443160 112551
17324 319643 68639 -20995 279041 572305 290921 332851 -116518 317638 243324 278077
17314 278077 206184 153374 222171 756154 419582 318019 244586 255830 260555 433608 322188
17303C22188j54149J96173p8877O6662I6484L57097A44480J13518J90294j04774
17293C43518K39767j98643J49723B03423R2935j00256a81650A22862N9546K62487
17283D44895n9167K074j70656J92197A53248M6961K38937j40828P9030O0332k4732
17272D12948L01738B93849j36650K66874l1289L342M4040j6159l6568k5525J7867
17261C79781q1839o3728J65942n8783P1200J25134k66911r0290K0064L18767j14463
17250D04874L85018A76366L2101E5925M98488o3289m718L4381j16715m6860L7009
17239C94221C4853M41770m5321m0919o0180J61961A43664L40942j60861j53049
17229A70696J76980O5455j79659M75137G7134J10281m0048L12355B2783L33442
$$ plain form
17303 322188 168039 364212 285335 351997 96484 453581 144480 257998 448292 343518
17293 343518 583285 384642 534365 203423 296358 196102 -181650 122862 182408 444895
17283 444895 385728 387802 217146 409343 153248 200209 439146 298318 377348 437680 412948
17272 412948 714686 293849 157199 424073 392784 396126 440166 424007 387439 361914 379781
17261 379781 297942 234214 400156 341373 412573 537707 270796 180506 200570 519337 404874
17250 404874 789892 176366 208467 55925 554413 491124 486406 520787 404072 357212 394221
17239 394221 34853 476623 431302 390383 330203 492164 143664 484606 323745 170696
17229 170696 347676 413131 233472 708609 77134 187415 147367 459722 22783 356225
17219C56225K96417k86816L9970j9037H3685N71098C05440A5112N50610B21990
17208B50155J30121Q3927J05817k03112m0225B5264N98579k88233j1308K58823
17198E83125J90523C02486l8924J42530K06039k70311j03570M48651j80027R2361
17188E99235I406O02564j36585r3678A18842L88630K48352k09578O0321A83114
17177B91030K31556k50220J03315j84389L71271M1520J17797k09441k28407L26346
17167F10378J5945j73182k04953K52464r2678P2632R6600j63749N8522J16113
17157E88092l2177R1171k02052J08017J24844j95888J49793J30824M1298k46017
17147E57905j386o761r9346J45830M24558l81450J20385j17763B97400J91897
$$ plain form
17219 356225 652642 365826 405796 386759 83685 654783 305440 15112 565722 221990
17208 250155 380276 464203 570020 366908 326683 25264 623843 335610 324302 583125
17198 583125 773648 302486 263562 406092 612131 341820 238250 686901 506874 599235
17188 599235 9406 611970 475385 381707 118842 507472 755824 546246 606567 183114
17177 291030 522586 272366 375681 191292 562563 604083 721880 512439 284032 610378
17167 610378 626323 453141 248188 500652 407974 480606 577206 413457 471979 588092
17157 588092 555915 647086 445034 553051 677895 482007 631800 762624 803922 557905
17147 557905 556519 549758 450412 596242 1020800 639350 759735 641972 297400 489297
17137D89297j05986R8655L04124k36347n7678N5138k7834K24126k21621Q6405
17127F08279k21086L42623C53779M24403C57797q1872M07374l39431O1157j04236
17117C00789O25535k85760o0080P3320k68822O5224K65184q5994J00500o8296
17107F61600M6587l3462P49N6025k18854O370L22455Q6773k03837j79191K85161
17096H30376j15304J22299C83310L28243q3761L2489J09077j395o409j8553l37708
17085D05293K14430j8335K96088o8142J40216j23964j0154k08322K57551k20960
17075F63701J00052j39239R5443K64545l27462Q429K69129j52572Q23l86449M58958
17064H55358C51154K05016K78283l95741J83741L91037C60685M61240J18749k6246
$$ plain form
17137 489297 383311 481966 786090 549743 492065 547203 519369 743495 521874 608279
17127 608279 387193 729816 353779 778182 357797 275925 683299 343868 405025 300789
17117 300789 926324 640564 580484 653804 384982 450206 715390 629396 729896 661600
17107 661600 708187 674725 675474 731499 512645 519015 841470 928243 724406 545215 830376
17096 830376 715072 837371 383310 711553 627792 660281 769358 767963 761554 743001 405293
17085 405293 619723 601388 897476 829334 969550 845586 835432 627110 884661 663701
17075 663701 763753 624514 719957 984502 657040 665469 934598 782026 782849 396400 855358
17064 855358 351154 556170 834453 438712 622453 1013490 360685 821925 940674 914428
17054I14428o7860j16649p7821K75299q7954j8253J90045j6707J7318K20715j73526
17043A059035n9806k79672L82367j67575J4978J72374l14696M23491n4777m7704
17033A128015q8734k23204R4772m6088N7417K70795j40588j60510K30310k03281
17023I18904L48442k48858k31661L56841l0517k25698J74235R6209o8886j7889
17013A071122J37994j49723L47624j32640k44062L502J87556M4890N8512q9338
17003A235437M770j38095K93600K7150k28422K06855F71561O92972n3312q3971
16993A227250K22333M5697j18159R7330j57781J15994j60200K69226n2564k72413
16983A216713M4808J78532k95289K94088j39747j61420l3051Q2203N40615r2591
$$ plain form
17054 914428 846568 729919 652098 927397 839443 821190 1011235 994528 1011846 1232561 1059035
17043 1059035 999229 719557 1101924 934349 949327 1121701 807005 1230496 1175719 1128015
17033 1128015 1039281 816077 910849 864761 922178 1192973 1052385 891875 1122185 918904
17023 918904 1267346 1018488 786827 1143668 1113151 887453 1061688 1157897 1089011 1071122
17013 1071122 1209116 1059393 1407017 1274377 1030315 1033817 1221373 1266263 1324775 1235437
17003 1235437 1240207 1102112 1395712 1422862 1194440 1401295 671561 1364533 1311221 1227250
16993 1227250 1449583 1495280 1377121 1474451 1316670 1432664 1272464 1541690 1489126 1216713
16983 1216713 1261521 1440053 1144764 1438852 1299105 1137685 1104634 1186837 1727452 1634861
16973A634861j83538J97065J10430k72500P9638k4497K49293o7101k9701Q6487
16963A780437n08828J64243P3935K28970K8061M4377l11221K74791k60048O6134
16953A580851K91752l8971M4181k23295j14859K99802O4784K375O0637j63323
16943A803934R3003K50059j97561p1848L92132K12916l91084O5440k64515n7980
16933A834496J71386K37058j24114K4681K01576J26447m64495K60578j23083R0714
16923B235244J73333j28459j6007K60380J46903j65655k07078k0752L36761k03417
16913B411253K60036K07682l19092J85501K69515j40047L9260l3811j04764p6164
16903B699369J26012J84609j30018k11331M52340O0106k82329J41912J37966n7223
$$ plain form
16973 1634861 1451323 1648388 1758818 1486318 1565956 1541459 1790752 1723651 1693950 1780437
16963 1780437 1271609 1435852 1509787 1738757 1766818 1811195 1499974 1774765 1514717 1580851
16953 1580851 1872603 1833632 1877813 1654518 1539659 1839461 1904245 1906620 1967257 1803934
16943 1803934 1896937 2146996 1949435 1877587 2269719 2482635 2091551 2156991 1892476 1834496
16933 1834496 2005882 2242940 2118826 2143507 2345083 2471530 2007035 2267613 2144530 2235244
16923 2235244 2408577 2280118 2264111 2524491 2671394 2505739 2298661 2277909 2614670 2411253
16913 2411253 2671289 2878971 2559879 2745380 3014895 2874848 2914108 2880297 2775533 2699369
16903 2699369 2825381 3009990 2879972 2668641 3120981 3181087 2898758 3040670 3178636 3121413
16893C121413M6037K22271k30582L35564k22254o3593J68181K54821j07256k94603
16883C229999N14278K021j72280j5950J85441k13760j20707M55548j81689J71744
16873C854645L33745j01214L7380J42963O8798J7057k56866K49618J46298N9282
16863D551706M5797j20126L41978k09273L66599l37953L95070l088l9769K40303
16853E231244j13059K51644J00915J21645j94181J15243N40844m54765K40626
16844E840156O53948k67209K57977K8101R8391J51045K3796l14669L69134Q5905
16834F926575M03908K0004j20861k31576N26603j51283N38972P6457j08563L31069
16824H211305j4816j4605J07217O18347j4493N17158J30326j8709K08550r7929
$$ plain form
16893 3121413 3167450 3389721 3159139 3494703 3272449 3208856 3377037 3631858 3524602 3229999
16883 3229999 3744277 3746298 3574018 3558068 3743509 3529749 3409042 3864590 3682901 3854645
16873 3854645 4188390 4087176 4124556 4267519 4336317 4353374 4096508 4346126 4492424 4551706
16863 4551706 4597503 4477377 4819355 4610082 4976681 4638728 5033798 5030710 4990941 5231244
16853 5231244 5118185 5369829 5470744 5592389 5398208 5513451 6054295 5599530 5840156
16844 5840156 6494104 6226895 6484872 6512973 6611364 6762409 6786205 6471536 6840670 6926575
16834 6926575 7330483 7350487 7229626 6998050 7524653 7373370 7912342 7988799 7880236 8211305
16824 8211305 8196489 8181884 8289101 8907448 8892955 9410113 9540439 9521730 9730280 9632351
16814I632351N50551J03956J27999N18405L48797j67074M58969Q297j40510O96771
16804A2138512O7656L33981J96317O65871K8009K15515O84678k56572O42879J53821
16794A4870667O49490L99837O01716N4720L16743L42005O87084J42306N97420
16785A8661988M67770J058811j87779Q29447N60793M53184N27061P34308L79650
16776B3485233Q74667R09019O09947R38942P70287P14122R44354O83585Q03869
16767C0734025R95101J095855J010470R48996R52389J281219J512972R46432J173937
16758D0651396J517218J800856Q66748J408248J774192J768275J363305J688251
16750E2838489J819232J939486J773571K162816J825483J980387K460833J829065
$$ plain form
16814 9632351 10182902 10286858 10414857 10933262 11282059 11114985 11573954 11582251 11441741 12138512
16804 12138512 12206168 12540149 12736466 13402337 13430346 13645861 14330539 14073967 14716846 14870667
16794 14870667 15520157 15919994 16521710 16576430 16893173 17235178 17922262 18064568 18661988
16785 18661988 19129758 20188569 20000790 20830237 21391030 21844214 22371275 23105583 23485233
16776 23485233 24359900 25268919 25878866 26817808 27588095 28302217 29246571 29930156 30734025
16767 30734025 31729126 32824981 33835451 34784447 35736836 37018055 38531027 39477459 40651396
16758 40651396 42168614 43969470 44836218 46244466 48018658 49786933 51150238 52838489
16750 52838489 54657721 56597207 58370778 60533594 62359077 64339464 66800297 68629362
16742F8629362K349423K049863K474188K138084K290296K448001K168201K034954
16734H6582372K275689K245367J909327K101112J724864J605286J716840J365061
16726A01525918O81526J295324P79708O42425N78640n49649K41078l68015m56084
16717A04370871j148226p99165j299033j395966j488914j585290j920693j672893
16709I3060691k266650k349218j790310k689337k107207j924502k444012k458537
16701G5030918k065757k068119k318065k589152j831753k062293k416843j738087
16693E7940849j550038k260628j352064k016787j687966j562713j562960j582905
16685D4364788j243991j610434j421610j393849r50653j299720q66527j258634
$$ plain form
16742 68629362 70978785 73028648 75502836 77640920 79931216 82379217 84547418 86582372
16734 86582372 88858061 91103428 93012755 95113867 96838731 98444017 100160857 101525918
16726 101525918 102207444 103502768 104282476 104924901 105503541 104953892 105194970 104826955 104370871
16717 104370871 103222645 102423480 101124447 99728481 98239567 96654277 94733584 93060691
16709 93060691 90794041 88444823 86654513 83965176 81857969 79933467 77489455 75030918
16701 75030918 72965161 70897042 68578977 65989825 64158072 62095779 59678936 57940849
16693 57940849 56390811 54130183 52778119 50761332 49073366 47510653 45947693 44364788
16685 44364788 43120797 41510363 40088753 38694904 37744251 36444531 35578004 34319370
16677C4319370j558487n48085j341233l92597j230794p30725r60522o40203q94345
16668B6022379p27333o10087q74525n83006p99656m37582n92741m17174j046786
16659A9933489k02319n31505l90767l4745j355640l4220m16749n87671k57400
16650A6122473l18128m50377l84934q11360K79294m02944o65383j52802j99366
16641A3016473l89603j99765n23314j40103j0191o2554p26675J05217n71856L07095
16631A0804724o45437J83521l99355l22582p9252j6350k31638k27883l30833k5979
16621H708936l80864r005j38313l06737L35715o08696J10624k77632j3866k81406
16611G138756K5691m91385L41259j09241k49116R0454l37565j4121j40019q6293
$$ plain form
16677 34319370 32760883 32212798 30871565 30478968 29248174 28517449 27556927 26916724 26022379
16668 26022379 25295046 24684959 23810434 23227428 22427772 21990190 21397449 20980275 19933489
16659 19933489 19731170 19199665 18808898 18774153 17418513 17384293 16967544 16379873 16122473
16650 16122473 15804345 15353968 14969034 14157674 14436968 14034024 13368641 13215839 13016473
16641 13016473 12626870 12427105 11903791 11763688 11753497 11690943 10964268 11069485 10497629 10804724
16631 10804724 10159287 10342808 9943453 9620871 9541619 9525269 9293631 9065748 8734915 8708936
16621 8708936 8328072 8319067 8180754 7874017 8209732 7601036 7711660 7434028 7420162 7138756
16611 7138756 7164447 6673062 7014321 6905080 6655964 6746418 6408853 6394732 6254713 6168420
16601F168420J26265m94811J57331K610l55790j03207k91954K55921J36725l25912
16591E275598j58706J13016j61006k69135J88221k9665l84326o4749n8459J19930
16581D570719r1772J54825j82727k09595Q4927k2456K8631k77862k41639P0323
16571C883374K4152M6024r2623R2096l48836q8487r3806J04035L65346m46296
16561C444979M1578M1260j31690k0620N5672j85521k62829J86816j38545K00537
16551C231637l86712j36299J82296j5870K07371p0506k80389K26047q6422k65305
16541B605848J97818l58779O8416K15479j92920O8809k34989N0101j29840p7834
16531B212109J23043M35539j04033k0698l94757L04301n7209j22582k37079J11109
$$ plain form
16601 6168420 6294685 5799874 5957205 5959815 5604025 5500818 5208864 5464785 5601510 5275598
16591 5275598 5116892 5229908 5068902 4799767 4987988 4958323 4573997 4509248 4450789 4570719
16581 4570719 4478947 4633772 4451045 4241450 4326377 4303921 4332552 4054690 3813051 3883374
16571 3883374 3907526 3953550 3860927 3953023 3604187 3515700 3421894 3525929 3891275 3444979
16561 3444979 3486557 3527817 3396127 3375507 3431179 3245658 2982829 3169645 3031100 3231637
16551 3231637 2844925 2708626 2890922 2875052 3082423 3011917 2731528 2957575 2871153 2605848
16541 2605848 2803666 2444887 2513303 2728782 2535862 2604671 2369682 2419783 2289943 2212109
16531 2212109 2335152 2770691 2666658 2645960 2251203 2555504 2498295 2375713 2138634 2249743
16521B249743k56108m7276J77845K16893o2746o7661l13140J49458j10789J53597
16511B089816l60501K1737J90302p7432J17997n8803j14312J99170k0161j17498
16501A870315l43773J07608J06609O7566K47448n15614M14700l6026m13453j00355
16491A405025N24224l45205q1787J34808L20110l10510l01715n1344J42002r2601
16481A343007J17680k03827M07424l04392L3246K08563l20074J98903l2649J98213
16471A646094k87526K25487j28272l5038k01039O0594K91659k92945j62824J38254
16461A254444J59570j91245Q082L92026k58454J1910J21112p29428L99602K92997
16451A460616l75944L79894k03578j18070j8217k7987J00119L4859O8456k30017
$$ plain form
16521 2249743 1993635 1946359 2124204 2341097 2278351 2210690 1897550 2047008 1936219 2089816
16511 2089816 1729315 1751052 1941354 1863922 1981919 1923116 1808804 2007974 1987813 1870315
16501 1870315 1526542 1634150 1740759 1808325 2055773 1540159 1954859 1918833 1505380 1405025
16491 1405025 1929249 1584044 1502257 1637065 1957175 1646665 1344950 1293606 1435608 1343007
16481 1343007 1460687 1256860 1664284 1359892 1393138 1601701 1281627 1480530 1447881 1646094
16471 1646094 1358568 1584055 1455783 1420745 1219706 1280300 1571959 1279014 1116190 1254444
16461 1254444 1414014 1222769 1230851 1622877 1364423 1376333 1497445 768017 1167619 1460616
16451 1460616 1084672 1464566 1260988 1142918 1124701 1096714 1196833 1231692 1300148 1070131
16441A070131q4142J65805l51553K95082n14548O80794k82417J97451j39958N5820
16431A092465q9019l1128J99421k91890J36124D34766K84708M33927p4152j08529
16421I70720R732j28753L9242J51444r7776l45860L43244j12925J44784j61671
16411H12181j20960J08622L94056j14143j75595J96202l53704J32613k46068K92099
16401I25303l67823J96656j9534Q7989l3318P7513J01279q2923k33812j45627
16391E05703K38806k07021K72170R3197J74662m52144O16751B42644O96234l22778
16381F16100L8339J66344K2673j10692j82783K00619o2034l22549M69689r6703
16371G39003j66222J32261B71938N91408k92914n1264M39322m30599P7952K41530
$$ plain form
16441 1070131 985989 1151794 800241 1095323 580775 1261569 979152 1176603 1036645 1092465
16431 1092465 1003446 972318 1171739 879849 1015973 434766 719474 1153401 1079249 970720
16421 970720 980452 851699 890941 1042385 944609 598749 941993 829068 973852 812181
16411 812181 691221 799843 1193899 1079756 904161 1100363 746659 879272 633204 925303
16401 925303 557480 754136 734602 822591 789273 866786 968065 885142 651330 505703
16391 505703 744509 537488 809658 902855 1077517 625373 1242124 242644 938878 616100
16381 616100 654439 820783 843456 732764 549981 750600 688566 366017 835706 739003
16371 739003 572781 705042 271938 863346 570432 519168 958490 527891 605843 847373
16361H47373k24837j35960J7150R3683J31445B30969K48751K99636l28096K12792
16351F64052P1578k52053j61805K12728Q0691L39128j33909B96465K20776J85341
16341G02582j47177Q7611j96466K7573J50176l4470j78517o7614K63168j17098
16331D89768J58636k42888j3924J50247n1500J70123q3475q5595K47558j51506
16321E87444P0968j59574K78333l67036J17682j97082j42621M23583j92617L14099
16311G33179j16690A49204M10207k56517J47941O1555K0299j4559B08014N83869
16301G91883l14237K308k32333J41000K44259k36477l5912K41827k26636j49299
16291B26383k5949n7044M80591E4049M50999j35688E3629M58812A96356J07874
$$ plain form
16361 847373 622536 486576 503726 597409 728854 230969 479720 779356 451260 664052
16351 664052 735630 483577 321772 534500 615191 954319 820410 296465 517241 702582
16341 702582 555405 643016 446550 474123 624299 589829 411312 343698 606866 489768
16331 489768 648404 405516 391592 541839 490339 660462 576987 491392 738950 587444
16321 587444 658412 498838 777171 410135 527817 330735 188114 611697 419080 733179
16311 733179 616489 149204 559411 302894 450835 512390 532689 518130 208014 791883
16301 791883 477646 479954 247621 388621 632880 396403 360491 602318 375682 226383
16291 226383 200434 143390 623981 54049 505048 369360 53629 512441 196356 304230
16281C04230J86595j71809K1266L24738D3094N51514A52024P2324M02492k70704
16271C56136O9603o1862k2050N2760J0646J43344k52617q1617q7290K58412J07966
16260D93431B13332L03286J59997k41600E1185N47663J17589B19973K14431A81183
16249A37203O9798J33804p0496j02237J96699K03329j75227A82385P5447k5504
16239B32328J03783A56503n1156K6215L2088Q5165m0523R127M6280L03772A47518
16227C63166l7790j26252J87578j75230K1271o2729J3642K59002A65670f3796
16216A52321J5503o3262P8245K44471I275L09936A25130B5874K59458J07922j45950
16205B47304B3832K58551P6876b0712C25572E5513A1226K53311O275a9538A05583
$$ plain form
16281 304230 490825 319016 340282 665020 43094 594608 152024 224348 626840 356136
16271 356136 425739 363877 341827 394587 405233 548577 295960 214343 127053 385465 493431
16260 493431 213332 516618 676615 435015 51185 598848 716437 219973 434404 181183
16249 137203 207001 340805 270309 168072 364771 568100 392873 182385 257832 232328
16239 232328 336111 156503 105347 131562 163650 248815 208292 217419 263699 567471 147518
16227 363166 325376 199124 386702 211472 232743 170014 183656 442658 165670 -63796
16216 152321 167824 104562 182807 427278 9275 319211 125130 25874 285332 393254 247304
16205 247304 23832 282383 359259 -20712 325572 55513 11226 264537 270812 -19538 105583
16193B87308m8529J16976C2182O60927B96867H8023K66716j33534P5539R3353
16183C90097k013g3946D21366J9875f9648B9459j2567J34536m8923J52676M7016
16172C02197l872A46920L27179h1614B14607e674A77881J35019j8852a59309I2638
16160C7824P3400J89451m556j39160J61144F6325J01566P3913J21160C8093K59903
16149B97996b38953B1484J13475j7209P3234J68578j68153K6C279a37461B37968
16137D44430c63E8082K12631B9615K7105K45951a9707d050B9382M37837H0361
16125B29920e6615B11866r1087c9445F8125P9436B2186a97354A95788J25223d782
16113B93392J39805A85419f6564A17822K60492A5898J84194q8487B7872O25421
$$ plain form
16193 287308 238779 355755 32182 693109 296867 88023 354739 221205 296744 390097
16183 390097 388084 -73946 421366 441241 -69648 29459 16892 151428 102505 255181 302197
16172 302197 298325 146920 474099 -81614 214607 -5674 177881 312900 294048 -159309 92638
16160 37824 111224 300675 296119 156959 318103 66325 167891 241804 362964 38093 297996
16149 297996 -238953 21484 134959 117750 190984 359562 191409 191435 3279 -137461 237968
16137 444430 -363 58082 270713 29615 56720 302671 -19707 -4050 29382 467219 80361
16125 229920 -56615 211866 120779 -39445 68125 147561 22186 -197354 195788 321011 -4782
16113 293392 433197 185419 -66564 117822 378314 15898 200092 111605 27872 653293
16103F53293a0450I2920R3195C8510c15648B4460M0133O2042J45605R0543A01325
16091f544k41416d4956D1582d7631B57359E4762b11455J8974A21282m9382J15247
16080A87147e927A28780a33709B2990O1837Q3540J77512I2607L36722H1341J79071
16069B60412A16442O2232b03444N2102l7170A57543L2238d2196H6748N3732J52501
16058B92981D3912K28902A3549M46447A40115J16199A19026K1096a44964E5109
16047B11151h6747A09046b38857B75990j24213o035a65279A9960K75004c38888
16036H597b5469E719K74597b1726J659I1770Q8336L3916k090f1323E1486J0659
16024F2145a0610A24950c0266E8938K06051D6994O7659P4299B9966J7591J86230
$$ plain form
16103 653293 -10450 92920 186115 38510 -315648 24460 64593 126635 272240 362783 101325
16091 -6544 -247960 -44956 41582 -47631 257359 54762 -211455 -192481 121282 71900 187147
16080 187147 -5927 128780 -133709 22990 84827 168367 345879 92607 429329 81341 260412
16069 260412 116442 178674 -203444 -151342 -188512 157543 189781 -42196 86748 140480 292981
16058 292981 43912 272814 13549 459996 140115 256314 119026 140122 -144964 55109
16047 211151 -86747 109046 -238857 275990 151777 145742 -165279 19960 294964 -338888
16036 8597 -25469 5719 280316 -21726 -20067 91770 180106 214022 211932 -61323 51486 62145
16024 62145 -10610 124950 -30266 58938 264989 46994 114653 188952 29966 47557 233787
16013B33787a43792A45123K41806b14828B47231a07389O071C4261M63320b1151
16002C8777R62K23227h2029A86631m1439b85491P1310B83347a40601A03689K00049
15991C03738j45307a17947C20120A26913M54058o375L68578J95001k3484K24601
15981A339292j72975m17887l22265c3228D69075j75573c4651A01056b8559A76717
15970A92262a63280F9068B8843c40418O6780A774d386q9015B85852D7882K12985
15959B60867a63121A56935f3500G5447a21040D9798Q3847b50637h8678A5402a40038
15947a68051c8333j95427b6901j14057k23023D8227a02611D2172L0786b65418
15936c4509A14223K7686c25788A84066g400F8413c34685a20670n9194I4107K5135
$$ plain form
16013 233787 -143792 145123 386929 -214828 247231 -107389 -101318 34261 497581 -21151
16002 38777 39739 262966 -82029 186631 145192 -285491 -214181 283347 -140601 103689 303738
15991 303738 158431 -117947 320120 126913 580971 574596 943174 1138175 1114691 1339292
15981 1339292 1166317 748430 426165 -33228 469075 293502 -34651 101056 -28559 176717
15970 192262 -163280 69068 28843 -340418 -273638 1774 -4386 -93401 285852 47882 260867
15959 260867 -163121 156935 -63500 75447 -121040 49798 133645 -250637 -88678 15402 -140038
15947 -168051 -38333 -233760 -26901 -140958 -363981 48227 -102611 42172 72958 -265418
15936 -34509 114223 141909 -325788 184066 -7400 68413 -334685 -120670 -179864 94107 119242
15925A19242f5048D8030J64416A01421N9081l81h4674j07788c8863A93563i7841
15913a57555A8258a19135e8677E8527J0290L0623a26761A55007l2517c1168C284
15901e4788A39422a6878r6207L6445A28042a9562h016E4172i2401k6519M939m122
15889a18103e3381C8026H434J79583D8357J87199o9782o5268J73603P915c24859
15877c8475I8213R1360c31824G411J0913b8097j61733i2325b6165A91045I5276
15865h105A09810D214J3495P1072a53965E4867d7733A69662J2379E9626J28112
15854A87738F1649k452b0320G294L70256i9143j27965b5708j2879n3887p3547
15843a66021A12015K44272E175P7815g5255G8329J22679e1301A51920g7427J4852
$$ plain form
15925 119242 -65048 48030 212446 101421 160502 160121 -84674 -192462 -38863 193563 -97841
15913 -157555 18258 -119135 -58677 58527 68817 99440 -126761 155007 122490 -31168 3284
15901 -54788 139422 -16878 -113085 -76640 128042 -19562 -8016 54172 -92401 -118920 -113981 -118103
15889 -118103 -53381 38026 8434 188017 48357 235556 165774 100506 274109 282024 -324859
15877 -38475 98213 189573 -331824 7411 18324 -28097 -189830 -92325 -26165 191045 95276
15865 -8105 109810 4214 17709 88781 -153965 54867 -47733 169662 182041 59626 187738
15854 187738 61649 59197 -20320 7294 377550 -99143 -227108 -25708 -38587 -92474 -166021
15843 -166021 112015 356287 5175 82990 -75255 78329 201008 -51301 151920 -77427 -62575
15832f2575r0206c0104j39248g4803H6729e21753e3420A91540a42634k1246e8357
15820A43586J78916a77415b5721a0305n33648c2602B92469j03452c29603J0050
15810c19553H4125a84690H4606g9259k32992R1997j45899e449H8976h9372k4484
15799a13856a1739l08270A2698J36578d9167H3596d03210a78771B68290q94m7400
15788B19996I226J78444a76682A0884a22897a4170K905k47516J6460B0231b96628
15776B40833g975k0156r0108Ac028k59056J26616k75217A08143l0646c0533C32329
15763d9695p5999a1991B37360p6921A4457J14254J67704A15864a11237C84201
15752A49735M3332a27021C63901g9895C54809j27163E3666a82999B57490i5049
$$ plain form
15832 -62575 -152781 -30104 -169352 -74803 86729 -521753 -53420 191540 -142634 -163880 -58357
15820 143586 322502 -177415 -25721 -10305 -543953 -32602 292469 189017 -329603 -319553
15810 -319553 84125 -184690 84606 -79259 -312251 -220254 -366153 -5449 88976 -89372 -113856
15799 -113856 -11739 -320009 12698 149276 -49167 83596 -403210 -178771 268290 267396 219996
15788 219996 9226 187670 -176682 10884 -122897 -14170 -11265 -258781 -242321 20231 -296628
15776 240833 -7975 -28131 -118239 1 -3028 -262084 -135468 -410685 108143 77497 -30533 332329
15763 -49695 -125694 -11991 237360 160439 14457 128711 296415 115864 -111237 384201
15752 149735 193067 -127021 363901 -79895 354809 227646 53666 -182999 257490 -95049
15741b699r3641b9547H4940a50576b4939B13736k4792B2549J79707a45965l06959
15730d52924a04975A79060c5090J3594G2070J73881c5933B01862H0285C9853d4049
15718G9926a47574A60904d590m1518B2091i6145j33245D08719b25506D92242c35297
15706A33076a30522a0862j70088i128A2159h5775B22306a20251m3879f137k9350
15695c5487F1736c54920a5146E004a63205G7869K19961A05986A1861a30521D0840
15683g1515C2040f3695a026B68816H7620k9187L3970k6800J83863D395R3353M2877
15671A40625a89211o6924J16657j8939n352f6821J2593H6286c19325A00594a45945
15659B09526j9533c38067H1329e1896D3904d11529c8719k13770m3488C19658a27331
$$ plain form
15741 -2699 -96340 -29547 84940 -150576 -24939 213736 188944 22549 202256 -145965 -452924
15730 -452924 -104975 179060 -35090 -21496 72070 245951 -35933 201862 80285 39853 -44049
15718 79926 -147574 160904 -4590 -46108 22091 -96145 -229390 408719 -225506 492242 -335297
15706 133076 -130522 -10862 -180950 -9128 12159 -85775 222306 -120251 -164130 -6137 -35487
15695 -35487 61736 -354920 -15146 5004 -163205 77869 297830 105986 11861 -130521 40840
15683 -71515 32040 -63695 -1026 268816 87620 58433 92403 65603 249466 4395 97748 140625
15671 140625 -189211 -256135 -139478 -158417 -163769 -66821 -54228 86286 -319325 100594 -145945
15659 209526 189993 -338067 81329 -51896 43904 -411529 -38719 -252489 -295977 319658 -127331
15647B0814J23259a38562k68310B66820f1461G0029j4350b0110j73104A79369
15636d3187j7795k06631n7710E24599D0824R075N1207m3309J49211E0372j8791
15625C1581J97992f8513A03101C9549a62927M0708a0531p3683j11150q8542N6260
15614b27646b1581A32843M4602a83045D56561A40146i2417B37200j15362J1610
15604A33448a21945C0731Q4453C324b28932d7554p8262A21772a98318N7464c3218
15592a03813j14976A38775P8344i5762A37297b60376i9153D3464h7939K6592A53133
15580c55760J22764e03B19261C4832h8652f22A46081f2343B09733B6009J44069
15569A70078c7588a1103E3908h7070E0815a91773J4992N7218C57367b49405j10178
$$ plain form
15647 20814 144073 -138562 -406872 266820 -61461 70029 55679 -20110 -193214 179369
15636 -43187 -60982 -267613 -325323 524599 40824 49899 101106 57797 207008 50372 31581
15625 31581 229573 -68513 103101 39549 -162927 -122219 -10531 -84214 -195364 -283906 -227646
15614 -227646 -21581 132843 177445 -183045 456561 140146 -92417 237200 121838 133448
15604 133448 -121945 30731 115184 3324 -228932 -47554 -125816 121772 -198318 -140854 -33218
15592 -103813 -218789 138775 217119 -95762 137297 -260376 -99153 43464 -87939 -61347 153133
15580 -355760 -232996 -503 219261 34832 -88652 -622 146081 -62343 209733 26009 170078
15569 170078 -37588 -11103 53908 -87070 50815 -191773 -176781 -119563 357367 -249405 -359583
15558c59583J09366A00250P6187a82296A7600c09696C23685C0677J73586b76520
15547i891A05874b15381P5656j98169F2647b4020j82818L7705A5171a15379B18329
15535b60411a12506b142A64337b07855a7115j66458F7183B7401N1332j8122e3955
15523a41088A41300c6004B00848g3249A45513k9485a01831B63806O198j32264
15513A37740J99502j47030e3067A86038F2797N419L43711B8493N9911J29910R7441
15502C15755K5778N2639j83512m7566J90980H8564b3240k20514B496b1283A97041
15490F9989i6646A22261l3012Q5328C5685p144a32836B73930E5254g7661c119
15478B67502b22433B44086m7542R4903K21262N05883l01139k70862L7641A14499
$$ plain form
15558 -359583 -250217 100250 176437 -182296 17600 -309696 323685 30677 204263 -276520
15547 -9891 105874 -215381 -139725 -337894 62647 -24020 -206838 -169133 15171 -115379 218329
15535 -260411 -112506 -2142 164337 -207855 -17115 -183573 67183 27401 78733 60611 -53955
15523 -141088 141300 -36004 200848 -73249 145513 116028 -101831 263806 270004 137740
15513 137740 337242 190212 -53067 186038 62797 68216 411927 28493 88404 218314 315755
15502 315755 341533 394172 210660 163094 354074 88564 -23240 -243754 2496 -21283 197041
15490 69989 -96646 122261 89249 174577 35685 28541 -132836 273930 55254 -77661 -3119
15478 267502 -222433 244086 196544 291447 512709 1018592 717453 446591 484232 114499
15467B66519m6749a00717b0419b621A81639K73014G07d6604C95973b47886C82464
15455C06299d004k0687E1915e6294H774b8223l923A18148N3040n0445P5607d3329
15442F47217k08150O20463N4297p6177j910A55193E7011J63701a81254d076k48757
15431b52833F261b42999J0037B07916r0499i0977C6478a1244E8268L1901a71861
15419A9831f030D2514J97876L2672A31368C1196L7723e9049A8907a00088p0548
15408a70636A92094e3327j48901C9811K9277b21846J00536M6904a6440m4017k0436
15397h0893K7167A39779L7067K05635b90596C6822J93840A04882b03692A81357
15386A34961a52560K9894A73371c48491e6504F5581N9304h6891j49723j7278e8032
$$ plain form
15467 266519 219770 -100717 -20419 -2621 181639 454653 707 -46604 395973 -247886 382464
15455 306299 -4004 -24691 51915 -56294 8774 -28223 -32146 118148 171188 120743 196350 -43329
15442 647217 439067 1059530 1113827 1037650 1035740 155193 57011 220712 -181254 -4076 -252833
15431 -252833 6261 -242999 -232962 207916 117417 -90977 36478 -11244 58268 90169 -171861
15419 19831 -6030 42514 240390 273062 131368 31196 68919 -59049 18907 -100088 -170636
15408 -170636 192094 -53327 -202228 39811 69088 -221846 -121310 -74406 -16440 -60457 -80893
15397 -80893 -53726 139779 176846 382481 -290596 36822 230662 104882 -203692 181357
15386 134961 -152560 -122666 173371 -348491 -56504 65581 124885 -86891 -236614 -253892 -58032
15374A91203L21228F3810J46965E326J87074i5294B5165h2840E7707a64083A71795
15362A75329D092J53088k087a70948B76507a9060B58730p2076I0889m3932K23224
15351B70181n8013J76035j15267a21030e921B44506O6522L62485k80550A70666
15340A80217m4811n0563L32369a66252B80864a25495M853C76904A49610n3091
15330I6519Q7371C6671b1757B60906F800f1136b6316B40772I0410N7387f9130
15318A42824O3663l766l9886a28958B22832j05948P1936o8307K74075A81596G4359
15306B24098n5961Q5322K34528B7251a10688p2651A52795e6244A06140b62560
15295a04594k41557G6659L51346A93387f7806B45322I3891f8079j09252i244A63971
$$ plain form
15374 191203 512431 63810 210775 5326 192400 -95294 25165 -82840 57707 -164083 171795
15362 175329 4092 157180 155093 -170948 276507 -19060 258730 186654 90889 46957 270181
15351 270181 212168 388203 272936 -121030 -5921 244506 311028 673513 392963 170666
15340 180217 135406 84843 417212 -166252 280864 -125495 -120642 376904 149610 96519
15330 96519 183890 36671 -21757 260906 6800 -61136 -26316 240772 90410 147797 -69130
15318 142824 206487 202721 162835 -128958 222832 116884 188820 120513 394588 181596 74359
15306 224098 168137 253459 487987 27251 -110688 -183339 152795 -56244 106140 -262560
15295 -104594 -346151 76659 428005 193387 -67806 245322 93891 -68079 -177331 -9244 163971
15283C47416a3590k95871I1449a03025E89001C1031d71405i7104B6625J50372
15273A76997P1062b03208P2001A49114G1851Q7463J62587b64145a5360B25385
15262g0044H0522b54838B28140D7547b83085A48605a34020j8735A12169E0095
15251a03346b5414B41891P7629p1622J28334b50152C07313a12532I0969L71078
15241D62047k27636J86025K83392J375735K33153o22403P58050j221611C80005
15231B14079O066c7738q1653A5756b60261C8257j6191J44035a7726B65925a43855
15219A53145F9067d6976m527B06222a59109E5682a50094A57539R6523B2969Q9247
15208A12216h1887B55391A21541M2721Q1647G5093K69542d89834a92964j5159
$$ plain form
15283 347416 -13590 -309461 91449 -103025 589001 31031 -471405 -97104 26625 176997
15273 176997 248059 -203208 -131207 149114 71851 159314 321901 -264145 -15360 225385
15262 -70044 80522 -254838 228140 47547 -283085 148605 -134020 -152755 112169 50095
15251 -103346 -25414 241891 319520 247898 376232 -250152 307313 -112532 90969 462047
15241 462047 234411 420436 703828 2079563 2312716 1690313 2448363 1226752 380005
15231 214079 220145 -37738 -119391 15756 -260261 38257 22066 166101 -17726 265925 -143855
15219 153145 69067 -46976 -51503 206222 -159109 55682 -150094 157539 254062 22969 112216
15208 112216 -81887 255391 121541 164262 245909 75093 344635 -489834 -192964 -208123
15198b08123f6394B23801e0999r6227B27614a34962r7806b6553C91494i0994C37419
15186a95690A71670P5703q7395k874E480c92525H6787c6033j18836a8782A98527
15174A68802e355B8910b1676A34613M37605H6829l1227a67916g3055F44962C559
15162b26805B45155m685i2163B72228j6179B1469a10023d4744A29348M3212b35421
15150I1395b22497C16156M5196B0567g9092L7582B11131Q371f2714C27978j31903
15139A96075a63847L7131o9344B21754p0991n1664o042N2688e1008j18568E38952
15127C02179B9797L12424j23100b4253B21790n4073G6255J03784R9828J20362
15117D00229J2789L63858A19688c5650A54047e7169n1190D8859b4227B55351D4674
$$ plain form
15198 -208123 -66394 223801 -50999 -147226 227614 -134962 -232768 -26553 391494 -90994 337419
15186 -195690 171670 247373 159978 157104 5480 -392525 86787 -36033 -154869 -18782 198527
15174 168802 -5355 28910 -21676 134613 572218 86829 55602 -167916 -73055 644962 3559
15162 -226805 245155 240470 -92163 272228 256049 21469 -110023 -44744 129348 172560 -235421
15150 91395 -222497 316156 361352 20567 -79092 -41510 211131 219502 -62714 327978 196075
15139 196075 -163847 -126716 -196060 221754 150763 99099 93057 145745 -51008 -169576 538952
15127 302179 29797 342221 219121 -24253 221790 167717 76255 180039 279867 400229
15117 400229 413018 776876 119688 -35650 154047 -57169 -108359 48859 -24227 255351 44674
15105a8507j3558c240A15383i7678F5096e7619A15744K6738D4759i1308j24569
15094b15877i1845A90741c62643h8392C65785d2129B89153E7a97760C06746c6834
15082d7648j98374A97276K80862G1709J09004J76744C9380b07108D9959K55110
15072C05069E8310o146J99022m2581h6086B7122A1988K09872q4507a18863C26862
15060A11222L48754p5647j59700J67598N136H2921K65710j2950R1024j76043J19444
15049C70106j39292M07660H5714K16319j28995K11836j23231J31184j45054J84035
15039D31808K4744A68139O3149Q0721J29220A52655P6695K37698k28758M52543
15029F90833k06319J38118k71913A53167M46916k10150I1955O98380K9769l22780
$$ plain form
15105 -18507 -32065 -3240 115383 -97678 65096 -57619 115744 142482 44759 -91308 -215877
15094 -215877 -91845 190741 -362643 -88392 365785 -42129 289153 57 -197760 306746 -36834
15082 -47648 -246022 197276 478138 71709 180713 357457 39380 -207108 49959 305069
15072 305069 58310 52164 251186 208605 -86086 27122 11988 221860 137353 -118863 326862
15060 111222 459976 384329 224629 392227 397363 82921 348631 335681 426705 250662 370106
15049 370106 230814 638474 85714 302033 173038 384874 261643 392827 247773 431808
15039 431808 456552 168139 231288 312009 441229 152655 229350 467048 238290 690833
15029 690833 484514 622632 350719 153167 600083 389933 91955 790335 820104 497324
15019D97324K16288B81093L75384B69054L04276B22488M47304k52757A81445K82915
15009D64360B06558K94770A87365O07539B46102P22N8012J85390J73230M0493
14999G03949A47757O66600B88823n0948K25832l261B07614Q2914J44491R9059
14989E34078Q0636J50478N532j99014n9898j48248L98036j54579K05185R89C15232
14977D62210J02055A5398O21350k90687M36397N2833J78986m20019k28991l8993
14967C26274K7283o5363O1411J26078j6899A51825K78863B05683o9618K31833
14957C67898j18095J51098j30384r4973d5016D33097m9790j28733J4222j11715
14947A57081L14681o6773r3559N70065k00586k881R4365l64596j36489Q384J79096
$$ plain form
15019 497324 713612 281093 656477 269054 573330 222488 669792 417035 181445 464360
15009 464360 206558 501328 187365 794904 246102 246824 304836 490226 663456 703949
14999 703949 147757 814357 288823 237875 463707 460446 207614 290528 435019 534078
14989 534078 614714 765192 770724 571710 511812 363564 761600 607021 812206 813195 315232
14977 462210 564265 15398 636748 346061 782458 835291 1014277 594258 365267 326274
14967 326274 353557 288194 349605 475683 458784 151825 430688 205683 136065 367898
14957 367898 249803 400901 270517 175544 -45016 433097 383307 254574 268796 157081
14947 157081 471762 404989 311430 881495 680909 678028 772393 407797 271308 279692 458788
14936D58788A37331M89182j95981L31151j84286J32852M40950j20506L24090j59097
14926A195686M01529j27321J17461k76933L49401k70628l0709J30608O01368M05754
14916B496216n47251j25820o58945k53132K56786E51594q356r0014j77217J22717
14906C98724I8916P5793K85482j12626L49821j39030A29828L15642l9663b6748
14895E76860j45331c983D74917j80116j19497O8860K06558L3396j09052N3006
14885D28072A86695N41372M9717C85659M29093m7580o1404K236k86331J91630
14875F13303B17800K03149H8523C6843L71405J73888k81553N31645k22019o8394
14865E41815M4316p576L23867m36261o4887K17726j33317k07090n5526h505A46913
$$ plain form
14936 458788 137331 626513 430532 761683 577397 710249 1151199 1030693 1354783 1195686
14926 1195686 1597215 1469894 1587355 1310422 1659823 1389195 1358486 1489094 2090462 2496216
14916 2496216 1948965 1823145 1164200 911068 1167854 551594 543238 453224 276007 398724
14906 398724 98916 174709 460191 347565 697386 558356 129828 445470 405807 -26748
14895 576860 431529 -3983 474917 294801 175304 244164 450722 484118 375066 428072
14885 428072 186695 728067 777784 385659 814752 767172 705768 708004 421673 613303
14875 613303 217800 420949 88523 36843 408248 582136 300583 832228 610209 541815
14865 541815 586131 578555 902422 466161 401274 619000 485683 278593 223067 -8505 146913
14853C57327J29679J8898k45497L93P478L87534k00911J90780J48686J50495M8429
14842I93291O5744l07189J32419l6289k76143M67280j44635j14887o0306q1555
14832F37730C02552J74487K50017j88587A01476M22137k5621P792R3821p3988
14822E25617K57354B79538M13583k58651K38450J01896O2010k69626J97204l52062
14812D12342N72288D47942J22464k38565P27843j12148j33792J94072j59732m5732
14802H02352l14123k37283J60045j38934J07340N8170J69733r1454P0807O799
14792E93452J6346C01517K88551j63817O0610J66627r4941L20719l0764l131l47833
14781D97538J75135Q8108j45289L04883j59665K88038n9664k49901r1335n3025
$$ plain form
14853 357327 487006 505904 260407 260800 268278 655812 454901 645681 794367 944862 993291
14842 993291 1059035 751846 884265 847976 571833 1039113 894478 779591 719285 637730
14832 637730 302552 477039 727056 538469 101476 523613 497992 505784 599605 525617
14822 525617 782971 279538 693121 434470 672920 774816 836826 567200 764404 412342
14812 412342 984630 447942 570406 331841 1059684 947536 813744 1007816 848084 802352
14802 802352 488229 250946 410991 272057 379397 437567 607300 515846 586653 593452
14792 593452 609798 301517 590068 426251 486861 653488 558547 879266 848502 845371 497538
14781 497538 672673 760781 615492 920375 760710 1048748 989084 739183 647848 594823
14771E94823k3173J24617L4948M5294l11967p0748R6832J03671j97168L8755J10541
14760E46425J84937k73709B23888L44752l6696J22903j73606q5981P630L40241
14750G43131j80698K6820L200J23175j83830l7600K85490j98773n3791j62260
14740C64864L04194j98313J42107J13580J70274k1722k7217j3465j22858J89549
14730I00993N14105J74688L77591l07091l82009J76160l27159j97127j17529J2134
14720H24756j42789j90787J81210L39850q0912D43107L14955n2414L38471m32550
14710F11569L30365m13865L65577O1451M5357o6708P37840j47391K55392j49514
14700A630073lm04196k98095O8500m5710l50220K7818Q7102O0451M1202K0564
$$ plain form
14771 594823 571650 696267 731215 776509 464542 393794 490626 594297 397129 435884 546425
14760 546425 731362 457653 223888 568640 531944 654847 481241 395260 402890 743131
14750 743131 562433 589253 592453 715628 531798 494198 779688 580915 527124 364864
14740 364864 669058 470745 612852 726432 896706 874984 847767 834302 711444 900993
14730 900993 1415098 1589786 1967377 1660286 1278277 1454437 1127278 930151 812622 824756
14720 824756 681967 491180 672390 1012240 931328 443107 758062 705648 1044119 611569
14710 611569 941934 528069 893646 955097 1000454 933746 1671586 1524195 1779587 1630073
14700 1630073 1630070 1225874 927779 996279 950569 600349 628167 715269 775720 816922 837486
14689H37486l15479K39263J21205j29460k6275K2049q1837K35817m6462J33084
14679I89391l26349J58896k81240K4576o0238O57408m55532J28937J0824j55881
14669F90792J10854j10856P6625k7415K47666O4353k41715K6956J00702j361j40651
14658G95950N37246l82227m5660K34145L94654k85749J25921j34122l40930Q3800
14648I83028J0599Q117J02371j14088J11269Q4285k73564o0888J89423q392N2636
14637A084796p0156M2039n128p39K51912k35441n2920K0816k50540O97043m79228
14626A002454L25215j26258J8093j36895J83186m23374L96822k40191K71684j36236
14616A134500J72842l73668K98660J44162k20433j30161K92518J67040m24244
$$ plain form
14689 837486 522007 761270 882475 753015 726740 748789 666952 902769 856307 989391
14679 989391 663042 821938 540698 565274 505036 1162444 706912 835849 846673 690792
14669 690792 801646 690790 767415 740000 987666 1052019 810304 837260 937962 936601 795950
14658 795950 1333196 950969 905309 1139454 1534108 1248359 1374280 1240158 899228 983028
14648 983028 993627 1001744 1104115 990027 1101296 1185581 912017 851129 1040552 1032160 1084796
14637 1084796 1014640 1056679 1051551 1050812 1302724 1067283 1014363 1035179 784639 1481682 1002454
14626 1002454 1327669 1201411 1219504 1082609 1265795 842421 1239243 999052 1270736 1134500
14616 1134500 1307342 933674 1232334 1376496 1156063 1025902 1318420 1485460 1061216
14607A061216J70485J24967R073L4495n2412n4675p5579M30657j52999n46524
14597I48704K39059N464K28053M5184l47247K86103O6233K4254n7326k07725M14321
14586A645077J8319l67806K69905m61925N71033k44328Q4634J4996j14501N19033
14576A934437l59355o5291J66336K05054j34470K39612j41355l27487N93928l91325
14566A720084M74687k13097o9523j14163L40410R8251K765O2193m10057L79975
14556B271525K20591K04469M9632K06890L68289L80054N62030J167974L328435
14547H759889P511753J7800982K0508607B1282331G175037C500987j196230n35265
14539A769492j72616K54983K19726j27561N76130J189122K907115k727970j508227
$$ plain form
14607 1061216 1231701 1356668 1365741 1400236 1347824 1293149 1217570 1648227 1495228 948704
14597 948704 1187763 1193227 1421280 1466464 1119217 1405320 1471553 1495807 1438481 1230756 1645077
14586 1645077 1663396 1295590 1565495 1103570 1674603 1430275 1514909 1529905 1415404 1934437
14576 1934437 1575082 1509791 1676127 1881181 1746711 1986323 1844968 1517481 2111409 1720084
14566 1720084 2194771 1981674 1912151 1797988 2138398 2236649 2239414 2301607 1891550 2271525
14556 2271525 2492116 2696585 2746217 2953107 3321396 3701450 4263480 5431454 8759889
14547 8759889 16271642 34072624 54581231 21282331 7175037 3500987 2304757 1769492
14539 1769492 1596876 1851859 2071585 1944024 2520154 3709276 6616391 3888421 2380194
14530B380194n30721k7304o1190K11298p574r8166k24082K47732p1565J30655
14520A949277K22880k86717O3119J46443J66583j43424K86322r0485n5432L18521
14510B577087k83251K62604j03010r5251J03761K41144m23569L0089K47890j21995
14500B435499L11878J6081K6521m17196M11831J3088j38182P3698n7111M62267
14490C138374l87159M03639l97447K22881j00237j23632L95928l2569R4998l46082
14480B868694L81134k4282k21794K04687L6354J29666K31603n15951M89380J66379
14470C745870j52085J50756r8282L01286j96984N4279K97386k03052n9643n6074
14460C783457L16303R3185k91187N69505l33784J49040n7407L22999j84416Q5648
$$ plain form
14530 2380194 1849473 1822169 1760979 1972277 1964703 1866537 1642455 1890187 1818622 1949277
14520 1949277 2172157 1885440 1948559 2095002 2261585 2118161 2404483 2313998 2258566 2577087
14510 2577087 2293836 2556440 2453430 2358179 2461940 2703084 2279515 2309604 2557494 2435499
14500 2435499 2747377 2763458 2789979 2372783 2784614 2797702 2659520 2733218 2676107 3138374
14490 3138374 2751215 3154854 2757407 2980288 2880051 2756419 3152347 3119778 3214776 2868694
14480 2868694 3249828 3225546 3003752 3208439 3244793 3374459 3606062 3090111 3579491 3745870
14470 3745870 3593785 3744541 3646259 3947545 3750561 3804840 4102226 3899174 3839531 3783457
14460 3783457 4099760 4192945 3901758 4471263 4137479 4286519 4229112 4552111 4367695 4453343
14450D453343o791P0201R561K61593q6388L60569l30054q9006K93355k55376R02258
14439E583265l99749L02032j71618N2658K29425Q7350p7035k42336J57095L24380
14429E845467J34919L53134q1471K24930j52742K69519n16624Q99663k27138L12449
14419G062106J58697k05014J1393m6722L39809j73797N2832L5570M29677L46484
14409H011035j19333N49524m0680K85373R1609m21963L59999o5913o2752O00081
14399I186980j29260Q5326J68692O2631M97146M5093l0746j25171N14750j6751
14389A0258690M27544J06742M09351j41188N30801J59624J67154N85170j75784
14380A2328104N78528J10307k06530L38997J92552M10315K50777K6577M77138
$$ plain form
14450 4453343 4446552 4516753 4526314 4787907 4701519 5062088 4732034 4643028 4936383 4681007 5583265
14439 5583265 5183516 5485548 5313930 5366588 5596013 5683363 5606328 5363992 5521087 5845467
14429 5845467 5980386 6333520 6252049 6476979 6324237 6593756 6077132 6976795 6749657 7062106
14419 7062106 7220803 7015789 7027182 6980460 7320269 7146472 7199304 7234874 7664551 8011035
14409 8011035 7891702 8441226 8400546 8685919 8777528 8355565 8715564 8649651 8586899 9186980
14399 9186980 9057720 9143046 9311738 9374369 9871515 9916608 9885862 9760691 10275441 10258690
14389 10258690 10686234 10792976 11202327 11061139 11591940 11751564 11918718 12503888 12328104
14380 12328104 12906632 13016939 12810409 13149406 13341958 13752273 14003050 14029627 14506765
14371A4506765K59945M34099K04029J90050N27637K93908L43292L37652L82622
14362A7479999L41396M70514J24707Q55543j30357P03004N15109M14986O59137
14353B1434038L26048P40526Q25560J65831O02266P18430L47727N30105O85058
14344B6375589O46431Q29481J144540L73419P33230R52086J514998K9195J364128
14335C3963097J279064Q74243J152180J148210J236250P01015J579574J488786
14327D3422419J360073J757739J377930J707692K059849J783547J746485K119786
14319E7335520K268479J960676K289009K375689K356496K725902K841434L184079
14311G7337284K969370L700436L253457L822520L994620M875268M382656M891484
$$ plain form
14371 14506765 14766710 15200809 15404838 15594888 16122525 16416433 16759725 17097377 17479999
14362 17479999 17821395 18291909 18416616 19272159 19141802 19844806 20359915 20774901 21434038
14353 21434038 21760086 22500612 23326172 23492003 24094269 24812699 25160426 25690531 26375589
14344 26375589 27022020 27851501 28996041 29369460 30102690 31054776 32569774 32598969 33963097
14335 33963097 35242161 36116404 37268584 38416794 39653044 40354059 41933633 43422419
14327 43422419 44782492 46540231 47918161 49625853 51685702 53469249 55215734 57335520
14319 57335520 59603999 61564675 63853684 66229373 68585869 71311771 74153205 77337284
14311 77337284 80306654 84007090 87260547 91083067 95077687 99952955 104335611 109227095
14303A09227095N294666N417841N768550O059345O799962P401728P442431Q189865
14295A61601483Q898293R297809R728369J0638668J1143771J1913129J2356369
14288B35577891J3507193J4059076J4836401J5463108J6364001J6285463J7106934
14281C43200067J7319408J7430581J7034839J6274796J5611728J4446024J2640993
14274D53958436J0371610P158207L070430l43763j966054j232489j702037m628162
14266D64686178q101192j0956129j2693703j4178698j6240776j6800680j7499309
14259C68215691j7361089j7341030j6841485j6602407j5620068j5251661j4332865
14252B54865086j3924619j3125049j2236531j1593065j0948459j0436616r490080
$$ plain form
14303 109227095 114521761 119939602 125708152 131767497 138567459 145969187 153411618 161601483
14295 161601483 170499776 179797585 189525954 200164622 211308393 223221522 235577891
14288 235577891 249085084 263144160 277980561 293443669 309807670 326093133 343200067
14281 343200067 360519475 377950056 394984895 411259691 426871419 441317443 453958436
14274 453958436 464330046 471488253 474558683 474214920 472248866 471016377 469314340 464686178
14266 464686178 456584986 445628857 432935154 418756456 402515680 385715000 368215691
14259 368215691 350854602 333513572 316672087 300069680 284449612 269197951 254865086
14252 254865086 240940467 227815418 215578887 203985822 193037363 182600747 173110667
14245A73110667r333826n119178p829379q175740p301081o734055o398496n436955
14237A16781957n116011n214950m870149m322386m524171l970681k817104l877958
14229H2068547l415510l308932k834895k940759k716375k775152k539081k078990
14221E9458853k016432j518886k013940k021784j806415j957845j315567j315109
14213D5492875p69136j789788j621603j109769j321805q59390o93160q36682j597404
14204C4894138r92144r18665j051868l22531o69222q13588j277270o73184r17194
14195B7258472m97894m55810m61908n05220p92821j077089l61798l44176q18531
14186B1943225k63176p11218j79669o22353j87138q76393p7774n98856j64409
$$ plain form
14245 173110667 163776841 158657663 150828284 142652544 135351463 128617408 122218912 116781957
14237 116781957 111665946 106450996 101580847 97258461 92734290 88763609 85946505 82068547
14229 82068547 78653037 75344105 72509210 69568451 66852076 64076924 61537843 59458853
14221 59458853 57442421 55923535 53909595 51887811 50081396 48123551 46807984 45492875
14213 45492875 44723739 42933951 41312348 40202579 38880774 38021384 37328224 36491542 34894138
14204 34894138 33901994 32983329 31931461 31608930 30939708 30126120 28848850 28175666 27258472
14195 27258472 26760578 26304768 25842860 25337640 24544819 23467730 23105932 22761756 21943225
14186 21943225 21680049 20968831 20789162 20166809 19979671 19103278 19025504 18426648 18262239
14177A8262239o75051q0338p14333J11649j23703p13604m10300j08151o02238
14168A4946170J01869l76085l35161m8771l92599k46076O4591m70038l18379j11486
14158A2814035k58685j80280l07333o27781M39311m85838j04512k55114l92452
14149A0641351K6117l68947k06074L11221n22662J13744n07181k02902J66465
14140I451132J08307o82395R2683m7539k25419k44557J42763l22820l16641o5318
14130G890196j46808k36939J08690Q0288l90897P7205o5020K47188j3414o39366
14120F911123j41218L46257l65324J08519p24175M13593p652J38935k07702r8441
14110F373915Q778l24702J374j45730l47770K1696r5658R148k3729K33491k03979
$$ plain form
14177 18262239 17587188 17506850 16792517 16904166 16780463 16066859 15656559 15548408 14946170
14168 14946170 15048039 14671954 14336793 14288022 13895423 13649347 13713938 13243900 12925521 12814035
14158 12814035 12555350 12375070 12067737 11439956 11879267 11393429 11288917 11033803 10641351
14149 10641351 10667468 10298521 10092447 10403668 9881006 9994750 9487569 9284667 9451132
14140 9451132 9559439 8877044 8969727 8922188 8696769 8452212 8594975 8272155 7955514 7890196
14130 7890196 7743388 7506449 7615139 7695427 7304530 7381735 7316715 7563903 7550489 6911123
14120 6911123 6769905 7116162 6750838 6859357 6135182 6548775 6541123 6680058 6472356 6373915
14110 6373915 6382693 6057991 6059365 5913635 5565865 5587561 5491903 5501051 5477322 5710813 5506834
14099E506834k56926R7632k68596J36727j50534k40966K32083O0247K7791k76629
14089D867663O7553j10413m31075j4358L64651l20478N7495J2938j10345m42531
14079C941100J43595j00196K43835k91029K09487r7802K7739j15790j23629k66246
14069C571064J98601R1511j80926K9812k36535J52666N6011J22117k32877O09087
14059D180531l19341j90729K75337r4088r1378k71450j17206K39427k09158m1075
14049C360870j88989j90878k53806L36190L8315o66j59260K3666j74799p2734
14039B717909M03947l63460M36301k76356k2285L9847k2812k01845R2940o9861
14029B734325n9155Q073j19854J39569k97350L24780k76291r7465J57374l89342
$$ plain form
14099 5506834 5249908 5347540 5078944 5215671 5065137 4824171 5056254 5116501 5144292 4867663
14089 4867663 4935216 4824803 4393728 4379370 4744021 4423543 4481038 4493976 4383631 3941100
14079 3941100 4084695 3984499 4228334 3937305 4146792 4048990 4076729 3960939 3837310 3571064
14069 3571064 3769665 3861176 3680250 3710062 3473527 3626193 3682204 3804321 3571444 4180531
14059 4180531 3861190 3670461 3945798 3851710 3760332 3488882 3371676 3611103 3401945 3360870
14049 3360870 3171881 2981003 2727197 3063387 3101702 3101036 2941776 2965442 2790643 2717909
14039 2717909 3121856 2758396 3194697 2918341 2896056 2935903 2913091 2711246 2804186 2734325
14029 2734325 2675170 2683243 2563389 2702958 2405608 2730388 2454097 2356632 2514006 2124664
14019B124664k5275L70194l2298o4193l35560K79374l70328L08683J67836k87470
14009B135627K75504n78740M17680l52227j68720K18012j32307L13020k11722
14000A916127o5191K3570J21941j20384J10311k43361J48223m61253J59004K39850
13990A828837l6542N66234J888231N757838J5068653K8774421k3847369A3220241
13981G240821k284138r35905p44105k65652k19634r4232N9272k70945j40495l03207
13971B041780K51155j59663J23806j92780M8480l03439M48712k47659n5915L45141
13961B299618p14491M97606O7399l22178j48346Q8998j81887l2546O15639m68721
13951A701091M482J01961m46449K85989J6105J67634j23968k9237k86672J95539
$$ plain form
14019 2124664 2099389 2469583 2437285 2373092 2037532 2316906 1946578 2255261 2423097 2135627
14009 2135627 2411131 1832391 2250071 1897844 1729124 1947136 1814829 2127849 1916127
14000 1916127 1850936 1874506 1996447 1876063 1986374 1743013 1891236 1429983 1588987 1828837
13990 1828837 1792295 2358529 4246760 10004598 25073251 53847672 30000303 13220241
13981 7240821 4956683 4020778 3276673 3011021 2791387 2697155 2756427 2485482 2344987 2041780
13971 2041780 2292935 2133272 2257078 2064298 2112778 1809339 2258051 2010392 1954477 2299618
13961 2299618 1585127 2082733 2150132 1827954 1679608 1768606 1586719 1554173 2169812 1701091
13951 1701091 1705573 1807534 1361085 1647074 1663179 1830813 1706845 1677608 1390936 1586475
13941A586475j4956l28175K7843K99332J29894k52291m6453L03702J13732n41394
13931A277709L84531l4808k46720r1823j38479K17134Q4419j17176K1644K7611
13921A384042l6475j07646J91967o3399o5686J31187j73137j84299N8607L47523
13911A482684k77360L0366R7132k10390J30990r1023J85389k9878n3051l1824
13901A233035Q0280l37861m5567J8388L74645J96083m48967J41436J31058p5174
13891A267356k88359J56861k86864N94898k84176J85203j64040R8436m46829P8391
13881I10877L52736j59066j11223M8183Q7726o9272j6815k10455K68999K2105
13871A123795M9859k7947l41893L19333j52864J00439J57402m42621M25931l89414
$$ plain form
13941 1586475 1571519 1243344 1271187 1570519 1700413 1448122 1401669 1705371 1819103 1277709
13931 1277709 1662240 1627432 1380712 1288889 1150410 1367544 1451963 1334787 1356431 1384042
13921 1384042 1347567 1239921 1431888 1368489 1302803 1433990 1260853 1076554 1135161 1482684
13911 1482684 1205324 1235690 1332822 1122432 1253422 1162399 1347788 1317910 1264859 1233035
13901 1233035 1313315 975454 929887 948275 1322920 1519003 1070036 1211472 1342530 1267356
13891 1267356 978997 1135858 848994 1443892 1159716 1344919 1180879 1279315 832486 910877
13881 910877 1263613 1104547 993324 1041507 1129233 1059961 1043146 832691 1101690 1123795
13871 1123795 1173654 1145707 803814 1123147 970283 1070722 1228124 785503 1211434 822020
13861H22020L45538j44788Q2708O8756l12267J43002k88427M32627R9279l76389
13851H72059J86274L8543k97240L43439E26087M47667N7948j56746N763J83151
13841A063870l20189R7979l1581j0423R3087o8222L30018j55551N3608l1238k59037
13830G62321J83138l94226M90844k61811l2703J91992m568N4151k22768R7899
13820H64269k47094q9278N31992l53721J08090C50590P72325j45290k08685R2822
13810H61762l57503L24386k91497J23799K80635j09688J88829r1131O6273k62460
13800G33405j23205J62903l0915A68062N86003n565J23629l74211M30418m06238
13790E22098K15576j65305J70425R6871j30157K38062l85714K08406o6590j02461
$$ plain form
13861 822020 1167558 1022770 1105478 1174234 861967 1004969 716542 1149169 1248448 872059
13851 872059 1058333 1096876 799636 1143075 526087 973754 1031702 874956 880719 1063870
13841 1063870 743681 841660 810079 799656 892743 824521 1154539 998988 1052596 1021358 762321
13830 762321 945459 551233 1042077 780266 747563 939555 934987 989138 766370 864269
13820 864269 617175 527897 1059889 706168 814258 350590 1122915 977625 768940 861762
13810 861762 504259 828645 537148 660947 941582 831894 1020723 929592 995865 733405
13800 733405 610200 773103 742188 168062 754065 748500 872129 497918 928336 522098
13790 522098 737674 572369 742794 839665 709508 947570 561856 770262 703672 601211
13780F01211O0516r7782k14431M06336p6340o4557k75614L12897L7754q7289o2289
13769E40412N9204K03730k83641J81197Q4227l77945J89360k1899k13979K67410
13759F28076k10418J8135j12946J71144k8969J25887L6437A82805N39629l58498
13749C63936J24233k7112B25935L45500K96674l82738R3306J10236k1391l25987
13739C41535K75129B32570K03870m5416n1571N18583l55441R6941p5767K33171
13729G56940l13483j59728M12898j98809M73130C41064K3983j10458K89072j72579
13719C71082J02431j04843J68778k32694K83179J73986j46579k09403K42179j56086
13709D92030K54488l01072n3160K60464k15782K61931k07428A00567K11223O7682
$$ plain form
13780 601211 661727 563945 349514 755850 679510 614953 339339 652236 689990 602701 540412
13769 540412 599616 803346 519705 700902 785129 407184 596544 574645 360666 628076
13759 628076 417658 435793 322847 493991 465022 590909 627346 182805 722434 363936
13749 363936 488169 461057 225935 571435 868109 485371 578677 688913 667522 341535
13739 341535 616664 232570 436440 391024 339453 858036 502595 599536 523769 756940
13729 756940 443457 283729 696627 497818 970948 341064 365047 254589 543661 371082
13719 371082 473513 368670 537448 304754 587933 761919 615340 405937 648116 492030
13709 492030 746518 445446 392286 652750 436968 698899 491471 100567 311790 379472
13699C79472A60743K39652P227K87248k46143j16017L9098N6789L3515P2755G4126
13687D82898K60765l12189B14170K90091J34967j4315e972D66988r8734R5510
13677D63764K45333l40952P1131K23336L9716B03946E5862K64114N0584j48367
13667B22193K5145M53776B32290K50172J80361k45834R1535J91294k63832q2593
13657C53393A73067P42798C32597M63430A34599J64584K49751j68004j04264J11824
13647C88490a55168E60325h9709D40395p2191j25689J06283l4310J07091M965
13637D26544L9412k11158J61239j19859m6407R0962K54972k46787Q9180B03214
13626E75929A93529N5556p0088J37786J13364J06501j36827M9960j19444J8194
$$ plain form
13699 379472 160743 400395 407622 694870 448727 332710 371808 428597 462112 534867 74126
13687 482898 743663 431474 214170 504261 639228 624913 -5972 466988 368254 463764
13677 463764 709097 368145 439276 662612 702328 203946 55862 319976 370560 222193
13667 222193 247338 701114 232290 482462 662823 416989 508524 699818 435986 353393
13657 353393 173067 915865 332597 796027 134599 299183 548934 380930 276666 388490
13647 388490 -155168 560325 -89709 440395 368204 242515 348798 314488 421579 426544
13637 426544 465956 254798 416037 296178 249771 340733 595705 348918 438098 203214
13626 575929 193529 249085 178997 316783 430147 536648 399821 449781 330337 348531
13616C48531A46031K22313p9249J36931A43218G0858J69928J91080A57027M9975
13606B07002F5859L01041C388J16570K50946K18742B28618J40275q5430l4959
13596B48504H8098J11297Q0528K76828A1486M04618j5191j74980l0494a87692
13585B8478P4550J72764j25152K94541q5488P9371k02724n6121q6638J17590A04691
13573D14880m1796L646G0561K23376m4349j0539J28584j49881J1363O478N2325
13562B87918J94685R3908a996D6171L07244J3565o4394A37439K76780j59333k3721
13551B31165I0627J92530r0242M04413k55546j19772a90672D55127l3052Q4507
13541E06582A81287n3396j3487a23998B83477J24300j42906R4105j2143J18300
$$ plain form
13616 348531 146031 368344 289095 426026 143218 70858 240786 431866 157027 207002
13606 207002 65859 366900 3388 119958 370904 589646 228618 368893 283463 248504
13596 248504 88098 199395 279923 556751 11486 416104 400913 225933 195439 -187692
13585 28478 103028 275792 150640 445181 359693 439064 236340 180219 93581 211171 104691
13573 414880 373084 376730 70561 293937 249588 239049 367633 217752 229115 235593 287918
13562 287918 482603 576511 -1996 46171 353415 366980 302586 137439 414219 254886 231165
13551 231165 90627 283157 192915 597328 341782 222010 -190672 455127 422075 506582
13541 506582 181287 127891 114404 -123998 283477 407777 264871 358976 346833 465133
13531D65133D0854K32311j25259F4116K94195d6578C95171j93953D2625J79973
13521B22598J66909j65575q2870J08140M0033e3923A08718L00675j43141I4497
13510i2696C76981A06080M63375r7630j36337j45109J56924j60609F9557K2929
13500I2486l4678K63318K01122D3187K72609K03375j27770a3708B00675p2818
13490A27857d2274q6067E5101h0826c3578A25280J33026j18072J50866a4337C53125
13478a27136C38460B4535J23665J98884M8635I7597C2316O1871g1816B12620K31382
13467D44002a23608C3016O466J29053F4953L85338B09577A3648L42749H3491c2976
13455A32961J98423o8451R3063j51379N0287M3027q3998J31582I9933e9421A03585
$$ plain form
13531 465133 40854 273165 147906 64116 358311 -46578 395171 201218 42625 222598
13521 222598 389507 223932 141062 249202 289235 -53923 108718 409393 266252 94497
13510 -92696 376981 106080 569455 471825 335488 190379 347303 186694 69557 92486
13500 92486 57808 321126 522248 43187 315796 519171 391401 -13708 200675 127857
13490 127857 -42274 -128341 55101 -80826 -33578 125280 258306 140234 291100 -14337 353125
13478 -127136 338460 24535 148200 347084 395719 97597 32316 94187 -71816 212620 444002
13467 444002 -123608 33016 39482 168535 64953 450291 209577 13648 356397 83491 -32976
13455 132961 331384 262933 355996 204617 254904 297931 213933 345515 99933 -59421 103585
13443b667B96440j11152n139e4596A63124G4098i172m3082A74497K43991A31714
13431B9116i1752C84439j78488p8271Q873K1769D1290N3326L59386f4131C33311
13419C69282k0219E8442Q38596A37033K05260J48744B10642l3405O2922M8296
13409B88455J4032I9494K30335j04152a56493A74197K22270E0200K4420K28751
13399C03371J45463C5155a6688F4247K07493E0245M26370A57396J06894J72648
13389D36938H4148J37530K08448N5144E6755J18275G3087j7896J67275a68685
13378a67228A02397K10884C534b0248C15985p4520C3458L3466M53861F0693O4950
13367A25643C3784N34615j16390H801R1980i2137M810C94593j07115h9329H0317
$$ plain form
13443 -2667 296440 185288 180149 -54596 163124 74098 -9172 -52254 174497 418488 131714
13431 29116 -91752 384439 205951 127680 136553 158322 41290 94616 454002 -64131 333311
13419 369282 349063 58442 897038 137033 342293 491037 210642 177237 240159 288455
13409 288455 302487 99494 329829 225677 -156493 174197 396467 50200 74620 303371
13399 303371 448834 35155 -16688 64247 271740 50245 476615 157396 264290 436938
13389 436938 84148 221678 430126 485270 56755 175030 73087 55191 222466 -168685
13378 -167228 102397 313281 3534 -20248 315985 241465 33458 66924 520785 60693 125643
13367 125643 33784 568399 452009 8801 100781 -92137 -87327 394593 287478 -89329 80317
13355B21954K75891i9313A95598J81535m3233B2251J90698L7425G4124j9695J21170
13344A75599j6475B5768L78216b6727A71121D9449b53190B77178F0971J00408
13334A61379i0259A6792L61605A78018J21096m691J12646o4687K56529a45569
13323d685B26058b3052B92466J615J79651q1508o9178r3681j08815M52095A31284
13311g4118D15944b68789C43262F5065J10610A9912J06793b4992E3914l442J34021
13300A84493i0608D1167b8410C19250b2467D4771K79498E2400J58995B4915K17538
13289B42453L985K383K5176M9073r1581D0075a12541I6680E372K29890R3460j08809
13277B19913C7311J27117p3122d5678C06283l5721e9230r8202L0212B06978a3607
$$ plain form
13355 221954 497845 -99313 195598 377133 333900 22251 212949 250374 74124 54429 175599
13344 175599 159124 25768 403984 -26727 171121 49449 -253190 277178 60971 161379
13334 161379 -90259 16792 378397 178018 299114 294423 407069 342382 598911 -145569
13323 -4685 226058 -23052 292466 294081 473732 392224 323046 229365 120550 572645 131284
13311 -74118 415944 -268789 343262 65065 175675 19912 126705 -24992 53914 50472 184493
13300 184493 -90608 41167 -28410 319250 -22467 44771 324269 52400 211395 24915 242453
13289 242453 246438 248821 273997 323070 231489 40075 -112541 96680 5372 235262 328722 219913
13277 219913 37311 164428 91306 -45678 306283 270562 -59230 -157432 -127220 206978 -13607
13265B07856A01285B6075a44935D4839a3929k63753e3187K6188j01418C33467
13254I6913P488f299B1221A058J97529q3608P9697J79078a49643A05455J50330
13243B55785O2687D1454J15174k2598J76947H3049a33015B57671E145a18231N1334
13232f6897e720B43452p0982M15918A11563l2005C8944a18837c1035j84344C44739
13220A30204n4588J2336J7719K71064H727M45938A26723l2392h1236C5873f3994
13208B60268G8737a82604k5659q1980i243j64016g988A88423e5164C09631r2889
13197B16742n6519b88086A19209J75089d59034A66762J67513B7727N09167A91354
13186a8285l0447k34185N2915F6528c08280a30972A98055J7723b58748C08635
$$ plain form
13265 207856 101285 26075 -144935 44839 -13929 -277682 -53187 -26999 -128417 333467
13254 96913 104401 -6299 21221 1058 198587 114979 194676 373754 -149643 105455 255785
13243 255785 318472 41454 156628 134030 310977 83049 -133015 257671 5145 -118231 -66897
13232 -66897 -5720 243452 172470 588388 111563 79558 38944 -118837 -31035 -215379 344739
13220 130204 75616 87952 105671 376735 8727 454665 126723 94331 -81236 35873 -63994
13208 260268 78737 -182604 -208263 -290243 -9243 -173259 -7988 188423 -55164 309631 216742
13197 216742 160223 -288086 119209 294298 -459034 166762 334275 27727 536894 191354
13186 -18285 -48732 -282917 -230002 66528 -308280 -130972 198055 215778 -258748 308635
13175B87346j11099k8518J24138D0152a33520j09776B53393A4780L4557J50839
13165B00176a70654A71635h0736Q247K2406C96732f6736A54684p978l0717N5572
13154A71561K63G0389P900A4486J47417J21168j7028L8519b5137B53526C9505
13142A79809E7450K94284A6697J12752J27161P129A30466F0851L3819P0701a53462
13130A50672b40697E7761b48890i5260r3070A41495E0719K659K03232E9406B5451
13118H0282C406d0187j46607A4175Q1347b0469q2353I8496c15228A33b5055l1049
13106e6104l047A05655R7117i7907k7902B41267b12935M82B34879k3065K1040
13095B32854J74772A5634c42660i3594A5916b6624A11172O5098o8930b34180A55198
$$ plain form
13175 287346 176247 147729 271867 40152 -133520 -243296 253393 14780 49337 200176
13165 200176 -170654 171635 -80736 -72489 -50083 396732 -66736 154684 146706 115989 171561
13154 171561 171824 70389 78289 14486 161903 283071 266043 304562 -25137 253526 39505
13142 179809 57450 351734 16697 129449 256610 263739 130466 60851 94670 165371 -153462
13130 150672 -240697 57761 -248890 -95260 -188330 141495 50719 53378 256610 59406 25451
13118 80282 3406 -40187 -186794 14175 95522 -20469 -102822 98496 -315228 133 -25055 -56104
13106 -56104 -59151 105655 202772 -97907 -125809 241267 -212935 -212453 234879 211814 232854
13095 232854 407626 15634 -342660 -93594 15916 -26624 111172 176270 107340 -234180 155198
13083b01286A76223a72310B71978j09231a15711A33321n3142K985K08352P0746
13073C62262D4384i4086B86731D9388a24317j37216f8905B23273J31480E8413
13062A82451b08241B40926C3745g2305C37482c1658O861A87463D1193Q8028b71974
13050B12482a7158A64660j1784H146J58612J03341a71352D73273A66509L03054
13040D69563G2823b80473C5142b02248A06876G794c1297m9322A24313b8340C2606
13028A05338a3387k32414d1636A24531a74603B69261p6168Q7885f510E7551J3677
13017G1228J90906e4373a1266q8667K6158n4360A74488K20959b14161B58839j28276
13006A30563DJ83953J23666n0049C8029a06122C25842f7371B96755a19939A36453
$$ plain form
13083 -201286 176223 -172310 271978 162747 -115711 133321 80179 83164 291516 362262
13073 362262 44384 -94086 286731 49388 -124317 -261533 -68905 223273 354753 58413
13062 182451 -208241 240926 33745 -72305 337482 -31658 -24797 187463 41193 129221 -271974
13050 212482 -17158 164660 152876 8146 166758 270099 -171352 473273 166509 469563
13040 469563 72823 -280473 35142 -202248 106876 7794 -31297 -80619 124313 -28340 32606
13028 105338 -13387 -245801 -41636 124531 -174603 269261 193093 280978 -6510 57551 71228
13017 71228 262134 -54373 -11266 -99933 -73775 -128135 174488 395447 -214161 258839 130563
13006 130563 4 183957 307623 257574 38029 -106122 325842 -67371 296755 -119939 136453
12994C81589c0387D0525a66536m1927B2434a53175Q231L1087A13638g2490k4115
12983i6605F7876c36015B06935A6050a03248A0196b06511B30928a40566C22907
12972i9227c19k975n3834A58898b1784A98148a48718C6549K3018J24547Q469F2390
12959b27962f4417p5373q4359P9534r108B9564c417C2717J36037a62042L0620
12948a31422A26928P6347I1004B2948f3810B75408B4825K06030c75830b9369j1676
12937d1045D6024d17418a48199i094j48925D00242a4294r1738B57287E9537g5957
12925A48041f3375H4492d6828d879j06361j42390E17447b98004b0781B41615H5124
12913B32039a47282E4823J17892b12335d2257E7461J63951k2076E1350b77321
$$ plain form
12994 381589 -30387 40525 -166536 -208463 22434 -153175 -144944 -113857 113638 -72490 -96605
12983 -96605 67876 -336015 206935 16050 -103248 10196 -206511 230928 -140566 322907
12972 -99227 -319 -3294 -57128 158898 -21784 198148 -148718 36549 59567 184114 192583 62390
12959 -227962 -64417 -139790 -224149 -144615 -153723 29564 -3417 32717 168754 -162042 -131422
12948 -131422 126928 203275 91004 22948 -63810 275408 24825 230855 -375830 -29369 -41045
12937 -41045 46024 -417418 -148199 -9094 -158019 400242 -14294 -106032 257287 59537 -75957
12925 148041 -63375 84492 -46828 -4879 -111240 -253630 517447 -298004 -20781 241615 85124
12913 232039 -147282 54823 172715 -212335 -42257 57461 221412 199336 51350 -277321
12902C8320b9311k54978g4284j35802b7451A90620p7250l638A385P1894J74436
12891B47715b21667P4081A69137C1096b36592p3180J31375C07605C9966K31505
12881B71471b03148R6812E9642a97454k4378e134A44413a22804H3374D237i8461
12869A69899a1462B8695K38763p7403J26090c4294k66615B28697E5265g7401L0358
12858d7043E593J82054a92503B14434q4571j655a09984A68632K4433J78930j65958
12847B06037e7932k21241R8079B56622a70321B79045a82207M3852H0334J09147
12837A89481p2394b7598E9932c9083q7758a7797j9782a8565j8319C6137i9614
12825E3518K76405a74510J6479D6286J96326A0857K40516E5026B124J68602j7753
$$ plain form
12902 38320 -29311 -284289 -74284 -210086 -27451 190620 113370 109732 1385 73279 247715
12891 247715 -221667 -147586 169137 31096 -236592 -309772 -178397 307605 39966 271471
12881 271471 -203148 -106336 59642 -197454 -221832 -5134 144413 -122804 83374 4237 -98461
12869 169899 -11462 28695 267458 190055 316145 -34294 -300909 228697 55265 -77401 -47043
12858 -47043 5593 187647 -192503 214434 129863 128208 -109984 168632 193065 371995 206037
12847 206037 -57932 -279173 -181094 256622 -170321 279045 -182207 -138355 80334 189481
12837 189481 117087 -27598 59932 -39083 -126841 -17797 -37579 -18565 -36884 36137 -99614
12825 53518 329923 -174510 -158031 46286 242612 10857 251373 55026 2124 170726 152973
12814A52973L8787A7026O731N780a57955f5038C04718d809p2235c1795q534A32057
12801a18903q0950d6988A50914n3950a52193H851J26051i4953C7376a22086j3617
12790a35703B39938H8063B3652J05058b08942Q3163k7425k8735j05977J9539A36466
12778A22055f8340n7013m8357M0849l2944B4924j0125E103b28042B18767J48156
12767C66923A1248a94975A99660p1345l6759a49551M4312L1177A47542a79302
12756B73705G8924b02462k42075I9312J73204g7548L8389j5294G3059J7390J36589
12745B27038J347l8548a27577r9135l3316B27057k3615B9321L74984A62575J26929
12734B89504c34462H3257a82026B8511J22139a05874f250A08466b05714I4497
$$ plain form
12814 152973 191760 17026 23757 29537 -157955 -65038 304718 -4809 -77044 -31795 -40329 132057
12801 -118903 -199853 -46988 150914 96964 -152193 8851 134902 -94953 37376 -122086 -135703
12790 -135703 239938 88063 23652 128710 -208942 -125779 -153204 -181939 -287916 -268377 136466
12778 122055 -68340 -125353 -173710 -132861 -165805 24924 14799 5103 -228042 218767 366923
12767 366923 11248 -194975 199660 128315 91556 -149551 -105239 -74062 147542 -179302
12756 273705 78924 -202462 -444537 99312 272516 -77548 -39159 -54453 73059 90449 227038
12745 227038 228385 189837 -127577 -226712 -260028 227057 203442 29321 404305 162575 289504
12734 289504 -334462 83257 -182026 28511 150650 -105874 -6250 108466 -205714 94497
12723C19523i7747k5210r4467B2820a02068j24831A04109c017A16497A5270a13473
12711C24494A36639h2A79289M6682f417n4240A87060N6524E6155d5095E13284
12699a43958D4513K47015I6177l1812K94302a36364A57832a73631A79435c24662
12688b3492O944j8121a1706B76193e240j50231C543J74520H7828P9710a08030
12676C48893a50318B29626h9399j34240A59594j3466a75127G1567K12449j35131
12666A48885p2794a75688j4791f9710e116r2884A10349a33120A85758A9944J83852
12655B03796A4373a103A89839a107B56120m0632j06966b01952K7822g9190A02139
12643h7193H15b206A04878c27575c2863l9839F5095J8007J01531c5163E0893a17219
$$ plain form
12723 319523 -97747 -122957 -217424 22820 -102068 -226899 104109 -3017 116497 15270 -113473
12711 324494 136639 -82 179289 225971 -6417 -60657 187060 243584 56155 -45095 513284
12699 -143958 44513 291528 96177 64365 358667 -136364 157832 -173631 179435 -324662
12688 -23492 -16548 -34669 -11706 276193 -5240 -155471 3543 178063 87828 167538 -108030
12676 348893 -150318 229626 -89399 -223639 159594 146128 -175127 71567 284016 148885
12666 148885 76091 -175688 -190479 -69710 -5116 -98000 110349 -133120 185758 19944 203796
12655 203796 14373 -1103 189839 -1107 256120 215488 108522 -201952 -174130 -79190 102139
12643 -87193 815 -2206 104878 -327575 -32863 -72702 65095 83102 184633 -35163 50893 -117219
12630e479A87651c6838A76682N0411f6925A73809o3511D4142g6956F8855a18338
12618A50816j6366b94137A947K17641G788K7743a79432b7199A68803O5881J29134
12607C63818b56133d5355j11439j71236a54512e2795j07429K3131k10172I1493
12596B00418b25336B09697b68282B3172J37149C3688R3901c4058D7483a60633
12585a95559j57202a23991Q781L1891K2487j21655B17665b74304B22827F6335
12574F7297K00569F8973b30895p6871C1465a62840a7498j39447N1379C1712K29596
12563B61308e671G0314J1705J64097q8936m2476J3119a44343C9923L40226j84053
12552A96096n1929a49893f0033m38514g276j99188R1657B43606a40419C68901
$$ plain form
12630 -5479 187651 -36838 176682 227093 -66925 173809 110298 44142 -76956 68855 -118338
12618 150816 134450 -294137 1947 219588 7788 35531 -179432 -27199 168803 234684 363818
12607 363818 -256133 -45355 -156794 -328030 -154512 -52795 -160224 -137093 -347265 91493
12596 200418 -225336 209697 -268282 23172 160321 33688 127589 -34058 47483 -160633
12585 -195559 -352761 -123991 -115210 -83319 -60832 -182487 217665 -274304 222827 66335
12574 67297 267866 68973 -230895 -307766 31465 -162840 -17498 -156945 -105566 31712 261308
12563 261308 -5671 70314 82019 246116 157180 114704 127823 -144343 39923 380149 196096
12552 196096 144167 -149893 -60033 -498547 -7276 -206464 -114807 243606 -140419 368901
12541h574B96124I8792a83646L0381j29802i2167p3191A9639g54j66822a0537
12529A40109D0393J4206b61374a28618K0362l22418a15934b2706B2000a74830
12518A42100d4104D2716J59709m2685m1677g1910A20857J94649F2722a48682a9981
12506a24464j09463a6792k60452c5628B70356b0378p200E8526g0655j217H20a66246
12493h6176C29409c11506B07965p6597a39384k42788c2510j64576F2084a85496
12482B9673C290f3049j70455i3261j74325A8174i3442j83413Q0280B02723B4657
12470a16384E8567J05160c38666A07170b9736k14476A06673a31025B70318G8422
12459a28963q9673A69445c5742B75147l3400E3392c9020C71156p1412a91645r9109
$$ plain form
12541 -8574 296124 98792 -183646 -153265 -283067 -92167 -165358 19639 -754 -167576 -10537
12529 140109 40393 54599 -261374 -128618 -108256 -430674 -115934 -22706 22000 -174830
12518 142100 -44104 42716 202425 159740 118063 -71910 120857 315506 62722 -148682 -19981
12506 -124464 -233927 -16792 -277244 -35628 270356 -20378 -27578 58526 -70655 -71872 820 -166246
12493 -86176 329409 -311506 207965 131368 -139384 -382172 -32510 -197086 62084 -185496
12482 29673 3290 -63049 -233504 -93261 -267586 18174 -93442 -276855 -196575 202723 24657
12470 -116384 58567 163727 -338666 107170 -29736 -244212 106673 -131025 270318 78422
12459 -128963 -218636 169445 -35742 275147 241747 53392 -39020 371156 299744 -191645 -290754
12448b90754C23738c60267A72000o9998J65318a59733J3485c1517l5673k74863
12438c42053B30843b4325o7847C9809Q4031a10203B3992L8807J4321b70903D57757
12426D9076A342J78349a4206A20941Q3975e914l12258A42847b54099I2097c09826
12414a03545d5208n2943B10801a24680j73184A917b63493A45240j4401f8030A83698
12402G9674Q9834B2337a75423L2235k0833B71614g3478k35938B41454r340b93083
12390g7285A57534J51924A37071m8379f4953B97768b3140A85044J19935k5424
12380B79555a7113D7747i1393A69024J05151b3263c757C70773D9589i5396B77609
12368b31049A73496b04531c2j75554Q1186l59528D80377C7291g0506B7544g9969
$$ plain form
12448 -290754 323738 -360267 172000 102002 267320 -159733 -146248 -31517 -67190 -342053
12438 -342053 230843 -24325 -92172 39809 123840 -110203 23992 62799 77120 -270903 457757
12426 49076 1342 179691 -14206 120941 204916 -5914 -318172 142847 -254099 92097 -309826
12414 -103545 -45208 -98151 210801 -124680 -297864 1917 -263493 145240 130839 -68030 183698
12402 79674 169508 22337 -175423 -143188 -164021 271614 -73478 -309416 241454 232114 -293083
12390 -77285 157534 309458 137071 88692 -64953 297768 -23140 185044 304979 279555
12380 279555 -17113 47747 -91393 169024 274175 -23263 -3757 370773 49589 -95396 277609
12368 -231049 173496 -204531 -32 -175586 -94400 -453928 480377 37291 -70506 27544 -79969
12356A66749c63528A76745Q808O3050o1357a42733K0871J1035k7471B43944I5664
12344i1253k3681I5241J4975d9718F489K24425H2581b4786A08524J51123A11243
12332A59297J98773p1453R5682m9414K7198D2981K70122a32338G4158K38625k1869
12321B90914J31197A40871M0033o8750M81597A81837J82908b61639A97531l1176
12311A66355C9070N0385b55762B35506A02592L2070l8119D008Q1665d9258j19089
12300a68347o2897c615j98420G1473J19773g3082j96367A83139q3319e4157k5124
12289g9281A44180J27601c5139B07556K50151a09697A05798j6387B1546J93880
12279B15426L6147n1096D3440k412J96497C6918k101J62811K60154F7294J49846
$$ plain form
12356 166749 -363528 176745 185553 248603 187246 -142733 -121862 -110827 -138298 243944 95664
12344 -91253 -114934 95241 110216 -49718 6489 230914 82581 -24786 108524 259647 111243
12332 159297 358070 286617 382299 332885 360083 42981 313103 -132338 74158 312783 290914
12321 290914 422111 140871 180904 112154 593751 181837 364745 -261639 197531 166355
12311 166355 39070 89455 -255762 235506 102592 134662 96543 4008 85673 -49258 -168347
12300 -168347 -231244 -3615 -202035 71473 191246 -73082 -269449 183139 99820 -54157 -79281
12289 -79281 144180 271781 -35139 207556 457707 -109697 105798 89411 21546 215426
12279 215426 251573 200477 43440 41028 237525 36918 34817 197628 457782 67294 217140
12268B17140l4639l8636Q9991K7739j10731J13655H2068J89201K3938a37675b8984
12256B2168K32468J33578A69937G2602M08169k26362K59951a71943B57147G9799
12245B42619D711L68259b2628j84018G7965J62352J82801G9637J27016E9741K12130
12234B71871I1234J00101J81730D2508O1788Q8931p8671d6924j19493g5919m3039
12223a18958B0922e774I8591f639j061l1833q6230o1411Q9804B11013l4220J54832
12211C31625B8984K18213P8844i7178C64354A00400j966f1373E6819A1920J35884
12200A47804J13680j1051J42011a81588A53595p3050Q5995K32202r9260N9430
12190C58912a42799j70232a2283A48876B4485R3198r246J08919k2887P9273j0594
$$ plain form
12268 217140 182501 143865 233856 261595 150864 264519 82068 271269 295207 -137675 -28984
12256 22168 254636 388214 169937 72602 480771 254409 514360 -171943 257147 79799
12245 242619 4711 372970 -22628 -206646 77965 240317 423118 79637 206653 59741 271871
12234 271871 91234 191335 373065 42508 104296 193227 114556 -46924 -166417 -75919 -118958
12223 -118958 20922 -5774 98591 -6639 -7700 -39533 -125763 -187174 -97370 211013 176793 331625
12211 331625 28984 247197 326041 -97178 364354 100400 98434 -61373 56819 11920 147804
12200 147804 261484 250433 392444 -181588 153595 80545 166540 398742 299482 358912
12190 358912 -142799 -313031 -12283 148876 24485 117683 108437 217356 194469 273742 263148
12179B63148n8858d3592B99994A34226d4435C02964K63560j05413A54378J82393
12169C36771D339g6572D10449F2002M13985j81803P6667j1528p3409J46958J04446
12158E37318B03272J15157A3661b61229A23530O6220o403J93416c5979F17741
12147a73463f7969C5177K31951k3994i7286C05656E2493J52735f0639E3652J47218
12136B00870G963K22960e7517B64580q4075M3126a44149F3377J96866J02807l2228
12125C30822H0808b17720B24295K48427k35222o3951q4363L82715j72018f5103
12114E3827K85159j2522E0560P8187n8922b0239p8736b2991j77324C09169A15642
12102B28442h5331B0584K04854F5325N5682E2681j4021a38016c6030B44260h3004
$$ plain form
12179 263148 204290 -43592 299994 134226 -44435 302964 566524 461111 154378 336771
12169 336771 4339 -76572 410449 62002 475987 294184 370851 359323 285914 432872 537318
12158 537318 203272 318429 13661 -261229 123530 189750 183347 376763 -35979 617741
12147 -173463 -67969 35177 267128 243134 -97286 305656 52493 205228 -60639 53652 200870
12136 200870 7963 230923 -57517 264580 180505 223631 -144149 63377 260243 363050 330822
12125 330822 80808 -217720 224295 472722 237500 173549 89186 471901 299883 -65103
12114 53827 338986 326464 50560 128747 69825 -20239 -98975 -22991 -200315 309169 115642
12102 228442 -85331 20584 225438 65325 121007 52681 38660 -138016 -36030 244260 -83004
12090C26399a85601R722F2826b81449C74107I3563J22553a78778I6012b1502C62428
12078C3660K10056e2088I0572b1104C51860b4296A99366J47339L11630f2520B07831
12066B19904A7852a29260B47357F0428J10732A006J45674R3823b39124B65050
12055E4916B5845J03409K2085a27374C9300K93440c07182B28405A06627J33922
12045B40549K01177A85212f6649a7048A05551A612J36072e7971k20933f0404B8738
12033e1085q5125a9768B95152b6758A51038b3224A60677B3721b49510a00605b5078
12021B89604a36688M2663K80C6066N5131J86562l5645I4739e5841B5972J10766
12010A36738b93903A85284M2492o7516J89669a32412I7608k2251R7843F6615a56331
$$ plain form
12090 326399 -185601 -175879 62826 -281449 374107 93563 216116 -178778 96012 -21502 362428
12078 33660 243716 -52088 90572 -21104 351860 -24296 199366 346705 658335 -62520 207831
12066 219904 17852 -129260 247357 60428 171160 1006 146680 240503 -239124 265050
12055 54916 25845 129254 151339 -127374 39300 332740 -307182 228405 106627 240549
12045 240549 441726 185212 -66649 -17048 105551 1612 137684 -57971 -278904 -60404 28738
12033 -51085 -136210 -19768 295152 -26758 151038 -23224 160677 23721 -249510 -100605 -25078
12021 289604 -136688 -94025 -93745 36066 91197 277759 242114 94739 -55841 25972 136738
12010 136738 -293903 185284 227776 160260 349929 -132412 97608 75357 173200 66615 -156331
11998a42721M6805G1476l2109J03949M2722d2761r2204E7657i4311b3695j37620
11987a61315B78336C05J5982J63998B6796b01887A90294e7069B42398a44115A44515
11975c7939J3383C10176r9309g7323D0093J26085o6325i5856r4948E1017c46282
11963A14401J53836b11685a0277j26643j04627R4781J6298E4713J02924J32816
11953B90453a14702G2951j7140b51953L4201P8982j58167A31954b59979j69335
11943d29314B10239O0901H1836a79661I6161C8261J3904K15842a72850N6737c0689
11931c62266a33253l529A76845H4007a72023L2079o5033i5906r3486Q0106L8743
11920g0543j5996j11370h379H0942c175B1818c2499B36539o2564a8402A13308
$$ plain form
11998 -142721 -95916 71476 39367 143316 186038 -42761 -134965 57657 -94311 -23695 -161315
11987 -161315 278336 305 16287 180285 26796 -201887 190294 -57069 242398 -144115 144515
11975 -37939 -24556 310176 210867 -77323 40093 166178 99853 -95856 -190804 51017 -346282
11963 114401 268237 -211685 -10277 -136920 -241547 -146766 -130468 54713 157637 290453
11953 290453 -114702 72951 55811 -251953 -217752 -138770 -296937 131954 -259979 -429314
11943 -429314 210239 271140 81836 -179661 96161 38261 52165 268007 -172850 -116113 -30689
11931 -362266 -133253 -136782 176845 84007 -172023 -139944 -204977 -95906 -189392 -109286 -70543
11920 -70543 -86539 -197909 -8379 80942 -3175 21818 -32499 236539 173975 -18402 113308
11908A18867f5749D12437e6253j27531E3363a34239a7019ij79961b8234B6341
11896c40992G2887a28532A64282a57811B4294d8732j05558j44901C13232h145
11885A840b20621A4716b2838q1499k60936B8552O5963g3315q9526B54728A02995
11873A79992b29603A03816c95438a86608j7101A23804a46259O6191c099A01153
11862c26020A01274a65157E8574f0407A44418c1073B07478b53028B3542R2052
11852A15594A4392J45221j2554a39639C5396R4191j7931d11217d461m10538B056
11840b96284D3786a73551h1037A06476b64651A52428N3913C3128a34782l0459
11830a65241B12592h6272C8979J16450f4969j03338B13808h9779A76928b6626
$$ plain form
11908 118867 -65749 412437 -56253 -183784 53363 -134239 -17019 -9 -179970 -28234 26341
11896 -340992 72887 -128532 164282 -157811 24294 -48732 -154290 -299191 313232 -8145
11885 1840 -220621 14716 -22838 -104337 -365273 28552 94515 -73315 -162841 254728 102995
11873 179992 -229603 103816 -395438 -186608 -203709 123804 -146259 -80068 -3099 101153
11862 -326020 101274 -165157 58574 -60407 144418 -31073 207478 -253028 23542 115594
11852 115594 14392 159613 147059 -139639 35396 129587 111656 -411217 -4461 -414999 2056
11840 -296284 43786 -173551 -81037 106476 -264651 152428 206341 33128 -134782 -165241
11830 -165241 212592 -86272 38979 155429 -64969 -168307 213808 -89779 176928 -26626
11819a27315a203A53274a05174M475C6003K8709c3781m48584a3014l261H667a20593
11806a81252A44386K06365d9169n7730j5485N8557r4920J9884c4165j23398F0307
11794D50833b78188P5844N5139A58178A3252a9616A64897f9240k12846F8117e2396
11782e8754B75730b3380j7870C4955h6840M1572F1045k5459J80830p0224a97580
11770a37834A74588K3736m2367m0992R3074h7973j08414n8061I3965i6731n3872
11759a50603G4994f8823j83986A02922K9483a38360H4250M0276f1739G5876k622
11748G3254c376F9718R3900b8160A9965J56690O2904p6438b5737A74806H049c33192
11735H4555D0354K8955a80592A68410K654G1128k7945K87936C6575J10794a472
$$ plain form
11819 -127315 -1203 153274 -105174 -100699 36003 64712 -33781 -482365 -13014 -16275 8667 -120593
11806 -181252 144386 350751 -49169 -106899 -122384 -63827 -158747 -138863 -34165 -157563 60307
11794 450833 -278188 -202344 -147205 158178 13252 -19616 164897 -69240 -282086 68117 -52396
11782 -58754 275730 -23380 -41250 34955 -86840 -45268 61045 35586 216416 146192 -197580
11770 -137834 174588 198324 155957 114965 208039 -87973 -196387 -254448 93965 -96731 -150603
11759 -150603 74994 -68823 -252809 102922 132405 -138360 84250 124526 -61739 75876 73254
11748 73254 -3376 69718 163618 -28160 19965 176655 239559 163121 -25737 174806 8049 -333192
11735 84555 40354 69309 -180592 168410 171064 71128 43183 331119 36575 147369 -1472
11723B17666i7594A42058a16091H2931k727R6801f1488A30862E8060a4610A95718
11711I5908J61845m1747A5360j875K98518I4420e5699B30194b30465C8407h5859
11699b84425A4299J25193i1172r996C7829b49481B40620a07151q2686B07809c00593
11687e1172J0869m9630B79314A18392D9385J03960j5624N7335A3798b09672f9227
11675b32855J14673n8140L6776A22342L14098h9235n4797l26880A13027B5558
11664h1541B05347c495k23947A47453A4081a47207d7517j0431k50238a14929l1453
11653a46382A25026b52665J11450M2006D4143c2294B76859m5892D2393b33768
11642F2602L3881N9215L87J24884c72988a15486A9193a07556H0514J7421L74225
$$ plain form
11723 217666 -97594 142058 -116091 82931 80204 177005 -61488 130862 58060 -14610 195718
11711 95908 257753 216006 15360 13485 312003 94420 -55699 230194 -230465 38407 -85859
11699 -284425 14299 139492 -91172 -101168 37829 -249481 240620 -107151 -189837 207809 -300593
11687 -51172 -40303 -89933 279314 118392 49385 153345 137721 195056 13798 -209672 -69227
11675 -232855 -118182 -176322 -139546 122342 436440 -89235 -144032 -470912 113027 25558
11664 -81541 205347 -3495 -227442 147453 14081 -147207 -47517 -57948 -308186 -114929 -146382
11653 -146382 125026 -252665 -141215 -99209 44143 -32294 276859 230967 42393 -233768
11642 62602 96483 155698 156085 280969 -372988 -115486 19193 -107556 80514 97935 472160
11631D72160a17336H7191l9346b01802E7931o922M2841a16807I003M2418N5946
11620A07367n0066L45757h3480m3413e3062n5111B24472L4559G2124J31063h8921
11608B1121O4287m1847f5744A54467J32528a93700M7574b4183E6359Q5805D9697
11596d16582A18690b5591m80289A60484K6381C3284b28146C66804a21119A86396
11585C41076G5733J12107Q1651j1089d16688c6237C22115e1207B71222H4275a689
11573A45334e2239A91187H0295J91194F1552J93925b8336A53316D1699K03927
11563B45626A14041a85138F2720a6881B92415a44651E0909a24023B4669i4377
11552h7977k5175C43412I6357b80659C52269A6116e4495l7759A11676a69758A27750
$$ plain form
11631 472160 -117336 87191 47845 -201802 57931 51009 93850 -116807 9003 51421 107367
11620 107367 57301 403058 -83480 -126893 -53062 -108173 224472 259031 72124 203187 -88921
11608 21121 85408 43561 -65744 154467 286995 -193700 -146126 -24183 56359 142164 49697
11596 -416582 118690 -25591 -505880 160484 186865 33284 -228146 366804 -121119 186396
11585 341076 75733 187840 269491 258402 -416688 -36237 322115 -51207 271222 84275 -1689
11573 145334 -52239 191187 80295 271489 61552 255477 -28336 153316 41699 245626
11563 245626 114041 -185138 62720 -16881 292415 -144651 50909 -124023 24669 -94377
11552 -87977 -113152 343412 96357 -280659 352269 16116 -54495 -92254 111676 -169758 127750
11540A04207c2188A67422F4423J59241c2429j27648B38176d7157k210n1461E30
11528c5213j04482A39907J22198A25122o1992a09240B32293p100c2330q715n4282
11517i5327A39336D9385L4291j7416P272g1873B92342a73387A04360a36691A8922
11505a13846m453B17117A05314k7681J20780M7569D7943d7004B24451l3419F041
11493C4953P8572i2885C168O8230L8233e3931a9729j37718j04209g840B48384
11481B79868a25229B63093l0362d03704A50899a94A48828a5002H6321J313A3553
11469B44545L0530a95997D03978b5411B51792h6122A68015N324b3325F4089J42792
11458B06881a26040A90849J7091c93213F3269i0608C91061I3000a67634H437M2201
$$ plain form
11540 104207 -32188 167422 64423 223664 -32429 -160077 238176 -47157 -49367 -100828 530
11528 -35213 -139695 139907 262105 125122 63130 -109240 232293 225193 -32330 -41045 -95327
11517 -95327 139336 49385 83676 66260 73532 -71873 292342 -173387 104360 -136691 18922
11505 -113846 -118299 217117 105314 77633 198413 245982 47943 -47004 224451 191032 6041
11493 34953 113525 -92885 3168 71398 109631 -53931 -19729 -157447 -261656 -7840 248384
11481 279868 -125229 263093 232731 -403704 150899 -194 148828 -15002 86321 87634 13553
11469 244545 275075 -195997 403978 -25411 251792 -86122 168015 173339 -23325 64089 206881
11458 206881 -126040 190849 207940 -393213 63269 -90608 391061 93000 -167634 8437 50638
11447E0638P0000k0229K48331O0752j63695J07146b44327b2189n0296F0524N3717
11436A14241O8932f2185l1165j9320B22604J22678A24056a30132B85296e0082
11425d3907a4309k19420A11858A0254c5818A19065a52055k4148A46797K2584L2872
11414B02253e8509C12517F661J16b057m67753H5942c7743j27234a9349D3018F180
11401B93515G6187c81762f7906C81374j20003A06056Q8486f5732B71688a50588
11390e7650B24874c1417A2915K81660B5496a78334I7227N8656e95037K61708F5909
11378i9272q0068H5771b29944A47439g1880A78298p5902a02507G4219b91714Q211
11367b83503A25920h3926j37359L3567B25427d1612A12751a3589B17553q0235
$$ plain form
11447 50638 120638 100409 348740 409492 245797 352943 -244327 -22189 -72485 60524 114241
11436 114241 183173 -62185 -93350 -112670 222604 345282 124056 -130132 285296 -50082
11425 -43907 -14309 -233729 111858 10254 -35818 119065 -152055 -176203 146797 169381 202253
11414 202253 -58509 312517 6661 6777 -2057 -469810 85942 -37743 -164977 -19349 43018 6180
11401 293515 76187 -381762 -67906 381374 261371 106056 194542 -65732 271688 -150588
11390 -57650 224874 -31417 12915 294575 25496 -178334 97227 155883 -595037 -333329 65909
11378 -99272 -179340 85771 -229944 147439 -71880 178298 102396 -102507 74219 -291714 -283503
11367 -283503 125920 -83926 -221285 -187718 225427 -41612 112751 -13589 217553 137318
11357A37318b86553b5445C8945J81973h6116A59434K110a71253c243q6850A56480
11345A9757J35323g8748l7737h831b493r0483C9660J79900i2608l8224B6029b4086
11332G7375a4993E2717e8865j3826G7276h0249j16681i7839k5047k35810a32394
11320A85826a46240F1008a3344A35625b0295j32347A92581d4951B92535b13493
11309b54208A02491a66497c0144l51227i1164b6661j74137B09412a64684D1844
11298B9130f0428k30915B77990a03438o6927e1072B05291n8120c0030F1428J80960
11287B42388F9074c29130h5360B41411d2881A59132c2675m47895a01109p330G1511
11275A82822a47396d334G3105L1930D4212h9623l8710B59605l2596n9323Q7596
$$ plain form
11357 137318 -286553 -25445 38945 220918 -86116 159434 161544 -171253 -3243 -90093 156480
11345 19757 155080 -78748 -116485 -8831 -2493 -92976 39660 219560 -92608 -130832 26029 -24086
11332 77375 -14993 52717 -58865 -72691 77276 -80249 -196930 -97839 -122886 -358696 -132394
11320 185826 -146240 61008 -13344 135625 -20295 -152642 192581 -44951 292535 -213493
11309 -254208 102491 -166497 -30144 -381371 -91164 -26661 -200798 209412 -164684 41844
11298 29130 -60428 -291343 277990 -103438 -170365 -51072 205291 147171 -30030 61428 242388
11287 242388 69074 -329130 -85360 241411 -42881 159132 -32675 -480570 -101109 -108439 71511
11275 182822 -147396 -4334 73105 105035 44212 -89623 -128333 259605 227009 167686 255282
11264B55282a92022K0063e9446l9189D9751B3315e9104j03873a1888j77426O1336
11253a27978b0764j29505f8805A7164Q5552N945O1340g698A02769a6407B54999
11241b35579i8176C7365a79895r6951i2313E1226b91485J8967n5330a28486h517
11229h4091F5721k8121a98027A54434b11144A30642D8341O8888d6084k67116f9795
11217I7147i694j35691N6356q6122N1408c5195B09393d4876I5607b97387B47367
11205a42041f0259D0476h9738H3232a23112J218b1268A26125a77426H8278O5701
11194A53979J18695b4718D8436R495a97706G3130L29576a36851m7532I8543c5645
11182E6940g2169a2505E3271d28538a75615n6405k2127J08197A21323e0982j75197
$$ plain form
11264 255282 -192022 -171959 -59446 -98635 49751 23315 -59104 -162977 -11888 -189314 -127978
11253 -127978 -20764 -150269 -68805 17164 102716 108661 170001 -7698 102769 -16407 254999
11241 -235579 -98176 37365 -179895 -276846 -92313 51226 -291485 -272518 -327848 -128486 -8517
11229 -84091 65721 37600 -198027 154434 -211144 130642 48341 117229 -46084 -313200 -69795
11217 97147 -9694 -145385 -89029 -175151 -123743 -35195 209393 -44876 95607 -297387 247367
11205 -142041 -60259 40476 -89738 83232 -123112 -121894 -21268 126125 -177426 88278 153979
11194 153979 272674 -24718 48436 57931 -197706 73130 402706 -136851 -184383 98543 -35645
11182 56940 -72169 -12505 53271 -428538 -175615 -232020 -254147 -145950 121323 -50982 -226179
11171b26179c8456k30530b1430n0830R272j95352A59944J3062A1100L5258J26440
11160A72798n2827a61006D59455a9212n5309j66743j03586J53134Q1610C45740
11149B32274h7721M0878r311A35365a24236o6421f6978A2690O8627a10380B40578
11137b05754N1878M4392B7221J93056c458A7608c8563J106j89304B03719i8737
11125a62503j59118J53896A89484a36568j88389F6903L1719L6796p919J62738
11115B90237q0366L7300Q6236d2964A47545L3850d9458B83991a45935A15273b60460
11103D9290J35052c9667A4621a03121A52482K29882H732K02876R2261g0621H5590
11091D05288G8066J1499J09628F9431N1514a3323A49814B5680i1444E6773b46907
$$ plain form
11171 -226179 -38456 -268986 -21430 -72260 -62988 -258340 159944 173006 11100 46358 172798
11160 172798 119971 -161006 459455 -19212 -74521 -241264 -344850 -191716 -110106 345740
11149 232274 -87721 -46843 -56154 135365 -124236 -190657 -66978 12690 81317 -110380 240578
11137 -205754 -153876 -109484 27221 220277 -3458 17608 -38563 -37457 -226761 203719 -98737
11125 -162503 -321621 -167725 189484 -136568 -324957 66903 98622 135418 127499 290237
11115 290237 209871 247171 333407 -42964 147545 181395 -49458 283991 -145935 115273 -260460
11103 49290 184342 -39667 14621 -103121 152482 382364 8732 211608 303869 -70621 85590
11091 405288 78066 89565 199193 69431 120945 -13323 149814 25680 -91444 56773 -246907
11079I7188e7034j53078Q425B35407J03748K03743k33458L76929C40300K9126
11069C69426j49946M9013K29972k46228j05002L18620j58035R252j19090K18980
11059D16962K80905D6875K73098I8300M85171j48303J37256j03035J65822k03422
11049D31789J34297A91945L94631k042k55810K73056m2311J68004k98248k306
11039D26919J93481J53330k69537L27696j55680L50118m15143R7158j74727n1271
11029D82344L49100n5480j52077J78479O3059k88659j08931k05625M31043j36551
11019E56702L13295j31138k39172m555q642L40324B28028J91659l5315Q4567j97773
11008B71166O9740K29844k13650L05231j71839Q7418j40439K64442k84078K87683
$$ plain form
11079 97188 -57034 -210112 -201687 235407 339155 542898 309440 686369 340300 369426
11069 369426 219480 268493 498465 252237 147235 465855 307820 317072 197982 416962
11059 416962 697867 46875 319973 98300 583471 435168 572424 469389 635211 431789
11049 431789 566086 191945 586576 584534 328724 601780 559469 727473 429225 426919
11039 426919 620400 773730 504193 831889 676209 1026327 611184 708342 533615 482344
11029 482344 831444 775964 623887 802366 865425 576766 467835 262210 693253 556702
11019 556702 869997 738859 499687 495132 486490 826814 228028 419687 384372 468939 271166
11008 271166 340906 570750 357100 662331 490492 577910 437471 701913 417835 705518
10998G05518p2165J13611j65219k04157L57391k93746M2509Q4985N06749k72630
10988H02846l02764J69693k09561K08354j01101M43884m18200L17955B89743M51721
10978G41464P2888j63364M76271k63145J71089K76427j23768L05473J72347L61459
10968B027141P5088L42863m21111n2488L13442j88289O5459k99283K7246m96872
10958A393196K05462j20625m56792K52774L43844k91450K63721L57162j26639
10949A820653l53070p4606O2407k78735l5780l52206k84785K84923C67378j63540
10939B03838o1351J91587j05241j07753J26538A00020K51242a25845B9691H844
10928E2605j5761i676B42492A05838d0995A54436C9476J68814j5599e1672j00386
$$ plain form
10998 705518 633353 746964 581745 377588 734979 441233 483742 568727 1075476 802846
10988 802846 500082 669775 460214 668568 567467 1011351 593151 911106 289743 741464
10978 741464 814352 650988 1127259 864114 1035203 1311630 1187862 1493335 1665682 2027141
10968 2027141 2102229 2445092 2023981 1971493 2284935 2096646 2162105 1862822 1890068 1393196
10958 1393196 1598658 1478033 1021241 1274015 1617859 1326409 1590130 1947292 1820653
10949 1820653 1467583 1392977 1455384 1176649 1140869 788663 503878 788801 367378 203838
10939 203838 142487 334074 228833 121080 247618 100020 351262 -125845 29691 8844
10928 52605 36844 -9676 242492 105838 -40995 154436 39476 208290 192691 -51672 -152058
10917a52058o5495d1061E6378J02532a25016a6613A86271a36773F27315I4063
10906a1055C16230A54114m3608J06320f7719C42320E0036h2534m9779D4965J10001
10895A54966i8224n0396l4044B4893J64247b54065g9461k8478p3662g8350F3739
10883b709k29488m1713j68312H4966c35771J35034r7770j20112B74902G7102P5907
10872A53009G3268b20762j22040B88576a96715j20153D5671a86664N0634j53900
10862b89930i2181B75087d57601a4394F5253Q507a65570k1596g0908K3072C20017
10850B23215d2044m5108a5167H5908J36481a88729R2690m3710j43019A03514b5926
10838b30354N0787k47716E0741K4364A0213C239a48751c5416A86803b09606B96137
$$ plain form
10917 -152058 -217553 -41061 56378 158910 -125016 -16613 186271 -136773 627315 94063
10906 -11055 316230 154114 110506 216826 -67719 342320 50036 -82534 -132313 44965 154966
10895 154966 -98224 -148620 -182664 24893 189140 -254065 -79461 -107939 -181601 -78350 63739
10883 -2709 -232197 -273910 -442222 84966 -335771 -200737 -298507 -418619 274902 77102 153009
10872 153009 73268 -220762 -342802 288576 -196715 -316868 45671 -186664 -136030 -289930
10862 -289930 -92181 275087 -457601 -14394 65253 73760 -165570 -187166 -70908 -47836 320017
10850 223215 -42044 -87152 -15167 85908 222389 -188729 -96039 -139749 -282768 103514 -25926
10838 -230354 -179567 -427283 50741 75105 10213 3239 -148751 -35416 186803 -209606 296137
10826A96822r6036l6435h0973D2548b21397H9160d8639l43195F2299J68468A14243
10814A73347a29724f0886j56313B17665a65893N6718H4669A1408J48179a17196
10803d21777D21316d8381j48948P7824K6217l05653b3231k1733n7370A07449D1089
10791a28666l2414p5241F987c66379a38777A47244h9855j47449O7828k6623k7736
10780b23835d6855A15973A6674L0337d85271a93793A53663d9557m9906J8191A50652
10768A07471g9985k0936A03410P5094e9284J7783G1800K9731d1492B0162b06208
10756A32092a14413q4389o0416n6432h8400b09j01558b7704N874A72411c839p878
10744a1717I0932A5760g8382G4887c3456k28345A35210j6489E041a67749o3682
$$ plain form
10826 196822 100786 64351 -80973 42548 -221397 89160 -48639 -391834 62299 230767 114243
10814 173347 -129724 -60886 -217199 217665 -165893 -109175 84669 11408 159587 -117196
10803 -421777 421316 -48381 -197329 -119505 -93288 -398941 -23231 -44964 -102334 107449 41089
10791 -128666 -161080 -236321 6987 -366379 -138777 147244 -89855 -237304 -169476 -196099 -223835
10780 -223835 -46855 115973 16674 47011 -485271 -193793 153663 -49557 -99463 -81272 150652
10768 107471 -79985 -100921 103410 178504 -59284 -41501 71800 101531 -41492 20162 -206208
10756 132092 -114413 -198802 -259218 -315650 -88400 -209 -101767 -27704 -21830 172411 -3839 -11717
10744 -11717 90932 15760 -78382 74887 -33456 -261801 135210 118721 5041 -167749 -231431
10733b31431G6420a59859b4054q8542H6115M4121b72046a20900q9907B81032a42173
10721g4729j00641A55529d6251o793k98132h7072A6430b81383N0882B30342a64006
10709a7421r9464A27369A6204a05010A53036c83892f8627n2468m5154I6889L7646
10698A34535B445f6000e635A91717l8594c43611J46852A55451b89146e8613B00762
10686c00505f619l3944k25539a29739p474N8081k3058e861A05994l6490M6719
10675A16223h3334l7483A2913a36849e0820r8988c4709B8707k049c8077j0973
10664d9050E763P3964c43379C2199a64125K5342j25829L652B9722a14994r723
10653a24717d1580m7410M4180I1092a35122k15707M1679J13132o695a289k81183
$$ plain form
10733 -231431 76420 -159859 -24054 -112596 86115 130236 -272046 -120900 -210807 281032 -142173
10721 -74729 -175370 155529 -46251 -53044 -351176 -87072 16430 -281383 -230501 230342 -164006
10709 -17421 -116885 127369 16204 -105010 153036 -383892 -68627 -121095 -166249 96889 134535
10698 134535 2445 -66000 -5635 191717 153123 -343611 -196759 155451 -289146 -58613 200762
10686 -300505 -6619 -40563 -266102 -129739 -137213 -79132 -102190 -5861 105994 69504 116223
10675 116223 -83334 -120817 12913 -136849 -50820 -149808 -34709 28707 26658 -38077 -49050
10664 -49050 5763 79727 -343379 32199 -164125 -138783 -264612 -260960 29722 -114994 -124717
10653 -124717 -41580 -88990 -44810 91092 -135122 -350829 -309150 -196018 -202713 -1289 -282472
10642b82472h7280C9760a58675B93135B7563f0837k08811a07286a0967j09188
10632a20155A5237N7681l0160P8096A3501a16623j5137m1776B2827P2833c14033
10620b94444l3401a36506k21323a47322f1472B3052b34495j95228A4163d14009
10609d3323l20962e4906p4605G3971G521d35193C03737E4093A8258a49816A16871
10597a77364B65515a21536C2896A1994f1681j66699c649o7563C2319d1909E2700
10585I8516a6984P204r2592q4359B01846g0917A6584a68308C11244p1725d2891
10573c31361c0541B82795a7346B71170l1700d9641k46241a01764o5668D0700a99539
10561D3956J06423a39001B14006c25702D7045a52198j3273M0552B2090e1933m1643
$$ plain form
10642 -282472 -87280 39760 -158675 293135 27563 -60837 -269648 -107286 -10967 -120155
10632 -120155 15237 72918 42758 120854 13501 -116623 -131760 -173536 22827 95660 -314033
10620 -294444 -327845 -136506 -357829 -147322 -61472 23052 -234495 -429723 14163 -414009
10609 -43323 -364285 -54906 -129511 73971 7521 -435193 303737 54093 18258 -149816 116871
10597 -177364 265515 -121536 32896 11994 -61681 -228380 -3649 -71212 32319 -41909 52700
10585 98516 -16984 -9780 -102372 -186731 201846 -70917 16584 -168308 311244 239519 -42891
10573 -331361 -30541 282795 -17346 271170 239470 -49641 -295882 -101764 -167432 40700 -199539
10561 43956 150379 -139001 214006 -325702 47045 -152198 -165471 -124919 22090 -51933 -93576
10550i3576P153K5754A03026b45481N522i6469r7805A14624b46445B18030a34921
10538b5299A02906J4842a52331j11641O4612B04695I2574g1194A68983A6232L55259
10527C71491G2047K04165a54330L6460M4060B361b29743a03847l14496a38109
10516b47859C783a43812F9005J5508a42326j33086R5148N3426A64883a56032C4412
10504e2489A75632D1491b03734o8214A17581i7403k0723j90915Q1577B43851c55196
10492G2123f050m28935R5443A23496k3352K892P3891H0885J1951B3201J40041
10481A63242l9437b75167B09530b36212G8590K07232j08497K72559l3363M50336
10471H66857j48372C22858K86320k02656j99743N0637O7150j39929B2716A0017
$$ plain form
10550 -93576 -86423 -60669 103026 -245481 -239959 -96469 -194274 114624 -246445 218030 -134921
10538 -25299 102906 117748 -152331 -263972 -199360 204695 92574 -71194 168983 16232 371491
10527 371491 72047 276212 -154330 -117870 -73810 2361 -229743 -103847 -418343 -138109
10516 -247859 3783 -143812 69005 84513 -142326 -275412 -180264 -126838 164883 -156032 34412
10504 -52489 175632 41491 -203734 -271948 117581 -97403 -118126 -309041 -227464 243851 -355196
10492 72123 -6050 -434985 -339542 123496 100144 103036 176927 80885 92836 23201 163242
10481 163242 123805 -275167 209530 -236212 78590 285822 177325 449884 416521 866857
10471 866857 718485 322858 609178 406522 206779 257416 324566 184637 22716 10017
10460G1027f9595j636B56073a64048A21276a63477k0546C3725a7848j18008D4052
10448C839g9900C7292d3263j26200F7691N7608i4533C3041M8919a32237E3412
10436a81277O5116A20740l308G726J00872a13314A18543a2720k27063m5725A45041
10424A1811a08113j05689j74618B18642b0289B9134M68513B1542a27757p0784
10414a98541k0451R5259G254f4146R850l53957a332B1522a4528j51226j00968
10403b66722j5969C8294L5678a16156p9982B74077K7058c6197j75033D8124J48878
10392A97002a01998B40920a15040D7995a58346E4874K60153d44253B81717G0776
10381a88706A61664b11658A39172E1443A4473e155j370H2879J35049D7453e5352
$$ plain form
10460 71027 -69595 -71231 256073 -164048 121276 -163477 -184023 33725 -17848 -135856 44052
10448 3839 -79900 37292 -43263 -169463 67691 125299 -94533 33041 81960 -132237 53412
10436 -181277 -116161 120740 117432 7726 108598 -113314 118543 -12720 -239783 -285508 145041
10424 11811 -108113 -213802 -388420 218642 -20289 29134 497647 21542 -127757 -198541
10414 -198541 -218992 -123733 7254 -64146 -54296 -408253 -1332 21522 -14528 -165754 -266722
10403 -266722 -282691 38294 73972 -116156 -196138 274077 301135 -36197 -211230 48124 197002
10392 197002 -101998 240920 -115040 47995 -158346 54874 315027 -444253 281717 70776
10381 -188706 161664 -211658 139172 51443 14473 -5155 -6525 82879 217928 47453 -55352
10369b2503A22072g0322A02150R6644L35933j56734O5244k5277n3677J23414B02341
10357D04139a23716C99589j28277q8745B1001L27839j32820m6160K5055J13037
10347C07952a2787B18902J85832l5500K2124j36402C4804L91182K0035A24630
10336G3708J26830o2429A9028R053a30873l0631A4268J55746m1715J18934f2644
10324b22828f2641j17945G9199K04518j07938p1107J40230a49458A03773J53410
10314B57183a34743C5703C730L3993M59746A21237g4586G2098a4377A01032N2199
10303A53231b56366J2268A72360A5296J66317D2710J84140b68640P0636B94730
10292B57221E7362L01048a11095j78141D6618J04806l1549b96941I9322b73086
$$ plain form
10369 -22503 122072 -70322 102150 198794 534727 377993 443237 417960 364283 487697 202341
10357 404139 -123716 399589 271312 182567 21001 348840 216020 169860 194915 307952
10347 307952 -12787 218902 404734 369234 391358 254956 34804 425986 446021 124630
10336 73708 200538 138109 19028 28081 -130873 -161504 14268 170014 128299 247233 -62644
10324 -222828 -62641 -180586 79199 283717 175779 104672 244902 -149458 103773 257183
10314 257183 -134743 35703 3730 37723 497469 121237 -74586 72098 -14377 101032 153231
10303 153231 -256366 -244098 172360 15296 181613 42710 226850 -268640 -198004 294730
10292 257221 57362 358410 -111095 -289236 46618 151424 119875 -296941 99322 -273086
10281C66412r294a13198A01257d05822a81362B5284a03326b9561B09612g9774
10270c4551G2126P7028h8763m2211j49674C9943h2848j15154B79141d10197a49969
10258A9012a17485D0112a08940F8482q117a9413B82654r9086k4131n4594j8916
10247H5927R3950M7394j3757H1055d6682C16643a31948c0371b663E257g702A05864
10234b93557J36413d5348a7453A87505a21044B5803a31487j07825g1988A6337
10223A90977F449J56750O312a82843j71865A44187c00967A06969l7977R3335k1577
10212A40750d7832m0272L6054j44017b6130j08216C8310a94789N4342A28753Q7906
10201B16659J6327D4447a04088b6157j0648G8000A1854N3483O924a33287j28586
$$ plain form
10281 366412 357118 -113198 101257 -405822 -181362 25284 -103326 -29561 209612 -79774
10270 -34551 72126 149154 -88763 -130974 -280648 39943 -82848 -198002 279141 -410197 -149969
10258 19012 -117485 40112 -108940 68482 60365 -19413 282654 183568 159437 104843 85927
10247 85927 179877 227271 213514 81055 -46682 316643 -131948 -30371 -2663 5257 -7702 105864
10234 -293557 -157144 -45348 -17453 187505 -121044 25803 -131487 -239312 -71988 16337
10223 190977 6449 163199 169511 -182843 -354708 144187 -300967 106969 68992 162327 140750
10212 140750 -47832 -88104 -52050 -196067 -26130 -134346 38310 -194789 -140447 128753 216659
10201 216659 232986 44447 -104088 -26157 -36805 78000 11854 65337 72261 -133287 -261873
10190b61873E4007c4241n1278K2751A7771a2390G0434e645k39629M5202K6470
10179a73602e7100k48279F6155a24294B9127K91947E625b1977p0742c562k3031
10168b6593k9296k92885a6817P437k01785E4147f0730B11733G3729F301c10448
10156A51167b52335i8370j37227B5908J78901c00647M5264I1421A439a73136A170
10144a74598c2499a2862C45590n1224f3817k13837B96a25627A55553E6250J49410
10133B05660a71514P5329N201g920m3763j51732A60772a49836q4882R9049I1133
10121a76896A18418c43090a14660B86226G9115B5839b21475D7762J14642B1898
10110C22406d46777G4140f7349k32318a0401H1386h1590j6061k39603A48539b84499
$$ plain form
10190 -261873 54007 -34241 -85519 -62768 17771 -12390 70434 -5645 -245274 -200072 -173602
10179 -173602 -57100 -305379 66155 -124294 29127 321074 5625 -21977 -92719 -3562 -26593
10168 -26593 -55889 -348774 -16817 -9380 -211165 54147 -60730 211733 73729 6301 -310448
10156 151167 -252335 -98370 -235597 25908 204809 -300647 -255383 91421 1439 -173136 1170
10144 -174598 -32499 -12862 345590 294366 -63817 -277654 296 -125627 155553 56250 205660
10133 205660 -171514 -96185 -90984 -7920 -51683 -203415 160772 -149836 -234718 -135669 91133
10121 -176896 118418 -343090 -114660 286226 79115 25839 -221475 47762 162404 21898
10110 322406 -446777 74140 -67349 -299667 -10401 81386 -81590 -97651 -337254 148539 -284499
10098e9558A17834e7593q8022D4352a66575j2267j85671b9155k32856e2958E9231
10086b5282j55394A3969J75973d5799l10754A08800a73463O4307l8376C89863
10075a95086h8389m3294c8759l48952C75082B6964c69889A01974h8660J8919c1344
10063h3056B5727A1243a62499M6811k32426B2954a60011A49495h3773n7303J2321
10052a28755C2538a25132O0211B02778a21357R537j11306j07152A70475d5194
10041A21450f9741D3196a06429j16877R2595e1545n8504k51977d3213n4178j16707
10030b14098A50265h6218b409j02159K5222j2444j0151A5140a42461G353c38934
10018b38900a18870q8144f7960p8997f6576j08668c0273C7149j2135J27592a71321
$$ plain form
10098 -59558 117834 -57593 -145615 44352 -166575 -178842 -364513 -29155 -262011 -52958 59231
10086 -25282 -180676 13969 189942 -45799 -356553 108800 -173463 -109156 -147532 389863
10075 -195086 -88389 -131683 -38759 -387711 375082 26964 -369889 101974 -88660 -69741 -31344
10063 -83056 25727 11243 -162499 -115688 -348114 22954 -160011 149495 -83773 -141076 -128755
10052 -128755 32538 -125132 -64921 202778 -121357 -111820 -223126 -330278 170475 -45194
10041 121450 -69741 43196 -106429 -223306 -130711 -51545 -110049 -362026 -43213 -97391 -214098
10030 -214098 150265 -86218 -2409 -104568 -79346 -91790 -101941 15140 -142461 7353 -338934
10018 -238900 -118870 -207014 -67960 -146957 -66576 -175244 -30273 37149 25014 152606 -171321
10006c6594D9367a30833J451G442Q1733a92244E6613i6573B0348h2497m8063j77779
9994c08339a12013B31484B447K38892a30273f2928B705h3694B3954L7725O0685
9983A22364h6368L3822A44441c00085e7541p18k00240f8082A67356M8265P833
9972B23454a85943A02684b25404n640A50415D440c01490A15123a72974A33125
9961d80158C5179b52775D19782f0590A87272J20536d47451a94295d2669l5977
9951g8646l30055q0968a13360A7301a47953k6006j3755n8028h7896M0315J1396
9940c6185j67586H0386b84358j53556a83787j12802b363p0298D0102f3982D1607
9928a87594j01732J12076c938A56530L0485f4042A29582c08596a11811d1598j46781
$$ plain form
10006 -36594 49367 -130833 -129382 7442 89175 -192244 56613 -96573 20348 -82497 -130560 -308339
9994 -308339 -112013 231484 2447 241339 -130273 -62928 2705 -83694 23954 61679 122364
9983 122364 -86368 -52546 144441 -300085 -57541 -58259 -258499 -68082 167356 215621 223454
9972 223454 -185943 102684 -225404 -231044 150415 4440 -301490 115123 -172974 133125
9961 -480158 35179 -252775 419782 -60590 187272 307808 -447451 -194295 -42669 -78646
9951 -78646 -408701 -489669 -113360 17301 -147953 -173959 -187714 -245742 -87896 -47581 -36185
9940 -36185 -203771 80386 -284358 -437914 -183787 -296589 -2363 -72661 40102 -63982 41607
9928 -187594 -289326 -177250 -3938 156530 187015 -64042 129582 -308596 -111811 -41598 -188379
9917a88379C53334a17592o1803H9637a68346M4300k3228O1770C593b28783L4380
9906a94403h6844L1565K0143I2992a0287C54030B3988f1191C21133j58557q0149
9895H2427e6561K1003k5910j17478N1188k52923A86378b95745i4109B83599A23448
9883b72127G13K80473c9881o2470m9374E2192R3385h1216j4487j29259M7894j97166
9871c74234e2452F2761b05212B81449a95275i6465j13594p1066a2161r0053B57023
9859I1148c17763a36993f0522n3813a3440A18144a01734d0666j77528k86612D0600
9847e28758a85809E434d9809j07965E3860A1173i6478a1765C802J47678A1413
9835A79493H1202b81739a23220b9720k11175O0425F5297k1074Q3039b05761f2476
$$ plain form
9917 -188379 353334 -117592 -179395 89637 -168346 -124046 -147274 -85504 3593 -228783 -194403
9906 -194403 -86844 -55279 -35136 92992 -10287 354030 23988 -61191 321133 162576 82427
9895 82427 -56561 -35558 -61468 -178946 -127758 -380681 186378 -295745 -94109 283599 123448
9883 -272127 713 281186 -39881 -102351 -151725 52192 145577 -81216 -95703 -224962 -177068 -374234
9871 -374234 -52452 62761 -205212 281449 -195275 -96465 -210059 -281125 -12161 -102214 257023
9859 91148 -317763 -136993 -60522 -114335 -13440 118144 -101734 -40666 -218194 -504806 40600
9847 -528758 -185809 5434 -49809 -157774 53860 11173 -96478 -11765 3802 151480 11413
9835 179493 81202 -281739 -123220 -29720 -240895 -180470 65297 44223 127262 -205761 -62476
9823G4364a25554c7770p2011k20658f5964n271n0536d0334f481F6671b10029O6763
9811a43266B8883J59870a8864m65813f5408a194C4152a59875A1757c85588a19351
9799i2796k4414j87699g8020k47377a13666j28266b5368B8475K40420b7404m2872
9788g0276j5217k24112C72001j07023l9114D1404a7544l42075D75748F4010O5214
9777A29224o2920c11556J53901j41640B1693e5855k09080A8019b55431e5270B20694
9765b54432F8725b56266A32386a09835F0616O7231a05296c7420q1543J764G7420
9753b70659f3768l01254A44793g9675E8649b63965J00249c1534j99035n7337a27328
9741d10290a19404C41845a54612g5443A4832O6430P951b96656n241C35289b59896
$$ plain form
9823 74364 -125554 -37770 -109781 -330439 -65964 -71235 -121771 -40334 -6481 66671 -210029 -143266
9811 -143266 28883 188753 -18864 -484677 -65408 -1194 34152 -159875 11757 -385588 -119351
9799 -92796 -117210 -304909 -78020 -325397 -113666 -241932 -25368 28475 268895 -27404 -70276
9788 -70276 -85493 -309605 372001 264978 225864 41404 -17544 -359619 475748 64010 129224
9777 129224 66304 -311556 -157655 -299295 21693 -55855 -264935 18019 -255431 -55270 220694
9765 -254432 68725 -256266 132386 -109835 60616 127847 -105296 -37420 -118963 -117199 77420
9753 -270659 -63768 -365022 144793 -79675 58649 -263965 -163716 -31534 -230569 -287906 -127328
9741 -410290 -119404 341845 -154612 -75443 14832 81262 89213 -296656 -301897 335289 -259896
9729a11819a3079l24860a01627f928j02654J6969B88877B5398a40212C14706a40817
9717a49856L4709d5962j53806q3643J11987E6625a16047p4906O7531B69465I6921
9705b24549l0518G6925d60442f1328m7957m3568l6244i2670k02068g0191r0991
9694a61182L8884A1092J65151l0810O9682H6590i1424b5857n8744A5121a52227
9682E1864M2356A0375c52261J49589C1940e9757j84483A65989n4646c08137j1575
9671c19712J38069n0467q3780R3556B85676a53119j19116J03147O1320r4372K7177
9660a74963B5908b62189a24904J7083A85189J9014c20392a50700H7859O6082C4215
9648b22655D2426C52K372L30020D3219Q3407K73570D6194G724J54692h5947A64317
$$ plain form
9729 -111819 -13079 -337939 -101627 -6928 -109582 -92613 288877 25398 -140212 314706 -140817
9717 -149856 -115147 -45962 -199768 -283411 -171424 56625 -116047 -190953 -123422 269465 96921
9705 -224549 -255067 76925 -460442 -61328 -109285 -152853 -189097 -92670 -294738 -70191 -161182
9694 -161182 -122298 11092 176243 145433 215115 86590 -91424 -25857 -84601 15121 -152227
9682 51864 94220 10375 -352261 -202672 31940 -59757 -244240 165989 111343 -308137 -319712
9671 -319712 -181643 -232110 -315890 -222334 285676 -153119 -272235 -169088 -107768 -202140 -174963
9660 -174963 25908 -262189 -124904 -107821 185189 204203 -320392 -150700 87859 153941 34215
9648 -222655 42426 352 2724 332744 43219 126626 400196 46194 7724 162416 -85947 164317
9635A92986c78740a49807j5637d8258j17795H7087a85646h7531D00166c06445
9624a81099R286q8686G921b87961A27625f1304o8436A5194a35048N1622N678l3871
9612a11619o3263r2297a7527q9824n1800I0408c03422J36864h0199j26860a6217
9600G8195a51552p1386C81518i2871k36421A1678J46722a60375c9903J1408q8288
9589a16783j05723d4518B25768a61837A89552Q512F6579b08908F5640f993k6470
9578c3463p7866M8636k73644b8573A81015g957D3279d56830A33660e0008B62127
9566A54613P2053A07962g2213H5474d2195D8581L4385A5192a9214F4441b92087
9554A98377f1251k20891J33108j08674B3987b22734i0571n589k98870a5681m1836
$$ plain form
9635 192986 -378740 -149807 -165444 -48258 -166053 87087 -185646 -87531 400166 -306445
9624 -181099 -171813 -260499 7921 -287961 127625 -61304 -129740 15194 -135048 -83426 -77748 -111619
9612 -111619 -174882 -267179 -17527 -107351 -159151 90408 -303422 -166558 -80199 -207059 -16217
9600 78195 -151552 -222938 381518 -92871 -329292 11678 158400 -160375 -39903 -28495 -116783
9589 -116783 -222506 -44518 225768 -161837 189552 198064 66579 -208908 65640 -6993 -33463
9578 -33463 -111329 -62693 -336337 -28573 181015 -7957 43279 -456830 133660 -50008 262127
9566 154613 226666 107962 -72213 85474 -42195 48581 82966 15192 -19214 64441 -292087
9554 198377 -61251 -282142 -149034 -257708 23987 -222734 -90571 -96160 -395030 -15681 -57517
9543e7517j10678K4653f0839r0002f5879J53B8890b64118g3221k57184M2609k3708
9531c11504B13984b31330G9917a61548A9124L72371C0621M7591h4208A35245b20563
9519D17039I0586o220a36799A27257a76101j38141A04934j5729G263b34983B89484
9507B60402b19465L6447j41720a26192C46878b71037l665j859g2772D3970J8091
9496F2061J2687a21005K7496A95937G5840j5237e3177k12644c9297F6146l3045
9485C3101e6651k71573k9915A44262b06354A85702a7168k70615G685b6188E1653
9473e224A33238h2191C5058b5089C18914a83190B57227b26598j4379q0576a2671
9461B14994a23495B0311d50348a85634j4540H2633b06233O5583e9373l89647K0510
$$ plain form
9543 -57517 -168195 -143542 -60839 -150841 -65879 -65726 28890 -264118 -73221 -330405 -287796 -311504
9531 -311504 213984 -231330 79917 -161548 19124 391495 30621 78212 -84208 135245 -220563
9519 417039 90586 84366 -136799 127257 -176101 -314242 104934 89205 7263 -234983 289484
9507 260402 -219465 -183018 -324738 -126192 346878 -271037 -274702 -276561 -72772 43970 62061
9496 62061 74748 -121005 -93509 195937 75840 60603 -53177 -265821 -39297 66146 33101
9485 33101 -56651 -328224 -358139 144262 -206354 185702 -17168 -287783 7685 -26188 51653
9473 -5224 133238 -82191 35058 -25089 318914 -183190 257227 -226598 -240977 -321553 -12671
9461 214994 -123495 20311 -450348 -185634 -200174 82633 -206233 -140650 -59373 -449020 -428510
9450d28510j92745H4281a58017k12186J33957A07244c85892f9846G4170d1868
9439a20056B1645h9104M1457A32078e233k34799h1830A4137a20597e3852k69376
9428c23228i3684k32158L1487G0085f1740j2114B83572q4330B1002a03064F5696
9416c26615K1316Q0848g6854m2287b8049r2186A37470e0107j12962B5770Q2195
9405A07965N6636c38234g629A581c21169J12523j47102a29879A17273f8002m3125
9394a11127B7931e7914o1159j9027E1658h2863A47768a40431C6004f6544I7282
9382e451k86539A79476d9780j97287A1357a48101A84641F5653a21359e2115C48579
9370a77906A14739b61466B03179b07397J9464C01494c6141A21532l1427c62812
$$ plain form
9450 -428510 -621255 84281 -158017 -370203 -236246 107244 -385892 -69846 74170 -41868
9439 -120056 21645 -89104 -47647 132078 -5233 -240032 -81830 14137 -120597 -53852 -323228
9428 -323228 -93684 -325842 -294355 70085 -61740 -73854 283572 199242 21002 -103064 65696
9416 -326615 -305299 -224451 -76854 -119141 -28049 -120235 137470 -50107 -163069 25770 107965
9405 107965 164601 -338234 -7629 1581 -321169 -208646 -355748 -129879 117273 -68002 -111127
9394 -111127 27931 -57914 -119073 -138100 51658 -82863 147768 -140431 36004 -66544 97282
9382 -5451 -291990 179476 -49780 -247067 11357 -148101 184641 65653 -121359 -52115 348579
9370 -177906 114739 -261466 203179 -207397 -187933 301494 -36141 121532 90105 -362812
9359d8830o3486j50125J0936B6812J36839f3135k82904E2871a03683j73696g6560
9347B09656M6082A14317a05482L3366k84041p923h6697b0054j76711A31594a49016
9335h3307j44466N5924O0214C5211c7279c787r9988G5712b53211L695a6267p3634
9323h9901A4795a53749j89656J65996g2339J9568m2276A1152a53806j12187C5309
9311b32533f0709B84319a12777A44384M7296b32829d3531a534B76061d3359J7991
9300b5368B30702r7352n1183a35908I3053M3334b47293A00442c18056A65484e1063
9288a00092A38212l2306M4985a88843m4060B77820b8146C61924D4324a44713g2119
9276a57290A6237c78973i4562B5610a4321A98312i5964b3290k7488B28899f9589
$$ plain form
9359 -48830 -112316 -262441 -251505 26812 163651 -63135 -346039 52871 -103683 -277379 -76560
9347 209656 255738 114317 -105482 -72116 -356157 -364080 -86697 -20054 -196765 131594 -149016
9335 -83307 -227773 -171849 -111635 35211 -37279 -3787 -103775 75712 -253211 -249516 -16267 -89901
9323 -89901 14795 -153749 -343405 -177409 -72339 -52771 -95047 11152 -153806 -265993 35309
9311 -232533 -60709 284319 -112777 144384 191680 -232829 -43531 -1534 276061 -43359 -25368
9300 -25368 230702 133350 82167 -135908 93053 136387 -247293 100442 -318056 165484 -51063
9288 -100092 138212 105906 150891 -188843 -232903 277820 -28146 361924 44324 -144713 -72119
9276 -157290 16237 -378973 -94562 25610 -14321 198312 -95964 -23290 -50778 228899 -69589
9264A4733b17338g5351A82176o5867a8335B83766A9611a15423q6191R2077A6130
9252f257E2498R8234D0866c21529a15259D5272Q0420a39685j06442C3647b42205
9240A02987a67470f7694p2230D01817D8676b52538D0829e0491C8769b2239q2740
9229a04979k79326h6721B22119E0910a03428I7364a07320m2682M7778K1726l4206
9218a14704l3343d5011k5631j24236j50856B3232a52080k36576D7289a45410F7283
9206h717A10134F157N1219c38790a31723p687r2615A19483a8356k4899o7149A79514
9193a16682d8021m1834A39616D8934b14110B47262a5188k7562A38415f23147a98472
9181a22972F5286c64893c3332A23981Q141B907a89195A03821b03531O4977j3389
$$ plain form
9264 14733 -217338 -75351 182176 116309 -18335 283766 19611 -115423 -201614 -109537 16130
9252 -6257 52498 150732 40866 -321529 -115259 45272 125692 -139685 -246127 33647 -242205
9240 102987 -167470 -67694 -139924 401817 48676 -252538 40829 -50491 38769 -22239 -104979
9229 -104979 -384305 -86721 222119 50910 -103428 97364 -107320 -150002 -102224 -80498 -114704
9218 -114704 -148047 -45011 -70642 -194878 -345734 23232 -152080 -388656 47289 -145410 67283
9206 -8717 110134 6157 57376 -338790 -131723 -139410 -232025 119483 -18356 -43255 -110404 179514
9193 -116682 -48021 -89855 139616 48934 -214110 247262 -15188 -42750 138415 -623147 -198472
9181 -122972 65286 -364893 -33332 123981 132122 2907 -189195 103821 -203531 -138554 -151943
9170a51943f852H3437a08979G1218e4747E6940b7735k80270a3146C7759c03111
9158C26568d5847A90487g6836j3339d3172H8971l9048b80924N701J33718O5089
9147g6416j14237A50064f8799J686r5532L8748j04211A4696h9100b0393D7039
9135a4463j0441A44896c05443J04006p7873d143j09423c8863k3561j28366J5620
9124a75170m9308j8306M2393o9308B99057A00609a22826F6865J23769L09462G4979
9112A64675a29462A36662g3782H8463g2796A04646J92110a29098A6990J65649
9102A82639g5212A40513e9799k59718h9412A8441d0673k59585a8438j00743A95037
9090H5827b2179o5886l25241F1347b91623B04780A4033K8920b83248K5806B8535
$$ plain form
9170 -151943 -6852 83437 -108979 71218 -54747 56940 -27735 -308005 -13146 37759 -303111
9158 326568 -45847 190487 -76836 -90175 -43172 88971 49923 -280924 -275223 -141505 -76416
9147 -76416 -190653 150064 -68799 -67113 -162645 -123897 -228108 14696 -89100 -20393 47039
9135 -14463 -24904 144896 -305443 -201437 -279310 -4143 -113566 -38863 -62424 -190790 -175170
9124 -175170 -224478 -242784 -200391 -269699 299057 100609 -122826 66865 190634 500096 74979
9112 164675 -129462 136662 -73782 88463 -72796 104646 296756 -129098 16990 182639
9102 182639 -75212 140513 -59799 -319517 -89412 18441 -40673 -300258 -18438 -119181 195037
9090 85827 -22179 -88065 -413306 61347 -291623 204780 14033 42953 -283248 -257442 28535
9078A18742a35273A18174J43032l4345e1517b2209k17255h1904G0769b87745F8950
9066a69876D7519c11984F1980N6382n3530a66648O3561F5301i9243l8922H5150
9054A60361b38969N3325l063j12924A71833c18808N2984h4463C72092a24522l3807
9043a58329E4956a74988H97J16709i2743B04221a85600L2747J0335j99385G8784
9031B98708c45357a66907n351r6732F569J47420b29689N448C87635B6194J29865
9020A56059i1385p6043l22305a33113E9949a450l94044G5052A9724a61391j77137
9009c38528A79230d08746J34717M2796A01171J8138c8596B12934B0208a9098j72539
8998a91637A0939J91803H0558b4102n1135m1307c9519j22519A51200m5316d4554
$$ plain form
9078 118742 -135273 118174 261206 226861 -51517 -22209 -239464 -81904 70769 -287745 68950
9066 -169876 47519 -311984 61980 118362 64832 -166648 -103087 65301 -99243 -138165 85150
9054 160361 -238969 -185644 -188707 -301631 171833 -318808 -265824 -84463 372092 -124522 -158329
9043 -158329 54956 -174988 897 117606 -92743 204221 -185600 -152853 -142518 -341903 78784
9031 298708 -345357 -166907 -172258 -268990 6569 153989 -229689 -224241 387635 26194 156059
9020 156059 -91385 -167428 -489733 -133113 59949 -1450 -395494 75052 19724 -161391 -338528
9009 -338528 179230 -408746 -274029 -231233 101171 119309 -38596 212934 20208 -19098 -191637
8998 -191637 10939 202742 80558 -24102 -75237 -116544 -39519 -162038 151200 105884 -44554
8986c3854l59799B0485c79915E4742a18803k5470A31231g6338I2904j8329a79933
8974b7091A89767J18965E9581d8712C2461a53568d5092B20309d0432D168J86368
8963A90536e8755k4041I8820b88844J31315A35783J53127d25043H3751a05069
8952c2895A46974J21998G7589b18034b4079k10306J8791i5384A21316d17883B89009
8940a30094E6858g9095j4844H763b04582M7039G5630a74810A07055N10008a21677
8928A97376a03454b4856n4468l5646A35992L1674Q1097L86636R72192M296546
8918E904137J0019892C939605H27869B81321A26160P5346b4228I8487N453P64
8908A04704a35544H6801l858J70288b81303a40185L9248G7918C4896a62151J0160
$$ plain form
8986 -33854 -393653 20485 -379915 54742 -118803 -144273 131231 -76338 92904 74575 -179933
8974 -27091 189767 308732 59581 -48712 32461 -153568 -45092 220309 -40432 4168 190536
8963 190536 -58755 -82796 98820 -288844 -157529 135783 288910 -425043 83751 -105069
8952 -32895 146974 268972 77589 -218034 -24079 -234385 -215594 -95384 121316 -417883 289009
8940 -130094 56858 -79095 -93939 8763 -204582 -157543 75630 -174810 107055 617063 -121677
8928 197376 -103454 -24856 -79324 -114970 135992 167666 248763 635399 1607591 5904137
8918 5904137 15924029 3939605 827869 281321 126160 201506 -24228 98487 103940 104704
8908 104704 -135544 86801 82943 253231 -281303 -140185 -100937 77918 34896 -162151 -151991
8897a51991P0149E3061c67637f543F6827a63260l1765A4118c26759R7856G8503
8885a50904j00458B24435b81378B32693o6537d1475k87712m1260a25010a1562
8874b54397r177m411a5192C46007j60292h0178B22736F1565a81508l5411e9126
8862a39878A78411c02875a738C49036b71614B62020c45636A60023b10457p4240
$$ plain form
8897 -151991 -81842 53061 -367637 -6543 66827 -163260 -195025 14118 -326759 -228903 78503
8885 -150904 -251362 224435 -281378 232693 166156 -41475 -329187 -370447 -125010 -11562
8874 -254397 -263574 -267985 -15192 346007 185715 -80178 222736 61565 -181508 -216919 -59126
8862 -139878 178411 -302875 -1738 349036 -271614 262020 -345636 160023 -210457 -284697
$$ [...]
##END NTUPLES=NMR SPECTRUM
##END=
