
##TITLE=AC1362_CENAH12180_7155162_ooGzdNBeBk
##JCAMPDX= 6.0         $$ Bruker NMR JCAMP-DX V2.0
##DATA TYPE= NMR SPECTRUM
##DATA CLASS= NTUPLES
##ORIGIN= BRUKER
##OWNER= Administrator
$$ 1.72 TOPSPIN		Version 2.1
$$ 2012-12-01 11:52:24.152 -0500  Administrator@X
$$ Compression mode = diff/dup
##.OBSERVE FREQUENCY= 400.02188249412
##.OBSERVE NUCLEUS= ^1H
##.ACQUISITION MODE= SIMULTANEOUS (DQD)
##.ACQUISITION SCHEME= undefined
##.AVERAGES= 64
##.DIGITISER RES= 22
##SPECTROMETER/DATA SYSTEM= spect
##.PULSE SEQUENCE= noesygpps1d.comp
##.SOLVENT NAME= COFFEE_meoh
##.SHIFT REFERENCE= INTERNAL, COFFEE_meoh, 1, 14.96296
##AUDIT TRAIL= $$ (NUMBER, WHEN, WHO, WHERE, PROCESS, VERSION, WHAT)
$$ ##TITLE= Audit trail, TOPSPIN		Version 2.1
$$ ##JCAMPDX= 5.01
$$ ##ORIGIN= Bruker BioSpin GmbH
$$ ##OWNER= Administrator
$$ $$ E:\/data/COFFEE/nmr/AC1362_CENAH12180_7155162_ooGzdNBeBk/12/pdata/1/auditp.txt
$$ ##AUDIT TRAIL=  $$ (NUMBER, WHEN, WHO, WHERE, PROCESS, VERSION, WHAT)
(   1,<2012-12-01 11:52:17.191 -0500>,<Administrator>,<X>,<go>,<TOPSPIN 2.1>,
      <created by zg
	started at 2012-12-01 11:40:52.375 -0500,
	POWCHK enabled, PULCHK disabled,
       configuration hash MD5:
       86 BA 57 50 F2 9D 5C 9B 26 00 A9 28 5F 66 2E 89
       data hash MD5: 64K
       81 80 AB B5 0A 08 8C 1B D3 47 2D 2F FC 18 2B 7F>)
(   2,<2012-12-01 11:52:20.914 -0500>,<Administrator>,<X>,<proc1d>,<TOPSPIN 2.1>,
      <Start of raw data processing
       efp LB = 0.3 FT_mod = 6 PKNL = 1 PHC0 = 0 PHC1 = 0 SI = 128K 
       data hash MD5: 128K
       F4 D2 73 0A 24 AD 01 F5 4E 35 8F FB B7 C7 3E 19>)
(   3,<2012-12-01 11:52:22.266 -0500>,<Administrator>,<X>,<proc1d>,<TOPSPIN 2.1>,
      <pk PHC0 = -79.60144 PHC1 = 0 
       data hash MD5: 128K
       54 F2 C7 4A F8 E1 32 7C 48 EF 2F A4 BB CE 86 01>)
(   4,<2012-12-01 11:52:23.100 -0500>,<Administrator>,<X>,<proc1d>,<TOPSPIN 2.1>,
      <abs ABSG = 1 
       data hash MD5: 128K
       F4 07 EA D1 14 D0 96 1B 9C 4C 3C DA C2 ED F9 27>)
(   5,<2012-12-01 11:52:23.302 -0500>,<Administrator>,<X>,<proc1d>,<TOPSPIN 2.1>,
      <abs ABSG = 2 
       data hash MD5: 128K
       66 56 03 5F EE 61 AD F5 8F D7 1D 4D A6 19 4C 69>)
(   6,<2012-12-01 11:52:23.468 -0500>,<Administrator>,<X>,<proc1d>,<TOPSPIN 2.1>,
      <abs ABSG = 3 
       data hash MD5: 128K
       13 06 46 5A CD B8 E6 B1 1C 0F E5 C3 5A DF DF 9F>)
(   7,<2012-12-01 11:52:23.669 -0500>,<Administrator>,<X>,<proc1d>,<TOPSPIN 2.1>,
      <abs ABSG = 4 
       data hash MD5: 128K
       29 21 98 9F 3D 52 54 AF 59 45 86 F0 AD B3 DA 3E>)
(   8,<2012-12-01 11:52:23.835 -0500>,<Administrator>,<X>,<proc1d>,<TOPSPIN 2.1>,
      <abs ABSG = 5 
       data hash MD5: 128K
       52 B1 88 70 01 FC 99 D9 1C 94 9A 69 C6 62 AF BA>)
$$ ##END=
$$ 
$$ $$ hash MD5
$$ $$ 8C EB DE A6 05 9D D8 EA 2A 0C 30 30 AB 14 D4 73
##$RELAX= 
##$RELAX= 
##$RELAX= 
##$RELAX= 
##$RELAX= 
##$RELAX= 
##$RELAX= 
##$RELAX= 
$$ Bruker specific parameters
$$ --------------------------
##$DU= <E:\>
##$EXPNO= 12
$$ [...]
##$TP07= 0
##$TPNAME0= <>
##$TPNAME1= <>
##$TPNAME2= <>
##$TPNAME3= <>
##$TPNAME4= <>
##$TPNAME5= <>
##$TPNAME6= <>
##$TPNAME7= <>
##$TPOAL= (0..7)
0.5 0.5 0.5 0.5 0.5 0.5 0.5 0.5
##$TPOFFS= (0..7)
0 0 0 0 0 0 0 0
##$TUNHIN= 0
##$TUNHOUT= 0
##$TUNXOUT= 0
##$USERA1= <user>
##$USERA2= <user>
##$USERA3= <user>
##$USERA4= <user>
##$USERA5= <user>
##$V9= 5
##$VALIST= <valist>
##$VCLIST= <CCCCCCCCCCCCCCC>
##$VD= 0
##$VDLIST= <DDDDDDDDDDDDDDD>
##$VPLIST= <PPPPPPPPPPPPPPP>
##$VTLIST= <TTTTTTTTTTTTTTT>
##$WBST= 1024
##$WBSW= 4
##$XGAIN= (0..3)
0 0 0 0
##$XL= 0
##$YL= 0
##$YMAX_a= 7802819
##$YMIN_a= -17282544
##$ZGOPTNS= <>
##$ZL1= 120
##$ZL2= 120
##$ZL3= 120
##$ZL4= 120
##$ABSF1= 14.96296
##$ABSF2= -5.595222
##$ABSG= 5
##$ABSL= 3
##$ALPHA= 0
##$AQORDER= 0
##$ASSFAC= 0
##$ASSFACI= 0
##$ASSFACX= 0
##$ASSWID= 0
##$AUNMP= <proc_prof1d_extract.lims>
##$AXLEFT= 0
##$AXNAME= <>
##$AXNUC= <1H>
##$AXRIGHT= 0
##$AXTYPE= 0
##$AXUNIT= <>
##$AZFE= 0.1
##$AZFW= 0.1
##$BCFW= 0
##$BC_mod= 0
##$BYTORDP= 0
##$COROFFS= 0
##$CY= 15
##$DATMOD= 1
##$DC= 0
##$DFILT= <>
##$DTYPP= 0
##$F1P= 0
##$F2P= 0
##$FCOR= 0.5
##$FTSIZE= 131072
##$FT_mod= 6
##$GAMMA= 0
##$GB= 0
##$INTBC= 1
##$INTSCL= 1
##$ISEN= 128
##$LB= 0.3
##$LEV0= 0
##$LPBIN= 0
##$MAXI= 10000
##$MC2= 0
##$MEAN= 0
##$ME_mod= 0
##$MI= 0
##$NCOEF= 0
##$NC_proc= -2
##$NLEV= 6
##$NOISF1= 0
##$NOISF2= 0
##$NSP= 0
##$NTH_PI= 0
##$NZP= 0
##$OFFSET= 14.96296
##$PC= 1
##$PHC0= -79.60144
##$PHC1= 0
##$PH_mod= 1
##$PKNL= yes
##$PPARMOD= 0
##$PPDIAG= 0
##$PPIPTYP= 0
##$PPMPNUM= 2147483647
##$PPRESOL= 1
##$PSCAL= 4
##$PSIGN= 0
##$PYNMP= <proc.py>
##$REVERSE= no
##$SF= 400.020008851482
##$SI= 131072
##$SIGF1= 0
##$SIGF2= 0
##$SINO= 400
##$SIOLD= 131072
##$SPECTYP= <>
##$SREGLST= <1H.CDCl3>
##$SSB= 0
##$STSI= 131072
##$STSR= 0
##$SW_p= 8223.68421052631
##$SYMM= 0
##$S_DEV= 0
##$TDeff= 65536
##$TDoff= 0
##$TI= <>
##$TILT= no
##$TM1= 0
##$TM2= 0
##$TOPLEV= 0
##$USERP1= <user>
##$USERP2= <user>
##$USERP3= <user>
##$USERP4= <user>
##$USERP5= <user>
##$WDW= 1
##$XDIM= 131072
##$YMAX_p= 453275675
##$YMIN_p= -16128
##$CURPLOT= <Network HP LaserJet P1505>
##$CURPRIN= <$Network HP LaserJet P1505>
##$DFORMAT= <normdp>
##$LAYOUT= <+/1D_H.xwp>
##$LFORMAT= <normlp>
##$PFORMAT= <normpl>
##$SURQMSG= 1
$$ End of Bruker specific parameters
$$ ---------------------------------
##NTUPLES= NMR SPECTRUM
##VAR_NAME=  FREQUENCY,     SPECTRUM/REAL,   SPECTRUM/IMAG
##SYMBOL=    X,             R,               I
##VAR_TYPE=  INDEPENDENT,   DEPENDENT,       DEPENDENT
##VAR_FORM=  AFFN,          ASDF,            ASDF
##VAR_DIM=   131072,        131072,          131072
##UNITS=     HZ,            ARBITRARY UNITS, ARBITRARY UNITS
##FACTOR=    0.0627417313425164, 1,          1
##FIRST=     8223.62146879497, 316,          -53940
##LAST=      0,             1578,            -54964
##MIN=       0,             -16128,          0
##MAX=       8223.62146879497, 453275675,    0
$$ Real data points
##PAGE= N=1
##DATA TABLE= (X++(R..R)), XYDATA
$$ [...]
$$ plain form
60990 1177241 1221777 1268033 1316275 1368840 1426490 1487226 1549155 1611891 1674890 1737548 1801852
60979 1801852 1872109 1951343 2040805 2143386 2263638 2403163 2559634 2731919 2922981 3137083
60969 3137083 3379280 3660111 3996306 4404323 4898188 5496825 6227879 7120735 8203748
60960 8203748 9515952 11114810 13063610 15418427 18232602 21536773 25239232 29000562
60952 29000562 32248551 34421730 35290801 35084061 34316300 33505626 33020533 33079781 33738545
60943 33738545 34785450 35699091 35832099 34749552 32451146 29306133 25800907 22325868
60935 22325868 19113510 16273827 13838262 11787800 10078740 8664363 7501468 6547809
60927 6547809 5763952 5118400 4586830 4146981 3777606 3461631 3187045 2944786 2728053
$$ packed form
60990A177241M4536M6256M8242N2565N7650O0736O1929O2736O2999O2658O4304
60979A801852P0257P9234Q9462J02581J20252J39525J56471J72285J91062K14102
60969C137083K42197K80831L36195M08017M93865N98637P31054Q92856J083013
60960H203748J312204J598858J948800K354817K814175L304171L702459L761330
60952B9000562L247989K173179Q69071k06740p67761q10674m85093N9248O58764
60943C3738545J046905R13641J33008j082547k298406l145013l505226l475039
60935B2325868l212358k839683k435565k050462j709060j414377j162895r53659
60927F547809p83857o45552n31570m39849l69375l15975k74586k42259k16733
$$ plain form
60918 2728053 2533194 2358578 2202044 2060716 1933007 1819006 1718730 1631239 1555302 1489387
60908 1489387 1430643 1375189 1320102 1264584 1209135 1154439 1101364 1051210 1005218 964008 927684
60897 927684 896169 869184 846220 826799 810539 796860 784986 774624 766354 760909 758071 756673
60885 756673 755661 754710 753756 752480 750638 748553 746786 745491 744446 743496 742478 740821 737780 733147 727314
60870 727314 720610 712967 704318 694847 684815 674481 664261 654577 645560 637277 630114 624366 619520
60857 619520 614642 609552 604966 601378 598615 596722 596441 598311 601912 606494 611889 618369 626128 635320
60843 635320 646118 658281 671138 684406 698433 713127 727227 739334 749321 758104 766441 774665
60831 774665 783280 792869 803364 814095 824671 835261 845829 855580 863470 869087 872875 875611 877822
$$ packed form
60918B728053j94859j74616j56534j41328j27709j14001j00276q7491p5937o5915
60908A489387n8744n5454n5087n5518n5449n4696n3075n0154m5992m1210l6324
60897I27684l1515k6985k2964j9421j6260j3679j1874j0362q270n445k838j398
60885G56673j012r51r54j276j842k085j767j295j045r50j018j657l041m633n833
60870G27314o704p643q649r471j0032j0334j0220r684r017q283p163n748m846
60857F19520m878n090m586l588k763j893k81J870L601M582N395O480P759R192
60843F35320J0798J2163J2857J3268J4027J4694J4100J2107R987Q783Q337Q224
60831G74665Q615R589J0495J0731J0576J0590J0568R751P890N617L788K736K211
$$ plain form
60818 877822 879638 881122 882562 884230 885808 886276 884513 879928 872588 863037 852113 840618 828869 816622
60804 816622 803597 790010 776526 763740 751761 740294 729072 718161 707820 698237 689736 683086
60792 683086 678978 677055 676123 675712 676758 680206 685671 692250 700015 709631 720905 732848 745000 757542
60778 757542 770185 782141 793298 804321 815388 825909 835688 845209 854308 861676 866358 868922 870546
60765 870546 871645 871998 871561 870566 869262 868047 867434 867538 868057 868910 870334 872182 873882 875343 877147 879530
60749 879530 881995 884362 887269 891095 895135 898582 901649 904962 908321 910768 911608 910818 908745 905877 902639
60734 902639 899015 894566 889039 882682 875866 868891 862241 856370 850983 845238 838989 833237 828982 826238
60720 826238 824455 823225 822123 820575 818416 816106 813941 811514 808291 804121 798826 791949 783446 774160
$$ packed form
60818H77822J816J484J440J668J578M68j763m585p340r551j0924j1495j1749j2247
60804H16622j3025j3587j3484j2786j1979j1467j1222j0911j0341r583q501o650
60792F83086m108j923r32m11J046L448N465O579P765R616J1274J1943J2152J2542
60778G57542J2643J1956J1157J1023J1067J0521R779R521R099P368M682K564J624
60765H70546J099L53m37r95j304j215o13J04N19Q53J424J848J700J461J804K383
60749H79530K465K367K907L826M040L447L067L313L359K447Q40p90k073k868l238
60734I02639l624m449n527o357o816o975o650n871n387n745o249n752m255k744
60720H26238j783j230j102j548k159k310k165k427l223m170n295o877q503r286
$$ plain form
60706 774160 765087 756577 748529 740797 733168 725653 719217 715505 715229 717313 720125 723037 726291 729963
60692 729963 733741 737365 740639 743128 744182 743224 739916 734374 727193 718875 709311 698392 686904 675968
60678 675968 665653 655205 644693 635281 627619 621125 615300 610546 607129 604447 602082 600576 600394 601004
60664 601004 601711 602626 604073 605786 607324 608508 608974 608223 606778 606219 607256 608745 609501 610028 611427 613556
60648 613556 615608 617801 621146 625847 631043 635865 639925 643077 645503 647675 649619 650774 651227 652334
60634 652334 655214 659374 663801 668777 675480 684318 694810 706709 720085 734556 749529 765133 781963
60621 781963 799970 818314 836167 852946 868020 880943 891782 900621 906941 910079 909945 906867 901173
60608 901173 893442 884501 874584 863149 850223 837203 825560 815510 806844 800152 795998 793572 791559
$$ packed form
60706G74160r073q510q048p732p629p515o436l712k76K084K812K912L254L672
60692G29963L778L624L274K489J054r58l308n542p181q318r564j0919j1488j0936
60678F75968j0315j0448j0512r412p662o494n825m754l417k682k365j506j82O10
60664F01004P07R15J447J713J538J184M66p51j445n59J037J489P56N27J399K129
60648F13556K052K193L345M701N196M822M060L152K426K172J944J155M53J107
60634F52334K880M160M427M976O703Q838J0492J1899J3376J4471J4973J5604J6830
60621G81963J8007J8344J7853J6779J5074J2923J0839Q839O320L138j34l078n694
60608I01173p731q941r917j1435j2926j3020j1643j0050q666o692m154k426k013
$$ plain form
60595 791559 789953 789727 790998 792756 794208 795201 795374 794108 791384 787832 783878 779628 775410 771502 767504
60580 767504 762851 757878 753470 749819 746432 743316 741153 740180 739779 739376 739157 739747 741655 745053 749681
60565 749681 755002 760702 766746 772674 777373 780109 781286 781638 781179 779631 777296 774714 771909 768749 765546
60550 765546 762542 759317 755630 752409 750908 751195 752304 753507 754634 755614 756795 759403 764740 773151 784570
60535 784570 799697 819689 845049 875825 912545 955836 1005130 1058551 1113699 1167611 1216218
60524 1216218 1255076 1280910 1292171 1288762 1272264 1246078 1214195 1179765 1145397 1114177 1089103
60513 1089103 1071567 1061329 1057857 1060891 1069983 1084335 1102885 1123810 1144402 1162388 1177087 1188512
60501 1188512 1196032 1199045 1198529 1196763 1195849 1197578 1204203 1217983 1240063 1270829 1311146 1362358 1425668
$$ packed form
60595G91559j606k26J271J758J452R93J73j266k724l552l954m250m218l908l998
60580G67504m653m973m408l651l387l116k163r73m01m03k19N90J908L398M628
60565G49681N321N700O044N928M699K736J177L52m59j548k335k582k805l160l203
60550G65546l004l225l687l221j501K87J109J203J127R80J181K608N337Q411J1419
60535G84570J5127J9992K5360L0776L6720M3291M9294N3421N5148N3912M8607
60524A216218L8858K5834J1261l409j6498k6186l1883l4430l4368l1220k5074
60513A089103j7536j0238l472L034R092J4352J8550K0925K0592J7986J4699J1425
60501A188512P520L013n16j766r14J729O625J3780K2080L0766M0317N1212O3310
$$ plain form
60488 1425668 1502742 1596425 1709600 1843679 1999359 2178252 2382457 2613402 2872986 3165429
60478 3165429 3496017 3867793 4280064 4727738 5197567 5663516 6088549 6433719 6666829
60469 6666829 6765426 6717565 6524491 6203069 5783706 5304039 4801561 4307343 3842442 3418399
60459 3418399 3040498 2710106 2424914 2179659 1968521 1786903 1631029 1497235 1382415
60450 1382415 1284290 1200510 1128225 1065022 1009617 961123 918317 880075 845902 815568 788713
60439 788713 765040 744368 726302 710266 695804 682339 668856 654709 640582 627741 616483
60428 616483 606309 597385 590514 585597 581475 577600 574636 573116 572664 573006 574560 577433 580738 583454
60414 583454 585244 586080 585928 585204 584761 584991 585571 586264 587245 588528 589952 591920 595263 600049 605256 609825
$$ packed form
60488A425668P7074R3683J13175J34079J55680J78893K04205K30945K59584K92443
60478C165429L30588L71776M12271M47674M69829M65949M25033L45170K33110
60469F666829R8597m7861j93074l21422m19363m79667n02478m94218m64901m24043
60459C418399l77901l30392k85192k45255k11138j81618j55874j33794j14820
60450A382415r8125q3780p2285o3203n5405m8494m2806l8242l4173l0334k6855
60439G88713k3673k0672j8066j6036j4462j3465j3483j4147j4127j2841j1258
60428F16483j0174q924o871m917m122l875k964j520m52L42J554K873L305K716
60414E83454J790Q36j52p24m43K30N80O93R81J283J424J968L343M786N207M569
$$ plain form
60398 609825 613357 615816 617426 618918 620963 623242 624899 625942 627224 629113 631170 633097 634908 636154
60384 636154 636190 635305 634440 633740 632504 630604 628588 626352 623190 619383 616307 614570 613450 612535 612454 613463
60368 613463 614747 615754 616932 618480 619637 619915 619940 620389 621152 622055 623304 624655 625286 625174 625552 627420
60352 627420 630589 634597 639427 644861 650406 656422 664015 673223 682664 691678 701344 712478 723998 734471
60338 734471 744115 754053 764461 774544 783563 790833 795521 797476 797734 797369 796465 794856 793109 791967
60324 791967 791575 791984 793735 797251 802404 809337 818848 831106 844688 857646 868833 877498 882476 882800
60310 882800 878714 871313 861626 850565 839160 828107 817414 806909 796682 786841 777480 769101 762344
60297 762344 757118 752786 749295 747164 746298 746004 746306 747794 749890 750851 750124 749225 749472 750263 750500 750373 750774
$$ packed form
60398F09825L532K459J610J492K045K279J657J043J282J889K057J927J811J246
60384F36154L6q85q65p00j236j900k016k236l162l807l076j737j120r15q1J009
60368F13463J284J007J178J548J157K78K5M49P63R03J249J351O31j12L78J868
60352F27420L169M008M830N434N545O016P593R208R441R014R666J1134J1520J0473
60338G34471R644R938J0408J0083R019P270M688J955K58l65r04j609j747j142
60324G91967l92M09J751L516N153O933R511J2258J3582J2958J1187Q665M978L24
60310H82800m086p401r687j1061j1405j1053j0693j0505j0227r841r361q379o757
60297G62344n226m332l491k131q66k94L02J488K096R61p27q99K47P91K37j27M01
$$ plain form
60280 750774 752067 754387 757968 762283 766023 768873 772190 777080 783064 789530 797113 806440 816887 827946
60266 827946 840590 855837 873030 891026 910183 931734 956154 983627 1015253 1052029 1093194
60255 1093194 1137194 1183934 1234767 1290686 1352012 1419550 1494599 1577730 1668573 1766688 1871828
60244 1871828 1983521 2101091 2223599 2349013 2473961 2595200 2710886 2819729 2919674 3008396
60234 3008396 3084487 3147148 3195298 3227998 3245232 3247351 3234343 3206677 3166393 3116419 3059353
60223 3059353 2997750 2934888 2874101 2817779 2767933 2727082 2697479 2679873 2674127 2680635 2700183 2732897
60211 2732897 2778412 2836850 2908698 2993925 3091835 3201376 3320880 3447874 3579647 3713382
60201 3713382 3845261 3970394 4084477 4184871 4269486 4335690 4381309 4405783 4409371 4392026 4353990
$$ packed form
60280G50774J293K320L581M315L740K850L317M890N984O466P583R327J0447J1059
60266H27946J2644J5247J7193J7996J9157K1551K4420K7473L1626L6776M1165
60255A093194M4000M6740N0833N5919O1326O7538P5049Q3131R0843R8115J05140
60244A871828J11693J17570J22508J25414J24948J21239J15686J08843R9945Q8722
60234C008396P6091O2661M8150L2700J7234K119j3008k7666m0284m9974n7066
60223C059353o1603o2862o0787n6322m9846m0851k9603j7606n746O508J9548L2714
60211B732897M5515N8438P1848Q5227R7910J09541J19504J26994J31773J33735
60201C713382J31879J25133J14083J00394Q4615O6204M5619K4474L588j7345l8036
$$ plain form
60190 4353990 4296613 4221664 4130917 4027570 3916985 3804647 3694101 3587857 3489145 3401236
60180 3401236 3325889 3264045 3217307 3187284 3174200 3177692 3198342 3236814 3292007 3361533 3443437
60169 3443437 3535870 3635506 3737954 3839406 3936507 4025028 4100410 4159601 4201226 4224468 4229280
60158 4229280 4217419 4191781 4154732 4108225 4055080 3998794 3942483 3889256 3843056 3807542 3784531
60147 3784531 3775012 3781206 3805869 3849990 3913088 3995646 4099353 4224884 4371421 4538862 4728902
60136 4728902 4943422 5183115 5448033 5738115 6052523 6389271 6745694 7118263 7501808
60127 7501808 7889847 8275776 8652875 9013433 9349250 9653195 9919474 10142599 10317359
60118 10317359 10439931 10507955 10519569 10473432 10369761 10210484 9998640 9738817 9438045 9105202
$$ packed form
60190D353990n7377p4949r0747j03347j10585j12338j10546j06244r8712q7909
60180C401236p5347o1844m6738l0023j3084L492K0650L8472N5193O9526Q1904
60169C443437R2433R9636J02448J01452R7101Q8521P5382N9191M1625K3242M812
60158D229280j1861k5638l7049m6507n3145n6286n6311n3227m6200l5514k3011
60147C784531r519O194K4663M4121O3098Q2558J03707J25531J46537J67441J90040
60136D728902K14520K39693K64918K90082L14408L36748L56423L72569L83545
60127G501808L88039L85929L77099L60558L35817L03945K66279K23125J74760
60118A0317359J22572O8024J1614m6137j03671j59277k11844k59823l00772l32843
$$ plain form
60108 9105202 8749697 8381720 8013079 7655779 7319190 7009469 6731380 6489115 6285236
60099 6285236 6120461 5995033 5909331 5862878 5853933 5880463 5940632 6032092 6151489 6294542 6455570
60088 6455570 6626899 6799754 6965996 7118444 7249967 7353683 7424460 7459718 7458994 7423483
60078 7423483 7355617 7257993 7132741 6982487 6811221 6623120 6421132 6208064 5988457 5767863
60068 5767863 5550566 5339510 5138135 4950572 4779933 4627816 4495478 4384062 4293682 4223634
60058 4223634 4173599 4143496 4132480 4139568 4165125 4210191 4274385 4355917 4453448 4566127 4691655
60047 4691655 4825972 4964987 5104906 5240629 5365672 5474418 5563356 5629994 5672129 5688587
60037 5688587 5679275 5644053 5582817 5496986 5389668 5264220 5124042 4973824 4819199 4664555
$$ packed form
60108I105202l55505l67977l68641l57300l36589l09721k78089k42265k03879
60099F285236j64775j25428q5702m6453q945K6530O0169R1460J19397J43053J61028
60088F455570J71329J72855J66242J52448J31523J03716P0777L5258p24l5511
60078G423483o7866r7624j25252j50254j71266j88101k01988k13068k19607k20594
60068E767863k17297k11056k01375j87563j70639j52117j32338j11416r0380p0048
60058D223634n0035l0103j1016P088K5557M5066O4194Q1532R7531J12679J25528
60047D691655J34317J39015J39919J35723J25043J08746Q8938O6638M2135J6458
60037E688587r312l5222o1236q5831j07318j25448j40178j50218j54625j54644
$$ plain form
60027 4664555 4512521 4365895 4228436 4103044 3990581 3891203 3805691 3734949 3679466 3640067
60017 3640067 3618223 3614986 3630446 3664656 3718229 3791782 3885614 4000018 4134920 4289059 4460297
60006 4460297 4646332 4843717 5046357 5246530 5437471 5613673 5769165 5897843 5996091 6063354
59996 6063354 6099626 6104011 6076156 6017257 5928951 5812886 5672361 5513116 5341782 5164751
59986 5164751 4988805 4820915 4666282 4527688 4407333 4307810 4230552 4174904 4139837 4125321
59976 4125321 4131083 4155296 4195752 4251491 4322290 4407175 4504064 4610160 4722146 4836679 4950976
59965 4950976 5062201 5166442 5259733 5340352 5408745 5464905 5507385 5535383 5550141 5553531 5546725
59954 5546725 5531089 5509120 5483762 5458030 5435903 5422285 5421412 5436563 5471821 5532429 5622507 5743924
$$ packed form
60027D664555j52034j46626j37459j25392j12463r9378q5512p0742n5483l9399
60017C640067k1844l237J5460L4210N3573P3553R3832J14404J34902J54139J71238
60006D460297J86035J97385K02640K00173J90941J76202J55492J28678R8248O7263
59996F063354L6272M385k7855n8899q8306j16065j40525j59245j71334j77031
59986E164751j75946j67890j54633j38594j20355r9523p7258n5648l5067j4516
59976D125321N762K4213M0456N5739P0799Q4885R6889J06096J11986J14533J14297
59965D950976J11225J04241R3291Q0619O8393N6160M2480K7998J4758L390o806
59954E546725j5636k1969k5358k5732k2127j3618q73J5151L5258O0608R0078J21417
$$ plain form
59942 5743924 5898351 6088985 6319118 6590293 6902838 7256867 7651305 8082589 8544952
59933 8544952 9030601 9528364 10022888 10495980 10928040 11298205 11585617 11773152 11850596 11814837
59923 11814837 11669157 11423609 11094529 10701485 10264060 9800876 9329314 8864180 8416826
59914 8416826 7995929 7607996 7256565 6942550 6666693 6430855 6236290 6082114 5966681
59905 5966681 5889295 5849526 5846122 5877943 5944947 6046911 6181891 6346846 6538621 6752946
59895 6752946 6983209 7221234 7458265 7683947 7885370 8048874 8162941 8219082 8211427 8137249
59885 8137249 7997944 7798767 7547925 7256054 6935246 6597206 6252329 5910276 5579759
59876 5579759 5266782 4974254 4704128 4458792 4239695 4046212 3877084 3731654 3608522
$$ packed form
59942E743924J54427J90634K30133K71175L12545L54029L94438M31284M62363
59933H544952M85649M97763M94524M73092M32060L70165K87412J87535P7444l5759
59923A1814837j45680k45548l29080l93044m37425m63184m71562m65134m47354
59914H416826m20897l87933l51431l14015k75857k35838j94565j54176j15433
59905E966681p7386l9769l404L1821O7004J01964J34980J64955J91775K14325
59895F752946K30263K38025K37031K25682K01423J63504J14067N6141p655p4178
59885H137249j39305j99177k50842k91871l20808l38040l44877l42053l30517
59876E579759l12977k92528k70126k45336k19097j93483j69128j45430j23132
$$ plain form
59867 3608522 3504472 3416366 3342998 3283475 3234716 3192205 3152426 3113076 3071776 3026501 2977117
59856 2977117 2925130 2872133 2819566 2769413 2723796 2684062 2651174 2626417 2610696 2603578 2603915 2610626
59844 2610626 2621749 2633471 2641457 2642871 2636228 2620108 2593444 2556850 2512511 2462928 2410628 2358574
59832 2358574 2309624 2265546 2227170 2195189 2170216 2152474 2142028 2138842 2142238 2151119 2165432 2186628
59820 2186628 2216019 2253369 2297670 2348410 2405352 2467955 2535642 2607629 2681778 2754654 2823523
59809 2823523 2887275 2944780 2993823 3032823 3062290 3083230 3095199 3097283 3090261 3076684 3059745 3043146
59797 3043146 3030988 3026429 3031045 3046171 3073495 3113273 3163620 3223456 3295323 3383941 3493265
59786 3493265 3626710 3789063 3985823 4220916 4496614 4815053 5177760 5583194 6024795
$$ packed form
59867C608522j04050q8106p3368n9523m8759m2511l9779l9350m1300m5275m9384
59856B977117n1987n2997n2567n0153m5617l9734l2888k4757j5721p118L37O711
59844B610626J1123J1722P986J414o643j6120k6664l6594m4339m9583n2300n2054
59832B358574m8950m4078l8376l1981k4973j7742j0446l186L396Q881J4313K1196
59820B186628K9391L7350M4301N0740N6942O2603O7687P1987P4149P2876O8869
59809B823523O3752N7505M9043L9000K9467K0940J1969K084p022j3577j6939j6599
59797C043146j2158m559M616J5126K7324L9778N0347N9836P1867Q8618J09324
59786C493265J33445J62353J96760K35093K75698L18439L62707M05434M41601
$$ plain form
59777 6024795 6489328 6954163 7386202 7746390 7998633 8118190 8096929 7945159 7688713 7361091
59767 7361091 6994965 6617651 6250023 5905997 5592891 5313945 5070792 4863344 4689143
59758 4689143 4544974 4428763 4338721 4271745 4224496 4195383 4183794 4188142 4206533 4238808 4286032
59747 4286032 4348319 4424935 4516136 4623066 4746115 4885167 5041433 5217454 5415365 5636635
59737 5636635 5883325 6158105 6463166 6800453 7172738 7582968 8032655 8521999 9050942
59728 9050942 9618247 10219384 10846286 11488681 12134322 12768657 13376490 13944822 14464147
59719 14464147 14928818 15338800 15701373 16029813 16340350 16650779 16979928 17345103 17759033
59710 17759033 18229932 18763314 19361193 20019239 20726156 21465459 22215941 22950815 23639294
$$ packed form
59777F024795M64533M64835M32039L60188K52243J19557k1261j51770k56446l27622
59767G361091l66126l77314l67628l44026l13106k78946k43153k07448j74201
59758D689143j44169j16211r0042o6976m7249k9113j1589M348J8391L2275M7224
59747D286032O2287P6616R1201J06930J23049J39052J56266J76021J97911K21270
59737E636635K46690K74780L05061L37287L72285M10230M49687M89344N28943
59728I050942N67305O01137O26902O42395O45641O34335O07833N68332N19325
59719A4464147M64671M09982L62573L28440L10537L10429L29149L65175M13930
59710A7759033M70899N33382N97879O58046P06917P39303P50482P34874O88479
$$ plain form
59701 23639294 24250808 24758147 25138788 25377275 25468722 25419853 25246770 24972322 24624152 24231880
59691 24231880 23823858 23425886 23061339 22750239 22507904 22345907 22274329 22301993 22435314 22679143
59681 22679143 23039021 23521153 24130219 24868567 25736567 26730583 27838819 29039153 30299394
59672 30299394 31576345 32813640 33943103 34891513 35589264 35978328 36020358 35704035 35047672
59663 35047672 34095459 32910096 31564339 30131999 28680156 27265154 25931493 24710291
59655 24710291 23617398 22653827 21807881 21055680 20361014 19679612 18968957 18198590 17356125
59646 17356125 16448241 15496834 14530836 13577522 12658378 11789394 10981371 10239027 9561944
59637 9561944 8947783 8394079 7897262 7452053 7052922 6695302 6375194 6088854 5833341
$$ packed form
59701B3639294O11514N07339L80641K38487R1447m8869j73083k74448l48170l92272
59691B4231880m08022l97972l64547l11100k42335j61997p1578K7664J33321K43829
59681B2679143L59878M82132O09066P38348Q68000R94016J108236J200334J260241
59672C0299394J276951J237295J129463R48410O97751L89064M2030l16323o56363
59663C5047672r52213j185363j345757j432340j451843j415002j333661j221202
59655B4710291j092893r63571q45946p52201o94666o81402p10655p70367q42465
59646A7356125r07884r51407r65998r53314r19144q68984q08023p42344o77083
59637I561944o14161n53704m96817m45209l99131l57620l20108k86340k55513
$$ plain form
59628 5833341 5606312 5405013 5226537 5069141 4932129 4814213 4713119 4626942 4554745 4495573
59618 4495573 4447865 4409782 4379032 4352378 4326353 4298390 4266322 4227244 4178242 4118049 4046836
59607 4046836 3965019 3873804 3776321 3676256 3575526 3474933 3376617 3283665 3197362 3116963 3042357
59596 3042357 2974937 2915623 2864054 2820053 2783935 2755062 2732109 2715273 2706210 2705142 2709863 2718317
59584 2718317 2730406 2746464 2765587 2786334 2807725 2828830 2848604 2866773 2883896 2900380 2916652
59573 2916652 2934297 2955422 2980728 3009746 3043103 3082794 3129929 3184009 3244879 3313717 3391680
59562 3391680 3479244 3577384 3687780 3811355 3948133 4098952 4265791 4450066 4652178 4872955
59552 4872955 5113830 5375123 5655683 5954286 6269589 6598472 6936360 7279519 7625249
$$ packed form
59628E833341k27029k01299j78476j57396j37012j17916j01094q6177p2197n9172
59618D495573m7708l8083l0750k6654k6025k7963l2068l9078m9002o0193p1213
59607D046836q1817r1215r7483j00065j00730j00593r8316r2952q6303q0399p4606
59596C042357o7420n9314n1569m4001l6118k8873k2953j6836r063j068M721Q454
59584B718317J2089J6058J9123K0747K1391K1105J9774J8169J7123J6484J6272
59573B916652J7645K1125K5306K9018L3357L9691M7135N4080O0870O8838P7963
59562C391680Q7564R8140J10396J23575J36778J50819J66839J84275K02112K20777
59552D872955K40875K61293K80560K98603L15303L28883L37888L43159L45730
$$ plain form
59543 7625249 7969654 8307507 8634930 8950405 9252924 9541406 9816556 10081149 10337774
59534 10337774 10587966 10833290 11074244 11307283 11525833 11725760 11907546 12071802 12214807
59525 12214807 12329452 12407850 12441216 12419758 12335505 12184645 11966302 11681123 11332867 10929870
59515 10929870 10483260 10004804 9507250 9004317 8507858 8025632 7562811 7124002 6712258
59506 6712258 6327769 5969614 5638068 5333941 5056828 4805529 4579342 4377623 4198850
59497 4198850 4041231 3903441 3783948 3680643 3591981 3517421 3456076 3406270 3367253 3339905
59487 3339905 3324887 3321518 3329312 3349029 3381187 3425097 3480551 3549037 3632252 3730895 3845906
59476 3845906 3979260 4132338 4305030 4497595 4711752 4948577 5206608 5483021 5774906
$$ packed form
59543G625249L44405L37853L27423L15475L02519K88482K75150K64593K56625
59534A0337774K50192K45324K40954K33039K18550J99927J81786J64256J43005
59525A2214807J14645P8398L3366k1458q4253j50860k18343k85179l48256m02997
59515A0929870m46610m78456m97554n02933m96459m82226m62821m38809m11744
59506F712258l84489l58155l31546l04127k77113k51299k26187k01719j78773
59497D198850j57619j37790j19493j03305q8662p4560o1345m9806l9017k7348
59487C339905j5018l369P794J9717L2158M3910N5454O8486Q3215R8643J15011
59476C845906J33354J53078J72692J92565K14157K36825K58031K76413K91885
$$ plain form
59467 5774906 6077921 6385082 6688061 6978247 7245403 7477208 7662018 7791270 7858705 7859627
59457 7859627 7792978 7662855 7476488 7241977 6968962 6669163 6353818 6031433 5709152 5394424
59447 5394424 5093250 4808204 4540135 4290662 4061321 3851707 3660556 3487669 3332948
59438 3332948 3194656 3070583 2960082 2863222 2778844 2705132 2641261 2586878 2540861 2502197 2471228
59427 2471228 2448502 2433242 2424301 2421588 2425114 2433715 2446154 2462372 2482166 2503896 2526141 2549576
59415 2549576 2575663 2604656 2636456 2672214 2713471 2760885 2815137 2877121 2944987 3012699 3074579
59404 3074579 3131096 3188413 3253320 3330618 3424117 3537087 3671728 3830345 4016667 4233724
59394 4233724 4480429 4752439 5047003 5366033 5715066 6100831 6529191 7002911 7520183
$$ packed form
59467E774906L03015L07161L02979K90186K67156K31805J84810J29252O7435R22
59457G859627o6649j30123j86367k34511k73015k99799l15345l22385l22281l14728
59447E394424l01174k85046k68069k49473k29341k09614j91151j72887j54721
59438C332948j38292j24073j10501r6860q4378p3712o3871n4383m6017l8664l0969
59427B471228k2726j5260q941k713L526Q601J2439J6218J9794K1730K2245K3435
59415B549576K6087K8993L1800L5758M1257M7414N4252O1984O7866O7712O1880
59404C074579N6517N7317O4907P7298R3499J12970J34641J58617J86322K17057
59394D233724K46705K72010K94564L19030L49033L85765M28360M73720N17272
$$ plain form
59385 7520183 8075307 8659957 9262791 9869031 10462496 11028427 11554261 12029640 12448030
59376 12448030 12808187 13112692 13365339 13570584 13733881 13860178 13951872 14008866 14029466 14009927
59366 14009927 13944303 13826641 13653143 13421743 13131677 12785875 12393349 11967937 11525546
59357 11525546 11083424 10659544 10269228 9921948 9622207 9371898 9169610 9008849 8879532
59348 8879532 8771039 8672468 8571474 8455937 8316998 8149263 7949269 7716283 7454066 7169508
59338 7169508 6869543 6560899 6251744 5950706 5663892 5394403 5144333 4915443 4708210
59329 4708210 4522176 4357190 4212911 4087655 3979409 3887520 3811845 3750928 3702717 3666454
59319 3666454 3642082 3628576 3624696 3630716 3647485 3674494 3710855 3757463 3816030 3886542 3967804 4059944
$$ packed form
59385G520183N55124N84650O02834O06240N93465N65931N25834M75379M18390
59376A2448030L60157L04505K52647K05245J63297J26297R1694N6994K0600j9539
59366A4009927o5624j17662j73498k31400k90066l45802l92526m25412m42391
59357A1525546m42122m23880l90316l47280k99741k50309k02288j60761j29317
59348H879532j08493r8571j00994j15537j38939j67735j99994k32986k62217k84558
59338G169508k99965l08644l09155l01038k86814k69489k50070k28890k07233
59329D708210j86034j64986j44279j25256j08246r1889p5675o0917m8211l6263
59319C666454k4372j3506l880O020J6769K7009L6361M6608N8567P0512Q1262R2140
$$ plain form
59307 4059944 4164116 4279951 4405313 4538269 4677290 4819824 4962528 5102611 5237254
59298 5237254 5362303 5473603 5569049 5647470 5706332 5743044 5758253 5755618 5738661 5710078 5673737
59287 5673737 5634833 5597820 5566083 5543363 5533461 5538625 5560114 5599975 5660170 5740229 5837789 5951013
59275 5951013 6078149 6214952 6354879 6491770 6620270 6733986 6825935 6891267 6927813 6934318
59265 6934318 6910650 6859989 6788632 6703211 6609641 6514332 6423970 6343710 6277256 6228540 6201420
59254 6201420 6197755 6217404 6259297 6320011 6391705 6464427 6531364 6590637 6642874 6689584 6733501
59243 6733501 6777469 6822448 6868758 6919372 6979749 7054468 7146493 7259851 7400372 7573152 7781042
59232 7781042 8025413 8305685 8617464 8952774 9301670 9651262 9983641 10278120 10516562
$$ packed form
59307D059944J04172J15835J25362J32956J39021J42534J42704J40083J34643
59298E237254J25049J11300R5446P8421N8862L6712J5209k635j6957k8583l6341
59287E673737l8904l7013l1737k2720r902N164K1489L9861O0195Q0059R7560J13224
59275E951013J27136J36803J39927J36891J28500J13716R1949O5332L6546O505
59265F934318k3668n0661p1357q5421r3570r5309r0362q0260o6454m8716k7120
59254F201420l665J9649M1893O0714P1694P2722O6937N9273N2237M6710M3917
59243F733501M3968M4979M6310N0614O0377P4719R2025J13358J40521J72780K07890
59232G781042K44371K80272L11779L35310L48896L49592L32379K94479K38442
$$ plain form
59223 10516562 10684990 10771175 10764723 10660728 10460871 10170623 9798438 9358322 8869624 8352060
59213 8352060 7822165 7294397 6782090 6295259 5839311 5417204 5031160 4681537 4366357
59204 4366357 4083403 3831367 3608323 3411078 3236913 3084229 2950718 2832836 2727902
59195 2727902 2635000 2553070 2479898 2413656 2353658 2298959 2248026 2200390 2156854 2117541 2081469
59184 2081469 2048419 2019182 1993610 1970520 1950032 1933830 1922426 1914352 1908769 1906766 1909259 1915629
59172 1915629 1925312 1938834 1956494 1977828 2003114 2033557 2069359 2109343 2153009 2201153 2254109
59161 2254109 2311302 2372895 2439767 2511587 2587201 2667308 2754384 2849433 2951236 3059326 3175111
59150 3175111 3299272 3430570 3568065 3711876 3860702 4011023 4159909 4306218 4447829
$$ packed form
59223A0516562J68428Q6185o452j03995j99857k90248l72185m40116m88698n17564
59213H352060n29895n27768n12307m86831m55948m22107l86044l49623l15180
59204D366357k82954k52036k23044j97245j74165j52684j33511j17882j04934
59195B727902r2902q1930p3172o6242n9998n4699n0933m7636m3536l9313l6072
59184B081469l3050k9237k5572k3090k0488j6202j1404q074n583k003K493O370
59172A915629R683J3522J7660K1334K5286L0443L5802L9984M3666M8144N2956
59161B254109N7193O1593O6872P1820P5614Q0107Q7076R5049J01803J08090J15785
59150C175111J24161J31298J37495J43811J48826J50321J48886J46309J41611
$$ plain form
59141 4447829 4580081 4698423 4800682 4885588 4951168 4995982 5020324 5025376 5013015 4987149 4953063
59130 4953063 4914579 4873776 4834045 4800888 4778890 4770389 4778185 4806958 4860706 4941048 5049122
59119 5049122 5186734 5354291 5549807 5770990 6015844 6279772 6554198 6828956 7093416
59110 7093416 7334289 7535669 7683875 7771001 7793336 7749978 7645477 7491449 7302876 7093836
59100 7093836 6877360 6666061 6469759 6293651 6140382 6012057 5908571 5826023 5758882 5702338
59090 5702338 5651226 5598862 5539082 5468164 5383426 5281910 5162173 5025692 4874946 4711672
59080 4711672 4538241 4358583 4176041 3992031 3808269 3628293 3455193 3289705 3132123
59071 3132123 2984088 2846884 2719977 2602873 2496447 2400815 2314030 2234634 2163421 2100922
$$ packed form
59141D447829J32252J18342J02259Q4906O5580M4814K4342N052j2361k5866l4086
59130D953063l8484m0803l9731l3157k1998q501P796K8773N3748Q0342J08074
59119E049122J37612J67557J95516K21183K44854K63928K74426K74758K64460
59110G093416K40873K01380J48206Q7126K2335m3358j04501j54028j88573k09040
59100G093836k16476k11299j96302j76108j53269j28325j03486q2548o7141n6544
59090E702338n1112n2364n9780p0918q4738j01516j19737j36481j50746j63274
59080D711672j73431j79658j82542j84010j83762j79976j73100j65488j57582
59071C132123j48035j37204j26907j17104j06426r5632q6785p9396p1213o2499
$$ plain form
59061 2100922 2045258 1994363 1948195 1906753 1867945 1829460 1790792 1751491 1709580 1663993 1616738
59050 1616738 1570402 1525298 1481137 1439476 1401980 1367932 1335948 1306759 1281983 1261496 1244177
59039 1244177 1229911 1218792 1209614 1201281 1194503 1190328 1188351 1188121 1190697 1196898 1205553 1215339 1226785
59026 1226785 1240524 1255159 1268822 1281273 1292516 1300945 1304958 1305085 1302753 1298491 1293008 1288237 1285394
59013 1285394 1283673 1282608 1283802 1288484 1295430 1303309 1313015 1325477 1339299 1352889 1366786 1381351 1394288
59000 1394288 1403275 1409242 1414318 1418270 1419768 1419536 1419390 1419596 1419941 1421892 1426896 1433857 1440978 1448751 1458557
58985 1458557 1469734 1480821 1492339 1505585 1519936 1534060 1548515 1564556 1581698 1599154 1618246
58974 1618246 1640561 1665089 1690037 1716204 1745652 1778298 1812876 1850059 1891540 1936807 1983666
$$ packed form
59061B100922n5664n0895m6168m1442l8808l8485l8668l9301m1911m5587m7255
59050A616738m6336m5104m4161m1661l7496l4048l1984k9189k4776k0487j7319
59039A244177j4266j1119r178q333o778m175j977k30K576O201Q655R786J1446
59026A226785J3739J4635J3663J2451J1243Q429M013J27k332m262n483m771k843
59013A285394j721j065J194M682O946P879R706J2462J3822J3590J3897J4565J2937
59000A394288Q987N967N076L952J498k32j46K06L45J951N004O961P121P773R806
58985A458557J1177J1087J1518J3246J4351J4124J4455J6041J7142J7456J9092
58974A618246K2315K4528K4948K6167K9448L2646L4578L7183M1481M5267M6859
$$ plain form
58963 1983666 2031042 2078573 2124637 2167749 2209014 2250422 2291752 2331999 2372655 2416498 2464129
58952 2464129 2514830 2569993 2632494 2703297 2781639 2868001 2963973 3069836 3185134 3311078 3449702
58941 3449702 3601445 3766279 3946350 4144566 4361501 4596723 4852431 5132769 5440320
58932 5440320 5776496 6144801 6550447 6997061 7486755 8023016 8610363 9251155 9945253
58923 9945253 10692186 11490402 12334040 13212307 14110917 15010951 15886634 16707114 17440737
58914 17440737 18056483 18524124 18818308 18924319 18839132 18569020 18129551 17546412 16851318
58905 16851318 16075336 15246871 14393309 13539446 12703437 11897019 11129425 10408218 9736944
58896 9736944 9115601 8543787 8020858 7543728 7107961 6711097 6352125 6028185 5734946
$$ packed form
58963A983666M7376M7531M6064M3112M1265M1408M1330M0247M0656M3843M7631
58952B464129N0701N5163O2501P0803P8342Q6362R5972J05863J15298J25944J38624
58941C449702J51743J64834J80071J98216K16935K35222K55708K80338L07551
58932E440320L36176L68305M05646M46614M89694N36261N87347O40792O94098
58923I945253P46933P98216Q43638Q78267Q98610R00034Q75683Q20480P33623
58914A7440737O15746M67641K94184J06011q5187k70112m39469n83139o95094
58905A6851318p75982q28465q53562q53863q36009q06418p67594p21207o71274
58896I736944o21343n71814n22929m77130m35767l96864l58972l23940k93239
$$ plain form
58887 5734946 5469733 5231005 5015043 4816615 4632739 4462529 4303653 4152563 4008355
58878 4008355 3872915 3746994 3629343 3519770 3419603 3328724 3245250 3168566 3099714 3038616
58868 3038616 2983836 2935133 2893217 2856971 2824009 2794085 2768827 2748197 2730497 2715815 2706015
58857 2706015 2701124 2699204 2700143 2706165 2718179 2735033 2756871 2785810 2822666 2866125 2915752 2972675
58845 2972675 3036863 3107032 3183901 3270359 3367653 3474490 3590552 3717824 3857788 4010357
58835 4010357 4176340 4357946 4556164 4770547 5002413 5255523 5533050 5836689 6169249
58826 6169249 6535236 6938286 7380797 7866446 8400146 8984882 9621129 10309231 11048889
58817 11048889 11835556 12659785 13509603 14369611 15217177 16023034 16756568 17388159 17887766
$$ packed form
58887E734946k65213k38728k15962j98428j83876j70210j58876j51090j44208
58878D008355j35440j25921j17651j09573j00167r0879q3474p6684o8852o1098
58868C038616n4780m8703m1916l6246l2962k9924k5258k0630j7700j4682r800
58857B706015m891j920R39O022J2014J6854K1838K8939L6856M3459M9627N6923
58845B972675O4188P0169P6869Q6458R7294J06837J16062J27272J39964J52569
58835D010357J65983J81606J98218K14383K31866K53110K77527L03639L32560
58826F169249L65987M03050M42511M85649N33700N84736O36247O88102P39658
58817A1048889P86667Q24229Q49818Q60008Q47566Q05857P33534O31591M99607
$$ plain form
58808 17887766 18227333 18387797 18362306 18153383 17771436 17236843 16578574 15827546 15012419
58799 15012419 14160758 13298849 12447634 11621294 10830777 10085397 9389904 8743730 8145118
58790 8145118 7593465 7086883 6621120 6192742 5800556 5442665 5115197 4815262 4542089
58781 4542089 4293826 4066234 3856094 3663049 3486793 3325222 3176668 3041004 2917085
58772 2917085 2801789 2692843 2590042 2492756 2399185 2309151 2224642 2146527 2073624 2005869 1945088
58761 1945088 1891504 1842827 1798161 1759537 1728081 1701801 1678637 1658637 1641639 1625929 1610851
58750 1610851 1597892 1587645 1578341 1568568 1558622 1548144 1535565 1521075 1506971 1493793 1479239 1462056
58738 1462056 1443659 1424713 1403747 1380673 1358094 1337354 1316589 1294368 1271927 1250078 1227365
$$ packed form
58808A7887766L39567J60464k5491k08923l81947n34593o58269p51028q15127
58799A5012419q51661q61909q51215q26340p90517p45380o95493o46174n98612
58790H145118n51653n06582m65763m28378l92186l57891l27468k99935k73173
58781D542089k48263k27592k10140j93045j76256j61571j48554j35664j23919
58772B917085j15296j08946j02801r7286r3571r0034q4509p8115p2903o7755o0781
58761A945088n3584m8677m4666l8624l1456k6280k3164k0000j6998j5710j5078
58750A610851j2959j0247r304r773r946j0478j2579j4490j4104j3178j4554j7183
58738A462056j8397j8946k0966k3074k2579k0740k0765k2221k2441k1849k2713
$$ plain form
58727 1227365 1203192 1179483 1157312 1135035 1111676 1089027 1068478 1048854 1029252 1010961 994716
58716 994716 979131 963678 950139 939328 929467 919548 911131 905002 899267 892664 886573 881939 877411
58703 877411 872392 868694 867276 866583 865798 866301 868084 868336 865580 861589 857187 849977 838617 825562 812962
58688 812962 799438 783584 767171 752091 737467 722643 709759 700486 693199 686184 680692 678145
58676 678145 677244 676557 677117 679886 683444 686540 690022 693973 696181 695910 695993 698726 702897 707236 713249 721938
58660 721938 731155 739045 746813 755298 762205 765699 767574 770081 772892 775920 781589 791265 802812 814624
58646 814624 828638 846418 865993 885899 908688 936915 969064 1002962 1039790 1081135 1125556
58635 1125556 1171946 1223083 1282032 1348139 1420350 1501428 1595025 1701558 1820770 1955379 2108475
$$ packed form
58727A227365k4173k3709k2171k2277k3359k2649k0549j9624j9602j8291j6245
58716I94716j5585j5453j3539j0811r861r919q417o129n735o603o091m634m528
58703H77411n019l698j418o93p85N03J783K52k756l991m402p210j1360j3055j2600
58688H12962j3524j5854j6413j5080j4624j4824j2884r273p287p015n492k547
58676F78145r01o87N60K769L558L096L482L951K208k71Q3K733M171M339O013Q689
58660G21938R217P890P768Q485O907L494J875K507K811L028N669R676J1547J1812
58646H14624J4014J7780J9575J9906K2789K8227L2149L3898L6828M1345M4421
58635A125556M6390N1137N8949O6107P2211Q1078R3597J06533J19212J34609J53096
$$ plain form
58624 2108475 2280274 2471167 2684710 2923487 3184676 3463206 3755657 4056365 4352343
58615 4352343 4626277 4862253 5045511 5161172 5199557 5161710 5056099 4892287 4681349 4438625
58605 4438625 4180157 3917332 3658287 3411685 3184553 2978527 2792540 2627274 2483301
58596 2483301 2357448 2245362 2145624 2057588 1977713 1902224 1831127 1765671 1704394 1645600 1590992
58585 1590992 1542654 1499034 1458115 1421688 1392005 1366824 1342291 1318021 1294835 1270332 1241790
58574 1241790 1211091 1181870 1154044 1125952 1099456 1077812 1060448 1044734 1030880 1020329 1011359
58563 1011359 1001174 990380 980737 970546 957062 941464 926692 912463 897122 882235 870499
58552 870499 861241 852781 846907 845978 847884 849049 850253 854302 860172 864830 868782 874358 880441 884312
$$ packed form
58624B108475J71799J90893K13543K38777K61189K78530K92451L00708K95978
58615D352343K73934K35976J83258J15661L8385l7847j05611j63812k10938k42724
58605D438625k58468k62825k59045k46602k27132k06026j85987j65266j43973
58596B483301j25853j12086r9738q8036p9875p5489p1097o5456o1277n8794n4608
58585A590992m8338m3620m0919l6427k9683k5181k4533k4270k3186k4503k8542
58574A241790l0699k9221k7826k8092k6496k1644j7364j5714j3854j0551q970
58563A011359j0185j0794r643j0191j3484j5598j4772j4229j5341j4887j1736
58552H70499r258q460n874r29J906J165J204M049N870M658L952N576O083L871
$$ plain form
58538 884312 886866 890634 894469 895526 894608 894123 892623 886899 877774 868308 858057 844488 828301 811885
58524 811885 794401 774002 752973 734942 718912 701804 684909 671724 661261 649825 637911
58513 637911 629118 623557 618437 613851 611893 611342 609290 606791 606922 608633 608564 607441 608489 610967 611702
58498 611702 611624 614241 618834 621701 623017 625874 629606 630765 629847 630465 632685 633672 634087 637229 642619 646947
58482 646947 650620 656890 665453 673457 681851 693934 708557 721638 733530 747849 763788 776726
58470 776726 785833 793978 800650 802110 798135 791651 782296 767525 749378 732813 717782 700372 681239
58457 681239 665287 653299 641553 629514 620246 613347 605210 596334 590716 588043 584149 579167 577372
58444 577372 578959 579896 580059 583430 590066 595894 600712 608188 617588 623840 626293 629144 632702 632702 629027
$$ packed form
58538H84312K554L768L835J057r18m85j500n724r125r466j0251j3569j6187j6416
58524H11885j7484k0399k1029j8031j6030j7108j6895j3185j0463j1436j1914
58513F37911q793n561n120m586j958n51k052k499J31J711o9j123J048K478P35
58498F11702p8K617M593K867J316K857L732J159r18O18K220R87M15L142N390M328
58482F46947L673O270Q563Q004Q394J2083J4623J3081J1892J4319J5939J2938
58470G76726R107Q145O672J460l975o484r355j4771j8147j6565j5031j7410j9133
58457F81239j5952j1988j1746j2039r268o899q137q876n618k673l894m982j795
58444E77372J587R37J63L371O636N828M818P476R400O252K453K851L558%l675
$$ plain form
58429 629027 626572 626553 625334 622811 623451 627954 632330 636302 644191 656322 668046 678394 691165 706385
58415 706385 719407 729707 741735 755644 766090 771781 777340 784098 787899 787663 787252 787131 783126 775131
58401 775131 768015 762232 752730 739002 726873 718411 709510 699439 693113 691518 689458 685355 683814
58388 683814 686071 687371 686380 687595 691965 694758 695175 698068 703457 704578 699355 693811 691078 687283 681441
58373 681441 678936 681474 683770 683815 686347 692577 696821 697096 698804 704185 708463 710141 714494 722825 728961
58358 728961 730571 733364 739951 745365 747867 753131 763156 771955 776757 782446 790392 794362 792426 791457
58344 791457 794720 796508 794246 794151 799328 803949 804991 808032 815627 821757 823789 828029 837291 844999 847969
58329 847969 852880 863479 873478 878937 885470 896280 905366 909726 916064 928147 939741 947296 957144
$$ packed form
58429F29027k455j9j219k523O40M503M376L972P889J2131J1724J0348J2771J5220
58415G06385J3022J0300J2028J3909J0446N691N559O758L801k36m11j21m005p995
58401G75131p116n783r502j3728j2129q462q901j0071o326j595k060m103j541
58388F83814K257J300r91J215M370K793M17K893N389J121n223n544k733l795n842
58373F81441k505K538K296M5K532O230M244K75J708N381M278J678M353Q331O136
58358G28961J610K793O587N414K502N264J0025Q799M802N689P946L970j936r69
58344G91457L263J788k262r5N177M621J042L041P595O130K032M240R262P708K970
58329H47969M911J0599R999N459O533J0810R086M360O338J2083J1594P555R848
$$ plain form
58316 957144 972734 987367 997157 1008364 1024216 1037408 1043652 1049672 1059779 1067798 1070402 1074865 1085154
58303 1085154 1094008 1097429 1103106 1115720 1128048 1135594 1145491 1161600 1175710 1183309 1193113 1210855 1228789
58290 1228789 1241496 1256477 1278294 1298165 1310672 1324899 1347257 1369301 1384617 1401580 1426853
58279 1426853 1452602 1472832 1495908 1527797 1559674 1585456 1614466 1652909 1690359 1718873 1747647
58268 1747647 1784045 1818514 1843799 1870520 1907491 1945203 1975292 2007365 2049470 2091394 2125088
58257 2125088 2161930 2211318 2262110 2304189 2348001 2403273 2459530 2508125 2561986 2631957 2705271
58246 2705271 2769703 2837083 2919922 3007259 3087559 3172571 3273690 3378044 3473680 3574702 3695091
58235 3695091 3822179 3943215 4072593 4224194 4383228 4535360 4696660 4883778 5082730
$$ packed form
58316I57144J5590J4633R790J1207J5852J3192O244O020J0107Q019K604M463J0289
58303A085154Q854L421N677J2614J2328P546R897J6109J4110P599R804J7742J7934
58290A228789J2707J4981K1817J9871J2507J4227K2358K2044J5316J6963K5273
58279A426853K5749K0230K3076L1889L1877K5782K9010L8443L7450K8514K8774
58268A747647L6398L4469K5285K6721L6971L7712L0089L2073M2105M1924L3694
58257B125088L6842M9388N0792M2079M3812N5272N6257M8595N3861O9971P3314
58246B705271O4432O7380Q2839Q7337Q0300Q5012J01119J04354R5636J01022J20389
58235C695091J27088J21036J29378J51601J59034J52132J61300J87118J98952
$$ plain form
58226 5082730 5279569 5492286 5738195 6000508 6263296 6547479 6874281 7226523 7586251
58217 7586251 7975715 8418842 8899189 9401044 9953117 10583717 11274341 12009159 12826485
58208 12826485 13766696 14817296 15969714 17279831 18808750 20561413 22557112 24901966
58200 24901966 27715732 31057202 35011892 39781036 45592577 52622936 61132201 71582962
58192 71582962 84499039 100341898 119704075 143475523 172595849 207790532 249643564
58185 249643564 298100500 350479535 399526133 434693298 447194949 434929199 402955864
58178 402955864 359680251 312661916 266922363 225272326 188972032 158191186 132521501
58171 132521501 111412699 94256771 80336650 68957359 59613177 51937351 45577515
$$ packed form
58226E082730J96839K12717K45909K62313K62788K84183L26802L52242L59728
58217G586251L89464M43127M80347N01855N52073O30600O90624P34818Q17326
58208A2826485R40211J050600J152418J310117J528919J752663J995699K344854
58200B4901966K813766L341470L954690M769144N811541P030359Q509265J0450761
58192G1582962J2916077J5842859J9362177K3771448K9120326L5194683M1853032
58185B49643564M8456936N2379035M9046598L5167165J2501651j2265750l1973335
58178D02955864m3275613m7018335m5739553m1650037l6300294l0780846k5669685
58171A32521501k1108802j7155928j3920121j1379291r344182p675826o359836
$$ plain form
58164 45577515 40230692 35724541 31952958 28777455 26065430 23760387 21830683 20196594
58156 20196594 18774126 17539999 16491375 15590287 14804513 14154843 13668589 13331719 13132373
58147 13132373 13103229 13278884 13662359 14273827 15181441 16451354 18125959 20282037 23046671
58138 23046671 26533785 30833698 36024837 41958644 47874291 52391297 54190150 52840560
58130 52840560 48967752 43691161 37995365 32510755 27580082 23337679 19771663 16816590
58122 16816590 14410370 12475502 10908299 9621499 8567222 7704663 6982711 6368562
58114 6368562 5857326 5438245 5081221 4765795 4492203 4254749 4033517 3819837 3621667
58105 3621667 3437645 3253550 3069722 2904476 2764744 2639087 2523716 2429160 2356660 2293136
$$ packed form
58164D5577515n346823m506151l771583l175503k712025k305043j929704j634089
58156B0196594j422468j234127j048624r01088p85774o49670m86254l36870j99346
58147A3132373k9144J75655L83475O11468R07614J269913J674605K156078K764634
58138B3046671L487114M299913N191139N933807N915647M517006J798853j349590
58130E2840560l872808n276591n695796n484610m930673m242403l566016k955073
58122A6816590k406220j934868j567203j286800j054277q62559p21952o14149
58114F368562n11236m19081l57024l15426k73592k37454k21232k13680j98170
58105C621667j84022j84095j83828j65246j39732j25657j15371r4556p2500o3524
$$ plain form
58095 2293136 2233744 2185042 2142427 2089005 2021141 1952049 1886777 1816644 1741546 1674337 1618809
58084 1618809 1565294 1511726 1467439 1432368 1394048 1349606 1310312 1280337 1250812 1218763 1192101
58073 1192101 1171826 1148425 1120187 1096603 1079684 1060058 1035458 1015107 1001693 986565 966942
58062 966942 950829 940769 929329 914808 905009 901249 894521 881692 870088 862117 850763 834328
58050 834328 820532 811791 801022 786131 774316 768109 761247 752204 747743 749084 748409 743154 740280
58037 740280 742430 743278 740638 740935 746380 750628 751298 754158 760625 763676 760582 757625 757861 756010 749699
58022 749699 744126 741365 736409 727927 721681 719215 714254 704293 694827 688350 680274 669595 662345 660154
58008 660154 656332 647667 639533 635086 629955 622003 615861 613239 608922 600929 594679 592616 589644 583479
$$ packed form
58095B293136n9392m8702m2615n3422o7864o9092o5272p0133p5098o7209n5528
58084A618809n3515n3568m4287l5071l8320m4442l9294k9975k9525l2049k6662
58073A192101k0275k3401k8238k3584j6919j9626k4600k0351j3414j5128j9623
58062I66942j6113j0060j1440j4521r799l760o728j2829j1604p971j1354j6435
58050H34328j3796q741j0769j4891j1815o207o862r043m461J341o75n255k874
58037G40280K150Q48k640K97N445M248O70K860O467L051l094k957K36j851o311
58022G49699n573k761m956q482o246k466m961r961r466o477q076j0679p250k191
58008F60154l822q665q134m447n131p952o142k622m317p993o250k063k972o165
$$ plain form
57994 583479 579687 581670 585110 587147 591757 601146 610800 617856 625664 635512 642578 644745 646824 651363
57980 651363 653785 651253 648028 647297 645803 641302 637354 636052 633653 627929 622326 618572 612789 603165
57966 603165 593837 587018 578910 567703 557856 552081 546662 539154 533235 531335 529801 525933 522680 521868
57952 521868 519915 514797 510323 509032 507697 504238 502147 503634 505215 504597 505144 509118 513231 515367 518828
57937 518828 525285 530350 530960 530581 532237 532912 529868 526146 524547 522148 515915 508205 501836 495186 486861
57922 486861 479679 475473 471340 465470 461163 460727 461066 459721 459587 463084 467291 469484 472051 477318 482949
57907 482949 486971 491880 499205 505488 508298 510796 515608 519649 519807 518434 518303 517412 513770 510176 509124
57892 509124 507909 503821 499332 497160 494932 489783 483602 478849 473751 466494 459559 455104 450711 444468
$$ packed form
57994E83479l792J983L440K037M610R389R654P056P808R848P066K167K079M539
57980F51363K422k532l225p31j494m501l948j302k399n724n603l754n783r624
57966F03165r328o819q108j1207r847n775n419p508n919j900j534l868l253q12
57952E21868j953n118m474j291j335l459k091J487J581o18N47L974M113K136L461
57937E18828O457N065O10l79J656O75l044l722j599k399o233p710o369o650q325
57922D86861p182m206m133n870m307m36L39j345j34L497M207K193K567N267N631
57907D82949M022M909P325O283K810K498M812M041J58j373j31q91l642l594j052
57892E09124j215m088m489k172k228n149o181m753n098p257o935m455m393o243
$$ plain form
57878 444468 439379 437768 436222 431361 425863 423359 422000 418730 415533 415716 417993 419911 423201 430085
57864 430085 437977 443469 448156 455099 462949 468943 474254 481016 487314 490456 492054 494646 496494 494949
57850 494949 491789 489987 488194 483651 477591 472589 467505 460259 452746 447729 443517 436867 428667 421783
57836 421783 415831 409008 402573 398619 395849 392190 389023 388162 387450 384163 380013 377840 376117 371802 366051
57821 366051 361847 358415 353166 346904 341983 337457 331180 324604 320496 317853 314065 310002 307909 306330
57807 306330 302322 296961 293535 291929 289783 287598 287635 289114 289424 288860 289494 290706 290493 289925 291678 295365
57791 295365 298653 301816 306884 313543 320080 327080 336118 346225 355615 365307 377006 389189 399365
57778 399365 408172 416903 423106 423507 419615 415633 412344 407776 402343 398356 395592 392082 388239 385822
$$ packed form
57878D44468n089j611j546m861n498k504j359l270l197J83K277J918L290O884
57864D30085P892N492M687O943P850N994N311O762O298L142J598K592J848j545
57850D94949l160j802j793m543o060n002n084p246p513n017m212o650q200o884
57836D21783n952o823o435l954k770l659l167q61p12l287m150k173j723m315n751
57821C66051m204l432n249o262m921m526o277o576m108k643l788m063k093j579
57807C06330m008n361l426j606k146k185L7J479L10n64O34J212k13n68J753L687
57791B95365L288L163N068O659O537P000R038J0107R390R692J1699J2183J0176
57778C99365Q807Q731O203M01l892l982l289m568n433l987k764l510l843k417
$$ plain form
57764 385822 384125 381569 379636 380586 382690 382368 379697 377124 374307 369252 363317 359951 359500 360292 363776
57749 363776 373155 387409 401800 414032 425083 434490 439928 441537 442006 442233 441125 439482 439778 442276
57735 442276 445333 449115 454927 461560 466690 471240 477945 486220 493043 498457 505496 514954 524916 535329
57721 535329 548366 564124 580351 596561 614354 633792 653577 674491 698388 724176 749207
57710 749207 774323 803041 836120 871643 910219 955094 1007043 1064184 1127261 1200242 1285114
57699 1285114 1380682 1487147 1607348 1742907 1893623 2061332 2249789 2459904 2689175 2936080
57689 2936080 3200036 3475862 3752475 4017847 4260837 4467621 4621939 4711885 4734022 4690737
57679 4690737 4588033 4436956 4252519 4048750 3837088 3629288 3437074 3267497 3122708
$$ packed form
57764C85822j697k556j933R50K104l22k671k573k817n055n935l366m51P92L484
57749C63776R379J4254J4391J2232J1051R407N438J609M69K27j108j643K96K498
57735D42276L057L782N812O633N130M550O705Q275O823N414P039R458R962J0413
57721E35329J3037J5758J6227J6210J7793J9438J9785K0914K3897K5788K5031
57710G49207K5116K8718L3079L5523L8576M4875N1949N7141O3077P2981Q4872
57699A285114R5568J06465J20201J35559J50716J67709J88457K10115K29271K46905
57689B936080K63956K75826K76613K65372K42990K06784J54318Q9946K2137m3285
57679D690737j02704j51077j84437k03769k11662k07800j92214j69577j44789
$$ plain form
57670 3122708 3005586 2921724 2874898 2865057 2891982 2955244 3046202 3142173 3211655 3226013 3169210
57659 3169210 3043121 2866816 2667376 2467375 2279834 2112056 1968765 1850573 1754223 1677014
57649 1677014 1618565 1577524 1550236 1534133 1529294 1535515 1551163 1576152 1612669 1661625 1721627 1792735
57637 1792735 1877879 1979247 2096465 2229671 2381009 2551575 2739924 2944776 3165721 3399413
57627 3399413 3637931 3872051 4092826 4288603 4444323 4546697 4588594 4568035 4486608 4350790
57617 4350790 4171764 3961559 3730744 3489948 3249858 3017791 2796778 2589142 2398180
57608 2398180 2225247 2068470 1925983 1797754 1683146 1579785 1486292 1403231 1330118 1264436
57598 1264436 1204789 1151925 1105453 1062861 1023133 987856 957247 928573 900269 874163 851657
$$ packed form
57670C122708j17122q3862m6826r841K6925O3262R0958R5971O9482J4358n6803
57659C169210j26089j76305j99440k00001j87541j67778j43291j18192r6350p7209
57649A677014n8449m1041k7288j6103m839O221J5648K4989L6517M8956O0002P1108
57637A792735Q5144J01368J17218J33206J51338J70566J88349K04852K20945K33692
57627C399413K38518K34120K20775J95777J55720J02374M1897k0559q1427j35818
57617D350790j79026k10205k30815k40796k40090k32067k21013k07636j90962
57608B398180j72933j56777j42487j28229j14608j03361r3493q3061p3113o5682
57598A264436n9647n2864m6472m2592l9728l5277l0609k8674k8304k6106k2506
$$ plain form
57587 851657 831061 810872 792479 777318 764280 752158 741875 734083 727256 720296 714410 710391
57575 710391 706696 702221 698379 696410 695305 694374 695147 698637 703325 707936 713634 721429 730077 738592 748223
57560 748223 759847 772124 784408 798718 816489 836031 855667 876816 901501 929324 959527
57549 959527 993731 1033934 1079922 1131164 1189245 1255980 1331145 1414493 1508091 1614313 1733354
57538 1733354 1864931 2010346 2170491 2343489 2526165 2715685 2907513 3093611 3264578
57529 3264578 3411603 3524924 3593840 3611585 3578780 3500384 3381955 3231120 3059258 2877730
57519 2877730 2693671 2511801 2337805 2176685 2029645 1895857 1775734 1669720 1575774 1491372
57509 1491372 1416618 1352483 1297403 1248675 1205861 1169791 1139396 1112554 1089107 1070149 1055189
$$ packed form
57587H51657k0596k0189j8393j5161j3038j2122j0283p792o827o960n886m019
57575G10391l695m475l842j969j105r31P73L490M688M611N698P795Q648Q515R631
57560G48223J1624J2277J2284J4310J7771J9542J9636K1149K4685K7823L0203
57549I59527L4204M0203M5988N1242N8081O6735P5165Q3348R3598J06222J19041
57538A733354J31577J45415J60145J72998J82676J89520J91828J86098J70967
57529C264578J47025J13321O8916J7745l2805p8396j18429j50835j71862j81528
57519B877730j84059j81870j73996j61120j47040j33788j20123j06014r3946q4402
57509A491372p4754o4135n5080m8728m2814l6070l0395k6842k3447j8958j4960
$$ plain form
57498 1055189 1042767 1033087 1027429 1025662 1026736 1030960 1039542 1052564 1069439 1090499 1116258 1146232
57486 1146232 1180435 1220929 1269957 1327804 1394367 1471315 1560583 1662198 1775807 1902793 2044507
57475 2044507 2199755 2366184 2542431 2726140 2910974 3087921 3248185 3382480 3479571 3529281
57465 3529281 3527106 3474237 3374681 3235002 3065343 2877175 2679801 2480474 2286235 2102739
57455 2102739 1932177 1774843 1631885 1504249 1390242 1287081 1194103 1111968 1039669 975004
57445 975004 917225 866562 821843 781120 743982 710861 680817 652415 625996 602661 581894
57434 581894 562571 545325 531230 519076 506649 493929 482336 471633 460483 449361 439954 432067
57422 432067 423976 415579 408437 402872 397649 392420 388009 384390 380660 376917 373980 371623 369102 366919
$$ packed form
57498A055189j2422r680n658j767J074M224Q582J3022J6875K1060K5759K9974
57486A146232L4203M0494M9028N7847O6563P6948Q9268J01615J13609J26986J41714
57475B044507J55248J66429J76247J83709J84834J76947J60264J34295R7091M9710
57465C529281k175n2869r9556j39679j69659j88168j97374j99327j94239j83496
57455B102739j70562j57334j42958j27636j14007j03161r2978q2135p2299o4665
57445I75004n7779n0663m4719m0723l7138l3121l0044k8402k6419k3335k0767
57434E81894j9323j7246j4095j2154j2427j2720j1593j0703j1150j1122r407p887
57422D32067q091q397p142n565n223n229m411l619l730l743k937k357k521k183
$$ plain form
57408 366919 365870 365081 363343 361658 361893 363538 364476 364435 364986 366491 367825 368849 370431 372209 372973 373186
57392 373186 374529 377024 379068 380236 381544 383048 383707 383569 383639 383613 382162 379420 376742 374133 370450 366052
57376 366052 362628 360289 357417 353529 349828 346786 343630 340418 338177 336775 335007 332975 331985 331929 331211
57361 331211 329578 328587 328939 329671 330322 331525 333097 333869 333944 334916 337335 340005 342184 344411 346800 348639
57345 348639 350139 352580 356221 359900 363055 366350 370058 373594 376818 380090 383123 385622 388750 393836
57331 393836 399901 404792 408572 413245 419221 424765 429142 433517 438317 442378 445395 448673 452698 456295
57317 456295 458950 461701 464957 467700 469635 472087 475877 480270 484686 489553 494841 499731 504394 510212
57303 510212 517664 525845 534538 544792 556892 569731 582802 596928 612562 629255 647250 667648
$$ packed form
57408C66919j049p89j738j685K35J645R38m1N51J505J334J024J582J778P64K13
57392C73186J343K495K044J168J308J504O59j38P0k6j451k742k678k609l683m398
57376C66052l424k339k872l888l701l042l156l212k241j402j768k032r90n6p18
57361C31211j633r91L52P32O51J203J572P72P5R72K419K670K179K227K389J839
57345C48639J500K441L641L679L155L295L708L536L224L272L033K499L128N086
57331C93836O065M891L780M673N976N544M377M375M800M061L017L278M025L597
57317D56295K655K751L256K743J935K452L790M393M416M867N288M890M663N818
57303E10212P452Q181Q693J0254J2100J2839J3071J4126J5634J6693J7995K0398
$$ plain form
57291 667648 690559 714947 740599 768241 797553 827350 858058 891518 927803 964573 1000144
57280 1000144 1034726 1067972 1097872 1123092 1144030 1160416 1170097 1171308 1164214 1149222 1125972 1095130
57268 1095130 1059171 1020154 978446 934587 890536 848047 807566 769674 735708 705992 679215
57257 679215 654577 632933 615040 600451 588878 580727 575381 570886 566338 562849 561303 560889 560630
57244 560630 560555 560586 560156 559679 560505 562651 564555 565716 567465 570341 573007 574695 576472 578951 581027 582136
57228 582136 583596 586381 589592 592433 595693 599923 604152 607773 611753 616583 620995 624215 627615 632597
57214 632597 638621 644758 651466 659305 667571 675655 684163 693316 701959 709593 717679 727444 738012 748109
57200 748109 757928 767871 777205 785568 794145 803757 813419 822377 831951 843636 856891 870521 884747
$$ packed form
57291F67648K2911K4388K5652K7642K9312K9797L0708L3460L6285L6770L5571
57280A000144L4582L3246K9900K5220K0938J6386R681J211p094j4992k3250l0842
57268A095130l5959l9017m1708m3859m4051m2489m0481l7892l3966k9716k6777
57257F79215k4638k1644j7893j4589j1573q151n346m495m548l489j546m14k59
57244E60630p5L1m30m77Q26K146J904J161J749K876K666J688J777K479K076J109
57228E82136J460K785L211K841L260M230M229L621L980M830M412L220L400M982
57214F32597O024O137O708P839Q266Q084Q508R153Q643P634Q086R765J0568J0097
57200G48109R819R943R334Q363Q577R612R662Q958R574J1685J3255J3630J4226
$$ plain form
57187 884747 900196 916210 931987 948130 965301 982529 998522 1013618 1028892 1044392 1059760
57176 1059760 1075507 1092198 1109310 1126147 1142820 1159231 1174463 1188459 1202888 1218927 1235526
57165 1235526 1251322 1266868 1283415 1300767 1318027 1335333 1353316 1371913 1391140 1411931 1434754
57154 1434754 1458527 1482344 1507212 1534706 1565063 1597959 1633856 1673019 1714326 1756681 1800719
57143 1800719 1847665 1897472 1949389 2003319 2059278 2116577 2174982 2235689 2299828 2366963 2436344
57132 2436344 2508545 2584465 2663763 2745685 2830565 2919281 3012167 3109647 3212885 3322580 3438176
57121 3438176 3559474 3688033 3825830 3973787 4132865 4305392 4493698 4698197 4918180
57112 4918180 5153841 5406491 5677624 5968936 6282795 6622048 6990153 7392177 7835297
$$ packed form
57187H84747J5449J6014J5777J6143J7171J7228J5993J5096J5274J5500J5368
57176A059760J5747J6691J7112J6837J6673J6411J5232J3996J4429J6039J6599
57165A235526J5796J5546J6547J7352J7260J7306J7983J8597J9227K0791K2823
57154A434754K3773K3817K4868K7494L0357L2896L5897L9163M1307M2355M4038
57143A800719M6946M9807N1917N3930N5959N7299N8405O0707O4139O7135O9381
57132B436344P2201P5920P9298Q1922Q4880Q8716R2886R7480J03238J09695J15596
57121C438176J21298J28559J37797J47957J59078J72527J88306K04499K19983
57112D918180K35661K52650K71133K91312L13859L39253L68105M02024M43120
$$ plain form
57103 7835297 8328923 8886585 9528761 10282795 11179969 12254646 13547261 15107056 16991867
57094 16991867 19267071 22004407 25278106 29158338 33704671 38958159 44929166 51586266
57086 51586266 58855142 66624182 74744094 83022432 91231748 99140150 106544288 113274965
57078 113274965 119166852 124012884 127540594 129444286 129474755 127537463 123729777 118294826
57070 118294826 111540482 103786746 95354429 86564185 77723357 69105837 60935117 53372215
57062 53372215 46511316 40388399 34998197 30307558 26262391 22795278 19835441 17315078
57054 17315078 15170842 13345670 11791313 10467088 9336094 8364924 7526398 6799305
57046 6799305 6165287 5608312 5116614 4681854 4296018 3951339 3642586 3366394 3118451
$$ packed form
57103G835297M93626N57662O42176P54034Q97174J074677J292615J559795J884811
57094A6991867K275204K737336L273699L880232M546333N253488N971007O657100
57086E1586266P268876P769040Q119912Q278338Q209316P908402P404138O730677
57078A13274965N891887M846032L527710J903692L0469j937292l807686n434951
57070A18294826o754344p753736q432317q790244q840828q617520q170720p562902
57062E3372215o860899o122917n390202m690639m045167l467113k959837k520363
57054A7315078k144236j825172j554357j324225j130994r71170q38526p27093
57046F799305o34018n56975m91698m34760l85836l44679l08753k76192k47943
$$ plain form
57037 3118451 2893966 2690460 2507089 2341397 2189617 2049986 1922802 1807192 1700708
57028 1700708 1602102 1511572 1428110 1349422 1274710 1204906 1139912 1078169 1019185 963989 912826
57017 912826 864754 819605 777925 738868 700610 663121 628253 596867 568023 541043 516170
57006 516170 493169 471571 452438 437676 427437 420165 415185 413211 414485 418675 426748 440887 462372
56993 462372 491396 529080 578028 640891 719901 818062 939905 1091205 1278325 1507628 1786348
56982 1786348 2124104 2525971 2970303 3388407 3679151 3762675 3628656 3333419 2955135 2555483
56972 2555483 2172742 1829441 1535315 1289112 1085759 921600 792231 690595 610774 550475
56962 550475 507634 478199 459558 452552 457664 472425 494560 523741 556990 585241 597987 590263
$$ packed form
57037C118451k24485k03506j83371j65692j51780j39631j27184j15610j06484
57028A700708r8606r0530q3462p8688p4712o9804o4994o1743n8984n5196n1163
57017I12826m8072m5149m1680l9057l8258l7489l4868l1386k8844k6980k4873
57006E16170k3001k1598j9133j4762j0239p272m980j974J274M190Q073J4139K1485
56993D62372K9024L7684M8948O2863P9010R8161J21843J51300J87120K29303K78720
56982A786348L37756M01867M44332M18104K90744Q3524j34019k95237l78284l99652
56972B555483l82741l43301k94126k46203k03353j64159j29369j01636p9821o0299
56962E50475m2841k9435j8641p006N112J4761K2135K9181L3249K8251J2746p724
$$ plain form
56950 590263 563630 522910 474110 423309 374707 330116 290864 258360 232281 210702 193048
56939 193048 180701 174030 171557 173005 180360 194823 215481 242210 277172 321942 374991 432057
56927 432057 485842 525092 538614 523075 484868 433495 375973 317896 264825 219474 180489
56916 180489 146463 118507 97118 79897 64879 53105 45350 39191 32115 24996 19787 16102 12772
56903 12772 10520 10307 10938 10942 11092 12704 15341 18552 24015 33470 46202 60890 78374 100324 126735
56888 126735 156968 191788 232376 278627 329823 384625 438196 481536 506755 512355 502025 480259
56876 480259 451190 419386 388582 360162 334698 313705 298324 287956 282196 282546 290383 305033
56864 305033 325998 355364 395889 448412 513495 593648 690219 797541 901444 983466 1027169
$$ packed form
56950E90263k6633m0720m8800n0801m8602m4591l9252l2504k6079k1579j7654
56939A93048j2347o671k473J448P355J4463K0658K6729L4962M4770N3049N7066
56927D32057N3785L9250J3522j5539l8207n1373n7522n8077n3071m5351l8985
56916A80489l4026k7956k1389j7221j5018j1774p755o159p076p119n209l685l330
56903A2772k252k13O31MJ50J612K637L211N463R455J2732J4688J7484K1950K6411
56888A26735L0233L4820M0588M6251N1196N4802N3571M3340K5219N600j0330k1766
56876D80259k9069l1804l0804k8420k5464k0993j5381j0368n760L50P837J4650
56864C05033K0965K9366M0525N2523O5083Q0153R6571J07322J03903Q2022M3703
$$ plain form
56853 1027169 1024395 979338 906329 821520 736111 656491 587096 530539 486909 455586 436898
56842 436898 430788 435791 451130 478203 518613 572841 642456 731260 842347 976087 1131648
56831 1131648 1305208 1481743 1631503 1721479 1733466 1671534 1555246 1408941 1254466 1107025
56821 1107025 973992 857841 759977 681135 619986 574224 542794 525559 521719 530445 552360
56810 552360 588788 640438 708303 794617 900677 1023029 1151048 1266353 1345566 1369288 1333161
56799 1333161 1249969 1139769 1019307 900219 791265 697217 617621 550522 496265 455334
56789 455334 425125 402520 387859 383021 387404 399248 419214 449007 488011 534818 589981 652285
56777 652285 712626 756151 771509 756146 714218 653485 583875 514557 450418 392672 342262
$$ packed form
56853A027169k774m5057p3009q4809q5409p9620o9395n6557m3630l1323j8688
56842D36898o110N003J5339K7073M0410N4228O9615Q8804J11087J33740J55561
56831A131648J73560J76535J49760Q9976J1987o1932j16288j46305j54475j47441
56821A107025j33033j16151r7864p8842o1149m5762l1430j7235l840Q726K1915
56810E52360L6428N1650O7865Q6314J06060J22352J28019J15305P9213K3722l6127
56799A333161q3192j10200j20462j19088j08954r4048p9596o7099n4257m0931
56789D55334l0209k2605j4661m838M383J1844J9966K9793L9004M6807N5163O2304
56777F52285O0341M3525J5358j5363m1928o0733o9610o9318o4139n7746n0410
$$ plain form
56766 342262 300373 266407 238442 215576 197536 182668 168896 156147 145441 136362 127897 120788
56754 120788 116226 113086 109260 104940 101707 99192 95688 91403 88024 85532 82388 78469 75010 72135
56740 72135 69193 66906 66321 66287 64856 62524 61158 60469 58679 56022 54294 53487 52205 50918 51362 52940
56724 52940 53202 51802 50613 49959 48230 45439 43766 44081 44920 45324 45871 46619 46868 47217 49109 52113 54269
56707 54269 55199 56279 57809 58833 59648 61573 64166 65553 65565 65784 66501 66497 65766 65476 65299 63827 61645
56690 61645 60888 61715 62281 62304 63371 65541 66934 67085 67554 68746 69178 68363 67470 66735 65134 62936 61538
56673 61538 60498 57823 53563 49938 47528 44566 40532 37150 35113 33000 30198 27949 26740 25569
56659 25569 24428 24627 26095 27288 28232 30671 34772 38758 42300 46972 52809 57719 61034 64368 68268
$$ packed form
56766C42262m1889l3966k7965k2866j8040j4868j3772j2749j0706r079q465p109
56754A20788m562l140l826m320l233k515l504m285l379k492l144l919l459k875
56740G2135k942k287n85l4j431k332j366o89j790k657j728q07j282j287M44J578
56724E2940K62j400j189o54j729k791j673L15Q39M04N47P48K49L49J892L004K156
56707E4269R30J080J530J024Q15J925K593J387J2K19P17mp31k90j77j472k182
56690F1645p57Q27N66K3J067K170J393J51M69J192M32q15q93p35j601k198j398
56673F1538j040k675m260l625k410k962m034l382k037k113k802k249j209j171
56659B5569j141J99J468J193R44K439M101L986L542M672N837M910L315L334L900
$$ plain form
56644 68268 71319 73398 76394 80721 84381 86483 88452 90756 91756 90893 89766 88933 86855 83179 79852
56629 79852 77791 75622 72853 71047 70564 69467 67021 65116 64823 64759 64227 64710 66705 68284 68435 68702
56613 68702 69878 70257 68949 67888 68658 70184 71358 73154 76296 79507 81855 84255 87079 88907 89194
56598 89194 89450 90323 90352 89081 88468 89617 91068 91927 93587 96540 98600 98337 97394 97351 97122 95551 93860
56581 93860 93417 93590 93758 94903 97322 99357 100206 101401 103788 105846 106770 108290 111471 114672 116760 119347
56565 119347 123606 127811 130480 133222 137979 144016 150056 156853 165166 173565 180681 187406 194653 201239
56551 201239 206141 210480 215183 219116 221590 224145 227662 230308 230544 229595 228795 227158 223845 220233 217241
56536 217241 213412 208103 203588 201309 198948 194155 188413 184156 180718 176345 171789 168529 165537 161002
$$ packed form
56644F8268L051K079K996M327L660K102J969K304J000q63j127q33k078l676l327
56629G9852k061k169k769j806m83j097k446j905k93o4n32M83J995J579J51K67
56613F8702J176L79j308j061P70J526J174J796L142L211K348K400K824J828K87
56598H9194K56Q73K9j271o13J149J451Q59J660K953K060k63r43m3k29j571j691
56581I3860m43J73J68J145K419K035Q49J195K387K058R24J520L181L201K088K587
56565A19347M259M205K669K742M757O037O040O797Q313Q399P116O725P247O586
56551B01239M902M339M703L933K474K555L517K646K36r49q00j637l313l612k992
56536B17241l829n309m515k279k361m793n742m257l438m373m556l260k992m535
$$ plain form
56522 161002 155506 150584 145986 141095 136995 134424 131681 127329 122910 120226 118115 114761 111107 108989
56508 108989 107836 106196 104704 104638 105265 105395 105822 107563 109521 110433 111188 112704 113673 113044 112487 113601 114974
56491 114974 114943 114908 116791 119439 120806 121565 123177 124454 123528 121507 120756 121136 121181 121363 122897 124884 125870
56474 125870 126742 128992 131610 132797 133245 134655 136555 137580 138371 140233 142467 143936 145676 149050 152992
56459 152992 155933 158629 162239 165664 167886 170854 176634 183596 188787 192277 195829 199155 201020 202304
56445 202304 204469 206640 207541 208478 210928 213076 212490 210411 209589 209519 207710 204171 200730 197346 192941 188575
56429 188575 185982 184078 180642 176218 172831 170161 166714 163388 162119 162102 161062 159079 157649 156258 153523
56414 153523 150415 148712 147536 145017 142035 140702 140572 139964 139526 140756 142524 142885 142839 144413 146636 147301
$$ packed form
56522A61002n496m922m598m891m100k571k743m352m419k684k111l354l654k118
56508A08989j153j640j492o6O27J30M27J741J958R12P55J516R69o29n57J114J373
56491A14974l1l5J883K648J367P59J612J277r26k021p51L80M5J82J534J987R86
56474A25870Q72K250K618J187M48J410J900J025P91J862K234J469J740L374L942
56459A52992K941K696L610L425K222K968N780O962N191L490L552L326J865J284
56445B02304K165K171R01R37K450K148n86k079q22p0j809l539l441l384m405m366
56429A88575k593j904l436m424l387k670l447l326j269j7j040j983j430j391k735
56414A53523l108j703j176k519k982j333j30o08m38J230J768L61m6J574K223O65
$$ plain form
56398 147301 147082 147858 148605 147211 144776 143843 143897 142929 141886 142953 144892 144766 143001 142177 142088 140731 138949
56381 138949 139308 141452 143387 146294 153229 163885 175291 186613 198482 208791 214335 215859 216553
56368 216553 216450 213349 208266 204636 202699 200053 197163 196936 199182 200854 201538 203534 206700 208461 208781
56353 208781 210035 212204 213346 214463 218467 224475 228627 230563 233610 238509 242529 245091 248644 253466
56339 253466 257043 259294 263144 269202 274977 279996 286609 295061 302794 309291 316739 325363 332926 339306
56325 339306 346640 354631 360727 365261 371247 378716 384527 388114 392056 396468 398348 397223 396082 395931
56311 395931 394659 391928 389866 388309 384805 380048 377783 378541 378877 377599 377286 378836 380138 381010 383888
56296 383888 388624 392187 394373 398308 404510 410195 415211 422680 432834 442276 450414 460484 473102
$$ packed form
56398A47301k19P76P47j394k435r33N4r68j043J067J939j26j765q24q9j357j782
56381A38949L59K144J935K907O935J0656J1406J1322J1869J0309N544J524O94
56368B16553j03l101n083l630j937k646k890k27K246J672O84J996L166J761L20
56353B08781J254K169J142J117M004O008M152J936L047M899M020K562L553M822
56339B53466L577K251L850O058N775N019O613Q452P733O497P448Q624P563O380
56325C39306P334P991O096M534N986P469N811L587L942M412J880j125j141j51
56311C95931j272k731k062j557l504m757k265P58L36j278l13J550J302Q72K878
56296C83888M736L563K186L935O202N685N016P469J0154R442Q138J0070J2618
$$ plain form
56283 473102 485050 495767 508718 524855 541119 557017 576231 599866 624479 648817 676191
56272 676191 708068 741631 776047 814988 860535 910505 964189 1024876 1094379 1170907 1254681
56261 1254681 1349828 1458455 1578596 1710116 1856646 2019549 2195946 2384788 2588534 2806613
56251 2806613 3033459 3265241 3501921 3740178 3970957 4186779 4384960 4561014 4705851
56242 4705851 4812998 4882381 4914194 4905909 4858872 4781320 4681205 4561932 4427946 4287621
56232 4287621 4146823 4005870 3866239 3733638 3610839 3493998 3379915 3270504 3166453
56223 3166453 3063180 2957208 2850226 2742986 2631870 2515639 2398991 2285099 2171024
56214 2171024 2054830 1940638 1832094 1727241 1624436 1527013 1437342 1352553 1270827 1195770
$$ packed form
56283D73102J1948J0717J2951J6137J6264J5898J9214K3635K4613K4338K7374
56272F76191L1877L3563L4416L8941M5547M9970N3684O0687O9503P6528Q3774
56261A254681R5147J08627J20141J31520J46530J62903J76397J88842K03746K18079
56251B806613K26846K31782K36680K38257K30779K15822J98181J76054J44837
56242D705851J07147O9383L1813q285m7037p7552j00115j19273j33986j40325
56232D287621j40798j40953j39631j32601j22799j16841j14083j09411j04051
56223C166453j03273j05972j06982j07240j11116j16231j16648j13892j14075
56214B171024j16194j14192j08544j04853j02805r7423q9671q4789q1726p5057
$$ plain form
56204 1195770 1129964 1070335 1014446 965043 923705 886431 850329 818278 792192 768260 743822
56193 743822 722335 706394 692404 677516 665159 658211 653186 646836 642097 641804 642890 642550 643769
56180 643769 648902 654121 656130 658094 663016 667568 668491 668753 671271 672888 670732 668173 668206 667249 661851
56165 661851 655202 650709 645571 637164 629216 625048 621238 614655 609116 608250 608496 606151 604580 607257 610514
56150 610514 610613 611102 615528 619805 619814 619796 624906 632054 636513 641146 650480 661958 671834 683818 703294
56135 703294 728891 758173 795484 845420 904593 968621 1041202 1127394 1223889 1324630 1429645
56124 1429645 1539059 1644618 1736890 1815563 1884192 1941441 1986852 2028389 2073648 2118898 2156141
56113 2156141 2184875 2207505 2220206 2219214 2210230 2200976 2189816 2171280 2146049 2114953 2070070 2003408
$$ packed form
56204A195770o5806n9629n5889m9403m1338l7274l6102l2051k6086k3932k4438
56193G43822k1487j5941j3990j4888j2357o948n025o350m739k93J086l40J219
56180F43769N133N219K009J964M922M552R23K62K518J617k156k559L3r57n398
56165F61851o649m493n138q407p948m168l810o583n539q66K46k345j571K677L257
56150F10514R9M89M426M277Rj8N110P148M459M633R334J1478R876J1984J9476
56135G03294K5597K9282L7311M9936N9173O4028P2581Q6192R6495J00741J05015
56124A429645J09414J05559R2272P8673O8629N7249M5411M1537M5259M5250L7243
56113B156141K8734K2630J2701r92q984r254j1160j8536k5231l1096m4883o6662
$$ plain form
56101 2003408 1918859 1825110 1723448 1613716 1505080 1408144 1322053 1241235 1168784 1110978 1064657
56090 1064657 1022783 986934 961862 943458 924831 908595 900323 895649 887005 877504 874766 876543
56078 876543 875910 874997 879718 886379 887704 886980 892114 900832 905935 909871 919546 931892 939304 944423 954815
56063 954815 968087 977029 984212 996444 1010186 1017882 1023243 1034652 1048976 1057958 1064912 1078637 1096464
56050 1096464 1110170 1122890 1142865 1166148 1183234 1197200 1217310 1240536 1258018 1273910 1298502
56039 1298502 1328314 1352719 1374749 1405171 1441472 1473403 1503837 1542839 1586367 1622684 1654813
56028 1654813 1694427 1738639 1775641 1808309 1848756 1894280 1932734 1966937 2009219 2056428 2095582
56017 2095582 2129817 2172957 2222833 2266305 2306174 2355939 2412526 2462298 2509635 2570550 2642229
$$ packed form
56101B003408q4549r3749j01662j09732j08636r6936q6091q0818p2451n7806m6321
56090A064657m1874l5849k5072j8404j8627j6236q272m674q644r501k738J777
56078H76543o33r13M721O661J325p24N134Q718N103L936R675J2346P412N119J0392
56063I54815J3272Q942P183J2232J3742P696N361J1409J4324Q982O954J3725J7827
56050A096464J3706J2720J9975K3283J7086J3966K0110K3226J7482J5892K4592
56039A298502K9812K4405K2030L0422L6301L1931L0434L9002M3528L6317L2129
56028A654813L9614M4212L7002L2668M0447M5524L8454L4203M2282M7209L9154
56017B095582L4235M3140M9876M3472L9869M9765N6587M9772M7337O0915P1679
$$ plain form
56006 2642229 2708636 2771985 2847954 2934116 3015058 3094547 3189552 3296467 3397495 3496434 3612545
55995 3612545 3742890 3867847 3990200 4130079 4284737 4433825 4581611 4751965 4944064
55986 4944064 5136498 5332706 5556848 5807056 6060511 6322759 6622038 6956669 7300772
55977 7300772 7660608 8069742 8529839 9015174 9534800 10127581 10796315 11513836 12294662
55968 12294662 13189612 14209550 15331855 16583862 18037583 19721976 21633335 23836830
55960 23836830 26460336 29587720 33271887 37659891 42985874 49446321 57237982 66733615
55952 66733615 78458828 92899639 110552511 132184195 158782693 191218552 230205719
55945 230205719 276271819 328446060 381814147 426805414 452671651 453275675 430240774
$$ packed form
56006B642229O6407O3349P5969Q6162Q0942P9489R5005J06915J01028R8939J16111
55995C612545J30345J24957J22353J39879J54658J49088J47786J70354J92099
55986D944064J92434J96208K24142K50208K53455K62248K99279L34631L44103
55977G300772L59836M09134M60097M85335N19626N92781O68734P17521P80826
55968A2294662Q94950J019938J122305J252007J453721J684393J911359K203495
55960B3836830K623506L127384L684167M388004N325983O460447P791661R495633
55952F6733615J1725213J4440811J7652872K1631684K6598498L2435859L8987167
55945B30205719M6066100N2174241N3368087M4991267K5866237O04024k3034901
$$ plain form
55938 430240774 390970082 344046382 296040127 250952709 210846934 176411290 147456361
55931 147456361 123457911 103836448 87919761 74961571 64333189 55600403 48399599
55924 48399599 42376075 37274441 32963525 29325984 26210929 23512629 21196387 19215338
55916 19215338 17481272 15938789 14589907 13421962 12380942 11435439 10599350 9870538
55908 9870538 9208582 8592110 8039743 7555558 7108337 6682499 6297733 5960646 5645583
55899 5645583 5340101 5063110 4821584 4593097 4367052 4161361 3982963 3811857 3639180
55890 3639180 3482640 3349389 3220445 3086481 2963664 2859626 2757724 2649445 2549974 2467297
55880 2467297 2386691 2299659 2218801 2150697 2082494 2008154 1940504 1884810 1827230 1761638 1701828
$$ packed form
55938D30240774l9270692m6923700m8006255m5087418m0105775l4435644k8954929
55931A47456361k3998450j9621463j5916687j2958190j0628382q732786p200804
55924D8399599o023524n101634m310916l637541l115055k698300k316242j981049
55916A9215338j734066j542483j348882j167945j041020r45503q36089p28812
55908I870538o61956o16472n52367m84185m47221m25838l84766l37087l15063
55899E645583l05482k76991k41526k28487k26045k05691j78398j71106j72677
55890C639180j56540j33251j28944j33964j22817j04038j01902j08279r9471q2677
55880B467297q0606q7032q0858o8104o8203p4340o7650n5694n7580o5592n9810
$$ plain form
55869 1701828 1655187 1609681 1558676 1513715 1480733 1447759 1408075 1372306 1345942 1317725 1281972
55858 1281972 1250220 1229112 1208206 1181197 1158294 1146146 1135778 1121695 1112939 1113842 1113193 1103858
55846 1103858 1094522 1091031 1084720 1070377 1057704 1053588 1050413 1043096 1040448 1047853 1054666 1050102 1036585
55833 1036585 1017266 986298 942552 898001 861401 827443 791690 761558 742272 726394 707859
55822 707859 692726 685704 679544 668272 658011 654418 651996 645891 641911 644663 647620 644872 641305
55809 641305 641661 640905 634821 628853 627103 623572 613484 602473 595655 588469 577236 567731 564085 559880
55795 559880 549444 537580 528981 518438 500955 481662 466318 451626 433993 418348 409041 401140
55783 401140 389757 379031 373135 367532 358051 349660 347314 346859 343945 343184 349195 356741 358799 356584
$$ packed form
55869A701828m6641m5506n1005m4961l2982l2974l9684l5769k6364k8217l5753
55858A281972l1752k1108k0906k7009k2903j2148j0368j4083q756R03o49r335
55846A103858r336l491o311j4343j2673m116l175p317k648P405O813m564j3517
55833A036585j9319l0968m3746m4551l6600l3958l5753l0132j9286j5878j8535
55822G07859j5133p022o160j1272j0261l593k422o105l980K752K957k748l567
55809F41305L56p56o084n968j750l531j0088j1011o818p186j1233r505l646m205
55795E59880j0436j1864q599j0543j7483j9293j5344j4692j7633j5645r307p901
55783D01140j1383j0726n896n603r481q391k346m55k914p61O011P546K058k215
$$ plain form
55769 356584 353056 344779 329338 313019 301984 292975 281187 269875 263581 259316 253225 248770 249572
55756 249572 251105 248140 243734 242404 241228 236202 230742 229256 228637 224580 220024 219002 218435 214347 210055
55741 210055 209762 210051 206121 200601 197906 195693 190248 184642 183166 183148 180526 178131 180136 183601 183715
55726 183715 182257 182716 182313 177145 170231 166161 162694 155985 149275 147753 149224 148306 145740 145368 145971
55711 145971 144400 142949 145520 150079 152746 155703 163277 173793 182998 191909 203530 215220 222073
55698 222073 224776 226737 226755 221879 214268 207894 201617 192663 183610 178667 176278 172639 169303 169978 173043
55683 173043 174660 176231 181382 188420 193200 196737 202755 210281 215752 219830 225122 229888 230970 230230
55669 230230 231124 231753 228401 223153 220704 220331 218328 215676 215756 216932 215104 211471 210216 210467 208116 203710
$$ packed form
55769C56584l528q277j5441j6319j1035r009j1788j1312o294m265o091m455Q02
55756B49572J533k965m406j330j176n026n460j486o19m057m556j022n67m088m292
55741B10055k93K89l930n520k695k213n445n606j476j8k622k395K005L465J14
55726A83715j458M59m03n168o914m070l467o709o710j522J471r18k566l72O03
55711A45971j571j451K571M559K667K957P574J0516R205Q911J1621J1690O853
55698B22073K703J961J8m876p611o374o277q954r053m943k389l639l336O75L065
55683A73043J617J571N151P038M780L537O018P526N471M078N292M766J082p40
55669B30230Q94O29l352n248k449l73k003k652Q0J176j828l633j255K51k351m406
$$ plain form
55653 203710 200984 199220 194641 188026 183503 180828 176084 169049 162981 158079 151859 145001 140181 136152
55639 136152 129542 121406 115548 111530 105942 99341 95227 93187 89810 85446 83402 83205 81368 78141
55625 78141 76923 77587 76830 74638 74001 74747 73945 71955 71862 73327 73192 71630 71508 72215 70413 66518 64099
55608 64099 63216 60709 56860 55333 56448 56753 55427 55006 55575 54321 51218 49206 48379 45846 41801 39920
55592 39920 41095 42257 41987 41936 42296 41204 39182 38947 40358 40568 39429 39668 41542 42465 42152 42938 44793
55575 44793 45196 44155 44212 45333 45029 43609 43938 45749 45699 43443 42189 42805 42801 41709 41946 43616 43897 42468
55557 42468 42258 43896 44675 43973 44430 46628 47813 47248 47836 50979 54555 57329 60762 65073 67989 68887
55541 68887 70046 72601 75229 77658 81323 85803 88802 90429 93264 97525 100508 101394 102137 102933 101457
$$ packed form
55653B03710k726j764m579o615m523k675m744p035o068m902o220o858m820m029
55639A36152o610q136n858m018n588o601m114k040l377m364k044j97j837l227
55625G8141j218O64p57k192o37P46q02j990r3J465j35j562j22P07j802l895k419
55608F4099q83k507l849j527J115L05j326m21N69j254l103k012q27k533m045j881
55592C9920J175J162k70n1L60j092k022k35J411K10j139K39J874R23l13P86J855
55575D4793M03j041N7J121l04j420L29J811n0k256j254O16mj092K37J670K81j429
55557D2468k10J638P79p02M57K198J185n65N88L143L576K774L433M311K916Q98
55541F8887J159K555K628K429L665M480K999J627K835M261K983Q86P43P96j476
$$ plain form
55526 101457 97445 93476 90365 86277 81191 77485 75114 70906 63800 56272 49479 41558 32018 23319
55512 23319 16836 11614 8415 10419 18328 28823 39136 49143 58031 63390 65047 65602 65881 63973
55498 63973 59873 56621 55479 54265 51832 49867 48901 46949 43691 41697 41810 41487 39320 37120 36007
55483 36007 34607 32716 32463 34062 34597 32925 31667 32458 33259 32442 31586 32064 32503 31704 30644 29698 27293
55466 27293 23114 19302 16899 14499 11764 10642 11623 12561 12633 13659 16085 17646 17579 18036 19687 20173
55450 20173 18776 18342 20345 22230 21931 21061 21232 21186 20014 19390 20025 19682 17328 15598 16436 17853 17778
55433 17778 17638 19193 21112 21641 21715 22528 22857 21550 20036 19778 19830 19283 19415 21047 22484 22408 22222 23251
55415 23251 24279 24067 23604 23716 23210 21493 20229 20303 20057 18656 18191 20087 22408 23134 23244 24107 24723
$$ packed form
55526A01457m012l969l111m088n086l706k371m208p106p528o793p921r540q699
55512B3319o483n222l199K004P909J0495J0313J0007Q888N359J657N55K79j908
55498F3973m100l252j142j214k433j965r66j952l258j994J13l23k167k200j113
55483C6007j400j891k53J599N35j672j258P91Q01q17q56M78M39p99j060r46k405
55466B7293m179l812k403k400k735j122R81R38P2J026K426J561o7M57J651M86
55450B0173j397m34K003J885k99q70J71m6j172o24O35l43k354j730Q38J417p5
55433A7778j40J555J919N29P4Q13L29j307j514k58N2n47J32J632J437p6j86J029
55415B3251J028k12m63J12n06j717j264P4k46j401m65J896K321P26J10Q63O16
$$ plain form
55398 24723 24091 23533 24133 24502 23548 22794 23566 24555 24557 24883 26503 27574 26455 24620 23982 23812 22867 21984
55380 21984 21964 21372 19111 16823 16237 16413 16025 15864 16633 16847 15558 14713 16079 18180 18896 18746 18955 18685
55362 18685 16972 15166 14680 14462 13307 12411 13014 13768 13180 12459 13179 14288 14204 13762 14304 14911 14320 13543
55344 13543 13821 14062 13113 12463 13731 15408 15118 13378 12277 12100 12037 12473 13756 14394 13209 11689 11605
55327 11605 12072 11594 11061 11873 12937 12551 11554 11635 12088 11325 10147 10446 11861 12605 12532 12705 13035 12936 13120
55308 13120 14317 15412 15254 14956 16033 17631 18030 17470 17122 16755 15805 15252 15968 16685 16091 15358 16173 17860
55290 17860 18943 19836 21373 22409 21704 20593 20934 21923 21762 21012 21282 21957 21225 19250 17519 16146 14481
55273 14481 13249 13420 14105 14103 14311 16009 18113 18764 18300 18012 17363 15191 12377 10599 9697 8873 8980 10835
$$ packed form
55398B4723o32n58O00L69r54p54P72R89KL26J620J071j119j835o38j70r45q83
55380B1984k0n92k261k288n86J76l88j61P69K14j289q45J366K101P16j50K09k70
55362A8685j713j806m86k18j155q96O03P54n88p21P20J109q4m42N42O07n91p77
55344A3543K78K41r49o50J268J677k90j740j101j77o3M36J283O38j185j520q4
55327A1605M67m78n33Q12J064l86r97Q1M53p63j178K99J415P44p3J73L30r9J84
55308A3120J197J095j58k98J077J598L99n60l48l67r50n53P16P17n94p33Q15J687
55290A7860J083Q93J537J036p05j111L41R89j61p50K70O75p32j975j731j373j665
55273A4481j232J71O85kK08J698K104O51m64k88o49k172k814j778r02q24J07J855
$$ plain form
55255 10835 12763 12823 12066 12661 14174 14779 14688 15220 15735 14828 13408 13317 13897 13201 11673 11321 12078 12239 11792
55236 11792 12142 13230 13941 14671 16481 18499 19145 19128 20155 21596 21588 20636 20816 22061 22517 21972 21680 21423
55218 21423 20053 18398 18295 19152 18810 17460 17379 19047 20829 22335 24736 27786 29729 30252 30567 30664 29478
55201 29478 27672 27180 27933 28052 27258 27072 27660 27547 26604 26320 26834 26619 25385 24536 24471 24122 23395 23460 24404
55182 24404 25061 25268 25864 26530 26131 25127 25017 25544 25084 23650 22832 22888 22647 22130 22518 23603 24000 23693
55164 23693 23624 23178 21090 18553 18076 19300 19370 17611 16420 17104 18252 18891 19938 21613 22417 21757 20978
55147 20978 20908 20794 20296 20119 20192 19620 18760 18882 19580 19218 18069 18110 19421 19881 18904 18333 18916 19027 17895
55128 17895 17181 18235 20310 22487 24890 27126 28046 27868 28144 28889 28264 25838 23531 22506 21745 20584
$$ packed form
55255A0835J928O0p57N95J513O05r1N32N15r07j420r1N80o96j528l52P57J61m47
55236A1792L50J088P11P30J810K018O46j7J027J441qr52J80J245M56n45k92k57
55218B1423j370j655j03Q57l42j350q1J668J782J506K401L050J943N23L15R7j186
55201B9478j806m92P53J19p94j86N88j13r43k84N14k15j234q49o5l49p27O5R44
55182B4404O57K07N96O66l99j004j10N27m60j434q18N6k41n17L88J085L97l07
55164B3693o9m46k088k537m77J224P0j759j191O84J148O39J047J675Q04o60p79
55147B0978p0j14m98j77P3n72q60J22O98l62j149M1J311M60r77n71N83J11j132
55128A7895p14J054K075K177K403K236R20j78K76P45o25k426k307j025p61j161
$$ plain form
55112 20584 20069 20741 21565 22056 23132 24885 25855 25518 25251 25993 27064 27970 29149 30291 30414 30197 31667
55095 31667 34822 37191 37604 37700 38811 40086 40796 41815 43471 44475 44298 44335 45428 46521 46948 47689 49145
55078 49145 49992 49566 49160 49655 50073 49710 49536 50195 50711 50440 50226 50454 50093 48830 47981 48085 47783 46357
55060 46357 45133 45025 44905 43842 42805 42642 42397 41164 39738 38954 38311 37599 37918 39584 40896 40522 39411
55043 39411 38955 39029 39255 40350 42629 44702 45134 44087 42227 39634 36889 35473 35844 36640 36885 37319 38572
55026 38572 39893 40821 42250 44583 46600 47388 47730 48433 49037 49265 49920 51200 51926 51535 51023 50908 50211
55009 50211 48530 47063 46454 45705 44429 43910 44604 44819 43425 41769 41353 41646 41680 41743 41919 41086 39057 37665
54991 37665 38044 38849 38837 39044 40529 42159 42777 43564 45958 48978 50837 51656 52452 52969 52664 52379 52923 53348
$$ packed form
55112B0584n15O72Q24M91J076J753R70l37k67P42J071R06J179J142J23k17J470
55095C1667L155K369M13R6J111J275P10J019J656J004j77L7J093J093M27P41J456
55078D9145Q47m26m06M95M18l63j74O59N16k71k14K28l61j263q49J04l02j426
55060D6357j224j08j20j063j037j63k45j233j426p84o43p12L19J666J312l74j111
55043C9411m56P4K26J095K279K073M32j047j860k593k745j416L71P96K45M34J253
55026C8572J321R28J429K333K017P88L42P03O04K28O55J280P26l91n12j15o97
55009E0211j681j467o09p49j276n19O94K15j394j656m16K93L4O3J76q33k029j392
54991C7665L79Q05j2K07J485J630O18P87K394L020J859Q19P96N17l05k85N44M25
$$ plain form
54973 53348 52695 52137 53311 55719 57776 59274 60966 62857 64778 67542 71736 76451 80828 85669 91958
54958 91958 99148 106601 115332 126553 139769 153989 169456 186412 203505 219157 233033 244432
54946 244432 250867 250368 243958 233934 221092 205612 189123 173523 158901 144750 132061 122031
54934 122031 113847 106019 98928 93836 90323 86935 83572 81052 79077 76743 74445 73323 73485 74558
54920 74558 77158 81852 87463 92344 96709 101947 108489 116152 125660 137786 151699 165977 180486
54907 180486 195449 209589 221137 229800 235766 237635 233530 223732 210319 194865 178342 162335
54895 162335 148129 135116 122155 109984 100338 93296 87536 82627 79006 76154 72947 69552 67116
54882 67116 65861 65156 65023 65772 66663 66722 66354 66411 66317 65007 63076 61968 61572 60676 59252 58156 57051 54899
$$ packed form
54973E3348o53n58J174K408K057J498J692J891J921K764M194M715M377M841O289
54958I1958P190P453Q731J1221J3216J4220J5467J6956J7093J5652J3876J1399
54946B44432O435m99o410j0024j2842j5480j6489j5600j4622j4151j2689j0030
54934A22031q184p828p091n092l513l388l363k520j975k334k298j122J62J073
54920G4558K600M694N611M881M365N238O542P663R508J2126J3913J4278J4509
54907A80486J4963J4140J1548Q663N966J869m105r798j3413j5454j6523j6007
54895A62335j4206j3013j2961j2171r646p042n760m909l621k852l207l395k436
54882F7116j255p05j33P49Q91N9l68N7r4j310j931j108l96q96j424j096j105k152
$$ plain form
54864 54899 52278 50877 50711 50050 48243 46537 45799 45328 44390 43338 42768 42812 43442 44414 44914 44387 43535 43425
54846 43425 43939 44233 44191 44189 43952 42996 41732 40901 40510 40532 41782 44612 47586 49037 49184 49157 48898 47903 47105
54827 47105 47894 49850 51458 52509 53759 54826 54626 53559 53112 53537 53935 54389 55938 58594 61313 63841
54811 63841 66627 69186 70622 71722 74494 79528 85649 92246 100100 109833 121220 134093 148402 163462
54797 163462 178640 194446 211305 227624 240841 249945 255147 255756 250696 240895 228860 215877 201806
54784 201806 187441 174615 163704 153399 143347 134818 128298 122562 116796 111720 107958 105075 102853
54771 102853 101812 101895 102175 102419 103454 105540 107837 109901 112377 115915 120748 127449 136575 147415 158632
54756 158632 170350 183995 199849 216351 232101 246944 260675 272158 280213 284252 283896 279237
$$ packed form
54864E4899k621j401j66o61j807j706p38m71r38j052n70M4O30R72N00n27q52j10
54846D3425N14K94m2kk37r56j264q31l91K2J250K830K974J451J47k7k59r95p98
54827D7105P89J956J608J051J250J067k00j067m47M25L98M54J549K656K719K528
54811F3841K786K559J436J100K772N034O121O597P854R733J1387J2873J4309J5060
54797A63462J5178J5806J6859J6319J3217R104N202O09n060r801j2035j2983j4071
54784B01806j4365j2826j0911j0305j0052q529o520n736n766n076l762k883k222
54771A02853j041Q3K80K44J035K086K297K064K476L538M833O701R126J0840J1217
54756A58632J1718J3645J5854J6502J5750J4843J3731J1483Q055M039l56m659
$$ plain form
54744 279237 271533 262344 252042 240383 228160 216636 205621 193956 181781 170443 160210 150107
54732 150107 140087 131338 124202 117797 111981 107696 104908 102162 98752 95522 93026 90668 88233 86559
54718 86559 86026 85885 85624 85527 85502 84925 84007 83760 84182 84040 82831 81424 80466 79679 78991 78771 78777 78460 78418 79653
54698 79653 81346 81450 79812 78565 78937 79875 80445 81360 83183 85032 86156 87015 87861 87955 87159 86624 86931
54681 86931 87172 86829 86934 88311 90178 91514 92495 93566 94441 94923 95508 96390 97123 97938 100032 103835 108307
54664 108307 112611 117096 122016 126736 130975 135410 140343 145071 149222 153283 157337 160807 163915 167692
54650 167692 171932 175003 176427 177739 179881 181702 182143 182099 182847 184354 186485 190169 195829 202050 207387
54635 207387 212355 218185 224625 230238 233888 234821 232324 226525 218653 209579 199048 187167 175361 164866
$$ packed form
54744B79237p704r189j0302j1659j2223j1524j1015j1665j2175j1338j0233j0103
54732A50107j0020q749p136o405n816m285k788k746l410l230k496k358k435j674
54718H6559n33j41k61r7k5n77r18k47M22j42j209j407r58p87o88k20Ol17m2J235
54698G9653J693J04j638j247L72R38N70R15J823J849J124Q59Q46R4p96n35L07
54681H6931K41l43J05J377J867J336R81J071Q75M82N85Q82P33Q15K094L803M472
54664A08307M304M485M920M720M239M435M933M728M151M061M054L470L108L777
54650A67692M240L071J424J312K142J821M41m4P48J507K131L684N660O221N337
54635B07387M968N830O440N613L650R33k497n799p872r074j0531j1881j1806j0495
$$ plain form
54621 164866 155418 146521 138812 133007 128584 124650 121257 118818 117172 116129 115972 116535 116830 116520 116709
54606 116709 118423 121258 124374 127684 131224 134494 137267 139914 142137 142643 141036 138699 136860 135099
54592 135099 132809 130660 129263 127651 124622 120630 116972 113897 110833 107732 104955 102409 99840 97394
54578 97394 95043 92177 88605 85220 82925 81588 80627 79720 78407 76119 73183 70705 68876 66715 64044
54563 64044 62225 62158 63092 64281 66103 68463 69826 69293 68175 68045 68534 68508 68140 68229 68637 68919 69438 70396
54545 70396 70823 70057 69186 69497 70547 71317 72213 74128 76374 77421 77204 77056 77849 79616 82490 86501 90840
54528 90840 94736 98694 103633 109176 114021 117613 120274 122005 122206 120399 116498 110885 104845 100154 97340
54513 97340 95045 91847 87927 84236 81059 78288 76110 74440 72655 70780 69847 70167 70429 69559 68220
$$ packed form
54621A64866r448q897p709n805m423l934l393k439j646j043j57N63K95l10J89
54606A16709J714K835L116L310L540L270K773K647K223N06j607k337j839j761
54592A35099k290k149j397j612l029l992l658l075l064l101k777k546k569k446
54578I7394k351k866l572l385k295j337r61r07j313k288k936k478j829k161k671
54563F4044j819o7R34J189J822K360J363n33j118j30M89k6l68Q9M08K82N19R58
54545G0396M27p66q71L11J050P70Q96J915K246J047k17j48P93J767K874M011M339
54528I0840L896L958M939N543M845L592K661J731K01j807l901n613o040m691k814
54513I7340k295l198l920l691l177k771k178j670j785j875r33L20K62q70j339
$$ plain form
54498 68220 67362 66630 65481 64528 64385 64438 64201 64558 66095 67592 67894 67998 69316 71079 71606 71191 71527 72922
54480 72922 74255 75230 76554 78206 79377 79999 80686 81436 81892 82419 83403 84050 83499 82571 82751 83958 84992
54463 84992 85626 86434 87093 86733 85663 84840 83914 81636 77983 74142 70687 67596 65685 65920 67339 67665
54447 67665 66229 64500 63566 62824 61474 59671 57862 56342 55652 56074 56669 56202 55050 54771 55791 56989
54431 56989 57594 57973 58392 58534 58467 58777 59444 59836 59930 60319 60999 61410 61657 62362 63285 63517 63124 63205 64183 65396
54411 65396 66520 68026 69997 71808 73182 74399 75426 76100 77175 79704 83242 86196 88182 90509 93961
54396 93961 97613 100526 103254 106856 111435 116410 121427 126353 131043 135587 140265 144978 149196 152576
54382 152576 155094 156613 156933 156194 154635 152172 148857 145373 142270 139126 135356 131374 127823 124199 119523
$$ packed form
54498F8220q58p32j149r53j43N3k37L57J537J497L02J04J318J763N27m15L36J395
54480G2922J333R75J324J652J171O22O87P50M56N27R84O47n51r28J80J207J034
54463H4992O34Q08O59l60j070q23r26k278l653l841l455l091j911K35J419L26
54447F7665j436j729r34p42j350j803j809j520o90M22N95m67j152k79J020J198
54431E6989O05L79M19J42o7L10O67L92R4L89O80M11K47P05R23K32l93Q1R78J213
54411F5396J124J506J971J811J374J217J027O74J075K529L538K954J986K327L452
54396I3961L652K913K728L602M579M975N017M926M690M544M678M713M218L380
54382A52576K518J519L20p39j559k463l315l484l103l144l770l982l551l624m676
$$ plain form
54367 119523 114097 109228 105449 102320 99788 98250 97337 96109 94569 93632 93468 93142 92063 90580 89090
54352 89090 87754 87182 88067 89952 91563 92575 93922 96229 99097 102078 105218 108479 111699 115277 119850
54337 119850 125103 129916 133741 137027 140414 144431 149673 155984 161657 164764 165259 164615 163612 161856 159153
54322 159153 155780 151457 145781 139736 135028 131639 127687 122116 116017 110793 106495 102569 98973 95868
54308 95868 93162 90747 88356 85223 80998 76885 74496 73576 72310 69966 67608 66024 64697 63298 62485
54293 62485 62560 62700 62211 61322 60272 58924 57708 57556 58352 58718 57885 56530 55376 54322 53468 53536 54560
54276 54560 55456 55527 55255 55105 54817 54440 54646 55402 55628 54865 54050 54025 54550 55368 56811 58613 59577 59302 58920
54257 58920 59276 59708 59584 59657 60741 62200 63005 63290 63719 64191 64297 64313 64656 65076 65306 65766 66647 67040 66053
$$ packed form
54367A19523n426m869l779l129k532j538r13j228j540r37j64l26j079j483j490
54352H9090j336n72Q85J885J611J012J347K307K868K981L140L261L220L578M573
54337A19850N253M813L825L286L387M017N242O311N673L107M95o44j003j756k703
54322A59153l373m323n676o045m708l389l952n571o099n224m298l926l596l105
54308I5868k706k415k391l133m225m113k389r20j266k344k358j584j327j399q13
54293F2485P5J40m89q89j050j348j216j52P96L66q33j355j154j054q54O8J024
54276E4560Q96P1k72j50k88l77K06P56K26p63q15k5N25Q18J443J802R64k75l82
54257E8920L56M32j24P3J084J459Q05K85M29M72J06J6L43M20K30M60Q81L93r87
$$ plain form
54238 66053 64226 62886 62505 62586 62698 62813 62872 62742 62406 61829 60964 60156 60031 60714 61718 62801 64205 65799
54220 65799 66806 66761 66042 65131 64070 62927 62005 61330 60657 60149 60195 60482 60160 59063 57737 56272 54353
54203 54353 52585 52259 53393 54392 54193 53405 52830 52259 51431 50798 50477 49660 47893 45915 44503 43561 43037
54186 43037 43486 44963 46483 47400 48265 49626 51103 52304 53387 54010 53166 51042 49598 50178 51813 53053
54170 53053 54151 56048 58325 59785 60292 60616 61042 61391 61855 62627 63290 63616 64387 66328 68815 70676 71730
54153 71730 72511 73037 72897 72154 71235 70276 69296 68521 67886 66813 65146 63573 62493 61282 59501 57922 57439
54136 57439 57731 57962 58030 58170 58068 57437 56849 56982 57567 57972 58272 58875 59712 60615 61899 63736 65609 67180
54118 67180 68944 71159 72961 73575 73658 74363 75582 76174 75472 73684 71354 69302 68519 69199 70356 71089 71604
$$ packed form
54238F6053j827j340l81Q1J12J15N9j30l36n77q65q08j25O83J004J083J404J594
54220F5799J007m5p19r11j061j143r22o75o73n08M6K87l22j097j326j465j919
54203E4353j768l26J134R99j99p88n75n71q28o33l21q17j767j978j412r42n24
54186D3037M49J477J520R17Q65J361J477J201J083O23q44k124j444N80J635J240
54170E3053J098J897K277J460N07L24M26L49M64P72O63L26P71J941K487J861J054
54153G1730P81N26j40p43r19r59r80p75o35j073j667j573j080j211j781j579m83
54136E7439K92K31O8J40j02o31n88J33N85M05L00O03Q37R03J284J837J873J571
54118F7180J764K215J802O14Q3P05J219N92p02j788k330k052p83O80J157P33N15
$$ plain form
54101 71604 72316 72765 72313 71130 69583 67437 64604 61950 60301 59392 58693 58420 58620 58163 56036 53067
54085 53067 51074 50685 51116 51618 51953 51820 51006 50029 49775 50601 52307 54490 56362 56945 56180 55203 54892 54957
54067 54957 55036 55582 56769 57698 57780 57880 58885 60170 60750 60935 61448 61809 61148 59884 59162 59252 59829 61060
54049 61060 63020 64811 65751 66667 68487 70369 70933 70574 70707 71381 71587 71435 71993 73224 74161 75018 77104
54032 77104 80488 83603 85511 86930 88733 90987 93848 97952 103379 109277 114763 119379 122880 125689
54018 125689 129260 134558 140344 144391 146308 147731 149795 152085 154115 156145 158121 159337 159605 159568 159467
54003 159467 158752 157166 155019 152195 148221 143596 139780 137458 135864 134111 132078 129744 126891 123843
53989 123843 121427 119792 118269 116645 115569 115358 115440 115263 114825 114142 113160 112371 112434 113007 113030 112369 112060 112675
$$ packed form
54101G1604P12M49m52j183j547k146k833k654j649r09o99k73K00m57k127k969
54085E3067j993l89M31N02L35j33q14r77k54Q26J706K183J872N83p65r77l11O5
54067E4957P9N46J187R29Q2J00J005J285N80J85N13L61o61j264p22R0N77J231
54049F1060J960J791R40R16J820J882N64l59J33O74K06j52N58J231R37Q57K086
54032G7104L384L115J908J419J803K254K861M104N427N898N486M616L501K809
54018A25689L571N298N786M047J917J423K064K290K030K030J976J216K68l7j01
54003A59467p15j586k147k824l974m625l816k322j594j753k033k334k853l048
53989A23843k416j635j523j624j076k11Q2j77m38o83r82p89O3N73K3o61l09O15
$$ plain form
53971 112675 113569 114079 114349 114578 114488 113936 113157 112101 110542 109067 108868 110154 111747 112643 112983 113192 113251 113292
53953 113292 113856 114986 115868 115914 115461 115068 114944 115399 116880 119100 120964 121913 122611 123861 125589 127420 129586
53936 129586 132748 137305 143170 149803 156418 162710 169378 177160 185346 192150 196662 199544 201606 202708
53922 202708 202430 200921 198662 196157 194201 193719 194878 196931 199214 201680 204348 206955 209440 212081 214902
53907 214902 217579 220072 222658 225308 227846 230807 235186 240986 246881 251698 255505 258864 261729 263493
53893 263493 263626 262024 259218 256385 254519 253444 252127 249965 247182 244031 240356 236016 231028 225336
53879 225336 219062 212839 207118 201334 194701 187675 181556 176696 172252 167720 163585 160211 157193 154064
53865 154064 150708 146938 142606 138196 134342 130713 126494 121919 118099 115336 112961 110941 110062 110151 109698
$$ packed form
53971A12675Q94N10K70K29r0n52p79j056j559j475j99J286J593Q96L40K09N9M1
53953A13292N64J130Q82M6m53l93j24M55J481K220J864R49O98J250J728J831K166
53936A29586L162M557N865O633O615O292O668P782Q186O804M512K882K062J102
53922B02708k78j509k259k505j956m82J159K053K283K466K668K607K485K641K821
53907B14902K677K493K586K650K538K961M379N800N895M817L807L359K865J764
53893B63493J33j602k806k833j866j075j317k162k783l151l675m340m988n692
53879B25336o274o223n721n784o633p026o119m860m444m532m135l374l018l129
53865A54064l356l770m332m410l854l629m219m575l820k763k375k020q79Q9m53
$$ plain form
53850 109698 107851 105425 103330 101390 99386 97840 96900 95699 93788 92079 91434 91339 90976 90565 90590 90551 89682
53833 89682 88303 87430 87479 88204 89380 90657 91237 90644 89546 89045 89332 89602 89106 87830 86366 85463 85463 85924
53815 85924 86097 85882 85866 86377 87098 87708 88198 88448 88261 88011 88474 89768 91139 92005 92466 92749 93012 93807 95737
53796 95737 98533 101466 104758 109323 114952 120154 124237 128187 132893 137883 142512 147087 151855 156056
53782 156056 158959 160873 162253 162815 162463 162125 162629 163556 164156 164590 165337 166077 166119 165260 163465 160448 156393
53765 156393 152247 148514 144564 140028 135931 133441 132300 131503 130672 129685 127844 124789 121618 119732 118986
53750 118986 118175 116890 115653 114580 113226 111588 110081 108626 106792 104804 103413 102839 102735 103038 103949
53735 103949 105151 106028 106657 107712 109284 110623 111185 111237 111149 110720 109579 107955 106797 107023 108587 110345
$$ packed form
53850A09698j847k426k095j940k004j546r40j201j911j709o45r5l63m11K5l9q69
53833H9682j379q73M9P25J176J277N80n93j098n01K87K70m96j276j464r03%M61
53815H5924J73k15j6N11P21O10M90K50j87k50M63J294J371Q66M61K83K63P95J930
53796I5737K796K933L292M565N629N202M083L950M706M990M629M575M768M201
53782A56056K903J914J380N62l52l38N04R27O00M34P47P40M2q59j795l017m055
53765A56393m146l733l950m536m097k490j141p97q31r87j841l055l171j886p46
53750A18986q11j285j237j073j354j638j507j455j834j988j391n74j04L03R11
53735A03949J202Q77O29J055J572J339N62N2q8m29j141j624j158K26J564J758
$$ plain form
53719 110345 111201 111372 112004 113526 115156 116275 117370 119051 120916 122118 122463 122239 121549 120615 120270 121336
53703 121336 123715 126669 129679 132518 134933 136901 138869 141176 143544 145601 147464 149322 150859 151590
53689 151590 151357 150154 148054 145742 144421 144615 145662 146899 148594 151070 153713 155768 157458 159492 161944
53674 161944 164470 167077 169826 172208 173722 174706 175813 177021 177898 178446 178930 179225 179074 178641 178220 177817
53658 177817 177532 177775 178450 178612 177725 176581 176181 176370 176532 176905 178079 179711 180935 181681 182502 183375 183806
53641 183806 183896 184254 184951 185451 185429 184850 183539 181586 179909 179443 179936 180375 180334 180066 179600 178812 178133 178152 178594
53622 178594 178675 178378 178420 179054 179837 180586 181638 183123 184816 186737 189111 191681 193813 195317 196552 197790
53606 197790 199137 200949 203570 206708 209770 212702 215849 219122 222091 224830 227968 231888 236492 241630
$$ packed form
53719A10345Q56J71O32J522J630J119J095J681J865J202L45k24o90r34l45J066
53703A21336K379K954L010K839K415J968J968K307K368K057J863J858J537P31
53689A51590k33j203k100k312j321J94J047J237J695K476K643K055J690K034K452
53674A61944K526K607K749K382J514R84J107J208Q77N48M84K95j51m33m21m03
53658A77817k85K43O75J62q87j144m00J89J62L73J174J632J224P46Q21Q73M31
53641A83806R0L58O97N00k2n79j311j953j677m66M93M39m1k68m66p88o79J9M42
53622A78594Q1k97M2O34P83P49J052J485J693J921K374K570K132J504J235J238
53606A97790J347J812K621L138L062K932L147L273K969K739L138L920M604N138
$$ plain form
53592 241630 247079 252250 256590 260276 263886 267533 270914 274076 277440 281106 284697 287864 290492 292579
53578 292579 294310 296068 298030 300105 302494 305663 309313 312201 313654 314530 315909 317641 319129 320702
53564 320702 323003 325633 327708 329291 331048 332930 334487 336067 338271 340542 341765 342179 343203 345400
53550 345400 348039 350710 353877 357513 360612 362617 364197 366163 368562 371243 374316 377598 380497 382946
53536 382946 385748 389556 394118 398820 403397 407839 412095 416106 419741 422715 425014 427227 430012 433421
53522 433421 437348 442182 448200 454721 460870 466941 473952 481964 489972 497440 504879 512907 521722 531564
53508 531564 542676 554675 566871 579243 592207 605520 618457 631101 644340 658533 673355
53497 673355 689049 706569 726021 746046 765288 783724 802198 821409 841607 862605 883777
$$ packed form
53592B41630N449N171M340L686L610L647L381L162L364L666L591L167K628K087
53578B92579J731J758J962K075K389L169L650K888J453Q76J379J732J488J573
53564C20702K301K630K075J583J757J882J557J580K204K271J223M14J024K197
53550C45400K639K671L167L636L099K005J580J966K399K681L073L282K899K449
53536C82946K802L808M562M702M577M442M256M011L635K974K299K213K785L409
53522D33421L927M834O018O521O149O071P011Q012Q008P468P439Q028Q815R842
53508E31564J1112J1999J2196J2372J2964J3313J2937J2644J3239J4193J4822
53497F73355J5694J7520J9452K0025J9242J8436J8474J9211K0198K0998K1172
$$ plain form
53486 883777 904647 925496 946822 968364 989428 1009982 1030494 1050853 1070492 1089379 1107806
53475 1107806 1125459 1141972 1158277 1175850 1194526 1212573 1229183 1245391 1262149 1279010 1295223
53464 1295223 1310793 1325822 1340109 1353975 1368212 1382525 1395275 1405497 1414034 1421902 1428776 1433978
53452 1433978 1437849 1441047 1443292 1443782 1442210 1438618 1432950 1425463 1416902 1407538 1396749 1384186 1370588
53439 1370588 1356765 1342566 1327624 1312311 1297019 1281101 1263489 1244023 1223422 1202349 1181130
53428 1181130 1160052 1139327 1118982 1099092 1079770 1060735 1041580 1022773 1005751 991589 980236
53417 980236 971303 964687 959891 955609 950727 945240 939680 934385 929812 926805 925821 926463 928283 931411 935866
53402 935866 941080 946761 953594 962376 973065 985286 999078 1014404 1030608 1047145 1064357 1082820
$$ packed form
53486H83777K0870K0849K1326K1542K1064K0554K0512K0359J9639J8887J8427
53475A107806J7653J6513J6305J7573J8676J8047J6610J6208J6758J6861J6213
53464A295223J5570J5029J4287J3866J4237J4313J2750J0222Q537P868O874N202
53452A433978L871L198K245M90j572l592n668p487q561r364j0789j2563j3598
53439A370588j3823j4199j4942j5313j5292j5918j7612j9466k0601k1073k1219
53428A181130k1078k0725k0345j9890j9322j9035j9155j8807j7022j4162j1353
53417I80236q933o616m796m282m882n487n560n295m573l007r84O42J820L128M455
53402I35866N214N681O833Q782J0689J2221J3792J5326J6204J6537J7212J8463
$$ plain form
53390 1082820 1102485 1123146 1145209 1169209 1195001 1222117 1250600 1280866 1313086 1347220 1383222
53379 1383222 1420753 1459234 1498665 1539784 1582891 1627176 1671846 1717239 1764057 1812012 1859983
53368 1859983 1907080 1952873 1997096 2039883 2081868 2123326 2163576 2201786 2237865 2271884 2303162
53357 2303162 2330714 2354204 2373765 2389301 2400701 2408310 2412434 2412685 2408518 2400039 2387665 2371490
53345 2371490 2351737 2329362 2305378 2279916 2252712 2224059 2194303 2162787 2128354 2090889 2051486
53334 2051486 2011220 1970623 1930277 1890955 1852982 1816191 1780638 1746639 1713900 1681256 1647644
53323 1647644 1613072 1578551 1545384 1514567 1486424 1460577 1436402 1413533 1391945 1371795 1353402
53312 1353402 1337194 1323410 1311960 1302577 1294741 1287289 1278586 1267511 1254120 1239269 1223947 1209049
$$ packed form
53390A082820J9665K0661K2063K4000K5792K7116K8483L0266L2220L4134L6002
53379A383222L7531L8481L9431M1119M3107M4285M4670M5393M6818M7955M7971
53368A859983M7097M5793M4223M2787M1985M1458M0250L8210L6079L4019L1278
53357B303162K7552K3490J9561J5536J1400P609M124K51m167q479j2374j6175
53345B371490j9753k2375k3984k5462k7204k8653k9756l1516l4433l7465l9403
53334B051486m0266m0597m0346l9322l7973l6791l5553l3999l2739l2644l3612
53323A647644l4572l4521l3167l0817k8143k5847k4175k2869k1588k0150j8393
53312A353402j6208j3784j1450r383p836p452q703j1075j3391j4851j5322j4898
$$ plain form
53300 1209049 1195155 1182160 1169663 1158045 1148505 1141618 1136502 1132051 1128421 1126576 1126794 1128408 1130729
53287 1130729 1133450 1136300 1139054 1142013 1146021 1151907 1160005 1170045 1181371 1193596 1207252 1223352 1242064
53274 1242064 1262303 1282957 1303986 1325894 1348725 1372058 1395516 1418696 1441070 1462465 1483220
53263 1483220 1503374 1522197 1539086 1554357 1568463 1580870 1590541 1597228 1601622 1604431 1605957 1606294 1605277
53250 1605277 1602349 1597047 1589521 1580215 1569307 1556823 1542940 1527721 1510963 1492804 1474076 1455510
53238 1455510 1437009 1418255 1399531 1381253 1363118 1344555 1325758 1307533 1290299 1273853 1257875
53227 1257875 1241976 1225415 1207546 1188601 1169553 1151298 1134330 1118910 1104915 1091623 1078230
53216 1078230 1064608 1051245 1038570 1026688 1015545 1004969 994703 984639 974817 965048 954918 944350
$$ packed form
53300A209049j3894j2995j2497j1618r540o887n116m451l630j845K18J614K321
53287A130729K721K850K754K959M008N886Q098J0040J1326J2225J3656J6100J8712
53274A242064K0239K0654K1029K1908K2831K3333K3458K3180K2374K1395K0755
53263A483220K0154J8823J6889J5271J4106J2407R671O687M394K809J526L37j017
53250A605277k928n302p526r306j0908j2484j3883j5219j6758j8159j8728j8566
53238A455510j8501j8754j8724j8278j8135j8563j8797j8225j7234j6446j5978
53227A257875j5899j6561j7869j8945j9048j8255j6968j5420j3995j3292j3393
53216A078230j3622j3363j2675j1882j1143j0576j0266j0064r822r769j0130j0568
$$ plain form
53204 944350 933641 922749 911146 898703 885977 873154 859401 843864 826712 808694 790367
53193 790367 772409 755924 741587 728952 717249 706275 695841 685117 673403 660935 648092
53182 648092 634491 619816 604910 590926 577876 565039 552239 539545 526256 511610 496285
53171 496285 481912 469156 457372 446011 435148 424689 414318 404380 395699 388315 381359 374322
53159 374322 367496 361043 354564 347884 341483 335894 331295 327759 325232 323219 321162 319243 318205 318384
53145 318384 319494 321218 323338 325399 326992 328297 329653 330680 330585 329135 326630 323048 318100 311994 305341
53130 305341 298376 291046 283710 276830 270150 263097 255875 249214 243153 237111 231084 225715 221175 217071
53116 217071 213518 211117 209689 208142 205894 203405 201054 198544 195800 193403 191641 189976 187878 185385
$$ packed form
53204I44350j0709j0892j1603j2443j2726j2823j3753j5537j7152j8018j8327
53193G90367j7958j6485j4337j2635j1703j0974j0434j0724j1714j2468j2843
53182F48092j3601j4675j4906j3984j3050j2837j2800j2694j3289j4646j5325
53171D96285j4373j2756j1784j1361j0863j0459j0371r938q681p384o956p037
53159C74322o826o453o479o680o401n589m599l536k527k013k057j919j038J79
53145C18384J110J724K120K061J593J305J356J027r5j450k505l582m948o106o653
53130C05341o965p330p336o880o680p053p222o661o061o042o027n369m540m104
53116B17071l553k401j428j547k248k489k351k510k744k397j762j665k098k493
$$ plain form
53102 185385 182449 178642 174016 169521 165995 163389 161414 160279 160176 160562 160548 159774 158536 157333 156486 155953
53086 155953 155299 154044 152037 149394 146286 143140 140565 138567 136312 133373 130698 129370 128915 128054 126757
53071 126757 126128 126339 126304 125567 124953 124865 124407 122966 121423 120908 121341 122044 122920 124120 125199 125493 124925 123863
53053 123863 122596 121406 120625 120178 119568 118695 118167 118446 119258 120117 120792 120992 120413 119451 119099 119642 120212 120084
53035 120084 119588 119232 118742 117703 116461 115637 115204 114745 114209 113842 113761 114049 114809 115737 116203 116192 116661 118443
53017 118443 121306 124450 127348 129612 130792 131031 131401 132837 135068 137129 138579 139736 141133 143285 146598
53002 146598 151004 155964 161169 166793 172798 178656 184163 189765 195458 200131 202825 204053 204931 205488 204799
52987 204799 202550 199499 196456 193588 190730 187650 183934 179266 173977 168914 164709 161439 158814 156347
$$ packed form
53102A85385k936l807m626m495l526k606j975j135j03L86j4p74j238j203q47n33
53086A55953o54j255k007k643l108l146k575j998k255k939k675j328m55q61j297
53071A26757o29K11l5p37o14q8m58j441j543n15M33P03Q76J200J079K94n68j062
53053A23863j267j190p81m47o10q73n28K79Q12Q59O75K00n79r62l52N43N70j28
53035A20084m96l56m90j039j242q24m33m59n36l67q1K88P60R28M66j1M69J782
53017A18443K863L144K898K264J180K39L70J436K231K061J450J157J397K152L313
53002A46598M406M960N205N624O005N858N507N602N693M673K694J228Q78N57o89
52987B04799k249l051l043k868k858l080l716m668n289n063m205l270k625k467
$$ plain form
52973 156347 153524 150312 147441 145722 145123 144855 144240 143132 141566 139497 137024 134616 132953 132516 133216
52958 133216 134382 135288 135698 135743 135375 134448 133367 133023 133785 135007 135889 136379 136875 137490 138111 138867 139993 141341
52940 141341 142437 143008 143231 143538 144262 145304 146084 146082 145499 145083 145263 145872 146711 147841 149158 150259 150921 151316
52922 151316 151512 151334 150927 150863 151418 152260 153139 154324 156037 158028 160020 161973 163530 163963 163192 162260 162218
52905 162218 163004 163910 164561 164845 164526 163686 163128 163602 164922 166444 168005 169682 171081 171708 171828 172156 172853
52888 172853 173519 174071 174909 176262 178021 180250 183268 187172 191722 196675 201854 206997 212058 217491 223668
52873 223668 230039 235448 239309 242022 244223 246179 248020 249909 251638 252491 251918 250182 248069 246025 243861
52858 243861 241253 238308 235487 233071 230889 228568 225936 223123 220461 218374 217082 216199 214914 212860
$$ packed form
52973A56347k823l212k871j719n99k68o15j108j566k069k473k408j663m37P00
52958A33216J166R06M10M5l68r27j081l44P62J222Q82M90M96O15O21P56J126J348
52940A41341J096N71K23L07P24J042P80kn83m16J80O09Q39J130J317J101O62L95
52922A51316J96j78m07o4N55Q42Q79J185J713J991J992J953J557M33p71r32m2
52905A62218P86R06O51K84l19q40n58M74J320J522J561J677J399O27J20L28O97
52888A72853O66N52Q38J353J759K229L018L904M550M953N179N143N061N433O177
52873B23668O371N409L861K713K201J956J841J889J729Q53n73j736k113k044k164
52858B43861k608k945k821k416k182k321k632k813k662k087j292q83j285k054
$$ plain form
52844 212860 210608 208959 208046 207520 207268 207303 207207 206482 205364 204583 204328 204251 204430 205442 207303 209179 210359
52827 210359 210769 210389 209067 207128 205285 203648 201682 199380 197415 195792 193579 190556 187975 186824 186417
52812 186417 185644 184664 184223 184188 183983 183863 184421 185183 184980 183569 181800 180274 178865 177524 176578 176113 175825
52795 175825 175552 175324 174903 173906 172405 170817 169261 167524 165595 163671 161680 159422 157122 155410 154669
52780 154669 154717 155036 155045 154400 153334 152446 151907 151279 150399 149870 150173 150854 151148 150915 150396 149648 148897 148854 149732 150380
52760 150380 149411 146942 144314 142309 140572 138678 136797 135206 133851 132528 130989 128972 126650 124857
52746 124857 124220 124331 124390 124316 124405 124264 123164 121419 120341 120605 121528 122265 122951 124254 126376 128895 131356
52729 131356 133747 136502 140030 144127 148033 151262 154031 156571 158481 159252 159030 158277 157035 155102 152638
$$ packed form
52844B12860k252j649r13n26k52L5r6p25j118p81k55p7J79J012J861J876J180
52827B10359M10l80j322j939j843j637j966k302j965j623k213l023k581j151m07
52812A86417p73r80m41l5k05j20N58P62k03j411j769j526j409j341r46m65k88
52795A75825k73k28m21r97j501j588j556j737j929j924j991k258k300j712p41
52780A54669M8L19Ro45j066q88n39o28q80n29L03O81K94k33n19p48p51m3Q78O48
52760A50380r69k469k628k005j737j894j881j591j355j323j539k017k322j793
52746A24857o37J11N9p4Q9j41j100j745j078K64R23P37O86J303K122K519K461
52729A31356K391K755L528M097L906L229K769K540J910P71k22p53j242j933k464
$$ plain form
52714 152638 149960 147030 143749 140415 137299 134104 130501 126765 123272 119832 116268 113027 110321 107306
52700 107306 103277 99154 96460 95090 93507 91039 88553 86797 85479 84303 83663 83791 84186 84275 83847 82674
52684 82674 80658 78554 77538 77752 78199 78256 78271 78398 78074 77128 76349 76263 76289 75739 74830 74093 73538 73049 72838
52665 72838 72883 72616 71799 71047 70811 70553 69657 68510 67846 67581 67229 67067 67838 69419 70742 71100 70807 70400
52647 70400 69870 68986 67950 67252 67062 67041 66854 66613 66628 66760 66434 65518 64881 65616 67750 70141 71624 71917
52629 71917 71454 70757 70072 69354 68513 67796 67700 68248 68694 68417 67802 67626 67862 67832 67396 67154 67448 67947 68350 68728
52609 68728 69050 69049 68810 68866 69505 70523 71753 73225 74682 75588 75813 75739 75594 75307 75085 75378 76076 76439 76096
52590 76096 75461 74976 74592 74203 73909 73629 73218 73210 74612 77552 80869 83419 85070 86060 86292 85890 85711 86488
$$ packed form
52714A52638k678k930l281l334l116l195l603l736l493l440l564l241k706l015
52700A07306m029m123k694j370j583k468k486j756j318j176o40J28L95Q9m28j173
52684H2674k016k104j016K14M47N7J5J27l24r46p79q6K6n50r09p37n55m89k11
52665G2838M5k67q17p52k36k58q96j147o64k65l52j62P71J581J323L58k93m07
52647G0400n30q84j036o98j90k1j87k41J5J32l26r16o37P35K134K391J483K93
52629G1917m63o97o85p18q41p17r6N48M46k77o15j76K36l0m36k42K94M99M03L78
52609F8728L22jk39N6O39J018J230J472J457R06K25p4j45k87k22K93O98L63l43
52590G6096o35m85l84l89k94k80m11qJ402K940L317K550J651R90K32m02j79P77
$$ plain form
52572 86488 87855 88817 88845 88098 87071 86487 87035 88678 90531 91810 92553 93149 93736 94408 95381 96568 97565
52555 97565 98512 100213 102806 105084 106002 106182 106935 108259 109002 108853 109008 110593 113332 116093 118081 119070
52539 119070 119055 118302 117531 117510 118324 119292 119766 119884 120340 121438 122751 123893 125210 127210 129553 131252 131902
52522 131902 132071 132339 132547 132345 131957 131974 132571 133268 133368 132539 131118 129817 128983 128280 127412 126833 127169 128146
52504 128146 128812 128765 128394 127935 127194 126378 126194 126723 127028 126411 125381 124838 124886 124942 124499 123350 121623 120058
52486 120058 119747 121047 123173 125129 126544 127294 127107 126177 125522 125991 127304 128598 129503 130146 130629 131104 131891
52469 131891 132873 133176 132182 130575 129728 130267 131763 133552 135232 136579 137575 138455 139349 140112 140811 141979 143864
52452 143864 145834 147136 147910 148836 150073 151290 152619 154767 158023 161659 164537 166101 166736 167295 168203
$$ packed form
52572H6488J367R62K8p47j027n84N48J643J853J279P43N96N87O72R73J187R97
52555I7565R47J701K593K278R18J80P53J324P43j49J55J585K739K761J988R89
52539A19070j5p53p71k1Q14R68M74J18M56J098J313J142J317K000K343J699O50
52522A31902J69K68K08k02l88J7N97O97J00q29j421j301q34p03q68n79L36R77
52504A28146O66m7l71m59p41q16j84N29L05o17j030n43M8N6m43j149j727j565
52486A20058l11J300K126J956J415P50j87r30o55M69J313J294R05O43M83M75P87
52469A31891R82L03r94j607q47N39J496J789J680J347R96Q80Q94P63O99J168J885
52452A43864J970J302P74R26J237J217J329K148L256L636K878J564O35N59R08
$$ plain form
52437 168203 168982 168892 168033 167349 167376 167593 167358 166860 166581 166309 165364 163535 161217 158822 156516 154336 152160
52420 152160 149791 147444 145802 145176 144979 144441 143464 142288 140800 138811 136641 134754 133079 131317 129661
52405 129661 128533 127855 127264 126878 127157 128108 129243 130267 131162 131730 131724 131481 131757 132720 133627 133731 133185 132888
52387 132888 133596 135247 137009 138028 138226 138202 138407 138810 139455 140702 142494 143941 144266 143839 143702 144316 145296
52370 145296 146135 146637 146830 146963 147435 148321 149159 149643 150220 151524 153525 155729 157856 159767 161089 161719 162485
52353 162485 164516 167908 171583 174499 176533 178228 180147 182453 184821 186852 188777 191353 194779 198258
52339 198258 201154 203946 207324 210910 213855 216264 218930 221852 224167 225562 226654 227861 228940 229926
52325 229926 231500 233971 236702 239099 241534 244746 248799 253018 256626 259126 260468 261222 262305 264221
$$ packed form
52437A68203P79r0q59o84K7K17k35m98k79k72r45j829k318k395k306k180k176
52420A52160k369k347j642o26j97n38r77j176j488j989k170j887j675j762j656
52405A29661j128o78n91l86K79R51J135J024Q95N68ok43K76R63R07J04n46k97
52387A32888P08J651J762J019J98k4K05M03O45J247J792J447L25m27j37O14R80
52370A45296Q39N02J93J33M72Q86Q38M84N77J304K001K204K127J911J322O30P66
52353A62485K031L392L675K916K034J695J919K306K368K031J925K576L426L479
52339A98258K896K792L378L586K945K409K666K922K315J395J092J207J079R86
52325B29926J574K471K731K397K435L212M053M219L608K500J342P54J083J916
$$ plain form
52311 264221 266751 269504 272472 275864 279718 283946 288537 293524 298838 304291 309636 314705 319622 324817
52297 324817 330656 337130 344012 351111 358306 365665 373787 383562 395097 407283 418907 429928 441134
52284 441134 452950 465300 478280 492072 506284 520270 534180 548947 565085 582223 599932
52273 599932 618275 637283 656569 675808 695120 714651 734232 753725 773325 793205 813137
52262 813137 832734 851860 870662 889312 907708 925191 940717 953701 964690 974841 984749 994188
52250 994188 1002828 1010652 1017570 1023186 1027161 1029429 1029973 1028810 1026306 1023099 1019489 1015177 1009796 1003536
52236 1003536 997110 991274 986358 982184 978507 975630 974353 975090 977318 980237 983729 988331 994549 1002548
52222 1002548 1012198 1022971 1034140 1045633 1058331 1072890 1088618 1104260 1119536 1134995 1150559
$$ packed form
52311B64221K530K753K968L392L854M228M591M987N314N453N345N069M917N195
52297C24817N839O474O882P099P195P359Q122R775J1535J2186J1624J1021J1206
52284D41134J1816J2350J2980J3792J4212J3986J3910J4767J6138J7138J7709
52273E99932J8343J9008J9286J9239J9312J9531J9581J9493J9600J9880J9932
52262H13137J9597J9126J8802J8650J8396J7483J5526J2984J0989J0151R908R439
52250I94188Q640P824O918N616L975K268N44j163k504l207l610m312n381o260
52236A003536o426n836m916m174l677k877j277P37K228K919L492M602O218P999
52222A002548R650J0773J1169J1493J2698J4559J5728J5642J5276J5459J5564
$$ plain form
52211 1150559 1165321 1178842 1191587 1203767 1214685 1223667 1230910 1236900 1241498 1244100 1244423 1242731 1239464
52198 1239464 1234769 1228276 1219380 1208002 1194929 1181044 1166438 1150707 1133821 1116102 1097641 1078547
52186 1078547 1059588 1041636 1024441 1006906 988692 970686 953739 937898 923196 910196 899154
52175 899154 889281 879401 868946 858073 847304 837312 828458 820286 812016 803714 796284 790166 784847
52162 784847 779920 775676 772156 768546 764207 759557 755161 750630 745261 739298 733590 728360 723172 718010
52148 718010 713510 710044 707250 704586 701875 699159 696430 693650 690864 688109 685310 682224 678536 674243
52134 674243 669975 666638 664528 663048 661469 659674 657898 655975 653257 649266 644274 639270 635364 633021
52120 633021 631692 630277 628017 624875 621166 617138 613020 609257 606455 605050 604889 605095 604634 603272 601818
$$ packed form
52211A150559J4762J3521J2745J2180J0918Q982P243N990M598K602L23j692l267
52198A239464m695o493q896j1378j3073j3885j4606j5731j6886j7719j8461j9094
52186A078547j8959j7952j7195j7535j8214j8006j6947j5841j4702j3000j1042
52175H99154r873r880j0455j0873j0769r992q854q172q270q302p430o118n319
52162G84847m927m244l520l610m339m650m396m531n369n963n708n230n188n162
52148G18010m500l466k794k664k711k716k729k780k786k755k799l086l688m293
52134F74243m268l337k110j480j579j795j776j923k718l991m992n004l906k343
52120F33021j329j415k260l142l709m028m118l763k802j405j61K06m61j362j454
$$ plain form
52105 601818 601154 601299 601769 602480 603744 605600 607770 610195 613062 616431 620326 625011 630575 636570 642836
52090 642836 650371 660340 672379 684955 697489 710926 725993 742231 759320 778137 799540 822903
52078 822903 846870 871051 896117 922497 949711 976889 1003456 1029400 1055140 1081015 1106778
52067 1106778 1131878 1156174 1179816 1202390 1222980 1241349 1258278 1274365 1289180 1302017 1312682
52056 1312682 1321033 1326455 1328596 1328068 1325729 1321602 1315131 1306125 1294897 1281845 1267482 1252591 1237758
52043 1237758 1222938 1207863 1192651 1177625 1162860 1148311 1134100 1120382 1107222 1094863 1083705
52032 1083705 1073818 1064907 1057015 1050708 1046281 1043417 1041924 1042118 1044111 1047475 1052076 1058450 1066758 1076215
52018 1076215 1086272 1097584 1110864 1125405 1139698 1153014 1165457 1177002 1187575 1197719 1208017
$$ packed form
52105F01818o64J45M70P11J264J856K170K425K867L369L895M685N564N995O266
52090F42836P535R969J2039J2576J2534J3437J5067J6238J7089J8817K1403K3363
52078H22903K3967K4181K5066K6380K7214K7178K6567K5944K5740K5875K5763
52067A106778K5100K4296K3642K2574K0590J8369J6929J6087J4815J2837J0665
52056A312682Q351N422K141n28k339m127o471r006j1228j3052j4363j4891j4833
52043A237758j4820j5075j5212j5026j4765j4549j4211j3718j3160j2359j1158
52032A083705r887q911p892o307m427k864j493J94J993L364M601O374Q308R457
52018A076215J0057J1312J3280J4541J4293J3316J2443J1545J0573J0144J0298
$$ plain form
52007 1208017 1217980 1226510 1233377 1239214 1244082 1247071 1247457 1245394 1241198 1234703 1225638 1214064 1200188 1184096
51993 1184096 1165801 1145258 1122394 1097515 1071528 1045308 1018867 991604 963202 933899 904067
51982 904067 874070 844318 814911 785410 755533 725906 697488 670459 644349 619119 595266
51971 595266 572891 551465 530653 510634 491495 473053 455552 439813 426282 414382 403189
51960 403189 392329 381877 371759 361724 351832 342666 334982 329142 324725 320786 316636 312325 308200
51947 308200 304177 299842 295159 290687 287007 284199 281976 280037 278180 276194 273792 270719 267031 263208
51933 263208 259770 256753 253889 251323 249649 249028 248746 248026 246858 245704 244829 244360 244498 245132 245556 245178
51917 245178 244231 243283 242406 241403 240472 239967 239790 239690 239874 240417 240345 238318 234341 229939 226408 223642 220925
$$ packed form
52007A208017R963Q530O867N837M868K989L86k063m196o495r065j1574j3876j6092
51993A184096j8295k0543k2864k4879k5987k6220k6441k7263k8402k9303k9832
51982I04067k9997k9752k9407k9501k9877k9627k8418k7029k6110k5230k3853
51971E95266k2375k1426k0812k0019j9139j8442j7501j5739j3531j1900j1193
51960D03189j0860j0452j0118j0035r892r166p684n840m417l939m150m311m125
51947C08200m023m335m683m472l680k808k223j939j857j986k402l073l688l823
51933B63208l438l017k864k566j674o21k82p20j168j154q75m69J38O34M24l78
51917B45178r47r48q77j003r31n05j77j00J84N43p2k027l977m402l531k766k717
$$ plain form
51900 220925 218185 216064 215097 215129 215321 214688 212914 210624 208580 206807 204941 203157 202059 201711 201504 201021
51884 201021 200290 199159 197242 194769 192714 191680 191283 191039 191191 192043 193032 193278 192877 192912 194031 195571 196356
51867 196356 196027 195255 194772 194572 194218 193684 193563 194417 196236 198538 200726 202241 202783 202657 202637 203179 204016 204740
51849 204740 205480 206593 208027 209419 210661 211940 213379 214975 216750 218527 219825 220458 221051 222453 224690
51834 224690 227016 228930 230635 232502 234524 236432 237980 239077 239827 240379 240540 239748 237760 235138 232639
51819 232639 230376 228043 225765 224086 223164 222565 221906 221238 220682 220089 219206 217987 216775 216285 217151 219201
51803 219201 221430 223022 224083 225048 225875 226463 227394 229362 231971 234002 234911 235383 236283 237732 239354 240812
51787 240812 241890 242483 242642 242348 241374 239784 238348 237790 237671 236764 234622 232175 230646 230470 231321 232584
$$ packed form
51900B20925k740k121r67L2J92o33j774k290k044j773j866j784j098l48k07m83
51884B01021p31j131j917k473k055j034l97k44J52Q52R89K46m01L5J119J540P85
51867A96356l29p72m83k00l54n34j21Q54J819K302K188J515N42j26k0N42Q37P24
51849B04740P40J113J434J392J242J279J439J596J775J777J298O33N93J402K237
51834B24690K326J914J705J867K022J908J548J097P50N52J61p92j988k622k499
51819B32639k263k333k278j679r22n99o59o68n56n93q83j219j212m90Q66K050
51803B19201K229J592J061R65Q27N88R31J968K609K031R09M72R00J449J622J458
51787B40812J078N93J59k94r74j590j436n58j19r07k142k447j529j76Q51J263
$$ plain form
51771 232584 233603 233978 233946 234089 234587 235106 235477 236017 237096 238707 240541 242169 243275 244064 245262 247344
51755 247344 249965 252607 255413 258736 262172 264916 266909 268795 270801 272535 273928 275456 277348 279371
51741 279371 281517 284099 287111 290277 293826 298259 303276 307970 312359 317637 324507 332261 340063 348154
51727 348154 357196 367263 378223 390317 403551 417040 429718 441176 451070 458201 461085 459343
51715 459343 454020 446695 438698 430826 423240 415711 408235 401144 394494 387892 381349 375715 371615 368299
51701 368299 364257 358891 352978 347527 342677 337906 332962 328251 324235 320611 316477 311528 306744 303408
51687 303408 301647 300507 299249 297861 296385 294635 292707 291002 289593 288446 288368 290624 295030 299385 301536
51672 301536 301288 299674 297142 293453 288891 284558 281479 279934 279518 279470 279217 278972 279462 280792 282136 282953
$$ packed form
51771B32584J019L75l2J43M98N19L71N40J079J611J834J628J106P89J198K082
51755B47344K621K642K806L323L436K744J993J886K006J734J393J528J892K023
51741B79371K146K582L012L166L549M433N017M694M389N278O870P754P802Q091
51727C48154R042J0067J0960J2094J3234J3489J2678J1458R894P131K884j742
51715D59343n323p325p997p872p586p529p476p091o650o602o543n634m100l316
51701C68299m042n366n913n451m850m771m944m711m016l624m134m949m784l336
51687C03408j761j140j258j388j476j750j928j705j409j147p8K256M406M355K151
51672C01536k48j614k532l689m562m333l079j545m16m8k53k45M90J330J344Q17
$$ plain form
51656 282953 283931 286143 289855 294770 300836 307903 315053 321299 326845 332778 339455 345908 350895 353930
51642 353930 355216 355169 354202 352488 349666 345000 338088 329415 320238 311828 304577 297774 290560 283104 276417
51627 276417 270884 265642 259751 253446 247742 243218 239698 236772 234113 231489 228915 226592 224470 222195
51613 222195 219746 217611 215965 214290 212281 210591 209956 210071 210046 209557 208792 207652 205959 204243 203335 203151
51597 203151 202732 201590 200275 199427 198957 198415 197701 197141 197224 198327 200335 202514 204182 205532 207403 210214
51581 210214 213530 216672 219339 221597 223785 226539 230435 235350 240499 245312 250031 255325 261561 268623
51567 268623 276208 284105 292281 300817 309730 318827 327733 336000 343162 348803 352693 354770 354880 352767
51553 352767 348452 342512 335783 328872 321959 314943 307707 300508 294188 289729 287365 286470 286401 287090 288566
$$ packed form
51656B82953R78K212L712M915O066P067P150O246N546N933O677O453M987L035
51642C53930J286m7r67j714k822m666o912q673r177q410p251o803p214p456o687
51627B76417n533n242n891o305n704m524l520k926k659k624k574k323k122k275
51613B22195k449k135j646j675k009j690o35J15k5m89p65j140j693j716r08j84
51597B03151m19j142j315q48m70n42p14n60Q3J103K008K179J668J350J871K811
51581B10214L316L142K667K258K188K754L896M915N149M813M719N294O236P062
51567B68623P585P897Q176Q536Q913R097Q906Q267P162N641L890K077J10k113
51553C52767m315n940o729o911o913p016p236p199o320m459k364q95o9O89J476
$$ plain form
51538 288566 290421 292324 294826 299053 305519 313547 321946 330101 338372 347478 357484 367527 376696 384952
51524 384952 392694 399637 404932 408470 411158 413490 414748 414282 412755 411159 409103 405230 399347 393150
51510 393150 388609 386255 385302 384935 385105 386224 388342 390824 392987 394923 397248 399961 402147 403094 403111 402745
51494 402745 401745 399420 395628 390735 384950 378419 371775 365813 360644 355689 350476 345057 339803 335250
51480 335250 331864 329397 326745 323085 319004 315852 314129 313223 312546 312108 311971 311993 312359 313629 315864 318258
51464 318258 320012 321265 322840 325341 328731 332599 336627 340824 345397 350364 355465 360474 365462 370669
51450 370669 376401 383076 390911 399322 407257 414551 422405 431880 442384 452322 460874 468330 474947 480432
51436 480432 484528 487265 488547 488182 486392 483660 480016 475154 469368 463750 459278 456204 454441 453972 454669
$$ packed form
51538B88566J855J903K502M227O466Q028Q399Q155Q271R106J0006J0043R169Q256
51524C84952P742O943N295L538K688K332J258m66j527j596k056l873n883o197
51510C93150m541k354r53l67J70J119K118K482K163J936K325K713K186R47J7l66
51494D02745j000k325l792m893n785o531o644n962n169m955n213n419n254m553
51480C35250l386k467k652l660m081l152j723r06o77m38j37K2L66J270K235K394
51464C18258J754J253J575K501L390L868M028M197M573M967N101N009M988N207
51450C70669N732O675P835Q411P935P294P854R475J0504R938Q552P456O617N485
51436D80432M096K737J282l65j790k732l644m862n786n618m472l074j763m69O97
$$ plain form
51421 454669 456174 458152 460365 462469 464115 465281 466101 466327 465382 462924 459036 453903 447665 440514 432558
51406 432558 423729 414229 404810 396064 387674 378976 370032 361479 353450 345503 337576 330215 323728 317898
51392 317898 312604 308017 304018 300203 296670 294098 292782 292253 292148 292799 294641 297632 301554 306337 311690
51377 311690 316968 321827 326569 331487 336239 340154 342762 343735 342695 339428 334045 326753 317820 307930
51363 307930 298106 288893 279921 270592 260970 251700 243206 235213 227073 218556 210320 203400 198053 193420
51349 193420 188663 184004 180089 176712 173107 169420 166782 165707 165281 164348 162753 161014 159445 158157 157453
51334 157453 157589 158372 159324 160065 160354 160098 159529 159009 158501 157589 156174 154741 153772 153301 153185 153353 153633 153847
51316 153847 154269 155448 157372 159337 160920 162598 165069 168450 172474 176952 181599 185868 189475 192913
$$ packed form
51421D54669J505J978K213K104J646J166Q20K26r45k458l888n133o238p151p956
51406D32558q829r500r419q746q390q698q944q553q029p947p927p361o487n830
51392C17898n294m587l999l815l533k572j316n29j05O51J842K991L922M783N353
51377C11690N278M859M742M918M752L915K608R73j040l267n383p292q933r890
51363C07930r824r213q972r329r622r270q494p993q140q517q236o920n347m633
51349A93420m757m659l915l377l605l687k638j075m26r33j595j739j569j288p04
51334A57453J36P83R52P41K89k56n69n20n08r12j415j433r69m71j16J68K80K14
51316A53847M22J179J924J965J583J678K471L381M024M478M647M269L607L438
$$ plain form
51302 192913 197069 202431 208848 215854 223109 230768 239348 248859 258147 265810 271800 277391 283323 288743
51288 288743 292294 293451 292307 288878 283449 277038 270634 264134 256757 248360 239754 231765 224480 217437
51274 217437 210205 202766 195514 188834 182648 176643 170950 166100 162165 158445 154387 150310 146845 144089
51260 144089 141739 139630 137688 135703 133629 131820 130487 129272 127799 126364 125503 125141 124732 124121 123753
51245 123753 124081 125151 126622 127896 128434 128435 128947 130785 133422 135480 136368 136917 138288 140673 143292 145379
51229 145379 146875 148157 149321 149924 149521 148289 146854 145548 144178 142585 141063 140005 139392 138840 137997
51214 137997 136817 135647 135062 135295 135764 135549 134498 133464 133292 133947 134848 135616 136211 136610 136695 136353 135561 134599
51196 134599 134144 134764 136184 137505 138240 138681 139168 139645 140155 141117 142671 144289 145462 146275 146895 147025 146437
$$ packed form
51302A92913M156N362O417P006P255P659Q580R511R288P663N990N591N932N420
51288B88743L551J157j144l429n429o411o404o500p377q397q606p989p285p043
51274B17437p232p439p252o680o186o005n693m850l935l720m058m077l465k756
51260A44089k350k109j942j985k074j809j333j215j473j435q61l62m09o11l68
51245A23753L28J070J471J274N38JN12J838K637K058Q88N49J371K385K619K087
51229A45379J496J282J164O03m03j232j435j306j370j593j522j058o13n52q43
51214A37997j180j170n85K33M69k15j051j034j72O55R01P68N95L99Q5l42p92r62
51196A34599m55O20J420J321P35M41M87M77N10R62J554J618J173Q13O20J30n88
$$ plain form
51179 146437 145594 145104 144828 144095 142624 140739 138886 137331 136249 135741 135849 136703 138341 140244 141537 141924
51163 141924 141962 142112 142084 141571 141072 141331 142363 143629 144840 145991 146938 147612 148354 149430 150438 150800 150630
51146 150630 150464 150294 149559 148042 146187 144496 143082 141753 140142 137855 134957 132151 130081 128636 127394
51131 127394 126518 126530 127276 127797 127353 126136 124902 124283 124491 125335 126409 127466 128584 129834 131046 132146
51115 132146 133425 135107 136920 138584 140443 143082 146527 150341 154356 158714 163200 167115 169911 171577
51101 171577 172354 172409 171815 170604 168833 166789 164861 163044 160874 158206 155662 153893 152775 151948 151761 152857
51085 152857 154928 156684 157168 156531 155480 154520 153805 153137 151993 150046 147778 146099 145271 144692 143888 143132
51069 143132 142785 142540 141780 140540 139692 140107 141809 144010 145905 147277 148255 148756 148553 147819 147038 146240 144923
$$ packed form
51179A46437q43m90k76p33j471j885j853j555j082n08J08Q54J638J903J293L87
51163A41924L8J50k8n13m99K59J032J266J211J151R47O74P42J076J008L62j70
51146A50630j66j70p35j517j855j691j414j329j611k287k898k806k070j445j242
51131A27394q76J2P46N21m44j217j234o19K08Q44J074J057J118J250J212J100
51115A32146J279J682J813J664J859K639L445L814M015M358M486L915K796J666
51101A71577P77N5n94j211j771k044j928j817k170k668k544j769j118q27j87J096
51085A52857K071J756M84o37j051r60p15o68j144j947k268j679q28n79q04p56
51069A43132l47k45p60j240q48M15J702K201J895J372R78N01k03p34p81p98j317
$$ plain form
51052 144923 143049 141528 141211 141824 142520 143109 144106 145774 147763 149556 150727 150909 150175 149380 149600 151125
51036 151125 153370 155655 157698 159518 161426 164019 167663 171973 176192 179985 183539 187049 190570 194215
51022 194215 197994 201591 204674 207235 209175 209907 209006 207044 205105 203624 202328 201166 200566 200730 201368
51007 201368 202228 203336 204684 206183 207880 209829 211831 213794 216136 219237 222702 225865 228887 232600
50993 232600 237340 242725 248609 255385 263203 271562 279896 288039 296070 304309 313492 324297 336639 350049
50979 350049 364736 381490 400474 420945 442446 465600 491448 520622 553441 590229 631233
50968 631233 676662 727024 782958 844642 911776 984102 1061384 1142945 1227873 1315639 1405722
50957 1405722 1496632 1586115 1672370 1754129 1829413 1895368 1949854 1992447 2023507 2043084 2051184
$$ packed form
51052A44923j874j521l17O13O96N89R97J668J989J793J171J82p34p95K20J525
51036A51125K245K285K043J820J908K593L644M310M219L793L554L510L521L645
51022A94215L779L597L083K561J940P32r01j962j939j481j296j162o00J64O38
51007B01368Q60J108J348J499J697J949K002J963K342L101L465L163L022L713
50993B32600M740N385N884O776P818Q359Q334Q143Q031Q239R183J0805J2342J3410
50979C50049J4687J6754J8984K0471K1501K3154K5848K9174L2819L6788M1004
50968F31233M5429N0362N5934O1684O7134P2326P7282Q1561Q4928Q7766R0083
50957A405722R0910Q9483Q6255Q1759P5284O5955N4486M2593L1060J9577Q100
$$ plain form
50946 2051184 2048244 2034677 2010659 1977018 1935836 1889641 1840459 1790030 1740266 1692801 1648473
50935 1648473 1607659 1570647 1537166 1506050 1475941 1446073 1416026 1385181 1352800 1318265 1280887
50924 1280887 1240034 1195884 1149534 1101897 1052940 1002519 951410 900915 851920 804982 761002
50913 761002 720984 685127 652682 622726 594786 568910 545512 525021 507468 492477 479679
50902 479679 468809 459377 450830 443292 437568 434015 431875 430153 428665 427786 427597 427838 428416 429480 431168
50887 431168 433569 436714 440388 444252 448287 452731 457495 462283 467450 473925 481910 490442 498756 507275
50873 507275 516674 526790 537317 548839 562168 577159 593251 610735 630444 652476 676325 702165
50861 702165 730960 763269 799022 838597 883207 933922 991146 1055413 1128055 1210629 1304144
$$ packed form
50946B051184k940j3567k4018l3641m1182m6195m9182n0429m9764m7465m4328
50935A648473m0814l7012l3481l1116l0109k9868l0047l0845l2381l4535l7378
50924A280887m0853m4150m6350m7637m8957n0421n1109n0495m8995m6938m3980
50913G61002m0018l5857l2445k9956k7940k5876k3398k0491j7553j4991j2798
50902D79679j0870r432q547p538n724l553k140j722j488q79j89K41N78J064J688
50887D31168K401L145L674L864M035M444M764M788N167O475P985Q532Q314Q519
50873E07275R399J0116J0527J1522J3329J4991J6092J7484J9709K2032K3849K5840
50861G02165K8795L2309L5753L9575M4610N0715N7224O4267P2642Q2574R3515
$$ plain form
50850 1304144 1409111 1526016 1655416 1797789 1953346 2121748 2302005 2492876 2693105
50841 2693105 2900777 3112547 3324009 3530667 3727845 3909683 4069263 4200398 4299192 4363875
50831 4363875 4393855 4389501 4352577 4286356 4195281 4084641 3960386 3828840 3696224 3568041
50821 3568041 3448450 3340046 3244233 3161630 3091834 3032831 2981050 2932223 2882368 2828370 2768305
50810 2768305 2701389 2627300 2545320 2454358 2353990 2245372 2130975 2013512 1895190 1777884
50800 1777884 1663681 1554856 1453122 1359002 1272196 1192617 1120827 1057431 1002313 954617 913258
50789 913258 877373 846568 820963 800798 785774 774958 767434 762800 760866 761178 763127 766264 770213
50776 770213 774445 778411 781743 784106 785052 784348 782211 778969 774672 769319 763259 757002 750738 744236 737127
$$ packed form
50850A304144J04967J16905J29400J42373J55557J68402J80257J90871K00229
50841B693105K07672K11770K11462K06658J97178J81838J59580J31135R8794O4683
50831D363875K9980m354l6924o6221r1075j10640j24255j31546j32616j28183
50821C568041j19591j08404r5813q2603o9796n9003n1781m8827m9855n3998o0065
50810B768305o6916p4089q1980r0962j00368j08618j14397j17463j18322j17306
50800A777884j14203j08825j01734r4120q6806p9579p1790o3396n5118m7696m1359
50789I13258l5885l0805k5605k0165j5024j0816p524m634j934L12J949L137L949
50776G70213M232L966L332K363R46p04k137l242m297n353o060o257o264o502p109
$$ plain form
50761 737127 729128 720295 711345 703437 697224 692285 687819 683793 681093 680673 682848 687291 693481 701291
50747 701291 711344 724618 741490 761442 783928 809224 838171 871403 909177 951564 998433
50736 998433 1049621 1105680 1168192 1238854 1318450 1407095 1505017 1612373 1728538 1852304 1982596
50725 1982596 2118174 2256582 2394188 2527504 2653873 2770687 2874520 2961421 3027714 3070402
50715 3070402 3087288 3077293 3040783 2979715 2897783 2800413 2694065 2584916 2477845 2376273 2282563
50704 2282563 2198438 2125125 2063087 2011624 1968973 1933037 1901784 1872809 1843060 1809693 1771133
50693 1771133 1726849 1676252 1618486 1553454 1482565 1408319 1333411 1260099 1189834 1123209 1060477
50682 1060477 1002235 949351 902206 860411 823457 791418 764806 743799 727738 715404 705942
$$ packed form
50761G37127p999q833q950p908o213m939m466m026k700m20K175M443O190P810
50747G01291J0053J3274J6872J9952K2486K5296K8947L3232L7774M2387M6869
50736I98433N1188N6059O2512P0662P9596Q8645R7922J07356J16165J23766J30292
50725A982596J35578J38408J37606J33316J26369J16814J03833Q6901O6293M2688
50715C070402J6886r995l6510o1068q1932r7370j06348j09149j07071j01572r3710
50704B282563q4125p3313o2038n1463m2651l5936l1253k8975k9749l3367l8560
50693A771133m4284n0597n7766o5032p0889p4246p4908p3312p0265o6625o2732
50682A060477n8242n2884m7145m1795l6954l2039k6612k1007j6061j2334r462
$$ plain form
50671 705942 699506 696892 698572 704388 714113 727698 744700 764160 785529 809066 834641 860677
50659 860677 885192 907546 928317 947745 965383 981202 995830 1009439 1021343 1031053 1038943 1045533
50647 1045533 1050946 1055532 1060288 1066109 1073156 1081422 1091385 1103672 1118624 1136688 1158690 1185090 1215408
50634 1215408 1248959 1285747 1325962 1368903 1413188 1457905 1502804 1547332 1590109 1629561 1664615
50623 1664615 1694624 1719097 1737886 1751445 1760713 1766820 1770989 1774510 1778529 1783888 1791323 1801759 1816126
50610 1816126 1834669 1856521 1880215 1904625 1929158 1952947 1974268 1991170 2002586 2008472 2008963 2003805
50598 2003805 1992598 1975121 1951083 1919802 1880470 1832850 1777778 1717096 1652978 1587052 1520125
50587 1520125 1452838 1386377 1322143 1260813 1202185 1146084 1092972 1043447 997512 954711 914785
$$ packed form
50671G05942o436k614J680N816R725J3585J7002J9460K1369K3537K5575K6036
50659H60677K4515K2354K0771J9428J7638J5819J4628J3609J1904R710P890O590
50647A045533N413M586M756N821P047Q266R963J2287J4952J8064K2002K6400L0318
50634A215408L3551L6788M0215M2941M4285M4717M4899M4528M2777L9452L5054
50623A664615L0009K4473J8789J3559R268O107M169L521M019N359P435J0436J4367
50610A816126J8543K1852K3694K4410K4533K3789K1321J6902J1416N886M91n158
50598B003805j1207j7477k4038l1281l9332m7620n5072o0682o4118o5926o6927
50587A520125o7287o6461o4234o1330n8628n6101n3112m9525m5935m2801l9926
$$ plain form
50576 914785 877882 844228 813894 786942 763541 743774 727335 713537 701788 692158 685355 681978
50564 681978 681816 683970 687671 692861 700095 709988 722628 737411 753562 770984 790430 812587 837241
50551 837241 863692 891830 922253 955319 990559 1027209 1064866 1103387 1142370 1181025 1218448
50540 1218448 1253863 1286689 1316606 1343557 1367732 1389555 1409673 1428918 1448261 1468724 1491045
50529 1491045 1515389 1541636 1570131 1601854 1637696 1677950 1722823 1772987 1829112 1891097 1958267
50518 1958267 2030072 2105948 2184685 2264610 2344290 2422312 2496334 2563176 2620232 2666250 2700576
50507 2700576 2722256 2730319 2724471 2705031 2672499 2627617 2571730 2506813 2435253 2359809 2283632 2210042
50495 2210042 2142191 2082728 2033528 1995698 1969978 1956927 1956382 1966942 1986498 2013250 2045709 2081767
$$ packed form
50576I14785l6903l3654l0334k6952k3401j9767j6439j3798j1749r630o803l377
50564F81978j62K154L701N190P234R893J2640J4783J6151J7422J9446K2157K4654
50551H37241K6451K8138L0423L3066L5240L6650L7657L8521L8983L8655L7423
50540A218448L5415L2826K9917K6951K4175K1823K0118J9245J9343K0463K2321
50529A491045K4344K6247K8495L1723L5842M0254M4873N0164N6125O1985O7170
50518A958267P1805P5876P8737P9925P9680P8022P4022O6842N7056M6018L4326
50507B700576K1680Q063n848j9440l2532m4882n5887o4917p1560p5444p6177p3590
50495B210042o7851n9463m9200l7830k5720j3051n45J0560J9556K6752L2459L6058
$$ plain form
50483 2081767 2118464 2152804 2182104 2203282 2212578 2206674 2184024 2144895 2090619 2023235 1945529 1860706
50471 1860706 1771772 1681201 1590979 1502751 1417988 1338035 1263825 1195584 1133117 1076351 1025247
50460 1025247 979343 937965 901022 869007 842028 819387 800388 784974 773144 764329 757898 753900
50448 753900 752729 754341 758322 764532 773182 784365 797981 814008 832466 853133 875700 900156
50436 900156 926668 955098 984921 1015694 1047377 1080176 1114285 1149747 1186333 1223402 1260004
50425 1260004 1295249 1328639 1360085 1389593 1416921 1441604 1463322 1482056 1497799 1510377 1519859
50414 1519859 1526911 1532361 1536692 1540463 1545000 1551845 1561440 1573054 1586164 1601153 1618339 1637097 1656549
50401 1656549 1676506 1697059 1717558 1736669 1753284 1766841 1776890 1782838 1784125 1780208 1770355 1753660
$$ packed form
50483B081767L6697L4340K9300K1178R296n904k2650l9129n4276o7384p7706q4823
50471A860706q8934r0571r0222q8228q4763p9953p4210o8241o2467n6766n1104
50460A025247m5904m1378l6943l2015k6979k2641j8999j5414j1830q815o431l998
50448G53900j171J612L981O210Q650J1183J3616J6027J8458K0667K2567K4456
50436I00156K6512K8430K9823L0773L1683L2799L4109L5462L6586L7069L6602
50425A260004L5245L3390L1446K9508K7328K4683K1718J8734J5743J2578R482
50414A519859P052N450M331L771M537O845R595J1614J3110J4989J7186J8758J9452
50401A656549J9957K0553K0499J9111J6615J3557J0049N948J287l917r853j6695
$$ plain form
50389 1753660 1729319 1696846 1656260 1608255 1554017 1494735 1431577 1366231 1301092 1238539 1180228
50378 1180228 1127216 1080373 1040378 1007624 982403 964867 954532 950328 951619 958810 972366 991333
50366 991333 1013271 1035456 1055705 1072316 1083861 1089269 1087854 1079381 1064374 1044128 1020025 992896
50354 992896 963347 932458 901645 871860 843290 815805 789378 764163 740524 718947 699597
50343 699597 682041 665720 650614 637097 625312 615098 606477 599661 594511 590386 586735 583632 581678
50330 581678 581529 583466 587164 591929 597497 604529 613976 625924 639424 653530 668207 684046 701361
50317 701361 719774 738593 757493 776847 797337 819168 841740 864282 886746 909813 933977
50306 933977 958787 983069 1005691 1026060 1044003 1059379 1071938 1081475 1088026 1091793 1092909 1091389
$$ packed form
50389A753660k4341l2473m0586m8005n4238n9282o3158o5346o5139o2553n8311
50378A180228n3012m6843l9995l2754k5221j7536j0335m204J291P191J3556J8967
50366I91333K1938K2185K0249J6611J1545N408j415q473j5007k0246k4103k7129
50354I92896k9549l0889l0813k9785k8570k7485k6427k5215k3639k1577j9350
50343F99597j7556j6321j5106j3517j1785j0214q621o816n150m125l651l103j954
50330E81678j49J937L698M765N568P032R447J1948J3500J4106J4677J5839J7315
50317G01361J8413J8819J8900J9354K0490K1831K2572K2542K2464K3067K4164
50306I33977K4810K4282K2622K0369J7943J5376J2559R537O551L767J116j520
$$ plain form
50294 1091389 1087290 1080772 1071981 1060996 1047927 1032976 1016572 999529 982842 966840 950585 932578
50282 932578 912200 890166 867529 844736 821795 798814 776051 753751 732306 712253 693825
50271 693825 676739 660685 645726 631995 619296 607340 596065 585459 575309 565427 555863 546649
50259 546649 537666 529033 521304 514950 509898 505817 502447 499383 496059 492453 489399 487654 486989 486685 486584
50244 486584 487017 488026 489379 491211 493944 497620 501878 506563 511761 517222 522351 526892 531158 535438
50230 535438 539595 543263 546216 548502 550545 552973 555984 558959 561060 562139 562682 563058 563237 563025 561989
50215 561989 559340 554653 548789 543411 539375 536102 532695 529031 525489 522206 519159 516626 515001 514230
50201 514230 513866 513718 514186 515850 518854 522825 527372 532467 538179 544158 549735 554643 559272 564000 568589
$$ packed form
50294A091389m099o518q791j0985j3069j4951j6404j7043j6687j6002j6255j8007
50282I32578k0378k2034k2637k2793k2941k2981k2763k2300k1445k0053j8428
50271F93825j7086j6054j4959j3731j2699j1956j1275j0606j0150r882r564r214
50259E46649q983q633p729o354n052m081l370l064l324l606l054j745o65l04j01
50244D86584M33J009J353J832K733L676M258M685N198N461N129M541M266M280
50230E35438M157L668K953K286K043K428L011K975K101J079N43L76J79k12j036
50215E61989k649m687n864n378m036l273l407l664l542l283l047k533j625p71
50201E14230l64j48M68J664L004L971M547N095N712N979N577M908M629M728M589
$$ plain form
50186 568589 572548 575876 579051 582379 585646 588335 589976 590347 589558 587840 585176 581342 576329 570289 563019
50171 563019 554085 543865 533894 525671 519477 514749 511083 508307 506175 504817 505045 507313 510593 513080
50157 513080 513823 512894 510316 505846 499763 492806 485281 477115 468809 461326 454890 448881 443124 438268 434478
50142 434478 430839 426715 422850 420335 418980 417524 415210 412582 410808 410584 411584 412798 413560 414182 415256
50127 415256 416568 417372 417757 418898 421702 425932 430947 436505 442406 448095 453239 458191 463351 468604 473831
50112 473831 479311 484920 489563 492293 493648 495027 496823 498036 497705 496063 494146 492746 491909 491029 489357
50097 489357 486680 483500 480364 477151 473393 469137 465065 461779 459423 458059 457987 459425 462072 465176 468052
50082 468052 470559 473232 476942 482263 489042 496643 504583 512915 522036 532272 543713 556334 570111
$$ packed form
50186E68589L959L328L175L328L267K689J641L71p89j718k664l834n013o040p270
50171E63019q934j0220r971q223o194m728l666k776k132j358K28K268L280K487
50157E13080P43r29k578m470o083o957p525q166q306p483o436o009n757m856l790
50142D34478l639m124l865k515j355j456k314k628j774k24J000J214P62O22J074
50127D15256J312Q04L85J141K804M230N015N558N901N689N144M952N160N253N227
50112D73831N480N609M643K730J355J379J796J213l31j642j917j400q37q80j672
50097D89357k677l180l136l213l758m256m072l286k356j364p2J438K647L104K876
50082D68052K507K673L710N321O779P601P940Q332R121J0236J1441J2621J3777
$$ plain form
50069 570111 584852 600033 615053 629764 644524 659571 674612 689194 703183 716494 728645
50058 728645 739062 747710 754868 760409 763850 765165 765006 763987 762224 759662 756301 751966 746365 739661
50044 739661 732542 725589 718956 712829 707612 703386 699647 695935 692340 689111 686244 683791 682155 681619
50030 681619 681803 682002 681839 681355 680723 680194 680080 680430 680804 680513 678988 675930 671439 666057 660299 654033 646777
50013 646777 638646 630474 622810 615390 607957 600956 594986 590017 585743 582305 580152 579346 579432 579860 580310
49998 580310 580891 582198 584783 588379 592147 595931 600589 606681 613563 620378 627225 634543 641960 648828
49984 648828 655599 663585 673338 684197 695571 707842 721785 737746 755680 775501 797108 820290
49972 820290 844658 869351 892866 913599 930521 943091 950831 953709 952880 950338 947651 945515 944541
$$ packed form
50069E70111J4741J5181J5020J4711J4760J5047J5041J4582J3989J3311J2151
50058G28645J0417Q648P158N541L441J315j59j019j763k562l361m335n601o704
50044G39661p119o953o633o127n217m226l739l712l595l229k867k453j636n36
50030F81619J84J99j63m84o32n29j14L50L74k91j525l058m491n382n758o266p256
50013F46777q131q172p664p420p433p001n970m969m274l438k153q06Q6M28M50
49998E80310N81J307K585L596L768L784M658O092O882O815O847P318P417O868
49984F48828O771P986R753J0859J1374J2271J3943J5961J7934J9821K1607K3182
49972H20290K4368K4693K3515K0733J6922J2570P740K878q29k542k687k136r74
$$ plain form
49959 944541 945687 949471 955171 961140 965568 966726 962938 952876 935941 912251 882523 848146 811066
49946 811066 773242 736093 700503 667077 636163 607715 581472 557338 535504 516108 498805
49935 498805 482839 467696 453672 441651 432224 425089 419322 414040 408751 403351 398055 393252 389201
49922 389201 385885 383234 381332 380208 379505 378588 377077 375263 373975 373882 374761 375493 375012 373179 370544 367435
49906 367435 363817 359963 356576 354017 351978 350190 348893 348254 347890 347428 347040 346957 346928 346709 346654 347214 348236
49889 348236 349413 351079 353817 357518 361587 365870 370632 375700 380450 384713 389014 393853 399356 405658
49875 405658 412925 420877 428939 437078 445880 455639 466016 476947 489353 504486 522870 544209 568144
49862 568144 594821 624858 658887 697093 739172 784712 833275 883739 933844 980982 1023490
$$ packed form
49959I44541J146L784N700N969M428J158l788j0062j6935k3690k9728l4377l7080
49946H11066l7824l7149l5590l3426l0914k8448k6243k4134k1834j9396j7303
49935D98805j5966j5143j4024j2021r427p135n767n282n289n400n296m803m051
49922C89201l316k651j902j124p03r17j511j814j288r3Q79P32m81j833k635l109
49906C67435l618l854l387k559k039j788j297o39l64m62l88q3k9k19n5N60J022
49889C48236J177J666K738L701M069M283M762N068M750M263M301M839N503O302
49875D05658P267P952Q062Q139Q802R759J0377J0931J2406J5133J8384K1339K3935
49862E68144K6677L0037L4029L8206M2079M5540M8563N0464N0105M7138M2508
$$ plain form
49851 1023490 1060936 1093497 1121744 1146856 1170200 1192503 1213966 1235128 1256770 1278814 1300112
49840 1300112 1319508 1336189 1348567 1353834 1349580 1335474 1312830 1283047 1247305 1207320 1165286 1122785
49828 1122785 1080226 1037475 994622 952136 910654 870732 832587 796109 761253 728294 697459
49817 697459 668530 641166 615490 592058 571330 553490 538638 526657 516850 508193 500146 492967
49805 492967 487035 482131 477581 472922 468099 463116 457812 452109 446240 440477 434686 428518 422075 416115
49791 416115 411301 407490 404079 400862 398069 395603 392883 389678 386560 384117 382077 379744 377078 374759
49777 374759 373195 371993 370559 368781 366909 365125 363589 362694 362869 364064 365617 366715 366974 366721 366764 367775
49761 367775 369688 371759 373425 374972 377150 380218 383819 387787 392523 398241 404341 410063 415585 421852
$$ packed form
49851A023490L7446L2561K8247K5112K3344K2303K1463K1162K1642K2044K1298
49840A300112J9396J6681J2378N267m254j4106k2644k9783l5742l9985m2034m2501
49828A122785m2559m2751m2853m2486m1482l9922l8145l6478l4856l2959l0835
49817F97459k8929k7364k5676k3432k0728j7840j4852j1981r807q657q047p179
49805D92967n932m904m550m659m823m983n304n703n869n763n791o168o443n960
49791D16115m814l811l411l217k793k466k720l205l118k443k040k333k666k319
49777C74759j564j202j434j778j872j784j536q95J75J195J553J098K59k53M3J011
49761C67775J913K071J666J547K178L068L601L968M736N718O100N722N522O267
$$ plain form
49747 421852 429376 437759 446537 456020 467099 480616 497089 516706 539283 564486 592256 622764
49735 622764 655933 691391 728992 768648 809208 847929 881839 909524 931268 947822 959752
49724 959752 967878 973582 978375 983471 989827 998115 1008377 1019829 1031019 1039933 1044004 1040633 1028189
49711 1028189 1006669 977351 942005 902452 860597 818415 777612 739266 703958 672245 644677
49700 644677 621133 600540 581880 565385 552067 542056 534217 527603 522375 518736 515858 512786 509752
49687 509752 507616 506360 505206 503969 503194 502947 502511 501494 500314 499362 498481 497622 497160 497129 496809 495615 493866
49670 493866 492276 491125 490370 490109 490442 491198 492200 493564 495345 497181 498669 499936 501517 503759 506539
49655 506539 509456 512130 514388 516229 517532 517980 517627 517382 518303 520247 521779 521716 520394 519172 519081 520214
$$ packed form
49747D21852P524Q383Q778R483J1079J3517J6473J9617K2577K5203K7770L0508
49735F22764L3169L5458L7601L9656M0560L8721L3910K7685K1744J6554J1930
49724I59752Q126N704M793N096O356Q288J0262J1452J1190Q914M071l371j2444
49711A028189k1520k9318l5346l9553m1855m2182m0803l8346l5308l1713k7568
49700F44677k3544k0593j8660j6495j3318j0011p839o614n228l639k878l072l034
49687E09752k136j256j154j237p75k47m36j017j180r52q81q59m62l1l20j194j749
49670D93866j590j151p55k61L33P56J002J364J781J836J488J267J581K242K780
49655E06539K917K674K258J841J303M48l53k45R21J944J532o3j322j222r1J133
$$ plain form
49639 520214 521982 523543 524243 524037 523426 522882 522515 522395 522865 524324 526972 530850 535762 541031 545769 549644
$$ packed form
49639E20214J768J561P00k06o11n44l67j20M70J459K648L878M912N269M738L875
$$ [...]
##END NTUPLES=NMR SPECTRUM
##END=
