
##TITLE=AC1363_CENAH12181_6945775_Yrp4P3u4DM
##JCAMPDX= 6.0         $$ Bruker NMR JCAMP-DX V2.0
##DATA TYPE= NMR SPECTRUM
##DATA CLASS= NTUPLES
##ORIGIN= BRUKER
##OWNER= Administrator
$$ 1.72 TOPSPIN		Version 2.1
$$ 2012-10-18 13:48:03.397 -0700  Administrator@X
$$ Compression mode = diff/dup
##.OBSERVE FREQUENCY= 400.02188249412
##.OBSERVE NUCLEUS= ^1H
##.ACQUISITION MODE= SIMULTANEOUS (DQD)
##.ACQUISITION SCHEME= undefined
##.AVERAGES= 8
##.DIGITISER RES= 22
##SPECTROMETER/DATA SYSTEM= spect
##.PULSE SEQUENCE= zg30
##.SOLVENT NAME= COFFEE_meoh
##.SHIFT REFERENCE= INTERNAL, COFFEE_meoh, 1, 14.98509
##AUDIT TRAIL= $$ (NUMBER, WHEN, WHO, WHERE, PROCESS, VERSION, WHAT)
$$ ##TITLE= Audit trail, TOPSPIN		Version 2.1
$$ ##JCAMPDX= 5.01
$$ ##ORIGIN= Bruker BioSpin GmbH
$$ ##OWNER= Administrator
$$ $$ C:\Bruker\TOPSPIN/data/COFFEE/nmr/AC1363_CENAH12181_6945775_Yrp4P3u4DM/10/pdata/1/auditp.txt
$$ ##AUDIT TRAIL=  $$ (NUMBER, WHEN, WHO, WHERE, PROCESS, VERSION, WHAT)
(   1,<2012-10-14 00:37:47.312 -0500>,<Administrator>,<TOPSPIN>,<go>,<TOPSPIN 2.1>,
      <created by zg
	started at 2012-10-14 00:36:40.500 -0500,
	POWCHK enabled, PULCHK disabled,
       configuration hash MD5:
       6B 1B 68 BB D9 2E 58 E2 7F 35 AD 54 07 DF 0E 41
       data hash MD5: 64K
       EA 17 91 9F 86 22 BB 34 D0 BC FC CA 4E 02 C2 5B>)
(   2,<2012-10-14 00:37:49.937 -0500>,<Administrator>,<TOPSPIN>,<proc1d>,<TOPSPIN 2.1>,
      <Start of raw data processing
       efp LB = 0 FT_mod = 6 PKNL = 1 PHC0 = 0 PHC1 = 0 SI = 32K 
       data hash MD5: 32K
       37 21 41 3A F9 E3 03 2A CC 5E 14 73 15 E6 03 FC>)
(   3,<2012-10-14 00:37:50.343 -0500>,<Administrator>,<TOPSPIN>,<proc1d>,<TOPSPIN 2.1>,
      <pk PHC0 = 182.3511 PHC1 = 0 
       data hash MD5: 32K
       D3 36 91 C8 28 6F 5F 30 C9 8E 77 D4 6D 82 F0 E5>)
(   4,<2012-10-14 00:37:50.453 -0500>,<Administrator>,<TOPSPIN>,<proc1d>,<TOPSPIN 2.1>,
      <abs ABSG = 1 
       data hash MD5: 32K
       27 76 26 62 EA 71 35 C1 43 F3 20 13 0A 62 87 1D>)
(   5,<2012-10-14 00:37:50.500 -0500>,<Administrator>,<TOPSPIN>,<proc1d>,<TOPSPIN 2.1>,
      <abs ABSG = 2 
       data hash MD5: 32K
       D9 76 18 71 05 0F 12 50 F1 CB 42 27 DA 3A 8C EF>)
(   6,<2012-10-14 00:37:50.531 -0500>,<Administrator>,<TOPSPIN>,<proc1d>,<TOPSPIN 2.1>,
      <abs ABSG = 3 
       data hash MD5: 32K
       52 47 DC 35 7E 0D 02 D8 A9 0B 5E B2 A0 38 D3 8A>)
(   7,<2012-10-14 00:37:50.562 -0500>,<Administrator>,<TOPSPIN>,<proc1d>,<TOPSPIN 2.1>,
      <abs ABSG = 4 
       data hash MD5: 32K
       F1 48 3B E1 92 4C 2C 9D 76 28 72 8E 57 48 8D E9>)
(   8,<2012-10-14 00:37:50.578 -0500>,<Administrator>,<TOPSPIN>,<proc1d>,<TOPSPIN 2.1>,
      <abs ABSG = 5 
       data hash MD5: 32K
       A6 8E 1F E6 35 1C 04 F6 AB 1E C3 82 10 36 AD AC>)
(   9,<2012-10-14 00:37:54.187 -0500>,<Administrator>,<TOPSPIN>,<audit>,<TOPSPIN 2.1>,
      <user comment:
       ICON-NMR User ID: COFFEE
       data hash MD5: 32K
       A6 8E 1F E6 35 1C 04 F6 AB 1E C3 82 10 36 AD AC>)
$$ ##END=
$$ [...]
150 150 150 150 150 150 150 150
##$TP07= 0
##$TPNAME0= <>
##$TPNAME1= <>
##$TPNAME2= <>
##$TPNAME3= <>
##$TPNAME4= <>
##$TPNAME5= <>
##$TPNAME6= <>
##$TPNAME7= <>
##$TPOAL= (0..7)
0.5 0.5 0.5 0.5 0.5 0.5 0.5 0.5
##$TPOFFS= (0..7)
0 0 0 0 0 0 0 0
##$TUNHIN= 0
##$TUNHOUT= 0
##$TUNXOUT= 0
##$USERA1= <user>
##$USERA2= <user>
##$USERA3= <user>
##$USERA4= <user>
##$USERA5= <user>
##$V9= 5
##$VALIST= <valist>
##$VCLIST= <CCCCCCCCCCCCCCC>
##$VD= 0
##$VDLIST= <DDDDDDDDDDDDDDD>
##$VPLIST= <PPPPPPPPPPPPPPP>
##$VTLIST= <TTTTTTTTTTTTTTT>
##$WBST= 2048
##$WBSW= 25
##$XGAIN= (0..3)
0 0 0 0
##$XL= 0
##$YL= 0
##$YMAX_a= 503711
##$YMIN_a= -645236
##$ZGOPTNS= <>
##$ZL1= 120
##$ZL2= 120
##$ZL3= 120
##$ZL4= 120
##$ABSF1= 14.98509
##$ABSF2= -5.573092
##$ABSG= 5
##$ABSL= 3
##$ALPHA= 0
##$AQORDER= 0
##$ASSFAC= 0
##$ASSFACI= 0
##$ASSFACX= 0
##$ASSWID= 0
##$AUNMP= <proc_prof1d_extract_pilot.lims>
##$AXLEFT= 0
##$AXNAME= <>
##$AXNUC= <1H>
##$AXRIGHT= 0
##$AXTYPE= 0
##$AXUNIT= <>
##$AZFE= 0.1
##$AZFW= 0.1
##$BCFW= 0
##$BC_mod= 0
##$BYTORDP= 0
##$COROFFS= 0
##$CY= 15
##$DATMOD= 1
##$DC= 0
##$DFILT= <>
##$DTYPP= 0
##$F1P= 0
##$F2P= 0
##$FCOR= 0.5
##$FTSIZE= 32768
##$FT_mod= 6
##$GAMMA= 0
##$GB= 0
##$INTBC= 1
##$INTSCL= 1
##$ISEN= 128
##$LB= 0
##$LEV0= 0
##$LPBIN= 0
##$MAXI= 10000
##$MC2= 0
##$MEAN= 0
##$ME_mod= 0
##$MI= 0
##$NCOEF= 0
##$NC_proc= -8
##$NLEV= 6
##$NOISF1= 0
##$NOISF2= 0
##$NSP= 0
##$NTH_PI= 0
##$NZP= 0
##$OFFSET= 14.98509
##$PC= 1
##$PHC0= 182.3511
##$PHC1= 0
##$PH_mod= 1
##$PKNL= yes
##$PPARMOD= 0
##$PPDIAG= 0
##$PPIPTYP= 0
##$PPMPNUM= 2147483647
##$PPRESOL= 1
##$PSCAL= 4
##$PSIGN= 0
##$PYNMP= <proc.py>
##$REVERSE= no
##$SF= 400.02
##$SI= 32768
##$SIGF1= 0
##$SIGF2= 0
##$SINO= 400
##$SIOLD= 32768
##$SPECTYP= <>
##$SREGLST= <1H.CDCl3>
##$SSB= 0
##$STSI= 32768
##$STSR= 0
##$SW_p= 8223.68421052631
##$SYMM= 0
##$S_DEV= 0
##$TDeff= 65536
##$TDoff= 0
##$TI= <>
##$TILT= no
##$TM1= 0
##$TM2= 0
##$TOPLEV= 0
##$USERP1= <user>
##$USERP2= <user>
##$USERP3= <user>
##$USERP4= <user>
##$USERP5= <user>
##$WDW= 1
##$XDIM= 32768
##$YMAX_p= 450718558
##$YMIN_p= -750743
##$CURPLOT= <Network HP LaserJet P1505>
##$CURPRIN= <$Network HP LaserJet P1505>
##$DFORMAT= <normdp>
##$LAYOUT= <+/1D_H.xwp>
##$LFORMAT= <normlp>
##$PFORMAT= <normpl>
##$SURQMSG= 1
$$ End of Bruker specific parameters
$$ ---------------------------------
##NTUPLES= NMR SPECTRUM
##VAR_NAME=  FREQUENCY,     SPECTRUM/REAL,   SPECTRUM/IMAG
##SYMBOL=    X,             R,               I
##VAR_TYPE=  INDEPENDENT,   DEPENDENT,       DEPENDENT
##VAR_FORM=  AFFN,          ASDF,            ASDF
##VAR_DIM=   32768,         32768,           32768
##UNITS=     HZ,            ARBITRARY UNITS, ARBITRARY UNITS
##FACTOR=    0.250966925370066, 1,           1
##FIRST=     8223.43324360094, -123150,      -159518
##LAST=      0,             -3941,           -130092
##MIN=       0,             -750743,         0
##MAX=       8223.43324360094, 450718558,    0
$$ Real data points
##PAGE= N=1
##DATA TABLE= (X++(R..R)), XYDATA
$$ [...]
19560h8497k01299A24115C1526K2642a39844o0192J8420a7529A90047J64038A52141
$$ -88497 -289796 124115 31526 54168 -139844 -200036 -181616 -17529 190047 354085 152141
19548g8781j01159A50040K76120a31236A23650N1513b21292C5631b83526a22970
$$ -78781 -179940 150040 426160 -131236 123650 175163 -221292 35631 -283526 -122970
19537b57462L7242B65278B5702d0312B58638d02906H9113l0029h7656j34023C44772
$$ -257462 -220220 265278 25702 -40312 258638 -402906 89113 59084 -87656 -221679 344772
19525D9327J3919f9563C4744f329j4695j6229A0756b05361D5305Q0765f8520l6312
$$ 49327 63246 -69563 34744 -6329 -21024 -37253 10756 -205361 45305 126070 -68520 -104832
19513a04832q4603A98521E5009n880J90995E5430A3252b46996B1040a16398J4192
$$ -104832 -189435 198521 55009 49129 240124 55430 13252 -246996 21040 -116398 -102206
19502a02206B17a49028N6877O248m4920D6684a78745b5172n4423k42735E1681
$$ -102206 217 -149028 -92151 -85903 -130823 46684 -178745 -25172 -79595 -322330 51681
19490C9352b10379g9083n4724N5218B3754b38589H9858g1736F5375b46381A71504
$$ 39352 -210379 -79083 -133807 -78589 23754 -238589 89858 -71736 65375 -246381 171504
19478f3897m51260C031a0721j91865P8790j12742A00059g9259A2987a66117M9297
$$ -63897 -515157 3031 -10721 -202586 -123796 -236538 100059 -79259 12987 -166117 -116820
19467a16820D0279O5858J39451a92930I9259d9795b4026k5174j15850N3948C7367
$$ -116820 40279 106137 245588 -192930 99259 -49795 -24026 -49200 -165050 -111102 37367
19455C9627J81399I3774i9715k04101a5457j51244m3135J8294b508o2710o2887
$$ 39627 221026 93774 -99715 -303816 -15457 -166701 -209836 -191542 -2508 -65218 -128105
19444a28105D823a58669C4786a67742q1067n6088a27414A35580n3061O9593q435
$$ -128105 4823 -158669 34786 -167742 -248809 -304897 -127414 135580 82519 152112 143677
19433A43677a12819d5958j29763b3182B22615h1663A2321c16650B60811C0258
$$ 143677 -112819 -45958 -175721 -23182 222615 -81663 12321 -316650 260811 30258
19422b5087l4484k1015l041n8968p9472B33276C1478a12102L8461j02133I3367
$$ -25087 -59571 -80586 -83627 -142595 -222067 233276 31478 -112102 -73641 -175774 93367
19410b53170N6633C13173h849F7433d2678o2848a8779j32472P0759B5457a34988
$$ -253170 -196537 313173 -8849 67433 -42678 -105526 -18779 -151251 -80492 25457 -134988
19398D02202i1k32045h9724B84246J07560C6896J76766e1269j69428Q9077J2787
$$ 402202 -91 -232136 -89724 284246 391806 36896 213662 -51269 -220697 -131620 -118833
19387a18833D4909a70003B12916a16882C3357J16663n0016a2823j32323d4547
$$ -118833 44909 -170003 212916 -116882 33357 150020 100004 -12823 -145146 -44547
19376b04871R9295B923Q700a44562A92994I3521b2533A02557l9853c63851I9810
$$ -204871 -105576 2923 11623 -144562 192994 93521 -22533 102557 62704 -363851 99810
19364d61890h72C4527b37333H8030a70617j53798a49425k80474G9764k1851B2399
$$ -461890 -872 34527 -237333 88030 -170617 -324415 -149425 -429899 79764 57913 22399
19352a03848a6871o1276E263g7238A06980b70549R6984A32727b34953d1123D15095
$$ -103848 -16871 -78147 5263 -77238 106980 -270549 -173565 132727 -234953 -41123 415095
19340i7159J0224A29783b24467O4681O5506A57497a16396k7500A01312c35765
$$ -97159 -86935 129783 -224467 -159786 -94280 157497 -116396 -143896 101312 -335765
19329f2628j1199m3711A44458a5882m4880m2180d2253F1291d01352K0013b7034
$$ -62628 -73827 -117538 144458 -15882 -60762 -102942 -42253 61291 -401352 -381339 -27034
19317A3904a53947B75229e0113A94405d25285O1442c7730J4560B49739b14388
$$ 13904 -153947 275229 -50113 194405 -425285 -363843 -37730 -23170 249739 -214388
19306a76379C7821D328c05702N392A73035G7440P8628f1821A04377h5300A06926
$$ -176379 37821 4328 -305702 -300310 173035 77440 156068 -61821 104377 -85300 106926
19294a18884o9236A20692J9814n1421b34570L5163g983q8660A46144a87922C276
$$ -118884 -188120 120692 140506 89085 -234570 -199407 -7983 -96643 146144 -187922 3276
19282e2160F4300g9002K2581j6557j6433D89164k21391b4308l40815J31363Q269
$$ -52160 64300 -79002 -56421 -72978 -89411 489164 267773 -24308 -365123 -233760 -225491
19271b25491M6874b0523A60480a14154A25113a19349a8303k9387j50155P5556
$$ -225491 -178617 -20523 160480 -114154 125113 -119349 -18303 -47690 -197845 -122289
19261a22289c1555j30456A83358b58391R2405Q154a8094n4785H7553b08856c5101
$$ -122289 -31555 -162011 183358 -258391 -165986 -157832 -18094 -72879 87553 -208856 -35101
19249A5694a71775D880a26292p2552A2573f8896k70100A57423e5500F1743b41566
$$ 15694 -171775 4880 -126292 -198844 12573 -68896 -338996 157423 -55500 61743 -241566
19237D5285L87242b44501H5634k3434J41526A8292e7763D625c23596A35299a45161
$$ 45285 432527 -244501 85634 62200 203726 18292 -57763 4625 -323596 135299 -145161
19225b07665i6846A05372b07836f5362q7037A45589d5245D0026a96960F6960a03946
$$ -207665 -96846 105372 -207836 -65362 -152399 145589 -45245 40026 -196960 66960 -103946
19213b67944c9612l52773J85287f5150r5703d4207A08499J3064a74911g5860I213
$$ -267944 -39612 -392385 -207098 -65150 -160853 -44207 108499 121563 -174911 -75860 9213
19201b36498H967e35697C5353i9641I0221f3635C2900Q8584e7166O189o5249K8437
$$ -236498 8967 -535697 35353 -99641 90221 -63635 32900 121484 -57166 -50977 -116226 -87789
19189h7789A13464J99202c9109H9705J12475d386k23919P7597L7831D8143B4048
$$ -87789 113464 312666 -39109 89705 202180 -4386 -228305 -150708 -112877 48143 24048
19177B20847b4188M605G6285J0946K5736a27559j67450C4987a24845j19369O5401
$$ 220847 -24188 -19583 76285 87231 112967 -127559 -295009 34987 -124845 -244214 -178813
19166a78813A49430b07816F0972d6695j24822b0769j44136r3974n5012b2326k35347
$$ -178813 149430 -207816 60972 -46695 -171517 -20769 -164905 -258879 -313891 -22326 -257673
19155b57673A72658b48684B0635J70978c1829A58521O3626b79354f9831L1940
$$ -257673 172658 -248684 20635 191613 -31829 158521 222147 -279354 -69831 -37891
19145c7891A22561a94607h2081D3672J34119A5726L7915K62632A29783e4041A7027
$$ -37891 122561 -194607 -82081 43672 177791 15726 53641 316273 129783 -54041 17027
19133d33919g8682k62351h795k04085P4376A25533K75035j23494A4906a44413
$$ -433919 -78682 -341033 -8795 -212880 -138504 125533 400568 277074 14906 -144413
19122i0611A31126l6622B1546a39516O5288Q133j20067O7355J5063j1626l5991
$$ -90611 131126 94504 21546 -139516 -74228 -66095 -186162 -118807 -103744 -115370 -151361
19111a51361A2327O9262a21777j80339p259a19820F418M8348a59310A14535l5977
$$ -151361 12327 81589 -121777 -302116 -309375 -119820 6418 54766 -159310 114535 78558
19100G8558c7042j86447A24519g5527o1398f0306j3336F6164a29302A69816e12645
$$ 78558 -37042 -223489 124519 -75527 -136925 -60306 -73642 66164 -129302 169816 -512645
19088b38048G2727a11924o3568A70107K23c7704G9208a40421A2411a74743n1312
$$ -238048 72727 -111924 -175492 170107 170330 -37704 79208 -140421 12411 -174743 -226055
19077b26055B28674h0519j27647q6962F9743J8490c36721A9853d6013H6219b03585
$$ -226055 228674 -80519 -208166 -295128 69743 88233 -336721 19853 -46013 86219 -203585
19065E5173c0593G4046M8999a87303j65801C3196a80874N9865B90900b57916k406
$$ 55173 -30593 74046 123045 -187303 -353104 33196 -180874 -121009 290900 -257916 -260322
19054b60322l5646d5602A87122a43956K3541m9265j39619d1584r9237n3646G7150
$$ -260322 -295968 -45602 187122 -143956 -120415 -169680 -309299 -41584 -140821 -194467 77150
19042H7722G171a32185N0897j82776E6526K11717a8998k15182I2908i6882I07
$$ 87722 7171 -132185 -81288 -264064 56526 268243 -18998 -234180 92908 -96882 907
19030h8730G7129J83291d0096B67746H1750J30158a7136C58712A03485a27538
$$ -88730 77129 260420 -40096 267746 81750 211908 -17136 358712 103485 -127538
19019a96326l538p4951a00958j84501A9031b0094C42964a98137k2349A786b11379
$$ -196326 -199864 -274815 -100958 -285459 19031 -20094 342964 -198137 -220486 1786 -211379
19007A27729c06737Q7158B46107j10297b11935g7158A67349A909J31060a69196
$$ 127729 -306737 -219579 246107 135810 -211935 -77158 167349 1909 132969 -169196
18996c45388a39947G9967b72426O4702Q4501b1927k82888A17298a0600A7659i7078
$$ -345388 -139947 79967 -272426 -207724 -123223 -21927 -304815 117298 -10600 17659 -97078
18984b23621d0498A03341K8118b4030k16588g2363B01171a41219K8693B05755
$$ -223621 -40498 103341 131459 -24030 -240618 -72363 201171 -141219 -112526 205755
18973b80015j3626B37941a65414M6439M3641r1264B24417a69662J6648B9289a49617
$$ -280015 -293641 237941 -165414 -118975 -75334 -166598 224417 -169662 -153014 29289 -149617
18961f5358o1328B28964R7275H0076K67302j20199a5692j79058e1198j68163c1190
$$ -65358 -126686 228964 326239 80076 347378 227179 -15692 -194750 -51198 -219361 -31190
18949G4542J02945b31262e711B36444r8934a74116f7146C34260a06255C62780
$$ 74542 177487 -231262 -5711 236444 137510 -174116 -67146 334260 -106255 362780
18938a04975C15548b62336C24797A45865l2940B7436g2649O200j27257Q3463k13416
$$ -104975 315548 -262336 324797 145865 112925 27436 -72649 -66449 -193706 -110243 -323659
18927c23659a41304C0173i7945K1240Q165r090b197G7862b15834g388o0108F9619
$$ -323659 -141304 30173 -97945 -76705 -68540 -77630 -2197 77862 -215834 -7388 -67496 69619
18914b0675F9946e1652m8963A14062b21739I5668c49141I4716A1470b53355N0048
$$ -20675 69946 -51652 -100615 114062 -221739 95668 -349141 94716 11470 -253355 -203307
18903b03307N5796F0382L81563A21086b26780i7167j33279E6002f28591B38156
$$ -203307 -147511 60382 441945 121086 -226780 -97167 -230446 56002 -628591 238156
18892a92204m0771f8928H9602C4816j1609e7233F95a40779A20255g0920c2534
$$ -192204 -232975 -68928 89602 34816 23207 -57233 695 -140779 120255 -70920 -32534
18880i6432A37191d8555r4355M9287B66148j13059a49312A9569K4690a09831e2084
$$ -96432 137191 -48555 -142910 -93623 266148 153089 -149312 19569 44259 -109831 -52084
18868b57930A7828c01344f5345m5408J6939I5759a73790k8892K9550g8444A80895
$$ -257930 17828 -301344 -65345 -110753 -93814 95759 -173790 -202682 -173132 -78444 180895
18856B64752a30955j699q3555a04944A10966m3173c83641i2722N40A02063i9441
$$ 264752 -130955 -132654 -216209 -104944 110966 67793 -383641 -92722 -92182 102063 -99441
18844F931a96935h8231B10953a75893P7609A02690M1827b39178P1020Q1525a1689
$$ 6931 -196935 -88231 210953 -175893 -98284 102690 144517 -239178 -168158 -86633 -11689
18832I2804d6897p7881O00C30891a56973j89682B5625K68317k323f7110I4980
$$ 92804 -46897 -124778 -124178 330891 -156973 -346655 25625 293942 291619 -67110 94980
18820c78778I5469K4103b26377B08730C7818J03846L09108k22477H3067A9788
$$ -378778 95469 119572 -226377 208730 37818 141664 450772 228295 83067 19788
18809D8790J70567q8680c73743b7076k85847e5049A3079a75806h1572r3274j76921
$$ 48790 219357 130677 -373743 -27076 -312923 -55049 13079 -175806 -81572 -174846 -351767
18798c51767b8535l35889B3745d5019q5920B20419f0055A75319g6866L45H7435
$$ -351767 -28535 -364424 23745 -45019 -130939 220419 -60055 175319 -76866 -76521 87435
18786d2939I6276e6331k20859B54337b99676A38597G258J15523c67360a31533
$$ -42939 96276 -56331 -277190 254337 -299676 138597 7258 122781 -367360 -131533
18775a05839l09260A05761K4752E1109g5768a6719k2190j12834K2695I9521b31621
$$ -105839 -415099 105761 130513 51109 -75768 -16719 -38909 -151743 -129048 99521 -231621
18763a99017N566C03668b03890m6906A10352c3537A02021b727k02543h2168B11338
$$ -199017 -193451 303668 -203890 -250796 110352 -33537 102021 -2727 -205270 -82168 211338
18751a5884l0545C55583e9835A01614A0669b27135i170j77901g6677r1643j2342
$$ -15884 -46429 355583 -59835 101614 10669 -227135 -9170 -187071 -76677 -168320 -180662
18740a80662d7184p7864F9248L04715A6198b55000A85554a93504F6010K19339
$$ -180662 -47184 -125048 69248 373963 16198 -255000 185554 -193504 66010 285349
18730B85349a59239D7199a48741L6223H0263J63167B9130a30299L0107A10900
$$ 285349 -159239 47199 -148741 -112518 80263 243430 29130 -130299 -100192 110900
18719C37539a47413k10584a64852k2452j87232a49992A8409h1631A32928f7188
$$ 337539 -147413 -357997 -164852 -187304 -374536 -149992 18409 -81631 132928 -67188
18708d1329B46862a84107f8567D61674a43576r494I9082a47695r1236A50606J08617
$$ -41329 246862 -184107 -68567 461674 -143576 -153070 99082 -147695 -238931 150606 259223
18697B59223g1155A38534E8076b12731H2513a30751j13022a01284M6691m3527
$$ 259223 -71155 138534 58076 -212731 82513 -130751 -243773 -101284 -54593 -98120
18687i8120k9818E7346D04J96278C0557c25618a9823k26674F0300a21960B5288
$$ -98120 -127938 57346 404 196682 30557 -325618 -19823 -246497 60300 -121960 25288
18675A5670K44470f6601j75855J7290P7583b7427B18288C3435a63033Q1471a7489
$$ 15670 260140 -66601 -242456 -225166 -147583 -27427 218288 33435 -163033 -81562 -17489
18663b1781j02609j64089C974a63659A73842J4213b75476d5148j68501j1918g1323
$$ -21781 -124390 -288479 3974 -163659 173842 188055 -275476 -45148 -213649 -225567 -71323
18651I6939b8425B03024C0320a04933C17592b75720N7465P3283F6654a20269A02801
$$ 96939 -28425 203024 30320 -104933 317592 -275720 -218255 -144972 66654 -120269 102801
18639b24201a09275m2996B26657A4147e9141A15619b4825o3914j19924e4880C00379
$$ -224201 -109275 -152271 226657 14147 -59141 115619 -24825 -88739 -208663 -54880 300379
18627c77538B08687b29767F4512a48180A5796Q3601L2847l8655i9492j67710D5735
$$ -377538 208687 -229767 64512 -148180 15796 99397 132244 93589 -99492 -267202 45735
18615i4337j151D585b58118C6361J29236c4210B15430c03593f5326p7933J5283
$$ -94337 -95488 4585 -258118 36361 165597 -34210 215430 -303593 -65326 -143259 -127976
18604a27976m7623P2532B27383r6190a96204l9242A611K7363c52437a56204O1736
$$ -127976 -175599 -103067 227383 131193 -196204 -235446 1611 28974 -352437 -156204 -94468
18593i4468B3867J34234i8351B07349E2030n604a83323M0429a2623A00948Q7084
$$ -94468 23867 158101 -98351 207349 52030 46426 -183323 -142894 -12623 100948 188032
18582A88032a60975B61310b15870P3046B1084J03102e40928b33157J6892P3929
$$ 188032 -160975 261310 -215870 -142824 21084 124186 -540928 -233157 -216265 -142336
18572a42336d6524n6247b6167k79828d765C6031a91123B29589b51516C23711h024
$$ -142336 -46524 -102771 -26167 -305995 -4765 36031 -191123 229589 -251516 323711 -8024
18560a49688p384A36493N2110H2315b67438k7684a1838k79550O4186C7625q051
$$ -149688 -157072 136493 188603 82315 -267438 -295122 -11838 -291388 -227202 37625 29574
18549B9574b38432K6247e8018G6225a10918D8952J61950f2020r5527B03374m0407
$$ 29574 -238432 -212185 -58018 76225 -110918 48952 210902 -62020 -157547 203374 162967
18538A62967c15588A98237a77123A71465o099a22135A867P0873J65234j623b60124
$$ 162967 -315588 198237 -177123 171465 165366 -122135 1867 72740 237974 236351 -260124
18526b44642a11710p072H3709b24248J09419a1402A07311a52564e2200F8755O9957
$$ -244642 -111710 -118782 83709 -224248 -114829 -11402 107311 -152564 -52200 68755 138712
18515A38712a84482J919D7035J575K26385h2814k5527B03240M160A03614B5071
$$ 138712 -184482 -182563 47035 48610 274995 -82814 -108341 203240 207400 103614 25071
18503d38716a12828B88302A5091b35433a16747M3130m179A50404c02643h1021
$$ -438716 -112828 288302 15091 -235433 -116747 -73617 -77796 150404 -302643 -81021
18492a01506A68463c6861m078j42005c6805a8015k1245C9607c35957h922A7314
$$ -101506 168463 -36861 -40939 -182944 -36805 -18015 -39260 39607 -335957 -8922 17314
18480A8870c34297d5916b2918E8776J1011a44367C67977d4093D1403d8301k07705
$$ 18870 -334297 -45916 -22918 58776 69787 -144367 367977 -44093 41403 -48301 -256006
18469b56006J27520l6192C40709D5602Q8476P06c63478f9550k61296i9357D7843
$$ -256006 -128486 -164678 340709 45602 134078 134784 -363478 -69550 -330846 -99357 47843
18457b56027A34982n9685c04580h4818l5216G0322c15455A46102l5381a43654
$$ -256027 134982 75297 -304580 -84818 -120034 70322 -315455 146102 110721 -143654
18446c09306a14969L0304A45594e2186j01387f6670p7799B7150O4682c2919B16871
$$ -309306 -114969 -84665 145594 -52186 -153573 -66670 -144469 27150 91832 -32919 216871
18434h6163K9793j99851h5652k86732E5151b36337m716M5159g8694j27646a01246
$$ -86163 -56370 -256221 -85652 -372384 55151 -236337 -241053 -195894 -78694 -206340 -101246
18422I6930e8170A39963e9872A47523a24807R150A93267b35540M8587E3623L11347
$$ 96930 -58170 139963 -59872 147523 -124807 -115657 193267 -235540 -186953 53623 364970
18411C64970d2891P643f562E4387K8780a00500r6604A2169b10885a04823M9141
$$ 364970 -42891 -35248 -6562 54387 83167 -100500 -197104 12169 -210885 -104823 -55682
18400e5682m1281l49043A44327a6434g744I5220m4249a75787A07506C5829b3782
$$ -55682 -96963 -446006 144327 -16434 -7744 95220 50971 -175787 107506 35829 -23782
18388b3964B03991c70354a67543p0266H9466a15638B33919D2275J3557J38815
$$ -23964 203991 -370354 -167543 -237809 89466 -115638 233919 42275 55832 194647
18378A94647q7113h716r5457p1240L2325A03358j3010q693a17689B78075J81937
$$ 194647 107534 -8716 -104173 -175413 -143088 103358 90348 81655 -117689 278075 460012
18367D60012F7839e8881A21411L6a11472c9135B8749M8728b08943O5084f8536
$$ 460012 67839 -58881 121411 121447 -111472 -39135 28749 77477 -208943 -143859 -68536
18355a80528E07005f5246k17256A04484a06525d4901H0321b3584C12371a4802
$$ -180528 507005 -65246 -282502 104484 -106525 -44901 80321 -23584 312371 -14802
18344g0448j19842k15111B7778K22936b29014A80982c0930r1748N3224A82823
$$ -70448 -190290 -405401 27778 250714 -229014 180982 -30930 -122678 -69454 182823
18333A84482b41384j66165C7833a95045A59754f7439j4591K557A11728a27033
$$ 184482 -241384 -407549 37833 -195045 159754 -67439 -82030 -79473 111728 -127033
18322B30237D4530g9996K2692A62252D7843F562h6947E0731b23770A43657h2801
$$ 230237 44530 -79996 -57304 162252 47843 6562 -86947 50731 -223770 143657 -82801
18310A5475a42759L1414K7426j10086B98785j39697a93323D8205R2594n5056L7222
$$ 15475 -142759 -111345 -83919 -194005 298785 159088 -193323 48205 140799 85743 122965
18299A22965B6987e05496B46185a13752B80049A11641Q8108a28574r3622d5237
$$ 122965 26987 -505496 246185 -113752 280049 111641 199749 -128574 -222196 -45237
18288c56100F405c5275B24093c61850K0176J64389l808d6110j24585D9150R1465
$$ -356100 6405 -35275 224093 -361850 -341674 -177285 -181093 -46110 -170695 49150 140615
18277A40615g9300K9060k46300r6908J76375P8311c6584j63547F7974l0804N5698
$$ 140615 -79300 -50240 -296540 -393448 -217073 -138762 -36584 -200131 67974 37170 92868
18266I2868P1597a41209G8785b680I9368O2451a83239B56884a24455G6895a04338
$$ 92868 164465 -141209 78785 -2680 99368 161819 -183239 256884 -124455 76895 -104338
18254a40564j54191O6289C8507b25268e6662j1619r8668f865k4291A02449a64967
$$ -140564 -294755 -228466 38507 -225268 -56662 -68281 -166949 -6865 -31156 102449 -164967
18242B00405j3753h6732A09232b91970j5171C9988M0111d8234J7648E7240R1422
$$ 200405 186652 -86732 109232 -291970 -307141 39988 80099 -48234 -30586 57240 148662
18231A48662N9817p1325a48370j8835A43666b07458j263C7279K79153B6412b4195
$$ 148662 208479 137154 -148370 -167205 143666 -207458 -208721 37279 316432 26412 -24195
18219A35215E7440J67424l6150d603A97964g0529C7284a93715B1569a97477F7797
$$ 135215 57440 224864 188714 -4603 197964 -70529 37284 -193715 21569 -197477 67797
18207A36587B4526J80462f4455B7454O5268O5952a68788B37256I9043C8743R2605
$$ 136587 24526 204988 -64455 27454 92722 158674 -168788 237256 99043 38743 131348
18196A31348b23439A43375b1614k30354b9747B75203b46976N1842i6509b8657
$$ 131348 -223439 143375 -21614 -251968 -29747 275203 -246976 -195134 -96509 -28657
18185C20584a75487Q7601C49816o9713H3107I203a57997d445B27568b24829B8292
$$ 320584 -175487 -87886 349816 280103 83107 9203 -157997 -4445 227568 -224829 28292
18173b15838A87146h2116c692A19348c8683B8886a8288j6035l92380I2797K4190
$$ -215838 187146 -82116 -3692 119348 -38683 28886 -18288 -34323 -426703 92797 116987
18162A16987b5662o5461j39852e8871j9942j34237j55638a17992E531a97798A92437
$$ 116987 -25662 -91123 -230975 -58871 -78813 -213050 -368688 -117992 5531 -197798 192437
18150b18862A97044b32750D4249J48236a42669A4144f848j13180b363j47734f3180
$$ -218862 197044 -232750 44249 192485 -142669 14144 -6848 -120028 -2363 -150097 -63180
18138A15636N1050E5597a54165e6265A66872a60505P4946j65598c3786B50574
$$ 115636 166686 55597 -154165 -56265 166872 -160505 -85559 -251157 -33786 250574
18127C28575a06038j0198D0944J850J71179K55829h1623j2864K3167l7635d2243
$$ 328575 -106038 -116236 40944 42794 213973 469802 -81623 -94487 -71320 -108955 -42243
18115C3903d61374K19274d0287r6435N8314l09980A11828a95855l6440b6579A80281
$$ 33903 -461374 -242100 -40287 -136722 -78408 -388388 111828 -195855 -232295 -26579 180281
18103a97926j548L6723A92898q8121O5915b9942j22596P5993L1027j97202J01912
$$ -197926 -199474 -162751 192898 104777 170692 -29942 -152538 -76545 -45518 -242720 -140808
18092a40808i969j85036G4081b31728B29930a55957p2814p7083A86026A6151g471
$$ -140808 -9969 -195005 74081 -231728 229930 -155957 -228771 -305854 186026 16151 -7471
18080D1523K58465b1853F9546a62190b5061B44735a18923A71308d2606j76331
$$ 41523 299988 -21853 69546 -162190 -25061 244735 -118923 171308 -42606 -218937
18070b18937D2716a4597H1962J407a05565I6410i0364o1476j47308c3377I2748
$$ -218937 42716 -14597 81962 83369 -105565 96410 -90364 -151840 -299148 -33377 92748
18058b12376A53404F9923e5137j8078A67982d0376C62054A7331a07685j50365
$$ -212376 153404 69923 -55137 -73215 167982 -40376 362054 17331 -107685 -258050
18048b58050O8335a5762F5086N2800B6604J56513L4151a460l8114j65948B4334
$$ -258050 -189715 -15762 65086 117886 26604 183117 217268 -1460 -39574 -205522 24334
18036c80B14582l8766B8401c3315o7322d8167E1950b18055A77142p3501J4760
$$ -380 214582 175816 28401 -33315 -100637 -48167 51950 -218055 177142 103641 118401
18025A18401a76967f8119k4710j2153A01792P1109a21839a8636A06084H774i401
$$ 118401 -176967 -68119 -92829 -104982 101792 172901 -121839 -18636 106084 8774 -9401
18013g4159k97185H1060b85574k56439I790M9390A2342R381d6814a7941k5290
$$ -74159 -371344 81060 -285574 -542013 9790 59180 12342 21723 -46814 -17941 -43231
18002d3231G0830J90598a13091H7432f7635A72038o21a71364F3009g647F5169
$$ -43231 70830 261428 -113091 87432 -67635 172038 171417 -171364 63009 -7647 65169
17990B01006f7016k02969b6536j34662E21080A44425c1146A9449G361b30889J5153
$$ 201006 -67016 -269985 -26536 -161198 521080 144425 -31146 19449 7361 -230889 -215736
17979b15736I0430B9794K04182g0232B13378C685b35248B94244E974P3374a68006
$$ -215736 90430 29794 233976 -70232 213378 3685 -235248 294244 5974 79348 -168006
17967D1884M5916R5902o5617K31841H0194i5792d7132l914B521K14348I5554l6299
$$ 41884 87800 183702 118085 349926 80194 -95792 -47132 -51046 2521 216869 95554 59255
17955E9255K22525a97745C52486C6452N2083C522L848N1221R1449b08980B7951
$$ 59255 281780 -197745 352486 36452 88535 3522 7370 58591 150040 -208980 27951
17943H5733c61815e9050p1796l02877a65255B8624J22541p5276A0351N8752c5276
$$ 85733 -361815 -59050 -130846 -433723 -165255 28624 151165 75889 10351 69103 -35276
17931B45468J23639G9380O3305D90g2583m33222a6598A30459g8308F6604K3168
$$ 245468 369107 79380 142685 490 -72583 -505805 -16598 130459 -78308 66604 89772
17920H9772a98182a1942m73847A2180a54751A71584j7678g2689A7544g0148c2136
$$ 89772 -198182 -11942 -485789 12180 -154751 171584 153906 -72689 17544 -70148 -32136
17908E1430H285O6289O8840b5461q7029F576J74562a41605F6548a1695A07201
$$ 51430 8285 74574 143414 -25461 -112490 6576 181138 -141605 66548 -11695 107201
17896b22710N9535M6177j04145G4141C4032K9968f7387I7676k7102k2094h9368
$$ -222710 -163175 -116998 -221143 74141 34032 64000 -67387 97676 70574 48480 -89368
17884a78003j81889G0993m678J28606Q1955G6996e5017A94151a96033E2915f3626
$$ -178003 -359892 70993 66315 194921 276876 76996 -55017 194151 -196033 52915 -63626
17872c28608A59866A1266f398r7067k7980m1701j17569c4577D02954A39806f3805
$$ -328608 159866 11266 -6398 -103465 -131445 -173146 -290715 -34577 402954 139806 -63805
17860F8202j7879b35308D43636b33625A5868L09117j50447p8793b49863J11387
$$ 68202 50323 -235308 443636 -233625 15868 324985 174538 95745 -249863 -138476
17850a38476I8524C4736b43345B54547a66230d9945I611c12541d6112B23923b52026
$$ -138476 98524 34736 -243345 254547 -166230 -49945 9611 -312541 -46112 223923 -252026
17838a06216p302F7420J12537c39771i1096D7882b6961k92765b8882A71777n1743
$$ -106216 -113518 67420 179957 -339771 -91096 47882 -26961 -319726 -28882 171777 120034
17827A20034b76936A3065h3948A21911l3575J99151j26633E4983f10039E9562
$$ 120034 -276936 13065 -83948 121911 88336 287487 160854 54983 -610039 59562
17816b7541m3797j15891L549A16608e9715l2460A88198q3091a12124M5839o7422
$$ -27541 -71338 -187229 -183680 116608 -59715 -92175 188198 105107 -112124 -66285 -133707
17805a33707H9338a19424q3896A14683N9817a62459j27726E3403R209N1547J9928
$$ -133707 89338 -119424 -203320 114683 174500 -162459 -290185 53403 62612 114159 134087
17794A34087a39561A45434e983I491J00776R9980c805A50061o9268K22346E816
$$ 134087 -139561 145434 -5983 9491 110267 210247 -3805 150061 80793 303139 5816
17782b65560A68876b8055H7574a02428A1621L0425A6786J02099i4453p219B05778
$$ -265560 168876 -28055 87574 -102428 11621 42046 16786 118885 -94453 -101672 205778
17770G8272N9055J26807f4029r736A59812a42613J2291J6424B33651a10779a8522
$$ 78272 137327 264134 -64029 -73765 159812 -142613 -130322 -113898 233651 -110779 -18522
17758A90568h0240j6854A45142b76312P5526A68200E1622j32J68692A9836J27392
$$ 190568 -80240 -97094 145142 -276312 -200786 168200 51622 51490 220182 19836 147228
17747A47228B3503J93491K0457a06777A26734d1267J092p586F6060P294j2782
$$ 147228 23503 216994 237451 -106777 126734 -41267 -40175 -47761 66060 73354 60572
17736F0572e5052n1058d088A79726p3321b6578A62215O6231I8902a3288A12659
$$ 60572 -55052 -106110 -4088 179726 106405 -26578 162215 228446 98902 -13288 112659
17724g7182r5107C4578K21518r3401a1607k60762f6006j32220J5332n1377A92328
$$ -77182 -172289 34578 256096 162695 -11607 -272369 -66006 -198226 -182894 -234271 192328
17712b59725c0270C43570j65048a4876j84280P15A77983R7863A10711l3603n183
$$ -259725 -30270 343570 178522 -14876 -199156 -198441 177983 275846 110711 77108 71925
17701G1925a16857j26231k97785M3874h3754A37590j0340c13420A26476Q4990
$$ 71925 -116857 -243088 -540873 -496999 -83754 137590 127250 -313420 126476 211466
17691B11466M516c2878j3501j34924k57198A2411d0056k27858A34632b38867B07156
$$ 211466 215982 -32878 -46379 -181303 -438501 12411 -40056 -267914 134632 -238867 207156
17679A24522b22107c5771C7974a5273q8926F0051R5613b595k10802c6564k3792
$$ 124522 -222107 -35771 37974 -15273 -104199 60051 155664 -2595 -213397 -36564 -60356
17668f0356m2776k4699D3022h7828L0657F0084a39499J8327e0061A22759b23806
$$ -60356 -103132 -127831 43022 -87828 -57171 60084 -139499 -121172 -50061 122759 -223806
17656A12267E5339r13j2128j2929J7429e541j80560h1293K6542B00006e0959k3267
$$ 112267 55339 54426 42298 29369 46798 -5541 -186101 -81293 -54751 200006 -50959 -74226
17644g4226C04137d3682p7529A38492d0444A12698g0678C3444a92388A41659J33144
$$ -74226 304137 -43682 -121211 138492 -40444 112698 -70678 33444 -192388 141659 274803
17633B74803A435P4359l6134J60328B1448a27601A40755B1431M881M4274j7148
$$ 274803 1435 75794 39660 199988 21448 -127601 140755 21431 26312 70586 53438
17622E3438B4482f4488n5118j15720B51049H9523b6078k518F8582a24145f0710
$$ 53438 24482 -64488 -119606 -235326 251049 89523 -26078 -28596 68582 -124145 -60710
17610A72412p7693L11164A23611O8095H4936A3071J66346g0094j55184A88491
$$ 172412 94719 405883 123611 191706 84936 13071 179417 -70094 -225278 188491
17599A52184d948k2651B58761a8274j79293A11183R2219b7952A91308c38672A17241
$$ 152184 -4948 -27599 258761 -18274 -197567 111183 203402 -27952 191308 -338672 117241
17587c29979a26912E3131J12426b39536a14951C7211B65N9999j312K11395b72922
$$ -329979 -126912 53131 165557 -239536 -114951 37211 265 60264 58952 270347 -272922
17575B71659J06952f8301c1817E20929i1713A7819a12250C14987E7832g1072B15383
$$ 271659 378611 -68301 -31817 520929 -91713 17819 -112250 314987 57832 -71072 215383
17563a58626B37849A12591D3508J22925d5260B91952g5960B24934a34501E4515
$$ -158626 237849 112591 43508 166433 -45260 291952 -75960 224934 -134501 54515
17552d45408a4271A88657d2865A41693C6834K0408L9288d1601A33098K762a34975
$$ -445408 -14271 188657 -42865 141693 36834 57242 96530 -41601 133098 135860 -134975
17540a33513A88180a70589g9863A7134J04002O37a08255q112J7377b9855A4680
$$ -133513 188180 -170589 -79863 17134 121136 121773 -108255 -116367 -98990 -29855 14680
17528A51284c32802C91083e4867A01108a24848a796G1490P12722A06388i5662
$$ 151284 -332802 391083 -54867 101108 -124848 -1796 71490 784212 106388 -95662
17517H7575J63633h6770B20297q566i5243M2535C28288A21085k5146a09322B11321
$$ 87575 251208 -86770 220297 211731 -95243 -52708 328288 121085 95939 -109322 211321
17505c95394i6777A7992L68083j40304l4722B4633i1637A71295a08056A92141
$$ -395394 -96777 17992 386075 245771 211049 24633 -91637 171295 -108056 192141
17494B072N37848A97312a62574f90A43653o2334J00241G3530L5907a78008f8303
$$ 2072 539920 197312 -162574 -690 143653 81319 181560 73530 109437 -178008 -68303
17482C2594J95160K65396d2563H2548K75894A55951C8046J30767J50085O6479
$$ 32594 227754 493150 -42563 82548 358442 155951 38046 168813 318898 385377
17472C85377J2106J2929c23422J58169A58592J96307H623K80425a24037C13149
$$ 385377 397483 410412 -323422 -165253 158592 354899 8623 289048 -124037 313149
17461e1771E9877b09420O8799n9814O0440f3952B50640m6989p1982e2209D11246
$$ -51771 59877 -209420 -140621 -200435 -139995 -63952 250640 203651 131669 -52209 411246
17449A80193p7456K08478N7230B265M69106H8690J41769k7848F8588Q3026J30034
$$ 180193 102737 311215 368445 2265 471371 88690 230459 202611 68588 151614 281648
17438B81648j06195b73011A75636b0474A75091G4577J32812N7580l6656r8858
$$ 281648 175453 -273011 175636 -20474 175091 74577 207389 264969 228313 129455
17428A29455q961j9731R7485l3293J46913m7691o2134R9291r5306I8375J67246
$$ 129455 120494 100763 198248 164955 311868 264177 202043 301334 206028 98375 265621
17417B65621B1538L96842j85599H0087J48685p3968M8450J2424m9944n3502O732
$$ 265621 21538 418380 232781 80087 228772 154804 203254 215678 165734 112232 118964
17406A18964f7777n0220A35113N5069q5252J43606H7862J12701H4499K96313A78836
$$ 118964 -67777 -117997 135113 190182 104930 248536 87862 200563 84499 380812 178836
17394B05825r2527J63495b6990C9170R4395K00799E3225L79201J21670a8887r7589
$$ 205825 113298 276793 -26990 39170 133565 334364 53225 432426 554096 -18887 -116476
17383a16476A42534l1028J94349j34722C9418J30224N0520L10107A70787p5717
$$ -116476 142534 111506 305855 171133 39418 169642 220162 530269 170787 95070
17373I5070K64105j02028r1956L33612A98066q3179K98862a91435L9152A77199
$$ 95070 359175 257147 165191 498803 198066 114887 413749 -191435 -152283 177199
17362C61107A38655D9523J09834m6020J05474f8897A21338n4606e5176B28196
$$ 361107 138655 49523 159357 113337 218811 -68897 121338 66732 -55176 228196
17351D64765B25901A09218K16892a7632n4832F0975b09892O3217F9779O279J53564
$$ 464765 225901 109218 326110 -17632 -72464 60975 -209892 -146675 69779 76058 229622
17340B29622C9983M6685J93855j06566J3504B5321Q6776a72999E08981a66123
$$ 229622 39983 86668 280523 173957 187461 25321 112097 -172999 508981 -166123
17329D6363b6607A53700l74d89462h565A3937L0692D520R7436J132i230A37838
$$ 46363 -26607 153700 153326 -489462 -8565 13937 44629 4520 101956 103088 -9230 137838
17316a26526B31323Q6947a5937k0694A42398J10442F8300a19970A77820j3563
$$ -126526 231323 318270 -15937 -36631 142398 252840 68300 -119970 177820 164257
17306A64257H689K66059J57890B0510i0261A44635N2501p8958a18734A90088J97982
$$ 164257 8689 274748 432638 20510 -90261 144635 197136 118178 -118734 190088 388070
17295C88070N7028I9484L02449j30119j15233K6080Q319j1382l7477O6664f7718
$$ 388070 445098 99484 401933 271814 156581 182661 190980 179598 142121 208785 -67718
17283B96029D1944J82195j09333K99190i2747B46892j3089m6324k4927j6720J4398
$$ 296029 41944 224139 114806 413996 -92747 246892 233803 187479 162552 145832 160230
17272A60230F9724J98901q08j05379d39j3561A87994a7289D53040A39745K43242
$$ 160230 69724 268625 267817 162438 -439 -14000 187994 -17289 453040 139745 382987
17261C82987j69768J25911P7934I1365J18124k6342m9735B0061L88584N6386J3783
$$ 382987 213219 339130 417064 91365 209489 183147 133412 20061 408645 465031 478814
17250D78814a05976B7608J13909L1494p8624J70040q7665C1532M36744k19714
$$ 478814 -105976 27608 141517 173011 94387 264427 176762 31532 468276 248562
17240B48562n3575d5363I1773K00099j17482p2541J29114J0425G1615J03263J04524
$$ 248562 194987 -45363 91773 291872 174390 101849 230963 241388 71615 174878 279402
17229B79402F9221A1112a54867C72650L2110A45411O01K48377I9179L00952C1540
$$ 279402 69221 11112 -154867 372650 404760 145411 146012 394389 99179 400131 31540
17217D26214A4769R8541K30311J47657A59188M21628A39883L41691j52192A15278
$$ 426214 14769 113310 343621 491278 159188 580816 139883 481574 329382 115278
17206B49494h6213C61636I2704O7373F9893i9054E3789R6433m5581J92527m1688
$$ 249494 -86213 361636 92704 160077 69893 -99054 53789 150222 104641 297168 255480
17195B55480K93596A59066c3987C2834K45857L644H6828J29031J61284j42590
$$ 255480 549076 159066 -33987 32834 278691 282335 86828 215859 377143 234553
17185B34553J6566p6847l0304O2332p0285L23600j03989a1863C61621j67405J80804
$$ 234553 251119 174272 143968 206300 136015 459615 355626 -11863 361621 194216 375020
17174C75020E5628J95211K29486d9702C37215j10747J22026A64664J65890F5429
$$ 375020 55628 250839 480325 -49702 337215 226468 348494 164664 330554 65429
17163A31655Q2207J8776I2139k1230J43225K28905k07853a4980A57274L38138
$$ 131655 213862 232638 92139 70909 214134 443039 235186 -14980 157274 495412
17153D95412o2448a34796B69776k3643j05334l1606J16227o7915Q5566a3703C33667
$$ 495412 432964 -134796 269776 246133 140799 109193 225420 157505 243071 -13703 333667
17141B36496L56276j07018j7590r1255j12284J57401A39266L33627r6531f5680
$$ 236496 592772 485754 468164 376909 264625 422026 139266 472893 376362 -65680
17130C80388O946j4935j18923J24748q9340P690N2083h7156D37041n1418A30254
$$ 380388 387334 372399 253476 378224 288884 296574 348657 -87156 437041 385623 130254
17118A41317K278N3113p5991K78363j40463J21470Q0945A68903L30642j46974
$$ 141317 143595 196708 120717 399080 258617 380087 461032 168903 499545 352571
17108C52571A74464J70314O4864J69665e1602C17867b5202C61969j21481j04121
$$ 352571 174464 344778 409642 579307 -51602 317867 -25202 361969 240488 136367
17098A36367N87142l51573J21229k1906j4033n0987o7343p9140Q9492J19713P813
$$ 136367 723509 371936 493165 471259 457226 406239 338896 259756 349248 468961 476774
17087D76774J7548A01431L25684A80682K54179K2421j66198J5455J38465J0730
$$ 476774 494322 101431 427115 180682 434861 457282 291084 306539 445004 455734
17077D55734K57648l30950K72270l06188r4320L94270B23906J41120j06667K84408
$$ 455734 713382 382432 654702 348514 254194 648464 223906 365026 258359 542767
17067E42767j95944r0947K53525j32436A33050L77392k12366j611J81727M3110
$$ 542767 346823 255876 509401 376965 133050 510442 298076 296465 478192 521302
17057E21302J8628B00114q0965K63231J02879m7994K93406n0140k33552j30142
$$ 521302 539930 200114 119149 382380 485259 437265 730671 680531 446979 316837
17047C16837J72116Q3646A41250L54778O3039j00539J69741k20173I3102L66928
$$ 316837 488953 572599 141250 496028 559067 458528 628269 408096 93102 460030
17037D60030L3053j50297R8303J39844k09124K18846j81193J42858j20210K40096
$$ 460030 493083 342786 441089 580933 371809 590655 409462 552320 432110 672206
17027F72206K21159m05746M2744j64459q2439J85593J91421k50404K22041J61896
$$ 672206 893365 487619 530363 365904 283465 469058 660479 410075 632116 794012
17017G94012k16144k26182j74115M06246J73721o1870p5221j00694J34539J05987
$$ 794012 577868 351686 177571 583817 757538 695668 620447 519753 654292 760279
17007G60279l79984N94876k20099k16702J21910O7988J0535k23205J4468O5963
$$ 760279 380295 975171 755072 538370 660280 728268 738803 515598 530066 596029
16997E96029J37896J028k72408L36723O2770k46360J89675j91233K25150k23667
$$ 596029 733925 734953 462545 799268 862038 615678 805353 614120 839270 615603
16987F15603M6881C08031O86365q2019K08922m91827j3735J23747m0826j8707
$$ 615603 662484 308031 994396 912377 1121299 629472 615737 739484 698658 679951
16977F79951J03673k46740k9399J08955J97285J78312k88681M74156m15570P4958
$$ 679951 783624 536884 507485 616440 813725 992037 703356 1177512 761942 836900
16967H36900k91501L81791K6041K26225k99148j34315o095L09144l36276j23564
$$ 836900 545399 927190 953231 1179456 880308 745993 739898 1049042 712766 589202
16957E89202O42509k39170j69604k05723J07482K27732j01622K13961J37662l76055
$$ 589202 1231711 992541 822937 617214 724696 952428 850806 1064767 1202429 826374
16947H26374K13947o0108J08352j95817J36780J60277n06599J37442P86217p70958
$$ 826374 1040321 980213 1088565 892748 1029528 1189805 683206 820648 1606865 835907
16937H35907L39749j40950J71180K16541l38918J54341j66305K83622N0553j07774
$$ 835907 1175656 1034706 1205886 1422427 1083509 1237850 1071545 1355167 1405720 1297946
16927A297946k04732n300J38486k5221j58412K90365j25304J77527J5092l3768
$$ 1297946 1093214 1087914 1226400 1201179 1042767 1333132 1207828 1385355 1400447 1366679
16917A366679J81710k81321K58895k30775M40817j33326M440k87872L07331j76734
$$ 1366679 1548389 1267068 1525963 1295188 1736005 1602679 1607119 1319247 1626578 1449844
16907A449844p7389M9918L26613p1475l6403r3231j1888J01467K0026k14472K86388
$$ 1449844 1372455 1422373 1748986 1677511 1641108 1547877 1535989 1637456 1657482 1443010 1729398
16896A729398n9858N8684r7208M20960n12532L21048m07186O41602k23798j93405
$$ 1729398 1669540 1728224 1631016 2051976 1539444 1860492 1453306 2094908 1871110 1677705
16886A677705o8370L53441k45137K09095M3265r775o8254K10058m2156m38448
$$ 1677705 1609335 1962776 1717639 1926734 1969999 1960224 1891970 2102028 2059872 1621424
16876A621424N16964l5925J81269K00178m73187Q7615j27364J84245M87114p30321
$$ 1621424 2138388 2102463 2283732 2483910 2010723 2098338 1970974 2155219 2642333 1912012
16866A912012L33627J15365K14854K28603k87287M7547q6695k03679J86064L64299
$$ 1912012 2245639 2361004 2575858 2804461 2517174 2564721 2478026 2274347 2460411 2824710
16856B824710j63313l7150P1988j85237L23837L6819L67485o5897k96023K18121
$$ 2824710 2661397 2624247 2696235 2510998 2834835 2871654 3239139 3173242 2877219 3095340
16846C095340j83858N16262l44533O5624J09372N7193L10326j06285j07289j46676
$$ 3095340 2911482 3427744 3083211 3148835 3258207 3315400 3625726 3519441 3412152 3265476
16836C265476J66066K96449k60764M06411m3224j35802M82820p9813j16366J39674
$$ 3265476 3431542 3727991 3467227 3873638 3830414 3694612 4177432 4097619 3981253 4120927
16826D120927J04848L9805L38543k52540M94925l05235M32101p3297P3400P7835
$$ 4120927 4225775 4265580 4604123 4351583 4846508 4541273 4973374 4900077 4973477 5051312
16816E051312j63524K89002L49044P5281L57790n53739L03753J43849K73213J12757
$$ 5051312 4887788 5176790 5525834 5601115 5958905 5405166 5708919 5852768 6125981 6238738
16806F238738R649J35403L35810k42811N17887R2985k5716L14547j40802O73121
$$ 6238738 6248387 6383790 6719600 6476789 6994676 7087661 7061945 7376492 7235690 7908811
16796G908811O8906j35691Q35635M8982R4473K04263M37784L44244L7168P2027
$$ 7908811 7977717 7842026 8677661 8726643 8821116 9025379 9463163 9807407 9844575 9916602
16786I916602O32352N2500L10755J5305N07646N03658J48152P43816J62561M14513
$$ 9916602 10548954 10601454 10912209 10927514 11435160 11938818 12086970 12830786 12993347 13407860
16776A3407860O58349L89288J64254N07965J044829J59279O35817N39874P23132
$$ 13407860 14066209 14455497 14619751 15127716 16172545 16331824 16967641 17507515 18230647
16767A8230647O91199O74402Q01789N07969J167688N35627R43065J276965R34088
$$ 18230647 18921846 19596248 20398037 20906006 22073694 22609321 23552386 24829351 25763439
16758B5763439J137228J135690J040575J246677J427799J733038J806994J414157
$$ 25763439 26900667 28036357 29076932 30323609 31751408 33484446 35291440 36705597
16750C6705597J999529J646385K559245K120722K237382K389363K834788L130325
$$ 36705597 38705126 40351511 42910756 45031478 47268860 49658223 52493011 55623336
16742E5623336K824617M078699L267074L792599L996395M518457N151017N010238
$$ 55623336 58447953 62526652 65793726 69586325 73582720 78101177 83252194 88262432
16734H8262432N281811N889847O148494O524150O505257O988568P099787P639715
$$ 88262432 93544243 99434090 105582584 112106734 118611991 125600559 132700346 140340061
16726A40340061P466250P695559P188911P395044O983614O569965N555136M824282
$$ 140340061 147806311 155501870 162690781 170085825 177069439 183639404 189194540 194018822
16718A94018822L644738K322659Q06575q88639j871662l720897m906018n844004
$$ 194018822 197663560 199986219 200792794 199904155 198032493 194311596 189405578 183561574
16710A83561574o512024p107473p760415p736824p637198p753798p663256p309574
$$ 183561574 177049550 169942077 162181662 154444838 146807640 139053842 131390586 124081012
16702A24081012o733840o787596o089033n914889n736521n134889m903300m789409
$$ 124081012 117347172 110559576 104470543 98555654 92819133 87684244 82780944 77991535
16694G7991535l758993m385925m000841l141063l424608l287186k874074k741095
$$ 77991535 74232542 69846617 65845776 62704713 59280105 55992919 53118845 50377750
16686E0377750k167107k615585k012339k509616j573187k014224j573418j481629
$$ 50377750 48210643 45595058 43582719 41073103 39499916 37485692 35912274 34430645
16678C4430645j634842j457426j644078j233940r25575j083545j127960j375199
$$ 34430645 32795803 31338377 29694299 28460359 27534784 26451239 25323279 23948080
16670B3948080j084636o57439o57150j158103o32640m26272j128263r71795n42730
$$ 23948080 22863444 22206005 21548855 20390752 19758112 19331840 18203577 17231782 16689052
16661A6689052m03504p19141l95109p35581m76612m47652m92279k75443k64408
$$ 16689052 16285548 15566407 15171298 14435717 13959105 13511453 13019174 12743731 12479323
16652A2479323o21116n90271K05509o89540k62312l46411m14168o635m93748m3896
$$ 12479323 11858207 11267936 11473445 10783905 10521593 10175182 9761014 9754379 9260631 9216735
16642I216735m98734l46377J31980m94148j82569k07752q8751m80351r968j90678
$$ 9216735 8718001 8371624 8503604 8009456 7826887 7619135 7530384 7050033 7040065 6849387
16632F849387K51428q60152Q0447k4409m81639p8168q1017l70191K83102j03597
$$ 6849387 7100815 6240663 6321110 6296701 5815062 5736894 5655877 5285686 5568788 5465191
16622E465191j66987k71954J60784l49617k66393j11127L80580j24615n02940
$$ 5465191 5298204 5026250 5187034 4837417 4571024 4459897 4840477 4715862 4212922
16613D212922j63725L02874k60399j12938j06578j19276l4811j20590j08431J19890
$$ 4212922 4049197 4352071 4091672 3978734 3872156 3752880 3718069 3597479 3489048 3608938
16603C608938J21385o19139j30024L05133r3572J97736k71347k3919n5004o1077
$$ 3608938 3730323 3111184 2981160 3286293 3192721 3390457 3119110 3095191 3040187 2979110
16593B979110m44109J82566q9178L28272m14165L0864k35755O72233j172405P36355
$$ 2979110 2535001 2717567 2628389 2956661 2542496 2573360 2337605 3009838 1837433 2573788
16583B573788k79348K75811m17085J67467J82409k14809j03570j0276l05042P54293
$$ 2573788 2294440 2570251 2153166 2320633 2503042 2288233 2184663 2174387 1869345 2623638
16573B623638p58437Q3850J15467r9396k16764L14074j35695j94212J86670N1015
$$ 2623638 1865201 1949051 2064518 1965122 1748358 2062432 1926737 1732525 1919195 1970210
16563A970210j80952o9341J04910l90973M69169l70102J16645K8753K7170j05829
$$ 1970210 1789258 1719917 1824827 1433854 1903023 1532921 1649566 1678319 1705489 1599660
16553A599660J41786l57247r8104L26093k22206J4255k0684j17035l5619J12249
$$ 1599660 1741446 1384199 1286095 1612188 1389982 1404237 1383553 1266518 1230899 1343148
16543A343148j26398j07177K55503l31607K07928J50324k32665P5967J38336n49665
$$ 1343148 1216750 1109573 1365076 1033469 1241397 1391721 1159056 1235023 1373359 823694
16533H23694L07558K24896n43942K74069P0353n3207J67411j18910N344j53862
$$ 823694 1131252 1356148 812206 1086275 1156628 1103421 1270832 1151922 1157266 1003404
16523A003404k35255l9728L33583J02577L3872q5302j43091J21133k8638k7884
$$ 1003404 768149 728421 1062004 1164581 1198453 1113151 970060 1091193 1062555 1034671
16513A034671k76264M08924j20131J0596k91975q8009j376J65043J00790l14517
$$ 1034671 758407 1167331 1047200 1057796 765821 677812 676436 841479 942269 627752
16503F27752L12394j17938O81Q4650Q8521k07729k51853M06859J05281k55052
$$ 627752 940146 822208 822889 907539 996060 788331 536478 943337 1048618 793566
16493G93566C48343K75345J8271J29693j25223j2765P2553K36175l42150j11378
$$ 793566 348343 623688 641959 771652 646429 633664 706217 942392 600242 488864
16483D88864J857M52948l52325J26893j07266L4901j32097K45316A76203K54038
$$ 488864 490721 943669 591344 718237 610971 645872 513775 759091 176203 430241
16473D30241L59800j58187N4754q0499j47575J32930p8854q1216J61471O8857
$$ 430241 790041 631854 686608 606109 458534 591464 512610 431394 592865 661722
16463F61722r8465L3626J6256j10885K57193B61316M67869B28541K08212J43468
$$ 661722 563257 596883 613139 502254 759447 261316 729185 228541 436753 580221
16453E80221M9581k5360E5793O85268k89813K35867j7101l02366l3568K34791
$$ 580221 629802 604442 55793 741061 451248 687115 670014 367648 334080 568871
16443E68871k04163M05662j26474B65372n8687J93768M61389A73343K46313j87028
$$ 568871 364708 770370 643896 265372 206685 400453 861842 173343 419656 232628
16433B32628K61959B37857R3159K851l9770L09556L1577j17089o4929J17365j38831
$$ 232628 494587 237857 331016 333867 294097 603653 635230 518141 453212 570577 431746
16422D31746J55039j51699k00073K77405p477m6899D6069J16119M3074L5074K1476
$$ 431746 586785 435086 235013 512418 504941 458042 46069 162188 205262 240336 261812
16411B61812o1569L39613j8499o842k23935K01053k34590L38399h7350I6891N02483
$$ 261812 200243 539856 521357 514515 290580 491633 257043 595442 -87350 96891 599374
16400E99374B81544M22132l17380n9566b8884D2001K85589A21920J51639k5222
$$ 599374 281544 703676 386296 326730 -28884 42001 327590 121920 273559 248337
16390B48337J25185o4729P8735A52795k1510p445N0752k8379L24491j81875A26006
$$ 248337 373522 308793 387528 152795 131285 123840 174592 146213 470704 288829 126006
16378F8011J60562F9668J07289L8568K29426j06091k8268K4851A8013R7011K44384
$$ 68011 228573 69668 176957 215525 444951 338860 310592 335443 18013 115024 359408
16367C59408A24506L39412I9324R8152m0453L3472J04470F2287J63960J67873
$$ 359408 124506 463918 99324 197476 157023 190495 294965 62287 226247 394120
16357C94120l6950g2010I7307K41147j31820J93834J64161A19529k8049J10488
$$ 394120 357170 -72010 97307 338454 206634 400468 564629 119529 91480 201968
16347B01968j3041j8454J67369B1533M90530j69273m7739q0067G1131K85792o3255
$$ 201968 188927 170473 337842 21533 512063 342790 295051 214984 71131 356923 293668
16336B93668I9134J26194H7194l3492K6626J98097b07348C57992j3907r0093I5074
$$ 293668 99134 225328 87194 53702 80328 278425 -207348 357992 344085 253992 95074
16324A22919J26942l1709J6267L2474i9450m5486A52326O7876j7111C7423N8526
$$ 122919 249861 218152 234419 266893 -99450 -144936 152326 220202 203091 37423 95949
16313I5949b4414B65674a09701A47532J9622D0375N742B515R1763J3560A333K5058
$$ 95949 -24414 265674 -109701 147532 167154 40375 46117 2515 94278 107838 1333 26391
16301B6391K28763A19198C1559K39037A29130E3785Q3698R4855j07421J31856
$$ 26391 255154 119198 31559 270596 129130 53785 137483 232338 124917 256773
16291B56773b8410O160A16765R1809M4602F9392K1739a405G843a4567A2901J63881
$$ 256773 -28410 -22250 116765 208574 253176 69392 91131 -1405 7843 -14567 12901 176782
16279A76782j9577J264R1578o3783b0070A42096N6154J6915K43327c31050C47352
$$ 176782 157205 158469 250047 186264 -20070 142096 198250 215165 458492 -331050 347352
16267g4774A65007L1749a65698A65211G8037K0064K21127n8721a41641d9373A61225
$$ -74774 165007 196756 -165698 165211 78037 98101 319228 260507 -141641 -49373 161225
16255A40504J47392a03001E1658J39190a91513j12457P3310C93432h6226o1888
$$ 140504 287896 -103001 51658 190848 -191513 -303970 -230660 393432 -86226 -148114
16245a48114B07979J39575b36304b8523L137H9445J65226h1575B70761I2341c82837
$$ -148114 207979 347554 -236304 -28523 -25386 89445 254671 -81575 270761 92341 -382837
16233C26081k3639m3029b96097A42323d5764C61177I424g352j83914A36449d9496
$$ 326081 302442 259413 -296097 142323 -45764 361177 9424 -7352 -191266 136449 -49496
16221A44740f3428D33123a70401H1051a88503A49097a494G9874c19584B29502
$$ 144740 -63428 433123 -170401 81051 -188503 149097 -1494 79874 -319584 229502
16210a98033d7473l0702A55099e2172m7035A26959h058l5914r3454k1148K1156
$$ -198033 -47473 -78175 155099 -52172 -99207 126959 -8058 -43972 -137426 -158574 -137418
16199a37418B29825J49536b09620a1251B10687C0389Q995J77232J3882c72832
$$ -137418 229825 379361 -209620 -11251 210687 30389 39384 216616 230498 -372832
16188H4157B8751K5424P3807h2359r0316L4365b8219a292A56180a5321k07711
$$ 84157 28751 54175 127982 -82359 -172675 -138310 -28219 -1292 156180 -15321 -223032
16177b23032e9199a5390A8695K79722B7800L10520j17105B6847c1342B12383h0986
$$ -223032 -59199 -15390 18695 298417 27800 338320 221215 26847 -31342 212383 -80986
16165B5579a32443A12588b00319A28377J13405L6598d3304B43699j66b95377g2034
$$ 25579 -132443 112588 -200319 128377 241782 278380 -43304 243699 243533 -295377 -72034
16153D4772Q4805b51876A08334L61334a04089a0036p0945k46603A52853c6746
$$ 44772 129577 -251876 108334 469668 -104089 -10036 -80981 -327584 152853 -36746
16142h8177B73761I9612b6468n6861B14944h0053E1149g6006r9324B18686H5372
$$ -88177 273761 99612 -26468 -83329 214944 -80053 51149 -76006 -175330 218686 85372
16130b07513c7877p9032J7681B96387b4114k59243j524K9003c4461k03339g0531
$$ -207513 -37877 -116909 -99228 296387 -24114 -283357 -284881 -255878 -34461 -237800 -70531
16118A00840m0332M281a1107l07746A94721a2669m6374p7103r5011A48321g3398
$$ 100840 60508 64789 -11107 -318853 194721 -12669 -59043 -136146 -231157 148321 -73398
16106A37266K9722P4741A6207K59806m8125c190o9879D62230g8824A64809J36233
$$ 137266 166988 241729 16207 276013 227888 -3190 -73069 462230 -78824 164809 301042
16095C01042b21811N2118g818B19653b40810A44516J17524b12773A2932b69283
$$ 301042 -221811 -169693 -7818 219653 -240810 144516 262040 -212773 12932 -269283
16084A91303o7009k4349g3452j86401D9020b03507F374d4604F1322O2716B7439
$$ 191303 124294 99945 -73452 -259853 49020 -203507 6374 -44604 61322 124038 27439
16072F9994B8103c23103A68777p595e0411j34945A72688j0081b2521k15004R8058
$$ 69994 28103 -323103 168777 161182 -50411 -185356 172688 162607 -22521 -237525 -139467
16061a39467J5905N1325B17710q1411c22270D68433A06632L3648N53K2216c87856
$$ -139467 -123562 -72237 217710 136299 -322270 468433 106632 140280 140833 163049 -387856
16049A30513B0454a60698B76981a8917E7741a3394j85343n2211C19764a13574
$$ 130513 20454 -160698 276981 -18917 57741 -13394 -198737 -250948 319764 -113574
16038a58720M1768J6865l13563C5525g7348b2197n3141I8242A6130N0374K0914
$$ -158720 -116952 -100087 -413650 35525 -77348 -22197 -75338 98242 16130 66504 87418
16027H7418J04158b12989P2122D9051R8382J5355b38162r1249J12339r2750M6733
$$ 87418 191576 -212989 -140867 49051 147433 162788 -238162 -329411 -217072 -309822 -263089
16016b63089B33747a91465j49303a01260j01031g33A90242J45055j31327i6702
$$ -263089 233747 -191465 -340768 -101260 -202291 -733 190242 335297 203970 -96702
16005A04300b24794B59048c19253a27459j76595a40807B94653D8754O2645J3887
$$ 104300 -224794 259048 -319253 -127459 -304054 -140807 294653 48754 111399 125286
15995A25286a82254B41447i9080A18442E3063a96455H6548d28932A56497a22699
$$ 125286 -182254 241447 -99080 118442 53063 -196455 86548 -428932 156497 -122699
15984a60183p8388J04512C73506j77450C0874K89465A40106E4725d5645l95004
$$ -160183 -238571 -134059 373506 196056 30874 320339 140106 54725 -45645 -440649
15974d40649F0145A2717K04a59910J4303D5699a59948q1119h7793j41010b8014
$$ -440649 60145 12717 12921 -159910 -145607 45699 -159948 -241067 -87793 -228803 -28014
15962C0642j1757a43273D6194b50261G9305J4231c93004g9010G1262a34396A25090
$$ 30642 18885 -143273 46194 -250261 79305 93536 -393004 -79010 71262 -134396 125090
15950C97813b88771C4955f9793A67598c28536F6364b00965f6679A31931e4739
$$ 397813 -288771 34955 -69793 167598 -328536 66364 -200965 -66679 131931 -54739
15939A04616R2843a79516C54099H7303E499P9505i8299c5097k19083A37466a01340
$$ 104616 197459 -179516 354099 87303 5499 85004 -98299 -35097 -254180 137466 -101340
15927a96584j60150F0885b18372p1949a0739n8893j53778A28977b16493N3232
$$ -196584 -356734 60885 -218372 -290321 -10739 -69632 -223410 128977 -216493 -163261
15917a63261g1689p4431d0506E5966a7829l12168G0417c81645a4652A81878b53045
$$ -163261 -71689 -146120 -40506 55966 -17829 -329997 70417 -381645 -14652 181878 -253045
15905h1416p4072n5714i1748n8463A27665D4971b5709l78807H6394C6177Q475
$$ -81416 -155488 -211202 -91748 -150211 127665 44971 -25709 -404516 86394 36177 44652
15894D4652a90031R0431j1175D5844a71331b3956B45759a66949m7746C9860N8839
$$ 44652 -190031 -99600 -110775 45844 -171331 -23956 245759 -166949 -214695 39860 98699
15883I8699k2000a77396o3723I4697c15822P7181I9690D8940c91901a3742A90637
$$ 98699 76699 -177396 -241119 94697 -315822 -238641 99690 48940 -391901 -13742 190637
15871c0143k90456B0173d2477m862B28341b23607F0287F920O9989h8232j81046
$$ -30143 -320599 20173 -42477 -47339 228341 -223607 60287 6920 76909 -88232 -269278
15860b69278J32453q7131d527C5207K04271b90470E4514e2728b5547C4696a75791
$$ -269278 -136825 -223956 -4527 35207 239478 -290470 54514 -52728 -25547 34696 -175791
15848D3316j523K85098j9253b29149J0057A77956e39014K04985a28107A21334
$$ 43316 41793 326891 307638 -229149 -219092 177956 -539014 -334029 -128107 121334
15837h1083k2769K2339B29936f1375K2175n8397C2647a05182B63912b38838i3376
$$ -81083 -103852 -81513 229936 -61375 -39200 -97597 32647 -105182 263912 -238838 -93376
15825a97245B14907a44683H1209J47074n1511a19209F7808K5b37823G6024E964
$$ -197245 214907 -144683 81209 228283 176772 -119209 67808 67833 -237823 76024 5964
15813c35582h9929A75622B024J69735J54682I8909N7112d94718D7943R8972f1017
$$ -335582 -89929 175622 2024 171759 326441 98909 156021 -494718 47943 146915 -61017
15801E1298c33249G3743O5935a35372j23975A58800C6941a57745E3698i9021A7009
$$ 51298 -333249 73743 139678 -135372 -259347 158800 36941 -157745 53698 -99021 17009
15789c5207l14865d5311E9015a14457j03147n8029h6373k62547a37233A73895
$$ -35207 -350072 -45311 59015 -114457 -217604 -275633 -86373 -348920 -137233 173895
15778a7176k08924P2073M4956B1227H317f4077b4217D0598b39387B1961J59907
$$ -17176 -226100 -154027 -109071 21227 8317 -64077 -24217 40598 -239387 21961 181868
15767A81868a6828o2598D556f7751B44625E2587j3436P6109n2854k1250J89110
$$ 181868 -16828 -79426 4556 -67751 244625 52587 39151 115260 62406 41156 230266
15756B30266A0374L5285b87682R0189j60569E2828a58502N3864j52998D73107
$$ 230266 10374 45659 -287682 -197493 -358062 52828 -158502 -104638 -257636 473107
15745a19900A02009b9388j59706L4319A28328d810j05554A20413a05330M531A15315
$$ -119900 102009 -29388 -189094 -154775 128328 -4810 -110364 120413 -105330 -100799 115315
15733A51095a27171K4206D5645K17285g2791j47438A61603d2410B081N6219J47056
$$ 151095 -127171 -102965 45645 262930 -72791 -220229 161603 -42410 2081 58300 205356
15722B05356b11140K2703j82610B11166a67505A54262l6466a26m2021j19111C54466
$$ 205356 -211140 -188437 -371047 211166 -167505 154262 117796 -126 -42147 -161258 354466
15710a48173J1930j10180b8630H1883b76988I9169a64913F1944B526a10935N339
$$ -148173 -136243 -246423 -28630 81883 -276988 99169 -164913 61944 2526 -110935 -105596
15699a05596A32466O8739a08489m5719d8907m69222h0722b6022C6272J1028F107
$$ -105596 132466 201205 -108489 -154208 -48907 -518129 -80722 -26022 36272 47300 6107
15687B026c68976h6088p3788B39178b16537D1826b1787E87140i8784E4080b6747
$$ 2026 -368976 -86088 -159876 239178 -216537 41826 -21787 587140 -98784 54080 -26747
15675C40211h3397A08870a90519g8903H8896a0766H989L05030a35338L6532A88336
$$ 340211 -83397 108870 -190519 -78903 88896 -10766 8989 314019 -135338 -98806 188336
15663c69916c8967A57462d8204k62081B2417h5931p2308B18480H3640d47762D6350
$$ -369916 -38967 157462 -48204 -310285 22417 -85931 -158239 218480 83640 -447762 46350
15651B9738K30261A07376l5594R5051G4362a14975E1805c1125H6327d0303A9733
$$ 29738 259999 107376 71782 166833 74362 -114975 51805 -31125 86327 -40303 19733
15639B9056f095p6978o1099A46222c21629A65980c22111k2475C99502H0024M6226
$$ 29056 -6095 -83073 -144172 146222 -321629 165980 -322111 -344586 399502 80024 126250
15628A26250b83818C37850b59954A73377c60792b3289C7464r854b5622l8614j32752
$$ 126250 -283818 337850 -259954 173377 -360792 -23289 37464 27610 -25622 -64236 -196988
15617a96988e0786n6000A15926P730c0705j75133B1553P2557J15203a37607d7711
$$ -196988 -50786 -106786 115926 123656 -30705 -205838 21553 94110 209313 -137607 -47711
15605i2782k71149B81112D74a23136A01495C7510c165j74528c7432F4407a42677
$$ -92782 -363931 281112 474 -123136 101495 37510 -3165 -177693 -37432 64407 -142677
15593b5774l58108a21564k10921H8887b8375k1216j46090H3279b14431B40501
$$ -25774 -383882 -121564 -332485 88887 -28375 -49591 -195681 83279 -214431 240501
15582I6164d6879q1361C22390b21983f9823F166b90534H495a14633j52534A71821
$$ 96164 -46879 -128240 322390 -221983 -69823 6166 -290534 8495 -114633 -267167 171821
15570A17528c8021G3942N1730b09390h1565A63424J21718r3163C8556J44118E4715
$$ 117528 -38021 73942 125672 -209390 -81565 163424 285142 191979 38556 182674 54715
15558e7952A68864R0197a19492j06189a4420k77100F1138a56143C3280a50658
$$ -57952 168864 259061 -119492 -225681 -14420 -291520 61138 -156143 33280 -150658
15547A42852E2572a3547B25241b68035A50259B9458b79753A36409G939a04686
$$ 142852 52572 -13547 225241 -268035 150259 29458 -279753 136409 7939 -104686
15536b5158j99588A87278q9326k5912a37117o7301D2713P3203A7306c51405f3838
$$ -25158 -224746 187278 97952 72040 -137117 -204418 42713 115916 17306 -351405 -63838
15524a99011k216K1515C6600a33536l34768A96962o2687L4104B7871L39629i0300
$$ -199011 -201227 -179712 36600 -133536 -468304 196962 134275 168379 27871 367500 -90300
15512A81996q2637D6998N3097a79388N6603j48771G7145A8285d3027k81625a12909
$$ 181996 99359 46998 100095 -179388 -122785 -271556 77145 18285 -43027 -324652 -112909
15500C5369a63033b1899A12264d6037A03662a8532j89332A32171J39906c5665
$$ 35369 -163033 -21899 112264 -46037 103662 -18532 -207864 132171 272077 -35665
15489A28619e8144p5169j34923B3263b08351p1373G1919b74731A62690G1483J69332
$$ 128619 -58144 -133313 -268236 23263 -208351 -279724 71919 -274731 162690 71483 240815
15478B40815b3904A64672a61405d618A16268j424g1995k40418a4004A14201b17098
$$ 240815 -23904 164672 -161405 -4618 116268 114844 -71995 -312413 -14004 114201 -217098
15466I5497K5476a31127K3116A12114d399F9677o026B2744f1080A23069m5327
$$ 95497 120973 -131127 -108011 112114 -4399 69677 63651 22744 -61080 123069 77742
15455G7742d7976j35167j18144A80688i2730A17097m2356j7680g1467A05827J00394
$$ 77742 -47976 -183143 -301287 180688 -92730 117097 74741 57061 -71467 105827 206221
15444B06221B7512c83708j05399g9244k58688A10616a96242B98857a79087C4077
$$ 206221 27512 -383708 -489107 -79244 -337932 110616 -196242 298857 -179087 34077
15433A49387J35515i8305A6370a95719Q7018H3496C1529J86769E1417b32307Q1580
$$ 149387 284902 -98305 16370 -195719 -108701 83496 31529 218298 51417 -232307 -150727
15422a50727A73047d5987J073G0570B6047J30301a6139A35150R413G1528K06818
$$ -150727 173047 -45987 -44914 70570 26047 156348 -16139 135150 144563 71528 278346
15411B78346g0187C60J68971b93991A72186K9530k8349b32557B02615E5808N0285
$$ 278346 -70187 360 169331 -293991 172186 201716 173367 -232557 202615 55808 106093
15400A06093C6314K08288H3944a0952m27336m3343E6532j8730a76406B27178C1788
$$ 106093 36314 244602 83944 -10952 -438288 -481631 56532 37802 -176406 227178 31788
15388b81338C9160L7268A0403O7391b27396n5249B46229g663A93477g9782A87930
$$ -281338 39160 76428 10403 77794 -227396 -282645 246229 -7663 193477 -79782 187930
15376h8198k86953J28445j32370g0714k3696A43548a36422O0763m6817A00726
$$ -88198 -375151 -246706 -379076 -70714 -94410 143548 -136422 -75659 -122476 100726
15365A95590b00754M5577b00n9512j83315I7908L5310a54545I3643O2157b30089
$$ 195590 -200754 -155177 -200 -59712 -243027 97908 133218 -154545 93643 155800 -230089
15353D6425J86731A11085n4942h155A71921b30737C09653C0031b23851H5370h9295
$$ 46425 233156 111085 56143 -8155 171921 -230737 309653 30031 -223851 85370 -89295
15341F7196a48727a7670A6994J40059E7061b02828h5083A81831J33664j19028
$$ 67196 -148727 -17670 16994 157053 57061 -202828 -85083 181831 315495 196467
15331A96467A5892K57979C2561J35903c87992B8356a70877B25295E9154e4955
$$ 196467 15892 273871 32561 168464 -387992 28356 -170877 225295 59154 -54955
15320B73414n1276d1342H2996B3450J65012d1231D09364A72792b88251i2140M5592
$$ 273414 222138 -41342 82996 23450 188462 -41231 409364 172792 -288251 -92140 -46548
15309d6548p7354A79811a36259A08395C4059J05649o2311J2914k3797J18500J07989
$$ -46548 -123902 179811 -136259 108395 34059 139708 77397 90311 66514 185014 293003
15298B93003d5777A11561a4535L36p5571B0016a67411K5600a2573A89227m5269
$$ 293003 -45777 111561 -14535 -14199 -89770 20016 -167411 -141811 -12573 189227 143958
15287A43958B0685J11313J64430j30264o7803J97779D9806a99144A8282d93717
$$ 143958 20685 131998 296428 166164 98361 296140 49806 -199144 18282 -493717
15276a46137e4716o7772N7382j18331B91649J11613A14708J33946A9280a72146
$$ -146137 -54716 -122488 -65106 -183437 291649 403262 114708 248654 19280 -172146
15265h1726j07832F1500L91670E7357O4220K6245N8054H9433m1480J68474j03168
$$ -81726 -189558 61500 453170 57357 121577 147822 205876 89433 47953 216427 113259
15254A13259L47224k06663J73041j45098N96220l717K08144K6893j49567B13788
$$ 113259 460483 253820 426861 281763 877983 874266 1082410 1109303 959736 213788
15243C17586M0295j52693o4286d3553E0543K01382B9353N0308a73810f6390A62876
$$ 317586 357881 205188 140902 -43553 50543 251925 29353 79661 -173810 -66390 162876
15231a0802D370J39346K7635D0756O7967O5146q6652b02405A16896c345j08587
$$ -10802 4370 143716 171351 40756 108723 173869 87217 -202405 116896 -3345 -111932
15220a11932A42821d1894A79965f4803J8641B4798d57973A95436B8782O7641B5359
$$ -111932 142821 -41894 179965 -64803 -46162 24798 -457973 195436 28782 96423 25359
15208b34926A63675M1091q2739H671J90180a32225p3207f260q6968C69818A0534
$$ -234926 163675 204766 122027 8671 198851 -132225 -205432 -6260 -93228 369818 10534
15196b36144B60768B7573J7544C13J23909L5903n2358N3928J8833Q428g6229b9476
$$ -236144 260768 27573 45117 313 124222 160125 107767 161695 180528 188956 -76229 -29476
15183B60028A16503i24k3716H3882b69499E839b1917D1906f4244C1055i2157B2733
$$ 260028 116503 -924 -24640 83882 -269499 5839 -21917 41906 -64244 31055 -92157 22733
15170H6929K68476j55885f5682J2360J5D7588L6261J40261b30415a15189C37212
$$ 86929 355405 199520 -65682 -53322 -53307 47588 83849 224110 -230415 -115189 337212
15158E8251a68249A48041J9093C7328j4781N3073J64564b57816B7425J82946h8885
$$ 58251 -168249 148041 167134 37328 22547 75620 240184 -257816 27425 210371 -88885
15146a958B74299J9517j13497L3292E569c32099C63212a20026A17927J53269B4011
$$ -1958 274299 293816 180319 213611 5569 -332099 363212 -120026 117927 271196 24011
15134i5831H9949a03795b7413H4009K55539a07597A464b53443C1553L93711B8937
$$ -95831 89949 -103795 -27413 84009 339548 -107597 1464 -253443 31553 425264 28937
15122C19990A54793b57B23609a01036A35604H16g96C82294A76080a34264B08009
$$ 319990 154793 -257 223609 -101036 135604 816 -796 382294 176080 -134264 208009
15110A84817n8992a09621b9600B39769j07084l2852M4957b3684A77635o4529j3559
$$ 184817 125825 -109621 -29600 239769 132685 99833 144790 -23684 177635 113106 99547
15099I9547A8842b7406A76302G3812K84393A43280a25139A65770j1453C4202J95195
$$ 99547 18842 -27406 176302 73812 358205 143280 -125139 165770 154317 34202 229397
15088B29397a86869G7931N3130C8955O8487A1863d2742J2763a3045j11050B98712
$$ 229397 -186869 77931 131061 38955 107442 11863 -42742 -29979 -13045 -124095 298712
15076h8493D22812A09864K74834O1297b58648B13825A2026N09885H0646b376A31448
$$ -88493 422812 109864 384698 445995 -258648 213825 12026 521911 80646 -2376 131448
15064e7813o4919C70749q967C8771K24104J477a7630D23071j95895i267E05901
$$ -57813 -122732 370749 361782 38771 262875 264352 -17630 423071 227176 -9267 505901
15052B37112J04508o1557p6903B4687K52793f4169A6996J16384L51087a15467
$$ 237112 341620 280063 203160 24687 277480 -64169 16996 133380 484467 -115467
15041C40261H3774K87755M4522A19111k3744K87494A17082a32862C44641M2680
$$ 340261 83774 371529 416051 119111 95367 382861 117082 -132862 344641 387321
15031C87321j50645K10171A34535J88971k3901A00187J18976b1256B54253n0206
$$ 387321 236676 446847 134535 323506 299605 100187 219163 -21256 254253 204047
15021B04047l6434B2511J79352E2806L75871B03635J20210N9139m3336A36153
$$ 204047 167613 22511 201863 52806 428677 203635 323845 382984 339648 136153
15010C719K0694M2063P0476O0661I2721A7569J4636R773J41069K60952j93680
$$ 3719 24413 66476 136952 197613 92721 17569 32205 41978 183047 443999 250319
14999B50319R7917l0591J35950B1400L60130Q6389K47354A61922N7620n3797k0052
$$ 250319 348236 317645 453595 21400 381530 467919 715273 161922 219542 165745 145693
14988A45693M1397J39694d8436A46253K72302A3599J68004l1827N9213N0486k3596
$$ 145693 187090 326784 -48436 146253 418555 13599 181603 149776 208989 259475 235879
14977B35879r1357J52310L3698j37421J55192j17009J69187g6013A46326K83116
$$ 235879 144522 296832 330530 193109 348301 231292 400479 -76013 146326 429442
14967D29442j31986g4672D2567K62408j01673J99386J97826A3880K86414L26919
$$ 429442 297456 -74672 42567 304975 203302 402688 600514 13880 300294 627213
14957F27213B87637K16810A93855M597M3106A12354K50718j47675A7337K67983
$$ 627213 287637 504447 193855 198452 241558 112354 363072 215397 17337 285320
14947B85320M4455A21721J84916A26626R4400J44499a2837B04317J57007K75462
$$ 285320 329775 121721 306637 126626 221026 365525 -12837 204317 361324 636786
14937F36786A59403J4026o8506J39649A05406L75230k35087r7082K02360A2491
$$ 636786 159403 173429 104923 244572 105406 480636 245549 148467 350827 12491
14926D50766A24658J21689M08676k24126a02825F33079k40160A53721J75321r7840
$$ 450766 124658 246347 655023 430897 -102825 633079 392919 153721 329042 231202
14916B31202N5376L37589k37726o649F7160L67801r82K740Q5796a53124E45635
$$ 231202 286578 624167 386441 379792 67160 434961 433979 436719 522515 -153124 545635
14904H1174M04576J66431A52584a04082C00596j04858J96106N1334A85170M5442
$$ 81174 485750 652181 152584 -104082 300596 195738 391844 443178 185170 230612
14894B30612J64124M3818R4681j29636I4156L59386j27641A58255N1004M43768
$$ 230612 394736 438554 533235 403599 94156 453542 325901 158255 209259 653027
14884F53027j67482O4004k59509K79279k45640j46409J36332j01615K36950k713
$$ 653027 485545 549549 290040 569319 323679 177270 313602 211987 448937 446224
14874D46224A97554M52557C02600N0552L00951l09815i4553D32449J25420A5417
$$ 446224 197554 650111 302600 353152 654103 344288 -94553 432449 557869 15417
14863B40780J98838k4743k0969j95375L8164P1569j08936M89584B58560P722K32874
$$ 240780 439618 414875 393906 198531 236695 308264 199328 688912 258560 266282 499156
14852D99156N2099N5030m254r8708N8074j94800j36393J46738q6540K43462a51849
$$ 499156 551255 606285 602031 503323 561397 366597 230204 376942 290402 533864 -151849
14840C83815p3396k1221K77830j79554K17753j86996L8213K25891k95376p3362
$$ 383815 310419 289198 567028 387474 605227 418231 456444 682335 386959 313597
14830C13597K33577k26520J71636j36941L73183k25904j19088J31255k52045L24271
$$ 313597 547174 320654 492290 355349 728532 502628 383540 514795 262750 587021
14820E87021p9803J41844B84409Q6585I3266M26356J45901k46279q2778K23419
$$ 587021 507218 649062 284409 370994 93266 519622 665523 419244 336466 559885
14810E59885K43120l61410j61029j4941K94346J61314k68645K65991j75868j09912
$$ 559885 803005 441595 280566 265625 559971 721285 452640 718631 542763 432851
14800D32851K33820B63386K93348j0686J86431k29312q883J87686C34948J22459
$$ 432851 666671 263386 556734 546048 732479 503167 494284 681970 334948 457407
14790D57407J10485J55469l14356M9023A30778L88681k35010M37392k15438j12031
$$ 457407 567892 723361 409005 458028 130778 519459 284449 721841 506403 394372
14780C94372K47141j02501N5747m5981m4073k24744J56006J71376p9449p3969
$$ 394372 641513 539012 594759 548778 504705 279961 435967 607343 527894 453925
14770D53925K47242j15437k10432J55307J35120k54582O4281n3916L01416m8717
$$ 453925 701167 585730 375298 530605 665725 411143 475424 421508 722924 674207
14760F74207J3240L7085l543r7903j71720R0286l0382J15356j99612j39065L81497
$$ 674207 687447 724532 720989 623086 451366 541652 511270 626626 427014 287949 669446
14749F69446M66089l21716k90278p3350M08200l03460J78467J98588j25149k0269
$$ 669446 1135535 813819 523541 450191 858391 554931 733398 931986 806837 786568
14739G86568j36608J97028m21769P37536n57807K74264l4828j38344K54441n7882
$$ 786568 649960 846988 425219 1162755 604948 879212 844384 706040 960481 902599
14729I02599J59227m22219K19776k11542J02083M2522K72689k53619j10678p2466
$$ 902599 1061826 639607 859383 647841 749924 792446 1065135 811516 700838 628372
14719F28372L33292D24596O8293L26355j26342J42220j66218m2333Q1492L10144
$$ 628372 961664 424596 492889 819244 692902 835122 668904 626571 708063 1018207
14709A018207L8347k91785O7709j15585P1920J66782m5062j04923n5133J91439
$$ 1018207 1056554 764769 832478 716893 788813 955595 910533 805610 750477 941916
14699I41916K00004J08303q2613l05702J71075p5072r7592o1935J22096j54556
$$ 941916 1141920 1250223 1167610 861908 1032983 957911 860319 798384 920480 765924
14689G65924l6862L31751j30671N5875j83341K59785k44158K93196k41733K64314
$$ 765924 729062 1060813 930142 986017 802676 1062461 818303 1111499 869766 1134080
14679A134080k30296K03708k92740J77881D84100O18076j7294j87488L64613k52789
$$ 1134080 903784 1107492 814752 992633 484100 1102176 1084882 897394 1262007 1009218
14669A009218Q7840j47898K39572j32892R5314K2777j05407j58025K99008k00723
$$ 1009218 1097058 949160 1188732 1055840 1151154 1173931 1068524 910499 1209507 1008784
14659A008784k99295J3018M84255m7642M5398n4976J37624J0415j16962Q0166
$$ 1008784 709489 722507 1206762 1159120 1204518 1149542 1287166 1297581 1180619 1260785
14649A260785j22076N4261J35599P3857l28941j18984J75085j4596q3731J57787
$$ 1260785 1138709 1192970 1328569 1402426 1073485 954501 1129586 1114990 1031259 1189046
14639A189046L78221j18878j58360j09947M72442r7000k74129j2852J3948O8527
$$ 1189046 1567267 1448389 1290029 1180082 1652524 1555524 1281395 1268543 1282491 1351018
14629A351018L8949j21603J06236N3770j05412L47409K70278m66425J90302j7781
$$ 1351018 1389967 1268364 1374600 1428370 1322958 1670367 1940645 1474220 1664522 1646741
14619A646741k35268K37417k60422j74128J46070J18124P79079r47742J86928
$$ 1646741 1411473 1648890 1388468 1214340 1360410 1478534 2257613 1309871 1496799
14610A496799O5587j64091K7679Q4757M54991l07305M8366k48494J9917l4911
$$ 1496799 1562386 1398295 1425974 1510731 1965722 1658417 1706783 1458289 1478206 1443295
14600A443295K75093J44420J48911m20028j25772M84595k89336l50488O24328
$$ 1443295 1718388 1862808 2011719 1591691 1465919 1950514 1661178 1310690 1935018
14591A935018k80012J01965J58880o9195q8168J21314Q138m5918J21368K01483
$$ 1935018 1655006 1756971 1915851 1846656 1758488 1879802 1887940 1842022 1963390 2164873
14581B164873l53756M13033n03683M44391l7847j37106J38513K30704J14963k75038
$$ 2164873 1811117 2224150 1720467 2164858 2127011 1989905 2128418 2359122 2474085 2199047
14571B199047L2517J38044o3843K53500j58684K65769j79966J90643L74022N436
$$ 2199047 2231564 2369608 2305765 2559265 2400581 2666350 2486384 2677027 3051049 3056485
14561C056485j58526N73367k44609L29596M49555R6127K32288M24511K0629M89066
$$ 3056485 2897959 3471326 3226717 3556313 4005868 4101995 4334283 4758794 4779423 5268489
14551E268489J034785J122359J684409L287090O399961R371088L558480j3873907
$$ 5268489 6303274 7425633 9110042 12397132 18797093 28168181 31726661 17852754
14543A7852754q528837l153974j466293o91162q90931J37547j41437r7296k32706
$$ 17852754 9323917 6169943 4703650 4012488 3121557 3259104 3117667 3020371 2787665
14534B787665N8077k71327L47459k59576R5467p1043Q3490k73422K70926k61769
$$ 2787665 2845742 2574415 2921874 2662298 2757765 2686722 2770212 2496790 2767716 2505947
14524B505947L75447l64815L43045l07566L04924k57149K32281R6095k04420L64557
$$ 2505947 2881394 2516579 2859624 2552058 2856982 2599833 2832114 2928209 2723789 3088346
14514C088346n12076L29339L6718k39645J65020L56272M0489m01493M79268m17462
$$ 3088346 2576270 2905609 2942327 2702682 2867702 3223974 3264463 2862970 3342238 2924776
14504B924776J92723R2271K5484l2929k480l5140K37200j87182K62456l09510
$$ 2924776 3117499 3209770 3235254 3202325 3199845 3164705 3401905 3214723 3477179 3167669
14494C167669N52433o02734N57497k5715k28791K86473J39928j31950j51300K41150
$$ 3167669 3720102 3117368 3674865 3649150 3420359 3706832 3846760 3714810 3563510 3804660
14484C804660J8161j95932M71459l00956J39561R7268j95700J91352O0382P8054
$$ 3804660 3822821 3626889 4098348 3797392 3936953 4034221 3838521 4029873 4090255 4168309
14474D168309k84827L45403R137Q881M05275l49784L7485K40896J62117k97850
$$ 4168309 3883482 4228885 4238022 4246903 4652178 4302394 4339879 4580775 4742892 4445042
14464D445042k1698J66677J88970K12821J83215o10764L47901j62660L00281O9424
$$ 4445042 4423344 4590021 4778991 4991812 5175027 4564263 4912164 4749504 5049785 5119209
14454E119209J31258L22916p7562J59748k70009Q9503m2895M84910l973L92789
$$ 5119209 5250467 5573383 5495821 5655569 5385560 5475063 5432168 5917078 5913105 6305894
14444F305894n42297m0624K61848j06285L72262l720J61482O9420j30064K07050
$$ 6305894 5763597 5722973 5984821 5878536 6250798 6247078 6408560 6477980 6347916 6554966
14434F554966M42488n0927L8679j86222M60978n9207N1541q3717l311J79341K09512
$$ 6554966 6997454 6946527 6985206 6798984 7259962 7200755 7252296 7168579 7165268 7344609 7554121
14423G554121N0648J94847N1054K96588K86268p6684J81351P4302J86233o6393
$$ 7554121 7604769 7799616 7850670 8147258 8433526 8356842 8538193 8612495 8798728 8732335
14413H732335R5975l4868M0192M78656j26551L01094L6755M78851k25674M21342
$$ 8732335 8828310 8793442 8833634 9312290 9185739 9486833 9523588 10002439 9776765 10198107
14403A0198107J37506R7379J15851L85965l17292K09465N55739J92528K77520
$$ 10198107 10335613 10432992 10548843 10934808 10617516 10826981 11382720 11575248 11852768
14394A1852768k24987O36629J13653N95J89216K11000K64204q8294P03512n5882
$$ 11852768 11627781 12264410 12378063 12378658 12567874 12778874 13043078 12954784 13658296 13602414
14384A3602414J86050O12629J27361K14330O26931P3771L8918N54855J3470M44563
$$ 13602414 13788464 14401093 14528454 14742784 15369715 15443486 15482404 16037259 16050729 16495292
14374A6495292J80282M45465M91135J49582O21555M17004K1994J082550n4520
$$ 16495292 16675574 17121039 17612174 17761756 18383311 18800315 18822309 19904859 19850339
14365A9850339O638P02200K90014O41531M32072O43671L74572M69217O16761N37988
$$ 19850339 19856977 20559177 20849191 21490722 21922794 22566465 22941037 23410254 24027015 24565003
14355B4565003N62155L51760J018477M71269P51266L61881M76722O57207J107568
$$ 24565003 25127158 25478918 26497395 26968664 27719930 28081811 28558533 29215740 30323308
14346C0323308Q19628R37347Q32165Q86224Q93271J036589J232232O30057J214426
$$ 30323308 31142936 32080283 32912448 33798672 34691943 35728532 36960764 37590821 38805247
14337C8805247Q59649J520839J097350J045252J317809J430191J337609J585003
$$ 38805247 39664896 41185735 42283085 43328337 44646146 46076337 47413946 48998949
14329D8998949J180919J969539J702606J662080K274130J540391K249634K458962
$$ 48998949 50179868 52149407 53852013 55514093 57788223 59328614 61578248 64037210
14321F4037210K057263K224417K822714K170764L009879K889515L256426L223204
$$ 64037210 66094473 68318890 71141604 73312368 76322247 79211762 82468188 85691392
14313H5691392L377460L844739L544714L845427M235181M473505M823196N057707
$$ 85691392 89068852 92913591 96458305 100303732 104538913 109012418 113835614 118893321
14305A18893321N077094N546051N755309O162415O629371P077939P323895P935396
$$ 118893321 123970415 129516466 135271775 141434190 148063561 155141500 162465395 170400791
14297A70400791Q488409Q919111R318915R886850J0531556J0939253J1458820
$$ 170400791 178889200 187808311 197127226 207014076 217545632 228484885 239943705
14290B39943705J2034086J1886650J2378380J1443129J1972911J1455325J1620538
$$ 239943705 251977791 263864441 276242821 287685950 299658861 311114186 322734724
14283C22734724J1618062J0496196R519748J0187638J0174273J0662792J0844340
$$ 322734724 334352786 344848982 354368730 364556368 374730641 385393433 396237773
14276C96237773J1136468J0461851J0512879Q240455N752631L873277L751625
$$ 396237773 407374241 417836092 428348971 436589426 442342057 446215334 449966959
14269D49966959P51599l934117o258472j0028460j2294857j2883090j2424178
$$ 449966959 450718558 446784441 440525969 430497509 418202652 405319562 392895384
14262C92895384j3529288j2683818j2630088j2602916j2980494j1544336j2200830
$$ 392895384 379366096 366682278 354052190 341449274 328468780 316924444 304723614
14255C04723614j2032061j1668650j1079469j1131625j1422903j0834648r980478
$$ 304723614 292691553 281022903 269943434 258811809 247388906 236554258 226573780
14248B26573780r593141r151618q611632q268349p814911p736190p566030o972169
$$ 226573780 216980639 207829021 199217389 190949040 183134129 175397939 167831909 160859740
14240A60859740o533344o201689n626544n585694n584781n348557m783181m666802
$$ 160859740 154326396 148124707 142498163 136912469 131327688 125979131 121195950 116529148
14232A16529148m389502m187610m132720l910820m024656l660904l381634l463059
$$ 116529148 112139646 107952036 103819316 99908496 95883840 92222936 88841302 85378243
14224H5378243l065268k979843k755433k404573k745763k275893k544413k256451
$$ 85378243 82312975 79333132 76577699 74173126 71427363 69151470 66607057 64350606
14216F4350606k483840j950445j491252j790981k038082j634648j878735j253908
$$ 64350606 61866766 59916321 58425069 56634088 54596006 52961358 51082623 49828715
14208D9828715j205562j464095j757650j302754j330081j236904j190778j226202
$$ 49828715 48623153 47159058 45401408 44098654 42768573 41531669 40340891 39114689
14200C9114689o37749j332337j134284j254314r07076r91267m61046r47987j098986
$$ 39114689 38476940 37144603 36010319 34756005 33848929 32857662 32396616 31448629 30349643
14191C0349643o13852o42961j110995k95038m84722q18594p63566q07837l33601
$$ 30349643 29735791 29092830 27981835 27686797 27202075 26383481 25619915 24812078 24478477
14182B4478477m63498q52661l42993m62874k95756j019841m5814l00624r16741
$$ 24478477 24014979 23162318 22819325 22356451 22060695 21040854 20995040 20694416 19777675
14173A9777675m81l95966p27082j81503n65570n9342l02944n32950k34651l97999
$$ 19777675 19777194 19381228 18654146 18472643 17907073 17847731 17544787 17011837 16777186 16379187
14163A6379187j60194m09320m73089J8912m16914r9232l09453l05164l99303J13828
$$ 16379187 16218993 15809673 15336584 15355496 14938582 14839350 14529897 14224733 13825430 13939258
14153A3939258k64275l52988j25089j4415n82135n73395J70330j14717n646l70659
$$ 13939258 13674983 13321995 13196906 13182491 12600356 12026961 12197291 12082574 12076928 11706269
14143A1706269j20272j5685m40114k40884K26603o12765j44154l7892m15679J23771
$$ 11706269 11585997 11570312 11130198 10889314 11115917 10503152 10358998 10321106 9905427 10029198
14133A0029198j30160r8142m01972K69529j35933l97927m05472J08607J43485
$$ 10029198 9899038 9800896 9398924 9668453 9532520 9134593 8729121 8837728 8981213
14124H981213l05291l4072o9269n9133k07687j06728m00545L93026o04896J5188
$$ 8981213 8675922 8641850 8572581 8513448 8305761 8199033 7798488 8191514 7586618 7601806
14114G601806J82571l73500j07342K95167l55073P0350n34490L46459j42938m37086
$$ 7601806 7784377 7410877 7303535 7598702 7243629 7313979 6779489 7125948 6983010 6545924
14104F545924K86558j38362j66731P8293k14574Q4233l02858j02810q1963J39585
$$ 6545924 6832482 6694120 6527389 6605682 6391108 6475341 6172483 6069673 5987710 6127295
14094F127295m325p0403l40024L1683j28658k50661N16808n05930R9775k47572
$$ 6127295 6122970 6052567 5712543 5744226 5615568 5364907 5881715 5375785 5475560 5227988
14084E227988K91199O1573k57365J05548m64850o2820m1446K86103o4530k17779
$$ 5227988 5519187 5580760 5323395 5428943 4964093 4901273 4859827 5145930 5081400 4863621
14074D863621l3049k58397l21455N08758j52599n851k77461K92902J7841k58914
$$ 4863621 4830572 4572175 4250720 4759478 4606879 4601028 4323567 4616469 4634310 4375396
14064D375396j52545J4319K7190j30634K81662O2285k76989j12278P2045j73523
$$ 4375396 4222851 4237170 4264360 4133726 4415388 4477673 4200684 4088406 4160451 3986928
14054C986928J13128j43071j09444K45705o59117K70302j98334K49383m24899
$$ 3986928 4100056 3956985 3847541 4093246 3434129 3704431 3506097 3755480 3330581
14045C330581M16542n484l55678J79821k06858K4826P8497p9290l08773J7534
$$ 3330581 3747123 3741639 3385961 3565782 3358924 3383750 3462247 3382957 3074184 3091718
14035C091718K02204J1219j85938j01704J37616r5461K5737M3912J05726o3846
$$ 3091718 3293922 3305141 3119203 3017499 3155115 3059654 3085391 3129303 3235029 3171183
14025C171183r9695N0762k18548L7644Q4777k32909M5038k78569J86992O385L22512
$$ 3171183 3071488 3122250 2903702 2941346 3026123 2793214 2838252 2559683 2746675 2753060 3075572
14014C075572k07171k90915n0282P7844q1809m11706L58022J24058j2511K36037
$$ 3075572 2868401 2577486 2527204 2605048 2523239 2111533 2469555 2593613 2581102 2817139
14004B817139n12905J63812m0813K60192l58343L44043K82279Q1066j6386j0251
$$ 2817139 2304234 2468046 2427233 2687425 2329082 2673125 2955404 3036470 3020084 3009833
13994C009833K96999N6623L58863L22875Q80040R21458L134042N367961R718126
$$ 3009833 3306832 3363455 3722318 4045193 4925233 5846691 8980733 14348694 24066820
13985B4066820P700067j0376679q533900m131568j617703j435248n50132q12375
$$ 24066820 31766887 21390208 12856308 8724740 7107037 5671789 5121657 4309282
13977D309282J77455n52185m53274J98991n93113N09203o00671J00342k22220
$$ 4309282 4486737 3934552 3481278 3680269 3087156 3596359 2995688 3096030 2873810
13968B873810l68502K73974l08946k02591J85282j43556M07977j17204k44830
$$ 2873810 2505308 2779282 2470336 2267745 2453027 2309471 2717448 2600244 2355414
13959B355414R7041q1234J4286j33974J44493j68873M5118J01153P1905m48530
$$ 2355414 2452455 2371221 2385507 2251533 2396026 2227153 2272271 2373424 2445329 1996799
13949A996799J67384k3264M3279j78221L9000k40805L07491j59474J87774n4910
$$ 1996799 2164183 2140919 2184198 2005977 2044977 1804172 2111663 1952189 2139963 2085053
13939B085053n01365J58685L96416j66168r4670l34073N39677l49150j09968K24531
$$ 2085053 1583688 1742373 2138789 1972621 1877951 1543878 2083555 1734405 1624437 1848968
13929A848968j52865j10733K53357k65125K16413r9746R7354k42736R6003m6633
$$ 1848968 1696103 1585370 1838727 1573602 1790015 1690269 1787623 1544887 1640890 1594257
13919A594257K27844K4863l04940M8545r9717k68335N07173k01908J25427k62335
$$ 1594257 1822101 1846964 1542024 1590569 1490852 1222517 1729690 1527782 1653209 1390874
13909A390874l82840P17684m41526L00153r2657J52437l15268k57179N70273k07142
$$ 1390874 1008034 1725718 1284192 1584345 1491688 1644125 1328857 1071678 1641951 1434809
13899A434809L1880l58388L04431J42420k49702j24641L67756j85895j09043K14369
$$ 1434809 1466689 1108301 1412732 1555152 1305450 1180809 1548565 1362670 1253627 1467996
13889A467996l3576K83773l95002l7303m1642L43836n65377L86778k39184n0810
$$ 1467996 1434420 1718193 1323191 1285888 1244246 1588082 1022705 1409483 1170299 1119489
13879A119489J06113J24651K25440k96184j94036J52066L8963q1387j22079L17126
$$ 1119489 1225602 1350253 1575693 1279509 1085473 1237539 1276502 1195115 1073036 1390162
13869A390162j12343K49131m37223j52591Q0383R339m6064l29410N62226K83535
$$ 1390162 1277819 1526950 1089727 937136 1017519 1026858 980794 651384 1213610 1497145
13859A497145F64192J11847N00286J0870k67547l4269J11816L5020J19282o4232
$$ 1497145 664192 776039 1276325 1287195 1019648 985379 1097195 1132215 1251497 1187265
13849A187265k04418K10047J52600m63326R3527J37769j32277n9425K5748j3669
$$ 1187265 982847 1192894 1345494 882168 975695 1113464 981187 921762 947510 933841
13839I33841o9460L79459k33763k1898O8789J69301P4031j63242m0896q2835m05344
$$ 933841 864381 1243840 1010077 988179 1056968 1226269 1300300 1137058 1096162 1013327 607983
13828F07983L68396j25092l9478K12368k04040P4880j44765J25265k70880J42138
$$ 607983 976379 851287 811809 1024177 820137 895017 750252 875517 604637 746775
13818G46775N9482q9110K8009K41944k33634K96175o3596J54170m22479K50342
$$ 746775 806257 717147 745156 987100 753466 1049641 986045 1140215 717736 968078
13808I68078n3217N2785n1842m9599q2885K5257N624J10302m00802N48580k63975
$$ 968078 914861 967646 915804 866205 783320 808577 814201 924503 523701 1072281 808306
13797H08306J07548j72923K88980l75188J65658K75135l20743L48439Q8621E18700
$$ 808306 915854 742931 1031911 656723 822381 1097516 776773 1125212 1213833 518700
13786F93047J1109K98274n831m0280k90837r3796K54415J60888j0717k13281L04926
$$ 693047 704156 1002430 996599 956319 665482 571686 826101 986989 976272 762991 1067917
13775A067917k41032j31782j76514N64801k28617N4895j19386j83435L78706K0613
$$ 1067917 826885 695103 518589 1083390 854773 909668 790282 606847 985553 1006166
13765A006166k69573J25658C76486j49234M06599j7848K98967R0135D59160K01238
$$ 1006166 736593 862251 376486 227252 633851 616003 914970 1005105 459160 660398
13755F60398k35162L26694K74547l66511l03879j7573J61106L92194l48515J05478
$$ 660398 425236 751930 1026477 659966 356087 338514 499620 891814 543299 648777
13745F48777q2367K892j34247J77703M47956l97756N10794E76970m7756j46337
$$ 648777 566410 569302 435055 612758 1060714 662958 1173752 576970 529214 382877
13735C82877K79583j68451K05325j30364o6257K20295B93562Q38857j97923j66676
$$ 382877 662460 494009 699334 568970 502713 723008 293562 1132419 934496 767820
13725G67820o6633K6513l5628j04770Q277j96828L81313j78325j57199o6084K61650
$$ 767820 701187 727700 692072 587302 595579 398751 780064 601739 444540 378456 640106
13714F40106j8355O0554j54026K89811l58226O7248j3371l7772m3521R4970L5790
$$ 640106 621751 682305 528279 818090 459864 527112 513741 475969 432448 527418 563208
13703E63208o5380R4364J56796r4221C15278J59252j27214J74871J71863j07266
$$ 563208 497828 592192 748988 654767 315278 474530 347316 522187 694050 586784
13693E86784j07403K2208o468K24466C24825J9968J72165K45192p5373j49839
$$ 586784 479381 501589 495121 719587 324825 344793 516958 762150 686777 536938
13683E36938j69741A16467L35251J71314B32798M86629j86408L38003m17098F0800
$$ 536938 367197 116467 451718 623032 232798 719427 533019 871022 453924 60800
13672D13882j04269L56085r8760K7582m0763j82985K88964k45484P8634P6709
$$ 413882 309613 665698 566938 594520 553757 370772 659736 414252 492886 569595
13662E69595r5582O6837B22840p1610L33045j345J4969j26796j83000j7573M26044
$$ 569595 474013 540850 222840 151230 484275 482930 497899 371103 188103 170530 596574
13651E96574k96505J46096R1857j27259J4783j64530K87412k20250K44784l0881
$$ 596574 300069 446165 538022 410763 425546 261016 548428 328178 572962 542081
13641E42081j02181j88196K58121I4082O28559j51835j92676j17328J6046K23747
$$ 542081 439900 251704 509825 94082 722641 570806 378130 260802 276848 500595
13631E00595l0750L7824p2737o5534J36226j23213N003J54538f31A96783K81778
$$ 500595 469845 507669 434932 369398 505624 382411 387414 541952 -631 196783 478561
13620D78561A41434K63739j43255O7080j5766K02098l657j24133K37250J53431
$$ 478561 141434 405173 261918 328998 313232 515330 511673 387540 624790 778221
13610G78221C57936j46135L39593k13232r656Q6444j47111o3425J84621J27259
$$ 778221 357936 211801 551394 338162 328506 414950 267839 204414 389035 516294
13600E16294B31534K16643A95630K42731j17681R6254A38308N00812k50235J29623
$$ 516294 231534 448177 195630 438361 320680 416934 138308 639120 388885 518508
13590E18508j54414J98900j23997k12595M7872K18228K7603j98228K10464k27903
$$ 518508 364094 562994 438997 226402 274274 492502 520105 321877 532341 304438
13580C04438M04846L2364B88057P3922K34634j90098o0939L18259C28250l8414
$$ 304438 709284 741648 288057 361979 596613 406515 345576 663835 328250 289836
13570B89836r3181K71565d8226C00225C2745L49360J37490j49860H3892R9190
$$ 289836 196655 468220 -48226 300225 32745 382105 519595 369735 83892 183082
13560A83082M36727k93786O6806p921L56400D0634o064M91323j8093k05991K04740
$$ 183082 619809 326023 392829 384908 741308 40634 34570 525893 507800 301809 506549
13549E06549A00609I484M16673j78923J4126K60054A02327J11317L30491j82638
$$ 506549 100609 9484 426157 247234 261360 521414 102327 213644 544135 361497
13539C61497K24426G6194J37663q990o6246G443M21441J08952j62009A35327a12121
$$ 361497 585923 76194 213857 204867 138621 7443 428884 537836 375827 135327 -112121
13527A5984M49492H1080K75407j45567C2306K27299A18928P4626I2226K47941
$$ 15984 465476 81080 356487 210920 32306 259605 118928 193554 92226 340167
13517C40167J68499L4146A77910l7751K80727O6926p8135l4431m1366J09031A28849
$$ 340167 508666 542812 177910 140159 420886 487812 409677 375246 333880 442911 128849
13505I5019J07152K25934F7061L19457j80988a15527B43482j18371J50515p5523
$$ 95019 202171 428105 67061 386518 205530 -115527 243482 125111 275626 200103
13495B00103K12212o5820A13621K47608J41312k36247J31603j52427P6970Q046
$$ 200103 412315 346495 113621 361229 502541 266294 397897 245470 322440 330486
13485C30486e0202C85042m8308A68289j4838K41696p1321k0783j07262K52577
$$ 330486 -50202 385042 336734 168289 153451 395147 323826 303043 195781 448358
13475D48358A88384L60360k73167A07713K24930A51146K75022j7363o2761q6499
$$ 448358 188384 548744 275577 107713 332643 151146 426168 408805 346044 259545
13465B59545K22624I0690L16107J02303E4994L15171p5345n2939K1105J31309
$$ 259545 482169 90690 406797 509100 54994 370165 294820 241881 262986 394295
13455C94295j00165I7819K38461o4393p8252j1713J26235F7638K39377K3874o5270
$$ 394295 294130 97819 336280 271887 193635 181922 308157 67638 307015 330889 265619
13444B65619Q1082R1373b0406D21441m2912j5062r1052P4901j54806J85522J2862
$$ 265619 346701 438074 -20406 421441 378529 363467 272415 347316 192510 378032 390894
13433C90894a6319A9977L98837A1003d0194C64475L1027A33760Q827K84297B400
$$ 390894 -16319 19977 418814 11003 -40194 364475 395502 133760 142587 426884 2400
13421B42878K42223H9198l2847a22243N1437C36398A19302a0904B45663L727J88595
$$ 242878 485101 89198 56351 -122243 -70806 336398 119302 -10904 245663 249390 437985
13410D37985j8430A30494c235q7352C70522j06986A8874M35926j00850k2237B0268
$$ 437985 419555 130494 -3235 -90587 370522 263536 18874 454800 353950 331713 20268
13398B48779k5337R7070K22136i7999A1498L24791o0732g1449J0022A17665J11104
$$ 248779 223442 320512 542648 -97999 11498 336289 275557 -71449 -61427 117665 228769
13387B28769r4168P6912g7358B10791j9834E2997L3057a25944B01845J26390A02566
$$ 228769 134601 211513 -77358 210791 190957 52997 86054 -125944 201845 328235 102566
13375A54344A407K43423E5523K70725A53665Q5777N4688I2967N18368a34156H7493
$$ 154344 1407 244830 55523 326248 153665 239442 294130 92967 611335 -134156 87493
13363C75053A24043N40328B89667J00936n1532j50757A5146b9637I8973K23213
$$ 375053 124043 664371 289667 390603 339071 188314 15146 -29637 98973 322186
13353C22186B9613h8030A41222L82542j28247j04579m9264L13501q2780j84274
$$ 322186 29613 -88030 141222 523764 395517 290938 241674 555175 472395 288121
13343B88121n6601L32915O0595B08615J68217j08090J32548F7305R9455J05756
$$ 288121 231520 564435 625030 208615 376832 268742 401290 67305 166760 272516
13333B72516C2287K20257C7709K92638A44622J54325K1626Q5220G4162J34185
$$ 272516 32287 252544 37709 330347 144622 298947 320573 405793 74162 208347
13323B08347r3123L24559B13875o4046l7150b68718C66815J46366B360a72570
$$ 208347 115224 439783 213875 149829 112679 -268718 366815 513181 2360 -172570
13312B35363J09571j45024l4567L49404h043B69874J35239A66983J37327n6388
$$ 235363 344934 199910 165343 514747 -8043 269874 405113 166983 304310 247922
13302B47922e7207H4970Q2633F7205F038N03274h7225a6868A10598g3284a8370
$$ 247922 -57207 84970 167603 67205 6038 509312 -87225 -16868 110598 -73284 -18370
13290A75621d62254B15143D2202K53740j0794C967K87921H6712h1191B77516n6327
$$ 175621 -462254 215143 42202 295942 285148 3967 291888 86712 -81191 277516 221189
13279B21189a67197A22882q094m8612M4445f0801A86838j5954D6442J02090c497
$$ 221189 -167197 122882 114788 66176 110621 -60801 186838 170884 46442 148532 -3497
13267a28853B59790D9121K44789L7530o9471C8296R7831J26165Q0636P6251B4651
$$ -128853 259790 49121 293910 331440 261969 38296 136127 262292 342928 419179 24651
13255f4021A83901o6294O7274b14596h0640L4409B69482G0498a39592A15223L02621
$$ -64021 183901 117607 184881 -214596 -80640 -46231 269482 70498 -139592 115223 417844
13244D17844A79077a1581q2032C34408l9590j35929O9701b8179A19728k1807P2965
$$ 417844 179077 -11581 -93613 334408 294818 158889 228590 -28179 119728 97921 170886
13233A70886O4835J35431E58M03842A58240M0760J284K84840j31660G7810J69925
$$ 170886 235721 371152 558 404400 158240 199000 200284 485124 353464 77810 247735
13222B47735r0581Q1576d8594I1591J80255i9810J0953k21714D74659A77129L58693
$$ 247735 157154 238730 -48594 91591 271846 -99810 -88857 -310571 474659 177129 535822
13211E35822A15445n3923b98987G6630Q6806p8170f8047p1665G1980L67850D6192
$$ 535822 115445 61522 -298987 76630 163436 85266 -68047 -139712 71980 439830 46192
13199B85780K00318j33031o7145C9023A1455c137n3797j6436A18026M7575f5237
$$ 285780 486098 353067 285922 39023 11455 -3137 -56934 -73370 118026 165601 -65237
13187a32077A68289c9450C24762q8091e2404D38914k07050b7760I2175d04704
$$ -132077 168289 -39450 324762 236671 -52404 438914 231864 -27760 92175 -404704
13176C41054c569j12325N0766Q657r1016q493A88417J1022g2611I3195A2124a03366
$$ 341054 -3569 -115894 -65128 -56471 -147487 -155980 188417 199439 -72611 93195 12124 -103366
13163B10625b16293C15158a09253C55373A58027N2932C5651K41666A25615a52873
$$ 210625 -216293 315158 -109253 355373 158027 210959 35651 277317 125615 -152873
13152F0286J82516a75442B10994J70103j52429j6758I8762P7620n7571A4432C071
$$ 60286 242802 -175442 210994 381097 228668 211910 98762 176382 118811 14432 3071
13140B63379C9870f4327A74205P7062a18950B11244j6h9561M0598B09826j0421
$$ 263379 39870 -64327 174205 251267 -118950 211244 211228 -89561 -48963 209826 199405
13129A99405l706e8166j46556o1426D7512j5185K25860d11092c44D68043H1373
$$ 199405 195699 -58166 -204722 -266148 47512 32327 258187 -411092 -344 468043 81373
13117B15436a077A17110J46202j0156e7073A7477n714P4053a53382A20294K71806
$$ 215436 -1077 117110 263312 253156 -57073 17477 11763 85816 -153382 120294 392100
13106C92100p1126F0867J20723J62159A04738l1250c3958E0321J22988A0775K01066
$$ 392100 320974 60867 181590 343749 104738 73488 -33958 50321 173309 10775 211841
13095B11841P6370B138J29145N542N2504p5741Q2167g3101b6702k60361b7296
$$ 211841 288211 2138 131283 136825 189329 113588 195755 -73101 -26702 -287063 -27296
13083a58613B59624N3208A25467C4913P5075d2481k45416F4521J37382m0539L40719
$$ -158613 259624 312832 125467 34913 109988 -42481 -287897 64521 201903 161364 502083
13072E02083E2176j0361J84737R5092j0760F5732M0076i8636L1148n9541E3519
$$ 502083 52176 41815 226552 321644 310884 65732 105808 -98636 -67488 -127029 53519
13060B76991C9649M0775a14441j05454d3741A3781d7907r1601B29799j04657l1188
$$ 276991 39649 80424 -114441 -219895 -43741 13781 -47907 -139508 229799 125142 93954
13049I3954R0087A8806J59402p5390c3116B36169L2982I4526O7715e2383B97892
$$ 93954 184041 18806 178208 102818 -33116 236169 269151 94526 162241 -52383 297892
13037C10061I6747P6926j0479E9363O1330J15121E624K84313j39947A2335J90141
$$ 310061 96747 173673 163194 59363 120693 235814 5624 289937 149990 12335 202476
13026B02476j01125m3870M0783g7322B33606b08892G6788l1951b78606A15987
$$ 202476 101351 57481 98264 -77322 233606 -208892 76788 44837 -278606 115987
13015G612K00780j5713d996A12437J09442l9457D6623J65234l174o2708F2378
$$ 7612 208392 192679 -4996 112437 221879 182422 46623 211857 208683 145975 62378
13003f2770A65424a19944J0258A90212a29503A19122E0103a99193n9680H3491
$$ -62770 165424 -119944 -109686 190212 -129503 119122 50103 -199193 -258873 83491
12992b24761B01359d6982j60928B11118C7239L17848r0739A25789a30561A92873
$$ -224761 201359 -46982 -207910 211118 37239 355087 264348 125789 -130561 192873
12981A22336L7545J68125I0413J29868n8829K22787j31944b1094m7920k20230
$$ 122336 159881 328006 90413 220281 161452 384239 252295 -21094 -69014 -289244
12971b89244e5119D9766K8942O8060b8008A74612K18265d2421n9870B42907r1778
$$ -289244 -55119 49766 78708 146768 -28008 174612 392877 -42421 -102291 242907 151129
12960A51129a52365A65200b4575H2093b59970D3863k253P2135D2500M0575l9215
$$ 151129 -152365 165200 -24575 82093 -259970 43863 41610 113745 42500 83075 43860
12949D3860J00789b41873K5174K4898m8282e5225A29376B8578L35351j32936c4044
$$ 43860 144649 -241873 -216699 -191801 -240083 -55225 129376 28578 363929 230993 -34044
12937i6607A45261N6254a19338K2645L8289j16217B49525r7429M0056A4981M5943
$$ -96607 145261 201515 -119338 -96693 -58404 -174621 249525 152096 192152 14981 60924
12926F0924R3750P0471o6363b95032J07175e8125A00506O6532a05417O939A35199
$$ 60924 154674 225145 158782 -295032 -187857 -58125 100506 167038 -105417 -98478 135199
12914C2316J77663L6306I4975B0160K20607d14150A20370f7889o5859B35004B2820
$$ 32316 209979 246285 94975 20160 240767 -414150 120370 -67889 -133748 235004 22820
12902a44989A51681D2181J48636l338c5336C1427J14794M3035F2789b72170A52935
$$ -144989 151681 42181 190817 187479 -35336 31427 146221 189256 62789 -272170 152935
12890G2613a31086c3271f464A25536E8161b35901J8142H3990h0687m4165A70491
$$ 72613 -131086 -33271 -6464 125536 58161 -235901 -217759 83990 -80687 -124852 170491
12878g6509C77289n260i2393F6396B3799R2270a75330A99849m7296g414A45225
$$ -76509 377289 372029 -92393 66396 23799 116069 -175330 199849 152553 -7414 145225
12866A9818K91520h5324B29233p9896J46138l1756A21653J0446C3120M9864P4607
$$ 19818 311338 -85324 229233 149337 295475 263719 121653 132099 33120 82984 157591
12855A57591f9959K9307J9917j31491B46698I6748b47734d2267A44339N2897n8481
$$ 157591 -69959 -40652 -20735 -152226 246698 96748 -247734 -42267 144339 197236 138755
12844A38755b33168A08314a14581F9716d64128B20232Q6903g0107r4115B12509
$$ 138755 -233168 108314 -114581 69716 -464128 220232 307135 -70107 -164222 212509
12833B28924I7809d1875a6168D0357N3004R9225b19272j17892B11842d6389K2847
$$ 228924 97809 -41875 -16168 40357 93361 192586 -219272 -337164 211842 -46389 -23542
12822b3542G1547h5064r0534B6930i8692h22D22555c78645B37295C6589J02318
$$ -23542 71547 -85064 -175598 26930 -98692 -822 422555 -378645 237295 36589 138907
12811A38907J27188D3131A7046L2162a21963H3937L8454A3072h8466k21294J20638
$$ 138907 266095 43131 17046 49208 -121963 83937 122391 13072 -88466 -309760 -189122
12800a89122H0912j437K16594b86355c9184l9711o0887A93061c621j57174D2830
$$ -189122 80912 79475 296069 -286355 -39184 -78895 -139782 193061 -3621 -160795 42830
12788a12921A24287J47704a44982n1843c6693I2128J12572b18698A57486b46991
$$ -112921 124287 271991 -144982 -196825 -36693 92128 204700 -218698 157486 -246991
12777D69509I074L99168H691P9710K2383n0742a14887c6925C08136b08599R0684
$$ 469509 9074 408242 8691 88401 110784 60042 -114887 -36925 308136 -208599 -117915
12766a17915B67416c2326B82520c54682A27864b05149I7737P3080H44g0518A10402
$$ -117915 267416 -32326 282520 -354682 127864 -205149 97737 170817 844 -70518 110402
12754i9128A9430J88053a22411B34061b25093B16343b8469m1123b7749p5636H1409
$$ -99128 19430 207483 -122411 234061 -225093 216343 -28469 -69592 -27749 -103385 81409
12742B73130Q2732f3393F2797J88117b28236h6625B2949J37966b32484A75309
$$ 273130 355862 -63393 62797 250914 -228236 -86625 22949 160915 -232484 175309
12731A3480K53237I3830M02456b9244l4981C2789b48080p0315c2586j76013C83820
$$ 13480 266717 93830 496286 -29244 -64225 32789 -248080 -318395 -32586 -208599 383820
12719a19871E9267J11318a10692I9795j3063m1499b9901A06635J42431f8992E53354
$$ -119871 59267 170585 -110692 99795 86732 45233 -29901 106635 249066 -68992 553354
12707g7988B27427O3612q7404o7999b816C92914A65882R7094b4002j90331D4077
$$ -77988 227427 291039 203635 135636 -2816 392914 165882 262976 -24002 -214333 44077
12695A42053e9306A55861c5640A47896J0178P0984b4437j24909g1301B8753a47498
$$ 142053 -59306 155861 -35640 147896 158074 229058 -24437 -149346 -71301 28753 -147498
12683H3566b46855O7060A83722R0123J33853A2471P7593e7940I8963b50323B37362
$$ 83566 -246855 -179795 183722 273845 407698 12471 90064 -57940 98963 -250323 237362
12671F5873b04558B6854L76744q9745a52513G2592H869c5479C723M4979N8293
$$ 65873 -204558 26854 403598 313853 -152513 72592 8869 -35479 3723 48702 106995
12660A06995l5102O4321J78702n0612F7387N2845l355b17795J5452A58453j2547
$$ 106995 71893 136214 314916 264304 67387 120232 116877 -217795 -202343 158453 145906
12649A45906a64381C20685b85551i9647A28151B3921K65261I0843h9109A30270
$$ 145906 -164381 320685 -285551 -99647 128151 23921 289182 90843 -89109 130270
12638B16424D8759J20047J42290N0962a34029A64019b31159A09726a1513o332
$$ 216424 48759 168806 311096 362058 -134029 164019 -231159 109726 -11513 -17845
12628a7845D62625j28408A45576m4157a70387D091a98897A33148Q2350n6326d3595
$$ -17845 462625 334217 145576 101419 -170387 4091 -198897 133148 215498 159172 -43595
12616h1500B63386o5529c9706A68697N2891M6665G5981a61461n9308c2424j10150
$$ -81500 263386 197857 -39706 168697 221588 268253 75981 -161461 -220769 -32424 -142574
12605a42574H9747R9498N8090n9482J19801H4591O4536R9981J20948A16780a38112
$$ -142574 89747 189245 247335 187853 307654 84591 149127 249108 370056 116780 -138112
12593B5171d78I6860K40573j08894C8413e9823B96672b20224A06809i6519C5432
$$ 25171 -478 96860 337433 228539 38413 -59823 296672 -220224 106809 -96519 35432
12581b4010g62J91A77341o4353a79783A71451a28705J0813B82559k8974j23273
$$ -24010 -762 -571 177341 112988 -179783 171451 -128705 -117892 282559 253585 130312
12570A30312n2017a9326j1484B07185o6176K90403G3059a80871A6505O9596b95433
$$ 130312 78295 -19326 -30810 207185 141009 431412 73059 -180871 16505 86101 -295433
12558I4677L0319J6216n1667P0856J35288a8202C0334d90185A26366a84759A4163
$$ 94677 124996 141212 89545 160401 295689 -18202 30334 -490185 126366 -184759 14163
12546A68532o137e5497j88552M3445B48852c3396C03108D7212A1038a19867A8633
$$ 168532 162395 -55497 -244049 -200604 248852 -33396 303108 47212 11038 -119867 18633
12534A63917o6922b807I262a4344A61923q0448a75748A3726M0347a12512c3271
$$ 163917 96995 -2807 9262 -14344 161923 81475 -175748 13726 54073 -112512 -33271
12522I5033a03914j04584E4721M5073f5961I0598J12793q2868E3306i4917K3626
$$ 95033 -103914 -208498 54721 99794 -65961 90598 203391 120523 53306 -94917 -71291
12511g1291c3019F6697a67852A50843d8209E7670M533a03775q3577D06816b08224
$$ -71291 -33019 66697 -167852 150843 -48209 57670 62203 -103775 -187352 406816 -208224
12499D978b58827a1967j04843j49635J3965C12506b9280A0269b4209j63664A7916
$$ 4978 -258827 -11967 -116810 -266445 -252480 312506 -29280 10269 -24209 -187873 17916
12487a83750B48337K92380H1883J5496b08375b113C7541a48319M1053k2218K3829
$$ -183750 248337 540717 81883 97379 -208375 -2113 37541 -148319 -107266 -129484 -105655
12476a05655B90448A15270a61949j5650f2507R769B1953J64745a19224A39232
$$ -105655 290448 115270 -161949 -177599 -62507 -52738 21953 186698 -119224 139232
12465a33644D5912i9356j82420B17702b1976D1349b34084b7862l60396N4388E19170
$$ -133644 45912 -99356 -281776 217702 -21976 41349 -234084 -27862 -388258 -333870 519170
12453A72115K1774e6541C5755a68072Q628a2215c95A85812K17352I6803N0688
$$ 172115 193889 -56541 35755 -168072 -159444 -12215 -395 185812 403164 96803 147491
12442A47491E3700J20218a92175B2157b80710I8224J09625j01105c63229B82493
$$ 147491 53700 173918 -192175 22157 -280710 98224 207849 106744 -363229 282493
12431A3298b55297f9366j08195f0469k3544A51120E3629B5574h6150j12553I4528
$$ 13298 -255297 -69366 -177561 -60469 -84013 151120 53629 25574 -86150 -198703 94528
12419h7388A42939d6775D8658A5698K1806P5158b87331a7985I1594h0140j08925
$$ -87388 142939 -46775 48658 15698 37504 112662 -287331 -17985 91594 -80140 -189065
12408a89065N3960B0387Q1397D633e9944A50589b75464e7268C6932c06052j13373
$$ -189065 -135105 20387 101784 4633 -59944 150589 -275464 -57268 36932 -306052 -419425
12397d19425e7542C0898e7481a5530A83342H6952K83707H9874b3479j99760C69440
$$ -419425 -57542 30898 -57481 -15530 183342 86952 370659 89874 -23479 -223239 369440
12385A99518D485M8600f848B22805A7756Q652e223j49825f0410k19510H7301J38261
$$ 199518 4485 53085 -6848 222805 17756 26408 -5223 -155048 -60410 -279920 87301 225562
12373B25562F5036J057N3877n9969b86717a5902j95360G5106J63021n9930N0970
$$ 225562 65036 66093 119970 60001 -286717 -15902 -211262 75106 238127 178197 229167
12362B29167e0053C00933l400a5112F2358J44625b21211B33968D5097b20975F4648
$$ 229167 -50053 300933 297533 -15112 62358 206983 -221211 233968 45097 -220975 64648
12350a37240C97987a27606C8236J64311j3962J54163C308b65045A20160b38966
$$ -137240 397987 -127606 38236 202547 188585 342748 3308 -265045 120160 -238966
12339A29038l3944b07623D0240a97580H9972m4208d1796B07099a73531F9680a40420
$$ 129038 95094 -207623 40240 -197580 89972 45764 -41796 207099 -173531 69680 -140420
12327E1105O7965a19086K6145q7997A68031p3542g3712q4103B08544A5931f8536
$$ 51105 119070 -119086 -92941 -180938 168031 94489 -73712 -157815 208544 15931 -68536
12315a5935C60058j71761M4026D7153c52480D9406K13263a35506A39731b22905
$$ -15935 360058 188297 232323 47153 -352480 49406 262669 -135506 139731 -222905
12304A74683c50360b1463q0742G7035d2690E4780N2105J882G201R5631g9590a8725
$$ 174683 -350360 -21463 -102205 77035 -42690 54780 106885 108767 7201 102832 -79590 -18725
12291a45587C43286j11268e8935B19927k8624a26870A08389B9460N3962M7456
$$ -145587 343286 232018 -58935 219927 191303 -126870 108389 29460 83422 130878
12281A30878b3386A4018a17963H8411b71913A82259a12894j35417B84759A07846
$$ 130878 -23386 14018 -117963 88411 -271913 182259 -112894 -248311 284759 107846
12270d706B24131a126k17566f733B25381I0073b14123b3532B60209G145b2478
$$ -4706 224131 -1126 -218692 -6733 225381 90073 -214123 -23532 260209 7145 -22478
12258A51697M8391h3738q065l2761L9315B31348f7348B84265j7350o4912e1503
$$ 151697 200088 -83738 -91803 -124564 -85249 231348 -67348 284265 266915 202003 -51503
12246a28665d2286K85I1429a72484A49069M0653G1839i3289C2637J53287o3078
$$ -128665 -42286 -42001 91429 -172484 149069 189722 71839 -93289 32637 185924 122846
12235A22846E495g4297A60484m6118J28445b57575C48667a96037D0360J29069
$$ 122846 5495 -74297 160484 114366 242811 -257575 348667 -196037 40360 169429
12225A69429J35520J19388A64169L43442D4522O803A5559M7538Q9380a092B15035
$$ 169429 304949 424337 164169 507611 44522 51325 15559 63097 152477 -1092 215035
12213B03500J78084H1056a07346k4155E1935p556h3027A28159K08374a12445F0457
$$ 203500 381584 81056 -107346 -131501 51935 44379 -83027 128159 336533 -112445 60457
12201B31404g1278a0958D19314D6634h5953I1767J43610K4613A10631J98354a22889
$$ 231404 -71278 -10958 419314 46634 -85953 91767 235377 259990 110631 308985 -122889
12189D32274H1202L6468K54923d3950A78673h669o746A00516H311L32917A27043
$$ 432274 81202 117670 372593 -43950 178673 -8669 -15415 100516 8311 341228 127043
12177B28132j03589i4815q3316A6325K07046k2412Q3096I2871N1964D7364M5249
$$ 228132 124543 -94815 -178131 16325 223371 200959 284055 92871 144835 47364 92613
12166I2613K137P7799b18469A45134a2882F0611e0150A50124J83036C1059L93938
$$ 92613 94750 172549 -218469 145134 -12882 60611 -50150 150124 333160 31059 424997
12155D24997a82199a275I2768K19870H2056O1637c61320B35609m6034K1964K9554
$$ 424997 -182199 -1275 92768 312638 82056 143693 -361320 235609 189575 211539 241093
12144B41093A10976I974K55618a18953b6545A1896J82993J5952D5713a04282G4061
$$ 241093 110976 9974 265592 -118953 -26545 11896 194889 210841 45713 -104282 74061
12132A85144h1100n7866R532H2560L0060L6735B7909J23944J25124d2750B01970
$$ 185144 -81100 -138966 -129434 82560 112620 149355 27909 151853 276977 -42750 201970
12120a06263j58035F5510b25453M3922P3564c5910k9964A48612e453k63108i9126
$$ -106263 -264298 65510 -225453 -181531 -107967 -35910 -65874 148612 -5453 -268561 -99126
12108b6930D8506K53922A00263C5863J97872E5394o782e7041l76145h1598A56636
$$ -26930 48506 302428 100263 35863 233735 55394 48612 -57041 -433186 -81598 156636
12096a49444C40397A24155L8129G2250C238b21833P0239l7521n7781A02602J23444
$$ -149444 340397 124155 162284 72250 3238 -221833 -151594 -189115 -246896 102602 226046
12085B26046o1234a85794A8520f5199B11188a06709D5907b19389K2005B11745
$$ 226046 164812 -185794 18520 -65199 211188 -106709 45907 -219389 -197384 211745
12074A30263K22932D3225N18633M83190l94847O8354A28369a4116b687A10879
$$ 130263 353195 43225 561858 1045048 650201 718555 128369 -14116 -2687 110879
12063C2561c7558b371C55797F5135L03942a82145G3467K2125f1373A44435f3198
$$ 32561 -37558 -2371 355797 65135 369077 -182145 73467 95592 -61373 144435 -63198
12051A26510A3873R3376g5374k13223B01257I1676b8250C37854A57155j8999m4701
$$ 126510 13873 107249 -75374 -288597 201257 91676 -28250 337854 157155 138156 93455
12040I3455e2257m7444j85844A2341O8135B3796J98443b07350A0789a92665Q3574
$$ 93455 -52257 -99701 -285545 12341 80476 23796 222239 -207350 10789 -192665 -109091
12029a09091A89430a62701j80855B48449a36187A00304K5377m1782b27914J08526
$$ -109091 189430 -162701 -343556 248449 -136187 100304 125681 83899 -227914 -119388
12019a19388K6382G6650B4135b49429B72990c90598I6237L31013A61774a46767
$$ -119388 -93006 76650 24135 -249429 272990 -390598 96237 427250 161774 -146767
12008E287b26996A19986b05946b7716j64616Q3307A1082f2478F4954Q2155b62335
$$ 5287 -226996 119986 -205946 -27716 -192332 -109025 11082 -62478 64954 147109 -262335
11996b18912d5845G8647B6481d9546A44827d2538k15195J084h2999c6810r6257
$$ -218912 -45845 78647 26481 -49546 144827 -42538 -257733 -256649 -82999 -36810 -133067
11985a33067A64529e8153A03572d9646j01837f7861A15518E16h3867K4740A07663
$$ -133067 164529 -58153 103572 -49646 -151483 -67861 115518 516 -83867 -59127 107663
11973a93567E5231J5055K39335A42240F9917J42214E3299e0222D3240a64791B09346
$$ -193567 55231 70286 309621 142240 69917 212131 53299 -50222 43240 -164791 209346
11961F3616P7328F0066C143b96986e7079l7813c8048M788k43119a32081A24142
$$ 63616 140944 60066 3143 -296986 -57079 -94892 -38048 -33260 -276379 -132081 124142
11949A49121c7913A00393b01015A71M4126a79499D28494b99874F2514A9156i5141
$$ 149121 -37913 100393 -201015 171 44297 -179499 428494 -299874 62514 19156 -95141
11937c2161l57139B48595j01493d00387a55475F3735d80004a92665h2692j1114
$$ -32161 -389300 248595 147102 -400387 -155475 63735 -480004 -192665 -82692 -93806
11927i3806A63893m5511L34866g4480k17671p1370B07559O4332c4654A65475K1234
$$ -93806 163893 118382 453248 -74480 -292151 -363521 207559 271891 -34654 165475 186709
11916A86709M3902A13311e3373k53305d1662A53989e0642A71483a21729k8612
$$ 186709 230611 113311 -53373 -306678 -41662 153989 -50642 171483 -121729 -150341
11906a50341F7907k3383L35366i200A31147F1848E88b83246J25666f596k65172
$$ -150341 67907 44524 379890 -9200 131147 61848 588 -283246 -157580 -6596 -271768
11895b71768K1835h1281B41227a54701A09436N0032J95038a98766A88480A1195
$$ -271768 -249933 -81281 241227 -154701 109436 159468 354506 -198766 188480 11195
11884b07478A40650a37157k3569j8657A77233a9572k01282C384e1347l6784j55186
$$ -207478 140650 -137157 -160726 -179383 177233 -19572 -220854 3384 -51347 -88131 -243317
11873b43317C2869K01707a13314j37826i9502A03443J48704e2185m06878i8678
$$ -243317 32869 234576 -113314 -251140 -99502 103443 252147 -52185 -459063 -98678
11862A61557a902D1611a16920A79208a01622A20578h4855k1991m9407C8272J08235
$$ 161557 -1902 41611 -116920 179208 -101622 120578 -84855 -106846 -156253 38272 146507
11851A46507F8310f3758A41401N5573b7032k12545C9374g271A74636g250l22100
$$ 146507 68310 -63758 141401 196974 -27032 -239577 39374 -7271 174636 -7250 -329350
11840c29350I1825K74048a6467l0758q0789A99091C7712e4846H1982M3675a51758
$$ -329350 91825 365873 -16467 -47225 -128014 199091 37712 -54846 81982 125657 -151758
11828a37004B75293c0846I2617J67283a48137O4204r0224c5336l23525N8689L3764
$$ -137004 275293 -30846 92617 259900 -148137 -83933 -174157 -35336 -358861 -300172 -266408
11817b66408H3292C2434J18453a77949A08797l379a22042B02619g1824J4139B01162
$$ -266408 83292 32434 150887 -177949 108797 105418 -122042 202619 -71824 -57685 201162
11805i1959j28902L5498b2545A29684a98490Q0237c7901j18382b1718N098k54736
$$ -91959 -220861 -185363 -22545 129684 -198490 -118253 -37901 -156283 -21718 -16620 -271356
11794b71356c9916B86739A0805J7723J71129a90249j68672I8J27167a37389D376
$$ -271356 -39916 286739 10805 28528 199657 -190249 -358921 98 127265 -137389 4376
11782a60030E5718J80361a06417n0020F1055d5123o614j63036B4513f5353B30127
$$ -160030 55718 236079 -106417 -156437 61055 -45123 -51737 -214773 24513 -65353 230127
11770A05760b11569C2375a12123H2306P4524B6660a13516M2736B95958b52477
$$ 105760 -211569 32375 -112123 82306 156830 26660 -113516 -70780 295958 -252477
11759B71010D257K89518a01299D09261a5757q5989I4846b51293c6514H4025l5270
$$ 271010 4257 293775 -101299 409261 -15757 -101746 94846 -251293 -36514 84025 48755
11748D8755c97017A94111J16195k0989J72532j30580a62001e6476j74074d9301
$$ 48755 -397017 194111 310306 289317 461849 331269 -162001 -56476 -230550 -49301
11737A38437K428B5812a35240d9858G5852P9615a71977j98410B8066b55923A88079
$$ 138437 140865 25812 -135240 -49858 75852 155467 -171977 -370387 28066 -255923 188079
11725G7905e6204A27897D8755L015J89548a01389a051n4061A53379b01630K5425
$$ 77905 -56204 127897 48755 51770 241318 -101389 -1051 -55112 153379 -201630 -176205
11714a76205A41167E998a75511m1410D1019L2795i3872B78246B1381J65347A5701
$$ -176205 141167 5998 -175511 -216921 41019 73814 -93872 278246 21381 186728 15701
11702a61277G3717e0259j11436A24307b40509m1355B10597c9774r0723l22346
$$ -161277 73717 -50259 -161695 124307 -240509 -281864 210597 -39774 -130497 -452843
11692d52843B4156J96705J83704A28152a18809j18893Q7760L0417A07650a46851
$$ -452843 24156 220861 404565 128152 -118809 -237702 -149942 -119525 107650 -146851
11681A65979J79987a22355e9140k4816F6941e990B05428J14881A32663a4903l2147
$$ 165979 345966 -122355 -59140 -83956 66941 -5990 205428 320309 132663 -14903 -47050
11670d7050B30235G2360C3447M7681a47359B3433a04638A68291K87869D204K1122
$$ -47050 230235 72360 33447 81128 -147359 23433 -104638 168291 456160 4204 25326
11659B5326d3795A35295o4086O5681b77125a19592D875L27501b83553F3299d7486
$$ 25326 -43795 135295 71209 136890 -277125 -119592 4875 332376 -283553 63299 -47486
11647c6159j64450b4057B62706h0534H0674a73079b4843A56818O3456I3555J37104
$$ -36159 -200609 -24057 262706 -80534 80674 -173079 -24843 156818 220274 93555 230659
11636B30659E4778O1755a48194A46066j632J03501j03204J22690b23716h3388
$$ 230659 54778 116533 -148194 146066 144434 247935 144731 267421 -223716 -83388
11625A96790c9430H7250e680B10028E6787b0572k12806J00534k1834D10497c3987
$$ 196790 -39430 87250 -5680 210028 56787 -20572 -233378 -132844 -154678 410497 -33987
11613d047I0476a71438e8652l78613A24024a05567B9558a21375B03776E2597L9011
$$ -4047 90476 -171438 -58652 -437265 124024 -105567 29558 -121375 203776 52597 91608
11602I1608e1213j02879d573A16090N2422a35791o1171D30233j51029B0656J12913
$$ 91608 -51213 -154092 -4573 116090 168512 -135791 -196962 430233 279204 20656 133569
11591A33569E6587a62960c7308C0411a86325b9848k0224l9445I0408e0752A02041
$$ 133569 56587 -162960 -37308 30411 -186325 -29848 -50072 -89517 90408 -50752 102041
11579A11928R5422a7875B5070a05782B01105M976b5985I659i4171A2011J40663
$$ 111928 207350 -17875 25070 -105782 201105 206081 -25985 9659 -94171 12011 152674
11568A52674a9127B98492H3752i9011B49317n3480n5680b653r1873j89662A59192
$$ 152674 -19127 298492 83752 -99011 249317 195837 140157 -2653 -94526 -284188 159192
11556a80063C32007j29218D527K51450b90038a12494j27125A29782R1911p7508
$$ -180063 332007 202789 4527 255977 -290038 -112494 -239619 129782 221693 144185
11546A44185O7666b67564b0166O414j42979j642B6887b31729a8623D46678A82654
$$ 144185 211851 -267564 -20166 -13752 -156731 -158373 26887 -231729 -18623 446678 182654
11534B67462C1444M0972J4024K4741a14209j29462B3630g7565D07840G2003J82367
$$ 267462 31444 72416 86440 111181 -114209 -243671 23630 -77565 407840 72003 254370
11523B54370j21096F3566K48045A34876L0074d1333H5049K75423i937o0636A21383
$$ 254370 133274 63566 311611 134876 164950 -41333 85049 360472 -9937 -70573 121383
11511F080J05145J24345d3266B91569C5307Q0819g0515C29183a33789G4930J35434
$$ 6080 111225 235570 -43266 291569 35307 116126 -70515 329183 -133789 74930 210364
11500B10364L4890o4315J3192J16610j15464j8928G9508L6329J21793a14051A69999
$$ 210364 245254 180939 194131 310741 195277 176349 79508 115837 237630 -114051 169999
11488B44227D6685K7455L12800A61016l333l6308e8419A23785l2842e7687a1748
$$ 244227 46685 74140 386940 161016 157683 121375 -58419 123785 90943 -57687 -11748
11476B27340J14121G9049R8735b3886B73935l6629a78887D15935A88282b079D203
$$ 227340 341461 79049 177784 -23886 273935 237306 -178887 415935 188282 -2079 4203
11464C72148K5057a1812B30421i3807A94769H6384b63319J14630K1214A5949J21176
$$ 372148 397205 -11812 230421 -93807 194769 86384 -263319 -148689 -127475 15949 137125
11453A37125J18136n9976K11593A45228D1023b18880D77657j46960A04410b3038
$$ 137125 255261 195285 406878 145228 41023 -218880 477657 330697 104410 -23038
11442a19309C3860J0136a53343A20992c0282B3557J66114c3939B7305N13289B24626
$$ -119309 33860 43996 -153343 120992 -30282 23557 189671 -33939 27305 540594 224626
11430a9848I5409i1763r5148B87884a42463e0889K4409a770j44105b7711D20352
$$ -19848 95409 -91763 -186911 287884 -142463 -50889 -26480 -1770 -145875 -27711 420352
11418E7671K23035c3830A5311b6925r5349A78575A5917J47185b32707h5175l06042
$$ 57671 280706 -33830 15311 -26925 -122274 178575 15917 163102 -232707 -85175 -391217
11407c91217a53547L6523G9809L5170K4522L2155K91151A78938i1607A79285h9742
$$ -391217 -153547 -117024 79809 114979 139501 171656 462807 178938 -91607 179285 -89742
11395B75706i6142j74661j43089i2953j29182k598F7096h4058d1899B5962J30634
$$ 275706 -96142 -270803 -413892 -92953 -222135 -224733 67096 -84058 -41899 25962 156596
11384A56596E2682b94920A30448B1443R2207K9298J06612E7969H007c0848I9486
$$ 156596 52682 -294920 130448 21443 113650 142948 249560 57969 8007 -30848 99486
11372B56281j08920d84565C9227J80125i2183J5900q717n8529o1967d2460j61827
$$ 256281 147361 -484565 39227 219352 -92183 -76283 -85000 -143529 -205496 -42460 -204287
11361b04287I0694g57j18157B4463J35278a63928n8441k01372a6179k9561C12812
$$ -204287 90694 -757 -118914 24463 159741 -163928 -222369 -423741 -16179 -45740 312812
11349C6018a95267F0443B4864P3532c128A38610A8639J38825a77364b3135j4428
$$ 36018 -195267 60443 24864 98396 -3128 138610 18639 157464 -177364 -23135 -37563
11338c7563r5243f5342A029J89813b57739B49997g0792b828A09338n0635J71541
$$ -37563 -132806 -65342 1029 190842 -257739 249997 -70792 -2828 109338 58703 230244
11327B30244E8125a08905L5590P46j39041c1151j93476R4203C1606R8537a30638
$$ 230244 58125 -108905 -73315 -72569 -211610 -31151 -224627 -130424 31606 130143 -130638
11315F774e3975A36938N1888n0739b75023J23652q6336F5612i8827j9231d9015
$$ 6774 -53975 136938 188826 138087 -275023 -151371 -237707 65612 -98827 -118058 -49015
11303a15342B94822G5583J05985a19014H8280a49081a7287H8766A2186L223d2539
$$ -115342 294822 75583 181568 -119014 88280 -149081 -17287 88766 12186 15409 -42539
11291a69846l7315F5596K69268d00504a03313A36665a09200C19065E5031b29886
$$ -169846 -207161 65596 334864 -400504 -103313 136665 -109200 319065 55031 -229886
11280c585B45673a91692A29408K18485b08577e2256l37868l774a7467B73919a66233
$$ -3585 245673 -191692 129408 347893 -208577 -52256 -390124 -393898 -17467 273919 -166233
11268a81862A89540c3629l46143B32503i5354C5007K93801e7627E0241e2326k16269
$$ -181862 189540 -33629 -379772 232503 -95354 35007 328808 -57627 50241 -52326 -268595
11257b68595D0929d71220B33780D0408c9505o3777k97581J76091F7274K62137
$$ -268595 40929 -471220 233780 40408 -39505 -103282 -400863 -224772 67274 329411
11247C29411i6374j51736b400j67612O6794A11962n557r079B1820e2570j12348
$$ 329411 -96374 -248110 -2400 -170012 -103218 111962 106405 97326 21820 -52570 -164918
11236a64918j45566a31650O487F6004a9670o2532B7906K53134f0807n9953D26836
$$ -164918 -310484 -131650 -125163 66004 -19670 -82202 27906 281040 -60807 -120760 426836
11224c11143O5044A39624b70940B29502b70886H7126J45618b34008O161B45789
$$ -311143 -246099 139624 -270940 229502 -270886 87126 232744 -234008 -227847 245789
11213A19794a13565A79069b70215G7873J00047G1151l2683a78157k2380Q2835
$$ 119794 -113565 179069 -270215 77873 177920 71151 38468 -178157 -200537 -117702
11203a17702B43061A16554b57440a12606C270d5749A16714J31763A18689E051
$$ -117702 243061 116554 -257440 -112606 3270 -45749 116714 248477 118689 5051
11192E951J36673e9014l22998m1676c4328o1370b7118r9226B19351g5571j55115
$$ 5951 142624 -59014 -382012 -423688 -34328 -95698 -27118 -126344 219351 -75571 -230686
11181b30686f5923C4142N4907L7821E2410f7165G5984d4960q1598I1730M6890
$$ -230686 -65923 34142 89049 126870 52410 -67165 75984 -44960 -126558 91730 138620
11170A38620b22553h1133l7958m9516N5855E9340b7263q9292A15189n7009J0201
$$ 138620 -222553 -81133 -119091 -168607 -112752 59340 -27263 -116555 115189 58180 68381
11159F8381J1414a96389K4084A4878b22598R4452G8322l169R1663Q2651a51038
$$ 68381 79795 -196389 -172305 14878 -222598 -128146 78322 75153 166816 249467 -151038
11147B9338a47782b7387E04745e3649B70303e4508k5497j20993i3864D20441k03376
$$ 29338 -147782 -27387 504745 -53649 270303 -54508 -80005 -200998 -93864 420441 217065
11136B17065C5022a59145F2198g8962e561E8173f7795a4244p8708j46091c7549
$$ 217065 35022 -159145 62198 -78962 -5561 58173 -67795 -14244 -92952 -239043 -37549
11124e0489A45955c64675c3173r8535d9010a8166B4467N72101A00442D409K6540
$$ -50489 145955 -364675 -33173 -131708 -49010 -18166 24467 596568 100442 4409 30949
11113C0949M0982M87295B17586M9485o6670C6937K03329H2427J89276g1378A80226
$$ 30949 71931 559226 217586 267071 200401 36937 240266 82427 271703 -71378 180226
11101D1598f8918A08184e086A0604g0155a5145C1889N8221M921K43513G1946G7
$$ 41598 -68918 108184 -5086 10604 -70155 -15145 31889 90110 95031 338544 71946 77
11088B91925o2227q211K5532H3076J02091P615A5396J41434J00448j12107B822
$$ 291925 229698 221487 247019 83076 185167 192782 15396 156830 257278 145171 2822
11076A70961J12986i5346a2821C33112d8176A43512K40126F2421K54570J23265
$$ 170961 283947 -95346 -12821 333112 -48176 143512 383638 62421 316991 440256
11066D40256K44367j35230O1596B11879Q2005D1484K69847J93997k34915J39244
$$ 440256 684623 549393 610989 211879 293884 41484 311331 505328 270413 409657
11056D09657L18448r7402k59315k5664M53697j44628J0825o84k96221J72532K6023
$$ 409657 728105 630703 371388 345724 799421 654793 665618 664934 368713 541245 567268
11045E67268O8255j05438J61657j75371J06237j71738J57660R9914j35468J45101
$$ 567268 635523 530085 691742 516371 622608 450870 608530 708444 572976 718077
11035G18077P6260B39305K64655K18776B96116M6916M86600C05143L73021J17993
$$ 718077 794337 239305 503960 722736 296116 343032 829632 305143 678164 796157
11025G96157q9075q3742L34484D43373K20108k16887J44641k8510K61660j90723
$$ 796157 707082 623340 957824 443373 663481 446594 591235 562725 824385 633662
11015F33662k65414N03490C85094J32773k53524K13166R3867R770P1566k21091
$$ 633662 368248 871738 385094 517867 264343 477509 571376 581146 652712 431621
11005D31621O6041M7110M4968J61019j49666l7660j25622K5540J68211p7512J9305
$$ 431621 497662 544772 589740 750759 601093 563433 437811 463351 631562 554050 573355
10994E73355k7445M07857l80218J85122k58406P06108n81742L62612k8394J23340
$$ 573355 545910 953767 573549 758671 500265 1206373 624631 987243 958849 1082189
10984A082189l32301K04297K55154L14421l51909M00763j6646j69236L65272K46327
$$ 1082189 749888 954185 1209339 1523760 1171851 1572614 1555968 1386732 1752004 1998331
10974A998331j78117K95941M34876l67427j01642l85086P7271m92277K38390j78868
$$ 1998331 1820214 2116155 2551031 2183604 2081962 1696876 1774147 1281870 1520260 1341392
10964A341392m7435L90407k57213J6747n54140P50079l85846L75253p4594j38319
$$ 1341392 1293957 1684364 1427151 1443898 889758 1639837 1253991 1629244 1554650 1416331
10954A416331k9491l56741K52794k67861l22855l4602B94536J58575j51993o6414
$$ 1416331 1386840 1030099 1282893 1015032 692177 657575 294536 453111 301118 234704
10944B34704O5595j19035O5089p8623F1810d4471B32612D3024L98425k01008j01834
$$ 234704 300299 181264 246353 167730 61810 -44471 232612 43024 441449 240441 138607
10933A38607J4168L6571a15857e1712I6721J56610b90814J35669M4951L5018k8395
$$ 138607 152775 189346 -115857 -51712 96721 253331 -290814 -155145 -110194 -75176 -103571
10922a03571k6266e0371B42017b5114j02920A41497C1232R7793A0695a48342H1839
$$ -103571 -129837 -50371 242017 -25114 -128034 141497 31232 129025 10695 -148342 81839
10910A05504j1556j7894Q0610J31019a86452E5524P8980b15610A43373J4134a34495
$$ 105504 93948 76054 156664 287683 -186452 55524 134504 -215610 143373 157507 -134495
10898a94449p8769Q2723j36167A01611a29371A09244d86824C48285j56950b50491
$$ -194449 -273218 -190495 -326662 101611 -129371 109244 -486824 348285 191335 -250491
10887a29380A38847e5130k36549h786l05150C16272h2204k93094a77746e7318
$$ -129380 138847 -55130 -291679 -8786 -313936 316272 -82204 -375298 -177746 -57318
10876a19171B60129h9190r0216I3745C3012c09401C0804b8898A15580b71106A25264
$$ -119171 260129 -89190 -179406 93745 33012 -309401 30804 -28898 115580 -271106 125264
10864c07848B29303f8361m8921A17383a37832G3783b9069k9390j57304B57401
$$ -307848 229303 -68361 -117282 117383 -137832 73783 -29069 -58459 -215763 257401
10853b56507A48444a17267A87018c3134j03885n1358B05669E193a1189o1811D1098
$$ -256507 148444 -117267 187018 -33134 -137019 -188377 205669 5193 -11189 -73000 41098
10841g4428b625k05818b1186n7999j71023Q2165P5809j14428M970B86801a21841
$$ -74428 -2625 -208443 -21186 -79185 -250208 -168043 -92234 -206662 -201692 286801 -121841
10829d18611A22092c6705A0700a70829A875L9934a78769B2160a03286d4820B6280
$$ -418611 122092 -36705 10700 -170829 1875 41809 -178769 22160 -103286 -44820 26280
10817a8400m24671h5267k13974b1383o4242b7459j18009L5057j50240C5402a13752
$$ -18400 -443071 -85267 -299241 -21383 -85625 -27459 -145468 -110411 -260651 35402 -113752
10805a10645M5645j42148k9106A13533K4898b4990C5158E629e3486C03231d30214
$$ -110645 -65000 -207148 -236254 113533 138431 -24990 35158 5629 -53486 303231 -430214
10793B00188c01712b7083l32660F4647b82168J21613M8415A32995e2901j39867
$$ 200188 -301712 -27083 -359743 64647 -282168 -160555 -112140 132995 -52901 -192768
10783a92768f9217r0938A35444a83612D4546b38870h8702l7601e881j76981M0317
$$ -192768 -69217 -160155 135444 -183612 44546 -238870 -88702 -126303 -5881 -182862 -142545
10772a42545a7804A37914f3615b5108j1223E5704c25350B7054J38412g8651A51315
$$ -142545 -17804 137914 -63615 -25108 -36331 55704 -325350 27054 165466 -78651 151315
10760i6497b3335j64389o0900C364J61836A4417b89855C126a03789p0621C9798
$$ -96497 -23335 -187724 -248624 3364 165200 14417 -289855 3126 -103789 -174410 39798
10748I9486b3425A00144M14092F464j079a30795o7864F4682L3968a1229A07314
$$ 99486 -23425 100144 514236 6464 5385 -130795 -198659 64682 98650 -11229 107314
10736b00093n8088b6578B02619b8007p5935F9064j3389a46652b8548B281J63047
$$ -200093 -258181 -26578 202619 -28007 -103942 69064 55675 -146652 -28548 2281 165328
10725A65328P9816A04914B3481a51604H1268J6140K05962b30962A29589Q4664
$$ 165328 245144 104914 23481 -151604 81268 97408 303370 -230962 129589 214253
10715B14253M6742b07596N5774A80275b11426d4195D9224a82126O4312j11535
$$ 214253 260995 -207596 -151822 180275 -211426 -44195 49224 -182126 -117814 -229349
10705b29349Q7132K7718M8429k97473a28633G0838R1917R9273D270J02384f2651
$$ -229349 -142217 -114499 -66070 -363543 -128633 70838 162755 262028 4270 106654 -62651
10693C9594c5559G952b77196a2081A76747a32480E9220c52140a0389A30952O0998
$$ 39594 -35559 7952 -277196 -12081 176747 -132480 59220 -352140 -10389 130952 191950
10682A91950b15138L4068A52971c51904B32134a86916C2168c8703j43088A14472
$$ 191950 -215138 -181070 152971 -351904 232134 -186916 32168 -38703 -181791 114472
10671B13850a58373r4407K497h7294I1398b81155P7057D564a8398j45066B39951
$$ 213850 -158373 -252780 -250283 -87294 91398 -281155 -204098 4564 -18398 -163464 239951
10659a95374A04366f9047H1893J5301L3106c8584D9692P9369c41116P0943B82502
$$ -195374 104366 -69047 81893 97194 130300 -38584 49692 129061 -341116 -270173 282502
10647a99202i4388L7825o0706C4948p951b19498D6012e0441L494B234a9126l11777
$$ -199202 -94388 -56563 -117269 34948 26997 -219498 46012 -50441 -46947 2234 -19126 -330903
10635c30903A11140a70747l07347c3542k6008B58878a5364A62762C3944J9486
$$ -330903 111140 -170747 -478094 -33542 -59550 258878 -15364 162762 33944 53430
10625E3430J47963o7489m7283c12813A90836K14900a78430A34377a42292A14622
$$ 53430 201393 133904 86621 -312813 190836 405736 -178430 134377 -142292 114622
10614C2275a47673o640A57131a56492j43605K9023A19702c8092B93592a23175
$$ 32275 -147673 -154313 157131 -156492 -300097 -271074 119702 -38092 293592 -123175
10603I0677K0478f6789j75166a15242o6169B76251b93143a01131A18523h0286
$$ 90677 111155 -66789 -241955 -115242 -181411 276251 -293143 -101131 118523 -80286
10592E9689P6865M6566b53673h3734j08280p2676I2309K57982j40326d6611A01163
$$ 59689 136554 183120 -253673 -83734 -192014 -264690 92309 350291 209965 -46611 101163
10580a44889r9178A20223a00905H6810Q1959J45021b76343a18856B33235a52645
$$ -144889 -244067 120223 -100905 86810 168769 313790 -276343 -118856 233235 -152645
10569c02699f3358q0796p3797N3318q1666H0845l0191B115b42409H6777a71003
$$ -302699 -63358 -144154 -217951 -164633 -246299 80845 50654 2115 -242409 86777 -171003
10557c41572J7237J06201A37255b35655f3267E0248O418K00579j25734f0871B84629
$$ -341572 -324335 -218134 137255 -235655 -63267 50248 56666 257245 131511 -60871 284629
10545a20769O848k00752a48355D9758a32510f5872a1683H8950a78235B2070O7214
$$ -120769 -113921 -314673 -148355 49758 -132510 -65872 -11683 88950 -178235 22070 89284
10534H9284J63801b1934o1836r8533c6688n0329A71020J13020A17957Q6547b36928
$$ 89284 253085 -21934 -83770 -182303 -36688 -87017 171020 284040 117957 204504 -236928
10522I36J40776a49411A34935a75272o6452B25886a56766c6267A87297f2751a1920
$$ 936 141712 -149411 134935 -175272 -241724 225886 -156766 -36267 187297 -62751 -11920
10510A6236d0809m22995b4055q3905H2626J8111c7831J4853B04751a94766A5981
$$ 16236 -40809 -463804 -24055 -107960 82626 100737 -37831 -22978 204751 -194766 15981
10498D5661J80426b14373j14614A75526f957j14484A03050q401a91541C66879
$$ 45661 226087 -214373 -328987 175526 -6957 -121441 103050 94649 -191541 366879
10487c03571A3956J47313J45054J68541A42785Q6549K70490j54276P046k1038
$$ -303571 13956 161269 306323 474864 142785 229334 499824 345548 352594 331556
10477C31556a03361B54110n2041B4112R5225a87156A54718D8185j8308a16813
$$ 331556 -103361 254110 202069 24112 119337 -187156 154718 48185 29877 -116813
10466c3901C42158f4292B31294B3616K14217L6700K34792A44780f6996I2329J43794
$$ -33901 342158 -64292 231294 23616 237833 274533 509325 144780 -66996 92329 236123
10455B36123E2537J19227a60702k6582M2279j420k2667K2002A4306O2512R709
$$ 236123 52537 171764 -160702 -187284 -145005 -146425 -169092 -147090 14306 76818 86527
10444H6527b3251A56706b24369g8549A69473b35516B4596P536c70732H4956j2724
$$ 86527 -23251 156706 -224369 -78549 169473 -235516 24596 32132 -370732 84956 72232
10433G2232k5275d4174k17233p738j06914J81720M6412C6337a69721C8614d2974
$$ 72232 46957 -44174 -261407 -269145 -376059 -194339 -147927 36337 -169721 38614 -42974
10421A0985c5746I8213b41515A00302g1602j1919N918o2073D94878F6461h474
$$ 10985 -35746 98213 -241515 100302 -71602 -83521 -77603 -139676 494878 66461 -8474
10409I2964a19499B70356C7701a11208H2964h2657j05901A14890L8584b89410
$$ 92964 -119499 270356 37701 -111208 82964 -82657 -188558 114890 153474 -289410
10398a51610A1539K74061B1981J26287E6962a18151C585a3991B43430i1862E21874
$$ -151610 11539 285600 21981 148268 56962 -118151 3585 -13991 243430 -91862 521874
10386A44932a44134D4641L96128C1661K8086L82511H4708J64520c25860B61249
$$ 144932 -144134 44641 440769 31661 59747 442258 84708 249228 -325860 261249
10375A65855J21799c6909D35367A71994P1450j06728J01841j11173L68296j4300
$$ 165855 287654 -36909 435367 171994 243444 136716 238557 127384 495680 481380
10365D81380O5776B57051C1315N4403l0614K68944j00498j1762a91378A67300
$$ 481380 547156 257051 31315 85718 55104 324048 223550 211788 -191378 167300
10354A63838m887J35937A40930J89428J59412O739A13851L99265d8759C86554
$$ 163838 158951 294888 140930 330358 489770 496509 113851 513116 -48759 386554
10343E08636B22830a23821H0248M7183Q9959I1219M5813M35327A04619a6393F14754
$$ 508636 222830 -123821 80248 127431 217390 91219 137032 572359 104619 -16393 614754
10331A80251k9691b24152B82405E4815J113b8021B27029R0285O2410a51513E3973
$$ 180251 150560 -224152 282405 54815 55928 -28021 227029 317314 379724 -151513 53973
10319B02881a70997L4797a1954l8422H6860b47391q1613A62210G0626Q4857g3033
$$ 202881 -170997 -136200 -11954 -50376 86860 -247391 -329004 162210 70626 155483 -73033
10307B11777f582A5645c5548B67803e1922B17339J84818b58773c4252I8341f1904
$$ 211777 -6582 15645 -35548 267803 -51922 217339 402157 -258773 -34252 98341 -61904
10295a74257B93027P8825a08141Q494A01157b18100A17827a53349L1155D93448
$$ -174257 293027 371852 -108141 -99647 101157 -218100 117827 -153349 -122194 493448
10284d9146a0884F21b037k2993B06646I3209j5640b22611a04271A56346N81507
$$ -49146 -10884 621 -2037 -25030 206646 93209 77569 -222611 -104271 156346 737853
10273G37853C2504k862f6243A29681A4285i7981j579k2838C0873M9424K6630A4032
$$ 737853 32504 29642 -66243 129681 14285 -97981 -99560 -122398 30873 80297 106927 14032
10260g2264G4426a88849A74580a01804F6943f7007F882h461p080n3387H4863M5890
$$ -72264 74426 -188849 174580 -101804 66943 -67007 6882 -8461 -15541 -68928 84863 130753
10248A30753N3971e8569m4158m4293D7054a85374M3529j28268C6538J32138b12088
$$ 130753 184724 -58569 -102727 -147020 47054 -185374 -141845 -270113 36538 168676 -212088
10236c638G8825G946a67467q2986E4500b98425A85288a90457h6514K9022B51841
$$ -3638 78825 7946 -167467 -250453 54500 -298425 185288 -190457 -86514 -57492 251841
10224H0941i8164j80635A49686B9806b87464C12365h8898m2724o0643d0742l1503
$$ 80941 -98164 -278799 149686 29806 -287464 312365 -88898 -131622 -192265 -40742 -72245
10213g2245l208j9656d1489B4730i975n7085F3879a80405N3792A6769i1541b9965
$$ -72245 -75453 -95109 -41489 24730 -9975 -67060 63879 -180405 -126613 16769 -91541 -29965
10200a60188j17392J38139H5473R8675D9914K56397f8090B18g162o5970j04956
$$ -160188 -277580 -139441 85473 184148 49914 306311 -68090 218 -7162 -73132 -178088
10189a78088C7585L18515C3257b2020j17885D5266L317e9896q2754j5319B3762
$$ -178088 37585 356100 33257 -22020 -139905 45266 48583 -59896 -142650 -157969 23762
10177G8523a09982o7295k54327B56223e7596j3523C77408D6108j5219a55004q8824
$$ 78523 -109982 -177277 -431604 256223 -57596 -71119 377408 46108 30889 -155004 -243828
10166b43828B12718i6913j56069B30554d52652A96828f6448m1301B28858j02057
$$ -243828 212718 -96913 -252982 230554 -452652 196828 -66448 -107749 228858 126801
10156A26801b57636n0023F8573a10441k6677I915L7304b40409a5179A63248b42204
$$ 126801 -257636 -307659 68573 -110441 -137118 9915 47219 -240409 -15179 163248 -242204
10144H3559d3656D682b95823J06517A98048d9557A56066a15792m3071O7556C64073
$$ 83559 -43656 4682 -295823 -189306 198048 -49557 156066 -115792 -158863 -91307 364073
10132E7946a44615j22331g4419D6644G91J42061A8969a80141L214I9408J91D0384
$$ 57946 -144615 -266946 -74419 46644 791 142852 18969 -180141 -176927 99408 99599 40384
10119a28057O2383A89948K5626b78594N200A21830B8094d4103F1334a8944j98617
$$ -128057 -65674 189948 215574 -278594 -273394 121830 28094 -44103 61334 -18944 -217561
10108b17561d5766E2365a13888N513j08637A54092a20615a1916j78385l53327
$$ -217561 -45766 52365 -113888 -108375 -217012 154092 -120615 -11916 -190301 -543628
10098e43628h9595D3785a67996d7363k99017f3989n78418A91264K9976b06490
$$ -543628 -89595 43785 -167996 -47363 -346380 -63989 -642407 191264 221240 -206490
10087A80831b63125L3737j0009c0316j77291M6095l4986e900E3167J00143F5575
$$ 180831 -263125 -229388 -239397 -30316 -207607 -161512 -196498 -5900 53167 153310 65575
10075b67844q6066A51795e498A12898d7902j17866d038B18048C9394h2254e520
$$ -267844 -353910 151795 -5498 112898 -47902 -165768 -4038 218048 39394 -82254 -5520
10063F8927m015d1913k4852l30429c1572E668b9509k43036g2960A60854a12780
$$ 68927 64912 -41913 -66765 -397194 -31572 5668 -29509 -272545 -72960 160854 -112780
10051B9926M5741K32323d17095C9697J95094b91799a08623A55190h2112I1522
$$ 29926 75667 307990 -417095 39697 234791 -291799 -108623 155190 -82112 91522
10040D5117J98384a1751C4732a87083l35870J79331J28964K9150J5048q8049J21992
$$ 45117 243501 -11751 34732 -187083 -522953 -343622 -214658 -185508 -170460 -258509 -136517
10029a36517k05309H8560a85872g056n7727A1071K11520a16140r9343o7900a38152
$$ -136517 -341826 88560 -185872 -7056 -64783 11071 222591 -116140 -215483 -283383 -138152
10017A71597p7026g8363j75285j41733a42742d1660j56286L3618j27865b5689
$$ 171597 94571 -78363 -253648 -395381 -142742 -41660 -197946 -164328 -292193 -25689
10006a10512c9644B26452b23536K2386A24769i7469l6241N6353A51810a19547
$$ -110512 -39644 226452 -223536 -201150 124769 -97469 -133710 -77357 151810 -119547
9995G2750J10695A1418c31009el80648D08295b16117g2115j15278f0816k10634
$$ 72750 183445 11418 -331009 -5 -380653 408295 -216117 -72115 -187393 -60816 -271450
9984b71450G1115c5281B64830G5961a53697A84549a82299m0572p2329n4928J40822
$$ -271450 71115 -35281 264830 75961 -153697 184549 -182299 -222871 -295200 -350128 -209306
9973b09306g6011j8745I3600J11343i9011L5576k24932h4822k18916I6223d2534
$$ -209306 -76011 -94756 93600 204943 -99011 -63435 -288367 -84822 -303738 96223 -42534
9961D4311c86224g8223A7767d769j38569A9860g4015B4250e5900J7268J8209j08782
$$ 44311 -386224 -78223 17767 -4769 -143338 19860 -74015 24250 -55900 -38632 -20423 -129205
9949a29205j3779g951j82261F9133c09120i2126A43359O8463a09511A62679i4141
$$ -129205 -142984 -7951 -190212 69133 -309120 -92126 143359 211822 -109511 162679 -94141
9937b4858l2879m2319d1432C5714P8746D5921d1107A6137b58373J09009B4621
$$ -24858 -57737 -100056 -41432 35714 114460 45921 -41107 16137 -258373 -149364 24621
9925b56397o9943A09192c73259G6201R9122K77823B16521e8900A15541a11818
$$ -256397 -326340 109192 -373259 76201 175323 453146 216521 -58900 115541 -111818
9914F2870J20553a29478c6049j41077J5690m5760B14926b33473F6191k7002K3855
$$ 62870 183423 -129478 -36049 -177126 -161436 -207196 214926 -233473 66191 39189 63044
9903F3044L9552O8276a14006j34404f3908H0403h0871A35239O1547c85644J33184
$$ 63044 102596 170872 -114006 -248410 -63908 80403 -80871 135239 196786 -385644 -252460
9892b52460L8812f5037A57383a09671K0454q3041g6643E5711j0041f0898j15727
$$ -252460 -213648 -65037 157383 -109671 -89217 -172258 -76643 55711 45670 -60898 -176625
9881a76625N8682L8968j18030N8085c3104m4502C547M9630a28021C4977a69406
$$ -176625 -117943 -78975 -197005 -138920 -33104 -77606 3547 53177 -128021 34977 -169406
9869c6137A22849e1549I9153d138j00351j5571A35453c09690o1387f3116D3291
$$ -36137 122849 -51549 99153 -4138 -104489 -120060 135453 -309690 -371077 -63116 43291
9857B49733l4024c30392e2817A33000a38594j7210B81668a53123N5669j1110I7369
$$ 249733 215709 -330392 -52817 133000 -138594 -155804 281668 -153123 -97454 -108564 97369
9845A02846a71626L5293D4896c3158n9991j92340J10153k06422i1222A84782a26224
$$ 102846 -171626 -136333 44896 -33158 -93149 -285489 -175336 -381758 -91222 184782 -126224
9833B24740C7095a69948p8645j00787J26590F2066L24241a71646l7039A95200
$$ 224740 37095 -169948 -248593 -349380 -222790 62066 386307 -171646 -208685 195200
9822A7160e9210b6915O136k74622P8085e7360b2950q4532K3317A69747A3901a37384
$$ 17160 -59210 -26915 -20779 -295401 -217316 -57360 -22950 -107482 -84165 169747 13901 -137384
9809G3147K535d17037a8970B65940c94413a11051c228j45598j85364l1895H929
$$ 73147 75682 -417037 -18970 265940 -394413 -111051 -3228 -148826 -334190 -366085 8929
9797E598a43201j79018g5913r8699Q4340L4027k67903A13569a45491A04333b32424
$$ 5598 -143201 -322219 -75913 -174612 -90272 -56245 -324148 113569 -145491 104333 -232424
9785b60849A95250i0801m68081i1161D20483C9477c2716l17622G083R374c97690
$$ -260849 195250 -90801 -558882 -91161 420483 39477 -32716 -350338 7083 16457 -397690
9773a3818m9522j10866l1785A61813b10965h3843l53703B86784j28714b48944
$$ -13818 -63340 -174206 -205991 161813 -210965 -83843 -437546 286784 158070 -248944
9762b69457J12764D5833b64333a9331p101D2399J05586b88233c1439A18484O5870
$$ -269457 -156693 45833 -264333 -19331 -26432 42399 147985 -288233 -31439 118484 184354
9751A84354B878b69949A0428a70626k3974M7554A06154m5490b65825F2130k6797
$$ 184354 2878 -269949 10428 -170626 -194600 -147046 106154 60664 -265825 62130 35333
9740C5333c72666A39413b5462j38665A75343D6757R232a74818C54280C7550L2177
$$ 35333 -372666 139413 -25462 -164127 175343 46757 55989 -174818 354280 37550 69727
9729F9727i9537A63139K1296d91696a12002r1554A37934a7014E3409c39244H3242
$$ 69727 -99537 163139 184435 -491696 -112002 -203556 137934 -17014 53409 -339244 83242
9717f5245B8843b47533l0191J25795M922I3128L01456b03059A09483H909J34963
$$ -65245 28843 -247533 -277724 -151929 -147007 93128 394584 -203059 109483 8909 143872
9706A43872M5123e16623a67686K3073D3483a27043c9059k05796j82657A89839
$$ 143872 188995 -516623 -167686 -144613 43483 -127043 -39059 -244855 -427512 189839
9695B19789b06542j35937J60178N1165o4964L2388F338g6517J0739k46788P1925
$$ 219789 -206542 -342479 -182301 -131136 -196100 -163712 6338 -76517 -65778 -312566 -240641
9684b40641E6538J27560b49013e3700C3453J88709E2795e7153B91c10585J52520
$$ -240641 56538 184098 -249013 -53700 33453 222162 52795 -57153 291 -310585 -158065
9673a58065B1762d66224D7312c52691i8994l80619A95433o8331c24507D91c2302
$$ -158065 21762 -466224 47312 -352691 -98994 -479613 195433 127102 -324507 491 -32302
9661I8690c4842B4583J09925b84790f4165k01803A54621l2499J01190I0667a19128
$$ 98690 -34842 24583 134508 -284790 -64165 -265968 154621 122122 223312 90667 -119128
9649B64556a84331B07614a33928B87715a41910d1018C40055c20372K9341J20933
$$ 264556 -184331 207614 -133928 287715 -141910 -41018 340055 -320372 -291031 -170098
9639a70098K5470d1828n1308B6330a90357A50155J7032J3155q3002a03889j28010
$$ -170098 -144628 -41828 -93136 26330 -190357 150155 167187 180342 97340 -103889 -231899
9628b31899O1111j50166R2967b6607n9808C7486K64091H8518J93020I8577e6641
$$ -231899 -170788 -320954 -227987 -26607 -86415 37486 301577 88518 281538 98577 -56641
9616b28310J7875A58461a969p0707p5423a2670H8496b253I631c08558R8063P3290
$$ -228310 -210435 158461 -1969 -72676 -148099 -12670 88496 -2253 9631 -308558 -210495 -137205
9604a37205O2820l1012m5928G2400d89907A20993D7672K474e8085o4222r6026
$$ -137205 -74385 -105397 -151325 72400 -489907 120993 47672 50146 -58085 -122307 -218333
9593b18333A42729F2980J8689b29332I6032d18783h299j64055D4173b01889M2287
$$ -218333 142729 62980 81669 -229332 96032 -418783 -8299 -172354 44173 -201889 -159602
9582a59602K4673j80682B80451e5380A02519J40732b8902o7244n0964q9472G6799
$$ -159602 -134929 -315611 280451 -55380 102519 243251 -28902 -96146 -147110 -236582 76799
9570C5621J15608a53518A0280N7611c87625a19021j99668Q567D8072a8137G8736
$$ 35621 151229 -153518 10280 67891 -387625 -119021 -318689 -310122 48072 -18137 78736
9558A36794c50460C8433i8777B96757a89570B42850a36835p3012j7850H3008e16108
$$ 136794 -350460 38433 -98777 296757 -189570 242850 -136835 -209847 -227697 83008 -516108
9546b95138R2738j27879j044J35057A38468F267g375r0580k51757g1583C41035
$$ -295138 -202400 -330279 -331323 -196266 138468 6267 -7375 -97955 -349712 -71583 341035
9534b18382B51141L022a08632a805k3010I374a17614E6967b65697J02762B0076
$$ -218382 251141 254163 -108632 -1805 -24815 9374 -117614 56967 -265697 -162935 20076
9522a68536f4191H0501K8848c84147B31851r3079c72420e9325A36864F7289b53106
$$ -168536 -64191 80501 109349 -384147 231851 138772 -372420 -59325 136864 67289 -253106
9510B9747b15187A65500b34426g4450A93178I0317a13027m6383B1032b66219a3893
$$ 29747 -215187 165500 -234426 -74450 193178 90317 -113027 -159410 21032 -266219 -13893
9498E2112K15772a76576k39192B81981M137A00618D3237a37860D2971b74545d2551
$$ 52112 267884 -176576 -415768 281981 286118 100618 43237 -137860 42971 -274545 -42551
9486A06502a04285c6898q6942K8731B21623N53o8154a88398K6665O7813j0020
$$ 106502 -104285 -36898 -123840 -95109 221623 222176 154022 -188398 -161733 -93920 -103940
9475a03940j89078R0897E015N5521J97393a17714N3869n4876R753H3491B53N9390
$$ -103940 -293018 -202121 5015 60536 257929 -117714 -63845 -118721 -108968 83491 253 59643
9463E9643Q7157a08241N0839j70016A58040F5781P8506b42371m359J17376j55213
$$ 59643 146800 -108241 -57402 -227418 158040 65781 144287 -242371 -246730 -129354 -284567
9452b84567D7104a47747K3367q5686I2925P6173a22033l18833B5674D588c00336
$$ -284567 47104 -147747 -124380 -210066 92925 169098 -122033 -440866 25674 4588 -300336
9440a28643j01746j0332d3750H8913N3651a16738B1591b62851a30342m4640d4044
$$ -128643 -230389 -240721 -43750 88913 142564 -116738 21591 -262851 -130342 -174982 -44044
9428f6736I3881C5391a67095c0831l389p222j88399D7301a57176j02718O7539
$$ -66736 93881 35391 -167095 -30831 -34220 -41442 -229841 47301 -157176 -259894 -192355
9417a92355I5944c60686g4061G5546d02131a27797j98356J34659e5604b5093j68187
$$ -192355 95944 -360686 -74061 75546 -402131 -127797 -326153 -191494 -55604 -25093 -193280
9406a93280B7764K86748C6454e7972G6048J17819j8649b6447p4677l9872G3638
$$ -193280 27764 314512 36454 -57972 76048 193867 175218 -26447 -101124 -140996 73638
9394A19169j48N4993H2841a45521a3012j26006N4890o6590D7347g4899A38115
$$ 119169 119021 174014 82841 -145521 -13012 -139018 -84128 -150718 47347 -74899 138115
9382a12140K1978m3725n4692A9072J43678b01479A76554C4723N5226d54741L4110
$$ -112140 -90162 -133887 -188579 19072 162750 -201479 176554 34723 89949 -454741 -420631
9371d20631H6188d2618l8882k21143B81312j02686a11378j13500D4188e5627B8225
$$ -420631 86188 -42618 -81500 -302643 281312 178626 -111378 -224878 44188 -55627 28225
9359a5866g222j13632j69066J12387f0360j52023i5502A5761K12273a66085j10794
$$ -15866 -7222 -120854 -289920 -177533 -60360 -212383 -95502 15761 228034 -166085 -276879
9348b76879C2648O373a72330M2898J4786j47889B3041c1813i134j72170B12528
$$ -276879 32648 39021 -172330 -129432 -114646 -262535 23041 -31813 -9134 -181304 212528
9336I6821a12965j23941g4067J9914j21340A53915k5523O8344f376j55273e3291
$$ 96821 -112965 -236906 -74067 -54153 -175493 153915 128392 196736 -6376 -161649 -53291
9324B96475b48809I8967i0408q8071a9856B20557b3915H6364e0655A24449c0115
$$ 296475 -248809 98967 -90408 -178479 -19856 220557 -23915 86364 -50655 124449 -30115
9312a40476A85100d6158G4072L1063b7109C2313K1243a60977g1254j19226L6056
$$ -140476 185100 -46158 74072 105135 -27109 32313 53556 -160977 -71254 -190480 -154424
9301a54424k27067B2739a88474l2455q0593m8758a47525j8427g0435j5900k09603
$$ -154424 -381491 22739 -188474 -220929 -301522 -350280 -147525 -165952 -70435 -86335 -295938
9290b95938f8684B273J13231a09680k64797a67434F9534a17146b4934A24401i4442
$$ -295938 -68684 2273 115504 -109680 -374477 -167434 69534 -117146 -24934 124401 -94442
9278b52445f0757j67480f4776j49810H0685a27347B9517a51207a9545l3904p5407
$$ -252445 -60757 -228237 -64776 -214586 80685 -127347 29517 -151207 -19545 -53449 -128856
9267a28856e0912E4797a72129r8498d9923A14895P3148i8882r9439k3933A30984
$$ -128856 -50912 54797 -172129 -270627 -49923 114895 188043 -98882 -198321 -222254 130984
9255b16638a01214K6565k3110p6049H1903a24037m92161A14888l1714k5210L16820
$$ -216638 -101214 -74649 -97759 -173808 81903 -124037 -616198 114888 83174 57964 374784
9244C74784A54938p225r086F098K01299a49219o1044a2572A09842J30629a91271
$$ 374784 154938 147713 138627 6098 207397 -149219 -210263 -12572 109842 240471 -191271
9232b24997A0494N9068c4060B8160b54864c0596j69885c0161a590l96244a14362
$$ -224997 10494 69562 -34060 28160 -254864 -30596 -200481 -30161 -1590 -397834 -114362
9220B17983a17173n9791a8429H3974a08277j13593f251j0592m225k10010Q6208
$$ 217983 -117173 -176964 -18429 83974 -108277 -221870 -6251 -16843 -21068 -231078 -144870
9209a44870l8443n3434j6848P8638A96613a32057b8979j62166A19608J8626A0705
$$ -144870 -183313 -236747 -253595 -174957 196613 -132057 -28979 -191145 119608 138234 10705
9197G7339b4756j75750D3970J5703a6616B7222M3223d11661A49228f0759m5343
$$ 77339 -24756 -200506 43970 59673 -16616 27222 70445 -411661 149228 -60759 -106102
9186a06102j14797E2043a01564A01588L2700a84462j47400A48039e8771B33325
$$ -106102 -220899 52043 -101564 101588 134288 -184462 -331862 148039 -58771 233325
9175A66492G6571L7752a52853R137M6365j68881j62042A04430g3794m2950k05739
$$ 166492 76571 114323 -152853 -143716 -97351 -266232 -428274 104430 -73794 -116744 -322483
9164c22483A8339a36515j31876f577j01502n1552N2937l12157c5179j82002D4937
$$ -322483 18339 -136515 -268391 -6577 -108079 -159631 -106694 -418851 -35179 -217181 44937
9152f6622p5689a6039A01454a68466A96789O4122O655D9309O1694D2826J48536
$$ -66622 -142311 -16039 101454 -168466 196789 260911 267566 49309 111003 42826 191362
9141A91362q1416b73393a36550e1308j06566k88412G0769J45899a83013h2200
$$ 191362 109946 -273393 -136550 -51308 -157874 -446286 70769 216668 -183013 -82200
9130a66207k34614A74661a5096j35026F6049a75690P6242A29467a30337j10490
$$ -166207 -400821 174661 -15096 -150122 66049 -175690 -99448 129467 -130337 -240827
9120b40827e621A28047a97793I5146b04157d6642j3280J1132l24338d0105B1497
$$ -240827 -5621 128047 -197793 95146 -204157 -46642 -59922 -48790 -373128 -40105 21497
9108b16494Q4847A71129K7051b9234B1239c15785h5464k65359B062a75307A98479
$$ -216494 -131647 171129 198180 -29234 21239 -315785 -85464 -350823 2062 -175307 198479
9096A33297c7238n6578f402k11520k70854K32048J2709A41293l5588K7773f335
$$ 133297 -37238 -93816 -6402 -217922 -488776 -256728 -244019 141293 105705 133478 -6335
9084a46449C1747b580k00112Q4645j52059F0107b05295l5605R8587A36749L5594
$$ -146449 31747 -2580 -202692 -118047 -270106 60107 -205295 -240900 -142313 136749 172343
9073A72343E9510a30584e8124E4244J60777a69082f9879j00273A42449a70747
$$ 172343 59510 -130584 -58124 54244 215021 -169082 -69879 -170152 142449 -170747
9062a93982D0060r967b65456P8847e6549J2302G012K16677a23960k03016h0771
$$ -193982 40060 30093 -265456 -186609 -56549 -44247 7012 223689 -123960 -326976 -80771
9050B03375F6597k1700J0344a89196i4409A14212Q14b42913A35968J3313b47180
$$ 203375 66597 44897 55241 -189196 -94409 114212 115026 -242913 135968 149281 -247180
9038a86402A85162Q8499b3122A2049g5564l4585b7568k74723J00200D7507a03487
$$ -186402 185162 273661 -23122 12049 -75564 -110149 -27568 -302291 -202091 47507 -103487
9026D5041j1744b8675B74396a49224o5912f9485o2267j83491a26808C9825L594
$$ 45041 33297 -28675 274396 -149224 -215136 -69485 -131752 -315243 -126808 39825 43419
9015D3419a33297A49860b94469g5822l2410L5599j58366e3839A59498a76664A3724
$$ 43419 -133297 149860 -294469 -75822 -108232 -72633 -230999 -53839 159498 -176664 13724
9003B05378q7784e3707k48608E6227O7851g7785G6572b9537k3953n7932A2472
$$ 205378 117594 -53707 -302315 56227 124078 -77785 76572 -29537 -53490 -111422 12472
8991c04423a07940A22289a49317G2360b45662B27117j10575b09597A54717a64426
$$ -304423 -107940 122289 -149317 72360 -245662 227117 116542 -209597 154717 -164426
8980b20296j68671J84578K0674A58444A6063b9525k19675m0300R8115C8895L1551
$$ -220296 -388967 -204389 -183715 158444 16063 -29525 -249200 -289500 -191385 38895 70446
8969G0446d7445A23650O5732b99234J43339E2265a15302a0485J446H7236c00186
$$ 70446 -47445 123650 189382 -299234 -155895 52265 -115302 -10485 -9039 87236 -300186
8957A02967b86945B29062l8675c11279B66551h6414F0499j4755a86520N9964E3399
$$ 102967 -286945 229062 190387 -311279 266551 -86414 60499 45744 -186520 -126556 53399
8945h0759c9536j7153B61594k1223e1942a4904o8702A17158n960J26022K12489
$$ -80759 -39536 -56689 261594 240371 -51942 -14904 -83606 117158 111198 237220 449709
8934D49709j76753O0990j45719a20118A44815L9490p6481M74459m505O63092J006831
$$ 449709 272956 333946 188227 -120118 144815 184305 107824 582283 577778 1240870 2247701
8923B247701J985187N691447m644340A970879I30149B56770K62406p1670R4130
$$ 2247701 4232888 9924335 5279995 1970879 930149 256770 519176 447506 541636
8914E41636G4022J32722q293p9114J93927q1329I4231k5993M89435I1167A1851
$$ 541636 74022 206744 198451 119337 313264 231935 94231 68238 557673 91167 11851
8902b01333B20870j02969l0847a13630c7460j5720j41382m5102A35855m3051L7351
$$ -201333 220870 117901 87054 -113630 -37460 -53180 -194562 -239664 135855 92804 130155
8891A30155b7246B8077L58867j60169K34849b29487E9944J47714B4335a09234
$$ 130155 -27246 28077 386944 226775 461624 -229487 59944 207658 24335 -109234
8880G4756a37332g601D0854a32471c3406j21170e0610a6659k3830O535B8647b13968
$$ 74756 -137332 -7601 40854 -132471 -33406 -154576 -50610 -16659 -40489 -33954 28647 -213968
8867g6585k52269D3673M9530D0327K3674J04281a8371k61120A52871c80847a54239
$$ -76585 -328854 43673 93203 40327 64001 168282 -18371 -279491 152871 -380847 -154239
$$ [...]
##END NTUPLES=NMR SPECTRUM
##END=
