
##TITLE=AC1363_CENAH12181_7160574_kADSKywJlK
##JCAMPDX= 6.0         $$ Bruker NMR JCAMP-DX V2.0
##DATA TYPE= NMR SPECTRUM
##DATA CLASS= NTUPLES
##ORIGIN= BRUKER
##OWNER= Administrator
$$ 1.72 TOPSPIN		Version 2.1
$$ 2012-11-30 22:58:39.776 -0500  Administrator@X
$$ Compression mode = diff/dup
##.OBSERVE FREQUENCY= 400.02188249412
##.OBSERVE NUCLEUS= ^1H
##.ACQUISITION MODE= SIMULTANEOUS (DQD)
##.ACQUISITION SCHEME= undefined
##.AVERAGES= 8
##.DIGITISER RES= 22
##SPECTROMETER/DATA SYSTEM= spect
##.PULSE SEQUENCE= zg30
##.SOLVENT NAME= COFFEE_meoh
##.SHIFT REFERENCE= INTERNAL, COFFEE_meoh, 1, 14.98509
##AUDIT TRAIL= $$ (NUMBER, WHEN, WHO, WHERE, PROCESS, VERSION, WHAT)
$$ ##TITLE= Audit trail, TOPSPIN		Version 2.1
$$ ##JCAMPDX= 5.01
$$ ##ORIGIN= Bruker BioSpin GmbH
$$ ##OWNER= Administrator
$$ $$ E:\/data/COFFEE/nmr/AC1363_CENAH12181_7160574_kADSKywJlK/10/pdata/1/auditp.txt
$$ ##AUDIT TRAIL=  $$ (NUMBER, WHEN, WHO, WHERE, PROCESS, VERSION, WHAT)
(   1,<2012-11-30 22:58:31.310 -0500>,<Administrator>,<X>,<go>,<TOPSPIN 2.1>,
      <created by zg
	started at 2012-11-30 22:57:37.304 -0500,
	POWCHK enabled, PULCHK disabled,
       configuration hash MD5:
       86 BA 57 50 F2 9D 5C 9B 26 00 A9 28 5F 66 2E 89
       data hash MD5: 64K
       B2 9D A0 1F 03 81 2E CE AD E3 62 00 16 87 43 3D>)
(   2,<2012-11-30 22:58:34.508 -0500>,<Administrator>,<X>,<proc1d>,<TOPSPIN 2.1>,
      <Start of raw data processing
       efp LB = 0 FT_mod = 6 PKNL = 1 PHC0 = 0 PHC1 = 0 SI = 32K 
       data hash MD5: 32K
       F1 63 47 C0 9D 7B D4 47 81 DE 86 D3 97 F7 CD 64>)
(   3,<2012-11-30 22:58:35.066 -0500>,<Administrator>,<X>,<proc1d>,<TOPSPIN 2.1>,
      <pk PHC0 = 94.11987 PHC1 = 0 
       data hash MD5: 32K
       D2 88 3E 3D 33 6E 97 8C 7B 6C CB 30 33 78 ED 8D>)
(   4,<2012-11-30 22:58:35.330 -0500>,<Administrator>,<X>,<proc1d>,<TOPSPIN 2.1>,
      <abs ABSG = 1 
       data hash MD5: 32K
       4A 36 36 6B D9 A3 F8 24 C0 B5 47 29 65 C3 A2 88>)
(   5,<2012-11-30 22:58:35.501 -0500>,<Administrator>,<X>,<proc1d>,<TOPSPIN 2.1>,
      <abs ABSG = 2 
       data hash MD5: 32K
       F3 C0 40 60 69 16 25 21 83 92 60 54 42 68 DE 27>)
(   6,<2012-11-30 22:58:35.672 -0500>,<Administrator>,<X>,<proc1d>,<TOPSPIN 2.1>,
      <abs ABSG = 3 
       data hash MD5: 32K
       25 6E 39 8D C1 4C BC E7 C2 45 0A B0 F4 44 6D A4>)
(   7,<2012-11-30 22:58:35.811 -0500>,<Administrator>,<X>,<proc1d>,<TOPSPIN 2.1>,
      <abs ABSG = 4 
       data hash MD5: 32K
       8E C6 63 F4 4B C9 E2 FD AA 78 8F 4D 38 45 AE 6D>)
(   8,<2012-11-30 22:58:35.951 -0500>,<Administrator>,<X>,<proc1d>,<TOPSPIN 2.1>,
      <abs ABSG = 5 
       data hash MD5: 32K
       8A D8 CC 35 2A 01 CA 14 5D 56 D2 61 6D 8E 6D 7C>)
$$ ##END=
$$ 
$$ $$ hash MD5
$$ $$ 4D 31 1B C3 FE 70 A4 AC 6B E6 59 DE 0F 76 B9 A3
##$RELAX= 
##$RELAX= 
##$RELAX= 
##$RELAX= 
##$RELAX= 
##$RELAX= 
##$RELAX= 
$$ Bruker specific parameters
$$ --------------------------
##$DU= <E:\>
##$EXPNO= 10
##$NAME= <AC1363_CENAH12181_7160574_kADSKywJlK>
$$ [...]
##$TP= (0..7)
150 150 150 150 150 150 150 150
##$TP07= 0
##$TPNAME0= <>
##$TPNAME1= <>
##$TPNAME2= <>
##$TPNAME3= <>
##$TPNAME4= <>
##$TPNAME5= <>
##$TPNAME6= <>
##$TPNAME7= <>
##$TPOAL= (0..7)
0.5 0.5 0.5 0.5 0.5 0.5 0.5 0.5
##$TPOFFS= (0..7)
0 0 0 0 0 0 0 0
##$TUNHIN= 0
##$TUNHOUT= 0
##$TUNXOUT= 0
##$USERA1= <user>
##$USERA2= <user>
##$USERA3= <user>
##$USERA4= <user>
##$USERA5= <user>
##$V9= 5
##$VALIST= <valist>
##$VCLIST= <CCCCCCCCCCCCCCC>
##$VD= 0
##$VDLIST= <DDDDDDDDDDDDDDD>
##$VPLIST= <PPPPPPPPPPPPPPP>
##$VTLIST= <TTTTTTTTTTTTTTT>
##$WBST= 1024
##$WBSW= 4
##$XGAIN= (0..3)
0 0 0 0
##$XL= 0
##$YL= 0
##$YMAX_a= 669148
##$YMIN_a= -562574
##$ZGOPTNS= <>
##$ZL1= 120
##$ZL2= 120
##$ZL3= 120
##$ZL4= 120
##$ABSF1= 14.98509
##$ABSF2= -5.573092
##$ABSG= 5
##$ABSL= 3
##$ALPHA= 0
##$AQORDER= 0
##$ASSFAC= 0
##$ASSFACI= 0
##$ASSFACX= 0
##$ASSWID= 0
##$AUNMP= <proc_prof1d_extract_pilot.lims>
##$AXLEFT= 0
##$AXNAME= <>
##$AXNUC= <1H>
##$AXRIGHT= 0
##$AXTYPE= 0
##$AXUNIT= <>
##$AZFE= 0.1
##$AZFW= 0.1
##$BCFW= 0
##$BC_mod= 0
##$BYTORDP= 0
##$COROFFS= 0
##$CY= 15
##$DATMOD= 1
##$DC= 0
##$DFILT= <>
##$DTYPP= 0
##$F1P= 0
##$F2P= 0
##$FCOR= 0.5
##$FTSIZE= 32768
##$FT_mod= 6
##$GAMMA= 0
##$GB= 0
##$INTBC= 1
##$INTSCL= 1
##$ISEN= 128
##$LB= 0
##$LEV0= 0
##$LPBIN= 0
##$MAXI= 10000
##$MC2= 0
##$MEAN= 0
##$ME_mod= 0
##$MI= 0
##$NCOEF= 0
##$NC_proc= -8
##$NLEV= 6
##$NOISF1= 0
##$NOISF2= 0
##$NSP= 0
##$NTH_PI= 0
##$NZP= 0
##$OFFSET= 14.98509
##$PC= 1
##$PHC0= 94.11987
##$PHC1= 0
##$PH_mod= 1
##$PKNL= yes
##$PPARMOD= 0
##$PPDIAG= 0
##$PPIPTYP= 0
##$PPMPNUM= 2147483647
##$PPRESOL= 1
##$PSCAL= 4
##$PSIGN= 0
##$PYNMP= <proc.py>
##$REVERSE= no
##$SF= 400.02
##$SI= 32768
##$SIGF1= 0
##$SIGF2= 0
##$SINO= 400
##$SIOLD= 32768
##$SPECTYP= <>
##$SREGLST= <1H.CDCl3>
##$SSB= 0
##$STSI= 32768
##$STSR= 0
##$SW_p= 8223.68421052631
##$SYMM= 0
##$S_DEV= 0
##$TDeff= 65536
##$TDoff= 0
##$TI= <>
##$TILT= no
##$TM1= 0
##$TM2= 0
##$TOPLEV= 0
##$USERP1= <user>
##$USERP2= <user>
##$USERP3= <user>
##$USERP4= <user>
##$USERP5= <user>
##$WDW= 1
##$XDIM= 32768
##$YMAX_p= 482862973
##$YMIN_p= -717523
##$CURPLOT= <Network HP LaserJet P1505>
##$CURPRIN= <$Network HP LaserJet P1505>
##$DFORMAT= <normdp>
##$LAYOUT= <+/1D_H.xwp>
##$LFORMAT= <normlp>
##$PFORMAT= <normpl>
##$SURQMSG= 1
$$ End of Bruker specific parameters
$$ ---------------------------------
##NTUPLES= NMR SPECTRUM
##VAR_NAME=  FREQUENCY,     SPECTRUM/REAL,   SPECTRUM/IMAG
##SYMBOL=    X,             R,               I
##VAR_TYPE=  INDEPENDENT,   DEPENDENT,       DEPENDENT
##VAR_FORM=  AFFN,          ASDF,            ASDF
##VAR_DIM=   32768,         32768,           32768
##UNITS=     HZ,            ARBITRARY UNITS, ARBITRARY UNITS
##FACTOR=    0.250966925370066, 1,           1
##FIRST=     8223.43324360094, 64342,        103406
##LAST=      0,             127486,          111951
##MIN=       0,             -717523,         0
##MAX=       8223.43324360094, 482862973,    0
$$ Real data points
##PAGE= N=1
##DATA TABLE= (X++(R..R)), XYDATA
$$ [...]
19474c08527q314J46791l1648j12757N1546b7445G9510d8790G4619e2112m0639
$$ -308527 -316841 -170050 -201698 -314455 -262909 -27445 79510 -48790 74619 -52112 -92751
19463i2751p2987G1483d496A9789a21380A88964b97931H8990a36076q6095d7528
$$ -92751 -165738 71483 -4496 19789 -121380 188964 -297931 88990 -136076 -222171 -47528
19451c31096b1483m14012B16562o7832a79687C2791a20666A51390D7245o380c6576
$$ -331096 -21483 -435495 216562 148730 -179687 32791 -120666 151390 47245 40865 -36576
19439B1689d16762A08598f3124m4816K036j06881k99572A47921b09527b0712A2870
$$ 21689 -416762 108598 -63124 -107940 -105904 -212785 -512357 147921 -209527 -20712 12870
19427a02821a5290k64474A84144b9090j27650A69733M0509b84602n3705A10699
$$ -102821 -15290 -279764 184144 -29090 -156740 169733 210242 -284602 -338307 110699
19416B99119e9044I126b10055e673k23072M3393M4777m3895g5370l31700i2490
$$ 299119 -59044 9126 -210055 -5673 -228745 -185352 -140575 -184470 -75370 -407070 -92490
19404d11588B84574B6178a57871A78888a90132f2436k616q3219g3872p3346p201
$$ -411588 284574 26178 -157871 178888 -190132 -62436 -65052 -148271 -73872 -147218 -154419
19393a54419J0411F4578g1339C5015R5497a42441D46468a76454f8687A68651h5932
$$ -154419 -144008 64578 -71339 35015 130512 -142441 446468 -176454 -68687 168651 -85932
19381b07949C651L1499b00475Q1571J2269k04626E3355a85906A98081d11949C54852
$$ -207949 3651 35150 -200475 -118904 -106635 -311261 53355 -185906 198081 -411949 354852
19369A16395Q7929b9250B11253g1375l28339a23114J4279I2813a81620c8228l27299
$$ 116395 204324 -29250 211253 -71375 -399714 -123114 -108835 92813 -181620 -38228 -365527
19358c65527a14836e2602m38481K24879I3377l7351e4693l10955A31197b92003
$$ -365527 -114836 -52602 -491083 -266204 93377 56026 -54693 -365648 131197 -292003
19347f9002B69366a41215r9106H2669b69286B4430a0716A93946g5057B30750a06259
$$ -69002 269366 -141215 -240321 82669 -269286 24430 -10716 193946 -75057 230750 -106259
19335G194L764Q5222e7712j40908m49113a32017n8130A9170a00302A28855b66138
$$ 7194 10958 96180 -57712 -198620 -647733 -132017 -190147 19170 -100302 128855 -266138
19323A17566h1322q9221P4126k15777j85769B44186c6341H1493b31009G006b89792
$$ 117566 -81322 -170543 -96417 -312194 -497963 244186 -36341 81493 -231009 7006 -289792
19311b76516a30635k73445a53805M0340K980l6501A24695b78745m163a19109C2185
$$ -276516 -130635 -404080 -153805 -113465 -110485 -146986 124695 -278745 -282908 -119109 32185
19299b03663H2031Q1592b2607j661C9492c06437I5318h4408J838E9576f222E0139
$$ -203663 82031 163623 -22607 -24268 39492 -306437 95318 -84408 -82570 59576 -6222 50139
19286b2101B60533D3817a78291B2824c1007j44307f3540r1601O0280j557A90937
$$ -22101 260533 43817 -178291 22824 -31007 -175314 -63540 -155141 -94861 -96418 190937
19274i5185I4411a491q4798l27204J60502E994N366b217C0344m663h6261k8838
$$ -95185 94411 -1491 -86289 -413493 -252991 5994 11360 -2217 30344 25681 -86261 -115099
19262a15099j05868C2735b74786f6951j1585j11754M4430f2313j1744k37158a22988
$$ -115099 -220967 32735 -274786 -66951 -78536 -190290 -145860 -62313 -74057 -311215 -122988
19250h450k4353j31809j47212R5395B8958d16894a46123r7956B46730a03650A25093
$$ -8450 -32803 -164612 -311824 -216429 28958 -416894 -146123 -244079 246730 -103650 125093
19238c7299B68007f5699j20940k02532D2595J0799K57402J4763a02713q4031L0457
$$ -37299 268007 -65699 -186639 -389171 42595 53394 310796 325559 -102713 -186744 -156287
19227a56287L2955N9533A17408f3742B70531f7527E951Q9707a21003G7444O1727
$$ -156287 -123332 -63799 117408 -63742 270531 -67527 5951 95658 -121003 77444 139171
19216A39171b69585Q2788n7779d304A29001d71463K18864h7009C45073a88834
$$ 139171 -269585 -186797 -244576 -4304 129001 -471463 -252599 -87009 345073 -188834
19205G7704b72000A50395d25535e9498p2542L7175A1189c12257D6229O8472a0551
$$ 77704 -272000 150395 -425535 -59498 -132040 -94865 11189 -312257 46229 114701 -10551
19193c03547C12305E2635a71201f1953j12863c5570j49292d1910D2092K04502
$$ -303547 312305 52635 -171201 -61953 -174816 -35570 -184862 -41910 42092 246594
19183B46594E5929c42566A7280c59214a77631F0743a7017j35948n5324e6506j14721
$$ 246594 55929 -342566 17280 -359214 -177631 60743 -17017 -152965 -208289 -56506 -171227
19172a71227I2621d0387l2759r4749k01454e1248B6560a32033q7427g9043L3343
$$ -171227 92621 -40387 -73146 -167895 -369349 -51248 26560 -132033 -219460 -79043 -45700
19161d5700n8116A97521f0861o4145A59857o8366r676f5659K3756B00072i365
$$ -45700 -103816 197521 -60861 -125006 159857 91491 81815 -65659 -41903 200072 -9365
19149D2605g0415m2439k4456A7508b23588E92946A01350e914k55683F2194d03606
$$ 42605 -70415 -112854 -137310 17508 -223588 592946 101350 -5914 -261597 62194 -403606
19137B469a34510b2506C4435f7184j17181A14266k957J2168i5563B89932b51869
$$ 2469 -134510 -22506 34435 -67184 -184365 114266 111309 123477 -95563 289932 -251869
19125d64177e0496l2558L3620j56997M4637O8238b7246j6812j34740r0595a13471
$$ -464177 -50496 -83054 -49434 -206431 -161794 -93556 -27246 -44058 -178798 -269393 -113471
19113b10910C02856a10411L218B44336E5816i5877A1787K04789o4159b36803p3796
$$ -210910 302856 -110411 -107193 244336 55816 -95877 11787 216576 152417 -236803 -310599
19102c10599e5831j10214B8295a63948l6277A29979R4290h54C671a84692D5388
$$ -310599 -55831 -166045 28295 -163948 -200225 129979 224269 -854 3671 -184692 45388
19090A04925g1004C31714a40184F2477b41388N3514A73041b06089A25948a57044
$$ 104925 -71004 331714 -140184 62477 -241388 -187874 173041 -206089 125948 -157044
19079H2898j5599b27740c079r884A08996b3289B92477A27928B7056g2753A41080
$$ 82898 67299 -227740 -3079 -12963 108996 -23289 292477 127928 27056 -72753 141080
19067h2669E1233b03247A03048c2626G568M9877b04006a1723H6221B6521N7829
$$ -82669 51233 -203247 103048 -32626 7568 57445 -204006 -11723 86221 26521 84350
19056H4350C6535A6170c5485j60914m4670c5563a7170j04650o2467I9504j9560
$$ 84350 36535 16170 -35485 -196399 -241069 -35563 -17170 -121820 -184287 99504 79944
19045G9944b93084a01762m8535j28591q2068r3922a40120B06943a34239j88497
$$ 79944 -293084 -101762 -150297 -278888 -360956 -454878 -140120 206943 -134239 -322736
19035c22736j9561A11118i9741H7844L972b69354l856A79123d3508A59319C3820
$$ -322736 -342297 111118 -99741 87844 91816 -269354 -273210 179123 -43508 159319 33820
19023b20963A1978N9820a42914O2093j55267c2029D9996J55505a30200r956a7626
$$ -220963 11978 71798 -142914 -80821 -236088 -32029 49996 205501 -130200 -140156 -17626
19011b82027H0917r631b29740G7507B0542M7359a51541d9016B78305a68613A44943
$$ -282027 80917 71286 -229740 77507 20542 67901 -151541 -49016 278305 -168613 144943
18999A52673g2727B55411E47P6161e5144G9580f285A58340b17321f878J003j74614
$$ 152673 -72727 255411 547 76708 -55144 79580 -6285 158340 -217321 -6878 -5875 -180489
18987a80489q5570B1873O4013b7075l22127A90888i6938j75294j1019A22879d651
$$ -180489 -266059 21873 85886 -27075 -349202 190888 -96938 -272232 -283251 122879 -4651
18975F3219d135I6531K11367P35227l29721c773k8743A04921i6262B09371d1842
$$ 63219 -4135 96531 307898 1043125 713404 -3773 -32516 104921 -96262 209371 -41842
18963d7437o6048A7096R6402e32539h0529q601k22870A98066c5090k26208l7166
$$ -47437 -113485 17096 113498 -532539 -80529 -89130 -312000 198066 -35090 -261298 -298464
18952b98464j21033B06276A02691J84301a89091j9954e7499A34978b08974R8031
$$ -298464 -419497 206276 102691 286992 -189091 -209045 -57499 134978 -208974 -110943
18942a10943d1463k03569j66934A31975E4144b70754N2716d3689I4572b0314G6649
$$ -110943 -41463 -245032 -411966 131975 54144 -270754 -218038 -43689 94572 -20314 76649
18930e2746B64435a28642H1109L08580G6071f0659l5230j78067G1426a47542A11726
$$ -52746 264435 -128642 81109 389689 76071 -60659 -95889 -273956 71426 -147542 111726
18918c16893D9646a89690o7407a00659a5256n2660B20056K73138A51856L94471
$$ -316893 49646 -189690 -257097 -100659 -15256 -67916 220056 493194 151856 546327
18908E46327K87718A64246a22790B60213M8280E2647b3372k7956G0306J79953
$$ 546327 834045 164246 -122790 260213 308493 52647 -23372 -51328 70306 250259
18898B50259g0446p2568j80332d7226k88320d0377a0838A35354f4697k38743R8886
$$ 250259 -70446 -143014 -323346 -47226 -335546 -40377 -10838 135354 -64697 -303440 -204554
18887b04554H1831b36319R0908n9595b1280A46925o1602d2423I126a75847k20292
$$ -204554 81831 -236319 -145411 -205006 -21280 146925 85323 -42423 9126 -175847 -396139
18876c96139J74433i38q9178j8552q6643j23668F1818a60676J0507O7645L9823
$$ -396139 -221706 -938 -90116 -108668 -195311 -318979 61818 -160676 -150169 -82524 -42701
18865d2701a1764k62514F2157d426j30057d5642j10868j8454a6033k63862g7198
$$ -42701 -11764 -274278 62157 -4426 -134483 -45642 -156510 -174964 -16033 -279895 -77198
18853a65762k19370Q1582D22465l5989b32545C07676j43744a2155A37193p930
$$ -165762 -385132 -303550 422465 386476 -232545 307676 163932 -12155 137193 129263
18843A29263n7328c3500E9988d49305K15283F5079j7614J18085b53835A17074
$$ 129263 71935 -33500 59988 -449305 -234022 65079 47465 165550 -253835 117074
18832a32040j10363K1303A2227K28841b9450l4846B45123d27453a61507p8872
$$ -132040 -242403 -221100 12227 241068 -29450 -64296 245123 -427453 -161507 -240379
18822b40379g4727B24514c1543D9423L1686J62773Q0428b5662q131j08015C9589
$$ -240379 -74727 224514 -31543 49423 81109 243882 324310 -25662 -33793 -141808 39589
18810E9627O5313M23451F7394b4398A86565E9840a02740E1709b2830j77452g0789
$$ 59627 124940 548391 67394 -24398 186565 59840 -102740 51709 -22830 -200282 -70789
18798f8540O363F7888J08679C5700c6242l42869F0189o033b68996O6367A9122
$$ -68540 -62177 67888 176567 35700 -36242 -379111 60189 54156 -268996 -202629 19122
18786H6572a95158q2514j06912a26738A49793F0682B0726c2017B9348f477n7575
$$ 86572 -195158 -277672 -384584 -126738 149793 60682 20726 -32017 29348 -6477 -64052
18775f4052F8547a42646o0856e286j36265M2282p1310l323r1714k05150B9560
$$ -64052 68547 -142646 -203502 -5286 -141551 -99269 -170579 -173902 -265616 -470766 29560
18763H8682a04942j22303j08788O5921C1269a27120k3041D652b84142E1008b15577
$$ 88682 -104942 -227245 -336033 -270112 31269 -127120 -150161 4652 -284142 51008 -215577
18751B49117b18818L1386L0684F867K89461A20259C9588b47256K2905g2549B27314
$$ 249117 -218818 -187432 -156748 6867 296328 120259 39588 -247256 -224351 -72549 227314
18739d34084E31209D8867a85632B74533b25115A51651F3734h8853n5434M41H0344
$$ -434084 531209 48867 -185632 274533 -225115 151651 63734 -88853 -144287 -143846 80344
18727F724K0749J474a95041r9543I2513k3262B2100d2756l07353f7400a8733k37583
$$ 6724 27473 28947 -195041 -294584 92513 69251 22100 -42756 -350109 -67400 -18733 -256316
18715b56316J02484j83923i7422D3124h0723A02045b85063c7574k08004E4139
$$ -256316 -153832 -337755 -97422 43124 -80723 102045 -285063 -37574 -245578 54139
18704b1341j06155l8316A12742b8109l3372j13938A02498E824a80506B49859G3607
$$ -21341 -127496 -165812 112742 -28109 -61481 -175419 102498 5824 -180506 249859 73607
18692c95611h2453a700j71747J2436L7882G1114d37122h2576C68178c67962d4785
$$ -395611 -82453 -1700 -173447 -161011 -123129 71114 -437122 -82576 368178 -367962 -44785
18680b65018D4929f7707j69512r10C48084a39674O4333j86850e669A84822b78487
$$ -265018 44929 -67707 -237219 -238129 348084 -139674 -75341 -262191 -5669 184822 -278487
18668B11201g3324B2005d00166O6872E0964P3124G678c4468F9172d22903F7256
$$ 211201 -73324 22005 -400166 -333294 50964 124088 7678 -34468 69172 -422903 67256
18656a87681f9116o2628j70435A25142i1356k23530A25604D8470e0147C2651i6546
$$ -187681 -69116 -131744 -302179 125142 -91356 -314886 125604 48470 -50147 32651 -96546
18644B21657A00728H86K0640a29244A63556a44650G7337i5682l11313a90147C4847
$$ 221657 100728 886 21526 -129244 163556 -144650 77337 -95682 -406995 -190147 34847
18632c6920j8655k04238N4280d2814k7126D1064b22227I1841a74056m0758L1031
$$ -36920 -55575 -259813 -205533 -42814 -69940 41064 -222227 91841 -174056 -214814 -183783
18621a83783b057E591h2350j23891N8902B0488a45616H6411h3884k37958a7919
$$ -183783 -2057 5591 -82350 -206241 -147339 20488 -145616 86411 -83884 -321842 -17919
18609a47523j49027A77077e2851n6554c604A36251b43473j9389A6174a29014O04
$$ -147523 -296550 177077 -52851 -109405 -3604 136251 -243473 -262862 16174 -129014 -128410
18598a28410G7281b89164R2103A74915R6821a50188k67210a67900q5360d6259
$$ -128410 77281 -289164 -197061 174915 271736 -150188 -417398 -167900 -253260 -46259
18587f1347A99095a94207K1837Q3916A3111K41599A3940a93417i2407k60540c8614
$$ -61347 199095 -194207 -172370 -88454 13111 254710 13940 -193417 -92407 -352947 -38614
18575A01050d57H0357c7032j42156j63163B9990h4353k31914a31622j43377a14804
$$ 101050 -457 80357 -37032 -179188 -342351 29990 -84353 -316267 -131622 -274999 -114804
18563a218D03759c1883j27733e0640j64625a06463b4556j51674D0656b71032o4860
$$ -1218 403759 -31883 -159616 -50640 -215265 -106463 -24556 -176230 40656 -271032 -335892
18552c35892i8298k60207A62831b96771a30812j35639f6547i237k44668C1446
$$ -335892 -98298 -358505 162831 -296771 -130812 -266451 -66547 -9237 -253905 31446
18541c7192j64092A7097G774a42079O0723A60520C0733a65016A18838N8337L3445
$$ -37192 -201284 17097 7774 -142079 -81356 160520 30733 -165016 118838 177175 210620
18530B10620q8582J60070b56287A8076M5713f2959r0061I3118k1799C3895J48193
$$ 210620 122038 282108 -256287 18076 63789 -62959 -153020 93118 71319 33895 182088
18519A82088b52611a13389m5761b7035A33604l0513b57133E2867K4629Q6800n6493
$$ 182088 -252611 -113389 -159150 -27035 133604 103091 -257133 52867 77496 164296 107803
18508A07803C0626K6536d36852a3578j41531r7801B6957c17629h4993A1617a47328
$$ 107803 30626 57162 -436852 -13578 -155109 -252910 26957 -317629 -84993 11617 -147328
18496a47680C17286a78395o0488B97477g2415C93805c48188A67892i0484a4060
$$ -147680 317286 -178395 -238883 297477 -72415 393805 -348188 167892 -90484 -14060
18485B44601g5924C2835J3466N6874J62796b1320n7401A0837e99495A01449k1471
$$ 244601 -75924 32835 46301 103175 265971 -21320 -78721 10837 -599495 101449 79978
18474G9978b16273G0801g9519A22056a441C5413c1016r4896G4759a52964D9443
$$ 79978 -216273 70801 -79519 122056 -1441 35413 -31016 -125912 74759 -152964 49443
18462c72798A50758b41521D7755b39893e5802F9843b73272b6802k5545k45971
$$ -372798 150758 -241521 47755 -239893 -55802 69843 -273272 -26802 -52347 -298318
18452b98318M7904j8538C33494E321L10985b05295n6850J14724n7851q8035a21862
$$ -298318 -250414 -268952 333494 5321 316306 -205295 -262145 -147421 -205272 -293307 -121862
18440c1241B18071a79125C1568a23788D5428O9449E264a80319h1391j81634a9325
$$ -31241 218071 -179125 31568 -123788 45428 114877 5264 -180319 -81391 -263025 -19325
18428b62283N6083f0009A1068b07942A10150D5378a36490K348A31238o3809c87390
$$ -262283 -206200 -60009 11068 -207942 110150 45378 -136490 -134142 131238 67429 -387390
18416f4385j21457r7741J13245D5670g0546K1124B02812J53414a74939A07343
$$ -64385 -185842 -283583 -170338 45670 -70546 -49422 202812 356226 -174939 107343
18405E0631J01483K53626D2395L8911e8592l05362I1218c41260J54451A08678
$$ 50631 152114 405740 42395 81306 -58592 -363954 91218 -341260 -186809 108678
18394b210A42212a80040Q3169E2857Q7268J08845c73772a48296D8036L77405A05003
$$ -2210 142212 -180040 -96871 52857 140125 248970 -373772 -148296 48036 425441 105003
18382d2257K142A37591l2607b86716A29844a50429c869j84509j34490A19987L4359
$$ -42257 -40115 137591 104984 -286716 129844 -150429 -3869 -188378 -322868 119987 154346
18371A54346a93825I8676d3964n12399a88776O8372L7990E4015L28495b32683
$$ 154346 -193825 98676 -43964 -556363 -188776 -120404 -82414 54015 382510 -232683
18360B15267D4922M3823b73462R0475f1542j39915B91488i8639A27671l5320C3638
$$ 215267 44922 88745 -273462 -182987 -61542 -201457 291488 -98639 127671 92351 33638
18348C0485J13980a18052j46067A40101e9002I1978j3125l0910A0713d5207B6555
$$ 30485 144465 -118052 -264119 140101 -59002 91978 78853 47943 10713 -45207 26555
18336a8287p6934j40363C09212a83459a337k52827C7357h3002A1570Q3397a05064
$$ -18287 -95221 -235584 309212 -183459 -1337 -254164 37357 -83002 11570 94967 -105064
18324C59726F534K86551e5620k8132M1174a53D17925A32468a59680e1085C3619
$$ 359726 6534 293085 -55620 -83752 -42578 -153 417925 132468 -159680 -51085 33619
18312A95459b2635B8702P8845a52474O4954K4619j4223n7222E97Q2351K7760a41576
$$ 195459 -22635 28702 107547 -152474 -87520 -62901 -77124 -134346 597 82948 110708 -141576
18299A21991m5047k3594e4129p5615j81290g3604a361m07347b1807j40348B5822
$$ 121991 76944 53350 -54129 -129744 -311034 -73604 -1361 -408708 -21807 -162155 25822
18287A24108a15626c2713p2265M9192l4680k89524d8095H4657L0557J56468c7343
$$ 124108 -115626 -32713 -104978 -55786 -90466 -379990 -48095 84657 115214 271682 -37343
18275b04309b5181k39530i0565F727B960N7138a74063A21347D6261K0214a60863
$$ -204309 -25181 -264711 -90565 6727 2960 60098 -174063 121347 46261 66475 -160863
18263A42171e2207k4339j19242A74752a10979o7446k9607A4487c61192d8801j40430
$$ 142171 -52207 -76546 -195788 174752 -110979 -178425 -208032 14487 -361192 -48801 -189231
18252a89231B58217a12197c618F3317a35668K9888i245p7728D4137j6961K6470
$$ -189231 258217 -112197 -3618 63317 -135668 -105780 -9245 -86973 44137 27176 53646
18241E3646L28535b46933i9518b1504o6758L1771C3341e4385H7267J27315b06803
$$ 53646 382181 -246933 -99518 -21504 -88262 -56491 33341 -54385 87267 214582 -206803
18229E0211K58291b8315p2685A04778a45791c7587k0943j94813B01498c38764
$$ 50211 308502 -28315 -101000 104778 -145791 -37587 -58530 -253343 201498 -338764
18218I1785A9488f229l66592a15782B77558b6322B04911A0405M9432a54734A13513
$$ 91785 19488 -6229 -372821 -115782 277558 -26322 204911 10405 59837 -154734 113513
18206a71625c6121l85772d0248k29327P1849E2332J31466D2564K29347f0765k30735
$$ -171625 -36121 -421893 -40248 -269575 -197726 52332 183798 42564 271911 -60765 -291500
18195b91500J09161I2377a9655p5818B31916a10805G9211J35569a19481E0433
$$ -291500 -182339 92377 -19655 -95473 231916 -110805 79211 214780 -119481 50433
18184c02869b7659G4679B7045J3554a2600j10424G8934b66309P653F3653h0531
$$ -302869 -27659 74679 27045 40599 -12600 -123024 78934 -266309 -258656 63653 -80531
18172A81595h6270a1761l5658j05625f7488k50344a05705j96924f2977j17756
$$ 181595 -86270 -11761 -47419 -153044 -67488 -317832 -105705 -302629 -62977 -180733
18162a80733j6187k4090h3151n5486Q54G1679a1583B9309J35350F4739K92803
$$ -180733 -196920 -221010 -83151 -138637 -137783 71679 -11583 29309 164659 64739 357542
18151C57542m7118I4178R1948L97640G4906K3419J08058A9400a56163L8262j55636
$$ 357542 310424 94178 186126 583766 74906 98325 206383 19400 -156163 -117901 -273537
18140b73537j66463G5206k2102a9773o8400H7676D409K24005j2020p155D4844
$$ -273537 -440000 75206 53104 -19773 -88173 87676 4409 228414 216394 209239 44844
18128i9567j01221A47392m8663m0432c1527o4646q2454B33836a29903A43026O3924
$$ -99567 -200788 147392 98729 58297 -31527 -96173 -178627 233836 -129903 143026 206950
18117B06950a08658a8641m836o1368A2714a73587M6412H3520B7368J9179c15968
$$ 206950 -108658 -18641 -23477 -84845 12714 -173587 -127175 83520 27368 46547 -315968
18105a28959A26466J80215c18597b4497E5113K6322b6071I6634b48856D68041
$$ -128959 126466 306681 -318597 -24497 55113 81435 -26071 96634 -248856 468041
18094h4564F5048A4997P282Q0590J62616b54900h165C08798F2529a35874C4736
$$ -84564 65048 14997 22279 102869 265485 -254900 -8165 308798 62529 -135874 34736
18082b2740H811d81893B87163j34386a94968B6589N6676g0217C01416d3315k07715
$$ -22740 8811 -481893 287163 152777 -194968 26589 83265 -70217 301416 -43315 -251030
18071b51030A60769a27005q6900A35947a93662l9960A29706n7879B437K55503
$$ -251030 160769 -127005 -213905 135947 -193662 -233622 129706 71827 2437 257940
18061B57940d0020e266n5144j11206A37075L85659B32560B7653p202N3280J0497
$$ 257940 -40020 -5266 -60410 -171616 137075 522734 232560 27653 20451 73731 84228
18050H4228k5515d6649J2779C83689q0223q0529I8046P0029b68367A44775B3915
$$ 84228 58713 -46649 -33870 383689 303466 222937 98046 168075 -268367 144775 23915
18038B94963a17194A26220m3279q486a44451A75528L72289a97318A93841d26845
$$ 294963 -117194 126220 82941 74455 -144451 175528 547817 -197318 193841 -426845
18027I9123J30916M8325a9117C60072c07408D9754d3399k53324B24793G661c37100
$$ 99123 230039 278364 -19117 360072 -307408 49754 -43399 -296723 224793 7661 -337100
18015a37974D9593N7338a13219j7343n2520E06K24871N6930f452E5330L24626
$$ -137974 49593 106931 -113219 -130562 -183082 506 225377 282307 -6452 55330 379956
18004C79956a54263C8811a50297B60976C7803b6635A73628b60053C11581c5446
$$ 379956 -154263 38811 -150297 260976 37803 -26635 173628 -260053 311581 -35446
17993c1329A79730h3025A94782a49612r2547j6496B14818O9528q9017k3164m0170
$$ -31329 179730 -83025 194782 -149612 -242159 -258655 214818 284346 195329 172165 131995
17982A31995a29260d6809j36163f8522C0392b29870Q6037A20011a85216b1019
$$ 131995 -129260 -46809 -182972 -68522 30392 -229870 -143833 120011 -185216 -21019
17971a58470M5509L3842A629J6527J24621m9810L9794a75303E5599K25007b51818
$$ -158470 -112961 -79119 1629 18156 142777 92967 132761 -175303 55599 280606 -251818
17959A73363d4149R522j03588o9928K849B53392p8400B3060a59898f6734B11046
$$ 173363 -44149 -34627 -138215 -208143 -205294 253392 174992 23060 -159898 -66734 211046
17947B95180o9218a86856J6454c5883B09782d1445I2856a44669r9012Q460J15687
$$ 295180 225962 -186856 -170402 -35883 209782 -41445 92856 -144669 -243681 -235221 -119534
17936a19534c6813G5679a41534O4780A62371a16988b7104A76645b35784A41289
$$ -119534 -36813 75679 -141534 -76754 162371 -116988 -27104 176645 -235784 141289
17925C9300J86426j7104j4176d9584j14681C8274c08931d0918q8254F7976L2977
$$ 39300 225726 208622 194446 -49584 -164265 38274 -308931 -40918 -129172 67976 100953
17914A00953A2818a52623L4885A75635J33183a08387e2228B87120b01174H6848
$$ 100953 12818 -152623 -117738 175635 308818 -108387 -52228 287120 -201174 86848
17903h4087B9061N17578g703n7357m10026B02163a31674J2069H7493M812N4017
$$ -84087 29061 546639 -7703 -65060 -475086 202163 -131674 -119605 87493 92305 146322
17892A46322J95227d93724a66071A71822c4396A28193N6928P0061a34128O5302
$$ 146322 341549 -493724 -166071 171822 -34396 128193 185121 255182 -134128 -68826
17882f8826j43420O2794C33571a84834P5906F5012J12194g8580B13891b7578j76043
$$ -68826 -212246 -149452 333571 -184834 -108928 65012 177206 -78580 213891 -27578 -203621
17871b03621i1877H6834c83174B48499H6388b25095i2046A58789f368C1651a65519
$$ -203621 -91877 86834 -383174 248499 86388 -225095 -92046 158789 -6368 31651 -165519
17859G9773b47261g9784E0807A1745J64662b4593B87254b71354A70484B9134O4898
$$ 79773 -247261 -79784 50807 11745 176407 -24593 287254 -271354 170484 29134 94032
17848I4032a63147e3152A46043E0012a15799N217e64A91721l1769a03570A70631
$$ 94032 -163147 -53152 146043 50012 -115799 -110582 -564 191721 159952 -103570 170631
17836E847K47467i7323E5360b65168k36512D7709a67662A10698b711k8621B81504
$$ 5847 253314 -97323 55360 -265168 -501680 47709 -167662 110698 -2711 -31332 281504
17824a09601D73031A72447e6248B42585G1723q532J96676e2322r0948G4138J29887
$$ -109601 473031 172447 -56248 242585 71723 63191 259867 -52322 -143270 74138 204025
17813B04025k9750Q2515g7140C56647o8724a15063C1064K599K06162a18530j06431
$$ 204025 174275 256790 -77140 356647 287923 -115063 31064 33663 239825 -118530 -224961
17802b24961A24658j6266K05237F6610b598n8324G0179P72l4533K23287a66601
$$ -224961 124658 108392 313629 66610 -2598 -60922 70179 70951 36418 259705 -166601
17790a2183H3726J99710C0593a2065n9078j05912A25647a10011C41428A63287
$$ -12183 83726 283436 30593 -12065 -71143 -177055 125647 -110011 341428 163287
17779B5314N8971k9150f4724k6054B72520A648a35966D79808c1644k7906J120
$$ 25314 84285 55135 -64724 -90778 272520 1648 -135966 479808 -31644 -59550 -58430
17768e8430o6D4791a3720c037o6759I1070J25125a14548B85578E59P8866K31889
$$ -58430 -58496 44791 -13720 -3037 -69796 91070 216195 -114548 285578 559 79425 311314
17756C11314q8086i906B55676O6148A59784K7274f5442B61367a60692C08684e1036
$$ 311314 223228 -9906 255676 321824 159784 187058 -65442 261367 -160692 308684 -51036
17744a7181A00797Q0549e0462m5753G5064B9685a4867A28383b644H2004J35521
$$ -17181 100797 181346 -50462 -96215 75064 29685 -14867 128383 -2644 82004 217525
17733B17525b33765a6287B00217I0481K9324J81710j34504J01706J81043k12218
$$ 217525 -233765 -16287 200217 90481 119805 301515 167011 268717 449760 237542
17723B37542r7795a25886F4670i0708B34051a1260j06597A51421l5480J13508
$$ 237542 139747 -125886 64670 -90708 234051 -11260 -117857 151421 115941 229449
17713B29449h1764A1218J83074o6323a50125A55477a90110M016A33173J23061
$$ 229449 -81764 11218 194292 127969 -150125 155477 -190110 -186094 133173 256234
17703B56234R3906d2561B83699C5068c05147a47319n1281A4146c23560A73693
$$ 256234 350140 -42561 283699 35068 -305147 -147319 -198600 14146 -323560 173693
17692F0051O8957E4413a41323c2232D7538b11763D72346j03016c8404B47649M5895
$$ 60051 129008 54413 -141323 -32232 47538 -211763 472346 369330 -38404 247649 293544
17681B93544A00170d06761H0151K38723F7878l0221A5788O1568f7261B41688g7380
$$ 293544 100170 -406761 80151 318874 67878 37657 15788 77356 -67261 241688 -77380
17669C38077a86291E8535a83048D82192g4259j01137K1593H8961a44073A92048
$$ 338077 -186291 58535 -183048 482192 -74259 -175396 -153803 88961 -144073 192048
17658a04929A98637a11311A09122e624B5701a3383D3870N5124b6105j79885h4449
$$ -104929 198637 -111311 109122 -5624 25701 -13383 43870 98994 -26105 -205990 -84449
17646E4751a25786F37208A06487M8828J12107a10622c3019B31753N6929A3227
$$ 54751 -125786 637208 106487 155315 267422 -110622 -33019 231753 288682 13227
17635a2261A77124O0826l7928G4631M2850M7694a25030G5580b5318r107A62880
$$ -12261 177124 237950 200022 74631 117481 165175 -125030 75580 -25318 -34425 162880
17623C89058j25014A12789J79550E374L33383A54846J18561I640L2844J97783
$$ 389058 264044 112789 292339 5374 338757 154846 273407 9640 42484 240267
17613B40267d375A35031Q5237a45274H7458B3391R5236k8614a1602k6309G5098
$$ 240267 -4375 135031 220268 -145274 87458 23391 118627 90013 -11602 -37911 75098
17601i0641B2738M13729G7644R6638j0911m5051b114A96282J2363D0546L04103
$$ -90641 22738 436467 77644 174282 163371 118320 -2114 196282 208645 40546 344649
17590C44649F9071J79051F4019f237C45640e9817C28256A24563o1139J18862J0290
$$ 344649 69071 248122 64019 -6237 345640 -59817 328256 124563 63424 182286 192576
17579A92576Q1570a1012B74407A5270K50101j08036J19011j28427l7686L57942
$$ 192576 274146 -11012 274407 15270 265371 157335 276346 147919 110233 468175
17569D68175k25003A18945j6425K49286a42218B38775o0886m9188l4962m3230
$$ 468175 243172 118945 102520 351806 -142218 238775 177889 128701 93739 50509
17559E0509L93546b03143A63221a02857A17007K60187I0041b08059A57226l1752
$$ 50509 444055 -203143 163221 -102857 117007 377194 90041 -208059 157226 125474
17549A25474k5857R3415j0715c5775C37461n4679o6027p1635J30586f1408C00057
$$ 125474 99617 193032 182317 -35775 337461 282782 216755 145120 275706 -61408 300057
17537B83344J97900b2613C76529F1723K36828F0829L53022r9712O0778Q7196K53428
$$ 283344 481244 -22613 376529 61723 298551 60829 413851 314139 374917 462113 715541
17526G15541K12989L28689L27261l44203k50754k82465K79082l65418k4485j68013
$$ 715541 928530 1257219 1584480 1240277 989523 707058 986140 620722 596237 428224
17516D28224K39364p2012h5161E81612q323J74466j92548P49683N5287N0682j48652
$$ 428224 667588 595576 -85161 581612 573289 747755 555207 1304890 1360177 1410859 1262207
17505A262207E4064L38885p3862L83065l12198m2566Q937A52549K35711D8357
$$ 1262207 54064 392949 319087 702152 389954 347388 356325 152549 388260 48357
17494I3884L5865J74810P6458O5823j52642K46889c4036A37250P2623K27050j65270
$$ 93884 129749 304559 381017 446840 294198 541087 -34036 137250 209873 436923 271653
17483B71653M47033l06956j61030F9089J58494J5276k126P9528J76144K3492h2722
$$ 271653 718686 411730 250700 69089 227583 242859 240733 320261 496405 519897 -82722
17471D30561A63857K89282n8023B8628J86524K6855j3640m620L20780k17561M2175
$$ 430561 163857 453139 395116 28628 215152 242007 228367 223747 544527 326966 369141
17460C69141l5694m3693J153j28546K21913n1350r8521l8832L62131B53429P6008
$$ 369141 333447 289754 290907 162361 384274 332924 234403 195571 557702 253429 329437
17449C29437r1361l686L85143k48196J30341o9881j26075A40609J93570M7962
$$ 329437 238076 234390 619533 371337 501678 431797 305722 140609 334179 382141
17439C82141I7428L09206m9248m4303J80258j99694E0313K95570K03661k58318
$$ 382141 97428 406634 357386 313083 493341 293647 50313 345883 549544 291226
17429B91226J65996j57986K02892A73276J04615K54548j86676K62794A81445K42048
$$ 291226 457222 299236 502128 173276 277891 532439 345763 608557 181445 423493
17419D23493r2167K83034A1659N81653k29089o5685J44655J9562k17897J39711
$$ 423493 331326 614360 11659 593312 364223 298538 443193 462755 244858 384569
17409C84569a05014B91295j494L7848O5943j47652J12180a16896C85644A43483
$$ 384569 -105014 291295 289801 327649 393592 245940 358120 -116896 385644 143483
17398d0658D79306r9155j76392J26944j30533o547J40008r8532A0785K50679D96
$$ -40658 479306 380151 203759 330703 200170 193623 333631 235099 10785 261464 496
17386D85514k27184k5390q7503J01325N5619J2090p6950O6176j23821M4176J39900
$$ 485514 258330 232940 145437 246762 302381 314471 237521 303697 179876 224052 363952
17375C63952F6427K66844o7057N9767n2611a5117A41189P9483q0807J60997k8241
$$ 363952 66427 333271 266214 325981 273370 -15117 141189 220672 139865 300862 272621
17364B72621o0825K69702B05102J08733M37452l37395k4423A86679J17060N3757
$$ 272621 211796 481498 205102 313835 751287 413892 389469 186679 303739 357496
17354C57496n1607J4311R2651A25010K80006K5371j87076J12016A41085K3831
$$ 357496 305889 320200 412851 125010 405016 430387 243311 355327 141085 164916
17344A64916R1579r899K07118j25009N2053K6843l0811j41637n2352m1426m9515
$$ 164916 256495 246596 453714 328705 380758 407601 376790 235153 182801 141375 91860
17333I1860h6642B20630p2265J87450r2212M1447J75094H2928J36371P1623k7556
$$ 91860 -86642 220630 148365 335815 243603 285050 460144 82928 219299 290922 263366
17322B63366M7227m5185m4375L86184j80021j44988j19870K99151A09614L69719
$$ 263366 310593 265408 221033 607217 427196 282208 162338 461489 109614 479333
17312D79333K353j44608j4069o2898k3234C5342J17277J33520L10295k64229p1314
$$ 479333 481686 337078 323009 260111 236877 35342 152619 286139 596434 332205 260891
17301B60891r8565K45664r1823G9753K44483L03062k57695J18167r4553J9472
$$ 260891 162326 407990 316167 79753 324236 627298 369603 487770 393217 412689
17291D12689C3280L26190q2381k6042j05311K52619L44113C43482J57002B00575
$$ 412689 33280 359470 277089 251047 145736 398355 742468 343482 500484 200575
17280E28921l8258F7172P30345l54068p3328P7667B06469J71124h879E87296j22103
$$ 528921 490663 67172 797517 443449 370121 447788 206469 377593 -8879 587296 465193
17269D65193J35308k23488L5209A42371J71949o6644r9878Q759L04678k21657
$$ 465193 600501 377013 412222 142371 314320 247676 147798 156557 461235 239578
17259B39578K83672D9118L95873J3657j25671P5832j02093j6615A04265N43561
$$ 239578 523250 49118 444991 458648 332977 408809 306716 290101 104265 647826
17249F47826l13007j28097K51974J81989o6740A89834F0400J46275K74024K08083
$$ 647826 334819 206722 458696 640685 573945 189834 60400 206675 480699 688782
17239F88782j70753j64269M7453K39827j94164j25876J83572M0394j21182j10211
$$ 688782 518029 353760 401213 641040 446876 321000 504572 544966 423784 313573
17229C13573N56347C96769l9519A49373M16933k60139j832P8695J77849K41875
$$ 313573 869920 396769 357250 149373 566306 306167 304335 383030 560879 802754
17219H02754l53738F7240N52154j04532j73004K8482J41337K07k19085N12140
$$ 802754 449016 67240 619394 514862 341858 370340 511677 511884 292799 804939
17209H04939C66403Q4582A92271J10818K990K53303N3684k6747m5553Q2792k10894
$$ 804939 366403 450985 192271 303089 306079 559382 613066 586319 540766 623558 412664
17198D12664J05324k44549K59123j67783j02692L04517j76411K61305C23384R1113
$$ 412664 517988 273439 532562 364779 262087 566604 390193 651498 323384 414497
17188D14497m0162n6452R6006L71386o4726k35121j84758M20192j87656j06266
$$ 414497 374335 317883 413889 785275 720549 485428 300670 720862 533206 426940
17178D26940K2108J81496j27141Q4240j69748j7076L01775C37215R6086j31653
$$ 426940 449048 630544 503403 587643 417895 400819 702594 337215 433301 301648
17168C01648L97843j73884J83421J25401j76957J805j92530N8039Q1154k07832
$$ 301648 699491 525607 709028 834429 657472 659277 466747 524786 605940 398108
17158C98108l1118M05426B50765L92577j67923j26695K03009K43078r0545l00710
$$ 398108 366990 772416 250765 643342 475419 348724 551733 794811 704266 403556
17148D03556k7188L1809N52996l89962J8091j65296L32457L9365l27244J52026
$$ 403556 376368 408177 961173 571211 589302 424006 756463 795828 468584 620610
17138F20610K7148J41910n3768k87478J89819K5508k71070M90811k4882j51011
$$ 620610 647758 789668 735900 448422 638241 663749 392679 883490 858608 707597
17128G07597K20070j23200P8650k22054Q1644k86100m2939K24693j92132K51262
$$ 707597 927667 804467 883117 661063 742707 456607 413668 638361 446229 697491
17118F97491k18605N11554j88404k78115M5201J01997O7263J50247j1987l81138
$$ 697491 478886 990440 802036 523921 569122 671119 738382 888629 876642 495504
17108D95504K0591k0071J16130K30597j45126k93328J90530k35743J72476k00885
$$ 495504 516095 496024 612154 842751 697625 404297 594827 359084 531560 330675
17098C30675P73105j10905l36611L23361L6861J04216j59240l32044K11158L0161
$$ 330675 1103780 992875 656264 979625 1016486 1120702 961462 629418 840576 870737
17088H70737j94393K22978l12684J58463K65843k44410k33692M73581m58660J78570
$$ 870737 676344 899322 586638 745101 1010944 766534 532842 1006423 547763 726333
17078G26333K75995j42082K19382j02017J62122k31290N0282J21592j48968q2721
$$ 726333 1002328 860246 1079628 977611 1139733 908443 958725 1080317 931349 848628
17068H48628O2204j32276l4665J76348j08191l35074M80310r1948q2742j68489
$$ 848628 910832 778556 743891 920239 812048 476974 957284 865336 782594 614105
17058F14105M48466R7841k42989j72265K16566L8102J67573n5524p0541k89152
$$ 614105 1062571 1160412 917423 745158 961724 999826 1167399 1111875 1041334 752182
17048G52182L08496J72940j72176N8606q0137M9245J10885J5470n50253N72117
$$ 752182 1060678 1233618 1061442 1120048 1039911 1089156 1200041 1215511 665258 1237375
17038A237375k43597K36706j30940Q904k79101K5486J02073K32107Q2626j17447
$$ 1237375 993778 1230484 1099544 1108448 829347 854833 956906 1189013 1271639 1154192
17028A154192R4137k0525l11405J96482j62120K35025j75438K74111L47826n55552
$$ 1154192 1248329 1227804 916399 1112881 950761 1185786 1010348 1284459 1632285 1076733
17018A076733J96998k82612L32475q327l0514k12361Q9732J86769n8950j99688
$$ 1076733 1273731 991119 1323594 1315267 1284753 1072392 1162124 1348893 1289943 1090255
17008A090255M67992k57093J73850j86616j00406k9140L73193k41560l5873K54727
$$ 1090255 1558247 1301154 1475004 1288388 1187982 1158842 1532035 1290475 1254602 1509329
16998A509329n47034P02636k1456k90284j40452M98473M2990j87642j42383j56424
$$ 1509329 962295 1664931 1643475 1353191 1212739 1711212 1754202 1566560 1424177 1267753
16988A267753J43121J19612J43515Q36k06135J43832N606K02091m1927k51024
$$ 1267753 1410874 1530486 1674001 1674837 1468702 1612534 1618140 1820231 1778304 1527280
16978A527280P3718j17898K49676j15281O5914J64632q5252j90326K75033j98479
$$ 1527280 1600998 1483100 1732776 1617495 1683409 1848041 1762789 1572463 1847496 1649017
16968A649017j21396J13679K7515J11988k85613L05124o3890J38928M967P5640
$$ 1649017 1527621 1641300 1668815 1780803 1495190 1800314 1736424 1875352 1880319 1955959
16958A955959L2683M91756o62520J41940K58234k5422k57638P8588J39216r2260
$$ 1955959 1988642 2480398 1817878 1959818 2218052 2192630 1934992 2013580 2152796 2060536
16948B060536m9411Q7226j71621L66367k23757p3362Q6026J37303K13305k17886
$$ 2060536 2011125 2098351 1926730 2293097 2069340 1995978 2082004 2219307 2432612 2214726
16938B214726j80216M23202Q1578n90254L75122N0948j08558L8646K5526Q0640
$$ 2214726 2034510 2457712 2539290 1949036 2324158 2375106 2266548 2305194 2330720 2411360
16928B411360r979J65480J38508n47619K35624J16480N5456m5025j29045L42236
$$ 2411360 2401381 2566861 2705369 2157750 2393374 2509854 2565310 2520285 2391240 2733476
16918B733476N1462N47168k38984k98817K54635k49944q5653J05446J4875J64204
$$ 2733476 2784938 3332106 3093122 2794305 3048940 2798996 2713343 2818789 2833664 2997868
16908B997868L01679o51090M10909L9063j02687M76793M694k60010K03480j25811
$$ 2997868 3299547 2648457 3059366 3098429 2995742 3472535 3477229 3217219 3420699 3294888
16898C294888J54448K07094k92566L71023m0788k05184K60382n3671J1184J33573
$$ 3294888 3449336 3656430 3363864 3734887 3694099 3488915 3749297 3695626 3706810 3840383
16888C840383l95063N52264N0418q3011k62172L45020j00533K15489K25068k54006
$$ 3840383 3445320 3997584 4048002 3964991 3702819 4047839 3947306 4162795 4387863 4133857
16878D133857J12885j25784M39004j10583k63981P63346l52420K31982m3704J92664
$$ 4133857 4246742 4120958 4559962 4449379 4185398 4948744 4596324 4828306 4784602 4977266
16868D977266j27638M04946l51273J02282K9234P4855K09880R4808K5617J10774
$$ 4977266 4849628 5254574 4903301 5005583 5034817 5109672 5319552 5414360 5439977 5550751
16858E550751j42754M27116p1354K03754R2219J5874J04599k25671L0097M32172
$$ 5550751 5407997 5835113 5763759 5967513 6059732 6075606 6180205 5954534 5984631 6416803
16848F416803q1385J35116K3838K50406J89178m3822J80217m9839L93359K60342
$$ 6416803 6335418 6470534 6494372 6744778 6933956 6890134 7070351 7020512 7413871 7674213
16838G674213l13419M93024P7180J1867M88506j08536l05815J35533M40571R0730
$$ 7674213 7360794 7853818 7930998 7942865 8431371 8322835 8017020 8152553 8593124 8683854
16828H683854L57547l08196L55376M26164L19428k61491K21818L69900K80389
$$ 8683854 9041401 8733205 9088581 9514745 9834173 9572682 9794500 10164400 10444789
16819A0444789J26285m0341P4200N70545J71417K97825J68794J59369Q6655M92358
$$ 10444789 10571074 10530733 10604933 11175478 11346895 11644720 11813514 11972883 12059538 12551896
16809A2551896K37053j0800M19804J18198N14674N46308l54781R51710L02544
$$ 12551896 12788949 12778149 13197953 13316151 13830825 14377133 14022352 14974062 15276606
16800A5276606j87370O33613K8358P18078L03850P38413K42022K85336L72714
$$ 15276606 15089236 15722849 15751207 16469285 16773135 17511548 17753570 18038906 18411620
16791A8411620O90245M31873M48880L22791P75609K97803Q11389N45168O34521
$$ 18411620 19101865 19533738 19982618 20305409 21081018 21378821 22190210 22735378 23369899
16782B3369899M56577J118102J36875R57276L94437Q32571Q47451J140984L72690
$$ 23369899 23826476 24944578 25081453 26038729 26433166 27265737 28113188 29254172 29626862
16773B9626862R19675Q95603R85132J037406J252853R13921N20488J633438J270932
$$ 29626862 30546537 31442140 32427272 33464678 34717531 35631452 36151940 37785378 39056310
16764C9056310J438671J136384J422247J111203J520553J513893J668113J807509
$$ 39056310 40494981 41631365 43053612 44164815 45685368 47199261 48867374 50674883
16756E0674883J437936J732054J727008J535141K240946J775417K135902K077785
$$ 50674883 52112819 53844873 55571881 57107022 59347968 61123385 63259287 65337072
16748F5337072K377838J821032K311677K693546K187483K504078K045429K616892
$$ 65337072 67714910 69535942 71847619 74541165 76728648 79232726 81278155 83895047
16740H3895047K663682K488554K116260K526240K319357J912636K720846J681433
$$ 83895047 86558729 89047283 91163543 93689783 96009140 97921776 100642622 102324055
16732A02324055K140576J673857K043150J542410J378943J297346P75036O34634
$$ 102324055 104464631 106138488 108181638 109724048 111102991 112400337 113175373 113810007
16724A13810007K13447Q51264k59416m08122q29161n61721q31592j210425j399591
$$ 113810007 114023454 114874718 114615302 114207180 113378019 112816298 111984706 110774281 109374690
16715A09374690j792227j652601j741400k255748j979959k124074k618964k278286
$$ 109374690 107582463 105929862 104188462 101932714 99952755 97828681 95209717 92931431
16707I2931431k634295k295946k650432k326352k365384k112088l045242k211978
$$ 92931431 90297136 88001190 85350758 83024406 80659022 78546934 75501692 73289714
16699G3289714k321831k155963k301800j985625k343786j922641k051624j526395
$$ 73289714 70967883 68811920 66510120 64524495 62180709 60258068 58206444 56680049
16691E6680049k203168j920106j521954j634986j711972j449680j603957j542840
$$ 56680049 54476881 52556775 51034821 49399835 47687863 46238183 44634226 43091386
16683D3091386j483529j087685j436809j155151j142108j162321j280620n93173
$$ 43091386 41607857 40520172 39083363 37928212 36786104 35623783 34343163 33749990
16675C3749990j154612j068603j099962p75600p46073q22799o80769r30051p95637
$$ 33749990 32595378 31526775 30426813 29651213 28905140 28082341 27401572 26471521 25675884
16666B5675884n10357q99842m25131p36809n24691p63899n24412m11623l57914
$$ 25675884 25165527 24265685 23840554 23103745 22579054 21815155 21290743 20879120 20521206
16657B0521206q87753j73583p69394m63664o68311m02115O3075p04136k54712
$$ 20521206 19633453 19459870 18690476 18226812 17558501 17156386 17219461 16515325 16260613
16648A6260613p78868q1787l85016l74498j30551m67060l35037O9239o37503l30787
$$ 16260613 15481745 15399958 15014942 14640444 14509893 14042833 13707796 13777035 13139532 12808745
16638A2808745J194k67756m97803j50779m39542J19489k83665m94220j13379l02441
$$ 12808745 12809939 12542183 12044380 11893601 11454059 11573548 11289883 10795663 10682284 10379843
16628A0379843J69143j38686k32529l27939j45507l95729n9836l38134j33067
$$ 10379843 10548986 10410300 10177771 9849832 9704325 9308596 9248760 8910626 8777559
16619H777559n8706j78475k34988p6819k49975P7785l16260j45137k25360K33039
$$ 8777559 8718853 8540378 8305390 8228571 7978596 8056381 7740121 7594984 7369624 7602663
16609G602663m50717r1181M5069k33988O6541j69448r2612j04635j23923p4090
$$ 7602663 7151946 7060765 7105834 6871846 6938387 6768939 6676327 6571692 6447769 6373679
16599F373679m96391Q89599m38833n98570K04190l07563L3321M5380j0406j23799
$$ 6373679 5877288 6766887 6328054 5729484 5933674 5626111 5659432 5704812 5694406 5570607
16589E570607j40830l0382k11726p2312K85914p76863N54934l22281O699k76721
$$ 5570607 5429777 5399395 5187669 5115357 5401271 4624408 5179342 4857061 4863760 4587039
16579D587039N5125J01649m34467M37248k47729k22793O9797m14340K54773J21142
$$ 4587039 4642164 4743813 4309346 4746594 4498865 4276072 4345869 3931529 4186302 4307444
16569D307444j3071j4507l09902M838k51116L09961q5286m9222l40567j9792j91570
$$ 4307444 4294373 4279866 3969964 3974802 3723686 4033647 3948361 3899139 3558572 3538780 3347210
16558C347210O31734n87438L82949m13867K70095k57831J65616j38126o1674n4387
$$ 3347210 3978944 3391506 3774455 3360588 3630683 3372852 3538468 3400342 3338668 3284281
16548C284281k69856L3905k43868r15L02687q4680l16388L58927k29492j4565
$$ 3284281 3014425 3048330 2804462 2803547 3106234 3021554 2705166 3064093 2834601 2820036
16538B820036P5818M7770l83044J69203j11458K01362j93998K01228l41475L8889
$$ 2820036 2895854 2943624 2560580 2729783 2618325 2819687 2625689 2826917 2485442 2524331
16528B524331K71438J7538k83811j70655K6314K73738l3835K7395k07822k62265
$$ 2524331 2795769 2813307 2529496 2358841 2385155 2658893 2625058 2652453 2444631 2182366
16518B182366R0037K66078m10047K85219R3565j91844j86560j5890j66797N74102
$$ 2182366 2272403 2538481 2128434 2413653 2507218 2315374 2128814 2112924 1946127 2520229
16508B520229k90191j81156K25709l21109N2332L81723m33672K37674m04440J28860
$$ 2520229 2230038 2048882 2274591 1953482 2005814 2387537 1953865 2191539 1787099 1915959
16498A915959L2803j40478L43321j07230N5927j75087m02837M7893J65686L32885
$$ 1915959 1948762 1808284 2151605 2044375 2100302 1925215 1522378 1570271 1735957 2068842
16488B068842k82182j2732m4434J84064n1073j89820M3471P1201o7433j65354
$$ 2068842 1786660 1773928 1729494 1913558 1862485 1672665 1716136 1787337 1719904 1554550
16478A554550L23852k62007j62160N0014N1230L92458m67309j38519O24557m81204
$$ 1554550 1878402 1616395 1454235 1504249 1555479 1947937 1480628 1342109 1966666 1485462
16468A485462J48417l15808Q5857J67182j32703Q8297J56428k97640N5891j37300
$$ 1485462 1633879 1318071 1403928 1571110 1438407 1526704 1683132 1385492 1441383 1304083
16458A304083j51196R2584k6817K28280k46640K24474K110j73098L17274o3591
$$ 1304083 1152887 1245471 1218654 1446934 1200294 1424768 1426878 1253780 1571054 1507463
16448A507463n28603L39437J27945k06903k05241J13621K30200m9864r7029l41468
$$ 1507463 978860 1318297 1446242 1239339 1034098 1147719 1377919 1328055 1231026 889558
16438H89558N24021k80312O6432l04270N09490r0585n89217M06208J67616m64885
$$ 889558 1413579 1133267 1199699 895429 1404919 1314334 725117 1131325 1298941 834056
16428H34056K12894M1460J05476q1062k3222j35557J51952J87312p5084q6762
$$ 834056 1046950 1088410 1193886 1112824 1089602 954045 1105997 1293309 1218225 1131463
16418A131463j62433m1837j25137K26490M4884l21389o1590K16209J07570J00247
$$ 1131463 969030 927193 802056 1028546 1073430 752041 690451 906660 1014230 1114477
16408A114477n6314k4209j02294M9726K69933k46085L0414l4218j22129J27720
$$ 1114477 1058163 1033954 931660 981386 1251319 1005234 1035648 1001430 879301 1007021
16398A007021k90590L44047j59040l74388N18073k44346j54485J80616O7240n455
$$ 1007021 716431 1060478 901438 527050 1045123 800777 646292 826908 894148 888693
16388H88693k10117J9048M09177l64616P7843J31465k68948R0819k98089M19886
$$ 888693 678576 697624 1106801 742185 820028 951493 682545 773364 475275 895161
16378H95161l2377n9880J60588j44517j49909M5380k22635K11429J02766L8210
$$ 895161 862784 802904 963492 818975 669066 714446 491811 703240 806006 844216
16368H44216m1165j29190J32355j64921K2919k92217N35861k34461K42160M2545
$$ 844216 803051 673861 806216 641295 664214 371997 907858 673397 915557 958102
16358I58102Q9467k04378k09752K2825n419j09528k40478L54568m4282L10600
$$ 958102 1047569 843191 633439 656264 650845 541317 300839 655407 611125 921725
16348I21725j81039j55468o1288L2778L5874k65423K27311k50544L29263n6472
$$ 921725 740686 585218 523930 556708 592582 327159 554470 303926 633189 576717
16338E76717K89654p5021N9960k29405M8129O6009j38451J69821M6979j34094
$$ 576717 866371 791350 851310 621905 670034 736043 597592 767413 814392 680298
16328F80298P2026l21267r1157M11138j60487j74885N02859l48659k10726K67640
$$ 680298 752324 431057 339900 751038 590551 415666 918525 569866 359140 626780
16318F26780k28798Q0176K80749l4257o4660o638j67214Q4610o4735J29627K3525
$$ 626780 397982 478158 758907 724650 659990 653352 486138 570748 506013 635640 659165
16307F59165k02981K31177j68316m5211K4558k6790j45897n9424J28396K49632
$$ 659165 456184 687361 519045 473834 498392 471602 325705 266281 394677 644309
16297F44309J723l04744K94558q9872n2186M42295h5626F41252O2556C29376M0555
$$ 644309 646032 341288 635846 545974 493788 936083 -85626 641252 703808 329376 369931
16286C69931J63700M5163k68943Q4413K39533K76755C48099n6932L6735J57869
$$ 369931 533631 578794 309851 394264 633797 910552 348099 291167 327902 485771
16276D85771P0775j36993j22932J3804k5718K23945F6525K23591J36319Q9650
$$ 485771 556546 419553 296621 310425 284707 508652 66525 290116 426435 516085
16266E16085j21543K31566B46371j7049K29545M6826j61178j45066J74989j8810
$$ 516085 394542 626108 246371 229322 458867 505693 344515 199449 374438 355628
16256C55628J33011J23277j14391K03916j27517B77770J40082J68818J77988B33653
$$ 355628 488639 611916 497525 701441 573924 277770 417852 586670 764658 233653
16245D26468A07162K24048q7215N0687p5416J20667G7732M56010p4766j6691B09641
$$ 426468 107162 331210 243995 294682 219266 339933 77732 533742 458976 442285 209641
16233C12720J44097j99358J49994j25619q9665M6349K94743j61091j3074A17900
$$ 312720 456817 257459 407453 281834 192169 238518 533261 372170 359096 117900
16222C52968P0540K72507n0553A69513K61950A55635k6552m3519L12177r3385
$$ 352968 423508 696015 645462 169513 431463 155635 129083 85564 397741 304356
16212C04356I7539O7082i7702C37726A28963K85536j52517O3542J60057k25106
$$ 304356 97539 164621 -97702 337726 128963 414499 261982 325524 485581 260475
16202B60475j06792L40416Q7341k73258A38284K63477B8123P14152A31296P0980
$$ 260475 153683 494099 581440 308182 138284 401761 28123 742275 131296 202276
16192B02276J5905O9795k5550q433J81951L5564H9684M96686l6937B29130j04644
$$ 202276 218181 287976 262426 253993 435944 471508 89684 586370 549433 229130 124486
16181A24486c0517a3199E16011H5398L11030H9549j326J58693r209m7097M34391
$$ 124486 -30517 -13199 516011 85398 396428 89549 88223 246916 237707 190610 625001
16170F25001A28936L32826A71662J02707B0230K93488J8960A65963E9275L26087
$$ 625001 128936 461762 171662 274369 20230 313718 332678 165963 59275 385362
16160C85362j24532D8628d4719C12944q7856q7708f8579A11174J47927q2070K35131
$$ 385362 260830 48628 -44719 312944 225088 137380 -68579 111174 259101 177031 412162
16149D12162l7052a8977B94755K6964a63787B02734P8248R329J47559I6770P0996
$$ 412162 375110 -18977 294755 321719 -163787 202734 280982 290311 437870 96770 167766
16138A67766D8372K23213j02672L9280h57B93912j8468A12499J21450I2311L18390
$$ 167766 48372 271585 168913 208193 -857 293912 275444 112499 233949 92311 410701
16127D10701o7865D5013J62189M9854n948q8286a31010A59475F9725J48871J13101
$$ 410701 342836 45013 207202 257056 251108 162822 -131010 159475 69725 218596 331697
16116C31697a78049B38468q8436a15698C29814F4783K83445h4981C47301d0959
$$ 331697 -178049 238468 150032 -115698 329814 64783 348228 -84981 347301 -40959
16105D99952A83860j9468L5761r7058N3487N2264P1896g5115E2230K85148A46705
$$ 499952 183860 164392 200153 103095 156582 208846 280742 -75115 52230 337378 146705
16093B25982A07268C2803c0025p7746C38791k4123A8275h1984A69699D7236c09278
$$ 225982 107268 32803 -30025 -107771 338791 314668 18275 -81984 169699 47236 -309278
16081A1416K10930B1654M67772k29544J67676A30244Q1222m4924J3015n1256a65138
$$ 11416 222346 21654 489426 259882 427558 130244 211466 166542 179557 128301 -165138
16069C2435N38397I3831M5242K998B6773K2997a18973A82174O411L9116J62556
$$ 32435 570832 93831 139073 142071 26773 49770 -118973 182174 188585 227701 390257
16058C90257A25351J9222L14882i5646B3758M5419J1350e1279j6224A99035a18238
$$ 390257 125351 144573 459455 -95646 23758 69177 80527 -51279 -67503 199035 -118238
16046i7899D0836N2080R007K2056F1838L52236a1552C79945b25395i2160n5411
$$ -97899 40836 92916 101923 123979 61838 414074 -11552 379945 -225395 -92160 -147571
16035a47571c5347p0235D5763J27582o8106i9776A09199a04996p1498C20325a83282
$$ -147571 -35347 -105582 45763 173345 105239 -99776 109199 -104996 -176494 320325 -183282
16023e03999B98783b6536j76129a5277A67887a49398B9678M2916O6685P8451Q394
$$ -503999 298783 -26536 -202665 -15277 167887 -149398 29678 72594 139279 217730 226124
16012B26124a31149A96049J77383B450P4442L18735E5908J30425r2049K15541
$$ 226124 -131149 196049 373432 2450 76892 395627 55908 186333 94284 309825
16002C09825e1235b2522C01878D1948J68774B9327d8407j17164h0728A36885F5017
$$ 309825 -51235 -22522 301878 41948 210722 29327 -48407 -165571 -80728 136885 65017
15990A17248a25071C20279J34764q3392K16443M12128L51818l96299K38654j31450
$$ 117248 -125071 320279 455043 371651 588094 1000222 1352040 955741 1194395 1062945
15980A062945n28939R700G519M19274B3345J50914R2518j25376K29322f3494A02898
$$ 1062945 534006 543706 7519 426793 23345 174259 266777 141401 370723 -63494 102898
15968f3813D33877A48073M2521O5061f2152J6988A62369J69064a77898N6311j68838
$$ -63813 433877 148073 190594 255655 -62152 -45164 162369 331433 -177898 -121587 -290425
15957b90425a21402j99387D57444d6730A58430K47869a28450j72656A83308C0557
$$ -290425 -121402 -320789 457444 -46730 158430 406299 -128450 -301106 183308 30557
15946a00673A96570D9605R1409A5350b8155k5250m4134N049A84541E3367b05498
$$ -100673 196570 49605 141014 15350 -28155 -53405 -97539 -92490 184541 53367 -205498
15934D01197a8150k40572A50078L1630m7605a27040C5605c4608A03595a75414
$$ 401197 -18150 -258722 150078 181708 134103 -127040 35605 -34608 103595 -175414
15923d9325A4246J7375b03880N2319B63752f9095D5547a25957a6661B6928a05920
$$ -49325 14246 31621 -203880 -151561 263752 -69095 45547 -125957 -16661 26928 -105920
15911c503p0873D6585L06H963g2844p4849A04435a9084k74573a20221j15880Q808
$$ -3503 -74376 46585 46891 8963 -72844 -147693 104435 -19084 -293657 -120221 -236101 -227293
15899b27293f7162A73224h7986A75243J18849A01995a09734j3508I1274k3991
$$ -227293 -67162 173224 -87986 175243 294092 101995 -109734 -123242 91274 67283
15889F7283i6677B7809L30221D0113O2600d3141l0424q9243F8665a30553b7837
$$ 67283 -96677 27809 358030 40113 102713 -43141 -73565 -162808 68665 -130553 -27837
15877B44120A14916A0335b21544A91777b17142A60609p9215a35279B0892a12988
$$ 244120 114916 10335 -221544 191777 -217142 160609 81394 -135279 20892 -112988
15866A96991a40626H8888j1021L4741C3749a75645C05993G0473h8988A91667b49919
$$ 196991 -140626 88888 77867 112608 33749 -175645 305993 70473 -88988 191667 -249919
15854a2453A07751a20701E7368N8155Q7472H3292J62757b40720F5688Q4197A8321
$$ -12453 107751 -120701 57368 115523 202995 83292 246049 -240720 65688 149885 18321
15842C02594a70932j45268D3863j460L80039i7819m7547C9621a63848A63756a17495
$$ 302594 -170932 -316200 43863 42403 422442 -97819 -145366 39621 -163848 163756 -117495
15830a7112A27502N3592d36049a76887J9480M7446B90426a11707E414K11470a53188
$$ -17112 127502 181094 -436049 -176887 -157407 -109961 290426 -111707 5414 216884 -153188
15818d3365j31220e7042j08015b3022j5432l848A58188a69743f9419A60521a98902
$$ -43365 -174585 -57042 -165057 -23022 -38454 -42302 158188 -169743 -69419 160521 -198902
15806a63654r0661A25942b79062i1189A45516a56009L5424G6641a04172k1899
$$ -163654 -254315 125942 -279062 -91189 145516 -156009 -120585 76641 -104172 -126071
15796a26071B18211b9913B33840C017b36438A4776i3911A60161Q600g100B44305
$$ -126071 218211 -29913 233840 3017 -236438 14776 -93911 160161 168761 -7100 244305
15784H4509a51777B64654e8943C7850a52386D2287c44666A01946a08483p3229
$$ 84509 -151777 264654 -58943 37850 -152386 42287 -344666 101946 -108483 -181712
15774a81712A13644a52801p3597n2333h6973j65133B29131f7074A62029h1427
$$ -181712 113644 -152801 -226398 -278731 -86973 -252106 229131 -67074 162029 -81427
15763A49180A102K45461a59627A34520e0417I5824a81050A37033N3730M3490O3869
$$ 149180 1102 246563 -159627 134520 -50417 95824 -181050 137033 190763 234253 298122
15752B98122B9566a53120K8858J1674A54806a48947j45757D7200k665L8454c07835
$$ 298122 29566 -153120 -124262 -112588 154806 -148947 -294704 47200 44535 82989 -307835
15740B19502D4099J43558f9902C46175a92721p3457E8831K79456j42953h8212
$$ 219502 44099 187657 -69902 346175 -192721 -266178 58831 338287 195334 -88212
15729d73045A67768e0583A38543a45184f3695k73016a9923n1638B46352b18375
$$ -473045 167768 -50583 138543 -145184 -63695 -336711 -19923 -71561 246352 -218375
15718g8826k5609A17444b65339h5464q846l08909D9781K0038N9472B7020L933
$$ -78826 -104435 117444 -265339 -85464 -94310 -403219 49781 69819 129291 27020 30953
15707C0953L2896a96164r4797A20500Q00i0959D02679o737g6230m4890c0431A40896
$$ 30953 63849 -196164 -290961 120500 121300 -90959 402679 395942 -76230 -121120 -30431 140896
15694H6695b64096B7077M0260J00524l075O8319c9884A93121B0916K8283K49538
$$ 86695 -264096 27077 67337 167861 164786 233105 -39884 193121 20916 49199 298737
15683B98737D9858K95660a34837D4116K10635C4668R0713a22009E0057b36058
$$ 298737 49858 345518 -134837 44116 254751 34668 125381 -122009 50057 -236058
15672i045k11771L1034g6450C085K8111b07392A10084k2594g480A25507a79282
$$ -9045 -220816 -189782 -76450 3085 31196 -207392 110084 87490 -7480 125507 -179282
15660a34607G8528b6738o729A17842a6197A50748i6847c7828q8949G0159A999
$$ -134607 78528 -26738 -33467 117842 -16197 150748 -96847 -37828 -126777 70159 1999
15648C12043F562f3031B90766B7255a14110G5069f6547k03175A51989l706P7218
$$ 312043 6562 -63031 290766 27255 -114110 75069 -66547 -269722 151989 148283 225501
15637B25501i798m0052n2706K2580J6448G5871c71903c8687q9166H7842a5585
$$ 225501 -9798 -49850 -102556 -79976 -63528 75871 -371903 -38687 -127853 87842 -15585
15625a83682q2533K1311A20354R2723e8134B844K27046b6509B85881a81052A02761
$$ -183682 -266215 -244904 120354 213077 -58134 2844 229890 -26509 285881 -181052 102761
15613B5807f514B55156j10187O5315h0755L8771A14854J12639K5380a09858m9690
$$ 25807 -6514 255156 144969 210284 -80755 -41984 114854 227493 252873 -109858 -159548
15602a59548j01800r900C37056b99557a38453a6541m8965k3500D9157L7081a57643
$$ -159548 -261348 -271248 337056 -299557 -138453 -16541 -65506 -89006 49157 86238 -157643
15590A58508c33961Q5640A69412d000A93755b32883D5993b37890B29514a27713
$$ 158508 -333961 -248321 169412 -4000 193755 -232883 45993 -237890 229514 -127713
15579b8214q2244i652j90400f2138B90056c19398a04305j3237D4194K13279b67049
$$ -28214 -110458 -9652 -200052 -62138 290056 -319398 -104305 -117542 44194 257473 -267049
15567A07584K53800A9128a57566K4463A77889a74606h6131h897I906Q5256c9691
$$ 107584 361384 19128 -157566 -133103 177889 -174606 -86131 -8897 9906 95162 -39691
15555A37772J26196H8585C742a91425e1150q9868B13503a13017C4992j2224K14972
$$ 137772 263968 88585 3742 -191425 -51150 -141018 213503 -113017 34992 22768 237740
15544B37740G7577h9705A1982K82618c2723A28243N49b31539A36804Q8139A04950
$$ 237740 77577 -89705 11982 294600 -32723 128243 128792 -231539 136804 224943 104950
15532A78508O2037l2353B3105b52638h2811G5715e7355P277D8128a30632b6340
$$ 178508 240545 208192 23105 -252638 -82811 75715 -57355 -50078 48128 -130632 -26340
15520A89365C8392g0850A7844K9966J326K16775G8408J9390A9616L46818A65585
$$ 189365 38392 -70850 17844 47810 49136 265911 78408 97798 19616 366434 165585
15508A62175m6348m0209d8103A73601d8926B03282r2431L26056F7030J81121i7136
$$ 162175 115827 75618 -48103 173601 -48926 203282 110851 436907 67030 248151 -97136
15496a49412D21684k895E049L45168r5591L3816g4679C1546J58715a26871B04154
$$ -149412 421684 418789 5049 350217 254626 288442 -74679 31546 190261 -126871 204154
15484I1848M7011J78305i006F08541A21698L24195a42244D29516j05438J2054
$$ 91848 138859 317164 -9006 608541 121698 445893 -142244 429516 324078 336132
15474C36132K55231k2733J62181l60399L2509f6213C54777D8447d21817A16947
$$ 336132 591363 568630 730811 370412 402921 -66213 354777 48447 -421817 116947
15463B66529b01450b0711j96526J07035n6674e1994j27343A15310e7602c661A42372
$$ 266529 -201450 -20711 -217237 -110202 -166876 -51994 -179337 115310 -57602 -3661 142372
15451F8653J03311c7176B21625F2545N4415a95863A31417L89064j14395P6237
$$ 68653 171964 -37176 221625 62545 116960 -195863 131417 520481 406086 482323
15441D82323L67602P59854m80623m98249B80833N7672A5999K7885P3043a94216
$$ 482323 849925 1609779 1129156 630907 280833 338505 15999 43884 116927 -194216
15430c175p201k29693b1843C47661c7748G1322a94335i5586A35674q975a04309
$$ -3175 -10376 -240069 -21843 347661 -37748 71322 -194335 -95586 135674 126699 -104309
15418A22442Q3107D7200J01486a3396F242L11384B5790b76245Q9660A33757J14786
$$ 122442 205549 47200 148686 -13396 6242 317626 25790 -276245 -186585 133757 248543
15407B48543b2415q7306A14201a12366j51213A86207b6817E0033A7441K00170
$$ 248543 -22415 -109721 114201 -112366 -263579 186207 -26817 50033 17441 217611
15397B17611d7963I4228L1801b6026j44730B47668L8458N8344E2021J23908b67759
$$ 217611 -47963 94228 126029 -26026 -170756 247668 286126 344470 52021 175929 -267759
15385A52189a49957j36331h047H2294L4345b06705a8059C98495A95672b10260
$$ 152189 -149957 -286288 -8047 82294 116639 -206705 -18059 398495 195672 -210260
15374A20356K40960d4948B29980K44454m7830g4497D5849M9868N4858m2469Q9920
$$ 120356 361316 -44948 229980 474434 426604 -74497 45849 95717 150575 108106 198026
15363A98026K21816A14076M77945B21729H4636k4187K53247A45568K95542L3186
$$ 198026 419842 114076 592021 221729 84636 60449 313696 145568 441110 474296
15353D74296a58759D42530r857j58808G4337L6082J30016b90818E24030A02466
$$ 474296 -158759 442530 432673 273865 74337 110419 240435 -290818 524030 102466
15342a78846C41597K21360r5875q9762K32526A59324C4929K05219A07446R3343
$$ -178846 341597 562957 467082 377320 609846 159324 34929 240148 107446 200789
15332B00789a89378B90613Q1335a12968B8737K44273J46981j52553G0672M2743
$$ 200789 -189378 290613 371948 -112968 28737 273010 419991 267438 70672 113415
15322A13415K7222F7425M64087A25080d3213j5046m5797A60769G5709B3978K2173
$$ 113415 140637 67425 531512 125080 -43213 -58259 -104056 160769 75709 23978 46151
15311D6151L35833A83936o4122j4197L62380G2079J13692a977j05740e1864B47560
$$ 46151 381984 183936 119814 105617 467997 72079 185771 -1977 -107717 -51864 247560
15299I6197d4860J3700n1336I7014a3220E11501a23356C3544c84852H624R6076
$$ 96197 -44860 -31160 -82496 97014 -13220 511501 -123356 33544 -384852 8624 104700
15288A04700K59190h109j98066G0384a34046B64512J12216A0344C025i8825C33119
$$ 104700 363890 -8109 -206175 70384 -134046 264512 376728 10344 3025 -98825 333119
15276I1678c29552e898A29330d0984a9705A57273a38774A51587N4004b8863m6198
$$ 91678 -329552 -5898 129330 -40984 -19705 157273 -138774 151587 205591 -28863 -75061
15265g5061A49021a7668n5403J1435I5883m662n33L5624N0834J35404i1266A53229
$$ -75061 149021 -17668 -73071 -61636 95883 91221 90688 126312 177146 312550 -91266 153229
15252a28036A12519c8283C67668C1514J10604A5998L24911A40752j838J61046
$$ -128036 112519 -38283 367668 31514 142118 15998 340909 140752 138914 299960
15242B99960L15075J56749R86585r7451L282m55840D30749j85208a55812B6991
$$ 299960 615035 771784 1758369 1660918 1664200 1208360 430749 245541 -155812 26991
15231d2614m4401p4239C52283a78415I1836L12302F2466d6586R78j12282M0938
$$ -42614 -87015 -161254 352283 -178415 91836 404138 62466 -46586 -45608 -157890 -116952
15220a16952H5022k8706B6236K71607A23571g1436q7706k0062A49669D5498L27839
$$ -116952 85022 56316 26236 297843 123571 -71436 -159142 -179204 149669 45498 373337
15209C73337A67614h2198A95083q3893b04439C2009e7463D775N5822J43816J2406
$$ 373337 167614 -82198 195083 111190 -204439 32009 -57463 4775 60597 204413 216819
15198B16819c11116A23833m5139F562K2888M2536c18236B35266e1542c371A58521
$$ 216819 -311116 123833 78694 6562 29450 71986 -318236 235266 -51542 -3371 158521
15186D9556J91893J66058j73929a10181M0123F2712M88685A24883k0871J41210
$$ 49556 241449 407507 233578 -110181 -70058 62712 551397 124883 104012 245222
15176B45222J28085g0699L3058G352K05737O9691a77326A73878H510O5727K7713
$$ 245222 373307 -70699 -37641 7352 213089 282780 -177326 173878 8510 74237 101950
15165A01950K49152a00646l3999c3612A79054B8756b7309A40016m7103L58341
$$ 101950 351102 -100646 -134645 -33612 179054 28756 -27309 140016 92913 451254
15155D51254A87056O93b87462A69979a21151E7990L4797J8226m3857g0009D14964
$$ 451254 187056 187749 -287462 169979 -121151 57990 92787 111013 67156 -70009 414964
15143c69780C35521b6058D41257A30510k6438a3433H2227e8563G8307l7575J84032
$$ -369780 335521 -26058 441257 130510 104072 -13433 82227 -58563 78307 40732 224764
15132B24764n3898J54393b23012F1595K08509F5232L71864j72952q7138J30988
$$ 224764 170866 325259 -223012 61595 270104 65232 437096 264144 177006 307994
15122C07994C2263M03465J17923J04613k30654J98891B41929C3562K46731r1597
$$ 307994 32263 435728 553651 658264 427610 626501 241929 33562 280293 188696
15112A88696n2696J99381H9255a26668b371H869J71518i191m622p2330C10670
$$ 188696 136000 335381 89255 -126668 -2371 8869 180387 -9191 -13813 -86143 310670
15100A15177l3992Q6181l4693E6059J11467a70800B95481j40622R3077g5844c865
$$ 115177 81185 167366 132673 56059 167526 -170800 295481 154859 247936 -75844 -3865
15088D62370B7028J74972c2018B59841N286b01259a3447C8447L9104b5442j09872
$$ 462370 27028 202000 -32018 259841 265127 -201259 -13447 38447 77551 -25442 -135314
15077a35314F9661d3219D25380A07516m3287K58935A16457K19826a19310B07657
$$ -135314 69661 -43219 425380 107516 64229 323164 116457 336283 -119310 207657
15066B58502Q9884A49889p0784B5323J61757H493N4161J99473Q3730J21467A58586
$$ 258502 348386 149889 79105 25323 187080 8493 62654 262127 345857 467324 158586
15054A30542J39431J18003M4808r3228L0964J54820K85843B26712J52491A49383
$$ 130542 269973 387976 432784 339556 370520 525340 811183 226712 379203 149383
15043A35121L919R2581E2176h1651B93603K33147k32592l9537L24371k33604L373
$$ 135121 139040 231621 52176 -81651 293603 526750 294158 254621 578992 345388 348761
15032C48761M20106j48273K11148J66866j23979j78645C12971J09246Q3498j09115
$$ 348761 768867 620594 831742 998608 874629 695984 312971 422217 505715 396600
15022C96600R6990L38956J30396l64092k67918J19827L12636C52962J29102n8845
$$ 396600 493590 832546 962942 598850 330932 450759 763395 352962 482064 423219
15012D23219R9092j85891J00477n8944Q6604j87125K22438A01737L0406L74468
$$ 423219 522311 336420 436897 377953 464557 277432 499870 101737 132143 506611
15002E06611b1829F57622k39407N1633J45345o7244l5358B33068R551M4098P2887
$$ 506611 -21829 657622 418215 469848 615193 547949 512591 233068 242619 286717 359604
14991C59604K53716J41044M9149l00374Q6108o08k392J58243k10414L50867N26917
$$ 359604 613320 754364 803513 503139 589247 588639 586247 744490 534076 884943 1411860
14980A411860l56545j911l14281O9477j47121k49343r8957M63383k1965R6713
$$ 1411860 1055315 1053404 739123 808600 661479 412136 313179 776562 754597 851310
14970H51310A42620K32889j68898L84454A46655c7741I30319C10999L9414J31339
$$ 851310 142620 375509 206611 591065 146655 -37741 930319 310999 350413 481752
14960D81752j65275j53260K87815J990A34925R9235N35269k20460k02714M7940
$$ 481752 316477 163217 451032 453022 134925 234160 769429 548969 346255 394195
14950C94195q8330Q1988O2879K23665j79578j21681K30197J95520k60513p683
$$ 394195 305865 387853 450732 674397 494819 373138 603335 798855 538342 530659
14940E30659j61072K79389m1840k9878J11245L73065k87114m1613j7449K29685
$$ 530659 369587 648976 607136 577258 688503 1061568 774454 732841 715392 945077
14930I45077L08967l81059M21991N0681P11546l21735R4388J87619l99480L7990
$$ 945077 1254044 872985 1294976 1345657 2057203 1735468 1829856 2017475 1617995 1655985
14920A655985j5409K26719J71289P48464j65328k91775n69460j64433j70513m45270
$$ 1655985 1640576 1867295 2038584 2787048 2621720 2329945 1760485 1596052 1425539 980269
14910I80269O0881j23951k62121j0031K7020K43223B51112L70919K0903j78426
$$ 980269 1041150 917199 655078 645047 672067 915290 251112 622031 642934 464508
14900D64508N0188J7165j33148j47870I3091N34310j37479o5759A5640M24345
$$ 464508 514696 531861 398713 250843 93091 627401 489922 424163 15640 439985
14890D39985J05236j43932M18095n2526J5536N33544k94383O8884j10544J67715
$$ 439985 545221 401289 819384 766858 782394 1315938 1021555 1090439 979895 1147610
14880A147610j33142q7308j38390n8334M1355k46852k49850J43961r990L12613
$$ 1147610 1014468 927160 788770 730436 771791 524939 275089 419050 409060 721673
14870G21673l1655k69605J67194M6229J46284l8908J61654k19037m8661B51036
$$ 721673 690018 420413 587607 633836 780120 741212 902866 683829 635168 251036
14859E23294I1057N65588k43409j37531M8170r061J97564J99861P8976k44839
$$ 523294 91057 656645 413236 275705 323875 314814 512378 712239 791215 546376
14849E46376k04160M2678O5600M70113P2600J43740j56865K05248o0988j01846
$$ 546376 342216 384894 450494 920607 993207 1136947 980082 1185330 1124342 1022496
14839A022496o376j45137N1248K26663l13324k15191r138j31089O2404N8633M09968
$$ 1022496 1016120 870983 922231 1148894 835570 620379 611241 480152 542556 601189 1011157
14828A011157D35652r112J40527J26997j02292L04536q3134l59865M17058J39398
$$ 1011157 435652 426540 567067 694064 591772 896308 813174 453309 870367 1009765
14818A009765q5288j61960L98875E71638p3931K06271o1023J15876q6759L46872
$$ 1009765 924477 762517 1161392 571638 497707 703978 642955 758831 672072 1018944
14808A018944l58901N53880l29594O36833m52663Q2910m09134j13701J97630k04814
$$ 1018944 660043 1213923 884329 1521162 1068499 1151409 742275 628574 826204 621390
14798F21390J19611k70613M521M47943D03808M1231M9329J16273j9674k85048
$$ 621390 741001 470388 474909 922852 403808 445039 494368 610641 590967 305919
14788C05919L48871Q3728k73964k10692M51426j70366L09337j4847k08409K69513
$$ 305919 654790 738518 464554 253862 705288 534922 844259 829412 621003 890516
14778H90516J43208O1551p1647l7817j25878j31818J21902Q8467l21366P6112
$$ 890516 1033724 1095275 1023628 985811 859933 728115 850017 938484 617118 693230
14768F93230j24952j22238J45557J39218J24283j73051k52489L11898j61759j85416
$$ 693230 568278 446040 591597 730815 855098 682047 429558 741456 579697 394281
14758C94281K40527L37590m71531K2429j11180N70574l83266J2329J96619p3707
$$ 394281 634808 972398 500867 523296 412116 982690 599424 611753 808372 734665
14748G34665K45255k32634k2020J50627k43385M12639j76672D02782M75800k10241
$$ 734665 979920 747286 725266 875893 632508 1045147 868475 402782 878582 668341
14738F68341p5316J17091J75957k01102K28476m2466P9803L06077J82139K97943
$$ 668341 593025 710116 886073 684971 913447 870981 950784 1256861 1439000 1736943
14728A736943L97902k62058j8315l68271L7136m79702j43072j592O246j127k47420
$$ 1736943 2134845 1872787 1854472 1486201 1523337 1043635 900563 898971 905217 904090 656670
14717F56670K85860j61654L23868J1022k12131R493o8452J03264J789R7199L78036
$$ 656670 942530 780876 1104744 1115766 903635 913128 844676 947940 949729 1046928 1424964
14706A424964l46663L99007r1943L25837O29445O2113j60415n14461k48807k82210
$$ 1424964 1078301 1477308 1385365 1711202 2340647 2402760 2242345 1727884 1479077 1196867
14696A196867l38453L68986j56952k89533O7999K26626K94118o37916K08303l02388
$$ 1196867 858414 1227400 1070448 780915 848914 1075540 1369658 731742 940045 637657
14686F37657M06757K13772m38416J40724K65417l59721o8503K27913m7137n9305
$$ 637657 1044414 1258186 819770 960494 1225911 866190 797687 1025600 978463 919158
14676I19158j86561M64661k93723Q6607l833K02210j04700l01730L75088j59534
$$ 919158 732597 1197258 903535 990142 986309 1188519 1083819 782089 1157177 997643
14666I97643J46461m2919o0815j1613J67991j46867J93873R8207l51151J71234
$$ 997643 1144104 1101185 1040370 1028757 1196748 1049881 1243754 1341961 990810 1162044
14656A162044P2214Q4116j65562J40994M06033j05727k88721r7028j15808O7137
$$ 1162044 1234258 1318374 1152812 1293806 1699839 1594112 1305391 1208363 1092555 1159692
14646A159692J02357O2566L8262l04734k47510K18324L5284j37694M91580k94290
$$ 1159692 1262049 1324615 1362877 1058143 810633 1028957 1064241 926547 1418127 1123837
14636A123837L15797r3455l5751N4031k47045q7697J32803L18244j55549Q688
$$ 1123837 1439634 1346179 1310428 1364459 1117414 1029717 1162520 1480764 1325215 1333903
14626A333903j14433K37007j63460J55681j50912J10545l9048Q7618J4061k59622
$$ 1333903 1219470 1456477 1293017 1448698 1297786 1408331 1369283 1456901 1470962 1211340
14616A211340L1897R2945N46067l77460j39859J2563Q892K72410l86348k3824
$$ 1211340 1243237 1336182 1882249 1504789 1364930 1377493 1386385 1658795 1272447 1248623
14606A248623N03076j63027J24113l11345N12499L1209j83426j81604J51095j19600
$$ 1248623 1751699 1588672 1712785 1401440 1913939 1945148 1761722 1580118 1731213 1611613
14596A611613j51824j8414L57689j70954M96680m47091J7798p7896J40369J31497
$$ 1611613 1459789 1441375 1799064 1628110 2124790 1677699 1695497 1617601 1757970 1889467
14586A889467L7969l36065K94586m03485J62547K61638J93084k51480L8785P5948
$$ 1889467 1927436 1591371 1885957 1482472 1645019 1906657 2099741 1848261 1887046 1962994
14576A962994m0967j797Q6659k08476K28095j23658L17701K59879j25809p7915
$$ 1962994 1922027 1920230 2006889 1798413 2026508 1902850 2220551 2480430 2354621 2276706
14566B276706L46926k65080J54621j43840J3938J86950M24871m23652K24285Q8044
$$ 2276706 2623632 2358552 2513173 2369333 2383271 2570221 2995092 2571440 2795725 2883769
14556B883769K32673J55566N4843L03511J40348N93625R84913J330937L039156
$$ 2883769 3116442 3272008 3326851 3630362 3770710 4364335 5349248 6680185 9719341
14547I719341Q837017J9953571R908856k3306258I927963D831018j141660o11879
$$ 9719341 18556358 38509929 48418785 25112527 9927963 4831018 3689358 3077479
14539C077479m97556Q4488J199033J689248k064485j012067k89722o5971j1882
$$ 3077479 2579923 2664411 3863444 5552692 3488207 2476140 2186418 2120447 2108565
14530B108565k88234N06815J20223m27249L00843J3678j95964J56056K00914k25956
$$ 2108565 1820331 2327146 2447369 2020120 2320963 2334641 2138677 2294733 2495647 2269691
14520B269691M91592J35505l87923K25876q5561J7636o6734R4802M2639K2386
$$ 2269691 2761283 2896788 2508865 2734741 2649180 2666816 2600082 2694884 2737523 2759909
14510B759909N2718P3619p6368J06546k96506L04340K35633J312j69617L35867
$$ 2759909 2812627 2886246 2809878 2916424 2619918 2924258 3159891 3161203 2991586 3327453
14500C327453j28849p0141k0059L48582l22221P9856K3777J57027K72129j09075
$$ 3327453 3198604 3128463 3108404 3456986 3134765 3214621 3238398 3395425 3667554 3558479
14490C558479j56995j19573J69918J63824k2282R3449l63285N96865J89861j90656
$$ 3558479 3401484 3281911 3451829 3615653 3593371 3686820 3323535 3920400 4110261 3919605
14480C919605j62858M60849k26073k6679K84388m07537K62782r7865K01248o9845
$$ 3919605 3756747 4217596 3991523 3964844 4249232 3841695 4104477 4006612 4207860 4138015
14470D138015K15508K41749o0395j37749K59069j30354N70460l57342l3219l3610
$$ 4138015 4353523 4595272 4534877 4397128 4656197 4525843 5096303 4738961 4705742 4672132
14460D672132M49768n68994M88797K07906j2106k18575M0641P1933J61885O4451
$$ 4672132 5121900 4552906 5041703 5249609 5237503 5018928 5059569 5131502 5293387 5357838
14450E357838L76066k08529n4929M38326Q2745K02428m60684J28092K95660J15
$$ 5357838 5733904 5525375 5470446 5908772 5991517 6193945 5733261 5861353 6157013 6157128
14440F157128k66905K58037K07222P5842m1225J33607N43490j63162J10703K10356
$$ 6157128 5890223 6148260 6355482 6431324 6390099 6523706 7067196 6904034 7014737 7225093
14430G225093K06880n7306n1669K46110K08638J70526j12q6473M5299R61779l26026
$$ 7225093 7431973 7374667 7322998 7569108 7777746 7948272 7948160 7861687 7906986 8868765 8542739
14419H542739j756J51490K08618J89964J5123J5638n1550J68385J49174J03757
$$ 8542739 8540983 8692473 8901091 9091055 9106178 9121816 9070266 9238651 9387825 9491582
14409I491582R5944M92260j58919M15476N13489k09435k02943O46972o5551J95230
$$ 9491582 9587526 10079786 9920867 10336343 10849832 10640397 10437454 11084426 11018875 11214105
14399A1214105j86921J49188k1612N92745j90832K20020L16126M24395j29736
$$ 11214105 11027184 11176372 11154760 11747505 11556673 11776693 12092819 12517214 12387478
14390A2387478M50170N5996M5199M57232L5529L17458N27810N51036K07700K55688
$$ 12387478 12837648 12893644 12938843 13396075 13431604 13749062 14276872 14827908 15035608 15291296
14380A5291296L70798j92855N05125R2003O46215J20085J42424J67607M47890
$$ 15291296 15662094 15469239 15974364 16066367 16712582 16832667 16975091 17142698 17590588
14371A7590588O83375K79684M27938N53408L50813O35959R2299J61902M92137
$$ 17590588 18273963 18553647 18981585 19534993 19885806 20521765 20614064 20775966 21268103
14362B1268103O50285K14394N99034M46822L17970M03381P68195L74992J007720
$$ 21268103 21918388 22132782 22731816 23178638 23496608 23899989 24668184 25043176 26050896
14353B6050896L31911P64211P88275N57552Q32597P77395O55408J029663N90201
$$ 26050896 26382807 27147018 27935293 28492845 29325442 30102837 30758245 31787908 32378109
14344C2378109J039875O20995R42545R20281J129020R91726J208124R40769Q16071
$$ 32378109 33417984 34038979 34981524 35901805 37030825 38022551 39230675 40171444 40987515
14335D0987515J637574J201921J200475J405927J103363J790658J418737J817293
$$ 40987515 42625089 43827010 45027485 46433412 47536775 49327433 50746170 52563463
14327E2563463J955640J604775J940610K131813K133427K003650K210360K643045
$$ 52563463 54519103 56123878 58064488 60196301 62329728 64333378 66543738 69186783
14319F9186783J981634L059647K273168K977022L217905L039146L676810L549754
$$ 69186783 71168417 74228064 76501232 79478254 82696159 85735305 89412115 92961869
14311I2961869L945619M184653L754271M871245M575964N212640N479298N778148
$$ 92961869 96907488 101092141 104846412 109717657 114293621 119506261 124985559 130763707
14303A30763707O269206O308058O774056P267341P715579Q069512Q845707Q703263
$$ 130763707 137032913 143340971 150115027 157382368 165097947 173167459 182013166 190716429
14295A90716429R977556R968422J1191497J1076698J1950074J2221074J3488864
$$ 190716429 200693985 210662407 221853904 232930602 244880676 257101750 270590614
14288B70590614J3803317J4460830J4570804J5070961J5212186J5443752J5822177
$$ 270590614 284393931 298854761 313425565 328496526 343708712 359152464 374974641
14281C74974641J5413860J5534201J4382233J4053205J2808636J1543376J0051349
$$ 374974641 390388501 405922702 420304935 434358140 447166776 458710152 468761501
14274D68761501P352460N182612J566400k852505n246503j880142o961268n572748
$$ 468761501 476113961 481296573 482862973 480010468 474763965 472883823 465922555 460349807
14266D60349807p362695r579723j2052443j3506803j4724958j5240840j5996393
$$ 460349807 452987112 443407389 431354946 417848143 403123185 387882345 371885952
14259C71885952j6036946j6210664j5756918j5461819j5440669j4527667j3989578
$$ 371885952 355849006 339638342 323881424 308419605 292978936 278451269 264461691
14252B64461691j3174114j2697685j2100855j1257706j0943733q688503r355020
$$ 264461691 251287577 238589892 226489037 215231331 204287598 195599095 186244075
14245A86244075r196707q314890p839190p567993p251496o490249o484294n688312
$$ 186244075 177047368 168732478 160893288 153325295 146073799 139583550 133099256 127410944
14237A27410944n318683n447747m857891m869845m598209l964813l228051m207833
$$ 127410944 122092261 116644514 111786623 106916778 102318569 98353756 95125705 90917872
14229I0917872l428557l631369l246541k891226k875314k654702k491614k434584
$$ 90917872 87489315 83857946 80611405 77720179 74844865 72190163 69698549 67263965
14221F7263965k168876k317843k104514j869729k127820j878355j548525j565535
$$ 67263965 65095089 62777246 60672732 58803003 56675183 54796828 53248303 51682768
14213E1682768j414472j401116j795022j387292j377724j171806m37289j118636
$$ 51682768 50268296 48867180 47072158 45684866 44307142 43135336 42698047 41579411
14205D1579411j414139j467105j134479r78792p28555m27567j221606j239753
$$ 41579411 40165272 38698167 37563688 36584896 35856341 35428774 34207168 32967415
14197C2967415p93565q15661p61712p74466n56785q60600p15855o40806n03070
$$ 32967415 32173850 31358189 30596477 29822011 29265226 28404626 27688771 27047965 26544895
14188B6544895q39883o48467k06045r20193k59763r96214O2077m07745q96029
$$ 26544895 25705012 25056545 24850500 23930307 23670544 22674330 22736407 22328662 21432633
14179B1432633l34982m34393k40381o23379m35493J54342j125117q0188k40694
$$ 21432633 21097651 20663258 20422877 19799498 19364005 19518347 18393230 18313042 18072348
14170A8072348r22789J6049k68619l09806j31863m35021n61275J00454o34231
$$ 18072348 17149559 17165608 16896989 16587183 16455320 16020299 15459024 15559478 14925247
14161A4925247J66620n89661J53670k33875n38148O7121l54289l87398l69252
$$ 14925247 15091867 14502206 14655876 14422001 13883853 13950974 13596685 13209287 12840035
14152A2840035j01793k20866l9125k63046j84286k57926L0266l54894J69409k51629
$$ 12840035 12738242 12517376 12478251 12215205 12030919 11772993 11803259 11448365 11617774 11366145
14142A1366145n96835J37982j62258j72299r0672n27474r915J02517k11160j02602
$$ 11366145 10769310 10907292 10745034 10572735 10482063 9954589 9944674 10047191 9836031 9733429
14132I733429l81128k38826K99019n36250J03004K1953K2028k98029j99600K12525
$$ 9733429 9352301 9113475 9412494 8876244 8979248 9001201 9023229 8725200 8525600 8738125
14122H738125n50313j31112p2939l2799l083m07453L31832l15469j39797q6497
$$ 8738125 8187812 8056700 7983761 7950962 7947879 7540426 7872258 7556789 7416992 7330495
14112G330495P1428j81515j23370k51051J12337K05382l04495N5175m11143R7315
$$ 7330495 7401923 7220408 7097038 6845987 6958324 7163706 6859211 6914386 6503243 6600558
14102F600558k21162J04612L22052l94568P2362n11350k2424j29039k00108N4165
$$ 6600558 6379396 6484008 6806060 6411492 6483854 5972504 5950080 5821041 5620933 5675098
14092E675098k90067L42254m5540r6580l10465J66625M1595k86889k4993O0476
$$ 5675098 5385031 5727285 5681745 5585165 5274700 5441325 5482920 5196031 5171038 5231514
14082E231514j71569l9654j26217L1121M03745j47373m38540K14017l95103m7084
$$ 5231514 5059945 5020291 4894074 4925195 5328940 5181567 4743027 4957044 4561941 4514857
14072D514857L92286n73723L55472l27956p197j08164J48442l2585Q5411J97549
$$ 4514857 4907143 4333420 4688892 4360936 4353739 4245575 4394017 4361432 4446843 4644392
14062D644392r4849J94314k07826j7586l87731j43656L67663k62287k6504j42678
$$ 4644392 4549543 4743857 4536031 4518445 4130714 3987058 4354721 4092434 4065930 3923252
14052C923252Q653m7515k18589J80157r9064M5058l04208J24441m623k3862P881
$$ 3923252 3931905 3884390 3665801 3845958 3746894 3791952 3487744 3612185 3607562 3583700 3591581
14041C591581J61992k96167j99446M18515k58407j30040J9263M434j89561J91697
$$ 3591581 3753573 3457406 3257960 3676475 3418068 3288028 3307291 3311725 3122164 3313861
14031C313861K812j94971K60801l78133q2014L69063l94887J84762k55561K00312
$$ 3313861 3316673 3121702 3382503 3004370 2922356 3291419 2896532 3081294 2825733 3026045
14021C026045o7496k26893l30088L24644k19901J70080K7005J33170l18327j74824
$$ 3026045 2958549 2731656 2401568 2726212 2506311 2676391 2703396 2836566 2518239 2343415
14011B343415N37651j29220k34607j6105m01329M08736r3838J49982k64334j09268
$$ 2343415 2881066 2751846 2517239 2501134 2099805 2508541 2414703 2564685 2300351 2191083
14001B191083O4786N505j18301q6277k140P8141k42713L10837l17008N3442L58623
$$ 2191083 2255869 2261374 2143073 2056796 2054656 2132797 1890084 2200921 1883913 1937355 2295978
13990B295978L94703K87754J601297O197520J7624630K0614847j6120124j5906386
$$ 2295978 2690681 2978435 4579732 10777252 28401882 49016729 32896605 16990219
13982A6990219p607441l152998j119283o06101l97146l30821m28370m55920j54104
$$ 16990219 9382778 6229780 5110497 4504396 4107250 3776429 3348059 2892139 2738035
13973B738035J714L32498k50512J12455k60307m21057k6655L40458m59101J69848
$$ 2738035 2739749 3072247 2821735 2934190 2673883 2252826 2226171 2566629 2107528 2277376
13963B277376k05044K18127K34062j08007j30686l16390N95607l78493J55830
$$ 2277376 2072332 2290459 2524521 2416514 2285828 1969438 2565045 2186552 2342382
13954B342382m12071M06624k71037J17050p024j08288q5748p2052J32160k87150
$$ 2342382 1930311 2336935 2065898 2182948 2175924 2067636 1981888 1909836 2041996 1754846
13944A754846M41570m70055P5434J34758k07734N903N3525q5949J4212L30073
$$ 1754846 2196416 1726361 1801795 1936553 1728819 1734722 1788247 1702298 1716510 2046583
13934B046583k25631J60941n4644l67653M03299m43831L48147k74092J11541P7484
$$ 2046583 1820952 1981893 1927249 1559596 1962895 1519064 1867211 1593119 1704660 1782144
13924A782144K8431q875P2037j68734q5316N8852k6486K05967j9631k73949O0190
$$ 1782144 1810575 1801700 1873737 1705003 1619687 1678539 1652053 1858020 1838389 1564440 1624630
13913A624630J31954k21260P9204K30721o76738N54620k93707J63959n36471M67490
$$ 1624630 1756584 1535324 1614528 1845249 1168511 1723131 1429424 1593383 1056912 1524402
13903A524402j20328j60187J2360K22657k34090R9215J12252k16662M0614J46704
$$ 1524402 1404074 1243887 1256247 1478904 1244814 1344029 1456281 1239619 1280233 1426937
13893A426937l09871K18127l14057K54298M09417k46838j31077k48856M40859
$$ 1426937 1117066 1335193 1021136 1275434 1684851 1438013 1306936 1058080 1498939
13884A498939j40539j61623K19597l08348L03140o0747j70164l7631j24389o1341
$$ 1498939 1358400 1196777 1416374 1108026 1411166 1350419 1180255 1142624 1018235 956894
13874I56894J79497o9652J65883j91966J11419j85560K95754j54098J06975J34292
$$ 956894 1136391 1066739 1232622 1040656 1152075 966515 1262269 1108171 1215146 1349438
13864A349438n7260M5753l38458j63004K63966L3001r4288P6868l1231k8842K43207
$$ 1349438 1292178 1337931 999473 836469 1100435 1133436 1039148 1116016 1084785 1055943 1299150
13853A299150k04507p9837j14479J94824J45440k8375J01434j02122l12813R7097
$$ 1299150 1094643 1014806 900327 1095151 1240591 1212216 1313650 1211528 898715 995812
13843I95812L63484j52029k09185R9008J60323j26854j80584M5076m4960K05512
$$ 995812 1359296 1207267 998082 1097090 1257413 1130559 949975 995051 950091 1155603
13833A155603l46212L66997k72940K25766j67932k61947J93270J31388D30399
$$ 1155603 809391 1176388 903448 1129214 961282 699335 892605 1023993 430399
13823H39916J07690l8149K1133J569m05376K29169K24457M7300l22599K40229
$$ 839916 947606 909457 930590 932159 526783 755952 980409 1027709 705110 945339
13813I45339k47549K48387r5745M0049J59512l87207k03553N79812j16484j58146
$$ 945339 697790 946177 850432 890481 1049993 662786 459233 1039045 922561 764415
13803G64415l63552O56963K7249m47870J30957K71589l91562N82603m34103J12330
$$ 764415 400863 1057826 1085075 637205 768162 1039751 648189 1230792 796689 909019
13793I09019j15323L36403m08578J37210J36754j55156p8012K43410j27473l51189
$$ 909019 793696 1130099 721521 858731 995485 840329 762317 1005727 878254 527065
13783E27065L36221o6430J16411j94267J59017j80824j2103N1645J18184j56717
$$ 527065 863286 796856 913267 719000 878017 697193 685090 736735 854919 698202
13773F98202j2548k9803K90521k62920J49681Q1286M5154m57978L71387J04132
$$ 698202 685654 655851 946372 683452 833133 914419 959573 501595 872982 977114
13763I77114l26957L10532l49927k11950K72612o0769J49085M1124k08029A24263
$$ 977114 650157 960689 610762 398812 671424 610655 759740 800864 592835 124263
13752C15686J27638O471j4375N65035R5594m70019J67038o862n6863K5465k99525
$$ 315686 443324 449795 435420 1000455 1096049 626030 793068 786206 729343 754808 455283
13741D55283L01099j38099k03104L02730j08287K48436k65854K4645k00825J93889
$$ 455283 756382 618283 415179 717909 609622 858058 592204 616849 416024 609913
13731F09913J24746j93929m9644K70567M0091j36340j98304K46559j51996K9356
$$ 609913 734659 540730 491086 761653 801744 665404 467100 713659 561663 591019
13721E91019O5421J45073j94709l2837J213j89645J27160j47262K79511J90325
$$ 591019 656440 801513 606804 573967 575180 385535 512695 365433 644944 835269
13711H35269k63065K9596M5795Q685l09152J08255O4184L30722l84245J10244
$$ 835269 572204 601800 647595 656280 347128 455383 519567 850289 466044 576288
13701E76288J96738K81948k93411L0098j63492j8913p3869B02889N62641C51915
$$ 576288 773026 1054974 761563 791661 628169 609256 535387 202889 765530 351915
13690I64639k92640N2061B05007K30479J36331L42265C43437J49474K1946q1758
$$ 964639 671999 724060 205007 435486 571817 914082 343437 492911 514857 433099
13680D33099j15517Q3203L04134J8347o2861B10911P60999D20813j51352Q6470
$$ 433099 317582 400785 704919 723266 660405 210911 971910 420813 269461 355931
13670C55931Q365K20886A59990K53097k834O4333k09484L37107j12053j89809
$$ 355931 364296 585182 159990 413087 410253 474586 265102 602209 490156 300347
13660C00347J52560A58603R9568L31905p9356k47853L11340J177j05698K50330
$$ 300347 452907 158603 258171 590076 510720 262867 574207 575384 469686 720016
13650G20016k83318J23271k58729L89578C40801m5440J37635L41664B15040K63560
$$ 720016 436698 559969 301240 690818 340801 295361 432996 774660 215040 478600
13640D78600L492D6291J50292L81986B27060P0581K6208M99005B69167k634L12919
$$ 478600 482092 46291 196583 578569 227060 297641 323849 822854 269167 266533 579452
13629E79452A8296L77502J48732A98410J63310l7207l8914J74417P2425k49234
$$ 579452 18296 395798 544530 198410 361720 324513 285599 460016 532441 283207
13619B83207L32742k87216M4460J76168k63258K59349J85750C32482K26563B07638
$$ 283207 615949 328733 373193 549361 286103 545452 731202 332482 559045 207638
13608B71186o5214J05795K38917j32151K96350k67203q4176M4963l4311R8691
$$ 271186 205972 311767 550684 418533 714883 447680 363504 408467 374156 472847
13598D72847L4904j51880J15297M5080p7581K56915C20240q2495K23043E2680
$$ 472847 507751 355871 471168 516248 438667 695582 320240 237745 460788 52680
13587B56872L22327B55639N0539J1761e5245D20787A30965K48749M8973m1886
$$ 256872 579199 255639 306178 317939 -55245 420787 130965 379714 428687 386801
13577C86801A67738K46453q9139r3365M03089k57897A38403P5425p9899K58643
$$ 386801 167738 414191 325052 231687 634776 376879 138403 213828 133929 392572
13567C92572l3730j9877j61489O2977J46861p4660j1155K8388A4617J21094R8650
$$ 392572 358842 338965 177476 240453 387314 312654 301499 329887 14617 135711 234361
13556B34361K37378j80777j23256M14794B33212N9124q598L11641n7198r7774
$$ 234361 471739 290962 167706 582500 233212 292336 283738 595379 538181 440407
13546D40407j54026J5434R2396D4487P669L85062j86685p8291K36301M0285I0788
$$ 440407 286381 301815 394211 44487 52156 437218 250533 172242 408543 448828 90788
13534D50424k663M7154J32834A29186K25855N5861m0852O4308j23550j992l0508
$$ 450424 447761 494915 627749 129186 355041 410902 370050 434358 310808 308816 278308
13523B78308J26035R3977A59610P9638l3151K03641A06840L42986j09968E1883
$$ 278308 404343 498320 159610 239248 206097 409738 106840 449826 339858 51883
13512C81286M7503j42853R683I3131K50511a27221B50547N8877r2797G8234N7157
$$ 381286 428789 285936 295619 93131 343642 -127221 250547 309424 216627 78234 135391
13501A35391K02174j8047j53918j1162n3660K08409K22629A64245L97803A42324
$$ 135391 337565 319518 165600 154438 100778 309187 531816 164245 562048 142324
13490D80061j94265j22137R5830I1449P9650g7809A84669n8394J75986H7890J28019
$$ 480061 285796 163659 259489 91449 171099 -77809 184669 126275 302261 87890 215909
13479B15909q2112K0066A4458M73615A91969J94069j14725P5187j67866M3873
$$ 215909 133797 153863 14458 488073 191969 386038 271313 346500 178634 222507
13469B22507J02070E8475J70887f7160F34020A9672Q6126M43283j99126a49988
$$ 222507 324577 58475 229362 -67160 634020 19672 105798 549081 349955 -149988
13458C22710k6239M5882A04081K55543r2589O3525M4126L7226G4382P1529J14995
$$ 322710 296471 342353 104081 359624 267035 330560 374686 411912 74382 145911 260906
13447B60906F9817K05974K30198q2591j71514J3642q1152J41414O9796J35869
$$ 260906 69817 275791 505989 423398 251884 265526 184374 325788 395584 531453
13437E31453k17147c7247D50147m0610C9439J92793q4174k5468l1927K17486l5808
$$ 531453 314306 -37247 450147 409537 39439 232232 148058 122590 90663 308149 272341
13426B72341N864E5831j4762J44156J88085H8920J28768r9555J61093P691m5830
$$ 272341 278205 55831 41069 185225 373310 88920 217688 118133 279226 286917 241087
13415B41087K6742m9107Q0296J48758I3205J46196K9396J92856k26512O1617E2400
$$ 241087 267829 218722 299018 447776 93205 239401 268797 461653 235141 296758 52400
13403A31340J39523J57969E4913Q2325h5221E8459J85334J40123A85093I2081
$$ 131340 270863 428832 54913 137238 -85221 58459 243793 383916 185093 92081
13392D6019k2294L8573K16689D9984e0688C32742F7303M5377J49912n4983p4566
$$ 46019 23725 62298 278987 49984 -50688 332742 67303 112680 262592 207609 133043
13381A33043K72217j94814k1488L0650r9762L16022J36896k68217n6349j05541
$$ 133043 405260 210446 188958 219608 119846 435868 572764 304547 248198 142657
13371A42657a11519B57941l3216M1104A14013J24862d3343J5483B22852j04671
$$ 142657 -111519 257941 224725 265829 114013 238875 -43343 -27860 222852 118181
13361A18181P3307l9853J49076J53461A84255K21851P4515B36047n0362L2356
$$ 118181 191488 151635 300711 454172 184255 406106 480621 236047 185685 218041
13351B18041J4371k2549b41470A92692R3238J9256j14698p8904K12585J03761
$$ 218041 232412 209863 -241470 192692 285930 305186 190488 111584 324169 427930
13341D27930C1193J93424m1680j6649N5725K66843k35244K52160F1465J88103
$$ 427930 31193 224617 182937 166288 222013 488856 253612 505772 61465 249568
13331B49568e630B97665J68500j89304j17388a24328C00624o9695j05111m9991
$$ 249568 -5630 297665 466165 276861 159473 -124328 300624 230929 125818 75827
13321G5827N64a36253A91249F3809B0803J73910b92286C45589J35155j53464G2577
$$ 75827 76391 -136253 191249 63809 20803 194713 -292286 345589 480744 327280 72577
13309D829K39291K12090j50809i0000B12234L01547B2528J83575I0579Q4658l5827
$$ 4829 244120 456210 305401 -90000 212234 513781 22528 206103 90579 175237 139410
13298A39410k2927D7619R7943K86347A07121l7898J64245N6495K61383A64160
$$ 139410 116483 47619 145562 431909 107121 69223 233468 289963 551346 164160
13287b5693j00653I6531J03226J92953A1827M05758D9503c992B80680j35294b10788
$$ -25693 -126346 96531 199757 392710 11827 417585 49503 -3992 280680 145386 -210788
13275E23142A86939c03140C36741L4173k0308c6597C83540r9679b24426a02483
$$ 523142 186939 -303140 336741 370914 350606 -36597 383540 283861 -224426 -102483
13264h7269C09058O6595A24818J46782a8542o4044B99265l3633a44907A49857
$$ -87269 309058 375653 124818 271600 -18542 -82586 299265 265632 -144907 149857
13253C08835A27792A6097a76831C01246q2779I5113K54308A68899b7210B17562
$$ 308835 127792 16097 -176831 301246 218467 95113 349421 168899 -27210 217562
13242g3075m8814D02974A17604K6153a90175A08322J69986I3431J34431n2454
$$ -73075 -121889 402974 117604 143757 -190175 108322 278308 93431 227862 175408
13232A75408n5509R5215P1739j07500a73182G7327a04820A91417J77374i6416
$$ 175408 119899 215114 286853 179353 -173182 77327 -104820 191417 368791 -96416
13221C14904M29320a0617A64024l0394b381B204M494f6574B54089j08862l5665
$$ 314904 744224 -10617 164024 133630 -2381 2204 6698 -66574 254089 145227 109562
13210A09562l5863K24770m3828c9731j165j74383F5153K52210Q953c5021l2105
$$ 109562 73699 298469 254641 -39731 -40896 -215279 65153 317363 326316 -35021 -67126
13199f7126q823l426A06051J16741m0620M0424p4708N4923D3754J42964a8766
$$ -67126 -75949 -79375 106051 222792 182172 222596 147888 202811 43754 186718 -18766
13187B90631H4587j4819K26833c82282C1005K40185G2006c5306A26853f2945j16486
$$ 290631 84587 69768 296601 -382282 31005 271190 72006 -35306 126853 -62945 -179431
13176a79431e067j34625A82497i9596q8172C24932j07917e4594k7386M151A31933
$$ -179431 -5067 -139692 182497 -99596 -187768 324932 217015 -54594 -81980 -77829 131933
13164a32301K1972B47465d6612A13629J32157h0316e235C84908j80461M8491f0218
$$ -132301 -110329 247465 -46612 113629 245786 -80316 -5235 384908 204447 252938 -60218
13152h3199A71531o4570N1101b63388B13935J9321b29565g0273A71637b12731
$$ -83199 171531 106961 158062 -263388 213935 233256 -229565 -70273 171637 -212731
13141e6388F0556K7081d42761C8741P1368g7107A60571M7700d5116k23939a9362
$$ -56388 60556 87637 -442761 38741 110109 -77107 160571 208271 -45116 -269055 -19362
13129B62481H3512k8765i095j90349C76693A87660K00798a21411H9584a15244
$$ 262481 83512 54747 -9095 -199444 376693 187660 388458 -121411 89584 -115244
13118A2579N3530c6699B85278j32781J37705B4458a56478A62044h1962D2507A7457
$$ 12579 66109 -36699 285278 152497 290202 24458 -156478 162044 -81962 42507 17457
13106A45505l7997D5058M5487J93517d6905k32353B48977m2299J71033g9324B84484
$$ 145505 107508 45058 90545 284062 -46905 -279258 248977 206678 377711 -79324 284484
13094F1341b0967n3645j25888B33174f21681B5183a44128j06864c1264k1059k00281
$$ 61341 -20967 -74612 -200500 233174 -621681 25183 -144128 -250992 -31264 -52323 -252604
13083b52604R2061C2197J23182a90317B30188m9460H6096N4925a26162A60643
$$ -252604 -160543 32197 155379 -190317 230188 180728 86096 141021 -126162 160643
13072F36192F2658L68231I6455h1776A70157J31136A44972k8461a0585B82908
$$ 636192 62658 430889 96455 -81776 170157 301293 144972 116511 -10585 282908
13061D07156A82394C1590R9061a43966e40D00677H5867O6118C8723L7423d3192
$$ 407156 182394 31590 130651 -143966 -540 400677 85867 151985 38723 76146 -43192
13049B79157j14055p8677d2219A99565o7418C620M8862g6928E7790c7730E0360
$$ 279157 165102 86425 -42219 199565 132147 3620 52482 -76928 57790 -37730 50360
13037b6271j89040h9518B89165a91883A34973F95P4221J49249h9687K134k15504
$$ -26271 -215311 -89518 289165 -191883 134973 695 74916 224165 -89687 -87553 -303057
13026c03057a43232B30184H7320g2514H5489L376J33405C2699c29833f282G5236
$$ -303057 -143232 230184 87320 -72514 85489 88865 222270 32699 -329833 -6282 75236
13014C20458j29246C9832J6207K24735A0822P804R4196J24358a53401o52e8170
$$ 320458 191212 39832 56039 280774 10822 18626 112822 237180 -153401 -154053 -58170
13002b04192C66169b42701I8928i4257A58994e6151a6863l7392D14579D0130b6459
$$ -204192 366169 -242701 98928 -94257 158994 -56151 -16863 -54255 414579 40130 -26459
12990e9721B9944M232a88658C1718J66557b74620A73996l8342a25069c200B67239
$$ -59721 29944 34176 -188658 31718 198275 -274620 173996 135654 -125069 -3200 267239
12978C74226j65937o7256O204F3395J86865a25246D40433k02412b38961J09283
$$ 374226 208289 141033 147237 63395 250260 -125246 440433 238021 -238961 -129678
12968a29678K1749a0459m9193E6973a57484B08003A0791a67896r9143A48023D3336
$$ -129678 -107929 -10459 -59652 56973 -157484 208003 10791 -167896 -267039 148023 43336
12956b73414a3341j11794C08212A34983J15221r8259R6111a64871B8052D207h919
$$ -273414 -13341 -125135 308212 134983 250204 151945 248056 -164871 28052 4207 -8919
12944E4662c32150C49108a44685j09449B41143A4632b32515e7253m360B25199
$$ 54662 -332150 349108 -144685 -254134 241143 14632 -232515 -57253 -61613 225199
12933a4690F0564k0979J22294m6087a00246j55089F1974a73465k86043A95647
$$ -14690 60564 39585 161879 115792 -100246 -255335 61974 -173465 -459508 195647
12922I216a75664A62716a213C08666H5369m0166K14484g5745A39645J3727M3012
$$ 9216 -175664 162716 -1213 308666 85369 45203 259687 -75745 139645 153372 196384
12911A96384J29686B499J4072L17314A52584c6205C04641a35489N9256j53317
$$ 196384 326070 2499 16571 333885 152584 -36205 304641 -135489 -76233 -229550
12901b29550B12602L1311A20425b4513F0197A2906J10243b72505H6709J31712
$$ -229550 212602 243913 120425 -24513 60197 12906 123149 -272505 86709 218421
12891B18421q7579j101O246a64864A40043m1373B6629b4035l27961B73163J07307
$$ 218421 130842 129741 135987 -164864 140043 98670 26629 -24035 -351996 273163 380470
12880C80470b45905B9808K4144a06969j8086m5342H7704l5547f6893j57370B8065
$$ 380470 -245905 29808 53952 -106969 -125055 -170397 87704 52157 -66893 -224263 28065
12868A77861a83310r3285D0206K3723P1148a39671C9989a13301B2774L1202P1643
$$ 177861 -183310 -276595 40206 63929 135077 -139671 39989 -113301 22774 53976 125619
12857A25619J63819i4667r2764C96657A2330M3875K45403h8135l9410A09968n3606
$$ 125619 289438 -94667 -187431 396657 12330 56205 301608 -88135 -127545 109968 56362
12846E6362c393n6652A41442a90582L4542f0811C73067c5556C1987b77252L8899
$$ 56362 -3393 -60045 141442 -190582 -156040 -60811 373067 -35556 31987 -277252 -238353
12835b38353e5814j41222b8062B05645a35769B26883G9402b887G4938B8871f5182
$$ -238353 -55814 -197036 -28062 205645 -135769 226883 79402 -2887 74938 28871 -65182
12823a07357N800k35718b5096A56232B7753c1221A39284k5176d5538j86152A10743
$$ -107357 -101557 -337275 -25096 156232 27753 -31221 139284 114108 -45538 -231690 110743
12811c0191B69439b80209a4916j09978o2913A32886n7179b73963H7886K6825k9986
$$ -30191 269439 -280209 -14916 -124894 -187807 132886 75707 -273963 87886 114711 84725
12800H4725G047K3742K93129h3306m3869k548c6946A52379M3466e0540j78724
$$ 84725 7047 30789 323918 -83306 -127175 -129723 -36946 152379 195845 -50540 -229264
12789b29264D75341a73562E0759J72169J87140g8209k08268B50470b72120P6785
$$ -229264 475341 -173562 50759 222928 410068 -78209 -286477 250470 -272120 -195335
12779a95335E7359b96969f1427k30022e1353A37829K3952J13487A2645b71830
$$ -195335 57359 -296969 -61427 -291449 -51353 137829 161781 275268 12645 -271830
12768D13213a32701c5840j03167C11942j18184k3431J56299I5283e8977D2377
$$ 413213 -132701 -35840 -139007 311942 193758 170327 326626 95283 -58977 42377
12757A3562a22590A07946E0123a28088e3357o6481A13195b17792l0545B457J07527
$$ 13562 -122590 107946 50123 -128088 -53357 -119838 113195 -217792 -248337 2457 109984
12746A09984a85253C82657b31365i5419D8554N6733j4851b7735B92787J41522
$$ 109984 -185253 382657 -231365 -95419 48554 105287 90436 -27735 292787 434309
12736D34309A04631B106L02634a1238l29005d5746A91474n4876j8595l6626N6830
$$ 434309 104631 2106 304740 -11238 -340243 -45746 191474 136598 118003 81377 138207
12725A38207i0221A32730f9901p5382A0017h0243C32366d00257E9594J49850c6879
$$ 138207 -90221 132730 -69901 -145283 10017 -80243 332366 -400257 59594 209444 -36879
12713D18933H2029Q3613K864N2052j00025P2894q2117D5133j0005K76730A42866
$$ 418933 82029 165642 168506 220558 120533 193427 111310 45133 35128 311858 142866
12701F7750b7533B58297d5626a242A76034R6363l6571b29029B8774f383j47810
$$ 67750 -27533 258297 -45626 -1242 176034 272397 235826 -229029 28774 -6383 -154193
12690a54193B7192a84106A27743b8334C019b20747f9419L0815L4B85639P2779
$$ -154193 27192 -184106 127743 -28334 3019 -220747 -69419 -38604 -38570 285639 358418
12679C58418B2392N9322d9352A11773D8131k2335b36811i656E1935r664a39400
$$ 358418 22392 81714 -49352 111773 48131 25796 -236811 -9656 51935 42271 -139400
12667A42125e3657B42282b25447P7290H1368c3329A89286h7060b7447A58894e7556
$$ 142125 -53657 242282 -225447 -148157 81368 -33329 189286 -87060 -27447 158894 -57556
12655c6825B87423G2731J17538K24322g9472A47745J29516b35430f2108H2099
$$ -36825 287423 72731 190269 414591 -79472 147745 277261 -235430 -62108 82099
12644a71121L0143O5241H953J26743c97849i817j10813H3535f0483H6337a75929
$$ -171121 -140978 -75737 8953 135696 -397849 -9817 -120630 83535 -60483 86337 -175929
12632B00759d2475k3060N897A24055a90489o957B61178D3642K08875A24045K01223
$$ 200759 -42475 -65535 -59638 124055 -190489 -197446 261178 43642 252517 124045 325268
12621C25268d8949k5146B61494a47331I7278j647a11232C6272a73060B5760d9446
$$ 325268 -48949 -74095 261494 -147331 97278 95631 -111232 36272 -173060 25760 -49446
12609c02563A11912R7652a55987r924A70565b23081L2473M4447j17226A38615
$$ -302563 111912 209564 -155987 -165911 170565 -223081 -190608 -146161 -263387 138615
12598A18822O072K3706C6249J55645a44469N5048A60898i6849a3775C558P1840
$$ 118822 124894 148600 36249 191894 -144469 -89421 160898 -96849 -13775 3558 75398
12587G5398L12315c7088n629B3375J27492n4478J09356B242Q4625K8250f4742
$$ 75398 387713 -37088 -42717 23375 150867 96389 205745 2242 86867 115117 -64742
12575B99514c978O09j19793l2609C15590I6637i3874A940a01598P244j69079B26469
$$ 299514 -3978 -3369 -123162 -155771 315590 96637 -93874 1940 -101598 -94354 -263433 226469
12562B61387h6353F384J56237b04560j9217B16227a13352n6283F9661I862a09213
$$ 261387 -86353 6384 162621 -204560 -223777 216227 -113352 -169635 69661 9862 -109213
12550A56011C8866K91980a01000d8447A89247F0034b99371a40307B46079q2589
$$ 156011 38866 330846 -101000 -48447 189247 60034 -299371 -140307 246079 163490
12540A63490b28015h4153K2721D30160a80398E177b50260J09288e8209C00071
$$ 163490 -228015 -84153 -61432 430160 -180398 5177 -250260 -140972 -58209 300071
12529a32264j3393d4980C8510a37986j3384I3107g8944A02587a31291A55156n3493
$$ -132264 -145657 -44980 38510 -137986 -151370 93107 -78944 102587 -131291 155156 101663
12518A01663b57796D2836P1307c08791F5559Q7807g3862k11392A46258c69029
$$ 101663 -257796 42836 114143 -308791 65559 153366 -73862 -285254 146258 -369029
12507b40919A86094b38200a1254k39575K096j15708L6816h6588a4462q5460J7367
$$ -240919 186094 -238200 -11254 -250829 -248733 -364441 -327625 -86588 -14462 -99922 -82555
12496h2555j17559a828r2384B12149j2909d60593b00252B95378c7432k47394F2143
$$ -82555 -200114 -1828 -94212 212149 199240 -460593 -200252 295378 -37432 -284826 62143
12484G3219e1093A09957p565L4566P1753A4646P2038L64212H0997C5993b262F8842
$$ 73219 -51093 109957 102392 136958 208711 14646 86684 450896 80997 35993 -2262 68842
12471c59327C9737J55819h5915F5617f1703m0664d1824l65476a8255j41472A27450
$$ -359327 39737 195556 -85915 65617 -61703 -102367 -41824 -407300 -18255 -159727 127450
12459E9815k4377d7423q978A10188a48873B31179a19007j5760e2691D2433g5223
$$ 59815 35438 -47423 -56401 110188 -148873 231179 -119007 -134767 -52691 42433 -75223
12447B4172b10625B29710f2954A83997b58906J12500k45458C2376b72331k6816
$$ 24172 -210625 229710 -62954 183997 -258906 -146406 -391864 32376 -272331 -299147
12437b99147a12234b4506j08113j06151c9299j39207k80635I3873h8827j22422
$$ -299147 -112234 -24506 -132619 -238770 -39299 -178506 -459141 93873 -88827 -211249
12427b11249j01214B6526K34545a48381D362K94270j21085d8351H2042a86431
$$ -211249 -312463 26526 261071 -148381 4362 298632 177547 -48351 82042 -186431
12416A38163j0304a72962B70408c9616j49890A78450g2169F1545b09210i7540
$$ 138163 127859 -172962 270408 -39616 -189506 178450 -72169 61545 -209210 -97540
12405A3095g5362m7893e2843D56902a44112F7433b0620C81906D5510a21983k7286
$$ 13095 -75362 -123255 -52843 456902 -144112 67433 -20620 381906 45510 -121983 -149269
12394a49269B11770g6212M442j58681A90197e1536B88832j8723j06240Q2221b745
$$ -149269 211770 -76212 -71770 -230451 190197 -51536 288832 270109 163869 246090 -2745
12382B70060b9487G5760J00856a66723e3523I2333L1309c5598A87312m3412K30250
$$ 270060 -29487 75760 176616 -166723 -53523 92333 123642 -35598 187312 143900 374150
12371C74150A9056J6574K12327r1704a0980A36992K0098h5186B45470D6703J5474
$$ 374150 19056 35630 247957 156253 -10980 136992 157090 -85186 245470 46703 62177
12360F2177N8869i9634M5785f949A29117K5042M1053a28969d1061A53442a34852
$$ 62177 121046 -99634 -53849 -6949 129117 154159 195212 -128969 -41061 153442 -134852
12348A21970b584k78604a04698A89319e0616E2959f765E09111d5262B97602F443
$$ 121970 -2584 -281188 -104698 189319 -50616 52959 -6765 509111 -45262 297602 6443
12336C61139E9540i837C01787d1998F4892N9381b03515A02414M6990L31898n6670
$$ 361139 59540 -9837 301787 -41998 64892 124273 -203515 102414 149404 481302 424632
12325D24632H0359K25476J70706A62465a53830A6235K88596L3618O5450j71762
$$ 424632 80359 305835 476541 162465 -153830 16235 304831 338449 403899 232137
12315B32137q7133g0200B94825n2788N2659A22570K95344q9146L7717A11290J44884
$$ 232137 145004 -70200 294825 242037 294696 122570 417914 328768 366485 111290 256174
12304B56174q4290K53953j50224g761j349C5307b0356C38525l1840g3101F6705
$$ 256174 171884 425837 275613 -7761 -9110 35307 -20356 338525 306685 -73101 66705
12292a17081a8950C85606D3479R2498R7075A1539c13857A72171c4006E5942J57985
$$ -117081 -18950 385606 43479 135977 233052 11539 -313857 172171 -34006 55942 213927
12281B13927k4149E7801c1321B16381L6874K38115k36470H9981e4187A1365d6589
$$ 213927 189778 57801 -31321 216381 253255 491370 254900 89981 -54187 11365 -46589
12269G9997J62483O2690F5573L16858j50470q7045O65a48013F2586J78711N7394
$$ 79997 242480 305170 65573 382431 231961 144916 145581 -148013 62586 241297 298691
12258B98691A16066K39453P5207A21250a8913B99369a69520a1326A45162D9965
$$ 298691 116066 355519 430726 121250 -18913 299369 -169520 -11326 145162 49965
12247E8601a89974C88086B2334J23801k5020O3115q2185K3074J4867J76651B5327
$$ 58601 -189974 388086 22334 146135 121115 184230 102045 125119 139986 316637 25327
12235C16998Q2179j91864b53403B3807J67377J71259a22662E6815g5363D29850
$$ 316998 399177 207313 -253403 23807 191184 362443 -122662 56815 -75363 429850
12224C2781J66363k2238b77183A38386C9707J63769G8196N5094O655C9739h7865
$$ 32781 199144 176906 -277183 138386 39707 203476 78196 133290 139945 39739 -87865
12212C38768a2688l6240D4708B1492a4971A69354J0783N4262h6814B4692b71426
$$ 338768 -12688 -48928 44708 21492 -14971 169354 180137 234399 -86814 24692 -271426
12200a59077c1736B3619i6535I2737b17158B72794K3229r5601D1329J45822J53699
$$ -159077 -31736 23619 -96535 92737 -217158 272794 296023 200422 41329 187151 340850
12189C40850A62250J74220i245A05187m8699M91550c4370C09256a21789N5088
$$ 340850 162250 336470 -9245 105187 56488 548038 -34370 309256 -121789 -66701
12179f6701K6548n0674G7811J35689o4980L832J35936j7457a0596q0837E09821
$$ -66701 -40153 -90827 77811 213500 148520 152352 288288 270831 -10596 -91433 509821
12167b0890C31533A7914K17645R2054L2925J88072B45217H8610d4738C51809o1882
$$ -20890 331533 17914 235559 327613 360538 548610 245217 88610 -44738 351809 289927
12156B89927B9833a40934A54884M44294B69311m6322m4326h4234D7361b2089B77528
$$ 289927 29833 -140934 154884 599178 269311 222989 178663 -84234 47361 -22089 277528
12144c9319j77581A26638m3141K6089K03184A6112d0871l9479G2083hA01878J17811
$$ -39319 -216900 126638 83497 109586 312770 16112 -40871 -80350 72083 -8 101878 219689
12132B19689a1607D15235E0167J8717O3272b7203G3925B6690K32271E2026L28735
$$ 219689 -11607 415235 50167 68884 132156 -27203 73925 26690 258961 52026 380761
12121C80761r0750J25329j75605j18987D5926K08006J21611Q603M7350j73D8642
$$ 380761 290011 415340 239735 120748 45926 253932 375543 384146 431496 431323 48642
12109C80238q182D1128a90704C76477a53571C99200A30808b52784B39213K45599
$$ 380238 372056 41128 -190704 376477 -153571 399200 130808 -252784 239213 484812
12099D84812k06806B4877k398c5541I0770K09554G0880c715H4711K09324I6286
$$ 484812 278006 24877 22479 -35541 90770 300324 70880 -3715 84711 294035 96286
12087b34490n4145a36239B61274G5784A4005K67442L9310O8675A01914J61260
$$ -234490 -288635 -136239 261274 75784 14005 281447 320757 389432 101914 263174
12077B63174j21284K65232r5260d3650c395A58497J43412B5658J68036K28023
$$ 263174 141890 407122 311862 -43650 -3395 158497 301909 25658 193694 421717
12067D21717j22655A14134L66523A81572o1001B7679K70644I8638L6138h754A87619
$$ 421717 299062 114134 480657 181572 120571 27679 298323 98638 134776 -8754 187619
12055B70215k1920E6308R9092a90799G3204J10818c5255j6747B10868G6841c09913
$$ 270215 248295 56308 155400 -190799 73204 184022 -35255 -52002 210868 76841 -309913
12043i11j78799A00483h3338A14753a31868m9539j3732B98725a35545j69580b9881
$$ -911 -179710 100483 -83338 114753 -131868 -181407 -195139 298725 -135545 -305125 -29881
12031A87825p7599b03636C02568b47789O2712F107d2780m5564E4173e7443A68962
$$ 187825 110226 -203636 302568 -247789 -185077 6107 -42780 -88344 54173 -57443 168962
12019a7152A47466E4557M05006A6007K73687M0915e232A03385o152J06814a63562
$$ -17152 147466 54557 459563 16007 289694 330609 -5232 103385 97233 204047 -163562
12007C21938F03a02720d9303A28155M7603K10966r5803c12435C97056j08837a0689
$$ 321938 603 -102720 -49303 128155 175758 386724 290921 -312435 397056 288219 -10689
11995a36675M1145A71355b46320D1019c90700F3329l1597g7211A6941L68122A56183
$$ -136675 -95530 171355 -246320 41019 -390700 63329 31732 -77211 16941 385063 156183
11983C61158b08501h245B13061C9616a55219l1480F5257P6560J11876c46229B79539
$$ 361158 -208501 -8245 213061 39616 -155219 -186699 65257 141817 253693 -346229 279539
11971H2652l522L98794D3271K64924b07079a01167A83122d4481A58534G246J68867
$$ 82652 79130 477924 43271 308195 -207079 -101167 183122 -44481 158534 7246 176113
11960A76113f8689A5171h2474p6302f5314A69152a29448A30776b30048n5147F668
$$ 176113 -68689 15171 -82474 -158776 -65314 169152 -129448 130776 -230048 -285195 6668
11948i4780j28625d6078A67819b55819e2174o3965j11283A5094e7525J9806j38033
$$ -94780 -223405 -46078 167819 -255819 -52174 -116139 -227422 15094 -57525 -37719 -175752
11937a75752A83474C8131l793b55442a01560E0637e9986h807j00888A8599b02002
$$ -175752 183474 38131 34338 -255442 -101560 50637 -59986 -8807 -109695 18599 -202002
11925g2349A39534M6866H511a91373B77102m1930b96710g0220m82796b7861A38625
$$ -72349 139534 186400 8511 -191373 277102 235172 -296710 -70220 -553016 -27861 138625
11913b04075b7564B10682c70823b8902j19389A12848g8958l1750H7190b03721
$$ -204075 -27564 210682 -370823 -28902 -148291 112848 -78958 -110708 87190 -203721
11902h496l2974B010b7377D6702d23692a40382C7253i5057j843j78927h5843n8269
$$ -8496 -41470 2010 -27377 46702 -423692 -140382 37253 -95057 -96900 -275827 -85843 -144112
11890a44112j84481A19410a39621k5512B18191n6310e30188A62782f6201j2074
$$ -144112 -328593 119410 -139621 -165133 218191 161881 -530188 162782 -66201 -78275
11880g8275I8071A5917M3388a144n8175m1850G0455a24228e9342C60883I7658
$$ -78275 98071 15917 59305 -1144 -59319 -101169 70455 -124228 -59342 360883 97658
11868a99038L8152A52295a6910j04652F3451b36345J11810r3858I4452P9320a63598
$$ -199038 -160886 152295 -16910 -121562 63451 -236345 -124535 -218393 94452 173772 -163598
11856b69618f1583H4304b51163C06023a93716D7785b92294j47070g135j56604
$$ -269618 -61583 84304 -251163 306023 -193716 47785 -292294 -439364 -7135 -163739
11846a63739j13588b0277C533a88521A53712F6798e4732q8844O490B30085b6116
$$ -163739 -277327 -20277 3533 -188521 153712 66798 -54732 -143576 -137086 230085 -26116
11834B9366b240E1248b73581a5478k53141g0239m1298m5026B99994c5822l28814
$$ 29366 -2240 51248 -273581 -15478 -268619 -70239 -111537 -156563 299994 -35822 -364636
11823c64636a12704f483B95138i0115k19744A03908c05833J13179O5384o8384
$$ -364636 -112704 -6483 295138 -90115 -309859 103908 -305833 -192654 -127270 -195654
11813a95654a4977A20165h1892k89005B67797c31153d5118q04A92143b5546k03233
$$ -195654 -14977 120165 -81892 -370897 267797 -331153 -45118 -45922 192143 -25546 -228779
11802b28779A51564E5176q160e1608m201j0036j50840c5945C8316d38753c1712
$$ -228779 151564 55176 47016 -51608 -55809 -65845 -216685 -35945 38316 -438753 -31712
11790B00847o1420b83790Q5070E9193i5881j05953A17692a6632B39037k6334j8760
$$ 200847 139427 -283790 -198720 59193 -95881 -201834 117692 -16632 239037 212703 193943
11779A93943a79358g9034m04146a13406L8832r602b1816k14098A28822J1495a28415
$$ 193943 -179358 -79034 -483180 -113406 -74574 -84176 -21816 -235914 128822 140317 -128415
11767b52847I856c7673n7974D3886c09954P8305g6730j00325F0488K83992b68173
$$ -252847 9856 -37673 -95647 43886 -309954 -231649 -76730 -177055 60488 344480 -268173
11755A3994a48583H6411C2256a631A6200f4611g05l00309A68030f0575A18564
$$ 13994 -148583 86411 32256 -1631 16200 -64611 -705 -301014 168030 -60575 118564
11743A90172k281G6379f5446A63834C3922a56339A491N5554b05515j7316A69812
$$ 190172 187891 76379 -65446 163834 33922 -156339 1491 57045 -205515 -222831 169812
11731D2204a74697I4208Q8183M2357D136K031K34731n9688o7693b19924R5178
$$ 42204 -174697 94208 182391 224748 4136 6167 240898 181210 113517 -219924 -124746
11720a24746J8506B914M9934a30551A30714a52885F492K17879p752P9721J67533
$$ -124746 -106240 2914 52848 -130551 130714 -152885 6492 224371 216619 296340 463873
11709D63873H7802J15121D1635K4481c41391B36443g1155j83510A09643k9071
$$ 463873 87802 202923 41635 66116 -341391 236443 -71155 -254665 109643 80572
11699H0572k9747e1954D5134M1602f1941b4039j97630d8508o888A6505h6766b9028
$$ 80572 50825 -51954 45134 86736 -61941 -24039 -221669 -48508 -55396 16505 -86766 -29028
11686f0519I1412g7265g146I5254J54794a48653f0728k77025B12411h815H9549
$$ -60519 91412 -77265 -7146 95254 250048 -148653 -60728 -337753 212411 -8815 89549
11674B57204H4648b6634B63633a09604p8847o6506A70085a84306P9665A62742
$$ 257204 84648 -26634 263633 -109604 -188451 -254957 170085 -184306 -104641 162742
11663B03263B2994J5570P8456J31969a6531j17421h977j11281A20281J64907N9086
$$ 203263 22994 38564 117020 248989 -16531 -133952 -8977 -120258 120281 285188 344274
11652C44274H4672J42767c02294G096b36801I1894m725h7683A72101b66210A73455
$$ 344274 84672 227439 -302294 7096 -236801 91894 87169 -87683 172101 -266210 173455
11640b89152a09538a0229l38758Q2750G7830a70367O8654A61458B6432j0451a88492
$$ -289152 -109538 -10229 -348987 -266237 77830 -170367 -101713 161458 26432 15981 -188492
11628B7640Q1972J03374C5705b92230R2339B14863f7666k05276A82120h421A01463
$$ 27640 109612 212986 35705 -292230 -199891 214863 -67666 -272942 182120 -8421 101463
11616b23326B80715A38428a26806e2415p6592n3594N9672b7327B30665a59394
$$ -223326 280715 138428 -126806 -52415 -129007 -182601 -122929 -27327 230665 -159394
11605A61556C3338J08652J68727A2343G9J50255J16852P2514q1048a1063A9172
$$ 161556 33338 141990 310717 12343 79 150334 267186 339700 258652 -11063 19172
11593B85725a67597j4176B88618A195Q3712M7925N5093a6333k05653E6184B4735
$$ 285725 -167597 -181773 288618 1195 84907 132832 187925 -16333 -221986 56184 24735
11581b4827F1466a3512C4802J92326K8084c0801A72166p5302a74239F0929J34304
$$ -24827 61466 -13512 34802 227128 255212 -30801 172166 96864 -174239 60929 195233
11570A95233a7293A01183C7944g8789B4607J81828a08021k441k0811f0740j42102
$$ 195233 -17293 101183 37944 -78789 24607 206435 -108021 -110462 -131273 -60740 -202842
11559b02842A60817b84859E6504a24294C54559c592G9524j7433g9584K8188F0129
$$ -202842 160817 -284859 56504 -124294 354559 -3592 79524 62091 -79584 -51396 60129
11547h2801c2123J734q6064k5619i664j47555F5108b50970i1469M441B09663H8024
$$ -82801 -32123 -30389 -116453 -142072 -9664 -157219 65108 -250970 -91469 -87028 209663 88024
11534B50705A17344a23174k1416e6513C0653M00065F0549L2879L4223a4391F7522
$$ 250705 117344 -123174 -144590 -56513 30653 430718 60549 93428 127651 -14391 67522
11522f6H3950i581l01019f0830A26222R423J59129a2164H5778a7713C140a51656
$$ -66 83950 -9581 -310600 -60830 126222 135645 294774 -12164 85778 -17713 3140 -151656
11509B80421l349a14723B41950l6489r9874Q2827E5343J31595C1438p90Q9954
$$ 280421 277072 -114723 241950 205461 105587 188414 55343 186938 31438 30648 120602
11498A20602G483J73603e3391A70074P3138a5897E2578a11822l3839N8264B49436
$$ 120602 7483 181086 -53391 170074 243212 -15897 52578 -111822 -145661 -87397 249436
11486A42716m0821A8613J3554M8023L18108I1203M10208I2774K80189f2198j7230
$$ 142716 101895 18613 32167 80190 398298 91203 501411 92774 372963 -62198 -79428
11475g9428A13376e7370K3097O985j18634I3456B7565J86341k6202P5992A7710
$$ -79428 113376 -57370 -34273 -27288 -145922 93456 27565 213906 187704 263696 17710
11463B76098a72989C2986L0724J41522B0463a00259G9699J1323c0972j9600q6775
$$ 276098 -172989 32986 63710 205232 20463 -100259 79699 91022 -30972 -50572 -137347
11452a37347l7687I6521j4934A2538a20465N2895F5022B7587i8770M6350j05394
$$ -137347 -175034 96521 81587 12538 -120465 -67570 65022 27587 -98770 -52420 -157814
11441a57814I7776J00286a11867A12064a20198q9237I2675R9563h0808j4574K1924
$$ -157814 97776 198062 -111867 112064 -120198 -209435 92675 192238 -80808 -95382 -73458
11430g3458j7488j26062c8948F6760J12468R4300A25267a44278M3571l10117A26362
$$ -73458 -90946 -217008 -38948 66760 179228 273528 125267 -144278 -100707 -410824 126362
11418a40432n52j54028J22160b5788p4504n4488A57481g8312k51908A22341a59464
$$ -140432 -140984 -295012 -172852 -25788 -100292 -154780 157481 -78312 -330220 122341 -159464
11406a73388F30K28419a48195A72130E741h0909B40741d8445j47716i3889B1014
$$ -173388 630 229049 -148195 172130 5741 -80909 240741 -48445 -196161 -93889 21014
11394C3341J52072a15579a6685n7145A37558a46275A56572a12017A57103F6567
$$ 33341 185413 -115579 -16685 -73830 137558 -146275 156572 -112017 157103 66567
11383f9033A14623a08751b9375A3861K0299g0083n8624d9596H1421b12285p9651
$$ -69033 114623 -108751 -29375 13861 34160 -70083 -128707 -49596 81421 -212285 -291936
11372b91936d5288K843o2683l8465o6346j23148I3236C1656b86424J28028a0650
$$ -291936 -45288 -42445 -105128 -143593 -209939 -333087 93236 31656 -286424 -158396 -10650
11360C59577j10652C2927J29613a04294B7096P7813a77413f771k28544B4620j075
$$ 359577 248925 32927 162540 -104294 27096 104909 -177413 -6771 -235315 24620 23545
11349B3545i0667j29357C5163N4566L9715a93547a1961C51313E7579J31279b6232
$$ 23545 -90667 -220024 35163 89729 129444 -193547 -11961 351313 57579 188858 -26232
11337d7761B40085r9683n8394a73492J1041o658j3197c2746J3856j11359a7590
$$ -47761 240085 140402 82008 -173492 -162451 -169109 -182306 -32746 -18890 -130249 -17590
11325F4824i2534F48a32374k33565g0820A15055h5648B0301a5709j45764E538
$$ 64824 -92534 648 -132374 -365939 -70820 115055 -85648 20301 -15709 -161473 5538
11313B01485m5617k5630d1358A54159i3949Q991k03505e5982B2456K46501b1355
$$ 201485 155868 130238 -41358 154159 -93949 -84958 -288463 -55982 22456 268957 -21355
11301e0603E3937K16053H4787a47892j1089A20740P6484a21265B23897a92488
$$ -50603 53937 269990 84787 -147892 -158981 120740 197224 -121265 223897 -192488
11290B99933A09778a72393e2542j68850A06248a03572p3975C59504a46349l5606
$$ 299933 109778 -172393 -52542 -221392 106248 -103572 -177547 359504 -146349 -181955
11280a81955b8230j41506b8487k8270D3470J61370e0947H9400b43468P6936c9605
$$ -181955 -28230 -169736 -28487 -56757 43470 204840 -50947 89400 -243468 -166532 -39605
11268I8453J56290j6450N4839b30535B32582L8976D2510b98604B40808a73709
$$ 98453 254743 238293 293132 -230535 232582 271558 42510 -298604 240808 -173709
11257D0058f7182k44289J44431C473a14059N6812p0320C3832a41506M0694k81665
$$ 40058 -67182 -311471 -167040 3473 -114059 -57247 -127567 33832 -141506 -100812 -382477
11246c82477F1022b54509N7549n8424a2151j39513e5679j07837M3961n7714B36466
$$ -382477 61022 -254509 -196960 -255384 -12151 -151664 -55679 -163516 -119555 -177269 236466
11234E1915K2771J30677C5890e008B28964G2217a23512A67764h8304j18403A01537
$$ 51915 74686 205363 35890 -5008 228964 72217 -123512 167764 -88304 -206707 101537
11222h8841A31704d42660B35301c47452M9391l9270R0347j9708N4704e2543E3367
$$ -88841 131704 -442660 235301 -347452 -298061 -337331 -246984 -266692 -211988 -52543 53367
11210e756H2413a12957B28003I1914a17038m5274N463H4485c27387J63074C4489
$$ -5756 82413 -112957 228003 91914 -117038 -162312 -156849 84485 -327387 -164313 34489
11198B31989F9317a92519j46652C3218K44034a08999n6027d027F6259a47252b795
$$ 231989 69317 -192519 -339171 33218 277252 -108999 -165026 -4027 66259 -147252 -2795
11186b08001A01170a97171o0995P2701K1027l2558L8950b0163F1238N8490c48864
$$ -208001 101170 -197171 -258166 -185465 -164438 -196996 -158046 -20163 61238 119728 -348864
11174a28356l52718F4193K22701O7517i4477M7151A21978c10499g1674C2057P5079
$$ -128356 -481074 64193 286894 354411 -94477 -47326 121978 -310499 -71674 32057 107136
11163A07136J09769B2450P546J34728d5177k18467g8652L2297B0184P7187c4093
$$ 107136 216905 22450 29996 164724 -45177 -263644 -78652 -46355 20184 97371 -34093
11151b09520j51154A65278J65732c45446B51080b60047h3956r3555N3703B61376
$$ -209520 -360674 165278 331010 -345446 251080 -260047 -83956 -177511 -123808 261376
11140b9580A01669b65A20878D1048A6570O1706a38814n9070R2750E3777a3118
$$ -29580 101669 -265 120878 41048 16570 78276 -138814 -197884 -105134 53777 -13118
11128E4026a1787B39960H03K0742a36952B58388C5869h9312A36040f0094A26509
$$ 54026 -11787 239960 803 21545 -136952 258388 35869 -89312 136040 -60094 126509
11116b2675n6004K9409j33906B07180d0766j73251C81342F5127b05021h5582L6538
$$ -22675 -78679 -49270 -183176 207180 -40766 -214017 381342 65127 -205021 -85582 -49044
11105d9044a671j09706E1381R3352j1753a52953H7497a6391B69123O1415a117
$$ -49044 -1671 -111377 51381 144733 132980 -152953 87497 -16391 269123 330538 -1117
11093A43286b52712A70923k6887N9935c48660B88413r6926r5220l1432J9544L09484
$$ 143286 -252712 170923 144036 203971 -348660 288413 191487 96267 64835 84379 393863
11082C93863j62410i8938D35722d1969D58587j59195q9539q9463K3011J10608
$$ 393863 231453 -98938 435722 -41969 458587 299392 209853 120390 143401 254009
11072B54009R7328G069K36304K7389G2954c700B15618K08925j94455q6773k7275
$$ 254009 351337 7069 243373 270762 72954 -3700 215618 424543 230088 143315 116040
11061A16040R6799L090J59652o9927J40566A90897R1987L4657H1314K09028r3378
$$ 116040 212839 215929 375581 305654 446220 190897 282884 317541 81314 290342 196964
11050A96964L73048j80647l6288K09782R4884j97387M4135J10558J91325l55224
$$ 196964 570012 389365 353077 562859 657743 460356 504491 615049 806374 451150
11040D51150K61721k14439K17851k41261R5582K35919n1473j54172J14968j25502
$$ 451150 712871 498432 716283 475022 570604 806523 755050 600878 715846 590344
11030E90344k17457L97745j31896N3590k62000o513N4412A92056M25427o87k6382
$$ 590344 372887 770632 638736 692326 430326 423813 478225 192056 617483 616796 590414
11019E90414m0061k08922Q9294r973K47100J32284C63383K25444J31146l52551
$$ 590414 550353 341431 430725 420752 667852 800136 363383 588827 719973 367422
11009C67422K72859j66581O7272j99701P0472A90690J71820J09792F9203K47654
$$ 367422 640281 473700 540972 341271 411743 190690 362510 472302 69203 316857
10999C16857K29801q6049A9636L19493K19904A07640K80043k5426k7303L02218
$$ 316857 546658 460609 19636 339129 559033 107640 387683 362257 334954 637172
10989F37172o6762k50885J10324J19749O3839j72599K03617R1263p5091J38885
$$ 637172 570410 319525 429849 549598 613437 440838 644455 735718 660627 799512
10979G99512l57098L70891k65461M66414J42671k56823L47553K46447k69928P94052
$$ 799512 442414 813305 547844 1014258 1156929 900106 1247659 1494106 1224178 2018230
10969B018230k34239L0079K61616j27284m27845K39064j19246k87642J55829j89343
$$ 2018230 1783991 1814070 2075686 1948402 1520557 1759621 1640375 1352733 1508562 1319219
10959A319219k23347J24136k95447K55523L18821p2267j58885J0687N1421K17305
$$ 1319219 1095872 1220008 924561 1180084 1498905 1426638 1267753 1278440 1329861 1547166
10949A547166k52424j79992J36493k09481k33323j66770j3500A47351N19953C06324
$$ 1547166 1294742 1114750 1251243 1041762 808439 641669 628169 147351 667304 306324
10938C73387O1431j14035B5757L90757I9861a98638A64821g9939J6808B90215
$$ 373387 434818 320783 25757 416514 99861 -198638 164821 -79939 -63131 290215
10927g5327A47335F2871J24509a74653A14494a62543B7945K178J70301b7945B3731
$$ -75327 147335 62871 187380 -174653 114494 -162543 27945 30123 200424 -27945 23731
10915A71166a1058B52470l809a158B55628a69068r219B43020F3727j1638b58991
$$ 171166 -11058 252470 248661 -1158 255628 -169068 -178287 243020 63727 52089 -258991
10903c1160j02411G9585d6522k938B11949h8113k3776M3512J6713j93884L6258
$$ -31160 -133571 79585 -46522 -49460 211949 -88113 -111889 -68377 -51664 -245548 -209290
10892b09290C2003f9344k66513C3006a65493F463b94442J33064A17584B2307b26729
$$ -209290 32003 -69344 -335857 33006 -165493 6463 -294442 -161378 117584 22307 -226729
10880A85777H89h6682A50182f3176j16983L5984l4458b3621B59914a45324L7567
$$ 185777 889 -86682 150182 -63176 -180159 -144175 -178633 -23621 259914 -145324 -107757
10869a07757A67829h4672B2549a61049f31C1060J04515m758D5322a26200C14621
$$ -107757 167829 -84672 22549 -161049 -631 31060 135575 130817 45322 -126200 314621
10857a98276b2966k6867B6830c60076A43343J30569a64550B36785E4564c24960
$$ -198276 -22966 -49833 26830 -360076 143343 273912 -164550 236785 54564 -324960
10846A4816a32124f827o5929k47293H0004A5845g5249A2619a12574j19518k5250
$$ 14816 -132124 -6827 -72756 -320049 80004 15845 -75249 12619 -112574 -232092 -257342
10835b57342a9454j09195D9245a04723r4715R012A57264f9966C70929C2379a17984
$$ -257342 -19454 -128649 49245 -104723 -199438 -190426 157264 -69966 370929 32379 -117984
10823B16849J80273l5958I2030A5603d42303e370m5751j79974R2103A04423a44163
$$ 216849 397122 361164 92030 15603 -442303 -5370 -51121 -231095 -138992 104423 -144163
10811c30022h9401M2418A38209b11619N4930k41402A63799j5787b15136A19794
$$ -330022 -89401 -46983 138209 -211619 -156689 -398091 163799 148012 -215136 119794
10800B09794a95629b065n1117j04133K966D4395b51203d3748B81292a41131f8440
$$ 209794 -195629 -2065 -53182 -157315 -154349 44395 -251203 -43748 281292 -141131 -68440
10788E2988b43157k52185g3711G2155b83592c8786k68443a36416k23399J46098
$$ 52988 -243157 -495342 -73711 72155 -283592 -38786 -307229 -136416 -359815 -213717
10778b13717H1095b48385j2874P2803e7542j80692A90965b46412A59440N5172
$$ -213717 81095 -248385 -261259 -188456 -57542 -238234 190965 -246412 159440 214612
10768B14612o6370k7786K66088b36923h1538A10711K03965I0618i6861c0365j12030
$$ 214612 148242 120456 386544 -236923 -81538 110711 314676 90618 -96861 -30365 -142395
10757a42395e3108r3403k21384G4539a59480D3618L18422c18166A09306I564b18865
$$ -142395 -53108 -146511 -367895 74539 -159480 43618 362040 -318166 109306 9564 -218865
10745g2954B94671a08902A16505J06490c7993j11092B11785a31062A64688k2806
$$ -72954 294671 -108902 116505 222995 -37993 -149085 211785 -131062 164688 141882
10735A41882l8070i541j36064J7304r3070q5138f1475j50417i2999n0850g1480
$$ 141882 103812 -9541 -145605 -128301 -221371 -306509 -61475 -211892 -92999 -143849 -71480
10723A38277F103g4947j62035k52988B37971B6566a7899I5951q670C4598j6188
$$ 138277 6103 -74947 -236982 -489970 237971 26566 -17899 95951 87281 34598 18410
10712A8410R2941c07743D1416R3567c5228j1012j76247R1298j73071B35781B7785
$$ 18410 111351 -307743 41416 134983 -35228 -46240 -222487 -131189 -304260 235781 27785
10700A43995a54198E2270L8735i6119l4353B7908R6535c08082b9943A77296p4138
$$ 143995 -154198 52270 91005 -96119 -130472 27908 124443 -308082 -29943 177296 103158
10689A03158R6134c07717D939b77117e6536k57372R2685N2937c5185A73745h1706
$$ 103158 199292 -307717 4939 -277117 -56536 -313908 -221223 -168286 -35185 173745 -81706
10677e0647k8944J2703n3738o516j78721J48848b8701q2030j30946F8686L12390
$$ -50647 -79591 -66888 -120626 -127142 -305863 -157015 -28701 -110731 -241677 68686 381076
10666C81076f5916l26822a73645e1257E1120J436d3244j23721K3017j20451Q7693
$$ 381076 -65916 -392738 -173645 -51257 51120 52556 -43244 -166965 -143948 -264399 -176706
10655a76706E1117a04067j65443I2804d3613j4665o8670B9701a12919B18975J61877
$$ -176706 51117 -104067 -269510 92804 -43613 -58278 -126948 29701 -112919 218975 380852
10644C80852D2809a39929j62439e8108p5911Q410j55638a12244c3034B32761a27053
$$ 380852 42809 -139929 -302368 -58108 -134019 -125609 -281247 -112244 -33034 232761 -127053
10632C82025b10755B66165a22671e0391o9294e5537l0915j04452E8847J07086
$$ 382025 -210755 266165 -122671 -50391 -119685 -55537 -86452 -190904 58847 165933
10622A65933D2822J21104a89363O9405A36250b33774f6611C98181h2267j77815
$$ 165933 42822 163926 -189363 -119958 136250 -233774 -66611 398181 -82267 -260082
10612b60082m6621h7855c7049j12314A60562b21865J05953k14948A20474a93795
$$ -260082 -306703 -87855 -37049 -149363 160562 -221865 -115912 -330860 120474 -193795
10601A21301B1577Q2577a90464N0731M8601a2464j83696E4073F987M6131b31481
$$ 121301 21577 104154 -190464 -139733 -91132 -12464 -196160 54073 6987 53118 -231481
10589c26349F1231b33241J06974A42736a3355A83906a0734j77443M7463A09947
$$ -326349 61231 -233241 -126267 142736 -13355 183906 -10734 -188177 -140714 109947
10578c6397j09450B1643a71277J1210k1242b3495F6000b12533i0243j44061J05519
$$ -36397 -145847 21643 -171277 -160067 -181309 -23495 66000 -212533 -90243 -234304 -128785
10567a28785C0999J81795b08335i5620F7958R8976E4471a59590a236F2348r397
$$ -128785 30999 212794 -208335 -95620 67958 166934 54471 -159590 -1236 62348 52951
10556E2951b21799I9843b65248f5186j20616A57799b2062A81802c04461E0567
$$ 52951 -221799 99843 -265248 -65186 -185802 157799 -22062 181802 -304461 50567
10545a90201f0664k4827M2551a1972m5190A25065c08752A14738a16502b0765d539
$$ -190201 -60664 -85491 -42940 -11972 -57162 125065 -308752 114738 -116502 -20765 -4539
10533a42407k1964A12102d70067b21964I7255K3171J6062h5462n9717A92296r4034
$$ -142407 -164371 112102 -470067 -221964 97255 120426 136488 -85462 -145179 192296 98262
10522I8262i1324o7059O0512p765M3364r2029k3339r0236d0730A78263A881K00516
$$ 98262 -91324 -158383 -97871 -105636 -62272 -154301 -177640 -267876 -40730 178263 1881 202397
10510B02397c0457C5188b23359i9326N304L5900B8334d38317P5320a25261E493
$$ 202397 -30457 35188 -223359 -99326 -94022 -58122 28334 -438317 -362997 -125261 5493
10498B9463e8885k45390A52534g6058k42918J45504A28832g7366k00856D5116
$$ 29463 -58885 -304275 152534 -76058 -318976 -173472 128832 -77366 -278222 45116
10487i925G2333C4863a87209C87182A69659b1318n5487A66458h5373E3003d0522
$$ -9925 72333 34863 -187209 387182 169659 -21318 -76805 166458 -85373 53003 -40522
10475D38517R953B11225K64690l9335j20232a25224C22892J78458c437j64395
$$ 438517 448470 211225 475915 436580 316348 -125224 322892 501350 -3437 -167832
10465a67832B95273j23457b26744d8633A20480a07960c3874n1530j51843A16557
$$ -167832 295273 171816 -226744 -48633 120480 -107960 -33874 -85404 -237247 116557
10454d552B65421a35447N883b6175j08885B667L6934d1086C22640g9173A07734
$$ -4552 265421 -135447 -129564 -26175 -135060 2667 39601 -41086 322640 -79173 107734
10442B45284a35327p3681P8397O823m5744b3495o4211n7196A34245B3894J20667
$$ 245284 -135327 -209008 -130611 -123788 -169532 -23495 -87706 -144902 134245 23894 144561
10431A44561a7366j43072c0905j11025n8656R6041J8367L1527A84533f8k03650
$$ 144561 -17366 -160438 -30905 -141930 -200586 -104545 -86178 -54651 184533 -68 -203718
10420b03718k08162E416O4308J26324j4520n7370K90165j46645g4188D8029a00220
$$ -203718 -411880 5416 69724 196048 181528 124158 414323 267678 -74188 48029 -100220
10408i9038A00507j5005b5286k17233A80481b05891c0812B34765f3217k54851
$$ -99038 100507 85502 -25286 -242519 180481 -205891 -30812 234765 -63217 -318068
10398c18068J56157A42386a82691G9859J10706J4524A6458a25902D1695b77770
$$ -318068 -161911 142386 -182691 79859 190565 205089 16458 -125902 41695 -277770
10387F1773K5059b19590B35320c57488E8322a50255A53024b90243B1411d7589
$$ 61773 86832 -219590 235320 -357488 58322 -150255 153024 -290243 21411 -47589
10376a6560j17943A54902J33301m4218I6587a17936I2131c5265B14277j8642l4383
$$ -16560 -134503 154902 288203 243985 96587 -117936 92131 -35265 214277 195635 161252
10365A61252o8464N82914j99582j93376J29104j79957h896C72501L3864b38181
$$ 161252 92788 675702 476120 282744 411848 231891 -8896 372501 406365 -238181
10354e1310A58034J3523J55308b27019A98132L1231r9896K71738j61607m6390
$$ -51310 158034 171557 326865 -227019 198132 229363 129467 401205 239598 193208
10344A93208K5439p280K51449j67809j00253K2280q434A02979J50044P0198j59964
$$ 193208 218647 211367 462816 295007 194754 217034 208600 102979 253023 323221 163257
10333A63257a86671A82274J05094a7779l333j26592q558C04166C4860M3382K0600
$$ 163257 -186671 182274 287368 -17779 -21112 -147704 -156262 304166 34860 78242 98842
10322I8842M90550B69750m6010b47046J16321C68168j66007a36520N5758A3729
$$ 98842 589392 269750 223740 -247046 -130725 368168 202161 -136520 -80762 13729
10311A62293N17147k92987i4088p1538A50218A1548J00620a39612k18068a6607
$$ 162293 679440 386453 -94088 -165626 150218 11548 112168 -139612 -357680 -16607
10300a00193r6945e7867H5430c43889D383K42045c74124e1178D7306a23920N1180
$$ -100193 -197138 -57867 85430 -343889 4383 246428 -374124 -51178 47306 -123920 -72740
10289g2740j39380a6079m2465j5745b5335a077E8406b37788h8193A37887J0570
$$ -72740 -212120 -16079 -58544 -74289 -25335 -1077 58406 -237788 -88193 137887 148457
10278A48457J4895a44149o6428L0312J1282P7704B557a39277r2585i3395h535
$$ 148457 163352 -144149 -210577 -180265 -168983 -91279 2557 -139277 -231862 -93395 -8535
10266A49384a07351I1225A8161a52756A94716b46371A2983a55181A12279d8549
$$ 149384 -107351 91225 18161 -152756 194716 -246371 12983 -155181 112279 -48549
10255a52894g4286j05638M1529C22575B8158K52769j14658c7831C1649h4583q780
$$ -152894 -74286 -179924 -138395 322575 28158 280927 166269 -37831 31649 -84583 -93363
10244i3363C49411A39209c38920J07437c4257L925H5997a89634B94781a20886
$$ -93363 349411 139209 -338920 -231483 -34257 -30332 85997 -189634 294781 -120886
10233d6627j3682G8292a69434B38998H2506J1790d8884l91154A13372b00088A1499
$$ -46627 -60309 78292 -169434 238998 82506 94296 -48884 -440038 113372 -200088 11499
10221c63503a08439L5119l42067e8988b1462j3423A38799e8545a6640A79326a08319
$$ -363503 -108439 -73320 -415387 -58988 -21462 -34885 138799 -58545 -16640 179326 -108319
10209c34785A9294b12585D0445h0057B60400o6347H2791a02660d6066O020A0605
$$ -334785 19294 -212585 40445 -80057 260400 194053 82791 -102660 -46066 -40046 10605
10197e8000A12718a36362A84498g3445m413j8190j66931h9212k54288N8252D2670
$$ -58000 112718 -136362 184498 -73445 -77858 -96048 -262979 -89212 -343500 -285248 42670
10185b22560J03932j49013c4625B05403C6525a24984G9800O4271I821K09786d94478
$$ -222560 -118628 -267641 -34625 205403 36525 -124984 79800 144071 9821 219607 -494478
10173A75612B6163a9568A03441e05091C2892b92919J42152o675A83509b22872
$$ 175612 26163 -19568 103441 -505091 32892 -292919 -150767 -157442 183509 -222872
10162c15390m9200F8819j3577f2511l9739l4368k28787A1078J94192a91873B8599
$$ -315390 -364590 68819 55242 -62511 -102250 -136618 -365405 11078 205270 -191873 28599
10150B30376a52208H3085b4364k0299D4005N6945C9085A9394h466F3360d2634
$$ 230376 -152208 83085 -24364 -44663 44005 100950 39085 19394 -8466 63360 -42634
10138f187j8023A02206h1286p0622C30782b29887Q1624j69790A36564b2575j49562
$$ -6187 -24210 102206 -81286 -151908 330782 -229887 -148263 -318053 136564 -22575 -172137
10127a72137B32180E4964e6676l1835K6774B7929f3933j97949G216a97684d2598
$$ -172137 232180 54964 -56676 -88511 -61737 27929 -63933 -261882 7216 -197684 -42598
10115f4265K0640j02681H4844b0049i582k45147B8260J15667a92727k33443J98086
$$ -64265 -43625 -146306 84844 -20049 -9582 -254729 28260 143927 -192727 -426170 -228084
10104b28084b6570k13871o866k258p9296d8527k20396d7337K0987k03004A96410
$$ -228084 -26570 -240441 -247307 -249565 -328861 -48527 -268923 -47337 -26350 -229354 196410
10092c0312j47495k9722M7165B3093b24985O0725I3661N0333k8005K69831A00757
$$ -30312 -177807 -207529 -160364 23093 -224985 -164260 93661 143994 115989 385820 100757
10080B35207A9372a9692l10063C49279i7030m2732c4044j65158H8474c9356j65384
$$ 235207 19372 -19692 -329755 349279 -97030 -139762 -34044 -199202 88474 -39356 -204740
10069b04740k5034M7966Q9722A2493a56735f9392J4641j27376B27950a62911N1501
$$ -204740 -229774 -181808 -92086 12493 -156735 -69392 -54751 -182127 227950 -162911 -111410
10058a11410C08684a09257b2259N957n3365j272H1095f6140k79535C9345K06254
$$ -111410 308684 -109257 -22259 -16302 -69667 -70939 81095 -66140 -345675 39345 245599
10047B45599c92170a69315B40281E5449a28146H857a57403A03332b70310i3971
$$ 245599 -392170 -169315 240281 55449 -128146 8857 -157403 103332 -270310 -93971
10036i5046j4671b5560H7712J302F153a38283q7101a0479m02826A47575d19939
$$ -95046 -109717 -25560 87712 89014 6153 -138283 -225384 -10479 -413305 147575 -419939
10024a60035D30761C7471A3512M2033b6367D08536A55634Q9596D9002c73328R6783
$$ -160035 430761 37471 13512 55545 -26367 408536 155634 245230 49002 -373328 -276545
10013b76545d7760i697j49342B4173b76800C20530q3317a35026p2651a9163k65007
$$ -276545 -47760 -9697 -159039 24173 -276800 320530 237213 -135026 -207677 -19163 -284170
10002b84170J34259O3211l23523B335J68291h5690A88443M0466F8330a79706e3215
$$ -284170 -149911 -86700 -410223 2335 170626 -85690 188443 228909 68330 -179706 -53215
9990a3143l141D2918c93504A85400a99763b9970H7356a12404g993j75207j84248
$$ -13143 -16284 42918 -393504 185400 -199763 -29970 87356 -112404 -7993 -183200 -367448
9979c67448a40724k69801J88996a9331B29932B6057b3611q9484n0977M8941q8636
$$ -367448 -140724 -410525 -221529 -19331 229932 26057 -23611 -113095 -164072 -115131 -203767
9968b03767A93667b61744j28244g3664C0887L0617J49429a517j03525I7379b0290
$$ -203767 193667 -261744 -389988 -73664 30887 61504 210933 -1517 -105042 97379 -20290
9956a83593k37728D3956J15415B4390i8006c2487H8953b0694j35419j4769C7191
$$ -183593 -421321 43956 159371 24390 -98006 -32487 88953 -20694 -156113 -170882 37191
9944D3547a44131A59021j5662B4863b17761Q3814a5726B11968b86815A47977I49
$$ 43547 -144131 159021 143359 24863 -217761 -133947 -15726 211968 -286815 147977 949
9932c218k73403E9604a98564D3175d3337F3416d9526l1974j86513A62382G2470
$$ -3218 -276621 59604 -198564 43175 -43337 63416 -49526 -81500 -268013 162382 72470
9920c19561a45266b5788A29620h7767K1820q1125A41423b27064q9411A39923d89796
$$ -319561 -145266 -25788 129620 -87767 -65947 -147072 141423 -227064 -316475 139923 -489796
9908a79085j21151D2916O602b3460k94641a20207K0655A0294b24486r4988A83646
$$ -179085 -300236 42916 49518 -23460 -318101 -120207 -99552 10294 -224486 -319474 183646
9896F3582b9172A44956c34441a34793A07268g9627j21561k722K3657r0137O6940
$$ 63582 -29172 144956 -334441 -134793 107268 -79627 -201188 -203910 -180253 -270390 -203450
9885b03450o5176f2537j75075a10024J7184B6185K3227a04343A13552a07758j73813
$$ -203450 -268626 -62537 -237612 -110024 -92840 26185 49412 -104343 113552 -107758 -281571
9874b81571a22796B9975a43958c2883j61896g1184p4163q099n1235B24727C4500
$$ -281571 -122796 29975 -143958 -32883 -194779 -71184 -145347 -153446 -204681 224727 34500
9862G6328d7505j1281B96908d6528p5626A28802b8312F4503b07079G3348B098
$$ 76328 -47505 -58786 296908 -46528 -122154 128802 -28312 64503 -207079 73348 2098
9850b13128A22205q610K2912a43039o2198d2791j42738B88903b0453r1090B5219
$$ -213128 122205 113595 136507 -143039 -205237 -42791 -185529 288903 -20453 -111543 25219
9838b15919a00209C09900c34719k4824I74J93307a5277j34293o8730A66460a02227
$$ -215919 -100209 309900 -334719 -359543 974 194281 -15277 -149570 -218300 166460 -102227
9826a3971o5546C9612J07887n2105b34730J13896I132L0285c02239a19583j88554
$$ -13971 -79517 39612 147499 95394 -234730 -120834 9132 39417 -302239 -119583 -308137
9815c08137H0502f3339B1731a16060L6985j485o1703B7906c45727e2106a9043
$$ -308137 80502 -63339 21731 -116060 -79075 -80560 -142263 27906 -345727 -52106 -19043
9803a13088H5995G364b69885j4928J02908P7787r5718F5194a7312A33674O1060
$$ -113088 85995 7364 -269885 -284813 -181905 -104118 -199836 65194 -17312 133674 194734
9792A94734d03958J91775I2881a85160e5590j92293R2645k39023A90663K52152
$$ 194734 -403958 -212183 92881 -185160 -55590 -247883 -155238 -394261 190663 442815
9782D42815i3351A63300a50979C6783a24262A44172b36211A66220P4902i7404
$$ 442815 -93351 163300 -150979 36783 -124262 144172 -236211 166220 241122 -97404
9771A72307d14866b6953l9696q4790I5363c66352J15259f2820A6717a94119j06661
$$ 172307 -414866 -26953 -66649 -151439 95363 -366352 -251093 -62820 16717 -194119 -300780
9760c00780A14052a55366c1922A3659P6203b7305k65704j21889b2447l0726k85232
$$ -300780 114052 -155366 -31922 13659 89862 -27305 -293009 -414898 -22447 -53173 -338405
9749c38405i1473n6376d1075B0082a49668I9584e45262d8458A35669h2417j06089
$$ -338405 -91473 -147849 -41075 20082 -149668 99584 -545262 -48458 135669 -82417 -188506
9738a88506l00026A84152m3441K48410a58067L7631B5462i5721A61727E6142L8396
$$ -188506 -488532 184152 140711 389121 -158067 -120436 25462 -95721 161727 56142 94538
9727I4538Q0080J08641e8560j1507c631I2880c48248K2021R2276A02349K29657
$$ 94538 174618 283259 -58560 -70067 -3631 92880 -348248 -326227 -233951 102349 332006
9716C32006C5811a84074H8145K31375f3536A3404a29069c6315A68843a11807E3820
$$ 332006 35811 -184074 88145 319520 -63536 13404 -129069 -36315 168843 -111807 53820
9704A35578g722I9048a15858d2983k2087B3905a27568b7531p4933k47360N9734
$$ 135578 -7722 99048 -115858 -42983 -65070 23905 -127568 -27531 -102464 -349824 -290090
9693b90090A00928o404b91664B5419J00016a94956I296g5255m61232b50541A33441
$$ -290090 100928 94524 -291664 25419 125435 -194956 9296 -75255 -536487 -250541 133441
9681b17364M4058L4141K3659e4977j56258b6131k82015a6491C36682a71992N3741
$$ -217364 -173306 -139165 -115506 -54977 -211235 -26131 -308146 -16491 336682 -171992 -118251
9670a18251f281l9891G1486J71601J14986A08904b13754K2781e694k42809d4890
$$ -118251 -6281 -46172 71486 243087 358073 108904 -213754 -190973 -5694 -248503 -44890
9658a02468B00103a13394k19448M9429N4312q845d4465C54703a19987G953d16937
$$ -102468 200103 -113394 -332842 -283413 -229101 -237946 -44465 354703 -119987 7953 -416937
9646a06868G9381C6797K30592A12228e7779l40483a24800k91993A13093L221J23257
$$ -106868 79381 36797 267389 112228 -57779 -398262 -124800 -416793 113093 116314 239571
9635B39571D4915e68631K82345R1282j09882J25605P6570l0288F4792a3121C8013
$$ 239571 44915 -568631 -286286 -195004 -304886 -179281 -102711 -132999 64792 -13121 38013
9623A11746a74262o4518F4202h3398R22E3758P2466R9290b04596h0179j97070
$$ 111746 -174262 -238780 64202 -83398 -82476 53758 126224 225514 -204596 -80179 -277249
9612b77249A63572J26514f4213m1209j30185k7417J10824K6518B2877c4814B13144
$$ -277249 163572 290086 -64213 -105422 -235607 -263024 -152200 -125682 22877 -34814 213144
9600c85012f0968m68028A12334b13152J02641q470c3192H3176b6682A51743a70379
$$ -385012 -60968 -528996 112334 -213152 -110511 -118981 -33192 83176 -26682 151743 -170379
9588i3772B5539c2536k49356a17097A44751b33673f6116G7004g0403O132q5831
$$ -93772 25539 -32536 -281892 -117097 144751 -233673 -66116 77004 -70403 -64271 -150102
9577a50102m6538j78893b3813l22838E9772R804f5374A34240o4538b80833h2421
$$ -150102 -196640 -375533 -23813 -346651 59772 69576 -65374 134240 69702 -280833 -82421
9565C3492a70294f598p2714D203K39502a31057l11410E9179a54292C9924R0133
$$ 33492 -170294 -6598 -79312 4203 243705 -131057 -442467 59179 -154292 39924 130057
9554A30057a47064j15845h6857o8558N1880j70409J10378l2281I6759k2944d39314
$$ 130057 -147064 -262909 -86857 -155415 -103535 -273944 -163566 -195847 96759 73815 -439314
9542a0807n2245K2565C7195a07055o3827G7893a21059j1751k227L6858j27491
$$ -10807 -63052 -40487 37195 -107055 -170882 77893 -121059 -132810 -135037 -98179 -225670
9531b25670B16263E3642a40390o6788A6707a02892B11622a63841j59029h2344
$$ -225670 216263 53642 -140390 -207178 16707 -102892 211622 -163841 -322870 -82344
9520A60915a60759k70268C2163K1002c21217C494g2199n4547C61219c4236H7765
$$ 160915 -160759 -431027 32163 53165 -321217 3494 -72199 -126746 361219 -34236 87765
9508D552b16838A17415J02586f6791F7237i4165A67506c53161Q2123M8885p3731
$$ 4552 -216838 117415 220001 -66791 67237 -94165 167506 -353161 -271038 -222153 -295884
9497b95884A67392i5466A36604o2225c35943R5456A32634c3334q4610j93380a19723
$$ -295884 167392 -95466 136604 74379 -335943 -240487 132634 -33334 -117944 -311324 -119723
9485a54752E2887a14861B18201a56093G5217A6589O4727b18971O4307J8804A2818
$$ -154752 52887 -114861 218201 -156093 75217 16589 81316 -218971 -154664 -135860 12818
9473b0313o083j93051B18202k3324a52906q1154j00376a39068C5700b12416k04923
$$ -20313 -26396 -219447 218202 194878 -152906 -234060 -334436 -139068 35700 -212416 -417339
9462d17339Q6949b1658D9252L9848h2344k134k537L0489k31948M9419a3591F2294
$$ -417339 -330390 -21658 49252 89100 -82344 -84478 -87015 -56526 -288474 -239055 -13591 62294
9449h4935A91717b43576L1469C6249b04846A21665g5776C3636J77456a41398A17205
$$ -84935 191717 -243576 -212107 36249 -204846 121665 -75776 33636 211092 -141398 117205
9437A84417a51521C81943j81494H3950b4319k49263A17137c35675a51444e1031
$$ 184417 -151521 381943 200449 83950 -24319 -273582 117137 -335675 -151444 -51031
9426b66752A78687F6704d17776q359J60973i3970j44072n0784N7358k6896f1547
$$ -266752 178687 66704 -417776 -426135 -265162 -93970 -238042 -288826 -231468 -258364 -61547
9414B06981c80822A96454a28813c3099k476l27486a58488k57236e7379I2085a77811
$$ 206981 -380822 196454 -128813 -33099 -35575 -363061 -158488 -415724 -57379 92085 -177811
9402a02384M6251j19780k34515A391a28627M976B63659f2647a665A32167a90077
$$ -102384 -56133 -175913 -410428 1391 -128627 -123651 263659 -62647 -1665 132167 -190077
9390d5171j29820A89515a43326j18487E738O9989d7127b0618j85207B10555h9033
$$ -45171 -174991 189515 -143326 -261813 5738 75727 -47127 -20618 -205825 210555 -89033
9378b00924r6843J42472A4912J10377i4661c6419m5805o3485j272E9434K10128
$$ -200924 -297767 -155295 14912 125289 -94661 -36419 -82224 -145709 -146981 59434 269562
9367B69562i298l0644g345j79333h5887D739J06929a06767k7951B91229f6083
$$ 269562 -9298 -39942 -7345 -186678 -85887 4739 111668 -106767 -134718 291229 -66083
9355b608B8134C026Q3773b49691a22445A9468a27456j39144A28188b51470F8550
$$ -2608 28134 3026 86799 -249691 -122445 19468 -127456 -266600 128188 -251470 68550
9343a94262K5562P9136p8394C95240a23482K37L5747A18431M0732b48610H1253
$$ -194262 -168700 -89564 -167958 395240 -123482 -123245 -87498 118431 159163 -248610 81253
9331b48617A157P1921E767g9384I8394m0335Q0523C5317b7113j32571M6501E17
$$ -248617 1157 73078 5767 -79384 98394 58059 138582 35317 -27113 -159684 -113183 517
9318d7810j73140F3467d81025a1258A35553g5192j8505k13619a03469K8738C20807
$$ -47810 -220950 63467 -481025 -11258 135553 -75192 -93697 -307316 -103469 -74731 320807
9306c2579k57363p1180B36028b68757A23085a1390k6262l09405R5960C8336b83812
$$ -32579 -289942 -361122 236028 -268757 123085 -11390 -37652 -347057 -251097 38336 -283812
9294A05257h7170m6728r5030j70034J64072M7325G056R4631O8966g3634J3185
$$ 105257 -87170 -133898 -228928 -398962 -234890 -187565 7056 101687 170653 -73634 -60449
9283f0449A09207c51624B09833a78451k52657a42333j1930O5261j6168A76941
$$ -60449 109207 -351624 209833 -178451 -431108 -142333 -154263 -89002 -105170 176941
9272b86789J01796k8054a1917j3894k66688A04206P0784C9923b7668R624k39506
$$ -286789 -184993 -213047 -11917 -25811 -292499 104206 174990 39923 -27668 -18044 -257550
9261b57550A3745a44675e0358G9518N6260a79827A46416i1357O211A92282a75064
$$ -257550 13745 -144675 -50358 79518 135778 -179827 146416 -91357 -85146 192282 -175064
9249d21571B5519b26212h7139g003j01348m4552c3070G3345b06988G4944C1115
$$ -421571 25519 -226212 -87139 -7003 -108351 -152903 -33070 73345 -206988 74944 31115
9237A21677E085J29888a91157A48590O9027d6145C92073b31027J04570b5695A1683
$$ 121677 5085 134973 -191157 148590 217617 -46145 392073 -231027 -126457 -25695 11683
9225b12559Q9984b5652j81065i1927k58162c8940A42272a52789k406e2705B22755
$$ -212559 -122575 -25652 -206717 -91927 -350089 -38940 142272 -152789 -155195 -52705 222755
9213b68176C3432J5229b08735A28642h8295A6116a04469j535j50571d2535l99833
$$ -268176 33432 48661 -208735 128642 -88295 16116 -104469 -106004 -256575 -42535 -442368
9202d42368J02184J24867B01753b854I4610Q0979c06028Q736J43183j59109g7947
$$ -442368 -340184 -215317 201753 -2854 94610 175589 -306028 -297292 -154109 -313218 -77947
9190b5808A44359a15049c5648k1728B32281Q1265g4486A62815c43539f1894n3970
$$ -25808 144359 -115049 -35648 -57376 232281 313546 -74486 162815 -343539 -61894 -115864
9179a15864C32433G4555a78026e0435l25523a03891k483p2218C67551D3001i559
$$ -115864 332433 74555 -178026 -50435 -375958 -103891 -106374 -178592 367551 43001 -9559
9167A52809C1272a49545j69161A73005L5174i9720d8197J9383k80435J02754O1963
$$ 152809 31272 -149545 -318706 173005 208179 -99720 -48197 -28814 -309249 -206495 -144532
9156a44532l4224A48573e1979A88847F070c99756b0442A9527f440j19499p8547
$$ -144532 -178756 148573 -51979 188847 6070 -399756 -20442 19527 -6440 -125939 -204486
9145b04486m6508K7540N7496E8118a57655C0772a16153A22233b07772B33765c77643
$$ -204486 -250994 -223454 -165958 58118 -157655 30772 -116153 122233 -207772 233765 -377643
9133a55706M3406C7570d76282K13119j64461B7847N3925n973b09741r3364J0974
$$ -155706 -112300 37570 -476282 -263163 -427624 27847 81772 75799 -209741 -303105 -292131
9122b92131J11573f4929o4472B12994A1843a56381E534J64209a16937A42230b8409
$$ -292131 -180558 -64929 -129401 212994 11843 -156381 5534 169743 -116937 142230 -28409
9110g1925p9422F9037f5416B4031K25845B1631K21950R378k3224d54345b13336
$$ -71925 -151347 69037 -65416 24031 249876 21631 243581 252959 229735 -454345 -213336
9098b72435A26845J18393O0970h9000k7522n3342B30153a2437m03535a42993A97666
$$ -272435 126845 245238 306208 -89000 -116522 -169864 230153 -12437 -415972 -142993 197666
9086g1535L4220A65880F3095c5027B30389C459c0448j37971B04285l4922G3252
$$ -71535 -37315 165880 63095 -35027 230389 3459 -30448 -168419 204285 169363 73252
9074a17391m8497G6217P4565d59025a18213K959r4996B26935a19000J4711D0480
$$ -117391 -165888 76217 150782 -459025 -118213 -115254 -210250 226935 -119000 -104289 40480
9062b50421d5666k20324d1261q9784N6380A20230a65582b6600r9510p9764P5123
$$ -250421 -45666 -265990 -41261 -131045 -74665 120230 -165582 -26600 -126110 -205874 -130751
9051a30751C28484b45646h0383r6022j32454G3606N8562n8207J1233J18335g980
$$ -130751 328484 -245646 -80383 -176405 -308859 73606 132168 73961 85194 203529 -7980
9039A99431c499B46438I2217b51136A03236f414j97895E092b214j61681A03278
$$ 199431 -3499 246438 92217 -251136 103236 -6414 -204309 5092 -2214 -163895 103278
9027d82525B54071a9227A77210a78479F5103b30329C4385c46928C71642a27237
$$ -482525 254071 -19227 177210 -178479 65103 -230329 34385 -346928 371642 -127237
9016C03131H0375K63989F3569k9653b18761E3009c7838A70638f3791a1329r8980
$$ 303131 80375 344364 63569 33916 -218761 53009 -37838 170638 -63791 -11329 -110309
9005a10309q9265c4860A51273b33406B5837Q1084a03944L602l7931A06793B19
$$ -110309 -199574 -34860 151273 -233406 25837 106921 -103944 -100342 -138273 106793 219
8993A15579C7949b3436A37512J9047d64638B79556i771j11012A61947b05978B79004
$$ 115579 37949 -23436 137512 156559 -464638 279556 -9771 -120783 161947 -205978 279004
8981A0824a31377A51112E5108a99414A88934E0176a98159L8350O50F1343h0725
$$ 10824 -131377 151112 55108 -199414 188934 50176 -198159 -159809 -159159 61343 -80725
8969A82982a44232j5961D3734K75097B5906M2032a53402g4342q8743E5300a0103
$$ 182982 -144232 -160193 43734 318831 25906 67938 -153402 -74342 -163085 55300 -10103
8957c12615A1137M8213g3740n5834I9683d9961l92967J73739f1235K1945j63825
$$ -312615 11137 59350 -73740 -129574 99683 -49961 -442928 -269189 -61235 -39290 -203115
8946b03115j83840J21274n8918f4607j6861j04692Q664A9712N6673a94098f1801
$$ -203115 -386955 -265681 -324599 -64607 -81468 -186160 -177496 19712 76385 -194098 -61801
8934c56340a9855q1022C39376q5695A7248h224m2773B22295L0576i8626c4362
$$ -356340 -19855 -100877 339376 253681 17248 -8224 -50997 222295 252871 -98626 -34362
8922B80733M0501K23973J550822M362468M581671D806717A433693F97459B01048
$$ 280733 321234 545207 2096029 6458497 11040168 4806717 1433693 697459 201048
8912A05639K41229a2952A85528b1554A37411i3767A88460L07466A41168i2310
$$ 105639 346868 -12952 185528 -21554 137411 -93767 188460 495926 141168 -92310
8901e842k91256i4396f742k64669B22883a5414A07722a51864o0490a4066A9975
$$ -5842 -297098 -94396 -6742 -271411 222883 -15414 107722 -151864 -212354 -14066 19975
8889d09231C4567g8890q9795o8026G7127k013d06292a38539E8301b22241F2471
$$ -409231 34567 -78890 -168685 -236711 77127 75114 -406292 -138539 58301 -222241 62471
8877H0425b71140j83925C41127c32157G0393B5357i730j87081C680b71715b8956
$$ 80425 -271140 -455065 341127 -332157 70393 25357 -9730 -196811 3680 -271715 -28956
$$ [...]
##END NTUPLES=NMR SPECTRUM
##END=
