
##TITLE=AC1363_CENAH12181_7160574_kADSKywJlK
##JCAMPDX= 6.0         $$ Bruker NMR JCAMP-DX V2.0
##DATA TYPE= NMR SPECTRUM
##DATA CLASS= NTUPLES
##ORIGIN= BRUKER
##OWNER= Administrator
$$ 1.72 TOPSPIN		Version 2.1
$$ 2012-11-30 23:11:48.568 -0500  Administrator@X
$$ Compression mode = diff/dup
##.OBSERVE FREQUENCY= 400.02188249412
##.OBSERVE NUCLEUS= ^1H
##.ACQUISITION MODE= SIMULTANEOUS (DQD)
##.ACQUISITION SCHEME= undefined
##.AVERAGES= 64
##.DIGITISER RES= 22
##SPECTROMETER/DATA SYSTEM= spect
##.PULSE SEQUENCE= noesygpps1d.comp
##.SOLVENT NAME= COFFEE_meoh
##.SHIFT REFERENCE= INTERNAL, COFFEE_meoh, 1, 14.96293
##AUDIT TRAIL= $$ (NUMBER, WHEN, WHO, WHERE, PROCESS, VERSION, WHAT)
$$ ##TITLE= Audit trail, TOPSPIN		Version 2.1
$$ ##JCAMPDX= 5.01
$$ ##ORIGIN= Bruker BioSpin GmbH
$$ ##OWNER= Administrator
$$ $$ E:\/data/COFFEE/nmr/AC1363_CENAH12181_7160574_kADSKywJlK/12/pdata/1/auditp.txt
$$ ##AUDIT TRAIL=  $$ (NUMBER, WHEN, WHO, WHERE, PROCESS, VERSION, WHAT)
(   1,<2012-11-30 23:11:42.103 -0500>,<Administrator>,<X>,<go>,<TOPSPIN 2.1>,
      <created by zg
	started at 2012-11-30 23:00:10.446 -0500,
	POWCHK enabled, PULCHK disabled,
       configuration hash MD5:
       86 BA 57 50 F2 9D 5C 9B 26 00 A9 28 5F 66 2E 89
       data hash MD5: 64K
       1D 22 D9 85 73 C3 89 D8 86 E7 0A 4A 21 72 62 86>)
(   2,<2012-11-30 23:11:45.489 -0500>,<Administrator>,<X>,<proc1d>,<TOPSPIN 2.1>,
      <Start of raw data processing
       efp LB = 0.3 FT_mod = 6 PKNL = 1 PHC0 = 0 PHC1 = 0 SI = 128K 
       data hash MD5: 128K
       F8 47 24 A7 4C 1F 41 D6 B9 73 48 07 88 A5 EA EC>)
(   3,<2012-11-30 23:11:46.702 -0500>,<Administrator>,<X>,<proc1d>,<TOPSPIN 2.1>,
      <pk PHC0 = -83.87512 PHC1 = 0 
       data hash MD5: 128K
       E1 F7 4B F0 85 2F A9 70 2E 7B 7E 28 1A 9D EF 03>)
(   4,<2012-11-30 23:11:47.537 -0500>,<Administrator>,<X>,<proc1d>,<TOPSPIN 2.1>,
      <abs ABSG = 1 
       data hash MD5: 128K
       21 F2 70 9F 8E D7 5F DE 3D 25 8B BB 43 E8 FB C9>)
(   5,<2012-11-30 23:11:47.708 -0500>,<Administrator>,<X>,<proc1d>,<TOPSPIN 2.1>,
      <abs ABSG = 2 
       data hash MD5: 128K
       1D 5A 73 5E DB 4D CD F6 98 5F E3 7F 3D CD 03 26>)
(   6,<2012-11-30 23:11:47.880 -0500>,<Administrator>,<X>,<proc1d>,<TOPSPIN 2.1>,
      <abs ABSG = 3 
       data hash MD5: 128K
       0B 4A BF 0E F6 4B AC 21 7E BC 79 51 2E 99 CF CC>)
(   7,<2012-11-30 23:11:48.052 -0500>,<Administrator>,<X>,<proc1d>,<TOPSPIN 2.1>,
      <abs ABSG = 4 
       data hash MD5: 128K
       59 A3 A2 C1 33 BE 45 F6 A7 8A B2 A5 4E 06 A1 A6>)
(   8,<2012-11-30 23:11:48.224 -0500>,<Administrator>,<X>,<proc1d>,<TOPSPIN 2.1>,
      <abs ABSG = 5 
       data hash MD5: 128K
       9F A1 54 20 C8 1B 8C 8A E6 D5 45 EF 87 A0 70 B5>)
$$ ##END=
$$ 
$$ $$ hash MD5
$$ $$ 3C 71 5E 09 8F 3F 88 93 97 99 55 27 2A FF 52 9A
##$RELAX= 
##$RELAX= 
##$RELAX= 
##$RELAX= 
##$RELAX= 
##$RELAX= 
##$RELAX= 
##$RELAX= 
$$ Bruker specific parameters
$$ --------------------------
##$DU= <E:\>
##$EXPNO= 12
$$ [...]
##$TP07= 0
##$TPNAME0= <>
##$TPNAME1= <>
##$TPNAME2= <>
##$TPNAME3= <>
##$TPNAME4= <>
##$TPNAME5= <>
##$TPNAME6= <>
##$TPNAME7= <>
##$TPOAL= (0..7)
0.5 0.5 0.5 0.5 0.5 0.5 0.5 0.5
##$TPOFFS= (0..7)
0 0 0 0 0 0 0 0
##$TUNHIN= 0
##$TUNHOUT= 0
##$TUNXOUT= 0
##$USERA1= <user>
##$USERA2= <user>
##$USERA3= <user>
##$USERA4= <user>
##$USERA5= <user>
##$V9= 5
##$VALIST= <valist>
##$VCLIST= <CCCCCCCCCCCCCCC>
##$VD= 0
##$VDLIST= <DDDDDDDDDDDDDDD>
##$VPLIST= <PPPPPPPPPPPPPPP>
##$VTLIST= <TTTTTTTTTTTTTTT>
##$WBST= 1024
##$WBSW= 4
##$XGAIN= (0..3)
0 0 0 0
##$XL= 0
##$YL= 0
##$YMAX_a= 7937054
##$YMIN_a= -17383312
##$ZGOPTNS= <>
##$ZL1= 120
##$ZL2= 120
##$ZL3= 120
##$ZL4= 120
##$ABSF1= 14.96293
##$ABSF2= -5.595252
##$ABSG= 5
##$ABSL= 3
##$ALPHA= 0
##$AQORDER= 0
##$ASSFAC= 0
##$ASSFACI= 0
##$ASSFACX= 0
##$ASSWID= 0
##$AUNMP= <proc_prof1d_extract.lims>
##$AXLEFT= 0
##$AXNAME= <>
##$AXNUC= <1H>
##$AXRIGHT= 0
##$AXTYPE= 0
##$AXUNIT= <>
##$AZFE= 0.1
##$AZFW= 0.1
##$BCFW= 0
##$BC_mod= 0
##$BYTORDP= 0
##$COROFFS= 0
##$CY= 15
##$DATMOD= 1
##$DC= 0
##$DFILT= <>
##$DTYPP= 0
##$F1P= 0
##$F2P= 0
##$FCOR= 0.5
##$FTSIZE= 131072
##$FT_mod= 6
##$GAMMA= 0
##$GB= 0
##$INTBC= 1
##$INTSCL= 1
##$ISEN= 128
##$LB= 0.3
##$LEV0= 0
##$LPBIN= 0
##$MAXI= 10000
##$MC2= 0
##$MEAN= 0
##$ME_mod= 0
##$MI= 0
##$NCOEF= 0
##$NC_proc= -2
##$NLEV= 6
##$NOISF1= 0
##$NOISF2= 0
##$NSP= 0
##$NTH_PI= 0
##$NZP= 0
##$OFFSET= 14.96293
##$PC= 1
##$PHC0= -83.87512
##$PHC1= 0
##$PH_mod= 1
##$PKNL= yes
##$PPARMOD= 0
##$PPDIAG= 0
##$PPIPTYP= 0
##$PPMPNUM= 2147483647
##$PPRESOL= 1
##$PSCAL= 4
##$PSIGN= 0
##$PYNMP= <proc.py>
##$REVERSE= no
##$SF= 400.020008865697
##$SI= 131072
##$SIGF1= 0
##$SIGF2= 0
##$SINO= 400
##$SIOLD= 131072
##$SPECTYP= <>
##$SREGLST= <1H.CDCl3>
##$SSB= 0
##$STSI= 131072
##$STSR= 0
##$SW_p= 8223.68421052631
##$SYMM= 0
##$S_DEV= 0
##$TDeff= 65536
##$TDoff= 0
##$TI= <>
##$TILT= no
##$TM1= 0
##$TM2= 0
##$TOPLEV= 0
##$USERP1= <user>
##$USERP2= <user>
##$USERP3= <user>
##$USERP4= <user>
##$USERP5= <user>
##$WDW= 1
##$XDIM= 131072
##$YMAX_p= 448299355
##$YMIN_p= -11228
##$CURPLOT= <Network HP LaserJet P1505>
##$CURPRIN= <$Network HP LaserJet P1505>
##$DFORMAT= <normdp>
##$LAYOUT= <+/1D_H.xwp>
##$LFORMAT= <normlp>
##$PFORMAT= <normpl>
##$SURQMSG= 1
$$ End of Bruker specific parameters
$$ ---------------------------------
##NTUPLES= NMR SPECTRUM
##VAR_NAME=  FREQUENCY,     SPECTRUM/REAL,   SPECTRUM/IMAG
##SYMBOL=    X,             R,               I
##VAR_TYPE=  INDEPENDENT,   DEPENDENT,       DEPENDENT
##VAR_FORM=  AFFN,          ASDF,            ASDF
##VAR_DIM=   131072,        131072,          131072
##UNITS=     HZ,            ARBITRARY UNITS, ARBITRARY UNITS
##FACTOR=    0.0627417313425164, 1,          1
##FIRST=     8223.62146879497, -421,         -57302
##LAST=      0,             1371,            -57116
##MIN=       0,             -11228,          0
##MAX=       8223.62146879497, 448299355,    0
$$ Real data points
##PAGE= N=1
##DATA TABLE= (X++(R..R)), XYDATA
$$ [...]
64418 79661 80543 81437 82182 82343 81664 80463 79406 78903 78772 78630 78624 79429 81257 83175 83932 83349 82334 81560
64400 81560 80848 79949 79176 78804 78491 77833 77081 76748 76825 76942 77050 77378 77903 78378 78777 79256 79760 80065 80087 79792
64380 79792 79048 78054 77611 78293 79462 79858 79250 78819 79699 81696 83728 84958 85234 84853 84336 84180 84548 85305
64362 85305 86357 87590 88450 88192 86854 85466 84891 84836 84431 83415 82250 81377 80911 80894 81273 81655 81681 81640
64344 81640 82223 83541 84884 85592 85730 85646 85361 84835 84587 85467 87687 90354 92121 92248 91060 89555 88728
64327 88728 89204 91239 94719 98936 102615 104655 105089 105131 105989 107718 109399 110300 110447 110096 109148 107462 105473
64310 105473 104047 103646 103904 104047 103573 102525 101388 100802 101148 102174 103135 103415 102964 102140 101307 100688 100428
64293 100428 100598 101237 102430 104193 106207 107922 109152 110342 111991 113987 115796 117173 118424 120105 122769
64278 122769 126795 131953 137145 141123 143713 146014 149200 153365 157644 161130 163407 164464 164485 163747 162502
64263 162502 160816 158559 155591 152038 148424 145374 143023 140929 138715 136551 134677 132750 130302 127728
64249 127728 126089 125742 125822 125421 124652 124127 123946 123826 123878 124555 125869 127305 128544 129858 131674 134071 136794
64232 136794 139576 142385 145478 149121 153131 156864 159872 162408 165012 167736 170105 171735 172651 173069 173161
64217 173161 173031 172644 171778 170288 168307 166053 163564 160904 158369 156164 154101 152061 150510 149965 150059 149862
64201 149862 149212 149021 150051 151970 153957 155611 156796 157075 155975 153708 151133 149010 147554 146639 146143
64186 146143 146090 146665 148011 149874 151535 152262 151787 150303 148290 146509 145872 146891 149274 152216 154975 157080
64170 157080 158382 159283 160698 163278 166713 170191 173469 176980 180913 184910 188968 193992 200759 208626
64156 208626 215940 221795 226822 232105 237791 243052 247059 249526 250515 250180 248788 246639 243845 240479 236945
64141 236945 233903 231566 229345 226434 222619 218308 213957 209802 205998 202653 199694 196985 194591 192666
64127 192666 191084 189464 187611 185686 183837 181967 180030 178308 177223 177030 177798 179458 181726 184088 186102
64112 186102 187604 188583 189007 189000 189058 189874 191871 194876 198224 201231 203775 206504 210235 215080 220337 225375
64096 225375 230432 236370 243821 252744 262650 272988 283433 294055 305261 317399 330402 343777
64084 343777 356788 368594 378520 386509 393178 399059 403710 405888 404754 400798 395440 389795 383856 376841
64070 376841 368252 358573 348971 340435 333227 327014 321304 315819 310701 306449 303476 301704 300719 300299 300566
64055 300566 301623 303400 305899 309206 313132 317295 321815 327483 334828 343369 352257 361363 371233 382189
64041 382189 394118 407104 421663 438177 456428 475807 495601 515065 533588 550971 567275
64030 567275 582286 595401 606044 613880 618561 619650 617036 611249 603218 593865 583912 573752 563369
64017 563369 552663 542009 532289 524243 517922 512829 508438 504571 501543 499996 500365 502418 505574 509674
64003 509674 515062 521817 529333 536961 544772 553375 563123 573862 585404 598019 612413 629212 648363
63990 648363 669015 690235 711917 734860 759929 787386 817150 849404 884685 923458 965734
63979 965734 1011027 1058780 1109028 1162614 1220443 1282566 1348348 1417541 1490758 1568950 1653080
63968 1653080 1744518 1845011 1955840 2077638 2211706 2361141 2530184 2722972 2943725 3197851
63958 3197851 3492016 3833195 4228426 4685447 5212569 5817135 6503919 7274465 8127002
63949 8127002 9056751 10056862 11119383 12234950 13391322 14572385 15758247 16925345
63941 16925345 18046287 19091101 20030700 20840605 21502503 22003566 22335148 22491709 22469891
63932 22469891 22268175 21887870 21335087 20622354 19768939 18799793 17743317 16628320 15481203
63923 15481203 14324473 13176870 12054365 10971141 9940014 8972089 8075971 7257099
63915 7257099 6517634 5856804 5271412 4756452 4305817 3912857 3570762 3272918 3013280
63906 3013280 2786492 2587744 2412724 2257808 2120168 1997563 1888032 1789791 1701215 1620807
63896 1620807 1547266 1479586 1416943 1358442 1303177 1250550 1200317 1152121 1105232 1058895 1012852
63885 1012852 967368 922933 880039 839051 800032 762766 727131 693393 662025 633323 607260
63874 607260 583506 561461 540488 520356 501338 483709 467348 452043 437985 425510 414474
63863 414474 404320 394912 386881 380884 376650 373041 369119 365056 361892 360371 360146 360313 360605 361721 364387
63848 364387 368473 373326 378627 384401 390226 395018 397891 399014 399364 399602 399254 397007 391915 384313 375489
63833 375489 366441 357150 347074 335994 324156 311975 299956 288700 278492 269008 259813 251026
63821 251026 243053 235780 228619 221407 214710 209024 204184 199806 195927 192852 190642 189011 187581 185995
63807 185995 183929 181248 178182 175263 173052 171712 170669 168929 166152 163220 161247 160170 159013 157506
63793 157506 156549 156752 157369 157255 156216 154734 152931 150619 148021 145551 143069 140183 137250 135226 134349
63778 134349 133721 132459 130707 129230 128523 128674 129616 130994 131960 131599 129777 127406 125775 125498 126036 126265
63762 126265 125535 124101 122578 121345 120631 120766 121870 123495 125011 126179 127002 127270 126859 126321 126489 127470
63746 127470 128613 129471 130137 130512 130038 128533 126752 125726 125913 127211 129300 131700 133998 136357 139324
63731 139324 142920 146515 149965 154137 159648 165754 171296 176268 181483 187046 192190 196623 200972 205577
63717 205577 209674 212187 212797 211882 209931 207384 204657 201812 198417 194096 189146 184317 180018 175943 171538
63702 171538 166755 162223 158558 155522 152150 147883 143343 139682 137444 136376 136098 136351 136712 136765 136644 136809
63686 136809 137139 136939 136156 135936 137410 140339 143565 146543 149830 154066 159075 164155 168952 173779 179115
63671 179115 184896 190369 194733 197890 200368 202528 204118 204634 203787 201474 197697 192859 187809 183188 178827
63656 178827 174137 168950 163641 158588 153990 150186 147656 146483 146133 145957 145758 145726 146010 146506 147019 147557
63640 147557 148474 150280 153141 156590 159885 162727 165532 168956 173281 178288 183635 189313 195741 203388
63626 203388 212212 221589 230972 240569 251165 263222 276451 290395 305232 321697 340157 360028
63614 360028 380247 400221 420021 439548 457740 472960 484176 491504 495566 496757 495390 492200
63602 492200 488175 483948 479711 475663 472114 469084 466152 462786 458491 452597 444482 434330 423296 412461
63588 412461 401845 390831 379262 367619 356253 345122 334412 324752 316440 308905 301405 293941
63576 293941 286995 280594 274333 268413 264002 262174 262730 264427 266180 267814 269897 273259 278582 286032
63562 286032 295126 305238 316285 328751 343055 359213 377126 396687 417346 437976 457646 476372
63550 476372 494608 512077 527544 539861 548773 554480 556875 555786 551881 546797 542114 538435 535686
63537 535686 533977 533621 534231 534359 532493 528222 521982 513799 502901 488787 472137 454217 435655 416247
63523 416247 395847 375000 354681 335750 318655 303351 289422 276583 265133 255684 248388 242727
63511 242727 238089 234214 230992 228202 225724 223638 221815 219689 216917 214128 212580 212985 215008 217890
63497 217890 221163 224601 227920 230978 234197 238410 244148 251191 258808 266287 273176 279325 284971 290710
63483 290710 296992 303446 308866 312123 313103 312644 311644 310404 308721 306276 302802 298164 292580 286699 281190
63468 281190 276246 271553 266775 261963 257519 253829 250955 248654 246695 245073 243767 242405 240546 238471
63454 238471 237311 237895 239692 241386 242459 243589 245362 247388 249142 251101 254211 258531 263345 268648
63440 268648 275535 284678 295256 306113 317465 330589 345975 362678 379510 396141 412878 430150
63428 430150 448677 469473 492987 518436 544535 570691 597059 623546 649209 672573 692168
63417 692168 706844 716125 720387 720419 716754 709714 700018 688902 677527 666554 656246 646471 636528
63404 636528 625499 613047 599456 584655 567752 548031 526158 503908 482839 463496 445681
63393 445681 429005 413255 398607 385469 373923 363528 353981 345770 339704 335966 334050 333512 334192
63380 334192 335828 338216 341828 347517 355255 363819 372258 381179 392087 405821 422176 440648 460819
63367 460819 482209 504482 527873 552795 578917 605111 630319 653888 674955 692205 704671
63356 704671 712313 715531 714629 710172 703318 695058 685418 674113 661809 649939 639207 629017 618527
63343 618527 607546 596017 583329 568802 552510 534998 516425 496657 476152 456079 437290
63332 437290 419579 402199 384936 368499 353948 341790 331524 322134 313191 305345 299446 295269
63320 295269 291577 287547 283660 280963 279865 280003 280891 282124 283084 283124 282255 281323 281265 282288 283840 285137
63304 285137 285673 285415 284672 283698 282334 280242 277538 274924 272972 271491 269929 268265 267094 266747 266744 266406
63288 266406 265737 265335 265530 266033 266514 267144 268288 269856 271230 271784 271365 270401 269772 270434 272736 276009 279076
63271 279076 281348 283235 285426 288039 290694 293200 295806 298779 302037 305273 308270 310976 313424 315697
63257 315697 317922 320186 322510 324960 327789 331316 335622 340460 345530 350780 356245 361708 366796 371498
63243 371498 376366 382000 388575 396102 404947 415644 428272 442442 457929 474912 493504 513485
63231 513485 534722 557463 581895 607709 634391 661701 689475 717206 744192 770019 794616
63220 794616 818020 840457 862492 884705 907272 930183 953696 978085 1003019 1027638 1051215
63209 1051215 1073234 1092835 1108812 1120367 1127313 1129254 1125119 1113951 1095835 1071718 1042665 1009670
63197 1009670 973840 936212 897530 858647 820896 785582 753184 723595 697068 674284 655376
63186 655376 639514 625859 614483 605827 599539 594409 589556 585283 582563 581929 583123 585672 589395 594223
63172 594223 599832 605778 611897 618262 624798 631353 638262 646339 655897 665990 675107 682554 688792 694443
63158 694443 699438 703225 705382 705736 704170 700708 695724 689854 683630 677258 670691 663893 657150 651085
63144 651085 646157 642061 637893 633083 627918 622985 618454 614273 610800 608592 607493 606494 604810 602719
63130 602719 601021 599916 598887 597587 596364 595731 595651 595601 595237 594754 594627 595179 596422 598166 600179 602339
63114 602339 604728 607621 611320 616001 621718 628463 636115 644319 652610 660757 668906 677259 685656 693686
63100 693686 701215 708684 716715 725462 734383 742641 749736 755844 761554 767202 772461 776725 779890 782551
63086 782551 785330 788248 790992 793556 796210 798917 801230 802883 804119 805275 806405 807547 809032 811146
63072 811146 813699 816377 819408 823385 828394 833806 839180 845012 852278 861453 872317 884667 898865
63059 898865 915541 934941 956720 980398 1005959 1033995 1065270 1100209 1138826 1181020 1226752
63048 1226752 1275952 1328559 1384730 1444732 1508277 1574022 1640075 1705132 1769017 1832100 1894482
63037 1894482 1955865 2015984 2074861 2132631 2189407 2245342 2300596 2355102 2408520 2460533 2510866
63026 2510866 2558540 2601139 2635351 2658596 2669938 2669179 2655466 2627449 2584816 2529068 2462487 2386797
63014 2386797 2303318 2214114 2122289 2030945 1942177 1857161 1776816 1701988 1633164 1570412 1513655
63003 1513655 1462853 1417938 1378877 1345951 1319759 1300631 1288012 1280553 1276796 1275725 1276830 1280004
62991 1280004 1285469 1293518 1304084 1316618 1330481 1345277 1360589 1375651 1389646 1402252 1413529 1423267
62979 1423267 1430786 1435415 1436780 1434555 1428351 1418181 1404668 1388403 1369270 1346801 1321124 1293190
62967 1293190 1263986 1233796 1202282 1169149 1134765 1100336 1067457 1037273 1009959 985037 962069
62956 962069 940931 921573 903895 887873 873566 860955 849972 840674 833118 827047 821952 817446
62944 817446 813323 809242 804791 800062 795822 792775 790847 789421 788051 786693 785451 784427 783684 783010 781849
62929 781849 779830 777338 775195 773798 772887 772162 771599 770932 769299 765962 761292 756630 753045 750399 747640
62914 747640 743811 738681 732632 726211 719810 713633 707796 702407 697529 693105 688980 685130 681842 679511
62900 679511 678083 676817 674871 672182 669526 667535 665867 663584 660195 656019 651573 646928 641774 635905
62886 635905 629531 623254 617755 613258 609215 604773 599694 594641 590395 587038 584091 581248 578667 576622
62872 576622 575180 574282 573893 574022 574694 575854 577171 578055 578174 577918 578114 579202 580928 582874 584948 587243
62856 587243 589670 592005 594155 596187 598166 600075 601847 603385 604640 605774 607040 608406 609494 610089
62842 610089 610525 611339 612675 614305 616094 618060 619997 621499 622526 623592 625112 626801 628027 628628 629020
62827 629020 629530 629946 629845 629101 627863 626241 624250 622013 619690 617174 614154 610684 607440 605082 603391
62812 603391 601426 598664 595654 593327 591917 590859 589693 588708 588625 589906 592465 595942 600018 604473 609084
62797 609084 613713 618638 624606 632207 641139 650487 659984 670576 683312 697957 713339 729055 746174
62784 746174 766018 788829 814065 841640 872335 907095 946403 990346 1039018 1092756 1152135
62773 1152135 1217785 1290095 1369048 1454278 1545160 1640734 1739715 1840649 1941907 2041367 2136348
62762 2136348 2224132 2302463 2369361 2422649 2460101 2480166 2482434 2467524 2436700 2391542 2333623
62751 2333623 2264401 2185508 2099085 2007589 1913287 1818048 1723435 1630651 1540405 1453225 1369917
62740 1369917 1291367 1217878 1149213 1085472 1027398 975392 928591 885510 845453 808783 775825
62729 775825 746045 718502 692716 668760 646732 626483 607833 590819 575640 562433 551067
62718 551067 541111 531988 523249 514700 506336 498293 490941 484846 480354 477250 475053 473717 473731 475361 478020
62703 478020 480721 483038 485366 488369 492592 498574 506725 516809 527978 539726 552528 567166 583753
62690 583753 601925 621778 643918 668529 694968 722391 750175 777449 802819 825093 844036
62679 844036 859945 872672 881473 885697 885196 880082 870488 856694 839243 818839 796153 771672 745623
62666 745623 718194 689980 662028 635140 609361 584449 560684 538707 518618 499827 481996
62655 481996 465658 451537 439525 428680 418092 407510 397273 387861 379512 372105 365417 359455
62643 359455 354337 349774 344987 339408 333301 327471 322452 318219 314540 311274 308329 305614 303103 300781
62629 300781 298527 296161 293639 291061 288556 286253 284322 282835 281665 280705 280135 280233 280928 281799 282539 283201
62613 283201 283945 284854 286156 288335 291786 296365 301385 306062 310032 313696 318105 324252 332302 341663 351856
62598 351856 363007 375377 388863 403425 419770 439073 461902 487879 516547 548253 583845
62587 583845 623661 667132 713380 761913 812526 864628 916997 968275 1017375 1063075 1103465
62576 1103465 1136392 1160649 1176299 1183704 1182715 1173213 1155972 1132382 1103444 1069615 1031557 990521
62564 990521 947890 904769 862070 820497 780356 741825 705548 672508 643086 616611 592055
62553 592055 568847 546814 525829 505939 487484 470669 455195 440653 427052 414551 402883
62542 402883 391503 380213 369224 358712 348764 339752 332207 326159 320962 315987 311308 307574 305379
62529 305379 304780 305236 305962 306540 307217 308441 310167 311945 313637 315655 318317 321330 324212 327008 330272
62514 330272 334461 339614 345521 351933 358662 365793 373910 383793 395664 408888 422672 436987 452459
62501 452459 469286 486677 503533 519397 534270 547702 558690 566594 571670 574431 574833 572376 566704
62488 566704 557867 546382 533415 520546 508740 497629 486239 474316 462504 451427 441227 432011
62476 432011 424089 417503 411848 406856 402802 400117 398887 398938 400127 402336 405445 409455 414341 419649 424629
62461 424629 429017 433377 438404 444216 450625 457721 465754 474643 484087 494088 504954 516806 529395
62448 529395 542369 555350 567769 578972 588654 596916 603763 608685 610844 609572 604615 596072 584318
62435 584318 570015 554072 537387 520560 503849 487465 471757 457042 443402 430832 419483
62424 419483 409529 400947 393777 388466 385461 384430 384417 384946 386530 389926 395340 402612 411592 421857 432464
62409 432464 442616 452398 462417 472932 483714 494466 504758 513758 520647 525317 528143 529181 528145
62396 528145 525167 520916 515781 509529 501999 493637 485050 476456 467927 459843 452682 446518 441045 436051
62382 436051 431779 428942 428442 430814 435767 442445 450302 459585 470900 484588 500691 519273 540527
62369 540527 564708 592180 623408 658628 697515 739297 783249 829097 876994 926963 978216
62358 978216 1029062 1077791 1123640 1166495 1205536 1238591 1263219 1278277 1284242 1282241 1273211 1257929
62346 1257929 1237398 1212820 1185162 1154935 1122527 1088731 1054659 1020982 987567 954260 921906
62335 921906 892008 865322 841300 819116 798599 779768 761995 744395 726851 710057 694549
62324 694549 680250 666964 654789 643877 634264 626139 619814 615076 610886 606177 600873 595738 591223
62311 591223 586772 581394 574644 566786 558181 548842 538665 527857 516914 506224 495851 485661 475603
62298 475603 465961 457438 450877 446593 444055 442445 441434 441132 441393 441831 442682 445079 449940 456939 464991
62283 464991 473437 482237 491280 500342 509821 520735 533581 547590 561496 574783 587873 601359
62271 601359 615472 630160 645244 660427 675497 690725 706903 724866 745097 767865 793568
62260 793568 822636 855115 890604 928694 969235 1011918 1055740 1099193 1140841 1179325 1212830
62249 1212830 1239272 1257405 1267354 1269650 1264205 1250901 1230847 1206057 1177755 1145832 1110337 1072695
62237 1072695 1034824 997586 960840 924742 890225 858240 829208 803303 780650 760965 743461
62226 743461 727513 713193 700885 690467 681096 671722 661789 651600 642102 634095 627545 621829 616655
62213 616655 612390 609324 607032 604902 603051 602167 602512 603605 605003 606964 610034 614353 619698 626007 633440
62198 633440 641933 651092 660677 670999 682603 695668 709873 724825 740410 756677 773526 790679
62186 790679 807913 825143 842186 858581 873785 887585 900199 911931 922786 932557 941366 950110
62174 950110 960195 972706 987763 1004789 1023388 1043920 1067325 1094492 1125698 1160325 1196982
62163 1196982 1234017 1269998 1303658 1333592 1358589 1378424 1393852 1405520 1413327 1417240 1418120 1416948
62151 1416948 1413556 1407022 1397327 1385652 1372904 1358910 1343575 1327966 1313433 1300145 1287276 1274416
62139 1274416 1262131 1251134 1241435 1232306 1222753 1212213 1201132 1190722 1181776 1173940 1166536 1159762 1154505
62126 1154505 1151192 1149481 1149027 1149909 1152274 1156198 1161951 1169800 1179349 1189654 1200228 1211498 1224119
62113 1224119 1238279 1253907 1271052 1289715 1309617 1330431 1352051 1374477 1397733 1422016 1447607
62102 1447607 1474517 1502555 1531772 1562459 1594621 1628001 1662783 1699697 1739169 1780899 1824576
62091 1824576 1870457 1918792 1969234 2021400 2075595 2132297 2191104 2250644 2309411 2366409 2421350
62080 2421350 2474774 2527735 2580887 2633976 2686474 2738246 2789080 2838027 2884017 2926927 2967410
62069 2967410 3005922 3042859 3079551 3118104 3159848 3204461 3250762 3297658 3344119 3388996 3431459
62058 3431459 3471334 3508710 3543623 3576355 3607641 3638186 3668282 3698075 3727776 3757280 3785990
62047 3785990 3813542 3840496 3867940 3896557 3926395 3957370 3989596 4023321 4058830 4096312 4135437
62036 4135437 4175148 4214205 4251997 4288551 4323791 4357116 4387815 4415635 4440679 4462800 4481306
62025 4481306 4495361 4504633 4509443 4510242 4507051 4499629 4488196 4473703 4457227 4439237 4419670 4398623
62013 4398623 4376691 4354569 4332540 4310586 4288964 4268461 4249983 4233980 4220425 4209281 4200757
62002 4200757 4195093 4192425 4192998 4197224 4205181 4216210 4229332 4243938 4259698 4275888 4291339 4305260
61990 4305260 4317760 4329300 4339915 4349250 4357181 4364096 4370480 4376415 4381516 4385261 4387313 4387491 4385455
61977 4385455 4380600 4372356 4360461 4344789 4325071 4301130 4273311 4242334 4208667 4172353 4133462 4092329
61965 4092329 4049187 4003962 3956721 3908058 3858732 3809115 3759298 3709638 3660876 3613625 3567918
61954 3567918 3523355 3479695 3437331 3397151 3359783 3325017 3292162 3260982 3231982 3205696 3182091
61943 3182091 3160906 3142264 3126508 3113534 3102691 3093491 3086168 3081475 3080002 3081745 3086223 3092966 3101926
61930 3101926 3113430 3127778 3145031 3165216 3188565 3215376 3245683 3279309 3316352 3357674 3404849
61919 3404849 3459570 3523056 3596104 3679811 3776263 3888443 4019643 4173082 4352020 4560085
61909 4560085 4801646 5082205 5408392 5787322 6225878 6730620 7307742 7961926 8694129
61900 8694129 9499519 10365934 11272100 12185735 13063434 13853855 14503695 14964989 15202523
61891 15202523 15199798 14961430 14511045 13886119 13131953 12295709 11420922 10543539 9690495 8880296
61881 8880296 8124357 7428542 6794757 6222132 5707617 5246764 4834980 4468201 4142348
61872 4142348 3852748 3594770 3364781 3159850 2976795 2812289 2663910 2530357 2410488
61863 2410488 2302704 2205409 2117504 2038159 1966579 1902180 1844617 1793368 1747616 1706685 1670235
61852 1670235 1637881 1609070 1583579 1561693 1543513 1528341 1515070 1502994 1491981 1482068 1473273 1465651
61840 1465651 1459233 1453902 1449545 1446239 1444081 1442889 1442241 1441765 1441310 1440941 1440926 1441633 1443237 1445555 1448241 1451093
61824 1451093 1454090 1457226 1460493 1464024 1468115 1473099 1479228 1486606 1495127 1504536 1514786 1526460 1540724
61811 1540724 1558559 1579928 1603892 1629757 1658025 1689959 1726365 1767214 1812460 1862592 1917996
61800 1917996 1978332 2043152 2112894 2188692 2271323 2360937 2457768 2562513 2676013 2799214 2933683
61789 2933683 3081617 3245066 3425574 3624895 3845708 4091436 4365800 4672967 5018024
61780 5018024 5407198 5847916 6348820 6919431 7569676 8310111 9152561 10109523 11191791
61771 11191791 12405915 13752525 15224098 16800699 18445224 20101187 21694236 23136862
61763 23136862 24336498 25207540 25685256 25736907 25366375 24611908 23538493 22226799 20761062
61754 20761062 19218816 17664588 16147722 14703190 13353878 12112873 10985071 9968642
61746 9968642 9057260 8242778 7516991 6871891 6299261 5790632 5337742 4933171 4570867
61737 4570867 4246162 3955049 3693447 3457443 3244212 3052203 2880078 2725769 2586825
61728 2586825 2461356 2348155 2245974 2153199 2068377 1990774 1920181 1856292 1798452 1745984 1698551
61717 1698551 1656033 1618109 1584157 1553686 1526673 1503158 1482555 1463760 1446125 1429999 1415966
61706 1415966 1403729 1392205 1380691 1369436 1358870 1348616 1337723 1325682 1312772 1299303 1284944
61695 1284944 1269131 1251974 1234356 1217042 1199929 1182364 1164073 1145544 1127473 1110009 1092752
61684 1092752 1075432 1058379 1042173 1026971 1012414 998269 984927 973090 963021 954296 946277 938648
61672 938648 931529 925294 920424 917351 916189 916564 917822 919469 921348 923373 925224 926470 927052 927453 928260
61657 928260 929663 931524 933754 936255 938562 940032 940568 940664 940527 939668 937823 935717 934151 932633 929760
61642 929760 924942 918902 912436 905579 898338 891355 885316 880290 876177 873251 871701 871121 871099 871895 873904
61627 873904 876849 880168 883881 888350 893421 898586 903805 909375 915084 920375 925432 931244 938307 945956
61613 945956 953292 960122 966621 972544 977214 980060 980900 979988 977940 975350 972360 968836 964929 961027 957153
61598 957153 952861 947749 941599 934066 924974 915113 905975 898367 891793 885508 879508 874139 869380 865121
61584 865121 861607 859088 857507 857069 858622 862823 869343 877546 887567 900007 914912 931829 950660
61571 950660 971664 994747 1019542 1046171 1075185 1106653 1139987 1174769 1211119 1249033 1287902
61560 1287902 1326912 1365515 1403360 1440106 1475461 1509115 1540700 1570109 1597726 1623914 1648400
61549 1648400 1670638 1690578 1708422 1723723 1735510 1743390 1747762 1748756 1745662 1737689 1724782 1707565
61537 1707565 1687142 1665114 1642927 1620834 1598182 1575172 1553503 1534702 1518531 1503827 1490330
61526 1490330 1478814 1469788 1463047 1458356 1455851 1455819 1458794 1465823 1477921 1495207 1517158 1543803 1576110
61513 1576110 1615137 1661387 1715166 1777056 1847837 1928386 2020001 2124522 2243884 2379709 2533421
61502 2533421 2706443 2900056 3115220 3352680 3612850 3894951 4195846 4509433 4826913
61493 4826913 5137471 5428908 5688306 5903286 6063836 6163872 6201615 6179051 6101403 5976722
61483 5976722 5814737 5625130 5416586 5197156 4974532 4755235 4543804 4343264 4156076
61474 4156076 3984196 3828654 3689888 3568443 3464668 3377897 3306739 3250347 3208804 3182161
61464 3182161 3169651 3170007 3181964 3204313 3235951 3276123 3324109 3378401 3436595 3496308 3555880 3614163
61452 3614163 3670225 3723520 3773928 3821350 3865730 3907637 3948352 3989038 4030313 4072875 4117939
61441 4117939 4166510 4218586 4273497 4330683 4389651 4449478 4508881 4566615 4621359 4671467 4715232
61430 4715232 4751370 4778959 4797109 4805057 4802425 4789164 4765532 4732381 4691160 4643280 4589809 4532109
61418 4532109 4472346 4412893 4355555 4301771 4253093 4210751 4175091 4146103 4124240 4109959 4102730
61407 4102730 4101311 4104841 4112737 4123579 4135139 4145715 4154504 4160389 4161401 4156025 4144420 4127860 4107604
61394 4107604 4084930 4061670 4039905 4021357 4007682 4001196 4004814 4021336 4053102 4102107 4170023 4258166
61382 4258166 4367807 4500457 4657768 4841316 5052542 5292288 5559849 5852606 6166749
61373 6166749 6497715 6839119 7181419 7512381 7819100 8089565 8313052 8480635 8586492
61364 8586492 8628915 8610055 8534897 8410197 8243318 8040865 7807974 7548990 7268897 6973972
61354 6973972 6670942 6365559 6061983 5763381 5472795 5193189 4926902 4675528 4440451
61345 4440451 4223088 4024317 3844008 3681487 3536313 3408289 3296950 3201542 3121476 3056397
61335 3056397 3005691 2968298 2943103 2929325 2926470 2934138 2951873 2978886 3013853 3055232 3101912 3153308
61323 3153308 3208733 3266882 3326063 3384792 3442165 3497843 3551678 3603177 3651347 3695377 3735476
61312 3735476 3772664 3807656 3840321 3870345 3897817 3922720 3944239 3961206 3973124 3980231 3982517 3979145
61300 3979145 3969014 3951603 3927195 3896518 3860379 3819385 3773817 3723693 3668971 3609673 3546072
61289 3546072 3479080 3410421 3342052 3275336 3210991 3149867 3093274 3042352 2997530 2959021 2927467
61278 2927467 2903480 2886556 2874963 2866830 2861019 2856905 2853752 2850581 2846409 2840348 2831735 2820379 2806576
61265 2806576 2790642 2772672 2752962 2732482 2712543 2694065 2677464 2663302 2652740 2647332 2648665 2658287
61253 2658287 2677797 2708746 2752468 2809965 2881868 2968576 3070523 3188087 3320850 3466806
61243 3466806 3622378 3783125 3944073 4099334 4241905 4364163 4458629 4518434 4537924 4513845
61233 4513845 4446458 4339681 4200147 4035871 3855062 3665317 3473303 3284688 3103921 2933873
61223 2933873 2775994 2631087 2499745 2381867 2276170 2180834 2094799 2018155 1951199 1893427
61213 1893427 1843559 1800324 1762959 1731060 1704156 1681619 1663006 1648410 1638279 1632812 1631640 1634161
61201 1634161 1640040 1649278 1661911 1677679 1695724 1714480 1732151 1747547 1760365 1770530 1777673 1781626
61189 1781626 1783071 1783058 1781908 1779085 1774128 1767162 1758415 1747795 1735123 1720404 1703669 1684999 1664966
61176 1664966 1644609 1624663 1605086 1585610 1566341 1547383 1528160 1507683 1485489 1461966 1437765
61165 1437765 1413118 1387711 1360930 1332292 1301910 1270579 1239274 1208598 1178751 1149853 1121983
61154 1121983 1095049 1068925 1043673 1019329 995451 971197 945964 919830 893352 867145 841691
61143 841691 817273 793996 771975 751611 733575 718376 705913 695513 686498 678826 673155 670123
61131 670123 669550 670552 672415 675056 678554 682759 687753 694267 702928 713233 723928 734512 745760
61118 745760 758650 773326 789355 806408 824252 842493 860842 879400 898297 917259 935895
61107 935895 954111 971746 987979 1001639 1012045 1019064 1022436 1021722 1017083 1009611 1000593 990769 980464
61094 980464 969917 959131 947767 935733 923645 912208 901179 889514 876701 863571 851516
61083 851516 841120 831787 822541 812869 802765 792258 781281 770078 759514 750613 743660 737876 732158
61070 732158 726059 719890 714012 708360 702702 697066 691647 686415 681007 675037 668394 661403 654775 649224
61056 649224 644809 640632 635524 629187 622529 616849 612912 610881 610714 612212 614930 618561 623450 630237
61042 630237 638857 648330 657789 667349 677639 688798 700386 712078 723883 735682 747035 757574
61030 757574 767195 775757 783006 789046 794519 799978 805274 809913 813946 818166 823402 829840 837109 844949
61016 844949 853729 864228 876805 890856 905390 920255 936436 954857 975143 995998 1016745 1038137
61004 1038137 1061610 1088144 1118011 1151334 1188559 1230333 1277061 1328713 1384952 1445309 1509034
60993 1509034 1575089 1642783 1712653 1786402 1865814 1951944 2045443 2147083 2257473 2376675 2504758
60982 2504758 2642791 2793234 2960124 3149905 3372055 3638297 3961412 4355803 4839641
60973 4839641 5436380 6175063 7090529 8222798 9613265 11297095 13291820 15578454 18073299
60964 18073299 20605289 22929784 24796297 26044142 26668139 26813749 26712247 26599422 26649754
60955 26649754 26930079 27371828 27777993 27883183 27454125 26381151 24710501 22607463 20283957
60946 20283957 17934426 15702115 13672697 11883123 10336442 9016674 7899690 6959065
60938 6959065 6168826 5504951 4945904 4472522 4068261 3719781 3416691 3150416 2913674
60929 2913674 2701071 2509318 2336162 2179389 2037121 1908471 1793182 1690709 1600007 1519824
60919 1519824 1448540 1383851 1323247 1265029 1208619 1154047 1101568 1051764 1005428 963019 924442
60908 924442 889453 858002 829987 804929 782179 761385 742563 725748 710704 697000 684289
60897 684289 672504 661828 652473 644424 637412 631165 625747 621525 618757 617286 616793 617297 619127 622338
60883 622338 626415 630772 635312 640246 645581 651188 657205 663827 670623 676585 681147 684826 688584 692822
60869 692822 697181 701043 703811 704886 703835 700724 696142 690837 685303 679560 673273 666242 658905 652177
60855 652177 646627 642014 637815 633986 630947 629010 628204 628549 630134 632942 636919 642265 649357 658307 668866
60840 668866 680809 694076 708336 722701 736239 748737 760663 772329 783324 793014 801497 809795
60828 809795 818954 829107 839551 849675 859469 869111 878325 886382 892639 896997 899936 902266 904657
60815 904657 907191 909348 910575 910828 910437 909546 907861 904956 900677 895173 888647 881076 872188 861725 849772
60800 849772 836708 822801 807978 792175 775844 759945 745421 732747 721927 712723 704833 698029
60788 698029 692276 687790 684880 683667 683940 685393 688023 692118 697746 704438 711680 719606 728829 739584
60774 739584 751392 763687 776319 789235 802021 814170 825592 836511 846966 856680 865226 872061
60762 872061 876663 879084 880295 881506 883136 884827 886413 888391 891255 894811 898483 902152 906408 912018
60748 912018 919245 927655 936494 945305 954126 962976 971217 977711 981774 983769 984638 984988 984815 983949 982389
60733 982389 980129 976961 972719 967607 961982 955814 948695 940559 932057 923909 916107 908203 900252 892961
60719 892961 886832 881713 877341 873718 870615 867214 862774 857350 851356 844716 837035 828447 819624 810878
60705 810878 801761 791696 780694 769383 758735 749877 743743 740591 739907 740950 743358 747292 753072
60692 753072 760656 769404 778454 787351 796010 804003 810345 814394 816534 817314 816209 811947 804049 793387
60678 793387 781160 768015 754343 740773 727957 716192 705532 695978 687449 679910 673658 669129
60666 669129 666347 664926 664679 665665 667559 669574 671250 672681 673686 673458 671577 668784 666113 663680 661050
60651 661050 658413 656545 655694 655305 654970 654939 655491 656318 656855 656839 656257 655049 653178 650867 648486 646237 644141
60634 644141 642311 641111 640988 642176 644642 648305 653239 659623 667585 677201 688506 701330 715202 729745
60620 729745 745103 761691 779491 798000 816934 836477 856536 876104 893842 909161 922406
60609 922406 934062 944030 951713 956681 959272 960528 961331 961570 960366 957115 951899 944796 935433 923676
60595 923676 910377 896853 883761 870970 858436 846736 836685 828707 822642 817937 814071 810911
60583 810911 808527 806591 804296 801127 797385 793580 789606 784952 779537 773859 768468 763666 759589 756151
60569 756151 753095 750577 749490 750627 753632 757423 761526 766300 771793 777239 781971 786202 790470 794803
60555 794803 798866 802569 806155 809950 814349 819790 826404 833827 841568 849489 857852 867198 878277 891824
60541 891824 908241 927800 951266 979896 1014653 1055765 1103174 1156659 1214855 1274510 1331454
60530 1331454 1382270 1424589 1456052 1473953 1476449 1463898 1438776 1404403 1363826 1319638 1274511
60519 1274511 1231552 1193785 1163000 1139236 1121601 1109563 1103309 1103064 1108415 1118265 1131060 1145102
60507 1145102 1159157 1173083 1187715 1203896 1221756 1241047 1262003 1285703 1313865 1348595 1392239
60496 1392239 1446985 1514386 1595464 1691474 1804476 1937024 2091350 2268992 2471235 2699832
60486 2699832 2957387 3247221 3572748 3936377 4337970 4773104 5231321 5694775 6138212
60477 6138212 6531315 6843225 7047522 7125982 7070925 6886542 6588702 6202243 5756296 5279718
60467 5279718 4798146 4332284 3896675 3499346 3143031 2827347 2550418 2309456 2100988
60458 2100988 1921294 1766673 1633365 1517640 1416384 1327554 1249852 1182066 1122920 1071332
60448 1071332 1026303 986491 950391 917169 886931 859791 834996 811416 788610 766845 746223
60437 746223 726555 708163 691961 678264 666111 654385 643228 633689 626193 620045 614392 609038
60425 609038 604239 600222 597112 594913 593379 592204 591439 591391 591999 592764 593469 594559 596533 599267 602239 605129
60409 605129 607829 610092 611667 612748 613930 615614 617711 619988 622517 625558 629086 632610 635620 638228
60395 638228 641223 645341 650535 656094 661364 666079 670073 673181 675570 677802 680198 682378 683743 684260
60381 684260 684374 684200 683233 680959 677468 673343 669201 665571 662943 661534 660918 660196 658769 656859 655120
60366 655120 653899 653068 652500 652252 652214 651967 651293 650535 650157 650209 650576 651477 653194 655481 657835 660384 663838
60349 663838 668365 673152 677484 681802 687209 694224 702457 711248 720063 728278 735095 739968 742993 744754
60335 744754 745806 746284 746002 744967 743772 743277 743862 745206 746846 748711 751000 753871 757403 761640 766397
60320 766397 771250 775903 780356 784516 787859 789731 789881 788519 786136 783421 781032 779068 777035 774642
60306 774642 772396 771038 770688 770993 771826 773256 774987 776541 778049 780215 783292 786671 789779 792932 796873
60291 796873 801739 806876 811554 815538 818948 821869 824261 826188 827969 829960 832201 834456 836617 838814
60277 838814 841035 843033 844938 847642 852118 858464 866062 874579 884281 895398 907725 921037 935520
60264 935520 951656 969937 990702 1013851 1038705 1064670 1092254 1123018 1158285 1198162 1241968
60253 1241968 1289275 1340378 1396185 1457907 1526477 1602039 1684351 1773913 1872236 1980522 2098348
60242 2098348 2223980 2355686 2492321 2632843 2775726 2918769 3059150 3193787 3320018
60233 3320018 3435944 3539979 3630428 3705865 3765683 3809687 3837232 3847322 3839702 3815595 3777354
60222 3777354 3727741 3669591 3605785 3539359 3473646 3412117 3357687 3312220 3277007 3253661 3244006
60211 3244006 3249100 3268927 3303388 3353159 3419205 3501724 3599943 3712711 3838717 3976047 4121913
60200 4121913 4273050 4426188 4577839 4723665 4858533 4977702 5078093 5158229 5216908 5252415
60190 5252415 5263324 5249653 5212582 5153250 5072684 4973244 4859429 4736686 4609626 4481821
60180 4481821 4356874 4238884 4131697 4038224 3960764 3901520 3862269 3843569 3844684 3864448 3902085
60169 3902085 3957026 4028026 4112568 4207115 4307764 4410654 4512038 4608251 4695720 4771054 4831455
60158 4831455 4875356 4902611 4913824 4909583 4890767 4859575 4819783 4775646 4730809 4688511 4652464
60147 4652464 4626931 4615773 4621572 4645614 4688447 4750380 4831677 4932459 5052620 5192147 5351812
60136 5351812 5533482 5739566 5972182 6232963 6523411 6844848 7197664 7580630 7990876
60127 7990876 8424229 8875313 9337388 9802288 10260744 10703150 11120434 11504429 11847498
60118 11847498 12142126 12381401 12560069 12674810 12723374 12703852 12615292 12458992 12238968 11961360
60108 11961360 11633943 11266292 10869802 10456786 10039244 9628365 9234567 8867116 8533116
60099 8533116 8237101 7981926 7769994 7603388 7483076 7408634 7378851 7392074 7445563 7534825
60089 7534825 7653963 7796381 7954752 8120578 8284671 8438528 8575146 8688709 8774152 8827532
60079 8827532 8846722 8831587 8783594 8705174 8598995 8467480 8312997 8138338 7946605 7740563
60069 7740563 7522625 7295711 7063660 6830447 6599425 6373759 6157090 5953038 5764156
60060 5764156 5591971 5437991 5304018 5191457 5100980 5033108 4988634 4968231 4972071 5000096 5052254
60049 5052254 5128046 5226003 5343816 5478709 5627376 5785736 5949066 6112340 6270242 6417065
60039 6417065 6547058 6655174 6737579 6791640 6815650 6808626 6770448 6702151 6605993 6484966 6342337
60028 6342337 6181951 6008886 5829177 5648390 5470571 5298737 5135978 4985521 4849830
60019 4849830 4730163 4627207 4541878 4475420 4429030 4403621 4399908 4418612 4460588 4526701 4617456
60008 4617456 4732678 4871592 5033115 5215856 5417662 5635060 5863047 6095314 6324755
59999 6324755 6544014 6745989 6924386 7074385 7192936 7278300 7329173 7344319 7323021 7265649
59989 7265649 7173901 7051038 6902220 6734225 6554235 6368737 6183543 6004361 5836623 5684768
59979 5684768 5552098 5441391 5355138 5295027 5261494 5254001 5271539 5312793 5376087 5459271 5559381
59968 5559381 5672336 5793411 5918442 6044628 6170140 6293189 6411582 6522861 6624577
59959 6624577 6714606 6791474 6854362 6902786 6936546 6956201 6963288 6959810 6947813 6929894 6909909 6892619
59947 6892619 6882591 6883902 6900919 6938805 7002934 7098112 7228547 7398187 7610652 7868935 8175385
59936 8175385 8531674 8938170 9393029 9891793 10427413 10990032 11566459 12140018 12691074
59927 12691074 13198019 13638677 13992389 14242379 14377418 14392477 14289038 14075223 13764891
59918 13764891 13375391 12925236 12432981 11916850 11393798 10878179 10381195 9911447 9475562
59909 9475562 9078379 8723241 8412602 8148276 7931137 7761136 7638015 7561758 7532050 7547614
59899 7547614 7606514 7706902 7846958 8024031 8234096 8471806 8730411 9001230 9273327 9533840
59889 9533840 9768649 9963268 10104201 10180626 10185564 10116109 9973203 9761462 9488795 9165558
59879 9165558 8803523 8415055 8012368 7606668 7207500 6822615 6458092 6118351 5806139
59870 5806139 5522864 5269073 5044577 4848255 4678053 4531390 4405534 4297536 4204032 4121331
59860 4121331 4045848 3974470 3904780 3835331 3765856 3696976 3629440 3563715 3500596 3442066 3391070
59849 3391070 3350039 3319628 3298888 3286326 3280426 3279218 3279741 3278302 3271381 3256453 3232143 3197875
59837 3197875 3153662 3100455 3040595 2977461 2914358 2853776 2797677 2747909 2705792 2671479 2644406
59826 2644406 2624528 2612622 2609267 2614059 2626378 2646627 2676159 2716009 2766106 2825790 2894497 2971412
59814 2971412 3054602 3141052 3227827 3312964 3395003 3471895 3540921 3599855 3647893 3685169 3711628
59803 3711628 3726742 3730309 3723303 3708004 3687576 3665462 3644777 3627988 3617244 3615081 3624618 3648853
59791 3648853 3689786 3748370 3825476 3923031 4044315 4193241 4373497 4588531 4842256 5139231
59781 5139231 5483636 5877790 6321083 6808895 7330765 7868531 8396128 8881690 9291335
59772 9291335 9594154 9768151 9805398 9713477 9512159 9227657 8887686 8518295 8141635 7774408
59762 7774408 7427686 7108095 6819213 6562374 6337208 6142435 5976634 5838408 5726106
59753 5726106 5637905 5572406 5528973 5507162 5505881 5523549 5559267 5613437 5686904 5779804 5891807
59742 5891807 6023373 6176183 6352258 6553183 6780476 7036272 7323247 7644167 8001882
59733 8001882 8399522 8840174 9326269 9859368 10440299 11068805 11742536 12456154 13201200
59724 13201200 13966536 14738833 15503048 16243510 16946032 17600483 18202387 18752882 19258045
59715 19258045 19728809 20180962 20633526 21105491 21612980 22168330 22780078 23452166 24182422
59706 24182422 24961743 25774483 26599447 27410991 28180406 28877804 29474564 29946329 30276041
59697 30276041 30455960 30488027 30383076 30159653 29842327 29459225 29039413 28611072 28200434
59688 28200434 27830884 27522233 27290666 27149409 27109628 27181306 27373925 27696485 28156723 28760391
59678 28760391 29511176 30410293 31454312 32631868 33921356 35290408 36695719 38082467
59670 38082467 39385143 40531939 41452154 42083875 42380216 42314457 41884291 41113462 40048688
59661 40048688 38752337 37293972 35743560 34166531 32619497 31146608 29777605 28527772
59653 28527772 27398558 26378034 25442042 24557263 23686412 22794808 21857084 20861996 19813229
59644 19813229 18726118 17622635 16526878 15461380 14444072 13486930 12596963 11777885
59636 11777885 11030442 10352025 9737678 9182394 8682321 8233895 7832775 7474110 7153473
59627 7153473 6867198 6612259 6386266 6187270 6013244 5861950 5731496 5620573 5527734 5450674
59617 5450674 5386499 5332323 5285126 5241363 5197444 5150698 5099340 5041492 4974794 4897383 4809037
59606 4809037 4711152 4605770 4494840 4380244 4264119 4148895 4036913 3930004 3829423 3736150
59596 3736150 3651140 3575198 3508701 3451618 3403755 3364822 3334278 3311412 3295795 3287550 3286926 3293499
59584 3293499 3305907 3322473 3342078 3364369 3389179 3415831 3443056 3469558 3494716 3518885 3543118
59573 3543118 3568554 3596056 3626512 3661392 3702723 3752240 3810664 3878001 3954533 4041276 4139519
59562 4139519 4250211 4374008 4511728 4664556 4833889 5021167 5227819 5455189 5704358
59553 5704358 5975987 6270203 6586404 6923073 7277829 7647595 8028589 8416109 8804668
59544 8804668 9188839 9564159 9927116 10274447 10603061 10911072 11198637 11467293 11718565
59535 11718565 11953530 12173347 12379358 12572601 12754124 12926341 13093523 13260146 13428559
59526 13428559 13598010 13764743 13921842 14059010 14163644 14223020 14225963 14163430 14028964 13819505
59516 13819505 13535805 13182100 12765662 12296495 11786666 11249120 10696748 10141793 9594967
59507 9594967 9064323 8555122 8071067 7615463 7191079 6799395 6440561 6114046 5819048
59498 5819048 5554449 5318817 5110624 4928261 4769838 4633218 4516483 4418407 4338448 4276223
59488 4276223 4230994 4201763 4187935 4189730 4207748 4242299 4293423 4361470 4447298 4551881 4676102
59477 4676102 4820992 4987796 5177641 5391378 5629757 5893260 6181300 6491623 6820376
59468 6820376 7162271 7510318 7855654 8187939 8495883 8767551 8991047 9155957 9254659 9282643
59458 9282643 9238454 9124071 8945187 8710297 8429045 8111295 7767218 7407267 7041362 6677869
59448 6677869 6323195 5982031 5657799 5352977 5069102 4806699 4565535 4345189 4145239
59439 4145239 3964804 3802280 3655995 3525085 3409352 3308294 3220644 3144930 3080170 3025892
59429 3025892 2981746 2947217 2921556 2903859 2893333 2889530 2892187 2900771 2914281 2931663 2952380 2976587
59417 2976587 3004728 3036920 3072681 3111362 3152924 3198091 3247503 3300686 3355869 3410713 3463212
59406 3463212 3512443 3559240 3606498 3658590 3720131 3795043 3886429 3996848 4128391 4282409 4459177
59395 4459177 4658055 4878548 5121864 5391624 5693012 6031359 6411622 6838597 7316489
59386 7316489 7847568 8431112 9063242 9736910 10441552 11163283 11886293 12594609 13273150
59377 13273150 13908459 14489960 15011271 15470353 15868346 16208272 16494265 16730769 16921385
59368 16921385 17067945 17170325 17226534 17232617 17183018 17072130 16896367 16655194 16350860 15988382
59358 15988382 15576699 15129555 14664105 14197620 13744692 13316336 12919991 12559082 12232502
59349 12232502 11935036 11658555 11393111 11127961 10853091 10560879 10246845 9909389 9549479
59340 9549479 9170655 8778649 8380265 7982254 7590866 7211767 6849814 6508807 6191436
59331 6191436 5899317 5633012 5392291 5176525 4984739 4815407 4666690 4537126 4425789
59322 4425789 4331497 4252238 4185730 4130314 4084940 4048662 4020716 4000972 3989687 3986854 3992383 4006921
59310 4006921 4031716 4067284 4112827 4167485 4231789 4307364 4395462 4496264 4609321 4733939 4868981
59299 4868981 5012800 5163530 5319113 5476917 5633629 5785765 5930177 6064177 6185625
59290 6185625 6293136 6386099 6464562 6529523 6583462 6630131 6673489 6717003 6764045 6818319 6883176
59279 6883176 6960490 7050432 7152092 7263756 7382599 7504573 7624720 7737455 7836733 7916682
59269 7916682 7972589 8001493 8002082 7974381 7919376 7838374 7732641 7604209 7457279 7298455 7135276
59258 7135276 6974676 6822738 6684981 6565928 6468443 6393971 6343461 6317647 6316609 6339566 6385215
59247 6385215 6451786 6536706 6636772 6749148 6871985 7003797 7142614 7286450 7434840 7589563
59237 7589563 7753703 7930350 8122653 8334870 8572567 8841212 9144317 9482546 9853652
59228 9853652 10252275 10669512 11092939 11507145 11894317 12234994 12509700 12701239 12796392 12786386
59218 12786386 12667016 12439202 12109475 11689410 11194251 10641634 10050596 9440307 8828412
59209 8828412 8229609 7655077 7112726 6607760 6143080 5719345 5335196 4988194 4676071
59200 4676071 4397207 4149879 3931332 3737896 3565990 3412924 3276833 3155975 3048025
59191 3048025 2950019 2859235 2774291 2695181 2622132 2554754 2492481 2435250 2383086 2335254 2290617
59180 2290617 2248936 2211130 2177978 2149112 2123681 2101585 2083558 2070235 2061611 2057368 2057285 2061286
59168 2061286 2069458 2082187 2100050 2123366 2151907 2185181 2222948 2265356 2312581 2364453 2420555
59157 2420555 2480735 2545474 2615664 2691943 2774320 2862515 2956605 3057167 3164742 3279390 3400892
59146 3400892 3529124 3663860 3804167 3948416 4095064 4243043 4391051 4536666 4676630
59137 4676630 4807991 4928585 5036490 5129578 5206008 5264973 5306810 5332616 5344054 5343484 5334093
59126 5334093 5319843 5305255 5295055 5293826 5305923 5335487 5386182 5460843 5561627 5690513 5849186
59115 5849186 6038124 6255864 6499109 6762993 7040815 7323687 7600824 7860132 8088644
59106 8088644 8273300 8402656 8468808 8468354 8402421 8276593 8100726 7887876 7652321 7407626
59096 7407626 7165322 6934131 6719788 6525694 6353817 6204942 6078289 5971433 5880924 5802852
59086 5802852 5732870 5666171 5598011 5524429 5442491 5350037 5245511 5128101 4997873 4855608
59076 4855608 4702616 4540948 4373715 4204667 4036928 3872205 3711611 3557117 3411602
59067 3411602 3277359 3155049 3044361 2945110 2857322 2780785 2715116 2659983 2614679 2577566 2546404
59056 2546404 2518946 2492681 2464272 2430253 2388584 2339072 2282159 2218017 2147323 2072418 1996898
59045 1996898 1923771 1854185 1787947 1725026 1666292 1612870 1565193 1523015 1486091 1454331 1427336
59034 1427336 1404430 1385340 1370251 1358858 1350080 1343215 1338778 1337410 1338429 1340299 1342220 1344331 1346477
59021 1346477 1347806 1347670 1346079 1343195 1339220 1334946 1331532 1329392 1328061 1327489 1328589 1332033 1337266 1343347
59007 1343347 1350227 1358533 1368530 1379823 1391730 1403424 1414156 1423955 1433780 1444363 1455167 1465159
58995 1465159 1474423 1484261 1495728 1508688 1522473 1536883 1552230 1568703 1585984 1603421 1620514 1637383
58983 1637383 1654782 1673514 1693702 1714627 1735348 1755605 1776287 1798970 1824777 1853645 1884862
58972 1884862 1918274 1954684 1995076 2039875 2089070 2142495 2199575 2259119 2319868 2381137 2442581
58961 2442581 2503402 2562149 2617298 2667909 2713875 2755959 2795630 2834575 2874162 2915414 2959596
58950 2959596 3008744 3065360 3131286 3206786 3291021 3383695 3486073 3600127 3727000 3866866
58940 3866866 4020083 4187729 4370863 4570099 4786404 5021762 5278649 5559332 5866269
58931 5866269 6202715 6572240 6977845 7422252 7909058 8442950 9028663 9670081 10370237
58922 10370237 11131303 11953870 12836070 13773181 14757188 15775624 16810252 17836872 18826654
58913 18826654 19748077 20568535 21255881 21780793 22119972 22258915 22193329 21929339 21482881
58904 21482881 20877943 20143540 19310502 18409243 17468224 16512406 15562338 14634624 13742821
58895 13742821 12897094 12103340 11363785 10679057 10049390 9474126 8951317 8478434 8052837
58886 8052837 7671081 7328407 7019483 6739222 6482464 6243599 6017297 5799605 5588167
58877 5588167 5382112 5182216 4990490 4808718 4637475 4476890 4327652 4190484 4065075
58868 4065075 3950463 3846211 3752328 3668220 3592662 3524881 3464891 3412614 3367412 3328687 3296323
58857 3296323 3270267 3250221 3236030 3227984 3226485 3231734 3243973 3263696 3291302 3326667 3369351 3419267
58845 3419267 3477046 3543633 3619439 3703982 3796628 3897741 4008837 4131498 4266463 4413960
58835 4413960 4574582 4749520 4940190 5147965 5374064 5619578 5885986 6175919 6493106
58826 6493106 6841270 7223485 7642970 8103981 8611286 9168966 9780291 10448405 11176236
58817 11176236 11965233 12813922 13716910 14664287 15641594 16630239 17607557 18546298 19415008
58808 19415008 20180399 20810638 21277944 21560690 21645820 21530703 21223069 20739526 20103907
58799 20103907 19345292 18494979 17583403 16638500 15685042 14743486 13828908 12951448 12117838
58790 12117838 11332222 10596203 9909399 9270419 8677123 8126546 7615706 7142686 6706291
58781 6706291 6304755 5935542 5596355 5285507 5001280 4741624 4504404 4287082 4086224
58772 4086224 3898360 3721624 3555740 3400285 3253888 3115416 2984963 2863163 2750267
58763 2750267 2646305 2551314 2464821 2385700 2313236 2247902 2190578 2141245 2098798 2061798 2029127
58752 2029127 2000308 1975485 1954754 1937202 1920995 1904696 1888245 1872446 1857807 1844155 1830983
58741 1830983 1817862 1804647 1791453 1778377 1765292 1752014 1738456 1724334 1709075 1692482 1675170
58730 1675170 1657716 1639649 1620035 1598784 1576424 1552716 1526589 1497578 1466347 1433632 1399676
58719 1399676 1365027 1330830 1297921 1266445 1236697 1209371 1184472 1161007 1138370 1117161 1097950
58708 1097950 1080125 1062790 1046142 1031072 1017894 1006313 996301 988194 982044 977396 973514 969542
58696 969542 964862 959658 954688 950216 945667 940588 935158 929264 921872 912061 900133 887061 873429
58683 873429 859599 846327 834317 823530 813639 804831 797532 791706 787125 783934 782271 781684 781608 782033
58669 782033 783101 784435 785671 787280 790036 793946 798478 803544 809477 816218 823310 830514 837615 843862
58655 843862 848517 852003 855756 860907 867721 876174 886261 897779 910576 925154 942293 962009 983539
58642 983539 1006529 1031637 1059822 1091573 1127004 1166160 1208995 1255486 1306021 1361491 1423017
58631 1423017 1491869 1569486 1657159 1755745 1866164 1990110 2129850 2287413 2464514 2663136
58621 2663136 2885375 3132299 3403147 3695538 4005664 4327695 4652996 4970038 5265072
58612 5265072 5523305 5730523 5874868 5948362 5947931 5875843 5739169 5548301 5315404 5053409
58602 5053409 4775146 4492157 4213764 3947037 3697072 3466921 3257586 3068704 2899311
58593 2899311 2748038 2613229 2493491 2387857 2295030 2212953 2139848 2075338 2019684 1971993
58583 1971993 1929980 1891625 1856312 1824157 1794702 1766604 1738316 1708832 1677941 1645820 1612296
58572 1612296 1576595 1538036 1496883 1454466 1412636 1373091 1336609 1302612 1269926 1238398 1209280
58561 1209280 1183545 1160346 1137864 1115232 1092889 1071374 1050779 1031340 1013723 998496 985764
58550 985764 975321 966672 959089 952238 946603 942672 939856 936965 933696 930895 929366 929137 929983 931900
58536 931900 934848 938622 943257 949087 956198 964154 972247 979558 984841 986933 985399 980340 971616 958859
58522 958859 942330 923126 902336 880553 858399 836970 817346 799906 784353 770187 757082
58511 757082 745062 734473 725662 718585 712763 707537 702396 697359 693148 690461 688820 686659 683040 678836
58497 678836 675638 673972 673207 672687 672084 670968 669045 666720 664629 662675 660300 657592 655261 653632 652528
58482 652528 652126 652966 655024 657704 660986 665692 672295 680170 688400 696778 705706 715572 726435 737886
58468 737886 749180 759949 770713 782105 793707 804370 813637 821881 828876 833167 833315 829152 821427
58455 821427 810854 797931 783218 767294 750643 733861 717726 702886 689582 677644 666661
58444 666661 656379 647253 640268 635758 632699 629697 626381 623217 620365 617575 614971 613039 611862 611182
58430 611182 611067 611717 612730 613439 613922 614854 616440 618401 620937 624722 629919 636117 643249 651658 661278
58415 661278 671689 682940 695351 708611 722176 736558 752920 771241 790100 808406 826066
58404 826066 842584 856359 866025 871487 873183 871328 866395 859364 850985 841566 831746 822496 814024 805748
58390 805748 797742 791106 786440 783027 780079 777694 775987 774335 772332 770631 770103 770771 772156 773984 776100
58375 776100 778380 781166 785064 789915 794721 798892 802758 806591 810103 813211 816277 819208 821344 822667
58361 822667 824088 826155 828488 830844 833546 836436 838673 840167 841936 844426 846763 848396 850205 852986
58347 852986 856024 858227 859748 861479 863720 866241 869066 872444 876618 882077 889206 897387 905414 913171
58333 913171 921768 931675 942043 952349 963224 974882 986160 996026 1004786 1013002 1020522 1027454 1034762
58320 1034762 1042860 1050867 1058218 1065791 1074459 1083781 1093108 1102770 1113183 1123996 1135053 1146869 1159246
58307 1159246 1170827 1181034 1191009 1201688 1212539 1223313 1235218 1248977 1263414 1277494 1292165
58296 1292165 1308538 1325792 1342638 1359460 1377258 1395871 1414980 1435461 1457878 1480904 1503127
58285 1503127 1525216 1548428 1572214 1595298 1618080 1642079 1667880 1695369 1724900 1756451 1788667
58274 1788667 1820438 1852406 1885413 1918855 1952206 1986693 2023602 2062419 2102473 2144687 2189654
58263 2189654 2235800 2281847 2329491 2381053 2435994 2492318 2549870 2609495 2670439 2731599 2794200
58252 2794200 2860331 2929913 3001850 3076913 3156578 3240223 3326460 3416154 3511085 3610828 3714016
58241 3714016 3821560 3935436 4055460 4180510 4311741 4451236 4598661 4752818 4915368
58232 4915368 5089355 5275112 5471414 5679647 5902992 6142370 6397101 6668668 6959951
58223 6959951 7271704 7603755 7958758 8340799 8751636 9192584 9668766 10186948 10750673
58214 10750673 11362551 12030058 12763900 13572144 14461723 15444736 16537735 17756511 19118339
58205 19118339 20649006 22382347 24355735 26614853 29223703 32265341 35838548 40067933
58197 40067933 45122869 51225518 58652774 67756634 78999539 92968860 110351905 131886671
58189 131886671 158291025 190123007 227494217 269592472 314116712 356976497 392740987
58182 392740987 416018166 423250840 413935159 390564989 357471082 319348854 280179831
58175 280179831 242759495 208694373 178661528 152748790 130728269 112208632 96718421
58168 96718421 83780070 72966621 63915955 56322607 49938463 44574157 40082661 36339629
58160 36339629 33242063 30714705 28704961 27175183 26108004 25514123 25425402 25881519 26925130
58151 26925130 28594897 30894096 33734262 36877215 39910177 42296045 43519787 43277689
58143 43277689 41591356 38768197 35250990 31467811 27749128 24304949 21235851 18565287
58135 18565287 16277466 14339748 12708285 11333926 10173140 9191887 8360229 7650388
58127 7650388 7041570 6520370 6073839 5686446 5344927 5041091 4767947 4517284 4282845
58118 4282845 4062244 3854222 3657261 3471856 3300560 3144297 3001407 2871100 2754661
58109 2754661 2652145 2560850 2478008 2402128 2330663 2259355 2185499 2109903 2034692 1961209 1890637
58098 1890637 1824210 1761710 1701679 1643891 1589798 1540013 1493300 1448680 1406620 1367527 1330922
58087 1330922 1296772 1265926 1238501 1213291 1189254 1166217 1143823 1121267 1098374 1075705 1053505
58076 1053505 1031830 1011444 993082 976046 959215 943126 929205 917191 905328 893041 881337
58065 881337 870563 859913 849411 840269 832905 826447 820472 815304 810279 803747 795314 786264 777343
58052 777343 767922 757764 747679 737883 727597 716946 707488 700140 694209 689133 685493 683583 682608
58039 682608 682076 682517 684065 685833 687447 689824 693594 698073 702420 706443 709588 710590 708989 705753 701665
58024 701665 696401 689839 682860 675935 668298 659480 650389 641826 633133 623449 613280 603677 594727 585963
58010 585963 577594 570202 563694 557457 551186 544979 539056 533853 529810 526672 523615 520447 517904 516439
57996 516439 515536 514676 514090 514150 514903 516690 520274 525829 532599 539984 547955 555926 562429 566800 570171 573851
57980 573851 577474 579685 579979 578959 577348 575587 573984 572471 570527 567801 564386 560112 554336 546969
57966 546969 538978 531180 523273 514827 506557 499732 494771 491254 488896 487590 486749 485500 483581 481521
57952 481521 479956 479128 478932 479129 479639 480776 482960 486049 489370 492548 495802 499218 502257 504329 505405
57937 505405 505727 505334 504172 502254 499516 495919 491815 487671 483332 478187 472191 466022 460001 453668 446845
57922 446845 440313 434921 430676 427246 424801 423786 424304 426179 429226 433096 437306 441758 446770 452381
57908 452381 458167 463960 470075 476508 482604 487909 492634 496873 500080 501816 502324 501888 500350 497842 495201
57893 495201 492885 490034 485409 478892 471397 463678 455891 448037 440170 432317 424649 417567 411379 406177
57879 406177 402147 399536 398108 397239 396859 397630 399867 402985 406452 410531 415543 421115 426813 432902 439790
57864 439790 447222 454662 461955 469057 475647 481558 487049 492060 495851 497928 498647 498192 495784 490798 484026
57849 484026 476813 469470 461564 453319 445565 438564 431891 425357 419105 412950 406590 400381 395063 390758
57835 390758 387070 384044 382103 381012 379832 378005 375703 372928 369118 363926 357801 351470 345266 339130
57821 339130 332865 326222 319102 311787 304712 298054 291849 286320 281645 277501 273374 269310 265892 263471
57807 263471 261835 260608 259582 258685 258032 257974 258681 259749 260648 261538 263263 266549 271548 278097 285910 294526
57791 294526 303466 312621 322206 332237 342217 351281 358549 363533 366552 368646 370771 373045 374906 375862
57777 375862 375878 375187 373972 372165 369481 365796 361501 357210 353079 348877 344735 341253 338611 336283 334033
57762 334033 332588 332805 334603 337223 340058 342722 344773 346070 347072 348203 349129 349177 348193 346622 345149
57747 345149 344630 345841 348735 352449 356542 361610 368050 374973 381260 387057 393203 399694 405896 411920
57733 411920 418535 425845 433150 440117 447029 453969 460912 468705 478813 491724 506427 521675 537019
57720 537019 552565 568639 585949 605214 626410 649035 673165 699378 727575 756926 787300
57709 787300 819810 855592 894870 937594 984207 1035428 1092127 1155778 1228220 1310504 1402798
57698 1402798 1505906 1622110 1753967 1903183 2071313 2260702 2473625 2710767 2971130
57689 2971130 3252744 3552304 3863914 4178522 4484360 4767699 5014092 5210390 5346601
57680 5346601 5416670 5418884 5356752 5239209 5078921 4889759 4685579 4480164 4286595 4115821
57670 4115821 3975911 3872404 3808285 3782575 3788457 3812466 3835604 3836581 3796811 3705667 3563463
57659 3563463 3380602 3173365 2958598 2749700 2555278 2380101 2226738 2096390 1988773
57650 1988773 1901981 1833130 1779588 1739804 1713046 1698515 1695066 1701910 1719296 1748117 1788991 1842039
57638 1842039 1907493 1986139 2079195 2188185 2314935 2461202 2628070 2815897 3024789 3254391
57628 3254391 3502575 3764310 4031949 4296296 4547011 4772334 4959448 5096270 5173792 5187487
57618 5187487 5137295 5026976 4863751 4658025 4422255 4168804 3908018 3647633 3393313 3149314
57608 3149314 2918792 2703902 2505799 2324695 2160205 2011779 1878597 1759087 1651175
57599 1651175 1553434 1465558 1387267 1317180 1253410 1195021 1142152 1094817 1052289 1013732 978730
57588 978730 946993 918072 891638 867672 846154 826824 809365 793560 779228 766243 754619
57577 754619 744319 735106 726887 720042 714998 711549 709066 707294 706480 706824 708427 711728 717347 725300
57563 725300 734871 745412 756880 769565 783747 799659 817301 836254 856232 877825 902096 929398
57551 929398 959325 991996 1028622 1070444 1117805 1170763 1230111 1297273 1373524 1459814 1557059
57540 1557059 1666191 1788104 1923884 2074915 2242330 2426252 2625452 2837364 3058003
57531 3058003 3281790 3501297 3707119 3888401 4034395 4136293 4188193 4187256 4133960 4032432
57521 4032432 3890022 3716095 3520851 3314235 3104578 2897716 2697590 2507459 2329994
57512 2329994 2166543 2017351 1882587 1762354 1655710 1560848 1476617 1402968 1339588 1285118
57502 1285118 1238292 1198882 1166794 1141027 1120389 1104643 1094099 1088557 1087534 1091149 1099863 1113391
57490 1113391 1130628 1150779 1174227 1202366 1236858 1278857 1328646 1386141 1451870 1527064 1612718
57479 1612718 1709306 1817860 1940739 2080478 2237944 2411909 2599941 2799044 3005394 3213674
57469 3213674 3416305 3603176 3762882 3885159 3962481 3989826 3964402 3886894 3762637 3600553
57459 3600553 3410620 3202391 2984886 2766278 2553045 2349701 2159273 1983467 1822436
57450 1822436 1675250 1541089 1419902 1311831 1216259 1131543 1055624 987024 925340 870672
57440 870672 822570 779880 741636 707540 677270 649853 624236 600055 577436 556445 537296
57429 537296 520622 506714 494667 482997 471070 459356 448370 438072 428393 419675 412254 405943
57417 405943 400180 394475 388562 382373 376054 369993 364671 360377 357005 354219 351918 350409 349879 349870 349684
57402 349684 349210 348856 348760 348670 348655 349174 350280 351439 352432 353698 355474 357330 358902 360273 361212 360950 359417
57385 359417 357923 357726 358546 359293 359622 359892 360198 360504 361293 362963 364820 365737 365705 365787 366636 367963 369336 370559
57367 370559 371308 371329 371113 371545 372784 374204 375445 376746 378182 379447 380559 382076 384385 387363 390792
57352 390792 394533 398275 401746 405203 409042 412980 416448 419858 424510 430903 437922 444117 449180 453788
57338 453788 458632 464039 469993 476017 481424 486104 490808 496270 502364 508444 514249 520063 526145 532397
57324 532397 538624 544879 551447 558525 566056 573997 582642 592343 602833 613232 623026 632703 643108
57311 643108 654439 666247 678096 689842 701608 713932 727550 742440 757444 771521 785080
57300 785080 799386 814926 831257 848357 867083 888029 910719 934333 958699 984320 1011783
57289 1011783 1041442 1073364 1107360 1143125 1180314 1218454 1257164 1296647 1337487 1379416 1420707
57278 1420707 1459335 1494334 1525344 1551334 1570757 1582796 1587587 1585374 1576410 1561716 1542998 1521676
57266 1521676 1498622 1474844 1451572 1429590 1409175 1390734 1374792 1361353 1350067 1341088 1334965 1331637
57254 1331637 1330351 1330671 1332733 1336397 1340997 1346220 1352512 1360364 1369753 1380344 1391627 1402837 1413507
57241 1413507 1424139 1435603 1447874 1460171 1472330 1485136 1499204 1514414 1530496 1547251 1564191
57230 1564191 1580988 1598406 1617639 1638531 1659604 1680148 1701077 1723327 1746655 1770615 1795514
57219 1795514 1821624 1848444 1875556 1903309 1931867 1960375 1987931 2014691 2041287 2067817 2094197
57208 2094197 2120857 2148259 2176143 2203952 2231569 2259127 2286619 2314287 2342885 2373030 2404733
57197 2404733 2438027 2473382 2510923 2549889 2589497 2629786 2670977 2712653 2754252 2795836 2837504
57186 2837504 2878456 2917444 2954003 2988657 3022067 3054533 3086084 3116690 3146495 3176072 3206147
57175 3206147 3236897 3267977 3299378 3331617 3364769 3397972 3430265 3461441 3491783 3521667 3551737
57164 3551737 3582754 3614756 3646899 3678488 3709575 3740325 3770672 3801069 3832750 3866571 3902135
57153 3902135 3938512 3975136 4011569 4047221 4081916 4116128 4150129 4183538 4216090 4248072 4279447
57142 4279447 4309269 4336431 4360299 4380284 4395853 4407576 4417168 4425718 4432747 4437693 4441514 4446091
57130 4446091 4452918 4463252 4478809 4501366 4532006 4571192 4618867 4674031 4734998 4800504 4869710
57119 4869710 4940831 5011034 5078493 5143756 5208876 5276572 5350856 5437070 5540313 5664663 5814175
57108 5814175 5993020 6203889 6447863 6726913 7045723 7411406 7834311 8330917 8924925
57099 8924925 9645298 10525575 11606193 12935787 14570052 16572060 19013374 21969278
57091 21969278 25508028 29682471 34525056 40037212 46174015 52838935 59890970 67146905
57083 67146905 74377683 81330135 87786966 93616649 98755609 103141665 106678783 109267745
57075 109267745 110849587 111403179 110912310 109356111 106734023 103090212 98515953 93143392
57067 93143392 87143327 80718013 74080494 67429907 60935512 54730330 48909875 43535294
57059 43535294 38639872 34234622 30311618 26848258 23813108 21169677 18877395 16893469
57051 16893469 15176617 13689412 12398190 11273165 10289384 9426168 8665206 7990269 7388427
57042 7388427 6849617 6364633 5924914 5524283 5159019 4825639 4520007 4238935 3981066
57033 3981066 3745398 3530049 3332963 3152622 2987462 2835548 2695420 2566397 2447622
57024 2447622 2337606 2235131 2139827 2051468 1969327 1892563 1820723 1753699 1691653 1634958 1583541
57013 1583541 1536383 1492374 1451625 1415133 1383234 1355216 1330463 1309166 1291969 1279923 1274945
57002 1274945 1279495 1295689 1325477 1371668 1437835 1527275 1643136 1789220 1967756 2173200 2386968
56991 2386968 2579039 2716949 2777264 2753261 2655114 2503572 2321964 2131017 1946840 1779714
56981 1779714 1633222 1505291 1391226 1286447 1187745 1093806 1005389 924353 851999 788588
56971 788588 734214 689121 652883 624126 601517 584448 572459 564800 561078 561749 567423 578127
56959 578127 593658 614228 640149 670957 704839 738325 766320 783360 786023 774494 751787 721674
56947 721674 687445 651916 617596 586461 559631 537305 519005 504152 492730 485473 483350 486945
56935 486945 496307 511292 532058 559265 593583 634559 679646 724085 761602 785652 791397 777904
56923 777904 748710 709658 665820 620368 575515 533281 495042 461217 431852 407075 386607
56912 386607 369420 354401 341122 329619 319690 310860 302885 295923 290208 285753 282405 279995 278461
56899 278461 277886 278461 280415 283981 289308 296441 305598 317588 333671 354720 380760 411563 447295
56886 447295 488023 532757 579460 625693 668543 704066 727984 737772 734000 719665 698663 674833
56874 674833 651385 630232 611891 596447 584501 576939 574125 575906 582475 594898 614804 643793
56862 643793 683192 733975 796526 870049 951585 1034915 1110404 1166948 1195779 1193912 1164742 1115556
56850 1115556 1054302 987917 922195 861718 809420 766638 733909 711631 700120 699705 711064 735136
56838 735136 772596 823976 890608 974707 1077709 1198304 1331647 1469031 1597323 1699890
56828 1699890 1760885 1771075 1730936 1649347 1539873 1417030 1293237 1176934 1072586 982169
56818 982169 906495 845612 799027 766224 746831 740333 746250 764956 797954 846889 912211 992573
56806 992573 1084593 1182080 1275233 1351370 1398108 1407669 1379567 1319845 1237880 1143492 1045664 951846
56794 951846 866881 792576 728937 675806 633084 600057 575615 559378 551970 554017 565420 585778
56782 585778 614994 652974 698629 748903 798403 840149 867467 875941 864154 833496 787890 733270
56770 733270 675932 620440 568883 521919 480040 443854 413586 388648 367661 349109 332269
56759 332269 317412 304906 294485 285719 278723 273635 269707 265732 261370 257316 254143 251711 249717
56746 249717 248054 246409 244278 241674 239221 237243 235346 233197 231182 229881 229303 228971 228427 227357 225530
56731 225530 222982 220160 217696 216033 215149 214473 213266 211442 209749 208778 208118 207070 205868 205344 205558 205676
56715 205676 205210 204455 203586 202313 200704 199460 198912 198539 197869 197151 196688 196228 195502 194720 194042 193221 192300 192022
56697 192022 192886 194302 195318 195809 196388 197492 199095 201024 203096 205232 207806 211492 216323 221270 225156
56682 225156 227688 229268 230319 231205 232314 233609 234417 234125 232790 230738 228103 225277 223208 222529 222736
56667 222736 222859 222576 222069 221266 220090 219121 219052 219587 219735 219225 218779 218907 219183 219003 218427 217902 217547 217035 215903
56648 215903 213851 210923 207504 203875 199782 194762 188924 183069 177974 173800 170212 166766 163110 159152
56634 159152 155289 152247 150447 149571 148887 148015 147271 147255 148155 149590 151122 152737 154672 156905 159095 160994
56618 160994 162640 164188 165805 167658 169654 171245 171906 171863 171945 172651 173784 175064 176487 177890 178746 178807
56602 178807 178559 178699 179447 180617 181957 183134 183815 184039 184176 184257 183846 182896 182109 182009 182195 182094 181945 182352
56584 182352 183260 184170 185123 186588 188437 189852 190460 190918 192071 193988 196171 198374 200817 203595 206218
56569 206218 208025 209088 210386 212823 216329 220321 224843 230485 237164 243800 249486 254267 258441 261940
56555 261940 264977 268551 273438 279120 284401 288648 291732 293316 293235 292385 292129 292732 293178 292597 291217 289787
56539 289787 288692 287824 286806 285213 282945 280406 277948 275273 271852 267779 263646 259665 255607 251607
56525 251607 248327 246166 244854 243964 243254 242306 240422 237254 233178 228800 224401 220048 215900 212109 208620
56510 208620 205300 202185 199511 197593 196658 196619 197025 197445 197823 198278 198669 198697 198405 198199 198356 198788 199353 200104
56492 200104 201118 202260 203286 204141 205124 206672 208842 211050 212623 213628 214768 216372 218051 219571 221411
56477 221411 224035 227187 230542 234471 239336 244417 248473 251150 252902 253687 252956 251185 250299 251840 255345
56462 255345 259157 262418 265592 269295 273329 276995 279987 282700 285724 289204 292765 295956 298533 300321
56448 300321 301212 301591 302411 304399 307272 310102 312295 313874 314990 315638 315820 315578 314835 313496 311656 309402
56432 309402 306476 302476 297343 291426 285242 279477 274925 271894 269723 267324 264237 260830 257627 254858
56418 254858 252560 250619 248693 246495 244174 242103 240425 239124 238327 238109 238112 237888 237493 237291 237294 237244 237219 237568
56400 237568 238220 238687 238869 239325 240547 242323 243992 245107 245823 246861 248995 252310 256097 259740 263436
56385 263436 267697 272482 277390 282383 287658 292949 297629 301424 304482 306867 308622 310170 311856 313184
56371 313184 313277 312140 310707 309582 308505 307161 305720 304336 302879 301442 300455 299965 299450 298689 298208 298440
56355 298440 298991 299221 299111 299093 299327 299658 300126 301109 302909 305438 308353 311505 315211 319907 325475 331165
56339 331165 336403 341381 346607 352289 358557 365808 374212 383173 391942 400509 409281 418188 426900 435622
56325 435622 444793 454145 462918 470900 478383 485239 491018 495923 500591 504843 507717 508962 509455 509857 509868
56310 509868 509103 507727 505850 503315 500549 498664 498158 498332 498493 498868 499787 500845 501652 502722 504838 508057
56294 508057 511940 516314 521196 526399 531815 537727 544425 551907 560262 569928 581215 594081 608613
56281 608613 625072 643158 662026 681573 703010 727527 754987 784535 815889 849401 885395
56270 885395 924247 966798 1013994 1066453 1124916 1190773 1265467 1349640 1443491 1547763 1663810
56259 1663810 1792803 1935303 2091523 2261613 2445704 2643795 2855290 3078309 3309580
56250 3309580 3545029 3780214 4010205 4229637 4433174 4615673 4772104 4898267 4992010 5053203
56240 5053203 5082319 5079918 5048012 4991080 4914864 4824408 4723566 4615625 4503475 4389342 4274930
56229 4274930 4161550 4049608 3938252 3826014 3711725 3594554 3473690 3348578 3219379
56220 3219379 3086803 2951605 2814470 2676154 2537576 2399941 2264822 2133787 2007874
56211 2007874 1887760 1774390 1668884 1571762 1482797 1401672 1328177 1261794 1201774 1147704 1099322
56200 1099322 1055808 1016079 979791 947180 917969 891524 868049 848253 831574 816253 801718
56189 801718 789462 780769 774863 770243 766579 764201 762872 762368 763436 766823 771897 777304 782520 787760
56175 787760 792916 797627 801993 806271 810196 813362 815849 817711 818330 817078 814180 810269 805618 800515
56161 800515 795726 791781 788382 785288 783207 782956 784349 786735 790021 794327 799314 804829 811670 820732
56147 820732 831842 844349 858316 874249 892254 912565 936515 965976 1002157 1045790 1098159
56136 1098159 1161061 1236101 1324621 1427630 1544705 1673207 1809240 1948853 2087691 2220374
56126 2220374 2341722 2448799 2541446 2621465 2691811 2755506 2813905 2865921 2909239 2941798 2962030
56115 2962030 2969245 2964932 2952584 2934968 2912018 2881946 2842999 2793010 2728777 2647906 2550920 2440575
56103 2440575 2320262 2194428 2069099 1949636 1838242 1735150 1641416 1558637 1486596 1423379
56093 1423379 1367778 1319870 1279391 1245261 1216741 1193573 1174965 1159759 1147443 1137801 1129938 1122995
56081 1122995 1117442 1114266 1113192 1113089 1113704 1115611 1118862 1123108 1128612 1135740 1144006 1152952 1163198 1175021
56067 1175021 1186755 1196605 1205375 1215408 1227414 1240377 1253903 1268280 1282610 1295574 1308129 1322949
56055 1322949 1340831 1359817 1378272 1396687 1415963 1435952 1456350 1477404 1499085 1520969 1543268
56044 1543268 1566734 1591423 1616859 1643342 1671642 1701593 1732479 1764573 1798726 1834767 1871885
56033 1871885 1910111 1949708 1989817 2029754 2071024 2115667 2163173 2211404 2260110 2310798 2363416
56022 2363416 2416125 2468492 2522080 2577520 2633653 2690059 2747972 2808200 2870425 2934943 3002895
56011 3002895 3074509 3149227 3227555 3310569 3397742 3487765 3581305 3680364 3785196 3894727 4009726
56000 4009726 4132349 4262593 4398466 4539802 4688667 4845924 5010760 5183746 5366872
55991 5366872 5560312 5762678 5974723 6199296 6437532 6688908 6955242 7240579 7546795
55982 7546795 7873422 8222119 8597186 9001602 9437222 9909070 10424473 10987575 11600125
55973 11600125 12268289 13003126 13813747 14706204 15690597 16783474 18002312 19364619 20894773
55964 20894773 22625977 24594838 26842481 29425185 32419637 35919487 40039679 44933376
55956 44933376 50804818 57913368 66587956 77259108 90484567 106944633 127406298
55949 127406298 152658231 183399588 220037743 262316610 308738114 355982445 398863528
55942 398863528 431322453 448299355 447517003 430114005 399870740 361694524 320247771
55935 320247771 279158660 240783431 206337890 176223633 150370199 128461669 110049238
55928 110049238 94630311 81723662 70908575 61823080 54159286 47669740 42161616
55921 42161616 37474541 33468015 30026116 27058143 24487656 22247023 20282650 18555158
55913 18555158 17030413 15676166 14467684 13388234 12421400 11548826 10756525 10036763 9382013
55904 9382013 8782812 8232784 7729906 7271087 6850376 6463550 6109316 5784851 5485034
55895 5485034 5207136 4951387 4715852 4495489 4287488 4092929 3911926 3741704 3580827
55886 3580827 3430816 3291801 3160704 3035499 2917473 2807458 2703450 2603837 2509683 2421905
55876 2421905 2339058 2259723 2184438 2113701 2046549 1982531 1922748 1867667 1816143 1767585 1722782
55865 1722782 1681659 1642533 1604439 1567907 1532823 1498060 1464017 1432959 1406012 1382426 1362621
55854 1362621 1349097 1343086 1342894 1346755 1354651 1365692 1376105 1381615 1380102 1370729 1352680 1326424 1294433
55841 1294433 1259026 1220776 1180150 1139025 1099317 1061505 1025572 992008 960945 931757 904436
55830 904436 879904 858229 838169 819289 802826 789496 778125 767304 756774 746296 734969
55819 734969 722756 710997 700409 690268 680569 673098 669013 667064 665594 664696 664889 665195 664206 661794
55805 661794 658236 652848 645082 636015 627170 618648 609797 600830 592335 583825 574183 563046 550679 537061
55791 537061 522218 506892 491914 477367 463228 450146 438718 428604 419220 410695 403393 397155
55779 397155 391842 387986 386065 385608 385626 385298 383674 379534 372286 362451 350763 337638 323952 311266
55765 311266 300438 290920 282149 274668 269009 264433 259811 255051 250726 247039 243977 241738 240132 238292
55751 238292 235810 233440 231854 230555 228933 227491 226903 226626 225666 224104 222662 221212 218930 215677 212159
55736 212159 208925 206083 203794 202186 201011 200115 200010 201216 203287 205138 206086 205940 204435 201280 196619
55721 196619 190968 184930 179312 174968 172044 169877 168049 166958 166836 167053 167038 167238 168420 170714 174151
55706 174151 179404 187011 196367 206411 216848 227813 238751 248554 256500 262256 265368 265608 263458
55693 263458 259492 253649 245900 237106 228305 219563 210472 201419 193366 186765 181693 178752 178583 180565
55679 180565 183068 185153 187192 189805 192990 196275 198920 199974 198983 196718 194498 192783 191089 189208
55665 189208 187578 186387 185181 183693 182393 181917 182371 183385 184408 184830 184263 182898 181313 179874 178564
55650 178564 177300 175995 174351 171972 168667 164457 159431 153909 148415 143069 137262 130486 123281 116855
55636 116855 111869 108011 104624 101260 97803 94588 92295 91229 90783 89992 88515 86606 84460 82137 79996
55621 79996 78491 77473 76280 74617 72966 72070 72275 73336 74490 74877 74255 73308 72864 72932 72830 72118 71018
55604 71018 69967 69096 68135 66590 64174 61324 59014 57795 57207 56483 55542 54909 54906 55362 55920 56269 56267 56178 56534
55585 56534 57466 58462 59091 59577 60283 61052 61521 61676 61588 61029 59900 58612 57440 55922 53577 50875 48712
55568 48712 47214 45861 44556 43706 43305 42806 41939 40950 40001 38969 37920 37122 36476 35494 34014 32474 31322
55551 31322 30519 29781 29092 28938 30085 32852 36451 39476 41369 43008 45484 48837 52474 56172 59933
55536 59933 63318 65856 67829 69848 71931 73769 75561 77673 79682 80710 80613 79955 78969 77440 75527
55521 75527 73716 71961 69831 67494 65619 64189 62381 59670 56133 51579 45517 38267 31046 24549
55507 24549 18357 12176 6754 3061 1319 1326 2923 5569 8163 9956 11157 12173 12848 13026 13261 14249
55491 14249 15889 17523 18869 20118 21259 21885 21750 21245 21124 21803 22922 23723 23937 24025 24336 24413 23673 22426
55473 22426 21505 21047 20453 19525 18774 18477 18286 18023 18051 18537 18990 18928 18438 17847 17374 17353 18164 19607 20832
55454 20832 21191 20725 19832 19046 19167 20690 22850 24055 23582 22153 20637 19172 17896 17401 17775 18171 18076
55437 18076 18187 19204 20560 21270 21335 21310 21106 20305 19225 18511 17961 16908 15581 14997 15407 15927 15879 15578
55419 15578 15541 15774 16222 17135 18492 19581 19767 19338 19062 19031 18514 17048 15312 14579 15417 17195 18865 19855
55401 19855 20042 19348 17944 16634 16343 17148 18294 19127 19454 19093 17954 16734 16550 17443 18061 17389 16029
55384 16029 15144 14878 14657 14470 14888 16108 17782 19538 20994 21579 21104 20307 20074 20330 20415 20241 20215 20228 19749
55365 19749 18889 18417 18546 18645 18421 18523 19493 20828 21632 21744 21660 21648 21499 21072 20654 20636 20939 20944 20132 18840
55345 18840 18089 18481 19512 20239 20295 19878 19086 17958 17019 17006 17932 18970 19423 19329 18998 18489 17839 17337 17244
55326 17244 17498 17914 18440 19008 19377 19379 19143 18918 18779 18613 18282 17767 17264 17143 17649 18616 19577 20103 19982 19242
55306 19242 18224 17490 17413 17932 18845 20027 21127 21516 21060 20586 20872 21426 21100 19887 19171 19949 21627 22975
55288 22975 23559 23677 23491 22903 22050 21299 20834 20635 20739 21156 21643 21895 21927 22055 22541 23431 24583 25661 26265
55269 26265 26309 26189 26361 26837 27264 27361 27083 26457 25495 24248 22826 21408 20286 19740 19729 19881 19968 20240 21022
55250 21022 22130 22928 22963 22288 21246 20233 19692 19990 21028 22169 22780 22826 22710 22579 22113 21090 19836
55233 19836 18797 17931 16975 16259 16622 18292 20320 21524 21668 21341 21077 21103 21662 22804 23922 24195 23676
55216 23676 23335 23803 24699 25443 26192 27400 28921 30123 30781 31337 32321 33794 35324 36264 36185 35294 34348 33936
55198 33936 33953 34009 34095 34501 35205 35737 35660 34847 33364 31442 29644 28713 29040 30394 32144 33530 33860 32874
55180 32874 31090 29483 28641 28395 28338 28357 28499 28662 28760 28930 29241 29374 28952 28081 27206 26527 25976 25681 25968
55161 25968 26760 27429 27514 27204 26890 26641 26410 26420 26788 27042 26563 25490 24668 24642 25141 25625 25863 25810 25401 24765
55141 24765 24321 24394 24928 25739 26710 27506 27525 26630 25629 25531 26449 27671 28710 29733 30897 31782 31794 30887 29678
55122 29678 29008 29515 31370 34164 36981 38823 39204 38551 37975 38353 39501 40378 40220 39228 38034 36890 35722
55105 35722 34698 34236 34534 35467 36864 38446 39634 39909 39418 38841 38683 39100 40262 42197 44261 45472
55089 45472 45663 45666 46091 46601 46828 47313 48811 51110 53279 54796 55719 56006 55529 54775 54667 55408 56153 56165 55771
55070 55771 55789 56435 57299 58117 59012 59958 60507 60225 59230 58095 57263 56668 56006 55240 54712 54704 55113 55675 56307 56953
55050 56953 57247 56796 55837 55176 55259 55598 55404 54522 53487 52858 52876 53592 54811 55894 56051 55083 53590 52330
55032 52330 51627 51519 52071 53187 54374 55152 55660 56429 57540 58437 58721 58730 59035 59622 59961 59784 59457 59514 60039
55013 60039 60573 60558 59858 58971 58636 59077 59654 59431 58086 56099 54111 52435 51208 50656 50891 51564 52020 51831
54995 51831 51060 50106 49404 49245 49697 50623 51777 52884 53696 54164 54699 55997 58331 61052 63154 64376 65398
54978 65398 66850 68513 69811 70804 72152 74136 76230 77830 79030 80371 82092 84004 85977 88177 90840
54963 90840 94144 98334 103629 109901 116757 124134 132587 142776 154923 168997 185177 203645 223916
54950 223916 244615 263936 280148 291780 297881 298424 294186 285951 273986 258549 240801 222781
54938 222781 206223 191472 177705 164111 150792 138600 128357 120315 114159 109297 105185 101626
54926 101626 98851 97150 96353 95828 95125 94493 94606 95950 98710 103128 109515 117800 127412 137894 149446
54911 149446 162544 177149 192627 208505 224886 241748 257892 271004 279009 281320 278698 272038
54899 272038 261642 247777 231579 214911 199136 184307 169778 155531 142584 132002 123765 116816
54887 116816 110141 103557 97512 92422 88358 85160 82634 80658 79201 78256 77710 77415 77384 77751 78433 79025
54871 79025 79170 78835 78083 76848 75236 73737 72739 71972 70869 69360 67865 66596 65456 64562 64205 64145 63597
54854 63597 62210 60464 58821 57078 55006 53047 51767 51050 50494 50293 50952 52239 53126 52889 51804 50675
54838 50675 50054 50029 50435 51097 51934 52776 53146 52613 51608 51421 52927 55636 58418 60799 62922 64633 65471
54821 65471 65535 65621 66365 67811 69765 71945 73807 74944 75757 77055 78925 80779 82640 85541 90304 96678
54805 96678 104106 112596 122321 133050 144716 158089 174177 193029 213532 234054 252979 269012
54793 269012 281557 290673 296375 298295 296291 290896 282691 271752 258314 243615 229305 216156 203917
54780 203917 192288 181425 171623 163165 156476 151785 148577 145911 143416 141520 140616 140497 140718 141105 141657
54765 141657 142322 143096 144216 146185 149818 156170 165973 178922 193793 209466 225695 242775 260616
54752 260616 278342 294740 308962 320625 329280 334055 334244 330255 323461 314913 304686 292777 280073
54739 280073 267723 255897 243977 231846 220212 209526 199367 189245 179382 170328 162200 154722
54727 154722 147692 141017 134524 128154 122299 117630 114526 112772 111827 111265 110946 110776 110414 109459 108032 106851
54711 106851 106469 106662 106850 106896 106970 106853 106016 104478 102978 102165 102085 102564 103538 104740 105634 105970 106054 106233 106526
54692 106526 106979 107768 108644 108865 108220 107606 108004 109318 110851 112490 114526 116552 117588 117432 117064 117388 118231
54675 118231 118920 119295 119748 120652 122174 124364 127028 129721 132126 134292 136335 138245 140270 143145 147449
54660 147449 152854 158501 164088 170111 176902 183869 190003 194885 198849 202306 205310 207842 210093 212126
54646 212126 213504 213697 212901 212093 212135 213125 214850 217472 221349 226352 231918 237787 244170 251051 257826 263905
54630 263905 269197 273578 276147 275603 271371 264056 254813 244621 234073 223440 212746 202005 191538
54617 191538 181983 173948 167658 162794 158502 153888 148935 144856 143018 143427 144731 145834 147008 149177
54603 149177 152619 156781 160994 164870 168236 171140 173771 175992 177108 176534 174541 171874 168805 165083
54589 165083 160759 156350 152092 147664 142943 138459 134700 131384 127920 124275 120866 117783 114666 111399
54575 111399 108458 106334 104850 103282 101112 98535 96147 94244 92591 90939 89493 88567 87948 87075 85870
54560 85870 84875 84354 83785 82651 81354 80724 80780 80570 79360 77560 76308 76362 77515 78826 79339 78763 77650
54543 77650 76837 76692 76991 77488 78312 79727 81683 83802 85724 87345 88731 89962 91174 92739 95232 99030
54527 99030 103866 108932 113557 117742 121952 126417 130723 134083 135944 136339 135680 134250 131990 128851 125157
54512 125157 121405 117770 114131 110581 107449 104710 101809 98441 95150 92779 91468 90608 89607 88294
54498 88294 86710 85014 83669 83262 83899 84975 85743 86026 86257 86889 87825 88486 88514 88354 88847 90178 91625
54481 91625 92567 93354 94715 96704 98874 101318 104654 108867 112955 116112 118713 121641 125032 128184 130439
54466 130439 131649 131911 131322 130074 128394 126350 123916 121288 118856 116792 114875 112834 110742 108880 107304
54451 107304 105734 103923 101969 100090 98247 96272 94397 93258 93110 93282 92771 91285 89344 87426 85502
54436 85502 83518 81911 81255 81525 81996 81919 81186 80385 80281 81222 82975 85022 86921 88390 89240 89442 89179
54419 89179 88717 88273 88120 88531 89362 89950 89857 89711 90729 93366 96798 99859 102031 103360 103938 103965 104041 104892
54401 104892 106782 109472 112679 116242 119861 123012 125396 127410 129983 133803 138713 143933 148887 153652
54387 153652 158580 163705 168693 173123 176592 178797 179911 180639 181363 181352 179430 175468 170676 166289 162538
54372 162538 159039 155478 151619 147322 143048 139758 137653 135461 131675 126324 120868 116504 113235 110516
54358 110516 108095 106004 104214 102624 101191 99982 99212 99134 99662 100259 100512 100710 101432 102650 103763 104522
54342 104522 105449 107150 109692 112871 116659 121040 125675 130148 134491 139206 144737 150999 157291 162604
54328 162604 166174 167929 168414 168214 167485 166019 163603 160236 156148 151708 147253 142901 138609 134397 130376
54313 130376 126496 122454 117963 113076 108124 103394 98982 94896 91213 88042 85367 82969 80583 78184
54299 78184 76047 74423 73210 72049 70719 69231 67589 65671 63524 61617 60602 60834 62167 64113 66050
54284 66050 67428 68061 68360 69078 70654 72757 74589 75591 75822 75748 75836 76310 77035 77531 77340 76568 75908 75908 76353
54265 76353 76688 76905 77567 78868 80144 80637 80475 80498 81212 82299 83165 83646 84025 84557 85129 85364 84946 83845
54247 83845 82282 80515 78703 77023 75798 75391 75883 76860 77618 77684 77168 76557 76143 75778 75250 74637 74154 73845
54229 73845 73767 74281 75669 77457 78608 78631 78152 78149 78924 80036 80951 81406 81360 80992 80667 80579 80466 79952 79138 78595
54209 78595 78752 79405 79885 79620 78610 77418 76636 76348 76265 76335 76812 77580 77883 77134 75697 74405 73477 72458
54191 72458 71155 70057 69674 69832 69855 69255 68126 67018 66452 66422 66420 66164 66168 67214 69170 70777 70817 69322 67383
54172 67383 65990 65322 65036 64877 64809 64756 64536 64167 64054 64604 65734 66952 67892 68441 68406 67562 66227 65296 65251
54153 65251 65453 64894 63512 62252 61905 62339 62886 63036 62666 61942 61245 60970 61299 62223 63677 65465 67149
54136 67149 68306 68875 69101 69238 69528 70216 71241 72063 72180 71715 71121 70489 69615 68587 67719 66951 65939 64829
54118 64829 64296 64635 65381 65994 66372 66481 66111 65369 64886 65036 65360 65154 64322 63245 62195 61253 60552 60111
54100 60111 59668 59090 58731 59017 59832 60664 61142 61063 60155 58440 56707 56028 56621 57578 57877 57407 56868 56892 57387
54081 57387 57683 57279 56439 55942 56160 56558 56294 55171 53763 52754 52430 52741 53516 54537 55640 56890 58580
54064 58580 60973 63940 66787 68539 68715 67918 67416 67974 69290 70645 71726 72582 73227 73786 74763 76547
54048 76547 78664 80096 80441 80345 80637 81487 82644 84163 86408 89421 92593 95113 96669 97683 98907 100858
54032 100858 103629 107106 111175 115668 120313 124866 129263 133598 138030 142693 147485 151898 155324 157694
54018 157694 159627 161846 164659 168015 171662 175043 177466 178761 179481 180116 180444 180082 179232 178274 176993 174976
54002 174976 172562 170471 168514 165685 161771 157916 155095 152859 150282 147443 145068 143140 140895 138090
53988 138090 135373 133234 131357 129417 127873 127389 127745 127920 127312 126427 126139 126521 126829 126601 126346 126789 127723
53971 127723 128137 127535 126552 126031 125942 125654 124938 124097 123237 122000 120146 117996 116086 114680 113767 113246 112975
53954 112975 112874 113143 114154 115952 118027 119745 120817 121286 121353 121448 122189 123915 126399 129323 132887 137607
53938 137607 143539 150115 156758 163379 170179 177284 184695 192308 199819 206777 212831 217855 221832 224883
53924 224883 227414 229848 232059 233434 233696 233337 232962 232643 232299 232382 233525 235659 238080 240401 242882 245750
53908 245750 248866 252316 256732 262520 269098 275355 280696 285174 288846 291501 293103 293978 294364 293997 292451
53893 292451 289713 286281 282685 279055 275211 271084 266929 263027 259220 254907 249601 243409 236879 230394
53879 230394 223895 217245 210728 204951 200178 195942 191544 186840 182249 178010 173886 169777 166160 163467
53865 163467 161333 158942 155944 152493 148542 143846 138732 134158 130714 128123 125939 124081 122306 119920
53851 119920 116738 113835 112459 112396 112187 110909 109009 107297 105860 104316 102535 100673 98771 96753 94772
53836 94772 93268 92570 92502 92415 91787 90854 90517 91421 93277 95295 97094 98853 100676 102223 103026 102899 102012
53819 102012 100799 99781 99160 98605 97672 96442 95453 95022 94970 94995 95026 95178 95709 96979 99075 101448 103377
53802 103377 104866 106669 109348 112756 116546 120669 125130 129780 134662 140061 145841 151173 155389 158723
53788 158723 161737 164424 166504 168318 170654 173685 176736 179181 180996 182299 182896 182595 181547 179998 178016
53773 178016 175714 173480 171607 169872 167785 165183 162310 159342 156129 152517 148763 145412 142744 140482
53759 140482 138153 135649 133251 131117 129094 127216 125998 125769 125851 125009 122836 120281 118514 117663 116986 115958
53743 115958 114766 113808 113165 112656 112094 111408 110680 110092 109760 109611 109507 109360 109018 108227 107065 106269 106673 108190
53725 108190 109779 110543 110534 110290 110039 109756 109722 110498 112362 115095 118210 121097 123054 123728 123639 123868 125034 126757
53707 126757 128227 129047 129467 130093 131483 133743 136331 138490 140054 141559 143443 145499 147375 149267 151598
53692 151598 154206 156317 157320 157242 156470 155402 154451 153993 154107 154543 155054 155560 155962 156106 156120 156509 157599 159012
53674 159012 160044 160514 160932 161720 162557 162805 162407 162041 162346 163249 164191 164779 164976 164831 164333 163465 162209 160564
53656 160564 158862 157916 158449 160213 162079 163116 163350 163402 163808 164876 166771 169313 171950 174226 176046 177303
53640 177303 177617 176894 175810 175227 175277 175439 175359 175069 174597 173917 173269 172963 172859 172565 172172 172240 172956 173889 174764
53621 174764 175932 177732 179885 181851 183437 184679 185507 185967 186570 187899 189907 191949 193558 194948 196689
53606 196689 199042 201660 203881 205324 206243 207307 209034 211493 214444 217610 220835 224153 227710 231513
53592 231513 235308 238852 242175 245319 248042 250156 252068 254507 257669 261060 264245 267257 270157 272721
53578 272721 274843 276791 278691 280118 280589 280302 280082 280647 282103 283951 285431 286066 286070 286086 286452 286955 287320
53561 287320 287547 287672 287638 287627 288093 289180 290480 291649 292868 294406 296208 298284 301058 304810 309121 313414
53545 313414 317718 322330 326994 331117 334720 338504 342986 348090 353553 359236 364963 370570 376196 382160
53531 382160 388509 395028 401592 408135 414409 420301 426347 433292 441078 448850 456126 463369 471181 479512
53517 479512 487977 496483 505085 513641 522074 530757 540125 550028 559855 569271 578514 587973 597780 607981
53503 607981 618880 630984 644567 659342 674663 690074 705623 721661 738483 756238 775002
53492 775002 794688 814964 835384 855594 875330 894404 912937 931515 950802 970983 991686
53481 991686 1012280 1032105 1050668 1068001 1084741 1101469 1118061 1134063 1149556 1165168 1181210
53470 1181210 1197321 1213043 1228249 1242885 1256803 1270142 1283436 1296947 1310081 1321774 1331397
53459 1331397 1339143 1345718 1351654 1356758 1360163 1361190 1360160 1358039 1355318 1351680 1346830 1341042 1334556 1326969
53445 1326969 1317736 1306948 1295141 1282553 1269056 1254711 1239880 1224673 1208684 1191464 1173146
53434 1173146 1154453 1136081 1118104 1100040 1081527 1062774 1044192 1025859 1007729 990214 973940
53423 973940 958961 944889 931922 920916 912089 904414 896962 890166 884912 880918 877054 873074 869967
53410 869967 868480 868249 868702 869994 872561 876345 880981 886399 892788 900273 908954 919084 930843 944132
53396 944132 958840 975074 992815 1011545 1030628 1050008 1070211 1091710 1114587 1138849 1164743
53385 1164743 1192598 1222422 1253807 1286234 1319475 1353720 1389279 1426156 1463953 1502230 1540815
53374 1540815 1579690 1618639 1657201 1695038 1732268 1769344 1806512 1843360 1878939 1912384 1943435
53363 1943435 1972300 1999101 2023566 2045228 2063726 2078860 2090538 2098869 2104123 2106351 2105031 2099374
53351 2099374 2089101 2074723 2056888 2035638 2010701 1982532 1952588 1922210 1891481 1859541 1825927
53340 1825927 1791072 1755523 1719307 1682354 1645073 1607983 1571170 1534706 1499414 1466448 1435966
53329 1435966 1406770 1377535 1348036 1318979 1291114 1264851 1240390 1217711 1196522 1176650 1158417
53318 1158417 1142310 1128318 1115927 1104826 1095254 1087462 1081102 1075373 1069710 1064062 1058520 1052796 1046253
53305 1046253 1038479 1029786 1021060 1013032 1005744 998800 992114 986287 982184 980134 979673 980085 981120 983063
53291 983063 986141 990112 994587 999581 1005485 1012557 1020751 1030054 1040637 1052571 1065707 1080050 1095968
53278 1095968 1113735 1133114 1153725 1175570 1198738 1222685 1246381 1269255 1291576 1313759 1335707
53267 1335707 1357050 1377604 1397224 1415488 1431895 1446280 1458747 1469299 1477785 1484114 1488289 1490358
53255 1490358 1490559 1489292 1486552 1481540 1473318 1461918 1448409 1433758 1418030 1400879 1382411 1363233
53243 1363233 1343802 1324089 1303841 1283018 1261966 1241216 1221052 1201304 1181724 1162575 1144573
53232 1144573 1128146 1112965 1098317 1083662 1068741 1053494 1038291 1023996 1011429 1000736 991486
53221 991486 983212 975596 968313 961176 954491 948874 944604 941353 938581 935964 933432 931060 928920 926759
53207 926759 923821 919403 913685 907595 901670 895396 888021 879624 870946 862304 853185 843003 831933 820828
53193 820828 810473 801052 792263 783771 775486 767390 759221 750594 741401 731887 722167 711926 700867
53180 700867 689257 677684 666297 654648 642334 629513 616622 603880 591295 578997 567199
53169 567199 555869 544689 533470 522401 511708 501179 490274 478826 467450 457027 447717 438646
53157 438646 428767 418076 407839 399441 393017 387348 381140 374175 367074 360235 353540 347092 341570 337424
53143 337424 334105 330686 327081 324015 321797 319835 317638 315704 314902 315367 316565 318148 320122 322167 323456
53128 323456 323418 322320 320787 318933 316239 312248 307186 301883 297036 292511 287398 280866 272996 264716 257071
53113 257071 250682 245673 241600 237443 232187 225805 219448 214376 210840 208202 205794 203257 200260 196522
53099 196522 192306 188418 185394 182874 180054 176659 173271 170673 169019 167631 165625 162763 159629 156907
53085 156907 154610 152273 149791 147628 146084 144860 143648 142693 142237 141728 140337 138223 136547 135954 135673
53070 135673 134520 132351 130024 128226 126881 125645 124438 123396 122670 122318 122179 121815 120871 119576 118589 118282
53054 118282 118333 118185 117669 116997 116314 115512 114521 113565 112957 112699 112458 112048 111799 112181 113128 113985 114245 114048 113795
53035 113795 113571 113238 112868 112701 112750 112811 112784 112702 112468 111903 111110 110449 110151 110184 110492 111037 111623 112005 112181 112303
53015 112303 112352 112295 112521 113564 115240 116638 117218 117465 118143 119395 120970 122877 125222 127685 129762 131455
52999 131455 133232 135327 137541 139735 142129 145008 148428 152266 156311 160322 164230 168281 172740 177449
52985 177449 181963 186115 190147 194196 197918 200749 202418 203103 203171 202790 201774 199880 197311 194667 192182
52970 192182 189291 185318 180466 175683 171567 167857 164084 160266 156824 154139 152379 151371 150485 148977
52956 148977 146750 144458 142626 141030 139320 137844 137307 137743 138399 138683 138648 138484 138035 137172 136187 135428 134780
52939 134780 133922 133003 132630 133121 134108 134953 135366 135496 135683 136247 137360 138913 140534 141801 142472 142568 142404 142533
52921 142533 143360 144685 145772 146028 145499 144638 143866 143503 143841 144887 146171 147140 147723 148296 149173 150442 152080
52904 152080 153833 155037 155048 153988 152747 152140 152313 152937 153654 154279 154970 156179 158089 160102 161408 162105
52888 162105 163139 164978 166957 168204 168613 168537 168159 167716 167757 168472 169217 169387 169470 170445 172406 174593 176736
52871 176736 179519 183527 188439 193532 198457 203185 207657 211848 215981 220392 225187 230084 234456 237646
52857 237646 239420 240118 240219 239917 239297 238576 237757 236293 233671 230214 226808 223846 220995 217967 214935 212168
52841 212168 209823 208156 207323 206841 205865 204216 202558 201386 200448 199484 198831 198800 198929 198427 197030 194999 192534
52824 192534 189690 186632 183576 180597 177763 175242 173001 170726 168369 166417 165259 164629 164117 163875 164263
52809 164263 165047 165585 165672 165504 164903 163323 160814 158305 156653 155872 155576 155623 155844 155557 154064 151663 149670
52792 149670 149214 150197 151530 152118 151489 149769 147461 145287 143877 143347 143238 143007 142529 141988 141492 141057 140868
52775 140868 141138 141667 141855 141346 140408 139483 138620 137623 136592 135982 136083 136598 136853 136387 135389 134545 134359 134606
52757 134606 134548 133712 132293 130766 129301 127731 125974 124288 123049 122329 121729 120749 119381 118173 117521 117139
52741 117139 116542 115862 115644 115850 115698 114733 113461 112556 111945 111243 110729 111207 112958 115301 117340 118735 119738
52724 119738 120784 122174 123898 125693 127407 129351 132059 135627 139434 142667 145153 147537 150565 154070
52710 154070 156817 157523 156053 153397 150588 147918 145169 142092 138452 134158 129716 126180 124122 122868
52696 122868 121190 118598 115509 112397 109413 106788 104915 103729 102443 100310 97453 94694 92701 91474
52682 91474 90622 89910 89488 89574 89965 89983 89060 87352 85634 84527 83927 83225 81980 80342 78792 77544 76342
52665 76342 74918 73494 72538 72100 71734 71146 70516 70023 69470 68752 68343 68830 70047 71124 71440 71243 71220 71711
52647 71711 72441 72946 73133 73325 73700 73849 73204 71873 70604 69831 69204 68302 67365 66936 67195 68010 69294 70771
52629 70771 71715 71581 70758 70147 70067 70136 70073 70015 69995 69756 69227 68700 68327 67873 67173 66485 66196 66450 67166 68136 69019
52608 69019 69480 69519 69475 69666 70192 71022 72004 72833 73345 73816 74649 75751 76540 76561 75822 74595 73253 72234 71761
52589 71761 71562 71236 70845 70718 70768 70553 70099 70057 70870 72269 73842 75595 77672 79852 81668 82796 83230
52572 83230 83272 83482 84236 85238 85761 85423 84383 82836 80943 79337 78991 80179 82027 83464 84166 84296 83875
52555 83875 82990 82231 82296 83273 84693 86121 87391 88492 89565 90856 92361 93710 94645 95361 96148 96977 97702
52538 97702 98340 98900 99331 99992 101704 104782 108385 111355 113421 114974 116011 116070 115135 113835 112683 111737
52522 111737 111033 110722 110651 110453 110223 110461 111085 111156 110066 108562 108013 108866 110304 111318 111649 111642 111626 111625 111494 111129
52502 111129 110544 109844 109176 108716 108638 109002 109634 110203 110494 110558 110612 110832 111325 112183 113408 114715 115570 115599 114944
52483 114944 114079 113266 112414 111513 110870 110624 110293 109224 107448 105746 104858 105015 106182 108246 110770 113032
52467 113032 114659 115922 117184 118305 118851 118636 117863 117032 116914 118130 120293 121918 121724 119980 118157 117408
52451 117408 117834 119016 120613 122312 123758 124818 125693 126584 127484 128385 129451 130877 132692 134754 136779
52436 136779 138351 139118 139101 138738 138590 139042 140143 141599 142977 144062 144950 145731 146263 146481 146726 147437 148592
52419 148592 149738 150581 151221 151816 152309 152507 152237 151351 149858 148092 146556 145501 144800 144235 143674 142973 141965
52402 141965 140709 139556 138822 138443 138053 137381 136512 135758 135319 135098 134889 134662 134464 134135 133425 132455 131726 131450
52384 131450 131239 130732 130257 130467 131481 132756 133724 134160 134092 133795 133801 134465 135434 135978 135942 136024 136959 138723 140670
52365 140670 142162 142902 142910 142523 142370 143143 145166 148054 150846 152664 153394 153588 153734 153985 154714 156655 159922
52348 159922 163324 165529 166732 168345 170950 173534 175148 176497 179142 183521 188475 192566 195312 197149
52334 197149 198747 200568 202739 205085 207357 209520 211738 214032 216037 217326 218007 218806 220327 222375 224321
52319 224321 226118 228415 231466 234507 236767 238687 241414 245250 249333 252926 256303 260189 264864 270139
52305 270139 275690 281161 286288 291268 296678 302850 309651 317012 325206 334256 343500 352258 360687 369576
52291 369576 379431 390149 401432 413169 425427 438435 452582 468161 484984 502355 519529 536319
52279 536319 553309 571374 590710 610396 629205 646924 664483 682719 701394 719662 737089
52268 737089 753867 770254 786157 801113 814408 825358 833769 840112 845132 849362 853022 856104 858335
52255 858335 859299 858779 856826 853425 848474 842343 836077 830605 825879 821117 815744 809828 803823 798300 793893
52240 793893 791112 790078 790584 792430 795624 800355 806894 815399 825615 836851 848374 859777 871036
52227 871036 882485 894764 908321 922672 936516 948921 960125 970816 980921 989651 996614 1002351
52215 1002351 1007648 1012583 1016332 1017763 1016275 1012248 1006618 999879 991640 981319 968988 955321 940912
52202 940912 925930 910300 893958 877029 859975 843354 827186 810832 793782 776313 759064
52191 759064 742257 725793 709851 694898 681238 668977 658256 649000 640661 632724 625360 618990
52179 618990 613349 607652 601652 595874 590703 585927 581311 576987 573013 569148 565315 561783 558534 554974
52165 554974 550707 546179 542183 538977 536231 533549 530704 527646 524663 522348 521052 520457 519941 519210 518362
52150 518362 517533 516766 516076 515354 514366 513090 511946 511369 511213 510781 509398 506851 503425 499791 496755 494794
52134 494794 493754 493080 492297 491119 489284 486615 483317 479948 476927 474190 471489 468877 466728 465266 464338
52119 464338 463761 463690 464349 465468 466370 466752 467118 468205 470153 472423 474391 475906 477463 479895 483584 487783
52103 487783 491233 493806 497094 502706 510394 518591 526572 535158 545339 557160 570188 584196 598965
52090 598965 614198 630121 647566 666966 687788 709303 731311 753606 775466 796455 817221
52079 817221 838638 860488 881734 901846 920987 939052 955472 970062 983175 994812 1004308 1011268
52067 1011268 1016238 1019981 1022489 1023201 1021956 1019291 1015783 1011369 1005414 997359 987214 975345 961975
52054 961975 947226 931719 916622 902685 889525 876337 863069 850412 838787 828062 818257 809856
52042 809856 803169 797914 793723 790685 789151 789335 791283 794902 799773 805277 811140 817660 825219 833904
52028 833904 843701 854656 866523 878593 890220 901297 911949 921991 931088 939253 946788 953719
52016 953719 959596 963857 966257 966995 966513 965103 962601 958539 952670 945110 935961 925136 912753 899312
52002 899312 885184 870146 853829 836329 818025 799029 779343 759393 739827 720734 701628
51991 701628 682353 663493 645617 628534 611620 594614 577717 561064 544477 527809 511270
51980 511270 495352 480422 466440 453057 440026 427516 415936 405473 395890 386768 377819 368966
51968 368966 360317 352080 344372 337074 330046 323553 318236 314525 312165 310421 308634 306455 303734 300422
51954 300422 296596 292455 288281 284436 281298 279016 277292 275451 272854 269363 265569 262432 260480 259230
51940 259230 257644 255231 252556 250533 249422 248705 247735 246182 243955 241108 237970 235117 232996 231622 230684
51925 230684 229909 229301 229081 229392 229969 230230 229904 229535 230083 231931 234450 236679 238189 239153 239837 240388 241030
51908 241030 242035 243278 244063 243646 241893 239311 236542 233987 231777 229838 227945 225925 223911 222177 220608
51893 220608 218647 216039 213394 211635 210934 210576 209926 209103 208582 208519 208665 208647 208106 206889 205373 204304 203968
51876 203968 203809 203222 202462 202257 202728 203275 203472 203520 203794 204472 205673 207367 208997 209742 209427 208739 208301 208052
51858 208052 207788 207806 208569 210103 212100 214251 216081 216948 216761 216401 216847 218169 219877 221902 224414 226833
51842 226833 227994 227566 226630 226530 227613 229375 231340 233384 235507 237613 239477 240870 241919 243327 245869
51827 245869 249567 253673 257516 260957 263924 266025 266965 266940 266297 265045 262964 259946 256014 251352 246558
51812 246558 242530 239663 237393 234901 232062 229377 227210 225589 224567 224214 224242 224103 223663 223468 224157 225796
51796 225796 227879 229850 231553 233249 235244 237525 239865 242246 244895 247735 250141 251551 252117 252413 252646
51781 252646 252562 252029 251218 250145 248511 246214 243705 241589 240034 238717 237263 235625 234141 233293 233295 233894
51765 233894 234607 235130 235460 235778 236371 237524 239161 240677 241446 241519 241581 242246 243646 245601 247778 249667 250910
51748 250910 251829 253239 255554 258429 261458 264770 268604 272692 276499 279841 282864 285598 288007 290353
51734 290353 293010 295945 298789 301513 304699 308987 314434 320504 326515 332126 337626 343781 351209 359879
51720 359879 369327 379260 389639 400257 410694 420802 430795 440550 449107 455179 458084 458013 455544 451204
51706 451204 445409 438573 431220 424031 417563 411727 405757 399050 391959 385419 379806 374603 369229 363748
51692 363748 358539 353725 349300 345528 342655 340269 337471 333853 330048 327160 325799 325744 326276 326697 326756 326729
51676 326729 326972 327193 326413 323863 319780 315041 310198 305298 300563 296659 293934 291819 289453 286778 284553
51661 284553 283270 282473 281385 279972 279043 279365 280907 283037 285308 287894 291293 295731 301048 307146 314312
51646 314312 322827 332285 341615 349965 357391 364439 371158 376780 380446 382023 382079 381186 379384 376302 371645
51631 371645 365496 358134 349734 340438 330752 321527 313188 305235 296959 288606 281296 275612 270838 265912
51617 265912 260620 255331 250030 244425 238874 234420 231647 230069 228848 227597 226247 224645 222713 220665
51603 220665 218671 216545 214146 211820 210092 209062 208460 208121 208038 208047 207859 207391 206825 206355 206069 205930 205658 204889
51585 204889 203758 203137 203787 205397 206883 207594 207756 207853 208172 209055 210982 214067 217880 221985 226320 230916
51569 230916 235696 240838 246850 253874 261267 268345 275307 282991 291902 301915 312730 324105 335558
51556 335558 346221 355132 361571 365275 366595 366293 364822 361828 356748 349814 342030 334114 325948 317343
51542 317343 308961 302015 297149 293900 291341 289122 287845 288400 290976 294823 299049 303496 308640 314797
51528 314797 321811 329544 338231 348090 358832 369820 380596 391021 401020 410337 418525 425048 429486
51515 429486 431796 432242 431000 427996 423272 417319 410837 404316 398136 392889 389074 386440 384078 381451
51501 381451 379047 377744 377746 378562 379882 382033 385378 389589 393835 397546 400725 403486 405589 406628 406499
51486 406499 405475 403825 401502 398225 393696 387779 380696 373145 366010 359750 354211 349113 344472 340320
51472 340320 336329 332250 328604 326347 325665 325590 325117 324327 324048 324710 325979 327381 328827 330532 332760 335631
51456 335631 338901 342040 344845 347855 351761 356504 361429 366368 371965 378787 386677 395253 404460 414227
51442 414227 424049 433427 442473 451565 460658 469373 477550 485169 491897 497300 501409 504517 506460 506653
51428 506653 504914 501695 497420 492104 485776 478762 471454 464344 458393 454654 453163 452810 452768 453471 455670
51413 455670 459079 462679 465963 469094 472010 474111 474787 473627 470219 464450 457039 449084 440972 432333
51399 432333 423082 413682 404208 394044 383017 372051 362068 352823 343611 334574 326407 319038 311626
51386 311626 303958 296958 291513 287494 284233 281340 278671 276085 273884 273100 274699 278527 283497 288793
51372 288793 294469 300866 307899 315144 322316 329437 336610 343692 350067 354682 356456 354848 350052 342707
51358 342707 333531 323164 312101 300625 288927 277397 266709 257423 249517 242338 235027 227101 218827
51345 218827 211081 204624 199351 194367 188977 183468 178772 175448 173219 171397 169459 167187 164609 162023
51331 162023 159911 158585 157934 157582 157216 156687 155906 154854 153681 152675 152096 152056 152541 153434 154558 155789 157174
51314 157174 158803 160532 161923 162560 162446 162018 161756 161848 162241 162925 164100 166046 168894 172522 176620 180925
51298 180925 185427 190361 195913 201935 208123 214514 221622 229924 239297 249131 258949 268726 278654 288745
51284 288745 298602 307386 313985 317611 318364 317042 314203 309567 302615 293620 283741 274002 264465 254564
51270 254564 244063 233410 223266 213979 205617 198169 191495 185234 179076 173155 167892 163405 159309
51257 159309 155200 151136 147512 144612 142404 140614 138875 136978 135096 133578 132442 131333 130175 129460
51243 129460 129609 130344 131108 131781 132447 132795 132456 131859 131942 132973 134343 135648 137187 139118 140959 142391 143858
51226 143858 145800 147918 149860 152029 154922 158058 160432 161814 162737 163385 163289 162165 160271 157919 155322
51211 155322 152939 151199 149791 148000 145887 144290 143430 142466 140917 139578 139349 139848 140146 140320 141183 142670
51195 142670 143583 143159 142041 141327 141265 141304 140991 140350 139576 138791 138105 137610 137281 137016 136811 136782 136969 137207 137220 136856
51175 136856 136161 135232 134119 132945 131968 131293 130628 129642 128599 128253 128907 129870 130172 129622 128874 128508 128394 128018
51157 128018 127137 126010 125070 124502 124110 123655 123268 123397 124300 125705 127107 128254 129286 130555 132451 135176
51141 135176 138416 141369 143321 144173 144245 143733 142622 141018 139214 137407 135579 133715 131946 130473 129474
51126 129474 129014 128807 128203 126742 124765 123185 122550 122525 122324 121488 120269 119463 119833 121371 123192 124437 125203
51109 125203 126216 127717 129308 130930 133250 136721 140947 145440 150355 155801 160993 165134 168846 173639
51095 173639 179769 185602 189426 191043 191143 189994 187610 184605 181881 179567 177142 174590 172577 171317
51081 171317 170038 167984 165371 162840 160410 157645 154638 152183 150887 150496 150253 149586 148426 147135 146250
51066 146250 146055 146255 146247 145751 144992 144186 143171 141734 140087 138704 137764 137045 136335 135753 135555 135730 135904 135684
51048 135684 135100 134635 134717 135236 135743 136071 136426 136810 136831 136449 136499 137921 140572 143392 145769 148084 150682 152965
51030 152965 154160 154643 155782 158382 161852 165157 168126 171336 174954 178287 180732 182759 185502 189457
51016 189457 194006 198281 202082 205594 208602 210559 211435 211896 212440 212778 212417 211478 210560 209992 209695 209683 210192
50999 210192 211242 212520 213884 215644 218126 221274 224960 229401 234779 240653 246280 251684 257954 266085
50985 266085 275785 285759 295135 304224 313898 324684 336788 350688 367133 386454 408195 431731
50973 431731 457082 484969 516162 551023 589664 632304 679289 730792 786492 845592 907312
50962 907312 971529 1038790 1109341 1182055 1254593 1324762 1391462 1454111 1511453 1561408 1601991
50951 1601991 1632028 1651067 1659216 1657339 1646838 1628668 1602690 1568539 1527128 1480909 1432523 1383579
50939 1383579 1334798 1286827 1240396 1195895 1153356 1113011 1075506 1041291 1009903 980071 950569
50928 950569 920887 891137 861442 831602 801374 770913 740700 710911 681133 650964 620864
50917 620864 592147 565975 542477 520935 500605 481193 462761 445571 430095 416826 405776
50906 405776 396311 387737 379979 373449 368289 364059 360234 356692 353527 350736 348446 347212 347562 349193
50892 349193 351106 352693 354311 356602 359655 363149 366931 370989 375073 378918 382851 387670 393776 400757
50878 400757 407909 414869 421705 428832 437014 447024 458928 471886 484925 497787 510948 525100
50866 525100 540845 558588 578363 599955 623498 649778 679668 713533 751577 794551 843543
50855 843543 899213 961781 1031801 1110296 1198017 1295108 1401746 1518495 1645606 1782405 1927774
50844 1927774 2080909 2240983 2406244 2573871 2740536 2902492 3055121 3193066 3311303
50835 3311303 3406110 3475103 3516793 3530426 3516208 3475476 3410650 3325017 3222404 3106958 2983111
50824 2983111 2855529 2728774 2606810 2492668 2388225 2294019 2209326 2132701 2062533 1997104
50814 1997104 1934560 1873386 1812927 1753035 1693101 1631866 1568321 1502408 1434642 1365487 1295516
50803 1295516 1225881 1158117 1093430 1032416 975289 922047 872474 826416 784180 746414 713414
50792 713414 684632 658962 635503 614128 595450 580229 568693 560376 554557 550691 548358 547056
50780 547056 546303 545876 545777 546046 546768 548072 549758 551024 550963 549477 547438 545809 544826 544088 543139 541783 540025
50763 540025 538033 536196 535072 535178 536653 539042 541537 543682 545849 548878 553337 559388 567208 577042
50749 577042 588774 601965 616633 633563 653446 675989 700335 726172 754045 784728 818845
50738 818845 857083 900192 948512 1001867 1060227 1124291 1195149 1273495 1359359 1452363 1551810
50727 1551810 1656433 1764359 1873582 1982359 2088961 2191028 2285373 2368536 2437503 2489864
50717 2489864 2523542 2536717 2528240 2498207 2448253 2381417 2301619 2212933 2119104 2023520 1929334
50706 1929334 1839218 1754947 1677420 1607074 1544023 1487818 1437486 1391993 1350416 1311519 1273558
50695 1273558 1234860 1194498 1152239 1108207 1062941 1017472 972787 929197 886591 845234 805967
50684 805967 769624 736597 706891 680228 656111 634194 614695 598157 584793 574355 566577 561277
50672 561277 558040 556328 556090 557814 561762 567613 575121 584608 596335 609668 623364 636584 649345
50659 649345 662154 675479 689451 703799 718129 732404 746981 762053 777421 793012 809243
50648 809243 826495 844649 863663 884279 907496 933498 961729 991989 1024771 1060519 1099241
50637 1099241 1140974 1185842 1233315 1282038 1330858 1379509 1427865 1475035 1519769 1561318 1599237
50626 1599237 1632720 1660970 1684121 1702946 1717521 1727025 1731340 1732257 1732587 1734333 1738114 1743925 1751729
50613 1751729 1761418 1772848 1786173 1801667 1818947 1836709 1853563 1868971 1883097 1895898 1906740
50602 1906740 1914848 1919660 1920535 1916383 1905875 1887955 1862038 1827921 1785877 1736880 1682444 1624039
50590 1624039 1562684 1499197 1434650 1370448 1307879 1247663 1189919 1134592 1081956 1032716 987530
50579 987530 946445 908876 874202 842288 813414 787836 765605 746715 731120 718524 708349
50568 708349 700159 694078 690585 689837 691394 694749 700015 707772 718237 730838 744759 759758 776176
50555 776176 794303 814084 835525 858980 884669 912089 940244 968494 996890 1025609 1054413
50544 1054413 1082829 1110586 1137544 1163286 1187188 1209029 1229413 1249543 1270618 1293340 1317694
50533 1317694 1343171 1369491 1397322 1428091 1463019 1502626 1547304 1597941 1655435 1719752 1790000
50522 1790000 1865471 1946039 2031357 2120164 2210818 2302155 2393308 2482810 2568311 2647226 2717337
50511 2717337 2776751 2823726 2856864 2875481 2879618 2869754 2846499 2810479 2762453 2703569 2635557 2560691
50499 2560691 2481623 2401279 2322758 2249128 2183221 2127545 2084053 2053614 2035723 2029082 2032620 2045842
50487 2045842 2068134 2097926 2132561 2168708 2202704 2230723 2249120 2254921 2246147 2221885 2182306 2128648
50475 2128648 2063042 1988113 1906518 1820708 1732929 1645223 1559228 1475889 1395650 1319095 1247288
50464 1247288 1181272 1121391 1067417 1019254 977007 940315 908137 879585 854668 833876 817237
50453 817237 804211 794389 787888 785010 785838 790174 797573 807336 818814 831914 847153 865021 885374
50440 885374 907593 931230 956341 983157 1011562 1041017 1071039 1101651 1133178 1165613 1198395
50429 1198395 1230882 1262711 1293488 1322425 1348690 1371952 1392138 1408852 1421624 1430777 1437398 1442260
50417 1442260 1445342 1446692 1447127 1447553 1448195 1449284 1452250 1459281 1471546 1488436 1508667 1531481 1556575
50404 1556575 1583543 1611932 1641501 1671880 1702119 1730954 1757391 1780693 1799882 1813649 1820757
50393 1820757 1820243 1811244 1793012 1765282 1728456 1683305 1630648 1571474 1507296 1440235 1372687 1306814
50381 1306814 1244251 1186259 1134074 1088913 1051425 1021284 997637 980066 968950 964839 967670 976639
50369 976639 990534 1007860 1026750 1045146 1061265 1073817 1081759 1084028 1079733 1068685 1051557 1029473
50357 1029473 1003443 974283 943002 910976 879527 849369 820623 793333 767740 744055 722223
50346 722223 702162 684034 667979 653636 640266 627524 615881 606073 598214 591754 586300 582158
50334 582158 579880 579487 580467 582486 585760 590623 597024 604712 613662 623970 635418 647517 660063 673314
50320 673314 687502 702405 717617 733011 748722 764872 781608 799286 818208 838118 858232
50309 858232 877884 896859 914972 931583 945871 957461 966465 972948 976735 977923 977204 975295 972149
50296 972149 967114 959992 951567 942866 934134 924858 914667 903770 892450 880520 867555 853500 838745
50283 838745 823632 808070 791744 774672 757458 740869 725014 709084 692218 674620 657539
50272 657539 642004 627878 614266 600446 586145 571342 556400 542233 529709 518841 508991 499864
50260 499864 491777 484814 478407 472093 466229 461429 457648 454336 451339 449058 447713 446950 446353 445951 445960 446269
50244 446269 446451 446284 446086 446485 447861 449965 452093 453619 454372 454505 454206 453596 452755 451652 450181 448403
50228 448403 446578 444731 442385 439141 435516 432717 431398 430947 430250 428869 427235 425913 425076 424672 424754 425468
50212 425468 426827 428557 430209 431456 432298 432922 433362 433511 433515 433921 435130 436853 438317 439026 439146 439228 439830
50195 439830 441386 444098 447691 451409 454454 456531 457967 459302 460774 462188 463375 464668 466692 469497
50181 469497 472181 473680 473818 473189 472035 469734 465623 459948 453694 447732 442453 438048 434730 432651 431886
50166 431886 432534 434581 437616 440851 443550 445330 446084 445715 444031 440778 435752 428910 420437 410747 400501
50151 400501 390573 381783 374515 368691 364166 360921 358703 356784 354426 351485 348251 344873 341353 338016
50137 338016 335395 333528 331847 329964 328171 326946 326377 326328 326801 327778 329043 330586 332866 336204 340098
50122 340098 343681 346780 350019 353900 358337 363259 369121 376405 384850 393521 401594 408901 415741 422351
50108 422351 428611 434254 439292 444092 448965 453821 458359 462451 466029 468763 470175 470130 468961 467135 465065
50093 465065 463229 462047 461465 460941 460066 459023 458332 458338 459076 460403 462062 463825 465757 468262 471718 476160
50077 476160 481380 487140 493214 499491 506181 513710 522215 531319 540657 550489 561548 574339 588631
50064 588631 603508 617827 630914 643001 654799 666562 677835 688207 697826 706833 714799 721310
50052 721310 726728 731621 735627 737714 737575 736013 733724 730460 725771 719895 713400 706461 699149 692042
50038 692042 685820 680289 674421 667435 659433 650939 642260 633457 624524 615338 605747 596038 587111 579784
50024 579784 573834 568030 561319 553919 546982 541201 535988 530263 523786 517316 511472 506007 500504 495321
50010 495321 491237 488293 485623 482582 479520 477159 475620 474468 473496 472946 472923 473048 472842 472246 471563 471050
49994 471050 470733 470497 470145 469349 467742 465138 461648 457563 453127 448434 443449 438079 432283 426182 420159
49979 420159 414724 410162 406241 402411 398470 394947 392679 391981 392426 393417 394730 396415 398495 401017 404271
49964 404271 408608 414153 420921 429109 438904 449967 461513 473054 484832 497352 510666 524226
49952 524226 537194 548756 558351 565856 571492 575491 578031 579550 580798 582390 584449 586894 589791 593154
49938 593154 596589 599422 600990 600552 597218 590466 580642 568576 554830 539731 523973 508560 494062
49925 494062 480469 467866 456679 446975 438046 429164 420423 412498 405804 400291 395841 392386 389633
49912 389633 387030 384078 380557 376450 371861 367011 362198 357754 354044 351321 349412 347611 345106 341601
49898 341601 337451 333261 329354 325583 321618 317464 313662 310854 309229 308507 308349 308481 308519 308196 307791 307867
49882 307867 308398 308664 308302 307962 308445 309597 310575 310990 311193 311623 312378 313400 314570 315647 316497 317384 318636
49865 318636 320169 321759 323639 326273 329607 333192 337014 341509 346649 351803 356826 362529 369521 377217
49851 377217 384694 392134 400617 410685 421874 433711 446444 460569 476166 493031 511138 530569
49839 530569 551169 572476 593919 614854 634553 652467 668625 683594 697939 711828 725241
49828 725241 738424 751821 765512 778995 791679 803353 813931 822894 829341 832541 832183 828096 820188
49815 820188 808810 794869 779301 762474 744250 724569 703863 682972 662665 643139 624032
49804 624032 605054 586469 568784 552162 536556 522298 509908 499175 489009 478602 468298
49793 468298 458960 450812 443312 435799 427887 419529 411212 403832 397861 392737 387516 381974 376622 371779
49779 371779 367225 362743 358415 354330 350471 346972 343991 341224 337967 333830 329104 324427 320493 318091
49765 318091 317707 318795 319887 319822 318646 317192 316209 316144 317216 319163 321170 322571 323484 324479 325803 327272
49749 327272 328755 330335 332151 334367 337196 340578 344002 347056 349998 353346 357008 360410 363522 367136
49735 367136 371797 376995 381863 386450 391771 398605 406610 414689 422037 428726 435522 443307 452586 463314
49721 463314 475091 487620 501096 516115 533087 551649 570713 589060 605929 621161 635001
49710 635001 647754 659423 669572 677735 684070 689460 694834 700569 706681 713303 720623 728414 735962
49697 735962 742458 747151 749109 747203 740728 730032 716348 700932 684390 666877 648814 631151
49685 631151 614785 599899 586212 573807 563245 554645 547161 539828 532725 526793 522595 519776 517751
49672 517751 516376 515685 515406 515099 514652 514310 514319 514756 515636 516948 518499 519766 520121 519405 518399 518414 520077 522585
49654 522585 524478 525113 525000 524731 524206 523140 521817 520788 520100 519282 518016 516443 514891 513602 512621 511639
49638 511639 510035 507498 504610 502442 501510 501437 501614 501795 501986 502209 502639 503591 505094 506750 508322 510131
49622 510131 512518 515157 517413 519286 521451 524352 527775 531481 535659 540378 545062 549125 552936 557533
49608 557533 563297 569463 575137 580358 585934 592602 600691 610254 620990 632099 642701 652587 662352
49595 662352 672822 684535 697710 712244 727565 742869 757880 773293 790192 809082 829657
49584 829657 851434 874405 899054 925912 955178 986670 1020120 1055532 1093222 1133457 1176077
49573 1176077 1220581 1266607 1314211 1363632 1414891 1467840 1522615 1579794 1639804 1702253 1766202
49562 1766202 1831234 1897914 1966983 2038351 2111243 2185098 2259755 2334683 2408540 2479688 2546865
49551 2546865 2609212 2665960 2716274 2759130 2793212 2817338 2831270 2835812 2831774 2819120 2797519 2767556
49539 2767556 2731006 2689975 2646132 2600664 2554476 2508329 2462958 2419143 2377574 2338828 2303675
49528 2303675 2273163 2247999 2228008 2212666 2202132 2197317 2198913 2206859 2220776 2240334 2264997 2293947
49516 2293947 2326686 2363401 2404341 2449134 2497085 2547841 2601226 2656533 2712537 2768274 2823348
49505 2823348 2877255 2928753 2976157 3018060 3053444 3081232 3100065 3108646 3106110 3091969 3065925 3028009
49493 3028009 2978856 2919627 2851588 2775896 2693839 2607050 2517328 2426252 2334986 2244271 2154556
49482 2154556 2066332 1980419 1897766 1818862 1743674 1672204 1604752 1541351 1481469 1424745 1371661
49471 1371661 1322765 1277447 1234261 1192498 1152742 1115758 1081574 1049887 1020618 993650 968593
49460 968593 945302 924095 904974 887104 869683 853004 838042 825205 814054 803981 794543 785280
49448 785280 775873 766520 757655 749297 741183 733448 726613 720809 715578 710593 706055 702221 698990 696211
49434 696211 694005 692574 692038 692616 694570 697721 701405 705244 709761 715933 724287 734600 746262 758681
49420 758681 771435 784200 796441 807209 815552 821261 825048 827933 830726 834085 838458 843640 848868
49407 848868 853808 859116 865608 873211 881317 889863 899336 909799 920702 931755 943275 955379 967450
49394 967450 978812 989431 999415 1008257 1015235 1020464 1024931 1029445 1034055 1038618 1043332 1048354 1053274 1057544
49380 1057544 1061363 1065663 1071126 1077483 1084003 1090451 1097373 1105487 1115021 1125622 1136826 1148561 1161188
49367 1161188 1175105 1190389 1206958 1224957 1244633 1265750 1287497 1309395 1332095 1356756 1383632
49356 1383632 1411741 1440169 1469248 1500124 1533443 1568911 1606048 1644926 1686082 1730049 1777155
49345 1777155 1827601 1881546 1939180 2000821 2066855 2137487 2212535 2291549 2374260 2460921 2552181
49334 2552181 2648514 2749756 2855225 2964288 3076695 3192386 3311191 3432861 3557148 3683690
49324 3683690 3811854 3940846 4069807 4197633 4322839 4443839 4559215 4667456 4766628 4854738
49314 4854738 4930470 4993188 5042215 5076655 5096141 5101357 5093486 5073491 5042309 5001488 4953157 4899424
49302 4899424 4842142 4783109 4724002 4666094 4610386 4558030 4510188 4467437 4429758 4397335 4370971
49291 4370971 4351434 4338733 4332416 4332416 4339177 4353013 4373700 4400818 4434307 4474579 4522076 4576615
49279 4576615 4637040 4701616 4768943 4838426 4909700 4981687 5052433 5119796 5182078 5237971 5286219
49268 5286219 5325497 5354530 5372210 5377658 5370201 5349282 5314546 5266164 5204985 5132194 5048850 4956004
49256 4956004 4855231 4748722 4638727 4527043 4415050 4303922 4194625 4087856 3984162
49247 3984162 3884069 3788052 3696562 3610154 3529457 3454918 3386618 3324289 3267318 3214799 3165866
49236 3165866 3119993 3076744 3035346 2995066 2956079 2919373 2885447 2853563 2822721 2792872 2764665
49225 2764665 2738332 2713526 2690020 2667876 2646938 2626847 2607663 2589891 2573695 2558609 2544155
49214 2544155 2530260 2516805 2503322 2489539 2475874 2462969 2450916 2439247 2427470 2415308 2402637
49203 2402637 2389570 2376606 2364372 2353163 2342853 2333196 2324163 2316135 2309851 2305917 2304133 2303426 2302684
49190 2302684 2301623 2300683 2300249 2300163 2299900 2298952 2297086 2294416 2291197 2287429 2282741 2276793 2269753 2262177 2254496
49175 2254496 2246737 2238661 2229964 2220442 2210184 2199702 2189691 2180639 2172704 2165934 2160432 2156298 2153553
49162 2153553 2152222 2152431 2154343 2158006 2163306 2170083 2178316 2188142 2199703 2213027 2228160 2245249 2264309
49149 2264309 2284993 2306902 2330148 2355304 2382719 2412171 2443379 2476543 2512045 2549660 2588190
49138 2588190 2625852 2660997 2692840 2721822 2749190 2776062 2802907 2829877 2857218 2885062 2913147
49127 2913147 2941219 2969591 2998922 3029465 3060830 3092440 3123867 3154809 3185084 3214815 3244373
49116 3244373 3274115 3304276 3334978 3366000 3396595 3425884 3453499 3479596 3504301 3527498 3549189
49105 3549189 3569661 3589084 3607257 3623908 3639065 3652972 3665809 3677619 3688300 3697645 3705593 3712576
49093 3712576 3719432 3726866 3735123 3744134 3753662 3763307 3772795 3782555 3793721 3807273 3823336 3841550 3861801
49080 3861801 3884180 3908422 3933959 3960665 3989075 4019555 4051487 4083614 4115152 4146267 4177377
49069 4177377 4208277 4238199 4266577 4293315 4318206 4340524 4359567 4375415 4388708 4399710 4407924
49058 4407924 4412684 4413774 4411325 4405388 4395814 4382441 4365372 4345211 4323026 4299666 4275051 4248482
49046 4248482 4219881 4190405 4161462 4133422 4105729 4078138 4051318 4026142 4002859 3981255 3961395
49035 3961395 3943802 3928843 3916130 3904745 3894083 3884373 3876309 3870257 3865957 3862888 3860650 3858940 3857427
49022 3857427 3855920 3854598 3853888 3854105 3855204 3856817 3858468 3859789 3860640 3861062 3861224 3861482 3862271 3863641 3865011 3865811
49006 3865811 3866453 3868171 3871665 3876224 3880515 3883939 3886815 3889553 3892155 3894511 3896675 3898680 3900328 3901316
48992 3901316 3901401 3900438 3898433 3895614 3892287 3888565 3884241 3878852 3871821 3862777 3851973 3840139 3827574 3813472
48978 3813472 3796603 3776650 3754404 3730508 3704479 3675276 3642545 3606947 3569428 3530529 3490316
48967 3490316 3448615 3405151 3359682 3312229 3263264 3213628 3164235 3115745 3068433 3022291 2977247
48956 2977247 2933343 2890842 2850195 2811838 2775894 2742165 2710483 2681006 2654021 2629603 2607632
48945 2607632 2588118 2571236 2557080 2545631 2536970 2531192 2527997 2526671 2526759 2528497 2532289 2537831 2544166
48932 2544166 2550678 2557779 2566422 2577071 2589349 2602635 2616765 2631975 2648255 2665004 2681455 2697306
48920 2697306 2712755 2728012 2743042 2757904 2773141 2789573 2807683 2827245 2847570 2868134 2889108
48909 2889108 2911305 2935456 2961482 2988651 3016537 3045605 3076570 3109366 3143115 3177098 3211333
48898 3211333 3246081 3281220 3316423 3351705 3387392 3423650 3460386 3497471 3534670 3571294 3606417
48887 3606417 3639703 3671715 3703141 3733934 3763472 3791382 3817809 3842877 3866201 3887007 3904591
48876 3904591 3918736 3929849 3938610 3945271 3949392 3950543 3949109 3945911 3940939 3932992 3920842 3904379 3884318
48863 3884318 3861098 3834572 3804590 3771416 3735431 3696824 3655733 3612555 3567912 3522359 3476180
48852 3476180 3429474 3382397 3335257 3288317 3241636 3195304 3149760 3105603 3063001 3021653 2981481
48841 2981481 2943037 2906929 2873102 2841121 2811043 2783543 2759172 2737868 2719266 2703141 2689405
48830 2689405 2677943 2668693 2661756 2657177 2654619 2653378 2652840 2653003 2654470 2657814 2662990 2669592 2677588 2687397
48816 2687397 2699036 2711680 2724502 2737621 2751679 2766703 2782010 2797228 2812704 2828780 2845267
48805 2845267 2861896 2878807 2896259 2914275 2932898 2952404 2972888 2993967 3015337 3037300 3060270
48794 3060270 3083966 3107678 3131256 3155279 3180215 3205937 3232150 3258778 3285674 3312431 3338878
48783 3338878 3365453 3392601 3419997 3446789 3472605 3497895 3523194 3548484 3573481 3598209 3622990
48772 3622990 3648050 3673355 3698634 3723282 3746527 3768156 3788895 3809514 3829567 3847576 3862556
48761 3862556 3874683 3884213 3890463 3892488 3890270 3884545 3875699 3863534 3847977 3829332 3807779 3783234
48749 3783234 3755832 3726073 3694367 3660788 3625315 3587915 3548468 3507079 3464450 3421399 3378082
48738 3378082 3334309 3290595 3248013 3206821 3166227 3126105 3088127 3054375 3025371 3000301 2978805
48727 2978805 2961597 2949398 2942102 2939170 2940252 2945202 2953811 2965703 2980316 2997044 3015575 3035960
48715 3035960 3058102 3081429 3105358 3129833 3154931 3180230 3205184 3229978 3255327 3281373 3307405
48704 3307405 3332825 3357800 3382624 3406879 3429602 3450091 3468262 3484448 3499048 3512336 3524471
48693 3524471 3535705 3546483 3557156 3567791 3578553 3590206 3603806 3619835 3638029 3658075 3680068
48682 3680068 3704213 3730703 3760232 3794287 3834374 3881039 3933881 3992431 4056787 4127527 4205295
48671 4205295 4290501 4383214 4483155 4589745 4702198 4819742 4941935 5068596 5199168 5332207
48661 5332207 5465697 5597744 5726585 5850029 5965451 6070474 6163185 6241530 6303097 6345965
48651 6345965 6369542 6374204 6360428 6328645 6279709 6215027 6136253 6045181 5943904 5834755 5719900
48640 5719900 5601021 5479273 5355491 5230644 5106228 4983947 4864808 4748725 4635279
48631 4635279 4524637 4417443 4314118 4214800 4119813 4029654 3944371 3863413 3786243 3712818 3643278
48620 3643278 3577444 3514895 3455394 3399053 3346053 3296282 3249234 3204381 3161674 3121553 3084267
48609 3084267 3049372 3016187 2984619 2955119 2927807 2902159 2877771 2854978 2834318 2815596 2797939
48598 2797939 2780737 2764115 2748376 2733278 2718106 2702386 2686349 2670632 2655596 2641032 2626569
48587 2626569 2612245 2598497 2585606 2573312 2561124 2548861 2536764 2525180 2514345 2504458 2495759 2488431
48575 2488431 2482535 2478098 2475152 2473590 2473088 2473276 2473973 2475195 2477043 2479667 2483214 2487604 2492411 2497163 2501742
48560 2501742 2506238 2510410 2513718 2516081 2518213 2520797 2523635 2526201 2528910 2533048 2539167 2546159 2552492 2558005
48546 2558005 2563924 2571243 2579778 2588827 2598157 2608003 2618497 2629557 2641200 2653569 2666609 2679991
48534 2679991 2693450 2707094 2721328 2736465 2752436 2768840 2785318 2801971 2819382 2838072 2857944
48523 2857944 2878341 2898699 2918946 2939222 2959426 2979348 2999116 3019120 3039336 3059035 3077516
48512 3077516 3095003 3112496 3130741 3149611 3168501 3187059 3205435 3224087 3243594 3264474 3286950
48501 3286950 3310942 3336429 3363733 3393272 3425154 3459285 3495914 3535862 3580082 3629090 3682872
48490 3682872 3741205 3803933 3871043 3942612 4018740 4099436 4184552 4273834 4366990 4463592 4562785
48479 4562785 4663123 4762794 4860088 4953613 5042119 5124262 5198578 5263552 5317673 5359660 5388934
48468 5388934 5405809 5411048 5405339 5389414 5364532 5332387 5294461 5251796 5205450 5156813 5107232 5057657
48456 5057657 5008796 4961186 4914731 4868454 4821233 4772630 4722540 4670127 4613707 4551859 4484221
48445 4484221 4411070 4332620 4249106 4161244 4070106 3976523 3881000 3784266 3687611 3592469 3499803
48434 3499803 3410094 3323805 3241522 3163546 3089682 3019788 2954390 2894312 2839671 2789672 2743654
48423 2743654 2702045 2665921 2635775 2610887 2589742 2570826 2553345 2537616 2524659 2515003 2507919 2502100
48411 2502100 2496881 2492302 2488239 2484190 2480078 2476505 2473919 2472099 2470789 2470212 2470462 2470959 2471277 2472108 2474534
48396 2474534 2478449 2482590 2486258 2490210 2495536 2502348 2510020 2518098 2526353 2534325 2541611 2548447 2555344 2562132
48382 2562132 2568060 2572983 2577774 2583152 2588618 2593135 2596522 2599571 2602901 2606372 2609689 2612966 2616409 2619964
48368 2619964 2623748 2628540 2635345 2644526 2655666 2668211 2681931 2696778 2712685 2729660 2747932 2767890
48356 2767890 2789894 2814144 2840599 2869077 2899490 2931806 2965664 3000326 3035368 3071262 3108790
48345 3108790 3147909 3187674 3227358 3267052 3306873 3346011 3383085 3417260 3448658 3477793 3504920
48334 3504920 3529912 3552384 3571916 3588390 3602210 3614034 3624347 3633369 3641358 3648669 3655419 3661321
48322 3661321 3666089 3670026 3674035 3678929 3684772 3691077 3697705 3705344 3714904 3726566 3739812 3754343 3770519
48309 3770519 3788729 3808704 3829828 3851884 3875108 3899569 3924895 3950650 3976778 4003587 4031348
48298 4031348 4059858 4088334 4115901 4142378 4168478 4195025 4222151 4249431 4276621 4303898 4331576
48287 4331576 4360075 4390123 4422443 4457072 4493377 4530915 4569924 4610855 4653875 4699074 4746652
48276 4746652 4796343 4846986 4897238 4946630 4995252 5042401 5086205 5124842 5157503 5183613 5201603
48265 5201603 5209294 5205544 5190819 5165900 5130687 5084829 5029148 4965723 4896554 4822716 4744950 4664486
48253 4664486 4582885 4501414 4420988 4342506 4266758 4194009 4124058 4056734 3992049 3929845 3869675
48242 3869675 3811150 3754181 3698688 3644334 3590798 3538236 3487185 3437952 3390123 3342779 3295239
48231 3295239 3247646 3200816 3155492 3111781 3069330 3027774 2986832 2946157 2905513 2865082 2825265
48220 2825265 2786037 2746804 2707004 2666598 2625808 2584680 2543119 2501104 2458600 2415513 2372044
48209 2372044 2328866 2286543 2244829 2202966 2160679 2118518 2077119 2036492 1996232 1956201 1916700
48198 1916700 1878094 1840489 1803821 1768118 1733578 1700423 1668676 1638105 1608384 1579238 1550447
48187 1550447 1521914 1493879 1466918 1441395 1416942 1392762 1368553 1344909 1322730 1302411 1283748
48176 1283748 1266360 1249940 1234166 1218714 1203481 1188763 1175124 1163016 1152411 1142836 1133922 1125922
48164 1125922 1119455 1114688 1111091 1108102 1105671 1103845 1102203 1100249 1098173 1096682 1096140 1096458 1097798 1100666
48150 1100666 1105073 1110278 1115804 1122163 1130111 1139567 1149783 1160169 1170375 1179907 1188583 1197246 1207216
48137 1207216 1218847 1231295 1243893 1257012 1271188 1285996 1300448 1314220 1328016 1342800 1358991
48126 1358991 1376287 1394046 1411881 1429947 1448515 1467339 1485914 1504367 1523476 1543557 1564015
48115 1564015 1584482 1605686 1628401 1652007 1674989 1696706 1717758 1738687 1759193 1778832 1797723
48104 1797723 1816285 1834782 1853185 1870877 1886490 1898937 1908907 1918549 1929253 1940449 1950983 1960793
48092 1960793 1970492 1980187 1989828 2000311 2013087 2028694 2046543 2066074 2087216 2109669 2132778 2156500
48080 2156500 2181753 2209262 2238617 2268942 2300076 2332592 2366962 2403177 2441009 2480227 2520571
48069 2520571 2561757 2603481 2645271 2686522 2726882 2766494 2805719 2844786 2883774 2922608 2960757
48058 2960757 2997187 3030968 3061850 3089983 3115245 3137244 3155928 3171737 3184997 3195440 3202502
48047 3202502 3205922 3205925 3202965 3197451 3189601 3179420 3166819 3151893 3135122 3117266 3099002 3080571 3061734
48034 3061734 3042055 3021262 2999416 2976820 2953915 2931170 2908854 2886834 2864809 2842853 2821520
48023 2821520 2801200 2781539 2761784 2741570 2721073 2700481 2679679 2658457 2636521 2613107 2586986
48012 2586986 2557273 2524073 2488084 2449755 2409150 2366471 2322288 2277289 2232129 2187598 2144495
48001 2144495 2103161 2063380 2024933 1987937 1952436 1917904 1883567 1849199 1815330 1782687 1751615
47990 1751615 1721981 1693399 1665538 1638510 1613021 1589866 1569127 1550014 1531671 1513978 1497450
47979 1497450 1482518 1469183 1457325 1447000 1438231 1430658 1423682 1417045 1411077 1406140 1401954 1397845 1393736
47966 1393736 1390437 1388531 1387316 1385460 1382651 1379834 1377621 1375201 1371431 1366433 1361284 1356292 1350464 1342876
47952 1342876 1333845 1324318 1314629 1304365 1293210 1281374 1269166 1256540 1243162 1228723 1213135 1196584
47940 1196584 1179480 1162266 1145213 1128398 1111806 1095369 1078962 1062519 1046230 1030458 1015377
47929 1015377 1000723 986075 971410 957293 944416 933043 923048 914407 907280 901515 896397 891358
47917 891358 886832 883961 883337 884366 886055 888073 890753 894262 898246 902329 906553 911132 915928 920476
47903 920476 924490 928148 931718 935002 937341 938162 937411 935414 932536 929139 925641 922273 918755 914509 909284
47888 909284 903392 897337 891533 886447 882643 880350 879123 878193 877102 875902 874949 874675 875422 877149 879361
47873 879361 881610 884024 887167 891375 896442 901965 907745 913808 920176 926765 933481 940386 947764 955908
47859 955908 964755 973894 983054 992409 1002202 1012263 1022159 1031772 1041380 1051160 1060882 1070038 1078036 1084287
47845 1084287 1088512 1091050 1092491 1092941 1091959 1089332 1085425 1080531 1074247 1065951 1055672 1044124 1032011 1019650
47831 1019650 1007174 994640 981911 968778 955328 941981 929058 916495 904093 891865 880057
47820 880057 868969 858800 849570 841077 833014 825204 817725 810800 804615 799214 794412 789739 784599 778651
47806 778651 772087 765545 759671 754736 750531 746614 742682 738695 734645 730332 725561 720554 715980 712403
47792 712403 709736 707318 704502 701137 697584 694435 692198 691064 690807 690986 691344 692026 693338 695439 698445
47777 698445 702742 708818 716669 725705 735506 746483 759380 774326 790817 808676 828473 850731
47765 850731 875145 900935 927741 955786 985347 1016453 1048996 1082607 1116316 1148759 1179016
47754 1179016 1207095 1233437 1258062 1280385 1299759 1315966 1329140 1339368 1346491 1350230 1350427 1347119
47742 1347119 1340542 1331154 1319640 1306616 1292274 1276394 1258831 1239891 1220255 1200654 1181637 1163417
47730 1163417 1145840 1128794 1112759 1098613 1086616 1075935 1065570 1055424 1045982 1037251 1028855 1021152
47718 1021152 1015276 1011711 1009514 1007577 1006111 1006244 1008425 1011993 1016291 1021567 1028607 1037812 1048763 1060449
47704 1060449 1071945 1083135 1094765 1107480 1120816 1133449 1144385 1153443 1160544 1165161 1166849 1165931
47692 1165931 1163118 1158601 1151947 1142856 1131541 1118317 1103219 1086309 1068129 1049491 1030885 1012352
47680 1012352 994029 976544 960665 946658 934219 923022 913111 904657 897566 891579 886715 883411
47668 883411 882245 883612 887636 894079 902277 911451 921349 932473 945415 960031 975537 991472 1008245
47655 1008245 1026556 1046480 1067356 1088430 1109226 1129315 1148150 1165401 1181169 1195582 1208331
47644 1208331 1219003 1227730 1235105 1241359 1246028 1248583 1249065 1247873 1245246 1241377 1236861 1232570 1229006 1226041
47630 1226041 1223340 1220791 1218498 1216663 1215662 1216024 1218107 1221761 1226407 1231423 1236488 1241697 1247437 1254010
47616 1254010 1261167 1268001 1273417 1276733 1277833 1276835 1273820 1268885 1262216 1253846 1243389 1230309 1214576
47603 1214576 1196841 1177751 1157230 1134720 1110099 1084123 1057916 1032234 1007172 982294 956996
47592 956996 931153 905538 881326 858994 837973 817477 797213 777060 756618 735672 714729
47581 714729 694496 675044 656103 637949 621264 606181 592277 579548 568534 559203 550490 541436
47569 541436 532281 524025 517372 512419 508802 505699 502290 498785 496512 496304 497269 497863 497792 497957 498843 500054
47553 500054 501511 504085 508646 515205 523315 532687 542993 553670 564362 575211 586302 597198 607362
47540 607362 616699 625308 633040 639683 645317 650081 653840 656453 658067 658730 657961 655227 650655 644706 637321
47525 637321 628068 617084 605174 592775 579547 565331 550908 537318 524740 512545 500212 487769
47513 487769 475615 464412 454915 447224 440232 432501 423879 415666 408959 403445 398243 393316 389290 386204
47499 386204 383296 380109 377114 374979 373756 373083 372738 372649 372691 372903 373726 375611 378403 381363 383799 385551
47483 385551 386989 388643 390651 392382 392849 391775 390127 389264 389628 390473 390723 389789 387687 384788 381539 378182
47467 378182 374723 371297 368389 366410 365211 364357 363704 363317 363009 362539 362186 362497 363350 363959 364056 364469 366099
47450 366099 368766 371479 373504 374771 375524 376021 376458 376923 377504 378534 380372 382747 384850 386401 388119
47435 388119 390616 393334 395310 396649 398363 400839 403379 405448 407549 410448 414153 418135 422172 426466
47421 426466 431194 436381 442126 448541 455474 462601 469901 477877 487140 497843 509655 522355 536292
47408 536292 551992 569323 587394 605482 623643 642066 660171 676942 692055 705975 718872
47397 718872 730124 739179 746322 752086 756254 757975 756681 752484 745900 737607 728401 718822 708702 697436
47383 697436 684905 671843 659103 646774 634354 621694 609459 598453 588636 579115 569213 559331
47371 559331 550521 543316 537227 531411 525538 519898 514930 510929 508077 506458 505906 505936 505963 505643 505035 504460
47355 504460 504206 504375 504979 506038 507493 509165 510912 512653 514057 514420 513289 511168 509187 507949 507063
47340 507063 505897 504284 502216 499230 494621 488176 480409 472129 464060 456715 450272 444455 438790 433014
47326 433014 427164 421387 415819 410594 405665 400622 394892 388297 381361 375043 370114 366653 364019 361398
47312 361398 358475 355528 352879 350481 348150 345914 343887 342040 340459 339624 340041 341554 343399 345021 346482
47297 346482 348007 349438 350410 350850 351063 351366 351784 352152 352418 352715 353094 353283 352975 352381 352183 352764 353809 354962
47279 354962 356593 359314 362882 366150 368304 369646 371003 372801 375077 377984 381792 386439 391433 396265
47265 396265 400780 405231 410128 415962 422807 430135 437128 443304 448920 454834 461896 470268 479319 488219
47251 488219 496697 505059 513632 522441 531399 540411 549162 557155 564135 570203 575387 579473 582537 585240
47237 585240 588115 590848 592715 593588 593900 593771 592803 590866 588452 585923 582881 578766 573793 568901 564830
47222 564830 561538 558443 554934 550702 545885 541019 536642 532848 529323 525858 522700 520305 518786 517698
47208 517698 516340 514285 511649 508945 506725 505327 504845 505199 506232 507764 509668 511825 514094 516396 518845
47193 518845 521657 524833 528055 531024 533840 536833 540017 542864 544696 545174 544373 542592 540300 538132 536595
47178 536595 535625 534582 532836 530376 527777 525671 524325 523719 523862 524880 526766 529132 531396 533333 535406
47163 535406 538408 542772 548295 554503 561097 567984 575128 582635 590892 600369 611211 623111 635521
47150 635521 647933 660153 672494 685585 699560 713435 725730 735861 744577 752793 760393 766624
47138 766624 771343 775251 778808 781573 782927 783077 782875 782825 782722 782266 781547 780713 779519 777676 775470 773565
47122 773565 772091 770447 768244 766088 764933 764883 765116 765071 765165 766166 768194 770554 772372 773260 773615 774439 776570
47105 776570 779902 783613 787314 791622 797317 804355 812090 820066 828011 835318 841341 846200 850635 854913
47091 854913 858439 860551 861054 859782 856273 850349 842544 833505 823334 811962 799802 787466 775031
47078 775031 762076 748298 733689 718314 702521 687275 673728 662366 652955 645183 638790 633098
47066 633098 627214 621041 615521 611449 608449 605626 602891 601117 601091 602754 605464 608583 611707 614644 617445
47051 617445 620469 624330 629659 636661 644788 653042 660826 668357 676140 684237 692343 700352 708394 716322
47037 716322 723609 729879 735198 739687 743189 745623 747459 749513 752312 755878 760108 765026 770537 776149
47023 776149 781235 785658 789984 794916 800572 806493 812440 818884 826397 834716 842842 850161 857053 864176
47009 864176 871551 878801 886058 894071 903311 913279 922946 931700 939824 948211 957667 968284 979375 990178
46995 990178 1000629 1011257 1022273 1033129 1043121 1052057 1060042 1066939 1072505 1076827 1080057 1081838 1081649
46982 1081649 1079841 1077596 1075470 1072547 1067628 1060840 1053491 1046564 1040078 1033856 1028065 1022817 1017911 1013391
46968 1013391 1009833 1007631 1006373 1005445 1004963 1005576 1007491 1010256 1013468 1017268 1022062 1028114 1035481 1043988 1053215
46953 1053215 1062809 1072850 1083635 1095093 1106793 1118533 1130467 1142554 1154360 1165650 1176739
46942 1176739 1187886 1198686 1208440 1216862 1224050 1230039 1234837 1238755 1242209 1245225 1247542 1249148 1250251
46929 1250251 1250687 1249801 1247107 1242855 1237869 1233016 1228915 1225829 1223695 1222274 1221317 1220573 1219922 1219713 1220727
46914 1220727 1223429 1227376 1231752 1236273 1241084 1245957 1250383 1254547 1259470 1265848 1273391 1281647 1290805 1301244
46900 1301244 1312811 1325145 1338285 1352336 1366917 1381610 1396645 1412401 1428397 1443481 1457008
46889 1457008 1469096 1479754 1488471 1494820 1498812 1500442 1499484 1495993 1490530 1483639 1475543 1466609 1457634 1449370
46875 1449370 1442198 1436504 1432918 1431751 1432623 1435044 1439018 1444673 1451661 1459469 1468100 1477920 1488944 1500681
46861 1500681 1512498 1523673 1533327 1540938 1546919 1552157 1556876 1560463 1562511 1563550 1564559 1566166 1568511
46848 1568511 1571501 1574887 1578378 1581988 1586126 1591208 1597343 1604533 1612894 1622406 1632654 1643108 1653618
46835 1653618 1664441 1675795 1687470 1698756 1708754 1716991 1723852 1730137 1735981 1740469 1742606 1742403 1740606
46822 1740606 1737530 1732757 1726011 1717810 1708894 1699382 1688923 1677585 1666227 1655890 1646992 1639199 1631958
46809 1631958 1625107 1619033 1614258 1610904 1608619 1607136 1606900 1608958 1614120 1622285 1632686 1644712 1658348
46796 1658348 1673806 1690987 1709522 1729145 1749722 1770873 1791834 1811872 1830659 1848095 1863921
46785 1863921 1877698 1889024 1897482 1902451 1903410 1900673 1895470 1888908 1880877 1870298 1856507 1840134 1822518
46772 1822518 1804530 1786191 1767221 1747533 1727194 1706270 1684945 1663616 1642636 1622058 1601832
46761 1601832 1582169 1563454 1545730 1528475 1511048 1493342 1475953 1459662 1444683 1430351 1415702
46750 1415702 1400506 1385627 1372199 1360529 1350073 1340375 1331570 1323869 1317024 1310662 1304887 1300141 1296565
46737 1296565 1293814 1291448 1289238 1287160 1285400 1284316 1284171 1284858 1286100 1287841 1290159 1292837 1295359 1297410
46723 1297410 1299145 1300914 1302982 1305516 1308524 1311699 1314569 1316994 1319303 1321890 1324873 1328195 1331722 1335143
46709 1335143 1338204 1341219 1344941 1349608 1354540 1359134 1363951 1370245 1378577 1388384 1398867 1409685 1420746
46696 1420746 1431885 1442986 1453955 1464298 1473137 1480012 1485384 1489912 1493334 1494477 1492407 1487302 1480142
46683 1480142 1471800 1462561 1452322 1440931 1428205 1413854 1397649 1379753 1360765 1341303 1321717 1302241
46671 1302241 1283255 1265132 1247960 1231613 1216130 1201731 1188447 1175894 1163487 1150824 1137937
46660 1137937 1125348 1113846 1103946 1095495 1087855 1080470 1073157 1066087 1059769 1054915 1051908 1050378 1049705 1049970
46646 1049970 1052036 1056684 1064087 1074162 1086893 1102063 1119176 1137930 1158361 1180216 1202758 1225613
46634 1225613 1249258 1274009 1298850 1322093 1343016 1362131 1379822 1395497 1408328 1418194 1425546 1430801
46622 1430801 1434273 1436378 1437490 1437720 1437103 1435999 1435161 1435442 1437440 1441353 1447196 1455295 1466355 1480741
46608 1480741 1497804 1516389 1536083 1557485 1581026 1605958 1630776 1654267 1675743 1694624 1710413
46597 1710413 1723135 1733312 1741241 1746441 1747905 1744818 1737032 1724976 1709179 1689890 1667160 1641402
46585 1641402 1613730 1585616 1558111 1531446 1505302 1479408 1453833 1428813 1404383 1380297 1356291
46574 1356291 1332409 1309050 1286766 1266013 1246878 1228852 1210983 1192616 1174032 1156166 1139606
46563 1139606 1123983 1108466 1092729 1077365 1063350 1051106 1040037 1029053 1017645 1006343 996041
46552 996041 987117 979406 972758 967104 962099 957278 952647 948667 945506 942807 940327 938218 936361 934057
46538 934057 930988 928106 926850 927576 929306 931019 932682 934876 937846 941174 944264 947008 949937 953631
46524 953631 957977 962271 966142 970012 974411 979235 984166 989473 995691 1002612 1009317 1015408 1021683 1029296
46510 1029296 1038670 1049450 1061127 1073314 1085687 1098034 1110343 1122689 1135101 1147697 1160790
46499 1160790 1174604 1188850 1202713 1215349 1226448 1236406 1245924 1255335 1264247 1271864 1277560 1281163 1282886
46486 1282886 1283259 1282964 1282449 1281626 1280112 1277744 1274708 1271274 1267570 1263492 1258598 1252323 1244683 1236569 1228871
46471 1228871 1221355 1212935 1203097 1192378 1181317 1169571 1156449 1141786 1125849 1108791 1090793 1072416
46459 1072416 1054214 1036063 1017373 997974 978390 959297 941084 923960 908065 893265 879148
46448 879148 865437 852358 840499 830323 821784 814328 807280 800349 793830 788359 784578 782910 783356
46435 783356 785370 788217 791697 796341 802650 810319 818463 826412 833996 841229 848189 855186 862592 870329
46421 870329 877721 884002 888906 892834 896709 901511 907553 914119 920132 925353 930612 936730 943545 950287
46407 950287 956721 963548 971772 981976 994236 1008400 1024254 1041605 1060465 1081201 1104287 1129836
46395 1129836 1157521 1187113 1219060 1254224 1292995 1334817 1378735 1424230 1471371 1520393 1571340
46384 1571340 1623980 1677602 1730856 1782185 1830639 1876117 1918689 1957822 1992429 2021581 2045003
46373 2045003 2062963 2075867 2083977 2087294 2085564 2078451 2065894 2048386 2026817 2002007 1974516 1944951
46361 1944951 1914185 1882945 1851405 1819656 1788664 1760121 1735028 1712871 1692634 1674298 1658850
46350 1658850 1647091 1639040 1634404 1632950 1634418 1638726 1646506 1658838 1676184 1697957 1723413 1752490
46338 1752490 1785469 1822226 1862289 1905313 1951019 1998796 2047783 2097225 2146438 2194467 2240102
46327 2240102 2282219 2319897 2352371 2379096 2399781 2414174 2421958 2423070 2417751 2406012 2387370 2361663
46315 2361663 2329917 2293781 2254205 2211318 2165555 2118158 2070310 2022502 1975101 1928923 1884687
46304 1884687 1842392 1801935 1764139 1730447 1701580 1676992 1655776 1637689 1623170 1612686 1606292
46293 1606292 1603655 1604273 1607720 1613737 1622122 1632651 1645235 1660067 1677396 1697183 1719028 1742292
46281 1742292 1766119 1789569 1812201 1834463 1857107 1880099 1902538 1923722 1943813 1963146 1981341
46270 1981341 1997637 2011923 2024873 2036997 2047966 2057064 2064036 2069298 2073406 2076486 2078142 2077861 2075476
46257 2075476 2071220 2065415 2058318 2050333 2042128 2034242 2026687 2019198 2011776 2004758 1998437 1993008 1988820 1986255
46243 1986255 1985258 1985368 1986451 1989032 1993671 2000278 2008314 2017390 2027273 2037575 2047944 2058544 2069844
46230 2069844 2081774 2093419 2103675 2112006 2118377 2122776 2125084 2125329 2123763 2120525 2115300 2107454 2096617
46217 2096617 2083143 2067967 2051895 2035104 2017285 1998144 1977663 1956070 1933851 1911792 1890765
46206 1890765 1871275 1853212 1836059 1819376 1803178 1787964 1774317 1762378 1751856 1742689 1735506 1731126
46194 1731126 1729694 1730582 1733026 1736504 1740622 1745209 1750735 1758132 1767787 1778957 1790509 1802153 1814697
46181 1814697 1829247 1846294 1865291 1884779 1903182 1919961 1936067 1952912 1970840 1988842 2005697
46170 2005697 2021045 2035266 2048673 2061107 2072180 2081764 2090276 2098603 2107568 2117357 2127476 2137319
46158 2137319 2146678 2155728 2164695 2173709 2182859 2192200 2201622 2210826 2219500 2227533 2235076 2242341 2249390 2256107
46144 2256107 2262341 2267966 2272837 2276875 2280251 2283273 2285883 2287427 2287228 2285337 2282394 2278768 2274195 2268406
46130 2268406 2261754 2254856 2247851 2240422 2232452 2224217 2215770 2206581 2196219 2185218 2174840 2165874 2157929
$$ [...]
##END NTUPLES=NMR SPECTRUM
##END=
