
##TITLE=AC1365_HAWAS12179_7155411_SWLinPkv4v
##JCAMPDX= 6.0         $$ Bruker NMR JCAMP-DX V2.0
##DATA TYPE= NMR SPECTRUM
##DATA CLASS= NTUPLES
##ORIGIN= BRUKER
##OWNER= Administrator
$$ 1.72 TOPSPIN		Version 2.1
$$ 2013-01-30 01:06:37.065 -0500  Administrator@X
$$ Compression mode = diff/dup
##.OBSERVE FREQUENCY= 400.02188249412
##.OBSERVE NUCLEUS= ^1H
##.ACQUISITION MODE= SIMULTANEOUS (DQD)
##.ACQUISITION SCHEME= undefined
##.AVERAGES= 8
##.DIGITISER RES= 22
##SPECTROMETER/DATA SYSTEM= spect
##.PULSE SEQUENCE= zg30
##.SOLVENT NAME= COFFEE_meoh
##.SHIFT REFERENCE= INTERNAL, COFFEE_meoh, 1, 14.98509
##AUDIT TRAIL= $$ (NUMBER, WHEN, WHO, WHERE, PROCESS, VERSION, WHAT)
$$ ##TITLE= Audit trail, TOPSPIN		Version 2.1
$$ ##JCAMPDX= 5.01
$$ ##ORIGIN= Bruker BioSpin GmbH
$$ ##OWNER= Administrator
$$ $$ E:\/data/COFFEE/nmr/AC1365_HAWAS12179_7155411_SWLinPkv4v/20/pdata/1/auditp.txt
$$ ##AUDIT TRAIL=  $$ (NUMBER, WHEN, WHO, WHERE, PROCESS, VERSION, WHAT)
(   1,<2013-01-30 01:06:28.846 -0500>,<Administrator>,<X>,<go>,<TOPSPIN 2.1>,
      <created by zg
	started at 2013-01-30 01:05:22.690 -0500,
	POWCHK enabled, PULCHK disabled,
       configuration hash MD5:
       86 BA 57 50 F2 9D 5C 9B 26 00 A9 28 5F 66 2E 89
       data hash MD5: 64K
       8C FF CB E3 A1 04 12 25 02 FA 5D 0D 82 A9 0E 4D>)
(   2,<2013-01-30 01:06:31.925 -0500>,<Administrator>,<X>,<proc1d>,<TOPSPIN 2.1>,
      <Start of raw data processing
       efp LB = 0 FT_mod = 6 PKNL = 1 PHC0 = 0 PHC1 = 0 SI = 32K 
       data hash MD5: 32K
       E0 90 D6 34 B4 6C 14 61 A9 9D 48 7A FD 94 68 AD>)
(   3,<2013-01-30 01:06:32.393 -0500>,<Administrator>,<X>,<proc1d>,<TOPSPIN 2.1>,
      <pk PHC0 = 100.3986 PHC1 = 0 
       data hash MD5: 32K
       1A D1 3A 0A 16 CF 23 BE BC A2 03 AE 8E 17 45 C0>)
(   4,<2013-01-30 01:06:32.628 -0500>,<Administrator>,<X>,<proc1d>,<TOPSPIN 2.1>,
      <abs ABSG = 1 
       data hash MD5: 32K
       00 A7 29 E3 DC 65 41 B8 94 4B 2D D4 DB 44 BD A0>)
(   5,<2013-01-30 01:06:32.784 -0500>,<Administrator>,<X>,<proc1d>,<TOPSPIN 2.1>,
      <abs ABSG = 2 
       data hash MD5: 32K
       88 80 7B 34 27 B4 BF CB 6B 49 8F C2 C4 AE C6 07>)
(   6,<2013-01-30 01:06:32.925 -0500>,<Administrator>,<X>,<proc1d>,<TOPSPIN 2.1>,
      <abs ABSG = 3 
       data hash MD5: 32K
       E9 24 F5 03 D5 11 E4 56 14 FE 3A 3C 99 B7 41 78>)
(   7,<2013-01-30 01:06:33.096 -0500>,<Administrator>,<X>,<proc1d>,<TOPSPIN 2.1>,
      <abs ABSG = 4 
       data hash MD5: 32K
       33 7E 4B 8D 77 DD 6E 30 1E A0 E3 30 E1 BB 1B C1>)
(   8,<2013-01-30 01:06:33.237 -0500>,<Administrator>,<X>,<proc1d>,<TOPSPIN 2.1>,
      <abs ABSG = 5 
       data hash MD5: 32K
       28 5A C9 4C 56 F8 23 88 3A 36 C2 10 A4 2D 72 73>)
$$ ##END=
$$ 
$$ $$ hash MD5
$$ $$ 5A 89 94 68 F7 43 C7 AD ED DA 4D 2D F0 44 96 D1
##$RELAX= 
##$RELAX= 
##$RELAX= 
##$RELAX= 
##$RELAX= 
##$RELAX= 
##$RELAX= 
$$ Bruker specific parameters
$$ --------------------------
##$DU= <E:\>
##$EXPNO= 20
##$NAME= <AC1365_HAWAS12179_7155411_SWLinPkv4v>
$$ [...]
##$TP= (0..7)
150 150 150 150 150 150 150 150
##$TP07= 0
##$TPNAME0= <>
##$TPNAME1= <>
##$TPNAME2= <>
##$TPNAME3= <>
##$TPNAME4= <>
##$TPNAME5= <>
##$TPNAME6= <>
##$TPNAME7= <>
##$TPOAL= (0..7)
0.5 0.5 0.5 0.5 0.5 0.5 0.5 0.5
##$TPOFFS= (0..7)
0 0 0 0 0 0 0 0
##$TUNHIN= 0
##$TUNHOUT= 0
##$TUNXOUT= 0
##$USERA1= <user>
##$USERA2= <user>
##$USERA3= <user>
##$USERA4= <user>
##$USERA5= <user>
##$V9= 5
##$VALIST= <valist>
##$VCLIST= <CCCCCCCCCCCCCCC>
##$VD= 0
##$VDLIST= <DDDDDDDDDDDDDDD>
##$VPLIST= <PPPPPPPPPPPPPPP>
##$VTLIST= <TTTTTTTTTTTTTTT>
##$WBST= 1024
##$WBSW= 4
##$XGAIN= (0..3)
0 0 0 0
##$XL= 0
##$YL= 0
##$YMAX_a= 615255
##$YMIN_a= -526291
##$ZGOPTNS= <>
##$ZL1= 120
##$ZL2= 120
##$ZL3= 120
##$ZL4= 120
##$ABSF1= 14.98509
##$ABSF2= -5.573092
##$ABSG= 5
##$ABSL= 3
##$ALPHA= 0
##$AQORDER= 0
##$ASSFAC= 0
##$ASSFACI= 0
##$ASSFACX= 0
##$ASSWID= 0
##$AUNMP= <proc_prof1d_extract_pilot.lims>
##$AXLEFT= 0
##$AXNAME= <>
##$AXNUC= <1H>
##$AXRIGHT= 0
##$AXTYPE= 0
##$AXUNIT= <>
##$AZFE= 0.1
##$AZFW= 0.1
##$BCFW= 0
##$BC_mod= 0
##$BYTORDP= 0
##$COROFFS= 0
##$CY= 15
##$DATMOD= 1
##$DC= 0
##$DFILT= <>
##$DTYPP= 0
##$F1P= 0
##$F2P= 0
##$FCOR= 0.5
##$FTSIZE= 32768
##$FT_mod= 6
##$GAMMA= 0
##$GB= 0
##$INTBC= 1
##$INTSCL= 1
##$ISEN= 128
##$LB= 0
##$LEV0= 0
##$LPBIN= 0
##$MAXI= 10000
##$MC2= 0
##$MEAN= 0
##$ME_mod= 0
##$MI= 0
##$NCOEF= 0
##$NC_proc= -8
##$NLEV= 6
##$NOISF1= 0
##$NOISF2= 0
##$NSP= 0
##$NTH_PI= 0
##$NZP= 0
##$OFFSET= 14.98509
##$PC= 1
##$PHC0= 100.3986
##$PHC1= 0
##$PH_mod= 1
##$PKNL= yes
##$PPARMOD= 0
##$PPDIAG= 0
##$PPIPTYP= 0
##$PPMPNUM= 2147483647
##$PPRESOL= 1
##$PSCAL= 4
##$PSIGN= 0
##$PYNMP= <proc.py>
##$REVERSE= no
##$SF= 400.02
##$SI= 32768
##$SIGF1= 0
##$SIGF2= 0
##$SINO= 400
##$SIOLD= 32768
##$SPECTYP= <>
##$SREGLST= <1H.CDCl3>
##$SSB= 0
##$STSI= 32768
##$STSR= 0
##$SW_p= 8223.68421052631
##$SYMM= 0
##$S_DEV= 0
##$TDeff= 65536
##$TDoff= 0
##$TI= <>
##$TILT= no
##$TM1= 0
##$TM2= 0
##$TOPLEV= 0
##$USERP1= <user>
##$USERP2= <user>
##$USERP3= <user>
##$USERP4= <user>
##$USERP5= <user>
##$WDW= 1
##$XDIM= 32768
##$YMAX_p= 455594710
##$YMIN_p= -717487
##$CURPLOT= <Network HP LaserJet P1505>
##$CURPRIN= <$Network HP LaserJet P1505>
##$DFORMAT= <normdp>
##$LAYOUT= <+/1D_H.xwp>
##$LFORMAT= <normlp>
##$PFORMAT= <normpl>
##$SURQMSG= 1
$$ End of Bruker specific parameters
$$ ---------------------------------
##NTUPLES= NMR SPECTRUM
##VAR_NAME=  FREQUENCY,     SPECTRUM/REAL,   SPECTRUM/IMAG
##SYMBOL=    X,             R,               I
##VAR_TYPE=  INDEPENDENT,   DEPENDENT,       DEPENDENT
##VAR_FORM=  AFFN,          ASDF,            ASDF
##VAR_DIM=   32768,         32768,           32768
##UNITS=     HZ,            ARBITRARY UNITS, ARBITRARY UNITS
##FACTOR=    0.250966925370066, 1,           1
##FIRST=     8223.43324360094, 122863,       -94445
##LAST=      0,             69909,           -56856
##MIN=       0,             -717487,         0
##MAX=       8223.43324360094, 455594710,    0
$$ Real data points
##PAGE= N=1
##DATA TABLE= (X++(R..R)), XYDATA
$$ [...]
19580I735L2273e9599C43594b24074C9542J2940J00822c62208A23382i8793B237
19568C3233L8275R7343c200A53020c21317A76351a99202R6218c5114j15297I3788
19556I4777J20880l6205q936b30450P0517c6356A12139e0933j59040B01027r1314
19545A09713a04198F9742d55072D3179c8228k33736J05100P0329B89977I905b1285
19533d15607A72584C2189Q3736m8088a70425e2551A08140I913f9260A4684a43827
19521A74150c08108a05313j24644J0268i5042B27117A5410f8011q94C85249j21140
19510B64109A24330f3660k49217i6005b8278G456K29450a69304M7883l2463j08128
19499b62012M3038e2210A30826B765e5319j41300Q1112j68155b6143j53391A92661
$$ y = [9735, 42008, -59599, 343594, -224074, 39542, 52482, 153304, -362208, 123382, -98793, 2237, 33233, 71508, 168851, -3200, 153020, -321317, 176351, -199202, -102984, -35114, -150411, 93788, 94777, 215657, 179452, 170516, -230450, -159933, -36356, 112139, -50933, -209973, 201027, 109713, -104198, 69742, -455072, 43179, -38228, -271964, -166864, -96535, 289977, 9905, -21285, -415607, 172584, 32189, 115925, 67837, -170425, -52551, 108140, 9913, -69260, 14684, -143827, 174150, -308108, -105313, -229957, -219689, -95042, 227117, 15410, -68011, -68905, 385249, 264109, 124330, -63660, -312877, -96005, -28278, 7456, 236906, -169304, -121421, -153884, -262012, -218974, -52210, 130826, 2765, -55319, -196619, -115507, -283662, -26143, -179534, 192661]
19487a03753d1555A01868b70753J9280A57938e7460b365k95881O2662a04544B92404
19475A96b78482a18948j67979a15701q0206g0762A470c83425b2985j62474a2394
19463A76989a65154f6739j43091E4970J53240P3282a96078K9231B83852a83674
19452b23634I275b94395J00854A08107H085R565M9169a12175a1636o0590A61473
19440a91702c2762j20641A05935B8134a72779d6893j31593j39258d1799B27270
19429h5025H4672K05500f7266P820b1286j57972L6287A3795a94601h3610j01212
19418a84822M6354k91233h7309A04698h9395E643J40882a29560A907e5156F3072
19406F6147c12141B7784c24159Q4591i7697p03j6009M1727L3770o9464E3076b89925
$$ y = [-103753, -41555, 101868, -270753, -251473, 157938, -57460, -2365, -298246, -235584, -104544, 292404, 196, -278482, -118948, -286927, -115701, -195907, -70762, 1470, -383425, -22985, -185459, -12394, 176989, -165154, -66739, -209830, 54970, 208210, 281492, -196078, -166847, 283852, -183674, -223634, 9275, -294395, -193541, 108107, 8085, 17650, 66819, -112175, -11636, -72226, 161473, -191702, -32762, -153403, 105935, 28134, -172779, -46893, -178486, -317744, -41799, 227270, -85025, 84672, 290172, -67266, -59446, -21286, -179258, -142971, 13795, -194601, -83610, -184822, -138468, -429701, -87309, 104698, -89395, 5643, 146525, -129560, 1907, -55156, 63072, 66147, -312141, 27784, -324159, -239568, -97697, -98400, -114409, -72682, -38912, -108376, 53076, -289925]
19393A26977A3851J41343n9792c6388D697M4500c9010a1009r9055q9229K2341
19382a76952j43597a36217A77641c680A04162e5511j61061j97994D0397A7243
19371d592l34227I5262C7287b71816g4229n3017j4783M2646Q662C66318g8880
19359B78977a65802j10969B70746A05376c12893a50686j00120f2989r7863j58535
19349c19387C2940g5170q3702k37873a55501b9476A7081i1430L7764j7242L5183
19338c5725j88079H2473a97316e6471H6010o43g8858A05361f4131A06523j4303
19327I2220J76111j09301a05839j82524J7927A48543p0552J54199d27217J97443
19317b29774A03966A0284b6449C6382c89743A68387a27671l06456a50230B8843
$$ y = [126977, 13851, 155194, 95402, -36388, 4697, 49197, -39010, -11009, -110064, -199293, -176952, -320549, -136217, 177641, -3680, 104162, -55511, -216572, -414566, 40397, 17243, -4592, -338819, 95262, 37287, -271816, -74229, -127246, -142029, -99383, -90721, 366318, -78880, 278977, -165802, -276771, 270746, 105376, -312893, -150686, -250806, -62989, -160852, -319387, 32940, -75170, -158872, -396745, -155501, -29476, 17081, -91430, -53666, -70908, -35725, -223804, 82473, -197316, -56471, 86010, 85367, -78858, 105361, -64131, 106523, 92220, 268331, 159030, -105839, -288363, -270436, 148543, 77991, 232190, -427217, -229774, 103966, 10284, -26449, 36382, -389743, 168387, -127671, -434127, -150230, 28843]
19306A28185L2250G1870J69983b41121F098a56108A12699J8715m6753a87327j23096
19295c10423I372a03380l9663B66191c02332K3488h4256K5750f812j21010j37047
19284b64869a3382K256k81170n3534H0398B9329d7159A0965b55552J12932j0077
19273a52697l1696B27146d3832j29086j29988J38693N0025a6068j44221C72170
19262F4171l0312H22a09480c2055k0343p0920B6096h8256L8979C13303G4378E665
19249d1905k52606C59864A38866b10686D0899a25557F3605c58006n8228a16131
19238A3387N8375J02063a36487A19907c7210k88226C47346A36016J29158b52026
19227G2215a00367D7878h8241k80938A57553J18845i5659j01374d3410r4540o4643
$$ y = [128185, 160435, 71870, 241853, -241121, 6098, -156108, 112699, 131414, 84661, -187327, -310423, 9372, -103380, -143043, 266191, -302332, -278844, -84256, -58506, -6812, -127822, -264869, -13382, -11126, -292296, -345830, 80398, 29329, -47159, 10965, -255552, -142620, -152697, -184393, 227146, -43832, -172918, -302906, -164213, -114188, -16068, -160289, 372170, 64171, 33859, 822, -109480, -32055, -52398, -123318, 26096, -88256, -49277, 313303, 74378, 5665, -41905, -294511, 359864, 138866, -210686, 40899, -125557, 63605, -358006, -416234, -116131, 13387, 71762, 173825, -136487, 119907, -37210, -325436, 347346, 136016, 265174, -252026, 72215, -100367, 47878, -88241, -369179, 157553, 276398, -95659, -197033, -43410, -137950, -202593]
19216b02593B15452A4801b05961a01628A32997a6051D481b1178m872C07346c07388
19204a54028N7855A55909O1122a85389j26854k66661a18343m274j9416a656B3061
19192A87840a61204F4880a15510H8425O4268c66925J23420d4145A5169c1042k32266
19181b63308J25328q3973n7515a36895r9526E6824M0954f3863q2445m8612g4911
19169b05858N4758j2062C7615F085e4790A07613a4795A5979K4806b74534a09059
19157H9191j0872M03708k40408h1251j58203k63482e8721A21421a71619g2397
19146A8196Q1270i4883l2515m7589A76205a88769l7555a8812j4401k30625d4339
19134g0139k72341O9745b1116k38745A9968J18732B3051b55243d2243G7690A4075
$$ y = [-202593, 215452, 14801, -205961, -101628, 132997, -16051, 4481, -21178, -26050, 307346, -307388, -154028, -96173, 155909, 217031, -185389, -312243, -578904, -118343, -122617, -142033, -1656, 23061, 187840, -161204, 64880, -115510, 88425, 152693, -366925, -243505, -44145, 15169, -31042, -263308, -137980, -221953, -279468, -136895, -236421, 56824, 97778, -63863, -146308, -194920, -74911, -205858, -151100, -163162, 37615, 6085, -54790, 107613, -14795, 15979, 40785, -274534, -109059, 89191, 78319, 482027, 241619, -81251, -239454, -502936, -58721, 121421, -171619, -72397, 18196, 99466, -94883, -127398, -174987, 176205, -188769, -226324, -18812, -33213, -263838, -44339, -70139, -342480, -272735, -21116, -259861, 19968, 138700, 23051, -255243, -42243, 77690, 14075]
19122A15768K35182b82762Q4394K1683k04685J67933k5353B222O9359b92682B4252
19110A59843E064e8164j38007N2127k2677H92g2399r2933l8077e9877r6688o8016
19098b24581M6916b3571b807G8769M7164h0578A06192a14649e2557j76523g0979
19086a85873g4078L4017k73846a11738k5122l1116J0224q852p3758g8279A22008
19074f5207j05634B00276a20077M417B96367a80419D821c2094I4687J4796b40410
19062C5936d1630P316A5215f5427G8802j3270J77710a33694B02084a05383B9041
19050a41092O2189q9092k6053p469I6650a64188q8631a15549G5615d02086a16993
19038g9017o9948A71430b75509A32918a43152q0147e48C2953a57604P5824j28111
$$ y = [115768, 350950, -282762, -198368, -176685, -381370, -213437, -238790, 2222, 71581, -292682, 24252, 159843, 5064, -58164, -196171, -144044, -166721, 892, -72399, -165332, -203409, -59877, -156565, -224581, -177665, -23571, -2807, 78769, 125933, -80578, 106192, -114649, -52557, -229080, -70979, -185873, -74078, -40061, -313907, -111738, -136860, -167976, -157752, -166604, -240362, -78279, 122008, -65207, -170841, 200276, -120077, -115660, 296367, -180419, 4821, -32094, 94687, 109483, -240410, 35936, -41630, -34314, 15215, -65427, 78802, 65532, 243242, -133694, 202084, -105383, 29041, -141092, -78903, -167995, -194048, -201517, 96650, -164188, -252819, -115549, 75615, -402086, -116993, -79017, -148965, 171430, -275509, 132918, -143152, -223299, -548, 32953, -157604, -81780, -209891]
19027b09891B09944M9643a06367F9050c39323A75284b6531B7547c56228B53a12049
19015B09269i736B43557e37298B79689E4554b7873j79749G9709K07647C9762b46524
19003a7561B75681b56582F8215j8921a4740H8737J28275a32555H7198B0773b0308
18991D8492b68592D5008b08360B0125I945N6978L5885b39983A74195e230H0328
18979a61724A85411h6298r3959C46473B1363K8434J26278e0905m4605A11091M7533
18968A58624b7453B59637a85392B66841B875d3389j8563A08145A0817a40664O5662
18957g5002k60260J42176j5545R3692H9557a51520f3370j3321b6575m41223B58462
18945a37350A16639N5442C6292N370f6022q5751F9498a94298A50090a00260d7140
$$ y = [-209891, 209944, 259587, -106367, 69050, -339323, 175284, -26531, 27547, -356228, 253, -112049, 209269, -9736, 243557, -537298, 279689, 54554, -27873, -207622, 79709, 287356, 39762, -246524, -17561, 275681, -256582, 68215, 49294, -14740, 88737, 217012, -132555, 87198, 20773, -20308, 48492, -268592, 45008, -208360, 20125, 9945, 66923, 102808, -239983, 174195, -5230, 80328, -161724, 185411, -86298, -180257, 346473, 21363, 49797, 176075, -50905, -95510, 111091, 158624, -27453, 259637, -185392, 266841, 2875, -43389, -61952, 108145, 10817, -140664, -75002, -335262, -193086, -208631, -114939, 89557, -151520, -63370, -76691, -26575, -467798, 258462, -137350, 116639, 172081, 36292, 41662, -66022, -151773, 69498, -194298, 150090, -100260, -47140]
18933G1104O79K37746d03779a1327A64525b11538B115J17609E0268P5980h6327
18921a16256K0870k89376a60699k7436A18202h7776a5598j03539j21048O7493
18911a72692A15458k5482a95223h0337H5750e9332b0344k59321P0870I2145e3846
18899c01986h6221k3059n0861A85855c24828J28121B64863A11137h7111b8595
18888b28605A42052n2670a5372q2738k3032c0253j47503j45274A05180C3715O4620
18877I8335c32430D210R8636b98572A20460e007k93702a01500a6536k7651q4610
18866a28797C715J9964b86591J18684C1385d58343J47266D2492h0670j01637b3919
18854B13633E0731a91760B45486a01662G0837R7914E5679b00638j7758b0799p2174
$$ y = [71104, 71783, 309529, -403779, -11327, 164525, -211538, 2115, 119724, 50268, 126248, -86327, -116256, -95386, -384762, -160699, -188135, 118202, -87776, -15598, -119137, -240185, -172692, 115458, 89976, -195223, -80337, 85750, -59332, -20344, -279665, -208795, 92145, -53846, -301986, -86221, -109280, -160141, 185855, -324828, -196707, 264863, 111137, -87111, -28595, -228605, 142052, 89382, -15372, -98110, -121142, -30253, -177756, -323030, 105180, 33715, 98335, -332430, 4210, 102846, -298572, 120460, -5007, -298709, -101500, -16536, -44187, -128797, 3715, 23679, -286591, -167907, 31385, -458343, -311077, 42492, -80670, -182307, -23919, 213633, 50731, -191760, 245486, -101662, 70837, 168751, 55679, -200638, -218396, -20799, -92973]
18843i2973j26347B7937J8061g1388O978a9680l23201g5025j14739A0545c09684
18831g2997j52444B42503a69703l1090K0676A91612h3065b9490c557A4674N5472
18820G0146i2893A06605e8036C7393e3852j8019p2556G5836K16301a9586G9198
18808i2614B05141n0807l1347a76915B10054b16522A90191C2767g2746j14525
18798a87271A44416k9035K6389c6217p6335B64856b59034O2661q9026K2955a06040
18786I6879a65532B35422a86672Q6261j9408J03K5511B75689A1495e3473k28164
18775b81637J35035a3114j12558K2051B87314a99800j12796J04412A74057E6830
18764c8868l73946B8406b19535g1397n3251A22816l5861L6238d1286k58368h9823
$$ y = [-92973, -219320, 27937, 45998, -71388, -64410, -19680, -342881, -75025, -189764, 10545, -309684, -72997, -225441, 242503, -169703, -200793, -180117, 191612, -83065, -29490, -3557, 14674, 70146, -92893, 106605, -58036, 37393, -53852, -71871, -144427, 75836, 292137, -19586, 79198, -92614, 205141, 154334, 122987, -176915, 210054, -216522, 190191, 32767, -72746, -187271, 144416, 115381, 141770, -36217, -112552, 264856, -259034, -196373, -285399, -262444, -106040, 96879, -165532, 235422, -186672, -100411, -119819, -119716, -94205, 275689, 11495, -53473, -281637, -146602, -13114, -125672, -103621, 287314, -199800, -312596, -208184, 174057, 56830, -38868, -412814, 28406, -219535, -71397, -124648, 122816, 86955, 123193, -41286, -299654, -89823]
18752c94308H4831b6550A55206a97637g0684I6608a479q9581a0397G492a11827
18740b81920n3151i1642F1227g7276G1758P4423c30084G4692j666J39163c8252
18728A079i5063B3413a53425o3202E9141a1870F8911O6239l9140G648a93828M9639
18716a44189a5090A65002Q5962G0242M0044b4223k48795A52825h8465g370r9955
18705a07325q9964R8512r9227C27050r3327G9212b81944O917C9261a61421L8885
18694a22536j31251C9267a70663b1268A14041e8718D41913j46443a90904j0842
18684b01746e1161a7158l83896J68090D2724a44026E9289a12877m9178j32856
18674b94911J46307f8818p1684c4541e638n53940c7573A03778J5492f6965H2338
$$ y = [-394308, 84831, -26550, 155206, -197637, -70684, 96608, -1479, -91060, -10397, 7492, -111827, -281920, -335071, -91642, 61227, -77276, 71758, 146181, -330084, 74692, 73026, 212189, -38252, 1079, -95063, 23413, -153425, -216627, 59141, -11870, 68911, 135150, 96010, 7648, -193828, -144189, -15090, 165002, 250964, 70242, 110286, -24223, -273018, 152825, -88465, -7370, -107325, -197289, -98777, -198004, 327050, 233723, 79212, -281944, -275027, 39261, -161421, -122536, -253787, 39267, -170663, -21268, 114041, -58718, 441913, 295470, -190904, -201746, -51161, -17158, -401054, -232964, 42724, -144026, 59289, -112877, -162055, -294911, -148604, -68818, -140502, -34541, -5638, -559578, -37573, 103778, 119270, -66965, 82338]
18662b34434a02115j01740k56789A61557a82936a5146o4102p2590f0774A63051
18651b8714n326A77147G9039f5834B32685c85031J12750B7270A1225c2167j5142
18640d7309G4204l5710J74526L8190a96078I7125J54876b16085C5747a92351M0838
18629a51513l1775E23b46177a14892c3636j57487p857m0115J00441j30233J28994
18618a39893k7473p4812b3445B7234e4061j16640b7069q13k91205A3780o540J41655
18606A48895o0864P8220b853q0329l9368A43810a38610m8011A4063c66561a60445
18594g5376L5784A17787L0938D8567K57667f5447A32198k313L5344o5170c48415
18582A76989b67634a02540K6466E6842b66639e739B39011c92156i8997D0755a59635
$$ y = [-234434, -102115, -203855, -460644, 161557, -182936, -15146, -79248, -151838, -60774, 163051, -28714, -34040, 177147, 79039, -65834, 232685, -385031, -272281, 27270, 11225, -32167, -47309, 74204, 38494, 213020, 251210, -196078, 97125, 252001, -216085, 35747, -192351, -151513, -183288, 523, -246177, -114892, -33636, -191123, -198980, -239095, -138654, -268887, -139893, -167366, -242178, -23445, 27234, -54061, -170701, -27069, -27882, -319087, 13780, 7240, 148895, 88031, 166251, -2853, -83182, -122550, 143810, -138610, -186621, 14063, -366561, -160445, -75376, -39592, 117787, 148725, 48567, 306234, -65447, 132198, 129885, 165229, 100059, -348415, 176989, -267634, -102540, -76074, 56842, -266639, -5739, 239011, -392156, -98997, 40755, -159635]
18570a14299d0494B12017a83375e0729A42152P3117B1572a27780B5751J69465
18560A95216b3224C56691A02910B988f3912C8586c77164a55972f0382j52834a7370
18548d7719j12742k11582J47560c1067J2869j65516d4163D2336I131a63192a9137
18536g6595A56439K7269c39972a08914j94990C0994b35927A63191C5793a69726
18525B77179E0079C888b96292L3500a1730p0251j65194g2297B01981A2426M4431
18514E6857c11697a08765k7355j17422A70280c8851n8355C8247a26971K9693F2013
18502g3348K5491a9260A4602a16679k18993d7603e091k07644k50486a31015J6324
18491a14691A35220b01974F7277K38752g4219K4523m3340l29074D2921f5545k3447
$$ y = [-114299, -40494, 212017, -183375, -50729, 142152, 215269, 21572, -127780, 25751, 195216, -23224, 356691, 102910, 2988, -63912, 38586, -377164, -155972, -60382, -213216, -17370, -47719, -160461, -372043, -224483, -31067, -18198, -183714, -44163, 42336, 9131, -163192, -19137, -76595, 156439, 183708, -339972, -108914, -303904, 30994, -235927, 163191, 35793, -169726, 277179, 50079, 3888, -296292, -262792, -11730, -81981, -247175, -72297, 201981, 12426, 56857, -311697, -108765, -136120, -253542, 170280, -38851, -97206, 38247, -126971, -97278, 62013, -73348, -47857, -19260, 14602, -116679, -335672, -47603, -5091, -212735, -463221, -131015, -114691, 135220, -201974, 67277, 306029, -74219, -49696, -93036, -422110, 42921, -65545, -88992]
18480h8992B0387Q9640b60090N32f8655A5145Q1549b28663E9205K56280A08657
18468A36986l5553a56403A22216f1034A9515P7013b4241A04689c44546J42015
18458b02531N3509l2530k31377b852o5162J1202b0930A05662j9473a06342B643
18446B17873b51839P169b1238A75935G7125b00567E9563f2229j9915k6212j1145
18435a19501n5929B58931e1912j00053M0358b3509j0221A6808i4715A06752f6520
18423b13289A07108a5947j29302p5813k8558r6744N3463j1274f7520b2250k5862
18412d8112j86275M5889c4184A01944O4970k5142m4807h013C38649H9926L4417
18401A24343m0648a61001G9450R4162F5370a4491r6943l09251J07862a5794B49164
$$ y = [-88992, 20387, 110027, -260090, -259558, -68655, 15145, 96694, -228663, 59205, 315485, 108657, 136986, 101433, -156403, 122216, -61034, 19515, 96528, -24241, 104689, -344546, -202531, -149022, -181552, -412929, -2852, -68014, -56812, -20930, 105662, 86189, -106342, 2643, 217873, -251839, -244670, -21238, 175935, 77125, -200567, 59563, -62229, -82144, -108356, -119501, -175430, 258931, -51912, -151965, -111607, -23509, -33730, 16808, -94715, 106752, -66520, -213289, 107108, -15947, -145249, -221062, -249620, -346364, -292901, -304175, -67520, -22250, -48112, -234387, -188498, -34184, 101944, 166914, 141772, 96965, -8013, 338649, 89926, 124343, 83695, -161001, 79450, 173612, 65370, -14491, -111434, -420685, -312823, -15794, 249164]
18389a53947d6704B43114B431a61684k00975B60167a32618j16266j25401J60377
18379b13908D4792b90077F900d69783B66074j4034a26272B19321D7733h7655E2858
18367B16421p6614a5520B65756a97053A92872a34252j09260H5465g844j11122
18357a18966K1374A6292b86869A53048e10826A59946K6369H0381J08332b79779
18346d7994l18134E2149c7965j27101e8955C4277M821a6048o6432m941j3578b5948
18333i2864C10577q8029g1526H07b58403a15214d7906l125B50762A24984O2046
18322A87030b92476m691J2670G03h2185E5645J41694L3651H2320K4705J4880d14211
18309b08588q9947J34017e7463j11166A97216n3424m2295b18484F894a37145M8337
$$ y = [-153947, -46704, 243114, 2431, -161684, -362659, 260167, -132618, -248884, -374285, -213908, 44792, -290077, 6900, -469783, 266074, 252040, -126272, 219321, 47733, -87655, 52858, 216421, 139807, -15520, 265756, -197053, 192872, -134252, -243512, 85465, -7844, -118966, -97592, 16292, -286869, 153048, -510826, 159946, 186315, 80381, 188713, -279779, -47994, -366128, 52149, -37965, -165066, -58955, 34277, 39098, -16048, -82480, -87421, -100999, -25948, -92864, 310577, 222548, -71526, 807, -258403, -115214, -47906, -51031, 250762, 124984, 187030, -292476, -297167, -284497, 703, -82185, 55645, 197339, 230990, 82320, 107025, 121905, -414211, -208588, -298535, -164518, -57463, -168629, 197216, 143792, 101497, -218484, 6894, -137145, -88808]
18298h8808A01419h8779j78564C69679a17082n7489j5573O2599e0645B00136G9358
18286d5857E5955a74487A34448i9227A27674I520e8065o8886d4687A57119h6174
18274d4908j49134d4835F196h3338D0083a98883D8702a87598B50381a40473k3189
18263a63662m106k36317A9398O1338a66889C03580a28470o8820B48953n8590p7979
18252A12384J27550i1153K5367j42415d1643R977C6546d9682p9370A75528e8888
18240d31625B74809d84998a6892j44441G1702l0290A6477c0546A85366A2064L6119
18229D8183c242E8725b51278C01544a79452C8671a79145K2085e7562K1430k92075
18218c28207A17618d03757h6814a3362l20427h2896G1078K9726c18414a44191
$$ y = [-88808, 101419, -88779, -267343, 369679, -117082, -174571, -190144, -127545, -50645, 200136, 79358, -45857, 55955, -174487, 134448, -99227, 127674, 9520, -58065, -126951, -44687, 157119, -86174, -44908, -194042, -44835, 6196, -83338, 40083, -198883, 48702, -187598, 250381, -140473, -163662, -167768, -404085, 19398, 80736, -166889, 303580, -128470, -197290, 248953, 190363, 112384, 239934, -91153, -65786, -208201, -41643, -31666, 36546, -49682, -129052, 175528, -58888, -431625, 274809, -484998, -16892, -161333, 71702, 41412, 16477, -30546, 185366, 12064, 48183, -3242, 58725, -251278, 301544, -179452, 38671, -179145, -157060, -57562, -36132, -328207, 117618, -403757, -86814, -13362, -333789, -82896, 71078, 100804, -318414, -144191]
18207h6835m3358A0672a70133m3176i4158r080K3885E9707Q0676E4363b50083
18195a54280j53621a21949j85402c5755C59899e8340j4227l9597j4182r7819j36472
18184c60637e7400A63235F6928b07756Q3319A0676K71070j26943d9015a2846B9964
18172d106o8333C8698b19839A66511g7078B65134A6751i2746c7292A6691b27991
18160c46887a31984j1964j53837f8013A3615K21583a27199G3470a64976b5684
18149D496g7092J2572k3345b6291n0853H9174b26746M5894n6402c4560j20896
18138a55456A64b922q6880A5208b87349a27931B25912b4613k66708B09800C6937
18126C99553b8197G667b98234E55J05201a19846I9690C0172a36470I211g1502
$$ y = [-86835, -130193, 10672, -170133, -213309, -94158, -103238, -79353, 59707, 140383, 54363, -250083, -154280, -307901, -121949, -307351, -35755, 359899, -58340, -72567, -112164, -126346, -224165, -360637, -57400, 163235, 66928, -207756, -124437, 10676, 281746, 154803, -49015, -12846, 29964, -4106, -72439, 38698, -219839, 166511, -77078, 265134, 16751, -92746, -37292, 16691, -227991, -346887, -131984, -143948, -297785, -68013, 13615, 235198, -127199, 73470, -164976, -25684, 4496, -77092, -64520, -87865, -26291, -77144, 89174, -226746, -180852, -237254, -34560, -155456, 164, -2922, -89802, 15208, -287349, -127931, 225912, -24613, -291321, 209800, 36937, 399553, -28197, 7667, -298234, 555, 105756, -119846, 99690, 30172, -136470, 9211, -71502]
18114A72029G7879a80824l04407c6635k26103A90534E4318b24824k65756b18416
18103f0889K0027r5949j48016B31454d02442c000I9651C0767A3525J50563a66882
18091c79296e7154H3378g9783B28670b50837B8735c3535D357b19645N7703d1298
18079a55407E2470Q9500J37816H765K9529o859g3313K1736B20931r6558e0481
18067a12172p7245A09949e4982k4320A45204a01973c3045I7575B9257J38041a28119
18055b89297B10706J85923e8364A59905b28420J05025O0261l6879j79410h1385
18044b24171j30791b9103O215D501d33069G2455K02809E4167A847M3130g0111
18032B9376J19408J20592r6245a31489C02583a9839G7391b5234k74101g5282C30225
$$ y = [172029, 77879, -180824, -485231, -36635, -262738, 190534, 54318, -224824, -490580, -218416, -60889, -40862, -136811, -284827, 231454, -402442, -3000, 99651, 30767, 13525, 164088, -166882, -379296, -57154, 83378, -79783, 228670, -250837, 28735, -33535, 4357, -219645, -161942, -41298, -155407, 52470, 141970, 279786, 8765, 38294, 31435, -73313, -51577, 220931, 124373, -50481, -112172, -189417, 109949, -54982, -79302, 145204, -101973, -33045, 97575, 29257, 167298, -128119, -289297, 210706, 396629, -58364, 159905, -228420, -123395, -63134, -100013, -279423, -81385, -224171, -354962, -29103, -22888, 4501, -433069, 72455, 275264, 54167, 1847, 44977, -70111, 29376, 148784, 269376, 173131, -131489, 302583, -19839, 77391, -25234, -299335, -75282, 330225]
18020A97371h4674A31519e6686j47826I8109b71665n0983B3200J01581a85349
18009A69595i8220M4122B34040C2676J13896c93442A2699a02645H4668k3698a91188
17997a60494J4309j83533K2511K1687a5460j97277B29610b2989A12090B9236a4247
17985H5704a70723H8963i5622A50901a09934K7575j10073C089N7591i0453A07627
17973a04259j13999h6063B77380a58622j25409e4875b564j95757B41747H6832
17962A67560a13708e3238l22053O5514F2735d58971A58131o0463e2663k8273D0262
17950c40548a40794F3265J570Q4128A833i7695o7376e9223r916B9363K34028c29617
17937a95826E43441i3150j4788N0004A38495n0563M4995A1201R9006J13591C6006
$$ y = [197371, -84674, 131519, -56686, -204512, 98109, -271665, -322648, 23200, 124781, -185349, 169595, -98220, -54098, 234040, 32676, 146572, -393442, 12699, -102645, 84668, 60970, -191188, -160494, -146185, -329718, -307207, -285520, -15460, -212737, 229610, -22989, 112090, 29236, -14247, 85704, -170723, 88963, -95622, 150901, -109934, -82359, -192432, 3089, 60680, -90453, 107627, -104259, -218258, -86063, 277380, -158622, -284031, -54875, -2564, -198321, 241747, 86832, 167560, -113708, -53238, -375291, -309777, 62735, -458971, 158131, 97668, -52663, -80936, 40262, -340548, -140794, 63265, 64835, 148963, 1833, -97695, -165071, -59223, -69139, 29363, 263391, -329617, -195826, 543441, -93150, -107938, -57934, 138495, 87932, 132927, 11201, 110207, 223798, 36006]
17925a39598j3575C0693p267Q3086a14601A51687d60528F3686B9640b7081j21575
17914a48656q2013M3893M7723n2156C31692a8209H9665a19349k07653e402B46104
17902B39620r8690O2959c974E1062a90854A50407c1275B25749H976a62774r5858
17891b58632J06356e4022A37579B5716P8885C8890c3610b863C6311a50321D77864
17879C38484d2251j92060H121Q1478d9968k6506F655K23823g1590A46076m4106
17868A01970a01741i766D0445d65682A33273g1168k4377j30112A55884l4323K3780
17857A45341b79669A35248H272K38035B5098A224R5574R8635B6841b62737E2977
17845c9996H6250d3955J5106E3865a05908I3304l3179f5358k61753J45729d3852
$$ y = [-139598, -153173, 30693, 23426, 106512, -114601, 151687, -460528, 63686, 29640, -27081, -148656, -230669, -186776, -139053, -191209, 331692, -18209, 89665, -119349, -327002, -5402, 246104, 239620, 140930, 203889, -3974, 51062, -190854, 150407, -31275, 225749, 8976, -162774, -258632, -152276, -54022, 137579, 25716, 104601, 38890, -33610, -2863, 36311, -150321, 477864, 338484, -42251, -234311, 8121, 89599, -49968, -76474, 6655, 230478, -71590, 146076, 101970, -101741, -9766, 40445, -465682, 133273, -71168, -95545, -225657, 155884, 121561, 145341, -279669, 135248, 8272, 246307, 25098, 1224, 96798, 195433, 26841, -262737, 52977, -39996, 86250, -43955, -28849, 53865, -105908, 93304, 60125, -65358, -327111, -181382, -43852]
17833d1660B91878i2932j0002M7083L538p8985A75786f8155K5032l8247E8667
17821d0080F7715h980k87531a7162I9865j8636c0089j76049b3987j81792A90433
17809B73657a9900j38530o3236h074A23756b96271A76372a57141q9142B8860h451
17797b52684f9937b7339A30405a33347N8999A30414i8722j58403c2858I7014b7726
17785A92350a34889a7881j28749B78325a31255r5656C02692C8107a18193K6826
17775i1367b3170l4832C08576c6232n9405A29686A7532b50662A69847a91794F5520
17763b01382k01993O2796h1765B40574a56843j81085E520e3652k8433e525A9167
17751b12286g5902A49417d4752l711j94048h6604J8626k3120A33486k5119b72799
$$ y = [-41660, 291878, -92932, -102934, -55851, -52313, -131298, 175786, -68155, -43123, -81370, 58667, -40080, 67715, -8980, -296511, -17162, 99865, 81229, -30089, -206138, -23987, -205779, 190433, 273657, -19900, -158430, -221666, -8074, 123756, -296271, 176372, -157141, -246283, 28860, -8451, -252684, -69937, -27339, 130405, -133347, -74348, 130414, -98722, -257125, -32858, 97014, -27726, 192350, -134889, -17881, -146630, 278325, -131255, -226911, 302692, 38107, -118193, -91367, -23170, -58002, 308576, -36232, -95637, 129686, 17532, -250662, 169847, -191794, 65520, -201382, -403375, -340579, -81765, 240574, -156843, -337928, 5520, -53652, -82085, -5525, 19167, -212286, -75902, 149417, -44752, -48463, -242511, -86604, -67978, -91098, 133486, 108367, -272799]
17739a06316A25255n0841e8262k32766a44350p5614b7338C0518f5530I8779L1122
17728A29901b13049J5630g0668A23460K21645b20130d8779B22136H8648C5755
17717a88589m8755B70774a24262a669I9848b998A32788M556i848k31109o509A85700
17704A13090c3518G1097A5109L774c0055j1332F6469J09863a96233H9553b56490
17692a11918A39821D4897b9416j29665A06272D0003J61286F0282Q4418k8749b21908
17680A48881E700b77895i9990F8171C3566K2954J74091o5981M5950a32964D17969
17668d5158B55480j09725m7621a10269A89446c72719d3820A47294G3335B8158
17657A54079a03773D5725A8050a41835e9567D3246d0077A0993K12653b5041B11902
$$ y = [-106316, 125255, 74414, -58262, -291028, -144350, -219964, -27338, 30518, -65530, 98779, 129901, -213049, -197419, -70668, 123460, 345105, -220130, -48779, 222136, 88648, 35755, -188589, -237344, 270774, -124262, -1669, 99848, -2998, 132788, 137344, -9848, -240957, -247466, 185700, 113090, -33518, 71097, 15109, 18883, -30055, -41387, 66469, 176332, -196233, 89553, -256490, -111918, 139821, 44897, -29416, -159081, 106272, 40003, 201289, 60282, 144700, 115951, -221908, 148881, 5700, -277895, -99990, 68171, 33566, 56520, 230611, 164630, 210580, -132964, 417969, -45158, 255480, 145755, 98134, -110269, 189446, -372719, -43820, 147294, 73335, 28158, 154079, -103773, 45725, 18050, -141835, -59567, 43246, -40077, 10993, 223646, -25041, 211902]
17645f5786A35804J39672A36390E1151a93929I0663k9711L9532b1546A84591D3052
17633a01987p7147d6074A40054j0335b84178g613B45766c0874q8073J4454E6530
17621b7256p1234b2860k84127a878B91586j16621G6752A2517J53561b72837B04140
17609B28427D3046O201L60921c0815A49976d9367j50565B93794E5545a69042A27120
17597b85069f2628A86200p2339D2223a83390C3180J2641O698o636h878k2018I1476
17584c3993C08095g3502c2304k17746B62089q7775b70005c8459A93377b26596
17573e524k86055c6959C22441E4829Q4553n3247M2472D9682P8133a08272A551
17561A36893J01246c1513F1554a63020B3730K1798K1187P4021a77704a9434K695
$$ y = [-65786, 135804, 275476, 136390, 51151, -193929, 90663, 60952, 100484, -21546, 184591, 43052, -101987, -179134, -46074, 140054, 129719, -284178, -7613, 245766, -30874, -118947, -104493, 56530, -27256, -98490, -22860, -306987, -1878, 291586, 174965, 76752, 12517, 166078, -272837, 204140, 228427, 43046, 49247, 410168, -30815, 149976, -49367, -199932, 293794, 55545, -169042, 127120, -285069, -62628, 186200, 113861, 42223, -183390, 33180, 45821, 52519, 45883, -8878, -30896, 91476, -33993, 308095, -73502, -32304, -250050, 262089, 174314, -270005, -38459, 193377, -226596, -5524, -291579, -36959, 322441, 54829, 139382, 86135, 128607, 49682, 127815, -108272, 1551, 136893, 238139, -31513, 61554, -163020, 23730, 45528, 66715, 140736, -177704, -19434, -16739]
17550a6739C24277C1544a5165j45007E1585b8254E6953J34015q2689O1359j0233
17539A59405c34484d244C29023m4316b05947C9506L3773J12229a00790A19981
17528G1561A641a46281B42577l5798f7925I0174J48455J26267a98442A65429F7701
17516C4914L09548G3053e970D47824a86528I235J30426b26773B86968c99390D0342
17504a63452A39896c6418M853j35595B66706A04050j3029J52286e7554k47560
17494c05114A74784F2527b59235C53962E9885J96038j09141E6679J28486f300
17483a4052C64977G5772a03377A88448m6769J38743N2398a79790E7188a13735
17472D95961C7605K58390A16955d0613A62383p1854b71381R2821B80917a04804
$$ y = [-16739, 324277, 31544, -15165, -160172, 51585, -28254, 56953, 190968, 108279, 169638, 159405, -334484, -4244, 329023, 284707, -205947, 39506, 73279, 185508, -100790, 119981, 71561, 1641, -146281, 242577, 206779, -67925, 90174, 238629, 364896, -198442, 165429, 67701, 34914, 344462, 73053, -5970, 447824, -186528, 9235, 139661, -226773, 286968, -399390, 40342, -163452, 139896, -36418, -31565, -167160, 266706, 104050, 91021, 243307, -57554, -305114, 174784, 62527, -259235, 353962, 59885, 255923, 146782, 56679, 185165, -6300, -14052, 364977, 75772, -103377, 188448, 141679, 280422, 332820, -179790, 57188, -113735, 495961, 37605, 295995, 116955, -40613, 162383, 90529, -271381, -178560, 280917, -104804]
17461F3052J44661q6273j8628D6494d7003r1809A26100J04379L5985J63975A23802
17449D12154c4086B14316K49296r3827j39971J02748O4451a29526C61979M02185
17439G64164l66220j56209R9055A6785b0624B79562I7588qR1107q5147K19145
17428C22685b6222n242A69274N2808a08002a589A68006J734n25L78513G9083J36582
17416B15665k2473N6835j22561L29030b65225F89587A52189K09450A14940L34534
17406D49474e7098A51741N4469M4020a72669L8602B25658F5082J11402c6841e340
17394a12256E9425N3753N1735L64n9979L1094O3520B1913J8672k253i2446n5599
17382a48045C1586L93958r5442o8897H2854R1593o0150m5901a29972B91218a57591
$$ y = [63052, 207713, 121440, 102812, 46494, -47003, -138812, 126100, 230479, 266464, 430439, 123802, 412154, -34086, 214316, 463612, 369785, 229814, 332562, 397013, -129526, 361979, 764164, 397944, 241735, 340790, 16785, -20624, 279562, 97588, 97580, 188687, 103540, 322685, -26222, -31464, 169274, 222082, -108002, -1589, 168006, 169740, 169215, 547728, 79083, 215665, 193192, 250027, 127466, 456496, -265225, 689587, 152189, 361639, 114940, 449474, -57098, 151741, 206210, 250230, -172669, -134067, 225658, 65082, 176484, -36841, -5340, -112256, 59425, 113178, 164913, 165277, 105298, 136392, 199912, 21913, 40585, 38332, -92446, -148045, 31586, 425544, 330102, 261205, 82854, 174447, 114297, 68396, -129972, 291218, -157591]
17370H5039L3734J0743R3634a14590K0607A11010K81720j31990j09789g8251G384
17358I9416J4347J88979D6927M8943K15819E4239b68593D27492p5450a04453A9913
17346C29934I1711J19046m272a9306E0860K22651b973B58667K28862j75320A7638
17334A09746L58167A37397e0546k98j45240B00106n3829c9419n4096B21117r5945
17323A25172J9560h8855e688q4205p4069a2197H8036J75679o4569i609A09447
17311G9106J59907H9045J60663Q8509a69648f6116B15644J52208A18145L75733
17301D93878k00040r8583a31308A38602L558K41882j62281a365C12831j24780
17291A88051J75699n2851b1870d823k15667d9362J98A69873J05678q7029K07956
$$ y = [85039, 118773, 129516, 223150, -114590, -93983, 111010, 392730, 260740, 150951, -78251, 7384, 99416, 113763, 302742, 46927, 95870, 311689, 54239, -268593, 427492, 352042, -104453, 19913, 329934, 91711, 210757, 206485, -19306, 50860, 273511, -2973, 258667, 487529, 312209, 17638, 109746, 467913, 137397, -50546, -50844, -196084, 200106, 146277, -39419, -93515, 221117, 125172, 144732, -88855, -5688, -89893, -163962, -12197, 88036, 263715, 199146, -9609, 109447, 79106, 239013, 89045, 249708, 338217, -169648, -66116, 215644, 367852, 118145, 493878, 293838, 195255, -131308, 138602, 142160, 384042, 221761, -1365, 312831, 188051, 363750, 310899, -21870, -4823, -220490, -49362, -49164, 169873, 275551, 188522, 396478]
17280C96478C0442g3136A84509o0712o612L22556k08358j09416D1381a52993B22250
17268H5584L3479J9323a88858E74009j41207r8585p7960O4001A9233K70956n2194
17257B37995A15931M9346d0900C09996A10962g9799B47346r70J46993j83416A04605
17245C4938J76978D4205R9400l0909K25449K1625a07452B90011A43801E8105h9545
17233a50582A80694K37234G8442M7652P7284e339B42620H5762c7277C22035A57224
17221a02906L8155D02366j68783j2258a64972A10663J03576N7344n8303Q0852
17211B94132c4330C96952A48790b2819o858A82982p0549J21597L5690F1542N03572
17200E65114B67946I7952J12557M4868F1795J39998b24695A92303J03135A28889
$$ y = [396478, 30442, -73136, 184509, 123797, 117185, 439741, 231383, 121967, 41381, -152993, 222250, 85584, 119063, 138386, -188858, 574009, 432802, 334217, 256257, 320258, 19233, 290189, 237995, 115931, 165277, -40900, 309996, 110962, -79799, 247346, 246376, 393369, 209953, 104605, 34938, 211916, 44205, 143605, 112696, 338145, 359770, -107452, 290011, 143801, 58105, -89545, -150582, 180694, 417928, 78442, 126094, 203378, -5339, 242620, 85762, -37277, 322035, 157224, -102906, -64751, 402366, 233583, 221325, -164972, 110663, 214239, 271583, 213280, 294132, -34330, 396952, 148790, -22819, -29677, 182982, 112433, 234030, 269720, 61542, 565114, 267946, 97952, 210509, 255377, 61795, 201793, -224695, 192303, 295438, 128889]
17189A52104n9121P7065M10164d2498A13973e874D57321A29026i2663E32640H1697
17177C40578Q4479j15830H598a3423C25205m0567K03371J08159k81207A27563
17166C00638j46213M6906C3686L1756K94697a7465l9883B7722e6753A14941K22292
17155C37233m4055o0230E7790R2907H108K59680C9180L7024l094M19648o2040
17144D30718o5037q6551I1861J07194E3435L22050m6946I275L99766J67025k37105
17133C38961J65697k04271N0705d3153D65369B9580N64546j30327A30965J13829
17123B44794K157J96011A67310L2892I1945J33361K8358K04506j67301n7684Q5120
17112C18305p1601m4515J18972L27290B98463G8097J11402J51321J01028A25861
$$ y = [152104, 92983, 170048, 580212, -42498, 113973, -5874, 457321, 129026, -92663, 532640, 81697, 340578, 425057, 309227, 8598, -13423, 325205, 284638, 488009, 596168, 314961, 127563, 300638, 154425, 201331, 33686, 65442, 360139, -17465, -57348, 27722, -56753, 114941, 337233, 293178, 232948, 57790, 150697, 8108, 267788, 39180, 76204, 73110, 492758, 430718, 365681, 279130, 91861, 199055, 53435, 375485, 328539, 9275, 409041, 576066, 338961, 504658, 300387, 351092, -43153, 465369, 29580, 594126, 463799, 130965, 244794, 246951, 442962, 167310, 200202, 91945, 225306, 253664, 458170, 290869, 233185, 318305, 246704, 202189, 321161, 648451, 298463, 78097, 189499, 340820, 441848, 125861]
17101B72230K67614r7034n1530l386J37020J5331A19407D8113L96850k13230R1485
17090C23218M9773A26266j0769L11461E8481L05619l1225N7865m73j04028m475
17079B81764N4825A29826K47169j78941J97803A39149K9550M45307A54603K32690
17069C87293A12012J53488q3111J79541m6814K94066A62517J23897K02285J66581
17059F55280l01988J91918j90185J18042J15869j59026M0369r8315L54690l15627
17049D11027R7394j9912n7803k7713J3103q1742M4454O4125L32600k48026l5309
17038D92198K64892j86132J142n0613j55359R4480L34604B93379J77310P463L07003
17027G85155B89479J68761J23199L0861q9309n3173J61275D51N44058k49802M87486
$$ y = [272230, 539844, 442810, 391280, 387894, 524914, 540245, 119407, 48113, 444963, 231733, 323218, 372991, 126266, 115497, 426958, 58481, 364100, 332875, 390740, 390267, 286239, 281764, 336589, 129826, 376995, 198054, 395857, 139149, 168699, 614006, 154603, 387293, 112012, 265500, 182389, 361930, 315116, 609182, 162517, 286414, 488699, 655280, 353292, 545210, 355025, 473067, 588936, 429910, 470279, 371964, 726654, 411027, 508421, 488509, 430706, 402993, 416096, 334354, 378808, 442933, 775533, 527507, 492198, 757090, 570958, 572100, 521487, 366128, 460608, 795212, 293379, 470689, 478152, 785155, 289479, 458240, 581439, 612300, 522991, 469818, 631093, 451, 544509, 294707, 782193]
17016G82193l13256N5710Q6703k42329Q6605L39214j99206k4127k33182M57734
17006G96059K04980m58477P9159j0033l4781k592P2557O054C02645L04641k3465
16995E83821q0580M37881m19523r5722L64814j02169O4704k8977j10216q4202
16985E29831j53844M89213J12700j02358j46576O1427M6683j90540J34005k14227
16975E66314K98630j84398m4644L43945K4335D59545K26379L0798P3356K99819
16965A089897k73536j12785K56840m61587J51259J58876K29149k13150j10661
16956G14302J41951o9719Q7339J68834j91881J39561j01039L16957j98885m60816
16946E46604O15394k40019O2883n0413k4795J88746k89715J32694K58806O758
$$ y = [782193, 468937, 524647, 611350, 369021, 455626, 794840, 595634, 571507, 338325, 796059, 1001039, 542562, 621721, 611688, 576907, 574315, 646872, 652926, 302645, 607286, 583821, 503241, 941122, 521599, 425877, 790691, 688522, 753226, 724249, 614033, 529831, 375987, 865200, 977900, 875542, 728966, 790393, 837076, 646536, 780541, 566314, 864944, 680546, 635902, 979847, 1004182, 459545, 685924, 716722, 790078, 1089897, 816361, 703576, 960416, 498829, 650088, 808964, 1038113, 824963, 714302, 856253, 786534, 873873, 1042707, 850826, 990387, 889348, 1206305, 1007420, 546604, 1161998, 921979, 984862, 934449, 909654, 1098400, 808685, 941379, 1200185, 1206943]
16936A206943l02102K81240j84896P3778j73600M32621l50808M42787k25995k34270
16926I65698J71513J50189k10058K05957n4811m10283M78708Q172k91397p509
16916A006179O5881K06011j59621L64836k45055n0769N0468l2980L2121N78M1323
16905A278972o5683L80160J35833k24297J90469R4505k43920K36698l78569L51980
16895A756148K8854j66544L27222k17755O081P1433K408J60823l3003R7918m5721
16884A987864l26104Q7635K06203j40654K90748J6530m97245J21936R301P3725
16874A829939M31298n2089j269j49757L55783m578j73377j72245J34746j7952
16864B180499L89428l8120R354P8320l94081L88789m652k3670J27373o1021K07098
$$ y = [1206943, 904841, 1186081, 1001185, 1074963, 901363, 1333984, 983176, 1425963, 1199968, 965698, 1137211, 1287400, 1077342, 1283299, 1228488, 818205, 1296913, 1305085, 1013688, 1006179, 1072060, 1278071, 1118450, 1483286, 1238231, 1187462, 1237930, 1204950, 1237071, 1237649, 1278972, 1213289, 1593449, 1729282, 1504985, 1695454, 1789959, 1546039, 1782737, 1404168, 1756148, 1785002, 1618458, 1945680, 1727925, 1734006, 1805439, 1807847, 1968670, 1935667, 2033585, 1987864, 1661760, 1749395, 1955598, 1814944, 2105692, 2122222, 1624977, 1746913, 1756214, 1829939, 2261237, 2209148, 2207879, 2058122, 2413905, 2409327, 2235950, 2063705, 2198451, 2180499, 2569927, 2531807, 2541161, 2619481, 2225400, 2614189, 2609537, 2585867, 2713240, 2652219, 2859317]
16853B859317J7584k41903K73010j27189j41676J70119L52671J22631l24738K87697
16843C247523k28j73548j38250N60481l16833J61959K76847j24624K73188M4832
16833C811347J8142m786L25811O4494j53432J22806j38572K01645J98299J84507
16823D630261Q2926k65661K76641j47744L10321P7962K84953l84317M15252p5954
16813E204640j20541O26054l09249N55144O9065K56071K6457J53278K3553J65626
16803F650098M05065n17137O24223K11579K76206J46914L175N5211k3357N59233
16793H391210k51985J005526k76388L29900N18239r1087O11408L01490J55685
16784A0693998L65420L80089J04851K58967M78445J90229N12995N17733K92149
$$ y = [2859317, 2876901, 2634998, 2908008, 2780819, 2639143, 2809262, 3161933, 3284564, 2959826, 3247523, 3247295, 3073747, 2935497, 3495978, 3179145, 3341104, 3617951, 3493327, 3766515, 3811347, 3829489, 3824703, 4150514, 4215008, 4061576, 4184382, 4045810, 4247455, 4445754, 4630261, 4713187, 4447526, 4724167, 4576423, 4886744, 4964706, 5249659, 4865342, 5280594, 5204640, 5084099, 5710153, 5400904, 5956048, 6025113, 6281184, 6307641, 6460919, 6484472, 6650098, 7055163, 6538026, 7162249, 7373828, 7650034, 7796948, 7800123, 7855334, 7831977, 8391210, 8139225, 9144751, 8868363, 9198263, 9716502, 9625415, 10236823, 10538313, 10693998, 11059418, 11439507, 11544358, 11803325, 12281770, 12471999, 12984994, 13502727, 13794876]
16775A3794876O54772J95572P63238L63934P71124K67171Q35825M24102R37667
16766A9008281P48694P30918N46793Q11980J089130Q69179Q93613J064526J193270
16757B6956384J083228J176601J107476J704008J626947J577842J722954J842961
16749C8798401J423002K636647K052710K076122K713654K875335L232240K687248
16741E8495359L668359L975039L689203M282247M581946M760669N199485N704751
16733I4357058N715069O216323O685307O956994O740020P577295P314002P350161
16725A48912229O908650O881273O605045N764001M673906L976827K527075J309639
16717A87558645j01805j157775k612376l580253n071699n919081n988983p099590
$$ y = [13794876, 14449648, 14645220, 15408458, 15772392, 16543516, 16810687, 17646512, 18070614, 19008281, 19756975, 20487893, 21034686, 21846666, 22935796, 23804975, 24698588, 25763114, 26956384, 28039612, 29216213, 30323689, 32027697, 33654644, 35232486, 36955440, 38798401, 40221403, 42858050, 44910760, 46986882, 49700536, 52575871, 55808111, 58495359, 62163718, 66138757, 69827960, 74110207, 78692153, 83452822, 88652307, 94357058, 100072127, 106288450, 112973757, 119930751, 126670771, 134248066, 141562068, 148912229, 155820879, 162702152, 169307197, 175071198, 179745104, 183721931, 186249006, 187558645, 187456840, 186299065, 183686689, 180106436, 175034737, 169115656, 163126673, 156027083]
16709A56027083p396683p183003p619870p230699p094794p242052o413761o311197
16701I9535024o131695n570044n320563m685059m661624l916468m398399l705133
16693F1146039l230166l271007l124043k850846k415018k423372k103245k428436
16685C9299906j970036j583940j561700j391755j988155j423766j240147j121401
16677B7019006j092193j190773j037327p59015j226962p74648o10567q81515q88466
16668A8557540o60421m99947q38492n03725l18702n33301o24039p16283j33467
16659A3729163n33692k31945m63433l81549l58557q15118J02695n29109j31633
16650A0386822m21861j51544q51009P1992k66165Q3842k13567m22429j90829j83979
$$ y = [156027083, 148630400, 141447397, 133827527, 126596828, 119502034, 112259982, 105846221, 99535024, 93403329, 87833285, 82512722, 77827663, 73166039, 69249571, 64851172, 61146039, 57915873, 54644866, 51520823, 48669977, 46254959, 43831587, 41728342, 39299906, 37329870, 35745930, 34184230, 32792475, 30804320, 29380554, 28140407, 27019006, 25926813, 24736040, 23698713, 22939698, 21712736, 20938088, 20327521, 19446006, 18557540, 17897119, 17397172, 16558680, 16054955, 15736253, 15202952, 14578913, 13862630, 13729163, 13195471, 12963526, 12500093, 12118544, 11759987, 10944869, 11047564, 10518455, 10386822, 9964961, 9813417, 8962408, 9034400, 8768235, 8852077, 8638510, 8216081, 8025252, 7841273]
16640G841273n2299n46806q1812q4929j98271l7674j58276n84925O3055J10104
16630F269440o0554n05991o5337J35557j43055k42889l86700k91854k1767K20084
16620D906934j37867j85197R7822j71566p1797j42937K89627m90572R8665l74548
16610C818564K78211L523l45544r2432J74792k40660J6390n0775j11636J00250
16600C550683j36906m9924k16554L66315m61086j12338j40828q2698O7279L04202
16590C088145l87354j23192K2627k50250J78268K35538N1879k24513j13356L2704
16580B510496j05487k27578K46013j45945J25352m71833L95619l46390K35161
16571B215408k32362q1359O363J01375P584o308K69576p56912J72212J51699j46620
$$ y = [7841273, 7788974, 7242168, 7160356, 7075427, 6877156, 6839482, 6681206, 6096281, 6159336, 6269440, 6208886, 5702895, 5637558, 5773115, 5630060, 5387171, 5000471, 4708617, 4686850, 4906934, 4769067, 4583870, 4681692, 4510126, 4438329, 4295392, 4585019, 4094447, 4193112, 3818564, 4096775, 4100298, 3754754, 3662322, 3837114, 3596454, 3612844, 3562069, 3450433, 3550683, 3413777, 3363853, 3147299, 3513614, 3052528, 2940190, 2799362, 2716664, 2783943, 3088145, 2700791, 2577599, 2600226, 2349976, 2528244, 2763782, 2815661, 2591148, 2477792, 2510496, 2405009, 2177431, 2423444, 2277499, 2402851, 1931018, 2326637, 1980247, 2215408, 1983046, 1901687, 1908050, 2009425, 2017009, 2010701, 2280277, 1523365, 1695577, 1847276, 1700656]
16560A700656P9469K87052l19341k80204j35677K46989J38539p7983J89124j19644
16550A708980n1056m08085J25172K23068j71501J69461N2371l89883M43872k02990
16540A499409k49775J1635j26129j69650M58549j48106k52651K01846q521K07086
16530A423693k7702N9327J9429o84389L40035J70043n9302k7451j91573J73797
16520A195907j73996J96475j33019k20855M25654k93043J2745j42196j61839L35717
16510A041550Q8283j75343K61922k58644r6378J91720n070l9824m80002K87589
16500H15803j5626K24599l98564J86406O6201K16939l24164J42899k39116k6018
16490F49359K06988k6402j92623R7799J69123j19977j78996L78241D82862J18870
$$ y = [1700656, 1780125, 2067177, 1747836, 1467632, 1331955, 1578944, 1717483, 1639500, 1828624, 1708980, 1657924, 1249839, 1375011, 1598079, 1426578, 1596039, 1648410, 1258527, 1702399, 1499409, 1249634, 1261269, 1135140, 965490, 1424039, 1275933, 1023282, 1225128, 1216607, 1423693, 1395991, 1455318, 1474747, 790358, 1130393, 1300436, 1241134, 1213683, 1022110, 1195907, 1021911, 1218386, 1085367, 864512, 1290166, 997123, 1009868, 867672, 705833, 1041550, 1129833, 954490, 1216412, 957768, 861390, 1053110, 1048040, 1008216, 528214, 815803, 800177, 1024776, 626212, 812618, 878819, 1095758, 771594, 914493, 675377, 649359, 856347, 829945, 637322, 735121, 904244, 784267, 605271, 983512, 482862, 601732]
16480F01732J90930j03923R4074K1344O0953j41786K33785j85284k57588L43815
16470H58052l96476K88133R0867k23479J67522J04901k02503k66975n194K52103
16460F66951R1239R0204k09268J05161J50736m05553L62524m4744l25731L816
16450D85335J18180n7187K21263l12088J59617O9159j25320k4429R1148j99561
16440D26117r5089M51496l52742J94475J10110j67935j92839N5699K72953j40147
16430E62098P8360C12027J38694n9059A92284K83306B31285L67883j43833J11333
16420E66668q2909K3815G5254J53519L54645L3299j63199k12425L11100N8561
16410F10754r9052J7068m1800O1593j60052K36398j34485j08965j07419R4827
$$ y = [601732, 792662, 688739, 782813, 804157, 865110, 723324, 957109, 771825, 514237, 858052, 461576, 749709, 840576, 617097, 784619, 889520, 687017, 420042, 414848, 666951, 758190, 848394, 639126, 744287, 895023, 489470, 851994, 807250, 481519, 485335, 603515, 546328, 767591, 455503, 615120, 684279, 558959, 534530, 625678, 426117, 331028, 782524, 429782, 624257, 734367, 566432, 373593, 429292, 702245, 562098, 640458, 312027, 450721, 391662, 192284, 475590, 231285, 599168, 455335, 566668, 483759, 507574, 75254, 228773, 583418, 616717, 453518, 241093, 552193, 610754, 511702, 528770, 486970, 548563, 388511, 624909, 490424, 381459, 274040, 368867]
16400C68867M3723l3165l0230O9909j87989J62232A51214K28252J7933j69511
16390B27888M47735B10955K64627G6312M93621B25643q1700L7152K64525A34470
16379C68589r9911L0496Q0407R2365j42602K36721j09331k20546K9824K74330
16369E40342h563D88092k40310F5435K50152R885H4602L74751O1563k41843p0802
16358B08271J00936J01177l0817j35980p0071K24131j62219K38716Q8570a44083
16347D57168j70924j3429j15578o6054K08785r9494i2497B90532L7015j35710
16337A91837P3822j07987K25650A34623J59947I9942A4617A819L52412H1306J79939
16326B61245K91042A28933f4519B15561J39974g8921A33316E7541a28002C36639
$$ y = [368867, 412590, 379425, 349195, 419104, 231115, 393347, 151214, 379466, 397399, 227888, 675623, 210955, 475582, 76312, 569933, 225643, 143943, 181095, 445620, 134470, 368589, 268678, 299174, 379581, 471946, 329344, 566065, 456734, 236188, 266012, 540342, -8563, 488092, 247782, 65435, 315587, 325472, 84602, 459353, 520916, 279073, 208271, 309207, 410384, 379567, 243587, 173516, 397647, 235428, 474144, 562714, -144083, 457168, 286244, 272815, 157237, 91183, 299968, 200474, -92497, 290532, 327547, 191837, 265659, 157672, 383322, 134623, 294570, 99942, 14617, 1819, 354231, 81306, 261245, 552287, 128933, -64519, 215561, 355535, -78921, 133316, 57541, -128002, 336639]
16315D29906B01588p6805J13504L5765D3743K401h2602H5419L85903A57184r951
16304A47233n0142l1678f4932A63878a27088B10817N4319m6607L7651E3980J85910
16293B39890r8019e8372A24200D3818J71576J30991j61985L866R0434n7601J04379
16282C25478M0647L1709D465L2008c9814H9557J78261n5803o8471J20271H4752
16270A81500E0730a76117A30440a62895A45841J78220C5733J2167h2261C94473
16259h2469B9919J52075q9172R5411F188L16885G6208J32576c48670B25331J08057
16248C33388E8483a04118I2738L9452N1743O7459i1532B19969j08184o707P2677
16237A77755J2038k8784J30763k7340b01906R0869a5854D64942F410a28387B44338
$$ y = [429906, 201588, 124783, 238287, 274052, 43743, 46144, -82602, 85419, 471322, 157184, 147233, 97091, 65413, -64932, 163878, -127088, 210817, 265136, 218529, 256180, 53980, 239890, 141871, -58372, 124200, 43818, 215394, 346385, 184400, 188266, 278700, 221099, 325478, 366125, 397834, 4465, 36473, -39814, 89557, 267818, 212015, 143544, 263815, 84752, 181500, 50730, -176117, 130440, -162895, 145841, 324061, 35733, 47900, -82261, 394473, -82469, 29919, 181994, 92822, 188233, 6188, 323073, 76208, 208784, -348670, 225331, 333388, 58483, -104118, 92738, 132190, 183933, 251392, -91532, 219969, 111785, 105078, 177755, 189793, 161009, 291772, 264432, -201906, -111037, -15854, 464942, 6410, -128387, 244338]
16225B89684L641j14563k5770g9784E01340A52045P3039k6927a536B40600F31
16213A70966C5875K39617j25938D1086i480B71207g327A46549J89107E9955N4680
16202A14635J4258b619B83309J7951H8031a99512B14057o4703n101b77597A92051
16190H040L30763J23168a53633A68074l3791O3691R0640A7026a59099a6835D22880
16178B50938j8902a45027A15081Q7034a48804B74845J7392a0290I2800a2372m3563
16167e5935C80634f0969j11037A88395m2766C2620b43294i6515D9015j0201a14573
16155A40348J75305B6247a10888p0684A71791a28040A72958k9214C4861j5201
16145A9660P0926e1201o136A34313k4460c8042A49544l629F8688a85842A64936
$$ y = [289684, 293325, 178762, 152992, -79784, 501340, 152045, 225084, 198157, -1536, 240600, 631, 170966, 35875, 275492, 149554, 41086, -9480, 271207, -7327, 146549, 335656, 59955, 114635, 128893, -2619, 283309, 301260, 88031, -199512, 214057, 149354, 144253, -277597, 192051, 8040, 338803, 461971, -153633, 168074, 134283, 197974, 288614, 17026, -159099, -16835, 422880, 250938, 232036, -145027, 115081, 202115, -148804, 274845, 292237, -10290, 92800, -12372, -55935, 380634, -60969, -172006, 188395, 145629, 32620, -243294, -96515, 49015, 38814, -114573, 140348, 315653, 26247, -110888, -181572, 171791, -128040, 172958, 143744, 34861, 19660, 90586, -51201, -57337, 134313, 109853, -38042, 149544, 145915, 68688, -185842, 164936]
16133A0622K67201j09047k2819j6600K7437g3891q6367B32445h1236J1810o4356
16122a33782B46416a06784c5577j68157K6689G4957a92379m0627J12272N7863
16112f2871G539i7959D09907j40665b1317B44038K7322b57061B96555k2860b6517
16100E4119L9368K61164d7876B01054M339b41736d6800k21812C35559k3108j02244
16089B10207G3828a28929D34732i6991m5493L9746m7494O160K3899n252A65270
16077D7840J0011c7071A60946k8763a10340l3394j98385A60698r3F2823i2225
16065d5962H7649J25154D1506J31668L7754a04973B94439a14030M22j9121E208
16053a34726b79j16646m244N275K4228b1747j31458O2109J4614q5313b660r0683
$$ y = [10622, 277823, 168776, 145957, 129357, 156794, -73891, -160258, 232445, -81236, -69426, -133782, 246416, -106784, -35577, -203734, -177045, 74957, -192379, -233006, -120734, -62871, 7539, -97959, 409907, 269242, -21317, 244038, 271360, -257061, 296555, 273695, -26517, 54119, 93487, 354651, -47876, 201054, 205393, -241736, -46800, -268612, 335559, 312451, 210207, 73828, -128929, 434732, -96991, -142484, -102738, -150232, -144072, -120173, -125425, 165270, 47840, 57851, -37071, 160946, 132183, -110340, -143734, -342119, 160698, 160605, 62823, -92225, -45962, 87649, 212803, 41506, 173174, 210928, -104973, 294439, -114030, -113608, -132729, 5208, -134726, -279, -116925, -121169, -115894, -91666, -21747, -153205, -91096, -76482, -161795, -2660, -93343]
16041i3343a353m17237B12534A4506g3936A24176R2418G6688a44154F4955K08006
16030B72961a36283O7256m0475A34420c80153A88982k5400b5868H4593b94994
16019e4335F4899L23835g7144A09037g6938d71E4705i4627j7208k04393A03300
16007a72085G8774c14603B97116A00256i381J704H608c13623a01049L2521B87204
15995H8945Q0333b69118a11601k10933h9714j05177A57557D3531L7308a41109
15984A79123b48500A24178R6070F0775k4028J16113b13927h5523e716B8120a6429
15972G6248b320k10971j37518a28928d986B42619H1094c46030i8232l7269A09720
15960B05634a40092h516j39798O6428C2975a81735I5010c06801a09503G3697b11629
$$ y = [-93343, -1353, -418590, 212534, 14506, -73936, 124176, 216594, 76688, -144154, 64955, 272961, -136283, -69027, -109502, 134420, -380153, 188982, 163582, -25868, 84593, -294994, -54335, 64899, 388734, -77144, 109037, -76938, -471, 54705, -94627, -111835, -316228, 103300, -172085, 78774, -314603, 297116, 100256, -9381, -7677, 8608, -313623, -101049, -68528, 287204, 88945, 169278, -269118, -111601, -322534, -89714, -194891, 157557, 43531, 80839, -141109, 179123, -248500, 124178, 220248, 60775, 36747, 152860, -213927, -85523, -5716, 28120, -16429, 76248, -2320, -213291, -350809, -128928, -4986, 242619, 81094, -346030, -98232, -135501, 109720, 205634, -140092, -8516, -148314, -81886, 32975, -181735, 95010, -306801, -109503, 73697, -211629]
15948c3268m67k71597a29070B66103b52811a23937c8976E531R227a45709D4082
15936d9457k27362A67290b03339C24985g935B4163c893j33527m7617B36914b01711
15924a97105A13102a79544F6870K01837H4030D372M5904b16514G8417d51858D4138
15912a1086j93017c359B07683b21710M3720D3748a00636A76866o5481b55587R6912
15901a58675b3809B38484r7063D2718b66543a10034C47790j61075j6151D6597
15890d4158A67537B0677f3799K920P815A87983m0312m630n3419h1143G7423b78608
15877g8046r7520a8049A67268L6822e5699g449n9602n6494N2099k68768n7701
15866c97915J63885A36186n3014C4706c53084J2232Q9658N2717n5904B1414J38758
$$ y = [-33268, -33735, -305332, -129070, 266103, -252811, -123937, -38976, 5531, 14758, -145709, 44082, -49457, -276819, 167290, -203339, 324985, -7935, 24163, -3893, -137420, -185037, 236914, -201711, -197105, 113102, -179544, 66870, 268707, 84030, 4372, 50276, -216514, 78417, -451858, 44138, -11086, -204103, -3359, 207683, -221710, -177990, 43748, -100636, 176866, 111385, -255587, -158675, -23809, 238484, 141421, 42718, -266543, -110034, 347790, 186715, 170564, 46597, -44158, 167537, 20677, -63799, -60879, -53064, 187983, 147671, 143041, 89622, -81143, 77423, -278608, -78046, -175566, -18049, 167268, 204090, -55699, -7449, -67051, -123545, -71446, -340214, -397915, -234030, 136186, 83172, 34706, -353084, -340852, -251194, -198477, -254381, 21414, 160172]
15855A60172a92A82008b41223H5911a87445A50959a98362B44397Q5058o7649I7183
15843f4742j67365A64372D5775e2388A98289C5497a01134k98093A0194b62250
15832A72297F5886c27406a55385A02095M2960p2128a25297j4928n4607A15690
15821i6461D4831e2699l39547B43901c54923e174j32540F21P1036f5856B2570
15809a6083A7627g7837j65179f7078D68159b40366H5460a6758I568h7631L3630
15798e4001n9582D0430J25648A6260J69173K7034F7004J22670D1272d1811G3869
15786b44311g4422D1051b33466A52503l5604K45122d2228A86017b13536D2943
15775B11605c6386o32027a47838a4938A16157g3240A32045b77802H6464L0722
$$ y = [160172, -192, 182008, -241223, 85911, -187445, 150959, -198362, 244397, 329455, 261806, 97183, -64742, -232107, 164372, 45775, -52388, 198289, 35497, -101134, -399227, 10194, -262250, 172297, 65886, -327406, -155385, 102095, 145055, 72927, -125297, -140225, -194832, 115690, -96461, 44831, -52699, -392246, 243901, -354923, -5174, -137714, 621, 71657, -65856, 22570, -16083, 17627, -77837, -243016, -67078, 468159, -240366, 85460, -16758, 9568, -87631, -54001, -113583, 40430, 166078, 16260, 185433, 212467, 67004, 189674, 41272, -41811, 73869, -244311, -74422, 41051, -233466, 152503, 116899, 362021, -42228, 186017, -213536, 42943, 211605, -36386, -668413, -147838, -14938, 116157, -73240, 132045, -277802, 86464, 117186]
15765A17186e4001k1679o2570J4699B3927g7745J3464n6108k1211A48334J73589
15754C21923f9382E9899K31659a65688A73586k8113D9187f0953j83784a17118
15743C55396j24138a29334A4024g5414B15277A6923b57568J9503D9163f4281B62325
15731a9088l07796A17105a69368e6863C2388h7857E0999a484I9016P5482b01755
15719b97050F9991c63739b7033D45359h5108E011f6604j69136i5076A96253a42041
15707c32810a57993g400A06225a24996c1233k615A99558C4035d9838j00756j7894
15696a68488h086B7665K19518E3796K92824f7200e797A38449a03012K1634j26193
15685b07571d8255H350a12547j76678I7817i8238D11716b31993K8872p8357I6592
$$ y = [117186, -54001, -75680, -138250, -123551, 23927, -77745, -64281, -120389, -141600, 148334, 321923, -69382, 59899, 291558, -165688, 173586, 145473, 49187, -60953, -244737, -117118, 355396, 231258, -129334, 14024, -75414, 215277, 16923, -257568, -238065, 49163, -64281, 262325, -19088, -326884, 117105, -169368, -56863, 32388, -87857, 50999, -1484, 99016, 174498, -201755, -297050, 69991, -363739, -27033, 445359, -85108, 5011, -66604, -235740, -95076, 196253, -142041, -332810, -157993, -7400, 106225, -124996, -31233, -33848, 199558, 34035, -49838, -150594, -168488, -8086, 27665, 247183, 53796, 346620, -67200, -5797, 138449, -103012, -81378, -207571, -48255, 8350, -112547, -289225, 97817, -98238, 411716, -231993, -203121, -281478, 96592]
15673A13209d42147i1596A7841g5835A27257g6320A36211H604a96650i7513K0034
15662g7479L7060k04566i2786l39479a57016e5821b6254A73237n0941a32864J6133
15651a16731I2830h8909b5590r17o9363F7762a1347k69143b0968F4565R1336e8612
15638H2803f01867i0539F9190b95253c2612k2568k863p4789E1912M3349j1923
15627H3338c94829B21496b7021C24678m4911j08294l6666c32224L0427J04799
15617a96998C13551a64118k0482h9158E7566K7770A3952a46569B45980i0483G2694
15605g0252k00886a10801B27288f7749C48046a27529A28170g462j83186A38645
15594g4081k2906B3781K5588k3459J41763h6480A27344b03101h4236E0337L7672
$$ y = [113209, -442147, -91596, 17841, -75835, 127257, -76320, 136211, 8604, -196650, -97513, -77479, -40419, -244985, -92786, -432265, -157016, -55821, -26254, 173237, 122296, -132864, -116731, 92830, -88909, -25590, -26507, -95870, 67762, -11347, -280490, -20968, 64565, 155901, -58612, 82803, -601867, -90539, 69190, -295253, -32612, -55180, -58043, -132832, 51912, 95261, 83338, -394829, 221496, -27021, 324678, 279767, 171473, 134807, -332224, -301797, -196998, 313551, -164118, -184600, -89158, 57566, 85336, 13952, -146569, 245980, -90483, 72694, -70252, -271138, -110801, 227288, -67749, 348046, -127529, 128170, -7462, -190648, 138645, -74081, -96987, 23781, 49369, 25910, 167673, -86480, 127344, -203101, -84236, 50337, 88009]
15583H8009f6197n3067A95142p4396k6133f1700H1116c18154B40309H9680a36553
15571b08316P4651a3360A775a08911A08464i0878B97541a13387C4868a57678b0523
15559b08285P3980M0869A13329R1247g2184K0290b4041A28209a25419m8747k9156
15548b03322j04637c7521j69074L8477d3781A48271h6751G339J76473q5532A8210
15536C53602j67924J0374b52686c5870j09213H5010j100k8375a24618B32220A00279
15524a49234r1715H4693K91025f9967D1684a12493r4305j37515B1962L16371a70839
15512A79700f7709I3552a96887A23530g8128F9340c62534a60653e0496A82534
15501C0134N205R8866l2368b15318L387A42499B2055c28040B14990h537B61702
$$ y = [88009, -66197, -119264, 195142, 120746, 94613, -61700, 81116, -318154, 240309, 89680, -136553, -208316, -133665, -13360, 1775, -108911, 108464, -90878, 297541, -113387, 34868, -157678, -20523, -208285, -134305, -93436, 113329, 204576, -72184, -51894, -24041, 128209, -125419, -174166, -203322, -307959, -37521, -206595, -168118, -43781, 148271, -86751, 7339, 183812, 98280, 18210, 353602, 185678, 196052, -252686, -35870, -145083, 85010, 83910, 55535, -124618, 232220, 100279, -149234, -240949, 84693, 375718, -69967, 41684, -112493, -206798, -344313, 21962, 338333, -170839, 179700, -67709, 93552, -196887, 123530, -78128, 69340, -362534, -160653, -50496, 182534, 30134, 35339, 134205, 101837, -215318, -211931, 142499, 22055, -328040, 214990, -8537, 261702]
15489d6721j98617I6731b80017O081B13691f1605k9839k0093C12684A46954m5293
15478A01661b3946j57973M4040b2978H3504a0741A03243l4359B4715b5221j65672
15467a90893O6114a5399A29861a16292o1970B35202r1002a20315A66569n8116
15457A08453b0269r651l3815m6286K1c7357j90331I6461a2942o5018A01581e6512
15444H826J13854N570c6785r2228A69848c9419A60197p5879R7541f7798M193l9564
15432a03169k58878a16001P32j5834A24208k8652k4858a5451n3067C89115A57941
15420a80038k30167A2523g3782O322A06954c54568a73630C6458K27541c77463
15409b89567D7504a74681A39036A5934J96736a10667B85631h08A91926M1324a51008
$$ y = [-46721, -245338, 96731, -280017, -273936, 213691, -61605, -91444, -111537, 312684, 146954, 101661, -23946, -181919, -137879, -22978, 83504, -10741, 103243, 68884, 24715, -25221, -190893, -124779, -15399, 129861, -116292, -178262, 235202, 144200, -120315, 166569, 108453, -20269, -29920, -63735, -110021, -110000, -37357, -227688, 96461, -12942, -77960, 101581, -56512, 8826, 122680, 128250, -36785, -129013, 169848, -39419, 160197, 84318, 181859, -67798, -63605, -103169, -362047, -116001, -115269, -131103, 124208, 95556, 70698, -15451, -68518, 389115, 157941, -180038, -410205, 12523, -73782, -67460, 106954, -354568, -173630, 36458, 263999, -377463, -289567, 47504, -174681, 139036, 15934, 212670, -110667, 285631, -808, 191926, 233250, -151008]
15397e678m4395k00755c4012B23461h7729r0678A12618c6047A32375b93128a37551
15385A032K12885c68532a23079B58091I5615b32459d9438j13973d0429k880D2472
15373a12285M5316A0267d0904G0999a7985j850E0766O7882R127a4487j94692l51469
15361e60648a94366C50794j16683G4887e3041K4323j7427C66612I5513a05003
15350A90518q3366J23567G8386a36310A68467b43728a8934H1526b96613i8616
15339B11787a8822H2933R5189f892m08830L2573C88b88185G8199Q4729c7032G2980
15326b02823E5380i218B31085d67782B90821j25262K3668G8033i4013n6515q2954
15315b33482L1952C071J23269B0063R2543A5517K2717J96008c05407J14962A7322
$$ y = [-5678, -50073, -250828, -34012, 223461, -87729, -178407, 112618, -36047, 132375, -293128, -137551, 1032, 213917, -368532, -123079, 258091, 95615, -232459, -49438, -163411, -40429, -43309, 42472, -112285, -66969, 10267, -40904, 70999, -17985, -19835, 50766, 118648, 127775, -14487, -209179, -560648, -194366, 350794, 234111, 74887, -53041, -28718, -46145, 366612, 95513, -105003, 190518, 107152, 230719, 78386, -136310, 168467, -243728, -18934, 81526, -296613, -98616, 211787, -18822, 82933, 178122, -6892, -415722, -383149, 388, -288185, 78199, 162928, -37032, 72980, -202823, 55380, -9218, 231085, -467782, 290821, 165559, 189227, 78033, -94013, -150528, -233482, -201530, 3071, 126340, 20063, 112606, 15517, 38234, 234242, -305407, -190445, 17322]
15303C62949i7263A06232r049J35148C4676K2480P3694M6838g0167C00964b96543
15291i8275C50766d050j7301G0873c17108F3740P9877c1698E5844O236b37758
15279E8031M0814J6704N2638E2212i2525L3437B88773A36i7643k0814A26172j3162
15267A13010a97722A0606L74521a09747g434A32099h4116B14215J81063j88302
15257B06976D0398L5303K31984p0281f3107F2871L41833K61818J64235N41876
15247A372633l04202K09664p8647H8957K7783J66517i8341A9495L40889a96311
15236b44B90736G8720N2978M8501b15496A8948b30202I3887Q1568a046l05520
15225c06566Q8957A71950N7502r3236a5394A22807Q692f1297q0076A20245a40733
$$ y = [362949, -97263, 106232, 97183, 232331, 34676, 57156, 130850, 177688, -70167, 300964, -296543, -98275, 350766, -4050, -21351, 70873, -317108, 63740, 143617, -31698, 55844, 62080, -237758, 58031, 98845, 115549, 168187, 52212, -92525, -59088, 288773, 136, -97643, -118457, 126172, 113010, -197722, 10606, 385127, -109747, -7434, 132099, -84116, 214215, 395278, 206976, 40398, 75701, 307685, 237404, -63107, 62871, 404704, 666522, 830757, 1372633, 1068431, 1278095, 1199448, 88957, 116740, 283257, -98341, 19495, 360384, -196311, -244, 290736, 78720, 131698, 180199, -215496, 18948, -230202, 93887, 175455, -1046, -306566, -217609, 171950, 229452, 136216, -15394, 122807, 131499, -61297, -141373, 120245, -140733]
15213A73918b6572A1375M80g4452q8694A10534f4363A26061k0086a37229N8712
15202g8517J6546C9038A2264R9825f9366D31J49532L0300a5882A30985e2771D8528
15189E2727L6964L7684N897o641a00741C66394a12011F8424K0620a97743c1665
15177D2751F576b33814B24110L42385B6414J62203j8401M7908a60659H7144P8463
15166A65607N8150a57135A45349a10844e4641k53534C81751A38920b05611N5189
15156a50422e3450A44036A2299J11894g9394K1187m6896B98621o4833a82694C26038
15144C7945H707J19621l2590d5695C07393O8630j47423c0356j38537A75885n9988
15133A15897K4722b85424B74981H8412J18611d9105A33790J40809q2763e4930
$$ y = [173918, -26572, 11375, 11855, -74452, -163146, 110534, -64363, 126061, 105975, -137229, -78517, -61971, 39038, 12264, 112089, -69366, 431, 149963, 180263, -15882, 130985, -52771, 48528, 52727, 89691, 127375, 133272, 126631, -100741, 366394, -112011, 68424, 89044, -197743, -31665, 42751, 6576, -233814, 224110, 566495, 26414, 188617, 170216, 218124, -160659, 87144, 165607, 223757, -157135, 145349, -110844, -54641, -308175, 381751, 138920, -205611, -150422, -53450, 144036, 12299, 124193, -79394, -58207, -105103, 298621, 233788, -182694, 326038, 37945, 8707, 128328, 95738, -45695, 307393, 376023, 228600, -30356, -168893, 175885, 115897, 140619, -285424, 274981, 88412, 207023, -49105, 133790, 274599, 191836, -54930]
15122A38796J21335b55486A27332m3082M6063K86202j69736m7625M2797A13426
15111d7484A6906K23957j18651l7521P2372Q2634e9800C44199A57026d3104A75337
15099A29845J29251I7049c7490C73747c16111C48317b1045A19792O7500c9569
15088A68445b55368J22874J8610D50367a10900A68444R0637j17356L01280A01670
15077b7021A37817O0567j2758K34934A68100a97108d5917B21610J68352A41551
15066A28414M5839M1595g1656H3173K47780l9479F6824p043L02471j74823b12460
15054e3266A20137J86603N7353j41023p0675F2405K5911K43865n3879B5086c6100
15042B50920k5749I4220K44972M1551G2223h2130D26002a47451B66178b43846
$$ y = [138796, 260131, -255486, 127332, 84250, 130313, 416515, 246779, 199154, 241951, 113426, -47484, 16906, 240863, 122212, 84691, 157063, 239697, -59800, 344199, 157026, -43104, 175337, 129845, 259096, 97049, -37490, 373747, -316111, 348317, -21045, 119792, 187292, -39569, 168445, -255368, -132494, -113884, 450367, -110900, 168444, 259081, 141725, 443005, 101670, -27021, 137817, 198384, 185626, 420560, 168100, -197108, -45917, 221610, 389962, 141551, 128414, 174253, 215848, -71656, 83173, 330953, 291474, 66824, 59781, 362252, 187429, -212460, -53266, 120137, 306740, 364093, 223070, 152395, 62405, 88316, 332181, 278302, 25086, -36100, 250920, 225171, 94220, 339192, 380743, 72223, -82130, 426002, -147451, 266178, -243846]
15031f6170l2087A01263J94970L4951D3641A8657K75121A10760K82966A32098
15020C24443I7914m6065M17462B2138a66290A32404C5029L67519A23707P3486
15010A97193r1815j0184J54097n1578L81128B06381G1819J6335K05834A37891
14999F9993J69169K76760a56319b6480B50412G2567M20125l326A92793J31983
14989C24776q1231N6428N6739G8435J63542P9073j2290d085A47666Q5750e675
14977B52080J30295L77C7178J65690F6924K95056A7190K41943M2980A22128O2717
14966A84845J12529j9428a04455r3441A03637C5144L28865j7059g9234A81081
14955C25135d1783q1036G8061J62070G40K51769A8553K90576M1098A24624K42175
$$ y = [-66170, -98257, 101263, 296233, 331184, 43641, 18657, 293778, 110760, 393726, 132098, 324443, 97914, 51849, 469311, 22138, -166290, 132404, 35029, 402548, 123707, 197193, 105378, 95194, 249291, 197713, 578841, 206381, 71819, 88154, 293988, 137891, 69993, 239162, 515922, -156319, -26480, 250412, 72567, 492692, 489366, 192793, 324776, 243545, 299973, 356712, 78435, 241977, 321050, 308760, -4085, 147666, 233416, -5675, 252080, 382375, 382752, 37178, 202868, 66924, 361980, 17190, 259133, 302113, 122128, 184845, 297374, 277946, -104455, -197896, 103637, 35144, 364009, 346950, -79234, 181081, 325135, -41783, -122819, 78061, 240131, 740, 252509, 18553, 309129, 350227, 124624, 366799]
14944C66799A30451j8320m9412J01501K02159G5323M8737A5512K77478L8032G1861
14932B85752E5921A6582L00158Q9401j06273p9460J51750j26140J24570D9175
14921B53938a0802D07700p1921J73133j39051r7556D9365K73398A35255O6138
14911B01393J2453n174l5304q1658J35105m2037K45152j92525r838j1623P8919
14900B94863N4428E5245L56000J50618j69695m2394G7022M07372g8548F34796
14889E40862r9870A60206J75601l5586m051A37537L51618j96959J31322q7015
14879C36503A66567L24694e0934D30337K16198k39216r5872J55321k02924m4990
14869B18854p4647k7371N56070C15782N7435J97252c0276A50715J90177Q6476
$$ y = [366799, 130451, 112131, 62719, 164220, 366379, 75323, 124060, 15512, 292990, 331022, 71861, 285752, 55921, 16582, 316740, 406141, 299868, 220408, 372158, 246018, 370588, 49175, 253938, -10802, 407700, 335779, 508912, 369861, 272305, 49365, 322763, 135255, 201393, 213846, 208672, 173368, 91710, 226815, 184778, 429930, 237405, 227567, 215944, 294863, 349291, 55245, 411245, 561863, 392168, 349774, 77022, 484394, -78548, 634796, 540862, 440992, 160206, 335807, 300221, 296170, 137537, 489155, 292196, 423518, 336503, 166567, 491261, -50934, 430337, 646535, 407319, 311447, 466768, 263844, 218854, 144207, 116836, 672906, 315782, 373217, 570469, -30276, 150715, 340892, 427368]
14859D27368j96210J91350o3627j45457Q1563k4479E8408K53094J10987m0056
14849C82433o0100J8146j46761J40751M4323p8624J48030j32761r2419P1269J99160
14838D93447k34488R0262N3565j78635F4093M61233N6861k54776m4184K90011
14828E73238K9037j98860A26719J91956N6637j64256L46543k74894J92157k06794
14818B68068K25471p363q7453M52852p6829C86091J05856J21597B02641O5305
14808B67946K98932k45957K10491B47140J85010l2530j71227K02103L39686C67310
14797D50610J37384j14623L4778J89144K05371D39669L2245R5489k1695J57013
14787G02721k39369m671l7755k7228K99811B07422K47587J04596k36302l8689
$$ y = [427368, 231158, 422508, 358881, 213424, 294987, 270508, 58408, 311502, 422489, 382433, 322333, 340479, 193718, 334469, 378792, 300168, 448198, 315437, 223018, 294287, 493447, 258959, 349221, 402786, 224151, 64093, 525326, 582187, 327411, 283227, 573238, 602275, 403415, 126719, 318675, 375312, 211056, 557599, 282705, 474862, 268068, 493539, 486176, 398723, 851575, 774746, 386091, 491947, 613544, 202641, 267946, 566878, 320921, 531412, 247140, 432150, 399620, 228393, 430496, 770182, 367310, 450610, 587994, 473371, 508149, 697293, 902664, 439669, 471914, 567403, 545708, 702721, 463352, 458681, 420926, 393698, 693509, 207422, 455009, 559605, 323303, 284614]
14777B84614K04100j47245J95799q8364K69809C30680R6106J30241j39430C1058
14766F43519p9537l0321K06568k46549J05420k24978J58484r7545j78202L94574
14756F51433j46331J7414j08436M87109k77804k73496J88115K9157j73290L47265
14746G41136j43975K72031k67999j28681J4837m3813M79386l40535J62351j67771
14736E76967O8834j57374R5016J02547j63806L93862l10916K80479k89024J15842
14726G12427J14045k13016o299j70660M05800j24562k68031M43084j67749m4953
14716F80086R0538Q31M3478q680Q600k71088K03126k41360K05243J37316m6653
14705H01437K86568l19429j09603q0641N67794l80967j34116J1583K30688p1722
$$ y = [284614, 488714, 341469, 537268, 448904, 718713, 330680, 426786, 557027, 417597, 31058, 643519, 563982, 533661, 740229, 493680, 599100, 374122, 532606, 435061, 256859, 651433, 505102, 522516, 414080, 901189, 623385, 349889, 538004, 567161, 393871, 741136, 597161, 869192, 601193, 472512, 487349, 443536, 922922, 582387, 744738, 576967, 645801, 488427, 583443, 685990, 522184, 916046, 605130, 885609, 596585, 712427, 826472, 613456, 607157, 436497, 842297, 717735, 449704, 892788, 725039, 680086, 770624, 771455, 814933, 806253, 814853, 543765, 746891, 505531, 710774, 848090, 801437, 1088005, 768576, 658973, 578332, 1146126, 765159, 631043, 642626, 873314, 801592]
14695H01592J34487m21531N57160k87666N2641m3325o9990L3631J8280J85344
14685I60623k2631M7550J01069k00296K12693q917k89876O9177P5481l32662j86932
14674D25279L60871J50796J38887l52785N9690m5376Q1315J17841j27943j78900
14664F29675K46550j73330J3484Q3766R5895J61309L07607j65998k38561L5880
14654I96277N8693k17381K67902j33396O5223k26373J82301R8551N3945L7167
14644A182909k09186k07845M03075j33034R3296K0034k76772K22493K86564m99801
14634H81733J94314l62565O34124J17229k10078k80095L80484j232j03247j7706
14624A232961k6711k37607M6250K62259q7092l13712L84642K59522m83921J9787
$$ y = [801592, 936079, 514548, 1071708, 784042, 836683, 793358, 723368, 756999, 775279, 960623, 937992, 985542, 1086611, 886315, 1099008, 1090091, 800215, 869392, 944873, 612211, 425279, 786150, 936946, 1075833, 723048, 782738, 737362, 818677, 936518, 808575, 629675, 876225, 702895, 716379, 800145, 896040, 1057349, 1364956, 1198958, 960397, 996277, 1054970, 837589, 1105491, 972095, 1037318, 810945, 993246, 1091797, 1145742, 1182909, 973723, 765878, 1168953, 1035919, 1129215, 1149249, 872477, 1094970, 1381534, 881733, 1076047, 713482, 1347606, 1464835, 1254757, 974662, 1355146, 1353914, 1250667, 1232961, 1206250, 968643, 1014893, 1277152, 1190060, 876348, 1260990, 1520512, 1036591, 1056378]
14614A056378J92552K78124k54800r5415j1071J40755j24960J64044n4865m7414
14604A243328R3259P4776P4849J09750J08970m66848K67929J24230K3321j77034
14594A476530r5615J76868r1079K13240J2905K5114j23819J78691l12859N5883
14584A515859J71731M2170K12431k0122L7352k92205J24301l82376N03149m8898
14574A863392l23572R7188K79686n4551K96412l97044L20944l97425K84644K30392
14564B200066j8376J92613n5550j72130M24264k12847R8469L44967j84088L58145
14554B975533K14826o6361L54444M06973J187553J685032L390738Q933080J7001109
14545C6082927J0068091B2358990H494273C995742j195610m72965m33823J90979
$$ y = [1056378, 1248930, 1527054, 1272254, 1176839, 1165768, 1306523, 1181563, 1345607, 1290742, 1243328, 1336587, 1411363, 1486212, 1595962, 1704932, 1238084, 1506013, 1630243, 1653564, 1476530, 1380915, 1557783, 1466704, 1679944, 1692849, 1717963, 1594144, 1772835, 1459976, 1515859, 1687590, 1729760, 1942191, 1922069, 1959421, 1667216, 1791517, 1409141, 1912290, 1863392, 1539820, 1637008, 1916694, 1862143, 2158555, 1761511, 2082455, 1685030, 1969674, 2200066, 2181690, 2374303, 2318753, 2146623, 2570887, 2358040, 2456509, 2801476, 2617388, 2975533, 3190359, 3123998, 3478442, 3885415, 5072968, 6758000, 10148738, 19081818, 36082927, 46151018, 22358990, 8494273, 3995742, 2800132, 2327167, 1893344, 2084323]
14537B084323k48740n2533m0900j22477J49582O60399q76549N24569n5906j86876
14527A834892K56527P9333k68979j38123L91157m7853j76001J44681J16317L36326
14517B528277J9118m82466M32128O7090j79656l8207J91535J2825j15124J51262
14507B586782J7150k86913M02485J998k16316K97479j0709j85255L10604l8454
14497B878851k27332l01900O53378j83859M01764k90380J26675J3444P4346L62406
14487C507393l93214L20113r550k55984N07690k0035j96893R6754L312L3801K2
14476C593409n536M64293m76156J79543N8476K39387l99188L04889K52479J46850
14466D358446k72902J85657j91617K01239k26889L47588J51422m64290J28868
$$ y = [2084323, 1835583, 1783050, 1742150, 1619673, 1769255, 2429654, 1553105, 2077674, 2021768, 1834892, 2091419, 2170752, 1901773, 1763650, 2154807, 2106954, 1930953, 2075634, 2191951, 2528277, 2547395, 2064929, 2497057, 2564147, 2384491, 2346284, 2537819, 2550644, 2435520, 2586782, 2603932, 2317019, 2719504, 2721502, 2505186, 2802665, 2791956, 2606701, 2917305, 2878851, 2651519, 2349619, 3002997, 2819138, 3220902, 2930522, 3057197, 3070641, 3144987, 3507393, 3114179, 3434292, 3424742, 3168758, 3676448, 3656413, 3459520, 3556274, 3559586, 3593387, 3593409, 3587873, 4052166, 3576010, 3755553, 3814029, 4053416, 3654228, 3959117, 4211596, 4358446, 4085544, 4271201, 4079584, 4280823, 4053934, 4401522, 4552944, 4088654, 4217522]
14457D217522J21063J73808k21051L56226l3649L38966l9727m5883J70218L9728
14447E077221K37176j637N6649J4182k60347o841N65894l30128J25986J14339
14437E592494J27208j29651J08620J0497J33523O07259k37525k66734K29143K69541
14427F444375N3009J12117l88273K84009L96977k82652J26745L93436J40377R9625
14417G379745p0518o0042P32793l57533K11842r2926M43037l54489M44418M3681
14407H320008k18357J98023N39774k31455M16374p8845L38194R8288K58668J21227
14397I761899R708Q3559K99487L65869k8237J84157L82646J87574l1573N33871
14387A1748960k71372K35357L50289J21027J39462Q75045k55860P0526J57345
$$ y = [4217522, 4338585, 4512393, 4291342, 4647568, 4613919, 4952885, 4913158, 4867275, 5037493, 5077221, 5314397, 5312760, 5369409, 5383591, 5123244, 5116403, 5682297, 5352169, 5478155, 5592494, 5719702, 5590051, 5698671, 5709168, 5842691, 6449950, 6212425, 5945691, 6174834, 6444375, 6497384, 6609501, 6221228, 6505237, 6902214, 6619562, 6746307, 7139743, 7280120, 7379745, 7309227, 7249185, 7981978, 7624445, 7836287, 7743361, 8186398, 7831909, 8276327, 8320008, 8101651, 8299674, 8839448, 8607993, 9024367, 8945522, 9283716, 9382004, 9640672, 9761899, 9771607, 9855166, 10154653, 10520522, 10492285, 10676442, 11059088, 11246662, 11215089, 11748960, 11477588, 11712945, 12063234, 12184261, 12323723, 13198768, 12942908, 13013434, 13170779]
14378A3170779K68448O77079K59936j48814L82175N14528M9144K42609N52133
14369A5968017M98673K58063M4583L60610M26697K30002M46651L63949O70128
14360A9267373J40292O21869N97590J29515O70609L02865M64415N93177O96639
14351B3484344M98568L88819P84062P85771K95254Q37476Q77958O43508P72123
14342B9367883R28858Q57297N48158O99122J255265J007066N94574J039154R25609
14333C7222986J477441J141101J463767Q91385J471748J482301J472543J169584
14325D7792856J730865J585528J728719J618059J851073K445532J765647K596172
14317F3114451K215474K711516K723869K153079L302998L038049L199048L245476
$$ y = [13170779, 13439227, 14116306, 14376242, 14227428, 14609603, 15124131, 15173275, 15415884, 15968017, 16466690, 16724753, 16769336, 17129946, 17556643, 17786645, 18233296, 18597245, 19267373, 19407665, 20029534, 20627124, 20756639, 21427248, 21730113, 22194528, 22787705, 23484344, 23982912, 24371731, 25155793, 25941564, 26236818, 27074294, 27952252, 28595760, 29367883, 30296741, 31154038, 31702196, 32401318, 33656583, 34663649, 35258223, 36297377, 37222986, 38700427, 39841528, 41305295, 42196680, 43668428, 45150729, 46623272, 47792856, 49523721, 51109249, 52837968, 54456027, 56307100, 58752632, 60518279, 63114451, 65329925, 68041441, 70765310, 72918389, 76221387, 79259436, 82458484, 85703960]
14309H5703960L880095L474744L979551M491867M545334N267749M810129N734710
14301A21888139N605772N760471O796678O933543P421521P890962Q192165R417232
14293A79906483R100185J0197577J0791099J1226323J1941482J2424210J3181466
14286B58768825J3994045J4432581J4785439J5306420J5749925J5707554J5645012
14279C64389801J5536651J5237485J4663240J3286835J2057667R929395P214183
14272D52315257K985267K94186p98624P70771j356707k960440o705782r495447
14264D35048481j0721854j2650458j3847446j4894341j5612960j6035203j6133162
14257C35153057j5984289j5663300j4222560j4731182j3774467j3651119j2824243
$$ y = [85703960, 89584055, 93058799, 97038350, 101530217, 106075551, 111343300, 116153429, 121888139, 127493911, 133254382, 140051060, 146984603, 154406124, 162297086, 170489251, 179906483, 189006668, 199204245, 209995344, 221221667, 233163149, 245587359, 258768825, 272762870, 287195451, 301980890, 317287310, 333037235, 348744789, 364389801, 379926452, 395163937, 409827177, 423114012, 435171679, 445101074, 452315257, 455300524, 455594710, 454796086, 455566857, 454210150, 451249710, 444543928, 435048481, 424326627, 411676169, 397828723, 382934382, 367321422, 351286219, 335153057, 319168768, 303505468, 289282908, 274551726, 260777259, 247126140, 234301897]
14250B34301897j2164856j1328220j0691009j0094580r884192r261391p329280
14243A63548369q395151p775090p179847o586226o066195n525699n303673n520556
14235A11195932m934899m667911m273377m099145l294534l860172l579956l174023
14227G9311915l465066k632642k761559k661521k341166k660925k030203j890265
14219E8868568k127587j881502k070115j403114j785056j621323j072984j703182
14211D5203705j499056j222806j543239q97529p01584j010873j367755j155322
14203C5805541j236402m35693j169163n54134j201634o75757r84694p96838o08773
14194B8142453o20520o67118o06914o64157r51445o36575n26749k36437o08468
$$ y = [234301897, 222137041, 210808821, 200117812, 190023232, 180139040, 170877649, 163548369, 155153218, 147378128, 140198281, 133612055, 127545860, 122020161, 116716488, 111195932, 106261033, 101593122, 97319745, 93220600, 89926066, 86065894, 82485938, 79311915, 75846849, 73214207, 70452648, 67791127, 65449961, 62789036, 60758833, 58868568, 56740981, 54859479, 52789364, 51386250, 49601194, 47979871, 46906887, 45203705, 43704649, 42481843, 40938604, 40041075, 39339491, 38328618, 36960863, 35805541, 34569139, 34133446, 32964283, 32410149, 31208515, 30532758, 29548064, 28751226, 28142453, 27521933, 26854815, 26247901, 25583744, 24632299, 23995724, 23468975, 23232538, 22624070]
14185B2624070n93851l85843l67261r61877l26922j77596l70636l68515o44556
14176A8427013k24760n06192k84641l65178o1398r34270K55590l94998p36548
14167A5174618k15356j86517l66308K13983o19844o7841m83843R1362k15962l89351
14157A2934941m13230j35089j99809j62085R5492m89747j4074p00616n5466l6700
14147A0823617q9928k03961Q1990j82692l29848j55830O161l71324j34575k65966
14137I177644P0706k47022N4138q0471j57240k07349k41572J32431j14067l36684
14127H050514k58536K8349J28859k05982l7791l04708J50963k04764k22148l46147
14117F778609j27860J98554l75932j06018k09345J05078J36699k31226m2834N5800
$$ y = [22624070, 22030219, 21644376, 21277115, 20315238, 19988316, 19810720, 19440084, 19071569, 18427013, 18202253, 17696061, 17411420, 17046242, 16984844, 16050574, 16306164, 15911166, 15174618, 14959262, 14772745, 14406437, 14620420, 14000576, 13932735, 13448892, 13540254, 13324292, 12934941, 12521711, 12386622, 12186813, 12024728, 12120220, 11630473, 11616399, 10915783, 10860317, 10823617, 10733689, 10529728, 10611718, 10429026, 10099178, 9943348, 9949509, 9578185, 9443610, 9177644, 9248350, 9001328, 9055466, 8974995, 8817755, 8610406, 8368834, 8501265, 8387198, 8050514, 7791978, 7820327, 7949186, 7743204, 7705413, 7400705, 7551668, 7346904, 7124756, 6778609, 6650749, 6849303, 6473371, 6367353, 6158008, 6263086, 6399785, 6168559, 6125725, 6181525]
14107F181525k02809k46314J00201j65417J16151l5518k37041M0857n765k0054
14097E525816k46311P0593j84162J82197l46435l2873k47829r7713J80966q2951
14087D721298n563j76227l8314Q1912J09557l2411r9912j44403l38601R5304K39312
14076D411952k0822m11691L96254N7987l55135k21455j63572j50177L11770j78781
14066C676330K17761o05140L0775K43368J89786q6923j27737N65766k67369m15119
14056C421498j55673K75120o4690l31004k68492M08676q4850o5156L46258j29613
14046C352074j79219J43997m83482k69414K90809Q1281o2049L90263k08310k86265
14036B769685j29739J21704K03280J7952l5265K7093L348j87633p7661k4893M9448
$$ y = [6181525, 5978716, 5732402, 5832603, 5667186, 5783337, 5747819, 5510778, 5551635, 5545870, 5525816, 5279505, 5350098, 5165936, 5348133, 5001698, 4968825, 4720996, 4623283, 4804249, 4721298, 4715735, 4539508, 4501194, 4583106, 4692663, 4660252, 4560340, 4415937, 4077336, 4172640, 4411952, 4391130, 3979439, 4375693, 4433680, 4078545, 3857090, 3693518, 3543341, 3855111, 3676330, 3894091, 3288951, 3319726, 3563094, 3752880, 3665957, 3538220, 4103986, 3836617, 3421498, 3265825, 3540945, 3476255, 3145251, 2876759, 3285435, 3200585, 3135429, 3481687, 3352074, 3172855, 3316852, 2833370, 2563956, 2854765, 2936046, 2873997, 3264260, 3055950, 2769685, 2639946, 2761650, 2964930, 2982882, 2947617, 2974710, 2978058, 2790425, 2712764, 2687871, 2737319]
14025B737319j22369l20887P3676J97844Q2532k03509j71093J7710L303L09311
14015B603837j87350P9965l48680K41197l48062J63707l44306L78541l78966K10322
14005B070205P7885l63172K21532p1022R6839k4229j40131j681j21696R7328J46020
13994A987878k17198J21476j70111J89607J61176J245780K360770P310812J6282965
13985B9273155J6647531j9818108A2471434m625242k126949j539196j32584q38408
13977C209055j61976j66617k87532l75560L21046J0084j25107j43722K56021j74575
13967B361117m9280j22770Q8362n26862K04241Q875r6905m9337O4740R3138o763
13956A968556p7976J73958p4899l34172L25368l35345r3365J14978L78168o36246
$$ y = [2737319, 2614950, 2294063, 2367739, 2565583, 2648115, 2444606, 2273513, 2291223, 2294526, 2603837, 2416487, 2496452, 2147772, 2388969, 2040907, 2204614, 1860308, 2238849, 1859883, 2070205, 2148090, 1784918, 2006450, 1935428, 2032267, 2008038, 1867907, 1866226, 1744530, 1841858, 1987878, 1770680, 1892156, 1722045, 1911652, 2072828, 3318608, 5679378, 12990190, 29273155, 45920686, 26102578, 12471434, 7846192, 5719243, 4180047, 4047463, 3209055, 3047079, 2880462, 2592930, 2217370, 2538416, 2548500, 2423393, 2279671, 2535692, 2361117, 2311837, 2189067, 2277429, 1750567, 1954808, 1963683, 1866778, 1817441, 1882181, 1975319, 1968556, 1890580, 2064538, 1989639, 1655467, 1980835, 1645490, 1552125, 1667103, 2045271, 1409025]
13946A409025K56310l08112N18485O3704p8184j38029j13931J67670j25334l25549
13936A326055K28599J30214j9827K9774n83072K76976J64048p9137j82976J28834
13926A419488k55031K60318K8819L4252L08328m00766L5295L1498j69787O4047
13916A356461k1992k2906N66511m90206J21317o9501j09067Q2988l28325K53810
13906A339090L122k82101Q4470p4826Q9416l5282K36611j72517j94844N36122
13896A529261k92117l902o0538j10190K47984j33484j90241J84722R100J19479
13886A300074k32909J52843j67679k19872K15700J54448o6443O0435k38532K77623
13876A235688k93523J79314q0702J66901k76311J34786p4346J34171k05821p4057
$$ y = [1409025, 1665335, 1357223, 1875708, 1939412, 1861228, 1723199, 1609268, 1776938, 1651604, 1326055, 1554654, 1684868, 1665041, 1694815, 1111743, 1388719, 1552767, 1473630, 1290654, 1419488, 1164457, 1424775, 1453594, 1487846, 1796174, 1395408, 1430703, 1462201, 1292414, 1356461, 1334469, 1311563, 1878074, 1387868, 1509185, 1439684, 1330617, 1413605, 1085280, 1339090, 1342212, 1060111, 1144581, 1069755, 1159171, 1123889, 1360500, 1187983, 993139, 1529261, 1237144, 1233242, 1172704, 1062514, 1310498, 1177014, 986773, 1171495, 1180595, 1300074, 1067165, 1220008, 1052329, 832457, 1048157, 1202605, 1136162, 1196597, 958065, 1235688, 942165, 1121479, 1040777, 1207678, 931367, 1066153, 991807, 1125978, 920157, 846100]
13866H46100l676N00934n15571J96294J56796K9046j81438j67719j14316M36726
13856A183176o6259j65946K0543P5410P727j24428k94154M33996J45269l56848
13846H58486K8917J17896j60289k47809K85397J30434k434L3383k13703J13595
13836I43873m327q4958k02425K00546o8313L17097E36504K61347K96294m13134
13826F81011j5303J077M9562J90322p0840n800J02356j93385j15745O8508L17439
13815A009202n6873l02734K98463M9225l93327K71217j17458j38103K2687L11102
13805I53401l42767n5356K08591O8381k12724L02366l75732J60457K26121k56716
13795F76022K40178j64249j83996J12475m6136J11850j71049J4393K42277k61463
$$ y = [846100, 842424, 1343358, 827787, 1024081, 1180877, 1209923, 1028485, 860766, 746450, 1183176, 1116917, 950971, 971514, 1046924, 1054651, 930223, 636069, 1070065, 1215334, 858486, 887403, 1005299, 845010, 597201, 882598, 1013032, 1010598, 1043981, 830278, 943873, 939546, 854588, 652163, 852709, 784396, 1101493, 536504, 797851, 1094145, 681011, 665708, 666785, 716347, 906669, 835829, 830029, 932385, 739000, 623255, 691763, 1009202, 952329, 649595, 948058, 997283, 603956, 875173, 757715, 619612, 642299, 953401, 610634, 555278, 763869, 832250, 619526, 921892, 546160, 706617, 932738, 676022, 916200, 751951, 567955, 680430, 634294, 746144, 575095, 589488, 831765, 570302]
13785E70302L88950l88212J0149k0790j85129L92974j86478l4475O8419J02381
13775G18091L39375k80607k17450o8095K77445l8373j92913Q3859J65739k64020
13765E23051j56170M11308k97730J01889Q4253j65445R9282K99347k91841q0453
13755E27491j47928j62764L36385Q2819j98425K01060J20746J36708k72543j89495
13745D34054Q1497j58592M82318m02391J54428j24210M47991C52117L9412J61178
13735E52707J3389K85669l12767j44343p5633O9137P6385P7099J41964r3616J8987
13724F08978J11757k93947M8138J60150A77153K93682K1660j52156K85586j88326
13714D37599J14447j09778j08373P3093L4244R2125J18474k52785l0757l6068
$$ y = [570302, 959252, 571040, 581189, 560399, 375270, 768244, 581766, 547291, 615710, 718091, 1057466, 776859, 559409, 491314, 768759, 730386, 537473, 621332, 787071, 523051, 366881, 778189, 480459, 582348, 666601, 501156, 600438, 899785, 607944, 527491, 379563, 216799, 553184, 636003, 437578, 638638, 759384, 896092, 623549, 434054, 515551, 356959, 839277, 436886, 591314, 467104, 915095, 352117, 391529, 552707, 566096, 851765, 538998, 394655, 319022, 388159, 464544, 541643, 683607, 589991, 608978, 720735, 426788, 474926, 635076, 177153, 470835, 492495, 340339, 625925, 437599, 552046, 442268, 333895, 406988, 441232, 533357, 651831, 399046, 368289, 332221]
13704C32221j63938N8073K85414J8363j68471J42003k03917L05310k72983m3295
13694B88780P9286L1888A51991N69196j69920q9431J36060k25336K39098k49311
13684C62347K18844A89648K62114P6911K31741C12008J17613A60061a4857C49638
13673G57861j45211J81225k5337l39602k06706L90674j28468j9696J89891k86579
13663C68052E9095O54519j24548k11766J81202o5133j10535j87451L22518A88634
13652E45521j58273n3231J44170j06294L39789C00637o7733J60490r1114L30275
13642F32555k23478j10359K12869m4570R1975j75000J73548k17506L50075l23126
13632C66983L4239k8479O4722J24655j61056o3608L7936L46124l56816A67396
$$ y = [332221, 168283, 226356, 511770, 530133, 361662, 503665, 299748, 605058, 332075, 288780, 368066, 399954, 151991, 721187, 551267, 461836, 597896, 372560, 611658, 362347, 581191, 189648, 451762, 528673, 760414, 312008, 429621, 160061, -14857, 349638, 757861, 612650, 793875, 768538, 428936, 222230, 612904, 484436, 464740, 654631, 368052, 59095, 713614, 589066, 377300, 558502, 493369, 382834, 195383, 517901, 188634, 545521, 387248, 334017, 478187, 371893, 711682, 300637, 232904, 393394, 302280, 632555, 409077, 298718, 511587, 467017, 558992, 383992, 557540, 340034, 690109, 366983, 401222, 372743, 437465, 562120, 401064, 337456, 375392, 721516, 364700, 167396]
13621F80698A78787K66848K36471l37056m4829J63843M4904j63845I9318J70924
13611B70242J6120c2217D34210j68912O3173p2218J92654l7491A80267K36816
13601D17083N2148k14976A13876K46685n9312R205j4209r7890K02279A93324j949
13590A91375P873K95307k34935q4393K61689j83624J82167A72706J62658J55396
13580D90760A55691M23632k85902E6789J54943I2685J65047J88736e6283K6460
13570b9823E37219j09123m7020H4423K22288j877A48424K58710A86789K61026
13560D47815A63648C0556K25869I2490K50710j23665p0763Q7699G9488K32711
13550C12199p7448M7348B741K60633D0887K13208m5588h8015C71587j71831j436
$$ y = [680698, 178787, 445635, 682106, 345050, 300221, 464064, 508968, 345123, 99318, 270242, 286362, -32217, 434210, 265298, 328471, 256253, 448907, 411416, 180267, 417083, 469231, 254255, 113876, 360561, 301249, 310454, 296245, 198355, 400634, 193324, 191375, 199248, 494555, 259620, 175227, 436916, 253292, 435459, 172706, 335364, 490760, 155691, 579323, 293421, 56789, 211732, 92685, 257732, 446468, -56283, -29823, 537219, 428096, 381076, 84423, 306711, 304834, 148424, 407134, 186789, 447815, 163648, 30556, 256425, 92490, 343200, 219535, 148772, 236471, 79488, 312199, 234751, 282099, 2741, 263374, 40887, 254095, 208507, -88015, 371587, 199756, 198320]
13539A98320n546j1491M64879k54984p731R3717j8135j89328A15486K53708i1015
13527B04852m9879G0925Q2798N2427H3557R3939J53532O2253J20149I3556C1282
13515B55796N7861P2404a38375a0837C48667C0971O8421K04881C2673K32541D1953
13503E13989B49889Q6772N4310A28442J93390h8184E08327G7528Q8145K80415
13493D46088j07490k5202o9268j17593j3955K89700J85460j85380J18972k31406
13483B89926O3325A41962F8089f3511H8569J35647J08929F7263M29549k4926B24664
13471B04229j5192P3000k3084K04157E7155L76870j94183J17198j11196a9197
13460B10514i7337B48648K38298j58382H2743J30913K32283j21845M2390L6858
$$ y = [198320, 192774, 181283, 646162, 391178, 383447, 477164, 459029, 269701, 115486, 369194, -91015, 204852, 154973, 70925, 153723, 206150, 83557, 177496, 331028, 393281, 513430, 93556, 31282, 255796, 313657, 386061, -138375, -10837, 348667, 30971, 99392, 304273, 32673, 265214, 41953, 513989, 249889, 336661, 390971, 128442, 321832, -88184, 508327, 77528, 165673, 446088, 338598, 313396, 244128, 126535, 112580, 402280, 587740, 402360, 521332, 289926, 353251, 141962, 68089, -63511, 88569, 224216, 333145, 67263, 496812, 471886, 224664, 204229, 189037, 262037, 238953, 443110, 57155, 434025, 239842, 357040, 245844, -19197, 210514, -97337, 248648, 486946, 328564, 82743, 213656, 445939, 324094, 366484, 403342]
13450D03342E8017M15310A30852J35324a43713g0424A29576O8550O7663a39437
13439c60853F5826K28964I0236k7062d3751C38158E5241J22254J85157k5663L07367
13428F44356B92461d9223D37775c9553A70521R3863a35095B13754L35392a02057
13417a7983A32621P2550a1466A83782a56781C25202A12853J87386O8016m2588
13407C25667q5928F8442M67465a04714B59249A12328J41354O5776H5187K0869
13397A06056J19584N8859J83053A16741K61062j50472b04886A3027R7569J7516
13387A28112b3068C61356p6121r7152K15410G7622J43116E1729h8460a5705E1635
13375A81414K11856G6076K70675K541J30843j9865L6320B3928j96a5972A79378
$$ y = [403342, 58017, 473327, 130852, 266176, -143713, -70424, 129576, 198126, 265789, -139437, -360853, 65826, 294790, 90236, 63174, -43751, 338158, 55241, 177495, 362652, 336989, 644356, 292461, -49223, 437775, -39553, 170521, 264384, -135095, 213754, 549146, -102057, -17983, 132621, 205171, -11466, 183782, -156781, 325202, 112853, 300239, 368255, 325667, 239739, 68442, 535907, -104714, 259249, 112328, 253682, 319458, 85187, 106056, 225640, 284499, 467552, 116741, 377803, 227331, -204886, 13027, 110596, 128112, -23068, 361356, 285235, 188083, 403493, 77622, 220738, 51729, -88460, -15705, 51635, 181414, 393270, 76076, 346751, 349292, 480135, 460270, 496590, 23928, 23732, -15972, 179378]
13363A78270L0715n9116K17811b3591j5580o2082B41591M5305A12941B8615K09229
13352B37844J92319A83738r523J58778l7179A28030J68431J4889j26900K3474
13342B07924K27216A23111J92848p9188K33862A38121F3863L53144j59990K9099
13332B86116B1458J49900n2434p599K6778K08535l4009o2216J1526L77919B29232
13320B79534N3298R0391j13980a2581C57243A64320J81685A38969d8597B59065
13309A55178E4857a37271A41744k4512J72408f0349D2550a1928A20098K41681
13299C61779I0532B4179b02442B80016I9699R5341i6412l2776E2596M89882c1584
13287A05649M28014B12423i4169A70478l129a49297G0030C3660Q6887K80884d3927
$$ y = [178270, 208985, 149869, 367680, -23591, -39171, -101253, 241591, 286896, 112941, 28615, 237844, 430163, 183738, 174215, 332993, 295814, 128030, 296461, 311350, 184450, 207924, 435140, 123111, 315959, 236771, 470633, 138121, 63863, 417007, 257017, 286116, 21458, 171358, 118924, 111325, 138103, 346638, 312629, 250413, 261939, 639858, 229232, 279534, 332832, 423223, 309243, -12581, 357243, 164320, 346005, 138969, -48597, 259065, 155178, 54857, -137271, 141744, 117232, 289640, -60349, 42550, -11928, 120098, 361779, 90532, 24179, -202442, 280016, 99699, 195040, -96412, -129188, 52596, 542478, -31584, 105649, 533663, 212423, -94169, 170478, 167349, -149297, 70030, 33660, 120547, 401431, -43927]
13275a77603C13247p8264j6123D7335R752J65081c2730A67326a25761N7450A02532
13263B78369J87483b14348B30921p1686o6099J20749A03684n0455R9479R6117
13253B48825a63715G3432L19904I8885Q5315D3834K97896a48478A86287E2915
13242A43414g5623F1272j5314R3612J2412j1957J25876B8378L4947e8776j39262
13231a98038D48863A18154J14618a51561I6342E884a94949A52990d1045k33585
13221b74630G1485K45156I7185C842J45945K21987A62492J79167r7154j4991r3015
13210A36499J25372I3452Q1953b08305I7695K13035B744N3784j6952i475D08017
13198B04851J10748f6278C00371a12921b4471j5644C35271G1401a27216I5192
$$ y = [-177603, 313247, 234983, 218860, 47335, 57087, 222168, -32730, 167326, -125761, -68311, 102532, 278369, 465852, -214348, 230921, 159235, 93136, 213885, 103684, 53229, 152708, 248825, -163715, 73432, 393336, 98885, 184200, 43834, 341730, -148478, 186287, 52915, 143414, -75623, 61272, 45958, 139570, 151982, 140025, 265901, 28378, 63325, -58776, -198038, 448863, 118154, 232772, -151561, 96342, 5884, -194949, 152990, -41045, -274630, 71485, 316641, 97185, 3842, 149787, 371774, 162492, 341659, 244505, 229514, 136499, 261871, 93452, 175405, -208305, 97695, 310730, 2744, 56528, 39576, -9475, 408017, 204851, 315599, -66278, 300371, -112921, -24471, -40115, 335271, 71401, -127216, 95192]
13187D7812M57940C5090R1664a4348G1284b11760A43431f0679B63276D137J91734
13176A95871H47b5823B59709c02217H3168b5330A53744N5483a72646B68578i2039
13164B19918b6190C89646b45939I7752N0541b34861N7969Q7915A90507E3387J13375
13153A66762K8560a4050A06846J41181I9183a4080p8600A25003K42386j83468
13143A83921i6864o4798c4236A48404n4031l0337M0444d9415n6703B5584N1348
13132G6932a30141k5644j2840B36278N8236j11106o5224K03155j45026J44669
13122C20982G4280c3426B8521b47812A34752O8745d1148A25459L24332r6506O6361
13111D19646A95200a88977I2537J78390n806h411B81279f8049o1997a4163j940
$$ y = [47812, 505752, 35090, 126754, -14348, 71284, -211760, 143431, -60679, 263276, 4137, 195871, 847, -25823, 259709, -302217, 83168, -25330, 153744, 209227, -172646, 268578, -92039, 219918, -26190, 389646, -245939, 97752, 148293, -234861, -176892, -88977, 190507, 53387, 166762, 195322, -14050, 106846, 248027, 99183, -14080, -92680, 125003, 367389, 183921, -96864, -161662, -34236, 148404, 94373, 64036, 104480, -49415, -106118, 25584, 76932, -130141, -155785, -168625, 236278, 294514, 183408, 118184, 321339, 176313, 320982, 74280, -33426, 28521, -247812, 134752, 203497, -41148, 125459, 449791, 353285, 419646, 195200, -188977, 92537, 270927, 265121, -8411, 281279, -68049, -130046, -14163, -16103]
13100a6103A71855a94435A89767Q42f1963C9945i9222E2336R7418C3831K5191
13089E9022J2395b46591A72709A041Q8500K34378f6817m2807A59761m8626K57494
13078C68629c60389F9691N3673a37462k1816A81751o7126i6199A70166M4997d0746
13066C80630A30567l1897J57126K67190I5428J36891g5611A15907D0279C859c3165
13054a32888e553C07304L2212B2000N7946J25752K59389a06558K4207A68810M8083
13043B16893D878L12403C8431I591Q9834f2711j36758A59052j9634K9686b29301
13031A20781R5814B9265Q9365a01126B01947a14638A17784a01631a542H1802j7671
13020F4131A3820L25941a08475A64589a86471c2124B66542a39040B02706k266
$$ y = [-16103, 171855, -194435, 189767, 190609, -61963, 39945, -99222, 52336, 149754, 33831, 59022, 71417, -246591, 172709, 1041, 89541, 323919, -66817, -109624, 159761, 111135, 368629, -360389, 69691, 123364, -137462, -159278, 181751, 114625, -96199, 170166, 215163, -40746, 380630, 130567, 98670, 255796, 522986, 95428, 232319, -75611, 115907, 40279, 3859, -33165, -132888, -5553, 307304, 339516, 22000, 79946, 205698, 465087, -106558, -82351, 168810, 216893, 4878, 317281, 38431, 9591, 99425, -62711, -199469, 159052, 139418, 169104, -229301, 120781, 216595, 29265, 118630, -101126, 201947, -114638, 117784, -101631, -1542, 81802, 64131, 13820, 339761, -108475, 164589, -186471, -32124, 266542, -139040, 202706, 200440]
13010B00440E8885N4043K20j2741J47904j4337K15117a30031B90114b97589A96162
12998e6299j57763A0989d3257b063A46094f5486B38764J7213c4340E0523L00352
12987C50875A62316B7218c2237B38221k1862J30374d67234B06511a40716A51499
12976B36374I0809K0874R5929n6200K8280i2632L0563C98958e8062p0338M5217
12965h3183A06648b61434A61795b38549M90f2828I0424a8721j31364D38466H9121
12953A61338b37904a10331G8204J47804j02224B0491a14222F8194j4368b51026
12942A18997C9413J8062A0265K45353j02526a9086o9378A20871g8954C9647r917
12931B9730O3098b47427A02135g7835C4467J34978d887B33727b2733j19407O4531
$$ y = [200440, 58885, 112928, 113148, 100407, 248311, 233974, 449091, -130031, 290114, -297589, 196162, -56299, -214062, 10989, -43257, -2063, 146094, -65486, 238764, 255977, -34340, 50523, 350875, 162316, 27218, -32237, 238221, 216359, 346733, -467234, 206511, -140716, 151499, 236374, 90809, 111683, 207612, 151412, 179692, -92632, -62069, 398958, -58062, -128400, -83183, 106648, -261434, 161795, -238549, -238059, -62828, 90424, -18721, -150085, 438466, 89121, 161338, -237904, -110331, 78204, 226008, 123784, 20491, -114222, 68194, 53826, -251026, 118997, 39413, 57475, 10265, 255618, 153092, -19086, -88464, 120871, -78954, 39647, 29730, 92828, -247427, 102135, -77835, 34467, 169445, -4887, 233727, -22733, -142140, -77609]
12920g7609A18545g2507p5716A0635a61821A40671b57646f4626A9925b40439A77472
12908A704a1963A87121q9306k1168O1084c20158c2836B38894e7563I7787D0656
12896D62J32663K43796C1452a37364A63946a23199E7775J69502k0785G6411Q8680
12885A65091a87398B23690q8920M3439D7086L294K25016E4155Q0493r870d723
12873a52163j6803j41038d7127A44900e9706A32693J3689F1936J6746K96585d5020
12861A88225a71289B09541a61509C65963a4123j2924m19079i5573A20365b51031
12850C05146D9543K7444d4079B76069H4439P435a56743G2931K68658A30948j2050
12839A18898a8152k46939C94926F7409J1393a3149l0293C06390d6664j65055C20572
$$ y = [-77609, 118545, -72507, -148223, 10635, -161821, 140671, -257646, -64626, 19925, -240439, 177472, 1704, -11963, 187121, 97815, 76647, 137731, -320158, -32836, 238894, -57563, 97787, 40656, 462, 133125, 376921, 31452, -137364, 163946, -123199, 57775, 227277, 206492, 76411, 165091, -187398, 223690, 134770, 178209, 47086, 50380, 275396, 54155, 134648, 124778, -4723, -152163, -168966, -310004, -47127, 144900, -59706, 132693, 146382, 61936, 78682, 375267, -45020, 188225, -171289, 209541, -161509, 365963, -14123, -27047, -446126, -95573, 120365, -251031, 305146, 49543, 76987, -44079, 276069, 84439, 91874, -156743, 72931, 341589, 130948, 118898, -18152, -265091, 394926, 67409, 78802, -13149, -43442, 306390, -46664, -211719, 320572]
12827E6621J19753b80833c2724j6496I3768g4226G3889j7533d5412E4578b41780
12815d2821j37191K3144B012K8767a33023D2251J7048P184b71210f8924c1338
12803B14487J04917A20246A6778L50574g3504F5181i4289j51010B16980a04725
12792a78370G816e70392a19507A54154b0263A48162n5234c90283j1357a8539n2081
12781g0620c3053C1681a84443L8755A87811o6776L0828D8422c0818j35470E0826
12769h4537C8286d4846B90498b37933d1659H3589b86959A02353d6114j60026q6204
12758b92344f6454B06814r6229e0965k9697A14888c6235j6195j2131b6406n0964
12747g7370A45327d0039B75b33071f4345F7948J27083n6994P8257R3944a10312
$$ y = [56621, 176374, -280833, -32724, -49220, 93768, -74226, 73889, 56356, -45412, 54578, -241780, -42821, -180012, -156868, 2012, 30779, -133023, 42251, 59299, 66483, -271210, -68924, -31338, 214487, 319404, 120246, 16778, 367352, -73504, 65181, -94289, -245299, 216980, -104725, -178370, 7816, -570392, -119507, 154154, -20263, 148162, 92928, -390283, -401640, -18539, -70620, -33053, 31681, -184443, -145688, 187811, 121035, 151863, 48422, -30818, -166288, 50826, -84537, 38286, -44846, 290498, -237933, -41659, 83589, -286959, 102353, -46114, -206140, -292344, -66454, 206814, 110585, -50965, -80662, 114888, -36235, -52430, -64561, -26406, -77370, 145327, -40039, 275, -233071, -64345, 67948, 195031, 138037, 216294, 310238, -110312]
12735a34181N7888I9752G863Q0609a97940B44736n3854F852L2241b11859c3596
12723C00245E410d7517G641b707p7121j1134B87178j13817P5193a44451d5214
12711c7859Q277B43787a96174A51899B0883f3169D00261r2961j53512m6510B6592
12699A02834l5061J33979q4730l2828h8761C21315r7192F5520J99055j23635m5617
12688I5323J06526J53718C5719C095K62359k6094b76200b7543B6324b63706H4781
12676A1795N3828J28549f2875j5860D16178n8718q2956j28987e5325I0279b62359
12664e9445J4261C38424A9119L62169a26957A34229J81697G306b69645a05315
12653b1090C20824H1360j9383O4406b33782A56251J42364A17450D1222a37001
$$ y = [-134181, -76293, 99752, 7863, 88472, -197940, 244736, 190882, 6852, 39093, -211859, -33596, 300245, 5410, -47517, 7641, -2707, -79828, -90962, 287178, 173361, 248554, -144451, -45214, -37859, -29582, 243787, -196174, 151899, 20883, -63169, 400261, 307300, 153788, 107278, 26592, 102834, 67773, 201752, 117022, 84194, -88761, 321315, 224123, 65520, 264575, 140940, 95323, 201849, 355567, 35719, 3095, 265454, 239360, -276200, -27543, 26324, -263706, 84781, 11795, 65623, 194172, -62875, -78735, 416178, 357460, 274504, 145517, -55325, 90279, -262359, -59445, -45184, 338424, 19119, 381288, -126957, 134229, 315926, 7306, -269645, -105315, -21090, 320824, 81360, 61977, 126383, -233782, 156251, 298615, 117450, 41222, -137001]
12642A40689m5732P8656e6346a3652B60256c18124a23401d7716A189Q4343a22236
12630C01998i195q3095F63949e150C19387k563j14746R3556A12748J67117r1885
12619A87980B0729J88976f4394B47258B8158K03443P267d6268e627F5461j1204
12608E4257R6248J84585j33218C1258K37739H6492J78014G7044J46617b6709A9597
12596A57270B5380b2386n0707j5306k42683I831N7025J15006i8010D4160a25631
12584B16405B5237P4786A6352K94123b89620B0435i3057b8629g028j34732C4066
12572f2375j45634A68351l9942d0426r9116C44567A02638a22458J7829H3114l1751
12561E1363g480k06160B8986a97881A7968R5990a7033E3340P9537O8404J05236
$$ y = [140689, 94957, 173613, -56346, -13652, 260256, -318124, -123401, -47716, 1189, 85532, -122236, 301998, -9195, -92290, 663949, -5150, 319387, 316824, 202078, 295634, 112748, 279865, 187980, 20729, 209705, -64394, 247258, 28158, 231601, 238868, -46268, -5627, 65461, 54257, 150505, 335090, 201872, 31258, 268997, 86492, 264506, 77044, 223661, -26709, 19597, 157270, 25380, -22386, -73093, -88399, -331082, 9831, 66856, 181862, -98010, 44160, -125631, 216405, 25237, 100023, 16352, 310475, -289620, 20435, -93057, -28629, -7028, -141760, 34066, -62375, -208009, 168351, 128409, -40426, -139542, 344567, 102638, -122458, -104629, 83114, 51363, -7480, -213640, 28986, -197881, 17968, 113958, -17033, 53340, 132877, 201281, 306517]
12550C06517A48195B7372N9744K8082N5624K16566E1774a3281A71052r065f5752
12538B8680J66464a76919P632P0669j95256c6817n5902C33217D5373e5203A69828
12526A5498J90822i8526B98238r126A35646L22670a37486A86239F8781e530D12970
12514A28687i8548j42201H8413g4525B99016A43382h7890G3965j9224J83030b4896
12502a71263h4598K4546l4665F6677R6566N3601j5531b38070C3070O5614A3629
12490h8159b0533m690k05714i1446D9721d2146M557j03616F0846C825c5694q4802
12478a20496p7423j73234a60652F4486J31641M8103j13113a54459A28977M1422
12468A70399a01070D0621b79611D0683K297b218j01692L7931q0392n7469a743
$$ y = [306517, 148195, 27372, 87116, 115198, 170822, 387388, 51774, -13281, 171052, 161987, -65752, 28680, 195144, -176919, -169287, -98618, -293874, -36817, -92719, 333217, 45373, -55203, 169828, 15498, 206320, -98526, 298238, 289112, 135646, 458316, -137486, 186239, 68781, -5530, 412970, 128687, -98548, -240749, 88413, -74525, 299016, 143382, -87890, 73965, 54741, 237771, -24896, -171263, -84598, -60052, -94717, 66677, 163243, 216844, 201313, -238070, 33070, 98684, 13629, -88159, -20533, -25223, -230937, -91446, 49721, -42146, -37589, -141205, 60846, 3825, -35694, -120496, -197919, -371153, -160652, 64486, 196127, 244230, 131117, -154459, 128977, 170399, -101070, 40621, -279611, 40683, 42980, -2218, -103910, -65979, -146371, -203840, -1743]
12456H9416C728c77014a58431K2260k04283d0532D9653J40027H3664c6005j94672
12445b30677j81390A47526K5467b12918A56697D3201b35153C8619a38453j46742
12435b85195e2513A24055B3170b37788Q6953g771C9915g4784j446D6737a05098
12423c64323A44070k2261c04257h959j793j14118A92907H5121i2154L3150A554
12411B49561l5267l5247b09566Q7003H5152B6701K48009p4525i3036A5590L00531
12400C16121a92630L4645b2146k54148C9821e6450k35002G8682k580h1890j0479
12389i2369A3734e5423q6916f5557C7079Q5824e709j12134A65023a90780I6648
12377A0847i0180k7185e1098H0992f9660k6262j02580K9196a5464l03416D5412
$$ y = [89416, 3728, -377014, -158431, -136171, -340454, -40532, 49653, 189680, 83664, -36005, -230677, -412067, 147526, 172993, -212918, 156697, 43201, -235153, 38619, -138453, -285195, -52513, 124055, 23170, -237788, -150835, -7771, 39915, -74784, -76230, 46737, -105098, -364323, 144070, 121809, -304257, -8959, -10752, -124870, 192907, 85121, -92154, -59004, 1554, 249561, 214294, 179047, -209566, -122563, 85152, 26701, 274710, 200185, -93036, 15590, 316121, -192630, -157985, -22146, -276294, 39821, -56450, -291452, 78682, 76102, -81890, -92369, 13734, -55423, -142339, -65557, 37079, 122903, -5709, -117843, 165023, -190780, 96648, 10847, -90180, -117365, -51098, 80992, -69660, -95922, -198502, -169306, -15464, -318880, 45412]
12365D8990a81915K6525B60609c0536D02587c8577r036D9911K93016p3892g3705
12353A02862f7857J2382A00580a57234E4415J36745a1683l13077a45176E1064
12342a58040C6331a73002A1160e4276E5000J27809K65275B2810J36671h4916n9354
12331a44270G3388b39142D55134H7929e7440k5364E9598a48908K8977H8676c08132
12319B63726k1138d3964b0368H1990d4289B16063L9546g1011I838a34695d1940
12307b54890J06397E3039J1537B601i1047j8410A1054a2931B25074b3927B03120
12295c9708B39800a02769b7009k1193G13958a05421k01158e1325B86887B7435
12284H2750F898J19428K3648i655I7319n470b2891A45052Q721J5286a2153B50591
$$ y = [48990, -181915, -155390, 260609, -30536, 402587, -38577, -47613, 49911, 342927, 269035, -73705, 102862, -67857, -55475, 100580, -157234, 54415, 191160, -11683, -324760, -145176, 51064, -158040, 36331, -173002, 11160, -54276, 55000, 182809, 448084, 22810, 159481, -84916, -144270, 73388, -239142, 455134, 87929, -57440, -82804, 59598, -148908, -119931, 88676, -308132, 263726, 242588, -43964, -20368, 81990, -44289, 216063, 255609, -71011, 9838, -134695, -41940, -254890, -148493, 53039, 64576, 2601, -91047, -109457, 11054, -12931, 225074, -23927, 203120, -39708, 239800, -102769, -27009, -48202, 713958, -105421, -306579, -51325, 286887, 27435, 82750, 6898, 126326, 149974, -9655, 97319, 91849, -22891, 145052, 153773, 169059, -12153, 250591]
12271A32184B1879M05423F3826L39017C5675K74291A48799c30611A3326d7638
12260F3726J60901D2207K04818E0001J37842J52700b9011D9687a14121C61325
12249B53662N7652A32189e528A62298n7456K3873a50789B15119a51922G6887K33191
12238C10078a75008D52512A22367d8560A79318f7003o8153A98751O0894j04883
12228A54762k6713f3144F31704h5453C8013J96937G1868a02707B70918r2212P8287
12217B56993j1191A2068J34626B94J89293q2643K8749a01485C73422A72707h0409
12205A93618d3445M932o1836D44397j22692J58539Q6898j73792A91646K388o9479
12194A24555N4219d5984G4029a23487B48767o213a10610C7325K28319Q1236b74952
$$ y = [132184, 21879, 427302, 63826, 402843, 35675, 309966, 148799, -330611, 13326, -47638, 63726, 224627, 42207, 247025, 50001, 187843, 340543, -29011, 49687, -114121, 361325, 253662, 311314, 132189, -5528, 162298, 104842, 128715, -150789, 215119, -151922, 76887, 310078, -175008, 452512, 122367, -48560, 179318, -67003, -135156, 198751, 259645, 154762, 128049, -63144, 631704, -85453, 38013, 234950, 71868, -102707, 270918, 178706, 256993, 245802, 12068, 146694, 294, 189587, 106944, 135693, -101485, 373422, 172707, -80409, 193618, -43445, -38513, -100349, 444397, 321705, 480244, 567142, 393350, 191646, 194034, 124555, 178774, -45984, 74029, -123487, 248767, 242554, -110610, 37325, 265644, 346880, -274952]
12182a17440C27504P6112N9305h9857H0833d0218B9829L2995J77449J23093A734
12170b03537B5788K03828f3899E59J80846J11630a15175B40699l6449e1914k40879
12159b92793D24262l4580o0421b00770R3888f827a105j09128C2667b23139E1410
12147A36827c26420k4941B73654j33847P2754p5129J22894D3728J8553K65439
12137C27720d1902l22417i5208C02226a20173E5486b15611E0139J269a9963q3279
12126a03242C58657a68370J6473C25425b46585e5060k40633h275j72297n4616
12116b35188B18269I5226b513A92820a29382B18787a55593B27075H5528n465a02664
12104c7525A22054K5085n2436R3218H2261k6921b62309C48553A20305e7533A74316
$$ y = [-117440, 327504, 403616, 462921, -89857, 80833, -40218, 29829, 62824, 240273, 363366, 1734, -203537, 25788, 229616, -63899, 559, 181405, 293035, -115175, 240699, 204250, -51914, -292793, 424262, 389682, 329261, -200770, -106882, -6827, -1105, -110233, 32667, -223139, 51410, 136827, -326420, -351361, 273654, 139807, 212561, 137432, 260326, 43728, 62281, 327720, -41902, -364319, -95208, 302226, -120173, 55486, -215611, 50139, 51408, -19963, -103242, 358657, -168370, -151897, 325425, -246585, -55060, -295693, -8275, -180572, -235188, 218269, 95226, -2513, 192820, -129382, 218787, -155593, 227075, 85528, 80063, -102664, -37525, 122054, 147139, 94703, 187921, 82261, 55340, -262309, 348553, 120305, -57533, 174316]
12092B68341b78046B73589m9442F680c1512j40577b9636C62156a34731e6184B27427
12080I5404g7401l56591B908Q9547a82564e3776j13269n7656G842J14532a73420
12068B7362c0720B80136N834K62377K41068O95046F41757H343M53286c4260E8993
12056E5574Q3783a10374A31528g2436p8890d9039a5039j40217R779p029l6566
12045a89072P0566O985a6964A50194b17340a02647j66701B61929e4108A02165
12034A76085b27965E9979L7930J08838c6721B60170a14013A71978M317e0106B56226
12022B3156a54388B10947q7427a41113d9251J4412j04893M4685A05163K21400
12012C26563c25196C11030F4192J76427h1107B1989a55549A21124d2784m5787
$$ y = [268341, -278046, 273589, 224147, 6680, -31512, -172089, -29636, 362156, -134731, -56184, 227427, 95404, -77401, -433992, 2908, 92455, -182564, -53776, -167045, -224701, 7842, 122374, -173420, 27362, -30720, 280136, 285970, 548347, 789415, 1484461, 641757, 8343, 461629, -34260, 58993, 55574, 139357, -110374, 131528, -72436, -151326, -49039, -15039, -155256, -145477, -152506, -189072, -118506, -111521, -16964, 150194, -217340, -102647, -269348, 261929, -54108, 102165, 176085, -227965, 59979, 97909, 206747, -36721, 260170, -114013, 171978, 176295, -50106, 256226, 23156, -154388, 210947, 123520, -141113, -49251, -34839, -139732, -95047, 105163, 326563, -325196, 311030, 64192, 240619, -81107, 21989, -155549, 121124, -42784, -88571]
12002h8571j61768j65040C08016a03396d4142A853c6159l24744i9949H7149C629
11990c03870I5362C3676Q1437h9676A4136a94271b8412q0097B673b47766A60058
11978c9508E2907c10590c3513j3232B48089N7929c95047B58594a62024k9792A00185
11966f6088B58193A27567A7250J4161b01894R4925c9365l49532Q5493G2183l1506
11955D0677a38953D46083g6468k8943G8291a67938F5644J41593B1350b86230M8777
11944b37453A82781b30805J3654c8010l5331K9228H2848i5589k59693D7018R1021
11933A38039a48389C89347a42849a580o4619q2316D0632f1503i917r3149q1009
11922a84075C81339a50666M5188F2052R3643R6196o9456H7893c71008a3233B2578
$$ y = [-88571, -250339, -415379, 308016, -103396, -44142, 1853, -36159, -360903, -99949, 87149, 3629, -303870, 95362, 33676, 115113, -89676, 14136, -194271, -28412, -108509, 2673, -247766, 160058, -39508, 52907, -310590, -33513, -46745, 248089, 306018, -395047, 258594, -162024, -191816, 100185, -66088, 258193, 127567, 17250, 31411, -201894, -106969, -39365, -388897, -303404, 72183, 40677, -138953, 446083, -76468, -105411, 78291, -167938, 65644, 207237, 21350, -286230, -237453, 182781, -230805, -217151, -38010, -73341, -44113, 82848, -95589, -355282, 47018, 138039, -148389, 389347, -142849, -1580, -66199, -148515, 40632, -61503, -9917, -103066, -184075, 381339, -150666, -105478, 62052, 155695, 251891, 182435, 87893, -371008, -13233, 22578]
11910h576F5749L53837A15906j9100a60696B9738b80981A11246R2446a87734j00972
11899b88706J4328B91502g4291A21388g8065E14960C2127e5537k28260C8789a76610
11887A25339a24849A77599c50881a7275o1286K77E8578R4417b34578L1491j07031
11876c10118B10231a25679e1558H9920L5422C903L06611d5581B16203G6290a04754
11864A5519a00848j49889E2669J36206c05640E4812J3843R3872E8507b27595B0357
11852A22169a55769B68477j23382a84449E6212P7145b01760h2154A08561a33498
11841d2363A42972n1256j872c884A34600i2543f572D2054Q0987i700Q62q5722
11829i4560B54211c7966j74447O9980A25401a37777I8415c14827A99008c06097
$$ y = [-8576, 65749, 419586, 115906, 96806, -160696, 29738, -280981, 111246, 203692, -187734, -288706, -274378, 291502, -74291, 121388, -78065, 514960, 32127, -55537, -283797, 38789, -176610, 125339, -124849, 177599, -350881, -17275, -78561, -78284, 58578, 152995, -234578, -203087, -310118, 210231, -125679, -51558, 89920, 125342, 3903, 310514, -45581, 216203, 76290, -104754, 15519, -100848, -250737, 52669, 188875, -305640, 54812, 68655, 162527, 58507, -227595, 20357, 122169, -155769, 268477, 145095, -184449, 56212, 133357, -201760, -82154, 108561, -133498, -42363, 142972, 91716, 89844, -3884, 134600, -92543, -6572, 42054, 123041, -9700, -8838, -94560, 254211, -37966, -212413, -142433, 125401, -137777, 98415, -314827, 199008, -306097]
11818A77531c15507A65901a66818A18655b44065k8295B58945b20743A36367d3514
11807c13176a28638J6097m7262A14060a36032H3953l8463A5003B324e5093K1465
11796c3628p4959j6950b756I2206P1846a02128l0941a8983D1516J31038g8633
11784d6074k6445j73011a03688n2105A29943c367A44996o1871g1691j01413A33775
11772G273P4991a95439N2058m086A80601n2163f699j69163A97055b84507A37624
11760E8972a46326I9614J97483B2031i1089k02788d5745k10106p8949J60834p9149
11749b53115G1324Q9618l2346g3612k31390J22259F264b49349A82509q218K406
11738A76697K9487a06308A92917a28337k34477B13181a35662D3241b2592D654
$$ y = [177531, -315507, 165901, -166818, 118655, -244065, -272360, 258945, -220743, 136367, -43514, -313176, -128638, -112541, -159803, 114060, -136032, 83953, 45490, 15003, 2324, -55093, -33628, -108587, -125537, -2756, 92206, 164052, -102128, -133069, -18983, 41516, 172554, -78633, -46074, -72519, -245530, -103688, -155793, 129943, -3367, 144996, 83125, -71691, -173104, 133775, 7273, 82264, -195439, -143381, -147467, 180601, 128438, -6699, -175862, 197055, -284507, 137624, 58972, -146326, 99614, 297097, 22031, -91089, -293877, -45745, -255851, -334800, -173966, -253115, 71324, 160942, 128596, -73612, -305002, -182743, 6264, -249349, 182509, 174291, 176697, 206184, -106308, 192917, -128337, -362814, 213181, -135662, 43241, -22592, 4654]
11727E5670f3035j46485E2979J19872a12367K6789j1034a592k57893g9563Q763
11716g0800A92406B4501f3099j50788a3959B71754F8141a25816j64577E0766K72579
11705C23345E8805J94101J08455c0504A61502F7310H771J30634J4558i8137A02194
11693H2949o298J3174l7236K78928F8848K0787J77491a4296d282k15277A04327
11681F1000f2067A61827L04906k31588r0347a90114c0402A31313L995g0858a9732
11669A4402O4385J78301c42362G6236b36434f7472A07686f1844j02015A75664
11658b9092A4939J99019I2536b2964j55259k31005D0847g5411h879G4154N5238
11647A29392c6251A00452J400l9078k3834K95160A8429O2042K20578A47553J24563
$$ y = [55670, -63035, -209520, 52979, 172851, -112367, -85578, -96612, -1592, -259485, -79563, -70800, 192406, 24501, -63099, -213887, -13959, 271754, 68141, -125816, -290393, 50766, 323345, 58805, 252906, 361361, -30504, 161502, 67310, 8771, 139405, 153963, -98137, 102194, 82949, 76651, 89825, 52589, 331517, 68848, 89635, 267126, -14296, -4282, -219559, 104327, 61000, -62067, 161827, 466733, 235145, 144798, -190114, -30402, 131313, 135308, -70858, -19732, 14402, 78787, 257088, -342362, 76236, -236434, -67472, 107686, -61844, -163859, 175664, -29092, 14939, 213958, 92536, -22964, -178223, -409228, 40847, -75411, -8879, 74154, 129392, -36251, 100452, 101852, 62774, 38940, 334100, 18429, 80471, 301049, 147553, 272116]
11636B72116i557B00615b45861n9974G9834L98674B30808n812k2770k6122F229
11624A51397f0053F01856C2114J09841C8431J85526N2415a358D1835P7331Q8629
11613B07795f8110A5194a0888B07118m1339h6750E6603f2933B56810J25188c4873
11601C19855E3091j9404J54788N0554G7800g5258A92576o6957a58879A46003k2542
11590A23461N7895a44380C4879P4099J98352B4394a95308g8176G1528k8058J18317
11579A61787f9570k44265B13208G5578k689P0167k0949a08442c7335D8305c2742
11567C92173A88692J42329b6970C29e2173A13975n0645J51072L7124A05616H932
11555A30030P6942a55671k0555B3006M1367e1024A47938J46184c3008j30234a4567
$$ y = [272116, -9557, 200615, -245861, -305835, 79834, 478508, 230808, 224996, 202226, 176104, 6229, 151397, -60053, 601856, 32114, 141955, 38431, 223957, 276372, -1358, 41835, 119166, 207795, -68110, 15194, -10888, 207118, 165779, -86750, 56603, -62933, 256810, 381998, -34873, 319855, 53091, 33687, 188475, 239029, 77800, -75258, 192576, 125619, -158879, 146003, 123461, 181356, -144380, 34879, 108978, 307330, 24394, -195308, -78176, 71528, 43470, 161787, -69570, -313835, 213208, 75578, 72889, 143056, 122107, -108442, -37335, 48305, -32742, 392173, 188692, 331021, -26970, 329, -52173, 113975, 63330, 214402, 251526, 105616, 8932, 130030, 206972, -155671, -176226, 23006, 64373, -51024, 147938, 294122, -33008, -163242, -14567]
11543a46689l1565Q8380k28950e2453G1892M5174b13036b0954A18494a47680A11358
11531C6706K95737f898G4923a27542D4673a44287C20969I0176D1657b0140n1174
11520g1314m1465H8738J55371d8394A39871a76239A5536b61990d7564G1169J1376
11509H2545L35243A88777F7483b7295B37802r1392J06776N4055K41635A53591
11498A70065a53423a0708B47001a29626b2312A18442J71971J36014j26878b45881
11487B05804J20087I3859K32916j59970D3367b39010L7290A37670J33431K219
11477B73320d1169q000A58273o3109J05759H3031P783l7967J44817a3536B58479
11465C72743b9105A18484O6128q857H2209c9693A04149n0700M3879N72906B14369
$$ y = [-146689, -178254, -89874, -318824, -52453, 71892, 117066, -213036, -20954, 118494, -147680, 111358, 36706, 332443, -6898, 74923, -127542, 44673, -144287, 320969, 90176, 41657, -20140, -71314, -112779, 88738, 244109, -48394, 139871, -176239, 15536, -261990, -47564, 71169, 82545, 417788, 188777, 67483, -27295, 237802, 146410, 253186, 307241, 548876, 153591, 170065, -153423, -10708, 247001, -129626, -22312, 118442, 290413, 426427, 299549, -245881, 205804, 325891, 93859, 326775, 166805, 43367, -239010, -201720, 137670, 271101, 273320, -41169, -49169, 158273, 95164, 200923, 83031, 90814, 52847, 197664, -13536, 258479, 372743, -29105, 118484, 184612, 175755, 82209, -39693, 104149, 53449, 97328, 670234, 214369]
11453C09807H0077K06503i252B02323L9096C8698d9844j79822J11423B494O8819
11442G1313K4926O1885h7206b0320I2935c5911k11248B47763N1991j15543E2021
11430E6946c170F8842a93529d3253m1466C5979g7819B20660K08206j14432b39913
11418b3610r6532B7963J25844c25897K3048F2095J35592r6268N5339a3021p4209
11407h7230C25386i8286J015K7428A48787b76461b7587A8410p873P5071b44632
11395C49459A16708a31615J9394C3323J0403J46482a2370n3D7831a81094E629
11383b02366B12913d3136j96582A39134b10999B637J45076C4193K0876B4388c7386
11371a31473D4461K12628a52755L076A52857a02133A25739C226M6032J18014J03112
$$ y = [309807, 80077, 286580, -9252, 202323, 241419, 38698, -49844, -229666, -118243, 2494, 71313, 96239, 158124, -87206, -20320, 92935, -35911, -247159, 247763, 299754, 184211, 52021, 56946, -3170, 68842, -193529, -43253, -84719, 35979, -77819, 220660, 428866, 314434, -239913, -23610, -120142, 27963, 153807, -325897, -302849, 62095, 197687, 101419, 156758, -13021, -87230, 325386, -98286, -97271, -69843, 148787, -276461, -27587, 18410, 10537, 85608, -244632, 349459, 116708, -131615, -112221, 33323, 43726, 190208, -12370, -12423, 47831, -181094, 5629, -202366, 212913, -43136, -239718, 139134, -210999, 2637, 147713, 34193, 55069, 24388, -37386, -131473, 44461, 257089, -152755, -149679, 152857, -102133, 125739, 3226, 49258, 167272, 270384]
11360B70384a80107E3080b82683C52387H8450b11767d3466p1728r4403C68974
11349A19302a74777F4312k4476a09468B96810b11163I5306J5664K01185a044H6227
11337e5759A5386b12587K0397E15743b49275N3541Q5340L2407B20721p2719h6752
11325e9498A32439h6308B6558P3190N353a43479A33446C8706e8603k8113J8457
11314f8259D2517a61038A12876c945A03542p65D6489N710b13791G8679b9271B7773
11301c22283B8154J92450a09245A12886j3597b5327A27309a92923A50377d2764
11290a82632M5389K4246j72721H2383d41o0381B18507a84282I8385J00624c69457
11278A31840C8048K90163o1303m7190c55560g4960A33018f1901c577r5286B20725
$$ y = [270384, -180107, 53080, -282683, 352387, 88450, -211767, -43466, -115194, -209597, 368974, 119302, -174777, 64312, 39836, -109468, 296810, -211163, 95306, 110970, 312155, -1044, 86227, -55759, 15386, -212587, -192190, 515743, -249275, -195734, -110394, -77987, 220721, 148002, -86752, -59498, 132439, -86308, 26558, 99748, 105101, -143479, 133446, 38706, -58603, -86716, -68259, 42517, -161038, 112876, -3945, 103542, 102777, 46489, 52199, -213791, 78679, -29271, 27773, -322283, 28154, 220604, -109245, 112886, 99289, -25327, 127309, -192923, 150377, -42764, -182632, -137243, -112997, -285718, 82383, -441, -60822, 218507, -184282, 98385, 199009, -369457, 131840, 38048, 328211, 266908, 219718, -355560, -74960, 133018, -61901, -3577, -98863, 220725]
11266A75456E5015g1230j31199B37681a06506K1413d1962c739j39704j34202h0558
11254B5507c2485B79469F5646A9978J23933d25429D9525M5959A351L7001b01549
11242A91868d6694j13043A18182B2503g08k98642a007A34416a20146j63568A84036
11230E37M3762F643a57382F4223b08127Q8660H439a05134A00644e2176A40383
11218i5504o2691C29551a13444C4597c6615k03462b342k06415Q3136k44287a07378
11206a42354l1237k02493B08883c79171b0369n4846B34654E9522P284a85706l2576
11195b18282A94288e1598j56126r3584H3588f4248K9955q7761c9639A28688g9893
11183G0079h172B81414e1750j6033J1109F5978B7138b3691G5984a93733B33512
$$ y = [175456, 55015, -71230, -202429, 237681, -106506, -85093, -41962, -3739, -143443, -277645, -80558, 25507, -32485, 279469, 65646, 19978, 143911, -425429, 49525, 95484, 1351, 38352, -201549, 191868, -46694, -159737, 118182, 22503, -708, -299350, -1007, 134416, -120146, -283714, 184036, 537, 44299, 6643, -157382, 64223, -208127, -119467, 8439, -105134, 100644, -52176, 140383, -95504, -158195, 329551, -113444, 34597, -36615, -240077, -2342, -208757, -125621, -369908, -107378, -142354, -173591, -376084, 208883, -379171, -20369, -75215, 234654, 59522, 66806, -185706, -218282, 194288, -51598, -207724, -301308, 83588, -64248, -34293, -122054, -39639, 128688, -79893, 70079, -8172, 281414, -51750, -67783, -56674, 65978, 27138, -23691, 75984, -193733, 233512]
11171a16256e2110q676j95416k1139c3507B44096b78171e8001B1573J12839a91672
11159A42409A8325c8680q0466E1702e6020A44317n2321C0571d29754A38624B0537
11147a9012p8416j30164A43350a16957c5692F3302K6203d4657n8796J8734B6223
11135a48288A58083f421C86097I3349K9841K50653F618K4592J21198O0674A00590
11123A01676l9296a23868M5465B90006k4911A30837f1260K4256B4198f6876j53004
11112b19880g1921J7412G4296J47990g6265A00200N7017A1353L71981A09681J68722
11101B78403C0956J80710d4286F7475k981N3919Q7805r9154M0600j0206L36607
11090D74065h7240A16256N4787h9564k81335A42959J429K35588j82705J14139
$$ y = [-116256, -52110, -60786, -256202, -277341, -33507, 244096, -278171, -58001, 21573, 134412, -191672, 142409, 18325, -38680, -119146, 51702, -56020, 144317, 91996, 30571, -429754, 138624, 20537, -19012, -97428, -227592, 143350, -116957, -35692, 63302, 89505, -44657, -103453, -84719, 26223, -148288, 158083, -6421, 386097, 93349, 123190, 373843, 6618, 31210, 152408, 213082, 100590, 101676, 62380, -123868, -78403, 290006, 265095, 130837, -61260, -37004, 24198, -66876, -219880, -71921, -54509, 74296, 222286, -76265, 100200, 157217, 11353, 383334, 109681, 278403, 30956, 211666, -44286, 67475, 64494, 118413, 206218, 107064, 147664, 137458, 474065, -87240, 116256, 171043, -89564, -370899, 142959, 144388, 379976, 197271, 311410]
11080C11410C3447L65586A90112l296l8756K93403j05747k7014J42797J28610
11070E80109k65520j15398L30880Q2298B18219m590M4445K17255j85922k2M21088
11059G10473O7573j11297q3625K71115l75625N86693j33299l02429L50232C68770
11048G32385J11609m3709m8314r7945K10395j67596N54532D29827M14124l48937
11038D95014L02908J47260k95443J24525j45730J7523K23316m26331N75673m97068
11028E21647J75845P4128j5288j2870k39603P205K60072k70799L86640C51610
11017D21838J05803L45520k77296j21500J84034B49664K08117M0196K35279l45742
11007C87514K74335k04461P5848K4002r0889L59172j79710O312R8070l7552k39212
$$ y = [311410, 33447, 399033, 190112, 186816, 148060, 441463, 335716, 308702, 451499, 580109, 314589, 199191, 530071, 612369, 218219, 213629, 258074, 475329, 289407, 289385, 710473, 778046, 666749, 583124, 854239, 478614, 1065307, 932008, 629579, 979811, 368770, 732385, 843994, 800285, 751971, 654026, 864421, 696825, 1251357, 429827, 843951, 495014, 797922, 945182, 649739, 774264, 628534, 646057, 869373, 443042, 1018715, 521647, 697492, 771620, 756332, 743462, 503859, 511064, 771136, 500337, 886977, 351610, 421838, 527641, 873161, 595865, 474365, 658399, 249664, 457781, 497977, 733256, 387514, 661849, 457388, 533236, 557238, 466349, 825521, 645811, 652123, 750193, 712641, 473429]
10996D73429j12522O3767P0785J35731p1776M0483L18382J00559l48221L13669
10986I84286o2444j62812L37530J16376k74221K79926L19170m9115R7632K64533
10976A850861J44153J26480P27448j35792J70055m8863J73816l9402l04908l74929
10966B288919M6806k56568J9815j71646n4975M65801m24172K42953O5860L4046
10956B256839k29939l71378j07311j61366k07038m08669r088j71675K82085l50991
10946E21469M36272m21030k40045J7293k3938G0693J38205K10986A97492D7068
10935B60335B7379J32144K8410K4440l0071A1789K06083r2659B7312a3759B55874
10923i3116D70623g1336A33317K9330a94791A29546a81321P7036I2619k7436p22
$$ y = [473429, 360907, 424674, 495459, 631190, 559414, 599897, 918279, 1018838, 670617, 984286, 921842, 759030, 1096560, 1212936, 938715, 1218641, 1537811, 1488696, 1586328, 1850861, 1995014, 2121494, 2848942, 2713150, 2883205, 2834342, 3008158, 2968756, 2663848, 2288919, 2335725, 2079157, 2098972, 1927326, 1872351, 2338152, 1913980, 2156933, 2222793, 2256839, 2026900, 1655522, 1548211, 1386845, 1179807, 771138, 762050, 590375, 872460, 521469, 957741, 536711, 296666, 313959, 290021, 70693, 208898, 419884, 197492, 47068, 260335, 27379, 159523, 187933, 212373, 182302, 11789, 217872, 125213, 27312, -13759, 255874, -93116, 470623, -71336, 133317, 162647, -194791, 129546, -181321, -104285, 92619, 65183, 64461]
10912F4461b78511a4923I1844b45616A9252N0768A2855d01483A07307G534K56835
10901B64369d88497A97664b91917J06952B1812a59914p5964B65691a79141j41804
10891c20945k3106a66911b6765q694A21528Q5857D6780a85427e5514A52529f2319
10879A821R1454a77626A70642G9441N6010F4386J89354b3186k05A44351E2986
10867F9234b27285d2832a2679I8858c16983A29759l2455a01378M8886o5452E6827
10855i8715B10942o9688d9116K0195a1495k7111F4543f8207G150h2727D8721J11045
10843A59766B5682b7329B46458A01254a30841c7559j9939m4774D9112a57452I8059
10831b01299D21591h0343I7714k0666a05733B80741a30825D2222L3818J20753
$$ y = [64461, -278511, -14923, 91844, -245616, 19252, 70020, 12855, -401483, 107307, 7534, 264369, -488497, 197664, -291917, -184965, 21812, -159914, -235878, 265691, -179141, -320945, -344051, -166911, -26765, -35459, 121528, 207385, 46780, -185427, -55514, 152529, -62319, 1821, 93275, -177626, 170642, 79441, 135451, 64386, 253740, -23186, -23391, 144351, 52986, 69234, -227285, -42832, -12679, 98858, -316983, 129759, 97304, -101378, -52492, -117944, 56827, -98715, 210942, 141254, -49116, -28921, -11495, -38606, 64543, -68207, 7150, -82727, 48721, 159766, 25682, -27329, 246458, 101254, -130841, -37559, -57498, -102272, 49112, -157452, 98059, -201299, 421591, -80343, 97714, 77048, -105733, 280741, -130825, 42222, 76040, 196793]
10821A96793C5475a27187B15684c1267o3379L4920j1619l6973L1456l53238G4278
10809a91430B34512a37534I8692b93341a28462o5455A07158b34924d397r1957
10799i6354C910J53616d26533a82376E1183a19968D694a20225A43621A7646R6635
10788A14281b20846n7238e1822G1044a96987B01360c36429A78483b2656C44453
10777e9019C59226f5458r3210o6904I2157C6033K01018E1648a32529A47095C2487
10765b12494i558j17973A31930g4345I1641C4042b89695J08353O5196R784A1566
10753b96366E2902j0719a52900e0110m4527j9863n1595H2522j4154L7048a11671
10741f6321j8316B19389c5196q9116j41295r5786C4986P0293f2301A06765c34047
$$ y = [196793, 35475, -127187, 215684, -31267, -94646, -59726, -71345, -108318, -76862, -430100, 74278, -191430, 234512, -137534, 98692, -293341, -128462, -193917, 107158, -234924, -4397, -96354, 3910, 157526, -426533, -182376, 51183, -119968, 4694, -120225, 143621, 17646, 114281, -220846, -278084, -51822, 71044, -196987, 201360, -336429, 178483, -22656, 344453, -59019, 359226, -65458, -158668, -225572, 92157, 36033, 237051, 51648, -132529, 147095, 32487, -212494, -9558, -127531, 131930, -74345, 91641, 34042, -289695, -181342, -116146, -106362, 11566, -296366, 52902, 42183, -152900, -50110, -94637, -114500, -166095, 82522, 68368, 105416, -111671, -66321, -84637, 219389, -35196, -124312, -265607, -361393, 34986, 105279, -62301, 106765, -334047]
10729d48672a73164c1447D0577N2094K4014a57742O448A54518n6797b69364A62846
10717a98887C5093a44301j93581J53775P2052A02914b82872J03094j23177A6059
10706A93461c03543A22551E5870a73166A01375d7186o7310K8420P931B78201g7907
10694H3286J1783l1673J53243a71512F9182J28208a76717J8865k548e7737j05388
10683a63125d98G4680J05256l7599a55790J2216j95004E52b05502l9588J3989
10672b31101a04283I5637L1054D5076B077b95265H2510l7272b508A55707a88122
10660b5903m82296O2703B13523B6237a03997k16139C5781d1220k36867B91517
10649a07112c286k14865m1803A01711r383a33452A9138N6054a71364k4891I1600
$$ y = [-448672, -173164, -31447, 40577, 92671, 116685, -157742, -151294, 154518, 97721, -269364, 162846, -198887, 35093, -144301, -337882, -184107, -112055, 102914, -282872, -179778, -302955, 16059, 193461, -303543, 122551, 55870, -173166, 101375, -47186, -114496, -86076, -78145, 278201, -77907, 83286, 95069, 63396, 216639, -171512, 69182, 197390, -176717, -157852, -160400, -57737, -163125, -498, 74680, 179936, 142337, -155790, -143574, -338578, 552, -205502, -245090, -231101, -104283, 95637, 126691, 45076, 2077, -295265, 82510, 45238, -2508, 155707, -188122, -25903, -508199, -445496, 213523, 26237, -103997, -320136, 35781, -41220, -278087, 291517, -107112, -3286, -218151, -259954, 101711, 92328, -133452, 19138, 75192, -171364, -196255, 91600]
10637A44005e43037J96772C18105A05303b33214A331a48460f3090A43762c1147
10626F101h2120K6670j28695A71433e56370a24552M2304k4775A79609c16514h8812
10614f1106j26633M6922A68799h4364L0387b5508j95354R4882l494H4792b4949
10602a59579g3657D7110J41154h1140H0363i2206H6749b31459J08764n2812d7181
10590a140q6258k04837D9924J31271K40251a74713q0999j09787J14681b9036k45084
10579b74120g1378P515C4335N94c1403H3138a54176e654o8752A87851a64514E4485
10566A37141i1209j0471o9699B26147H9472j244i7905B24479e3454n9728J0045
10555a03137E639a4499l05934R0589B71973a121k01798a1703r6936r5862d8685
$$ y = [144005, -543037, -346265, 318105, 105303, -233214, 1331, -148460, -63090, 143762, -31147, 6101, -82120, -55450, -184145, 171433, -556370, -124552, -82248, -107023, 179609, -316514, -88812, -61106, -187739, -140817, 168799, -84364, -53977, -25508, -220862, -125980, -129474, 84792, -24949, -159579, -73657, 47110, 188264, -81140, 80363, -92206, 86749, -231459, -122695, -175507, -47181, -1140, -87398, -292235, 49924, 181195, 421446, -174713, -255712, -365499, -250818, -29036, -274120, -71378, -63863, 34335, 34929, -31403, 83138, -154176, -5654, -74406, 187851, -164514, 54485, 137141, -91209, -101680, -171379, 226147, 89472, 88228, -97905, 224479, -53454, -113182, -103137, 5639, -14499, -320433, -229844, 271973, -1121, -202919, -11703, -108639, -204501, -48685]
10543A67835O9460c04369C8066H271J11383b82811G6336A4731e100A004R1006
10532I2010l4949a42516F9718K18760h4237r5289C5448K1898b05509P7920j13973
10521b41562j01070G6173a50011C5204G257M07962A18011a05588A40246P1543
10511B11789d42B8304O6339b59809o6818a24598j07652f7075q1551A55L0109g7098
10498a61952d377E0716c1431l27285b7380p0050r0454b5590A84932e9954j63859
10487b23813j2624f0306B29084n051C5644K56452J30281o4704p885M8974F095
10475B6694J04556R1494b35781K6571J01483L3266j75047b8466o223k5247B84750
10463A62077f5378gA44568E74O5693J5692N235r678a40087D4408b11202Q0500
$$ y = [167835, 237295, -304369, 38066, 8271, 119654, -282811, 76336, 14731, -5100, 1004, 92010, 57061, -142516, 69718, 288478, -84237, -179526, 35448, 57346, -205509, -127589, -241562, -342632, 76173, -150011, 35204, 7257, 415219, 118011, -105588, 140246, 211789, -442, 28304, 94643, -259809, -326627, -124598, -232250, -67075, -148626, 155, 30264, -77098, -161952, -4377, 50716, -31431, -358716, -27380, -97430, -187884, -25590, 184932, -59954, -223813, -236437, -60306, 229084, 224033, 35644, 292096, 422377, 357673, 349788, 398762, 6095, 26694, 131250, 222744, -235781, -209210, -107727, -74461, -249508, -28466, -34689, -59936, 284750, 162077, -65378, -7, 144568, 574, 66267, 81959, 87194, 77516, -140087, 44408, -211202, -130702]
10451a30702N9551q4020p9998H4500R318a79972E2268g0304j01027f865F6370
10439F4631L8113b84215H2772a53315i518l6675B12816p0016F993b18482A05938
10427A66795e0140A02694K02417B5943K1796b70585B2054f378A79K86809a62825
10415i2530j84004A56585L05130d6881A23743K42782a96769B35830b05752P8258
10405a27494A91432M9228q7855b02594A34818B9517b94415A18882j992J18229
10395B35119N8699M9137l0430b63399C45577g4343J3004A58509e1806B38717a47398
10383A73333n0497o0063J776L79048B05730L6231r4050K13927p8281L3069f9536
10371A82671P0713P945K98902p9542j22829J02025J99701o6413j09285H3179K9794
$$ y = [-130702, -71151, -155171, -235169, 84500, 93818, -179972, 52268, -70304, -171331, -6865, 66370, 64631, 102744, -284215, 82772, -153315, -9518, -46193, 212816, 142800, 6993, -218482, 105938, 166795, -50140, 102694, 305111, 25943, 47739, -270585, 22054, -6378, 179, 286988, -162825, -92530, -276534, 156585, 461715, -46881, 123743, 366525, -196769, 235830, -205752, -127494, 191432, 240660, 152805, -202594, 134818, 29517, -294415, 118882, 116890, 235119, 293818, 342955, 312525, -263399, 345577, -74343, -61339, 158509, -51806, 238717, -147398, 173333, 122836, 62773, 64549, 443597, 205730, 241961, 147911, 361838, 283557, 316626, -69536, 182671, 253384, 261329, 560231, 480689, 357860, 459885, 659586, 593173, 483888, 83179, 112973]
10360A12973J48920M4266j6561J47364j53323E7569K75704P7855A49245M73845
10350F23090b687G27764k91008n9557A84358q8349M90802A68477N2956o3085L24127
10339D82475a02734A23761J08544k599I4676m4421K30091I1180g9049c9119G5736
10327a1443l26423e6877l4009B21608Q4727A52359a06396c5274D07745A06181
10316b5379B56733D6531J52429O3810L6067A26814J09488E4480R9239J65925b73160
10304b65542d4725j02645L1284A34119a99644P4318a7865j13306C49821a17642
10293b18555A43322c8089l3643a4007j82616O2035r4681q1794f035n8699B5754
10281B90158B8263K09709o003h1771k88613C5386J40389A6248M330R0473L1937
$$ y = [112973, 261893, 306159, 289598, 436962, 283639, 57569, 333273, 411128, 149245, 623090, -2687, 727764, 436756, 377199, 184358, 96009, 586811, 168477, 221433, 158348, 482475, -102734, 123761, 232305, 229706, 94676, 50255, 280346, 91180, -79049, -39119, 75736, -11443, -337866, -56877, -90886, 221608, 306335, 152359, -106396, -35274, 407745, 106181, -25379, 256733, 46531, 198960, 262770, 298837, 126814, 236302, 54480, 153719, 319644, -273160, -265542, -44725, -147370, -116086, 134119, -199644, -125326, -17865, -131171, 349821, -117642, -218555, 143322, -38089, -71732, -14007, -196623, -134588, -229269, -311063, -6035, -64734, 25754, 290158, 28263, 237972, 231969, -81771, -370384, 35386, 175775, 16248, 20578, 111051, 142988]
10270A42988a28485j10823l2421A01295B6591K6477a62587I6559M23006k47932
10260B71633q5702J58868K1673N7626j02792n9588K51854F1143e4290H4011G10
10248B90642I4836R0441h399k3038j47340C2988a50523K5148B2404O8011i6639
10236a75347Q3898N805j08214k63027A87244f0744k67851a02295j12635B95291
10225H780R547M9577b19513m2899g1019H6357J01040l7094h8707j55204A02013
10213b18876A0530f9819m5027L3875l6785k26170B43346i3293C3981c3605p2252
10202a05857D148J38238b14246e7177J6355F6566k8091f480k88435m8655A64143
10190A8928K70320c79383A46155Q2534a25186A5762a22436B9937N8703c44700
$$ y = [142988, -128485, -239308, -271729, 101295, 26591, 53068, -162587, 96559, 519565, 271633, 185931, 344799, 366472, 424098, 321306, 261718, 513572, 61143, -54290, 84011, 710, 290642, 94836, 185277, -8399, -31437, -178777, 32988, -150523, -125375, 22404, 90415, -96639, -175347, -91449, -85644, -193858, -456885, 187244, -60744, -328595, -102295, -214930, 295291, 8780, 18327, 67904, -219513, -262412, -71019, 86357, 187397, 150303, -88707, -243911, 102013, -218876, 10530, -69819, -114846, -80971, -117756, -343926, 243346, -93293, 33981, -33605, -105857, 4148, 142386, -214246, -57177, -40822, 66566, 38475, -6480, -294915, -343570, 164143, 18928, 289248, -379383, 146155, 228689, -125186, 15762, -122436, 29937, 88640, -344700]
10179B28717F3046Q257K6166j6728a87828A80176G0758o518e20963A10183m3392
10168F6791d769j46364K8800A09308J12927P2464C857a41274A54559b91614A41960
10156e3111n7593n3506O7685F3057M13247h2874j52329c973A15470i2740r9377
10145a92117C1441a60502j03810i7107j18386E2907b71787a03796B29239J34705
10135C63944c3992A03358f6016l3396n19645a5317j06434l1111A15973a18224
10124A47441F3427Q3454D5095K8483c9618A28768n5247b75792A54418c7137j08284
10113a45421K4832L9237l31922J55208A71699G2323g1615n2749A51560A6516b47872
10101d2840l28852e7172m439j25566i1995c5100j60816b83I2126M8006F2558a0002
$$ y = [228717, 63046, 71303, 97469, 80741, -187828, 180176, 70758, 64240, -520963, 110183, 66791, -4769, -151133, -122333, 109308, 222235, 294699, 3857, -141274, 154559, -291614, 141960, -53111, -110704, -164210, -96525, 63057, 476304, -82874, -235203, -3973, 115470, -92740, -192117, 31441, -160502, -264312, -97107, -215493, 52907, -271787, -103796, 229239, 363944, -33992, 103358, -66016, -99412, -619057, -15317, -121751, -152862, 115973, -118224, 147441, 63427, 146881, 45095, 73578, -39618, 128768, 73521, -275792, 154418, -37137, -145421, -120589, -81352, -413274, -258066, 171699, 72323, -71615, -124364, 151560, 16516, -247872, -42840, -371692, -57172, -61611, -187177, -91995, -35100, -195916, -283, 92126, 140132, 62558, -10002]
10088c8105j67464a1978A50401a72377L5409A17235a05105j75404J0486J27078
10078a42945A228b02780f7322p3454A6168J62865a51442j3103M8346j2687c1985
10066A30614J13585b50763C39230a55274A50945a46662m8224c6488o3863M3763
10056e6588H0208J4894b32657D203b37654A12327C0470b0126j9728j57632k792
10045b00278p5657P7124p9583B22541j00987e7159j482j48095I7614B3068a71243
10033B30540b1813k39583J22833C4842H744R3413P304M2029e73175c2673A04563
10021A89647c74523a2356l32566a11352E294d59946a20542D7493A4190a2910k56821
10010b69731M5416J3041D5846i5618j55551D6059J9989a60076B45852b10889p2423
$$ y = [-38105, -205569, -11978, 150401, -172377, -136968, 117235, -105105, -280509, -270023, -142945, 1228, -202780, -67322, -140776, 16168, 179033, -151442, -164545, -116199, -128886, -31985, 130614, 244199, -250763, 339230, -155274, 150945, -146662, -194886, -36488, -100351, -56588, 80208, 95102, -232657, 4203, -237654, 112327, 30470, -20126, -39854, -197486, -200278, -275935, -198811, -278394, 222541, 121554, -57159, -58641, -206736, 97614, 23068, -171243, 230540, -21813, -261396, -138563, 34842, 8744, 102157, 109461, 151490, -573175, -32673, 104563, 189647, -374523, -12356, -344922, -111352, 5294, -459946, -120542, 47493, 14190, -12910, -269731, -224315, -211274, 45846, -95618, -251169, 46059, 66048, -160076, 245852, -210889, -283312]
9999b83312J33445a5211k91062a48938B2329a36486n9439Q1454q0569h2514A5263
9987b32679O979G909d49553A01880b14665A26939h0000B993J04444J48156g4769
9975H9753R6157a2268B0967b71873a11000d7919F8657j3182b88460J34529n349
9964a59280k2077l5622R7175A29284b18581A0745a71445b8326a3277C7463b41350
9952B42941D6991a60327A52190L800a80394E3913A8247O5148e0209D578a01313
9940e1921a1197m5851j32746K1304O6682j18728J02592M4591J8080r0693k095
9929a48061o6922r5577i5679A63861e2000E2913d51545G7004o876D245c3463k33137
9917b66600a7345l9045c081j83687B35873C3656L76311I9776D8985K24483b90109
$$ y = [-283312, -149867, -15211, -306273, -148938, 22329, -136486, -195925, -114471, -195040, -82514, 15263, -232679, -225700, 7909, -449553, 101880, -214665, 126939, -80000, 2993, 107437, 255593, -74769, 89753, 185910, -12268, 20967, -271873, -111000, -47919, 68657, 55475, -288460, -153931, -159280, -181357, -216979, -119804, 129284, -218581, 10745, -171445, -28326, -13277, 37463, -241350, 242941, 46991, -160327, 152190, 155990, -180394, 53913, 18247, 83395, -50209, 4578, -101313, -51921, -11197, -57048, -189794, -168490, -101808, -220536, -117944, -73353, -55273, -145966, -148061, -214983, -310560, -95679, 163861, -52000, 52913, -451545, 77004, 70128, 4245, -33463, -266600, -17345, -56390, -3081, -186768, 235873, 33656, 409967, 99776, 48985, 273468, -290109]
9905b6641j20784A683a27517G3476g6141B554a93537A3045K80434g8031k26395
9894c04426A2708b09064A32158J42299c27627F9286k3188a52737D7115J02198
9884A49313c26745B49652b13113E9869b79956D7515f1810j59697K8529j86347
9874c79325a00574F1341e0519o4886j05940J9431m43874f231A76526d39099a08739
9862d1843H186a11154A7796M4217N6053c4632p543a8210H2756K03962b10020Q4743
9850a25277d204B87166a0183j34033A30277A7531a36300k858k16622b6164j18293
9839a44457M3746c7706j75659g3783p3098q3993D9927J79915a68986l2188m5540
9828b46714j29799A08390K4616b90577G5725c70177E5294r562g3698A04680k3583
$$ y = [-26641, -147425, 1683, -127517, 73476, -76141, 2554, -193537, 13045, 293479, -78031, -304426, 12708, -209064, 132158, 274457, -327627, 69286, 46098, -152737, 47115, 149313, -326745, 249652, -213113, 59869, -279956, 47515, -61810, -221507, -192978, -379325, -100574, 61341, -50519, -115405, -221345, -201914, -645788, -6231, 176526, -439099, -108739, -41843, 8186, -111154, 17796, 62013, 118066, -34632, -42175, -18210, 82756, 286718, -210020, -125277, -4204, 287166, -10183, -144216, 130277, 17531, -136300, -139158, -355780, -26164, -144457, -100711, -37706, -213365, -73783, -146881, -230874, 49927, 229842, -168986, -201174, -246714, -376513, 108390, 133006, -290577, 75725, -370177, 55294, 45732, -73698, 104680, 81097]
9817H1097i8256A74460a15014L6961p7040q1572A88951q3403J38576c37744C877
9805a79149P6782o5727j96794J57565b06l06648h2480B50933A11569E1107b11132
9793A44401a32077j46572J06706c8555A97841c1779a3352A1289b44228J12283
9783a31945c6694H5071k7445d15731a61587m1563g951k61029i3189A72402a97308
9771b18211h4557J4504j9851j10895A21463b77552b7426l94157a94651m540h3175
9759d292m7008k4168j27452b0729C3433b14392a02693A88716b65955O7277g2093
9747b01351G271N2894h6651n6058b3886j68749B698f3070j78874J6804G1857O6665
9735A38522d6537B6283a34899k16560c2334j7184j27843E1050a42142N9515a9093
$$ y = [81097, -98256, 174460, -115014, -78053, -155093, -236665, 188951, 105548, 244124, -337744, 3877, -179149, -102367, -168094, -364888, -207323, -206, -306854, -82480, 250933, 111569, 51107, -211132, 144401, -132077, -278649, -171943, -38555, 197841, -31779, -13352, 11289, -244228, -131945, -36694, 85071, 57626, -415731, -161587, -203150, -7951, -268980, -93189, 172402, -197308, -218211, -84557, -70053, -89904, -200799, 121463, -277552, -27426, -421583, -194651, -199191, -83175, -4292, -51300, -75468, -202920, -20729, 33433, -214392, -102693, 188716, -265955, -198678, -72093, -201351, 7271, 60165, -86651, -142709, -23886, -192635, 2698, -63070, -241944, -225140, 71857, 138522, -46537, 26283, -134899, -351459, -32334, -49518, -177361, 51050, -142142, -82627, -19093]
9723a34042m0038c9414A94815b55132G2071b109A27854a0801B27392j11542a96965
9711g0928b9778A4317a3975A5327R71a58006o0264A72839A7862M5153B1370i6111
9698c60029a33295G7552M261d8698j15571a6417B1942J01316a54052A92398a01705
9686g0431H4940l4786p905c54624F2467i1360A10154a74043r7713J14786d2939
9674a97831C3945Q506J23528e3738H0590P4517d6320j21764n4865k1796f9348
9662A66051G1393J262h8344J4366J0252D962h6324j31235g3821j61493j0946E7774
9649b0335j89693A17914j6556M8337K0966c4973m12098F6232d4024q7032a3825
9637B236f9781l77878a12763A45766J73622B6446a02776A86992H4910Q4458i982
$$ y = [-134042, -174080, -39414, 194815, -255132, 72071, -2109, 127854, -10801, 227392, 115850, -196965, -70928, -29778, 14317, -13975, 15327, 16298, -158006, -218270, 172839, 17862, 63015, 21370, -96111, -360029, -133295, 77552, 81813, -48698, -164269, -16417, 21942, 123258, -154052, 192398, -101705, -70431, 84940, 50154, 42249, -354624, 62467, -91360, 110154, -174043, -271756, -156970, -42939, -197831, 33945, 42451, 165979, -53738, 80590, 155107, -46320, -168084, -222949, -244745, -69348, 166051, 71393, 72655, -88344, -73978, -63726, 4962, -86324, -217559, -73821, -235314, -246260, 57774, -20335, -210028, 117914, 101358, 149695, 170661, -34973, -447071, 66232, -44024, -131056, -13825, 2236, -69781, -447659, -112763, 145766, 319388, 26446, -102776, 186992, 84910, 169368, -9982]
9625A79651b2915p4826A61701g9080k86806J30301H9677d9165j11827c8431l35156
9614c73587A30448L5676l1561o568F2676c90363B4905a6134E954J31180C8602
9602a27829j1113A13500a0783k86310h2537F5101M8799b03409J8581h4273j92816
9591b77089g3228j30479o4920F2029B8608J06562h8105B5720b84768e0964j33662
9580a84626P2297d7816m7925B81589c3580j1590Q618j96516C1678b0647j48931
9569a69578L8500b94k8866l0491I4075a91430A14982g3557L4644k89441A06786
9557I9292J31542g1111j6326k17079e9743o4387n1200F8506J2002a80069O126
9546a73943k5656R5725l9623A31361b20354j1765J01163B2310a18836R791B91123
$$ y = [179651, -22915, -97741, 161701, -79080, -365886, -235585, 89677, -49165, -160992, -38431, -373587, 130448, 166124, 134563, 127995, 62676, -390363, 24905, -16134, 5954, 137134, 38602, -127829, -138942, 113500, -10783, -297093, -82537, 65101, 113900, -203409, -184828, -84273, -277089, -73228, -203707, -268627, 62029, 28608, 135170, -88105, 25720, -284768, -50964, -184626, -112329, -47816, -95741, 281589, -33580, -45170, -36552, -233068, 31678, -20647, -169578, -131078, -294, -29160, -59651, 94075, -191430, 114982, -73557, -38913, -328354, 106786, 99292, 230834, -71111, -87437, -304516, -59743, -124130, -175330, 68506, 80508, -180069, -173943, -199599, -103874, -143497, 131361, -220354, -232119, -130956, 22310, -118836, -109045, 291123]
9534i8198j53254N136e8761A08469c02756j13401H9381C9596c66735G9863k54
9523G9609f8080c77j75030A08600c07471b2365l53589A87416a86976H381K44811
9512B53192i7060L0449o1881A252a54949j37517a39137l11848F9706j9547b88727
9500d4153o09A98076a17482F499c26925J3825i8808A35695b4946j69160i6416
9488E6342g5595j33387F267b47567M2529R5122D2084K0335a92097p8625a7209
9476e661K760k21236j32365D2156J16979p6527a10419A76224L5744f489c42r7568
9464i7910k52550O4186h1712l7313m40515I8606h0565b1883j06970G4784J11106
9453A85890c20522m8078a71760A29866a58451b8910k32822r6316R1655g2086J5717
$$ y = [-98198, -251452, -246316, -58761, 108469, -302756, -416157, 89381, 39596, -366735, 79863, 79609, -68080, -377, -175407, 108600, -307471, -22365, -375954, 187416, -186976, 8381, 253192, -97060, -66611, -128492, 1252, -154949, -292466, -139137, -450985, 69706, 50159, -288727, -44153, -44762, 198076, -117482, 6499, -326925, -313100, -98808, 135695, -24946, -194106, -96416, 56342, -75595, -208982, 6267, -247567, -205038, -109916, 42084, 62419, -192097, -270722, -17209, -5661, -2901, -224137, -356502, 42156, 159135, 82608, -110419, 176224, 211968, -6489, -342, -97910, -350460, -286274, -81712, -119025, -559540, 98606, -80565, -21883, -128853, 74784, 185890, -320522, -368600, -171760, 129866, -158451, -28910, -261732, -358048, -266393, -72086, -56369]
9442e6369j24830g7689a7925q5482H5595b6542A27216l0110a25047B46c38895
9430h1409k3671B36633f1969A30986C6644b24043I3938J84531a32599C5214J44132
9419A79346a37027k01601E0192J54669j00544K1704b2272k58516d2433I1029a18882
9407a88890L011i1214F474J64255b82270C42747i946k4473p0589E583a29752D3570
9394h9228j1084A78747a95994K0500e4556n1527B47711C8963N05363I3024a66443
9382b81615d7296D2419d33379I4249d27488A3909a30731O1926A81676c20430C1257
9370c11734A5024K2352C707J45197h9753j63588a13927p0486k6761M4420k5558
9359a92312A50720i4871o1414E3779P3199c41049A80456a84939N2278A36422a02430
$$ y = [-56369, -181199, -77689, -17925, -103407, 85595, -26542, 127216, 97106, -125047, 246, -338895, -81409, -105080, 236633, -61969, 130986, 36644, -224043, 93938, 278469, -132599, 35214, 179346, -137027, -338628, 50192, 204861, 104317, 126021, -22272, -280788, -42433, 91029, -118882, -188890, -185879, -91214, 6474, 170729, -282270, 342747, -9946, -34419, -105008, 5583, -129752, 43570, -89228, -100312, 178747, -195994, -175494, -54556, -106083, 247711, 38963, 544326, 93024, -166443, -281615, -47296, 42419, -433379, 94249, -427488, 13909, -130731, -68805, 181676, -320430, 31257, -311734, 15024, 37376, 3707, 148904, -89753, -253341, -113927, -184413, -211174, -166754, -192312, 150720, -94871, -156285, 53779, 126978, -341049, 180456, -184939, -132661, 136422, -102430]
9347d15304E2154g9170k56032C5681a23606j97393C80086a10756B36c3621j19920
9336a53541c9233E2053C863g3760C9906L6058A1196g242l67974B1586a80271l46968
9324e27239G6990L5361n5542K642J60402d13445Q6265e6356I6932K7760i9572
9312B84815a93617l1698O5076I8849h6321A6258c1882j46739B79268I7105J41031
9301B38136D4822f7852l2702k07172i4299m16351C14767f8036A2877J50371D8485
9289C80135D2774b82027J39762l21526K29787J04079M6742A32427o481k1764H510
9277A45274b12663R1376a3341k05858E3875c03486i4365L9145q6039A80186D7087
9265A13166a7935r8566F6564a205l6015j30520g3767D8276b06388C09512b94406
$$ y = [-415304, 52154, -79170, -335202, 35681, -123606, -320999, 380086, -110756, 236, -33621, -153541, -39233, 52053, 3863, -73760, 39906, 75964, 11196, -7242, -375216, 21586, -180271, -527239, 76990, 112351, 56809, 59451, 219853, -413445, -327180, -56356, 96932, 124692, -99572, 284815, -193617, -225315, -160239, 98849, -86321, 16258, -31882, -178621, 279268, 97105, 238136, 44822, -67852, -100554, -307726, -94299, -510650, 314767, -68036, 12877, 163248, 48485, 380135, 42774, -282027, -142265, -463791, -234004, -129925, -83183, 132427, 125946, 104182, 8510, 145274, -212663, -121287, -13341, -219199, 53875, -303486, -94365, -55220, -141259, 180186, 47087, 113166, -17935, -116501, 66564, -1205, -37220, -167740, -73767, 48276, -206388, 309512, -294406]
9253b24191l72B0189Q516h8285d3440j16241A97009a99836F379K1335J95733e242
9240a80739I2841M6921d6945B57810H5914K38703a72186A2754b43057j10938I8625
9228a69984A31726b88423O5445E5129a98289e803l4308j98407j42188A08912a52100
9216F5321f2722A84276c02294D4546J7763d4553j42539j97397C47543I1627j0222
9205H1405m041k0762a25104D2270M3895a15349A97994a76498L5135B2587g5462
9193a11303b443o7697A7629a30567B20292g7689k37215a26644G006P1397e4799
9181c00349h5386B70476F0362J8653c00107P5657R4276L0588o7128J2548B2245
9169a00395l16852a37340k07065I279M50K7896a25765f2296D648a47j59683p8466
$$ y = [-224191, -224563, 20189, 28705, -88285, -43440, -159681, 197009, -199836, 6379, 27714, 223447, -5242, -180739, 92841, 139762, -46945, 257810, 85914, 324617, -172186, 12754, -243057, -353995, 98625, -169984, 131726, -288423, -222978, 55129, -198289, -5803, -40111, -238518, -380706, 108912, -152100, 65321, -62722, 184276, -302294, 44546, 62309, -44553, -187092, -384489, 347543, 91627, 81405, 77364, 56602, -125104, 42270, 86165, -115349, 197994, -176498, -141363, 22587, -75462, -111303, -2443, -70140, 17629, -130567, 220292, -77689, -314904, -126644, 7006, 78403, -54799, -300349, -85386, 270476, 60362, 79015, -300107, -224450, -130174, -99586, -166714, -154166, 22245, -100395, -417247, -137340, -344405, 9279, 9729, 37625, -125765, -62296, 4648, -147, -159830, -238296]
9157b38296J12789j37309J26832A66908d15964A87859f2528l5628o0661g6869
9146c12143A06207a14088J3775j57826i9406R799k66776i6332k22518C1319b00047
9134B1806J03843a13060C6852b5717B94128C1726a67732B09114j7140G412K14332
9123B21744b69849A39840b08801p5899c1392q6161d4816A1506O4601b52562j44769
9112c97331a66966J3529O0842A12420c39462d400n3651g891j25277A10437l2681
9101G7756g8511p9901L8151a3329B06316g3276A46823D7348R9222a04098l07023
9090d11121b05129m8166j83482J83867b175k62122C03465a06164A35379a34391
9079b16438F9095a48953e5836G9157L1777b08143j0510k20116a65799A06325b15601
$$ y = [-238296, -125507, -262816, -135984, 166908, -415964, 187859, -62528, -98156, -158817, -76869, -312143, 106207, -114088, -100313, -258139, -99406, -89607, -356383, -96332, -318850, 31319, -200047, 21806, 125649, -113060, 36852, -25717, 294128, 31726, -167732, 209114, 191974, 7412, 221744, -269849, 139840, -208801, -284700, -31392, -117553, -44816, 11506, 76107, -252562, -397331, -166966, -153437, -92595, 112420, -339462, -4400, -58051, -7891, -133168, 110437, 77756, -78511, -158412, -120261, -13329, 206316, -73276, 146823, 47348, 146570, -104098, -411121, -205129, -253295, -436777, -252910, -2175, -264297, 303465, -106164, 135379, -134391, -216438, 69095, -148953, -55836, 79157, 110934, -208143, -218653, -438769, -165799, 106325, -215601]
9067b4681j15177e9583E2344e2769h343B23942F9718c1087l28435D575Q4771c6645
9054b5070D6279c01622h7097k40315A2150h1546A84711b66824D07404d0366k00514
9043b40880B87705b77322k5723J01559E0074d00478g0313E2845A253J28527o2407
9032F7373a99309E9426c0857m4791F4620d3586C08014c60223I1716A6488J80518
9021A97006c93380G1561d8866j94862A56542C1238a76397o5661K7343R972b031
9009i2555l1555j54916A409R2987c34711h3400j19969D71830H569a6795G4857
8997a76979C456a661A4847b976A79321k4589n4547a40254A48700J56360a97466
8985f3539A46254F8037a44076f4601j41159B3299J63770g258D8732c53353C5303
$$ y = [-24681, -139858, -59583, 52344, -52769, -8343, 223942, 69718, -31087, -359522, 4575, 89346, -36645, -25070, 46279, -301622, -87097, -327412, 12150, -81546, 184711, -266824, 407404, -40366, -240880, 287705, -277322, -303045, -201486, 50074, -400478, -70313, 52845, 1253, 129780, 67373, -199309, 59426, -30857, -75648, 64620, -43586, 308014, -360223, 91716, 16488, 197006, -393380, 71561, -48866, -243728, 156542, 31238, -176397, -242058, -214715, -204743, -2031, -92555, -124110, -279026, 1409, 94396, -334711, -83400, -203369, 471830, 8569, -16795, 74857, -176979, 3456, -1661, 14847, -2976, 179321, 154732, 100185, -140254, 148700, 305060, -197466, -63539, 146254, 68037, -144076, -64601, -205760, 23299, 187069, -7258, 48732, -353353, 35303]
8973g2589j2402j3691J5792j45295k9124h8087a7662B39335A8973d056A28138
8961a15228A14811i4596K8826l4101A61314a58696F9636I258c10477c7155b430
8949b9449j00723j11131k5369J2268p8729b3995C73614E4610b22385O8336A68539
8937a47810B8401N14763j5116n5260A0935f9216C38931A06290J81547n3129D767
8925B57532J33675Q10389K855643Q916875k884856A955378D56288j80690M0928
8916C16526O2621g9654j13356e209j99150C9773J10508P7292J29041G4046M6931
8905A20977K29135b02637B18727F0101J06913a83803H1150c12875L1840d7662
8894g7578j34079B39542E7407a73190B81576i8848b4161p4935k29187J25688j65909
$$ y = [-72589, -84991, -98682, -82890, -228185, -257309, -88087, -17662, 239335, 18973, -4056, 128138, -115228, 114811, -94596, -65770, -99871, 161314, -158696, 69636, 9258, -310477, -37155, -2430, -29449, -130172, -241303, -266672, -254404, -333133, -23995, 373614, 54610, -222385, -154049, 168539, -147810, 28401, 543164, 528048, 472788, 10935, -69216, 338931, 106290, 287837, 234708, 4767, 257532, 391207, 1201596, 4057239, 12974114, 10089258, 1955378, 456288, 275598, 316526, 379147, -79654, -193010, -5209, -204359, 39773, 150281, 227573, 356614, 74046, 120977, 350112, -202637, 218727, 60101, 167014, -183803, 81150, -312875, -281035, -47662, -77578, -211657, 239542, 57407, -173190, 281576, -98848, -24161, -99096, -328283, -202595, -368504]
8883c68504c6645k46872A06134a59694p0067r4728a22896A94114e2955j67138
8873b20093d38B52931G0500a43648a141A14231C0284c08228a21563e5877A25007
8861b55291H7195a60731D000g1640r9418k2737j1909I2058a68872l303p148b0049
8848a02804d3982A01065b35564D9849b35169e0797l6363C55648C7947R3101P4076
$$ y = [-368504, -36645, -283517, 106134, -159694, -229761, -324489, -122896, 194114, -52955, -220093, -438, 252931, 70500, -143648, -1141, 114231, 30284, -308228, -121563, -55877, 125007, -255291, 87195, -160731, 4000, -71640, -171058, -193795, -205704, 92058, -168872, -172175, -179323, -20049, -102804, -43982, 101065, -235564, 49849, -235169, -50797, -87160, 355648, 37947, 131048, 205124]
$$ [...]
##END NTUPLES=NMR SPECTRUM
##END=
