
##TITLE=AC1365_HAWAS12179_7155411_SWLinPkv4v
##JCAMPDX= 6.0         $$ Bruker NMR JCAMP-DX V2.0
##DATA TYPE= NMR SPECTRUM
##DATA CLASS= NTUPLES
##ORIGIN= BRUKER
##OWNER= Administrator
$$ 1.72 TOPSPIN		Version 2.1
$$ 2013-01-30 01:19:39.987 -0500  Administrator@X
$$ Compression mode = diff/dup
##.OBSERVE FREQUENCY= 400.02188249412
##.OBSERVE NUCLEUS= ^1H
##.ACQUISITION MODE= SIMULTANEOUS (DQD)
##.ACQUISITION SCHEME= undefined
##.AVERAGES= 64
##.DIGITISER RES= 22
##SPECTROMETER/DATA SYSTEM= spect
##.PULSE SEQUENCE= noesygpps1d.comp
##.SOLVENT NAME= COFFEE_meoh
##.SHIFT REFERENCE= INTERNAL, COFFEE_meoh, 1, 14.96081
##AUDIT TRAIL= $$ (NUMBER, WHEN, WHO, WHERE, PROCESS, VERSION, WHAT)
$$ ##TITLE= Audit trail, TOPSPIN		Version 2.1
$$ ##JCAMPDX= 5.01
$$ ##ORIGIN= Bruker BioSpin GmbH
$$ ##OWNER= Administrator
$$ $$ E:\/data/COFFEE/nmr/AC1365_HAWAS12179_7155411_SWLinPkv4v/22/pdata/1/auditp.txt
$$ ##AUDIT TRAIL=  $$ (NUMBER, WHEN, WHO, WHERE, PROCESS, VERSION, WHAT)
(   1,<2013-01-30 01:19:34.081 -0500>,<Administrator>,<X>,<go>,<TOPSPIN 2.1>,
      <created by zg
	started at 2013-01-30 01:08:03.925 -0500,
	POWCHK enabled, PULCHK disabled,
       configuration hash MD5:
       86 BA 57 50 F2 9D 5C 9B 26 00 A9 28 5F 66 2E 89
       data hash MD5: 64K
       7B F4 1F D0 93 A7 C2 9E D4 1C A3 14 76 5A D3 E3>)
(   2,<2013-01-30 01:19:37.143 -0500>,<Administrator>,<X>,<proc1d>,<TOPSPIN 2.1>,
      <Start of raw data processing
       efp LB = 0.3 FT_mod = 6 PKNL = 1 PHC0 = 0 PHC1 = 0 SI = 128K 
       data hash MD5: 128K
       A2 50 EC 8C 95 32 30 4C D8 6B B5 5F 93 F5 63 DD>)
(   3,<2013-01-30 01:19:38.237 -0500>,<Administrator>,<X>,<proc1d>,<TOPSPIN 2.1>,
      <pk PHC0 = -77.53052 PHC1 = 0 
       data hash MD5: 128K
       E6 73 C5 88 5A F5 26 DB 3D 87 01 33 44 2C 51 0A>)
(   4,<2013-01-30 01:19:38.893 -0500>,<Administrator>,<X>,<proc1d>,<TOPSPIN 2.1>,
      <abs ABSG = 1 
       data hash MD5: 128K
       3B 05 3A B6 0B 3D 49 F5 EF E6 F9 54 38 30 E4 7D>)
(   5,<2013-01-30 01:19:39.096 -0500>,<Administrator>,<X>,<proc1d>,<TOPSPIN 2.1>,
      <abs ABSG = 2 
       data hash MD5: 128K
       CA 7D F6 0C DD 33 44 A0 8B 48 BA D1 FA B7 CE B5>)
(   6,<2013-01-30 01:19:39.268 -0500>,<Administrator>,<X>,<proc1d>,<TOPSPIN 2.1>,
      <abs ABSG = 3 
       data hash MD5: 128K
       A7 FC D9 27 F1 A4 1C F8 16 FA E1 99 A1 AF D1 B9>)
(   7,<2013-01-30 01:19:39.440 -0500>,<Administrator>,<X>,<proc1d>,<TOPSPIN 2.1>,
      <abs ABSG = 4 
       data hash MD5: 128K
       FA AB 5C 2E D8 10 E2 A8 6C 63 5F 4C E6 AB AB 1E>)
(   8,<2013-01-30 01:19:39.628 -0500>,<Administrator>,<X>,<proc1d>,<TOPSPIN 2.1>,
      <abs ABSG = 5 
       data hash MD5: 128K
       0E 04 3E 18 E4 CC C0 98 9B 3C CE 14 4F 7C DA 14>)
$$ ##END=
$$ 
$$ $$ hash MD5
$$ $$ 81 DA C9 67 4C 22 D0 59 DA 04 1E BF E0 1E AD 72
##$RELAX= 
##$RELAX= 
##$RELAX= 
##$RELAX= 
##$RELAX= 
##$RELAX= 
##$RELAX= 
##$RELAX= 
$$ Bruker specific parameters
$$ --------------------------
##$DU= <E:\>
##$EXPNO= 22
$$ [...]
150 150 150 150 150 150 150 150
##$TP07= 0
##$TPNAME0= <>
##$TPNAME1= <>
##$TPNAME2= <>
##$TPNAME3= <>
##$TPNAME4= <>
##$TPNAME5= <>
##$TPNAME6= <>
##$TPNAME7= <>
##$TPOAL= (0..7)
0.5 0.5 0.5 0.5 0.5 0.5 0.5 0.5
##$TPOFFS= (0..7)
0 0 0 0 0 0 0 0
##$TUNHIN= 0
##$TUNHOUT= 0
##$TUNXOUT= 0
##$USERA1= <user>
##$USERA2= <user>
##$USERA3= <user>
##$USERA4= <user>
##$USERA5= <user>
##$V9= 5
##$VALIST= <valist>
##$VCLIST= <CCCCCCCCCCCCCCC>
##$VD= 0
##$VDLIST= <DDDDDDDDDDDDDDD>
##$VPLIST= <PPPPPPPPPPPPPPP>
##$VTLIST= <TTTTTTTTTTTTTTT>
##$WBST= 1024
##$WBSW= 4
##$XGAIN= (0..3)
0 0 0 0
##$XL= 0
##$YL= 0
##$YMAX_a= 6039290
##$YMIN_a= -12812158
##$ZGOPTNS= <>
##$ZL1= 120
##$ZL2= 120
##$ZL3= 120
##$ZL4= 120
##$ABSF1= 14.96081
##$ABSF2= -5.597372
##$ABSG= 5
##$ABSL= 3
##$ALPHA= 0
##$AQORDER= 0
##$ASSFAC= 0
##$ASSFACI= 0
##$ASSFACX= 0
##$ASSWID= 0
##$AUNMP= <proc_prof1d_extract.lims>
##$AXLEFT= 0
##$AXNAME= <>
##$AXNUC= <1H>
##$AXRIGHT= 0
##$AXTYPE= 0
##$AXUNIT= <>
##$AZFE= 0.1
##$AZFW= 0.1
##$BCFW= 0
##$BC_mod= 0
##$BYTORDP= 0
##$COROFFS= 0
##$CY= 15
##$DATMOD= 1
##$DC= 0
##$DFILT= <>
##$DTYPP= 0
##$F1P= 0
##$F2P= 0
##$FCOR= 0.5
##$FTSIZE= 131072
##$FT_mod= 6
##$GAMMA= 0
##$GB= 0
##$INTBC= 1
##$INTSCL= 1
##$ISEN= 128
##$LB= 0.3
##$LEV0= 0
##$LPBIN= 0
##$MAXI= 10000
##$MC2= 0
##$MEAN= 0
##$ME_mod= 0
##$MI= 0
##$NCOEF= 0
##$NC_proc= -2
##$NLEV= 6
##$NOISF1= 0
##$NOISF2= 0
##$NSP= 0
##$NTH_PI= 0
##$NZP= 0
##$OFFSET= 14.96081
##$PC= 1
##$PHC0= -77.53052
##$PHC1= 0
##$PH_mod= 1
##$PKNL= yes
##$PPARMOD= 0
##$PPDIAG= 0
##$PPIPTYP= 0
##$PPMPNUM= 2147483647
##$PPRESOL= 1
##$PSCAL= 4
##$PSIGN= 0
##$PYNMP= <proc.py>
##$REVERSE= no
##$SF= 400.02000971222
##$SI= 131072
##$SIGF1= 0
##$SIGF2= 0
##$SINO= 400
##$SIOLD= 131072
##$SPECTYP= <>
##$SREGLST= <1H.CDCl3>
##$SSB= 0
##$STSI= 131072
##$STSR= 0
##$SW_p= 8223.68421052631
##$SYMM= 0
##$S_DEV= 0
##$TDeff= 65536
##$TDoff= 0
##$TI= <>
##$TILT= no
##$TM1= 0
##$TM2= 0
##$TOPLEV= 0
##$USERP1= <user>
##$USERP2= <user>
##$USERP3= <user>
##$USERP4= <user>
##$USERP5= <user>
##$WDW= 1
##$XDIM= 131072
##$YMAX_p= 400324946
##$YMIN_p= -13866
##$CURPLOT= <Network HP LaserJet P1505>
##$CURPRIN= <$Network HP LaserJet P1505>
##$DFORMAT= <normdp>
##$LAYOUT= <+/1D_H.xwp>
##$LFORMAT= <normlp>
##$PFORMAT= <normpl>
##$SURQMSG= 1
$$ End of Bruker specific parameters
$$ ---------------------------------
##NTUPLES= NMR SPECTRUM
##VAR_NAME=  FREQUENCY,     SPECTRUM/REAL,   SPECTRUM/IMAG
##SYMBOL=    X,             R,               I
##VAR_TYPE=  INDEPENDENT,   DEPENDENT,       DEPENDENT
##VAR_FORM=  AFFN,          ASDF,            ASDF
##VAR_DIM=   131072,        131072,          131072
##UNITS=     HZ,            ARBITRARY UNITS, ARBITRARY UNITS
##FACTOR=    0.0627417313425164, 1,          1
##FIRST=     8223.62146879497, 3138,         -63224
##LAST=      0,             5886,            -62763
##MIN=       0,             -13866,          0
##MAX=       8223.62146879497, 400324946,    0
$$ Real data points
##PAGE= N=1
##DATA TABLE= (X++(R..R)), XYDATA
$$ [...]
61741D79507k685l317m004m389m420m253l867l097k112j360r43m42M08J268J713
61726D48007J826J911J986J989K168K685L054K637J658J092J454K261K882L271
61712D78881L535L387K523J288L35k13q85k122l779n317o243o385n987n504n109
61697D48405m545l697l024l052l546l678l111k390k113k152k029j670j416j453
61683D10529j586j591j498j515j749k051k074j585p95k07p7j66j66j22k46m87
61667C94614o06n61n06m06o6M03N09Rn98n91Q1P04O79J59k53j84L02R47J423J436
61647C97495J122J210K263L732M380L837L123L241L839L964L531L165K833J779
61633D39514r8j810k602k885l311l750l787l683l999m578m690m077l219k589k177
$$ plain form
61741 479507 476822 473505 469501 465112 460692 456439 452572 449475 447363 446003 445060 444618 445026 446294 448007
61726 448007 449833 451744 453730 455719 457887 460572 463626 466263 467921 469013 470467 472728 475610 478881
61712 478881 482416 485803 488326 489614 489949 489736 488851 486729 482950 477633 471390 465005 459018 453514 448405
61697 448405 443860 440163 437139 434087 430541 426863 423752 421362 419249 417097 415068 413398 411982 410529
61683 410529 408943 407352 405854 404339 402590 400539 398465 396880 396085 395878 395801 395635 395469 395347 395101 394614
61667 394614 394008 393447 392941 392535 392469 392872 393381 393390 392792 392201 392282 392986 393665 393824 393571 393387 393689 394636 396059 397495
61647 397495 398617 399827 402090 405822 410202 414039 417162 420403 424242 428206 431737 434902 437735 439514
61633 439514 439416 437606 435004 432119 428808 425058 421271 417588 413589 409011 404321 400244 397025 394436 392259
61618C92259j757j188l76O68J624K055J837J210M07n51j673k842l875m641n159
61603C77998n609o085o337n982n090m210l732l525l446l680m199m368l584k172
61589C15979j135j138k037l143l665l162k075j420j616k010j903j520j355j162
61575B88638n44o7n67j651k055j525j092j286j373q11k88n41j100j095o28m42
61559B73573p31j083j287j381j138k52J020J940K065J527P29J02rL61O99N73J57
61542B76865r3l8K39Q29J802K737L059K802K558K632K715K472J968J319M25o60
61526C01631j404j371r70j134k138l101l032k119j494j718k044j482k27N58K25
61511B80180p13j406j605j494j105l64M21P01L15k29k99J78O25M83j77p45p57
$$ plain form
61618 392259 390502 389314 388938 389606 391230 393285 395122 396332 396739 396188 394515 391673 387798 383157 377998
61603 377998 372389 366304 359967 353985 348895 344685 340953 337428 333982 330302 326103 321735 318151 315979
61589 315979 314844 313706 311669 308526 304861 301699 299624 298204 296588 294578 292675 291155 289800 288638
61575 288638 288094 288027 287460 285809 283754 282229 281137 279851 278478 277667 277379 276838 275738 274643 274015 273573
61559 273573 272842 271759 270472 269091 267953 267701 268721 270661 272726 274253 274982 275084 275075 275436 276135 276708 276865
61542 276865 276772 276734 276973 277802 279604 282341 285400 288202 290760 293392 296107 298579 300547 301866 302291 301631
61526 301631 300227 298856 297886 296752 294614 291513 288481 286362 284868 283150 281106 279624 279397 279955 280180
61511 280180 279467 278061 276456 274962 273857 273493 273914 274615 274930 274701 274402 274580 275205 275688 275511 274766 274009
61494B74009l06K23N53N39P1p31j451j754j682j344o21M47J297J368Q55M21L25
61477B72219L76N44R72J429J458J097Q14O30O7r10j559j285l18O77J197R64P5
61460B78447q30j108r47r80j052l86Q82J482Q34O2L32J205J523J162Q21O77L85
61443B82509J05M11J238J911K131K192K233K061J773J816K358L101L789M363M616
61428C16607M189L015J449J5q05p91l23j12j96L01J803L275L401K410J669J762
61412C37669K039K027K079K307J992O49j083k241k679k923l268l541l521l131
61398C26375k359j318k91L28K11o34j651k045j707j444j836k191j458Q6J051Q69
61382C11986M28M65N07j6m97oJ226K164K456K627K989L221L134L008K931K550
$$ plain form
61494 274009 273703 273926 274479 275018 275089 274358 272907 271153 269471 268127 267506 267953 269250 270618 271473 271894 272219
61477 272219 272595 273139 274111 275540 276998 278095 278909 279539 279606 278696 277137 275852 275534 276211 277408 278372 278447
61460 278447 277617 276509 275562 274582 273530 273144 274026 275508 276342 276404 276736 277941 279464 280626 281447 282124 282509
61443 282509 282614 283025 284263 286174 288305 290497 292730 294791 296564 298380 300738 303839 307628 311991 316607
61428 316607 320796 323811 325260 325275 324470 323679 323356 323244 323048 323349 325152 328427 331828 334238 335907 337669
61412 337669 339708 341735 343814 346121 348113 348762 347679 345438 342759 339836 336568 333027 329506 326375
61398 326375 324016 322698 322407 322735 322946 322312 320661 318616 316909 315465 313629 311438 309980 310066 311117 311986
61382 311986 312414 312879 313386 313370 312873 312867 314093 316257 318713 321340 324329 327550 330684 333692 336623 339173
61366C39173J753J097J081J406J418J038P87J004J491K026K741L739M707N238
61352C68699N442N854O727P741Q435Q675Q602Q402Q206Q003P515O417M823L327
61338D66868K449K243K512L032L374L004J915Q84O05P76M61p71k522m168n326
61323D75336n789n500m733l949l324k694j938j178n80j97m1p1p1K93J234K683
61307D49481M279N546O281O942Q231J0084J1409J1171R455P075M506J693j267
61294E34886l935n944p139p394o751n771n126m835m342l403k479k084k196k449
61280D71038k565k387j763o09R28K466L479L692L503L749M716N671N776N222M914
61265E07830N221N638N717N660N869O388P077P963R171J0634J1918J2309J1309
$$ plain form
61366 339173 340926 342023 343104 344510 345928 346966 347753 348757 350248 352274 355015 358754 363461 368699
61352 368699 374141 379995 386722 394463 402898 411573 420175 428577 436783 444786 452301 458718 463541 466868
61338 466868 469317 471560 474072 477104 480478 483482 485397 486281 486886 487662 488123 487352 484830 480662 475336
61323 475336 469547 464047 459314 455365 452041 449347 447409 446231 445651 445454 445413 445342 445271 445564 446798 449481
61307 449481 453760 459306 465587 472529 480760 490844 502253 513424 522879 529954 534460 536153 534886
61294 534886 530951 525007 517868 510474 503723 497952 492826 487991 483649 480246 477767 475683 473487 471038
61280 471038 468473 466086 464323 463714 464642 467108 470587 474279 477782 481531 486247 491918 497694 502916 507830
61265 507830 513051 518689 524406 530066 535935 542323 549400 557363 566534 577168 589086 601395 612704
61252F12704R243P112N546M258K939K075K134K360J448o39k577l591m375n701
61238F32936p078p525p057o584o625o858o838o565o230n763m899l643k458j819
61224E52994j585j080NJ102J486J202Q27N49J51k53j64N45J471K345L213L828
61208E66636L561K288Q05o3l55n77p87n48M42K036L885N712P381Q907J0435J2185
61192F21943J4329J6744J8819J9695J9022J7275J5096J2578R580O507M281L477
61180G79346L818M492M700M086K947J905J113J14j291k553l281l952n049o022
61166G80373o136n860o303p507q507r037r905j1503j3060j3796j3759j3243j2222
61153F49535j0784r351q079o695n067l299j238J210L185L329J397j508m532p767
$$ plain form
61252 612704 621947 629059 634605 638863 641802 643877 646011 648371 649819 649180 646603 643012 638637 632936
61238 632936 625858 618333 611276 604692 598067 591209 584371 577806 571576 565813 560914 557271 554813 552994
61224 552994 551409 550329 550334 551436 552922 554124 554951 555500 555651 555398 555234 555779 557250 559595 562808 566636
61208 566636 570197 572485 573290 573227 572872 572295 571508 570960 571402 573438 577323 583035 590416 599323 609758 621943
61192 621943 636272 653016 671835 691530 710552 727827 742923 755501 765081 771588 775869 779346
61180 779346 783164 787656 792356 796442 799389 801294 802407 802521 801230 798677 795396 791444 786395 780373
61166 780373 774237 768377 762074 754567 746060 737023 727118 715615 702555 688759 675000 661757 649535
61153 649535 638751 629400 621321 614626 609559 606260 605022 606232 609417 612746 614143 612635 608103 600336
61139F00336j1027j3175j3383j2228j0834r709q829q080p017n053k417k00J043
61126D99427J956L207M597N807P066Q460R562J0386J1769J4013J6166J7444J8446
61113F28306K0049K1964K3398K4268K4783K4597K3548K2535K2466K2823K2395
61102H81132K0979J9234J7255J4505J0870O753K328k328o558r567j1468j3130
61090I30005j5044j7005j8741k0096k0798k0743k0396k0350k0614k0765k0496
61079G14957j9632j8070j6143j4586j3639j2782j1703j0778j0111r045p335n858
61067E65275n255m795l632k255j541j227n55K24M62N57J376K695L602M063M751
61052E63745N706O477P267Q526R755J0251J0674J2391J5315J7926J9427K0401
$$ plain form
61139 600336 589309 576134 562751 550523 539689 529980 521151 513071 506054 501001 498584 498384 499427
61126 499427 501383 504590 509187 514994 522060 530520 540082 550468 562237 576250 592416 609860 628306
61113 628306 648355 670319 693717 717985 742768 767365 790913 813448 835914 858737 881132
61102 881132 902111 921345 938600 953105 963975 970728 973056 970728 964170 954603 943135 930005
61090 930005 914961 897956 879215 859119 838321 817578 797182 776832 756218 735453 714957
61079 714957 695325 677255 661112 646526 632887 620105 608402 597624 587513 578468 571133 565275
61067 565275 560020 555225 551593 549338 547797 546570 546015 546239 546701 547258 548634 551329 554931 558994 563745
61052 563745 569451 575928 583195 591721 601476 611727 622401 634792 650107 668033 687460 707861
61040G07861K1378K2229K3098K4556K6504K8154K9286L0499L2078L3697L5267
61029A014607L7054L8977M0639M1894M2469M1661L9656L8561M0494M5112N0543
61018A471667N6220O2870P0234P7089Q3504R1076J01074J14552J34159J63317
61008B425762K03450K54263L16528L92139M82615N91855P30083R09523J134970
60999G441188J402357J701100J998076K207596K198078J871147J261431N51858
60991B0632831l0407l46040l85998k15737Q1835L98931N80947M74950L6380o15923
60981B0611769j267791j742502j979585k013868j910717j726667j505090j278730
60973G186819j067107q77953p14560n79156m70370l83000l12352k56427k13549
$$ plain form
61040 707861 729239 751468 774566 799122 825626 853780 883066 913565 945643 979340 1014607
61029 1014607 1051661 1090638 1131277 1173171 1215640 1257301 1296957 1335518 1376012 1421124 1471667
61018 1471667 1527887 1590757 1660991 1738080 1821584 1912660 2013734 2128286 2262445 2425762
61008 2425762 2629212 2883475 3200003 3592142 4074757 4666612 5396695 6306218 7441188
60999 7441188 8843545 10544645 12542721 14750317 16948395 18819542 20080973 20632831
60991 20632831 20602424 20256384 19870386 19654649 19736484 20135415 20716362 21191312 21227692 20611769
60981 20611769 19343978 17601476 15621891 13608023 11697306 9970639 8465549 7186819
60973 7186819 6119712 5241759 4527199 3948043 3477673 3094673 2782321 2525894 2312345
60964B312345j80893j56066j37692j23722j11456r9808q9539q0792p2261o3285
60954A196831n4739m7251m0436l4475l0614k9183k8824k8444k8350k8623k8071
60943H17821k5967k3369k1488j9945j7946j6026j5264j5441j5382j4626j3636
60932F18731j2699j1811j1279j1470j2000j2015j1205r949q617p399o629o539
60920D97119o729o432n433m314l726l761l976l769k776j282j22R7l50o53m41j16
60904D53336j70m96n29L8Q43J207Q40Q6n19p48p15o00n30n95p27o96m22j54j52
60885D49297l83p64j456k511l433l656l339l150l239l045k240j309q72r06r01
60870D18093n69j0N75J102J665K501L741N055N859N998N992O364O912O947O133
$$ plain form
60964 2312345 2131452 1975386 1837694 1713972 1602516 1502708 1413169 1332377 1260116 1196831
60954 1196831 1142092 1094841 1054405 1019930 989316 960133 931309 902865 874515 845892 817821
60943 817821 791854 768485 746997 727052 709106 693080 677816 662375 646993 632367 618731
60932 618731 606032 594221 582942 571472 559472 547457 536252 526303 517686 510287 503658 497119
60920 497119 490390 483958 478525 474211 470485 466724 462748 458979 456203 454921 454799 454896 454546 453893 453452 453336
60904 453336 453166 452670 452141 452179 453022 454229 455069 455155 454636 453888 453173 452573 452043 451448 450721 450025 449603 449449 449297
60885 449297 448914 448150 446694 444183 440750 437094 433755 430605 427366 424321 422081 420772 419900 418994 418093
60870 418093 417524 417514 418089 419191 420856 423357 427098 432153 438012 444010 450002 456366 463278 470225 476358
60855D76358M817L608K907K870L480M418N059M895M062L262L063L355L626L590
60841E29370L317K919K404J822J216M26p22j949k639k582k254k200k406k477k119
60826E22126j238N5J383K289K708K961L169L109K832K857L384L893L928L835M149
60811E61440M748N167N373N630N933O212O681P326P446O552N412N195N766N916
60797F44797N228M558M446M258L404K336J633R78j05j114j177n35m36j521l045
60782F63705l855l698l321l533m435n422n861n805n919o684p735q243p804o812
60768E84578n902n305m841m428m331m831n770o579o820o597o395o565p015p352
60754E01847p285o933o662o579o277n343m028l057k781k859k829k607k271j895
$$ plain form
60855 476358 481175 484783 487690 490560 494040 498458 503517 508412 512474 515736 518799 522154 525780 529370
60841 529370 532687 535606 538010 539832 541048 541474 540752 538803 536164 533582 531328 529128 526722 524245 522126
60826 522126 520888 520943 522326 524615 527323 530284 533453 536562 539394 542251 545635 549528 553456 557291 561440
60811 561440 566188 571355 576728 582358 588291 594503 601184 608510 615956 622508 627920 633115 638881 644797
60797 644797 650025 654583 659029 663287 666691 669027 670660 671638 671533 670419 669242 668707 668271 666750 663705
60782 663705 659850 656152 652831 649298 644863 639441 633580 627775 621856 615172 607437 599194 591390 584578
60768 584578 578676 573371 568530 564102 559771 554940 549170 542591 535771 529174 522779 516214 509199 501847
60754 501847 494562 487629 480967 474388 468111 462768 458740 455683 452902 450043 447214 444607 442336 440441
60740D40441j793k444l706m577m292l375l064l838n037n787n783n235m465l696
60726C83349k897j898p91m4J10K0L0j11p16j369j388r27q18j334j797j637j194
60709C66588j166j738k518l019k969k406j650j073q11q46j192j757k230k410k474
60694C38329k559k400j875j558j980k569k216q69L44P44Q61J268J548J023j13
60679C27978j088j466j217l11J110K394K865K561K116J994K156K337K248J650
60665C45327N74n26j096r69m02K69Q31J167J249J168J074J115J416J956K488K800
60649C58441L061L637M410M685L997K758J818J505J400R61J33p11j249j534j905
60634C81407k590l409l918l809l170k383j856j739j828j780j528j390j616k009
$$ plain form
60740 440441 438648 436204 432498 427921 423629 420254 417190 413352 408315 402528 396745 391510 387045 383349
60726 383349 380452 378554 377763 377719 377829 377849 377879 377768 377052 375683 374295 373368 372550 371216 369419 367782 366588
60709 366588 365422 363684 361166 358147 355178 352772 351122 350049 349238 348392 347200 345443 343213 340803 338329
60694 338329 335770 333370 331495 329937 327957 325388 323172 322303 322647 323391 324252 325520 327068 328091 327978
60679 327978 326890 325424 324207 323896 325006 327400 330265 332826 334942 336936 339092 341429 343677 345327
60665 345327 345901 345375 344279 343310 342908 343177 344008 345175 346424 347592 348666 349781 351197 353153 355641 358441
60649 358441 361502 365139 369549 374234 378231 380989 382807 384312 385712 386673 386806 386095 384846 383312 381407
60634 381407 378817 375408 371490 367681 364511 362128 360272 358533 356705 354925 353397 352007 350391 348382
60620C48382k124j769j149o37n22q22j121q95k03J77l00j152j431r14k58l9j70
60603C35053k88k50j19J4P3J29L81Q80J369J669J907K037J503R1j223j133K54
60586C42347J407J265M17K4L87R69J356J542J605J584J588J762K170K817L609
60571C64849M258M540M713N377O791Q608J0338J1790J2975J3863J4228J3623J1613
60558D87566Q351M750J590j322m536p637r398r255p900o195m289k112L3J864L581
60543D55091N442P295Q936J0569J2493J4577J6338J7297J7149J5855J3742J1137
60531F05921P906L735j040n416q581j0354j0774r988q636p541o761n669m250l425
60517E35127l651m068l668k565j501o72J79J070J888K807L907M776N131N509O726
$$ plain form
60620 348382 346258 344489 343340 342703 342181 341359 340238 339343 339140 339317 339017 337865 336434 335520 335262 335223 335053
60603 335053 334765 334515 334396 334410 334483 334612 334993 335873 337242 338911 340818 342855 344358 344449 343226 342093 342347
60586 342347 343754 345019 345436 345460 345847 346816 348172 349714 351319 352903 354491 356253 358423 361240 364849
60571 364849 369107 373647 378360 383737 390528 399136 409474 421264 434239 448102 462330 475953 487566
60558 487566 495917 500667 502257 500935 496399 488762 479364 470109 462209 456014 451725 449613 449646 451510 455091
60543 455091 460533 467828 476764 487333 499826 514403 530741 548038 565187 581042 594784 605921
60531 605921 613827 617562 616522 611106 602525 592171 581397 571409 562773 555232 548471 542802 538552 535127
60517 535127 531476 527408 523740 521175 519674 519002 519181 520251 522139 524946 528853 533629 538760 544269 550995
60502E50995R009J2150J6036K0450K4853K9041L3539L8633M3516M7254N0160N3045
60490I28681N5377N5259N1297M3637L3045K0048N295r972k4382l7000m7234n4634
60478A019417n8942o0128n8381n4374m9414m4684m0285l5559l0392k5583k1800
60467E39875j8846j6274j4133j2661j1642j0655r697r039q512p462n605l588k366
60454D09395k222k605k914l068l238l394l371l218l064k811k313j741j378j176
60440C72882r28p63r40j188r78l92m6m3J34N39M69k97r05o30P0L94L43K74Qo65
60420C67338j192q91n4M89N61N75O02M86N87J363K338K502J732Q54L43o5l81j50
60402C77037N34Q24L96N5N50J448J815J435Q75O71R51J567K181K458K462K629
$$ plain form
60502 550995 560004 572154 588190 608640 633493 662534 696073 734706 778222 825476 875636 928681
60490 928681 984058 1039317 1090614 1134251 1167296 1187344 1192639 1182667 1158285 1121285 1074051 1019417
60478 1019417 960475 900347 841966 787592 738178 693494 653209 617650 587258 561675 539875
60467 539875 521029 504755 490622 477961 466319 455664 445967 436928 428416 420954 415349 411761 409395
60454 409395 407173 404568 401654 398586 395348 391954 388583 385365 382301 379490 377177 375436 374058 372882
60440 372882 371954 371191 370251 369063 368085 367693 367647 367604 367738 368277 368746 368449 367544 366914 366984 367378 367721 367995 368003 367338
60420 367338 366146 365255 365201 365690 366251 366826 367428 367914 368501 369864 372202 374704 376436 377290 377633 377568 377187 377037
60402 377037 377571 378395 378791 378846 379396 380844 382659 384094 384969 385640 386591 388158 390339 392797 395259 397888
60386C97888L205L907M343M367L987L212K245J451J012P66N19K15k18p12q08l5
60370D25344J235J924J537Q05O69J029J074M89k13n20n37o45r39j180j164r56
60354D27952p50n73j74P28K069L365M140M373M500M943N605N925N470M392L151
60339D75116J953P16m25j130j463k052l281m640n227m729l565k385j725j843k486
60324D42834k951k825k446k295k192j668q70m52n69n90M4J228K526L651M390M587
60308D42402M483M822O230Q550J1010J3119J5237J8017K1229K3402K3100K0469
60296F12070J6938J3302Q765K348n325j2263j6847j8827j8925j8157j7317j6551
60284E29211j5345j3288j0727q365o570n424n046n240n259m636l873l636l571
$$ plain form
60386 397888 401093 405000 409343 413710 417697 420909 423154 424605 425617 426383 426902 427117 426899 426187 425379 425344
60370 425344 426579 428503 430040 430845 431514 432543 433617 434106 433893 433373 432836 432191 431252 430072 428908 427952
60354 427952 427202 426629 426455 427183 429252 432617 436757 441130 445630 450573 456178 462103 467573 471965 475116
60339 475116 477069 477785 477360 476230 474767 472715 469434 464794 459567 454838 451273 448888 447163 445320 442834
60324 442834 439883 437058 434612 432317 430125 428457 427587 427135 426566 425976 426020 427248 429774 433425 437815 442402
60308 442402 446885 451707 457937 466487 477497 490616 505853 523870 545099 568501 591601 612070
60296 612070 629008 642310 651075 653423 648098 635835 618988 600161 581236 563079 545762 529211
60284 529211 513866 500578 489851 481486 474916 469492 464446 459206 453947 449311 445438 441802 438231
60271D38231k871j721j156j507k047k296k581l046l077k262j166n64n24o94r97
60256D11722j486j852j708j138o18m60n46n42k06L85Q95J120J205J254R65P8r74
60239D08094j333p15L01R70J032O98M10N92J281K033K498K882L465L978M014L740
60223D33940L525L151K181J020O30J207J962K326K574L049L594L956M148M155
60209D71418L927L764M120M876N418N492N402N400N475N700O020N833M691L292
60195E40828K820L211L288K621J986J789J360L94l05j30K78R4o04j524k864m482
60179E48760n317m652l238k287k009j981k185k731l173l075k782k723k505j591
60165E08511m17J36j5k92m85p61r64p65l13oJ62M09N94N05L67M96Q22J245J950
$$ plain form
60271 438231 435360 433639 432483 430976 428929 426633 424052 421006 417929 415667 414501 413937 413413 412719 411722
60256 411722 410236 408384 406676 405538 404920 404460 403914 403372 403166 403551 404446 405566 406771 408025 408990 409068 408094
60239 408094 406761 406046 406347 407317 408349 409047 409457 410049 411330 413363 415861 418743 422208 426186 430200 433940
60223 433940 437465 440616 442797 443817 444447 445654 447616 449942 452516 455565 459159 463115 467263 471418
60209 471418 475345 479109 483229 488105 493523 499015 504417 509817 515292 520992 527012 532845 537536 540828
60195 540828 543648 546859 550147 552768 554754 556543 557903 558297 557992 557862 558140 558234 557630 556106 553242 548760
60179 548760 543443 538791 535553 533266 531257 529276 527091 524360 521187 518112 515330 512607 510102 508511
60165 508511 508094 508230 508215 507923 507438 506677 505713 504948 504635 504629 504791 505200 505794 506299 506666 507162 507984 509229 511179
60146E11179K741K770J810J056J698L197M148M304M467M780M577L993M275O023
60132E61018Q185R314R039P992O861N937N109M030K463N81j275k880l931m015
60118F08428l286k690k807k942k171q83k94p38j444j830j964j871j489j312j940
60103E80767k892l050k410k216l023l846l771l224k999k948k542j904j348n25
60089E44069J010K772L800L917L789L846L941M096M742N952O973O990O096N165
60075F07158M751M452L438J398j182l585n453o832p960r057j0085j0661j0526
60062E55856j0084r976j0097r676q595p793p835p891p000n604m823m675m237l320
60048D54250k670k440j754j16J825L331M437N295N580N160M669M730N158N437
$$ plain form
60146 511179 513920 516690 518500 519556 521254 524451 528599 532903 537370 542150 546727 550720 554995 561018
60132 561018 569203 578517 587556 595548 602409 608346 613455 617485 619948 620529 619254 616374 612443 608428
60118 608428 605142 602452 599645 596703 594532 593649 593355 592617 591173 589343 587379 585508 584019 582707 580767
60103 580767 577875 574825 572415 570199 567176 563330 559559 556335 553336 550388 547846 545942 544594 544069
60089 544069 545079 547851 551651 555568 559357 563203 567144 571240 575982 581934 588907 595897 601993 607158
60075 607158 611909 616361 619799 621197 620015 616430 610977 604145 596185 587128 577043 566382 555856
60062 555856 545772 535796 525699 516023 507428 499635 491800 483909 476909 471305 466482 461807 457570 454250
60048 454250 451580 449140 447386 447270 449095 452426 456863 462158 467738 472898 477567 482297 487455 492892
60034D92892N460N242M468L007J461N55J40n85j983l631m965n837o405o776o930
60019D76113o819o494o112n735n233m584m100m064m169l816k942k146j796j541
60005D16562r33j13M30N39N05O61J057J428J429J018N91N32P25Q36R55J463K268
59988D29953K758K690K613L130M126M997N322N093M578M146L963L743L062J961
59974D82135R00J22m93q97p98k61K07L89O88J409K276K961L614M452N268N807
59958E07779O242O815P303P234O397M827K580nk233l621m394n023n515n613n391
59943E17382n181n058m877m726m839n085m992m346l440k672k178j898j753j671
59929D64666j623j626j595j308o54J81R25J555K183K788L264L594L772L689L450
$$ plain form
60034 492892 498352 503594 508062 511069 512530 513085 513225 512640 510657 507026 502061 496224 489819 483043 476113
60019 476113 469294 462800 456688 450953 445720 441136 437036 432972 428803 424987 422045 419899 418103 416562
60005 416562 415629 415516 415946 416485 416990 417651 418708 420136 421565 422583 423174 423706 424431 425267 426222 427685 429953
59988 429953 432711 435401 438014 441144 445270 450267 455589 460682 465260 469406 473369 477112 480174 482135
59974 482135 483035 483157 482664 481767 480969 480708 480915 481304 481992 483401 485677 488638 492252 496704 501972 507779
59958 507779 514021 520836 528139 535373 541770 546597 549177 549172 546939 543318 538924 533901 528386 522773 517382
59943 517382 512201 507143 502266 497540 492701 487616 482624 478278 474838 472166 469988 468090 466337 464666
59929 464666 463043 461417 459822 458514 457860 458041 458966 460521 462704 465492 468756 472350 476122 479811 483261
59914D83261L556M407N634O413O493O495O990P735Q175Q328Q649R095Q978P891
59900E82100O269M682K997Q02j633l533m674n587o469o719n955m835m213l967
59886E49265l354k193q93L84J784L118M000M650N655O862P412P057O547O302N692
59871F02288M247K788K360K602K168O33r85j665j592j561j776j769j333r91j368
59856F04046k332l081l091k633k200j794j129j97Q82K286M028N128M180J061k607
59841F02547m993n556m725k901n43J383J917J019o22k571m814o998q228p973o725
59826E50217n469m639l963l176k538k433k743k997l118l517m239m553l866k721
59812E00245k163k352k516k195j752j589j656j901k442k967k773j788q80p49j086
$$ plain form
59914 483261 486817 491224 496858 503271 509764 516259 523249 530984 539159 547487 556136 565231 574209 582100
59900 582100 588369 593051 596048 596850 595217 591684 587010 581423 574954 568235 562280 557445 553232 549265
59886 549265 545911 543718 542825 543209 544993 548111 552111 556761 562416 569278 576690 583747 590294 596596 602288
59871 602288 606535 609323 611683 614285 616453 617086 616101 614436 612844 611283 609507 607738 606405 605414 604046
59856 604046 601714 598633 595542 592909 590709 588915 587786 587589 588471 590757 594785 599913 604093 605154 602547
59841 602547 597554 591998 587273 584372 583829 585212 587129 588148 587526 584955 580141 573143 564915 556942 550217
59826 550217 544748 540109 536146 532970 530432 527999 525256 522259 519141 515624 511385 506832 502966 500245
59812 500245 498082 495730 493214 491019 489267 487678 486022 484121 481679 478712 475939 474151 473271 472522 471436
59797D71436j363j701k389l096l236k800k228j805j620j744k008k009j747j695
59783D41995j873j507k25J065J316P03N6l98p57n25P16K048K046Q18j8M47J483
59766D47390K167K492K665K481K084K286L408M537M713M197L887M091M639N617
59752D96654P110Q527R105Q976R013R649J0487J1080J1461J1761J1818J1376J0434
59739F27451R174P810O472N098L461J524l06j587k422l285m253m850m772m336
59725F35179m004l741l243k593k263k501l036l499l814m052m103l760l041k265
59711E89264j786j762k069k325k037r74N28J748K198J991J593J322J134Q81N99
59696E90305N11P74J222J520J504J318J199J180J110P28k06j648k964l307k600
$$ plain form
59797 471436 470073 468372 465983 462887 459651 456851 454623 452818 451198 449454 447446 445437 443690 441995
59783 441995 440122 438615 438390 439455 440771 441474 441530 441132 440375 439850 440566 442614 444660 445478 445460 445907 447390
59766 447390 449557 452049 454714 457195 459279 461565 464973 469510 474223 478420 482307 486398 491037 496654
59752 496654 503764 512291 521396 530372 539385 549034 559521 570601 582062 593823 605641 617017 627451
59739 627451 636625 644435 650907 656005 659466 660990 660684 659097 656675 653390 649137 644287 639515 635179
59725 635179 631175 627434 624191 621598 619335 616834 613798 610299 606485 602433 598330 594570 591529 589264
59711 589264 587478 585716 583647 581322 579285 578311 578839 580587 582785 584776 586369 587691 588825 589706 590305
59696 590305 590816 591590 592812 594332 595836 597154 598353 599533 600643 601371 601165 599517 596553 593246 590646
59681E90646j846j993k740l033k590k213k516l129l462l649m086m603m683m359
59667E45744m257m698n260n346m874m229l710l250k618j811j095o33k68K29Q51
59652E04775J488K220L099L784L811L226K505J836R80j64j382k599l911n018n297
59637E09353m774m323m460m537l723k238j004m78m43o30q64r18q28j140k138l125
59621D73730l137k269j516j432j706k058k691l597m138l741k614j420o02k22j78
59606D42409k63j93J40N55Q15R25J089J444J774J579O14n90j114o67P6M54O01
59589D49648Q86J057O40j58o95q74j081j307j156q56j243k462l504l487k770k247
59573D30391k143k121k138k428k814k782k281j858j873j994j707j054n13l38k69
$$ plain form
59681 590646 588800 586807 584067 581034 578444 576231 573715 570586 567124 563475 559389 554786 550103 545744
59667 545744 541487 536789 531529 526183 521309 517080 513370 510120 507502 505691 504596 503963 503695 503924 504775
59652 504775 506263 508483 511582 515366 519177 522403 524908 526744 527724 527560 526178 523579 519668 514650 509353
59637 509353 504579 500256 495796 491259 487536 485298 484294 483816 483373 482743 481879 480961 480133 478993 476855 473730
59621 473730 470593 468324 466808 465376 463670 461612 458921 455324 451186 447445 444831 443411 442809 442587 442409
59606 442409 442146 441953 442093 442648 443463 444388 445477 446921 448695 450274 450888 450298 449184 448517 448593 449047 449648
59589 449648 450534 451591 452231 452073 451378 450504 449423 448116 446960 446104 444861 442399 438895 435408 432638 430391
59573 430391 428248 426127 423989 421561 418747 415965 413684 411826 409953 407959 406252 405198 404685 404347 404078
59558D04078L0M96Q14Q89J008J473K275L172L865M080L678K919K402K547L195
59543D36921L915M529N184N998O924P993R568J2285J6441K1120K3921K2335J5930
59530E93064P037j045o342q718q824p362n058k581k10K035L985N314N877N610
59516E82782M280J820j121l452m633n135n866p320r143j0367j0229r046q034p969
59502E06567q353q330p932p684p347o083l878j897j052r56o96m3N45P20N90M54
59486D54625M96O91Q76J028J320J813K192K242K315K921L956M858N435N992O577
59471D97337O796O417N648M592L040R55j175k722l344l016k006q21K17J363K997
59456E16278M882O399P405Q257R056R565R856J0302J0846J1074J0974J0833J0292
$$ plain form
59558 404078 404108 404604 405418 406307 407315 408788 411063 414235 418100 422180 425858 428777 431179 433726 436921
59543 436921 440836 445365 450549 456547 463471 471464 481032 493317 509758 530878 554799 577134 593064
59530 593064 600101 599056 592714 583996 575172 567810 562752 560171 559961 561996 565981 571295 577172 582782
59516 582782 587062 588882 587761 584309 579676 574541 568675 561355 552212 541845 531616 522570 514536 506567
59502 506567 498214 489884 481952 474268 466921 460838 456960 455063 454011 453055 452359 452316 452861 453581 454171 454625
59486 454625 455121 455812 456688 457716 459036 460849 463041 465283 467598 470519 474475 479333 484768 490760 497337
59471 497337 504133 510550 516198 520790 523830 524785 523610 520888 517544 514528 512522 511701 511918 513281 516278
59456 516278 521160 527559 534964 543221 552277 561842 571698 582000 592846 603920 614894 625727 636019
59443F36019Q589N857L111O32k434o274r467j0650j0206r295q209o759n562n516
59429E79836o338o872o654o163n576m438k624o94R51K594M613O977R424J1730
59415E76766J3757J5604J7679K0265K3201K6218K8979L0061K6698J7070L030j0568
59403G88760j9635k3274k2708j9245j3747o913P82Q599J4274J4414P492l905j4912
59390G09982k2327k6006k6971k5773k2984j9765j7027j4591j1945r337p422o183
59378D99651m963l494k220j545j239p40K20J445K440K741K344J834J861K432K978
59363E03745L095K920K779K809L044L475L926M208M539N381O747Q069R049J0125
59349E73911J1726J3553J5019J6108J7191J8265J8928J9023J8803J8513J8138
$$ plain form
59443 636019 644608 650465 653576 654208 651774 645500 636033 625383 615177 605882 597673 590914 585352 579836
59429 579836 573498 566626 559972 553809 548233 543795 541171 540477 541428 544022 548635 555612 565036 576766
59415 576766 590523 606127 623806 644071 667272 693490 722469 752530 779228 796298 799328 788760
59403 788760 769125 745851 723143 703898 690151 683238 684020 692619 706893 721307 728799 724894 709982
59390 709982 687655 661649 634678 608905 585921 566156 549129 534538 522593 513256 505834 499651
59378 499651 494688 491194 488974 487429 486190 485450 485670 487115 489555 492296 494640 496474 498335 500767 503745
59363 503745 506840 509760 512539 515348 518392 521867 525793 530001 534540 539921 546668 554737 563786 573911
59349 573911 585637 599190 614209 630317 647508 665773 684701 703724 722527 741040 759178
59338G59178J7482J6160J3753J0351O718L534P57j879m224o171q273j1011j3753
59325G82622j5353j5597j5151j4304j2899j1415j0784j0848j0307q697p189o808
59313F43270o917o365n125l867k642j125M08J478K424M050O468R158J1988J5156
59299F68359J8110J9398J7765J3017N887k213r441j4353j6798j7568j7164j5491
59287F49508j2715r677p124n085l292j757n71M45J562K751L801M634N328N919
59273F33727O506P411Q960J1027J2938J4016J4223J4127J4127J3836J2452R774
59261G73124O512L521R56j603m402p238r743j1701j2979j3414j2910j1680j0283
59248F88160r242q528p577o067m542l867m050m072l088j447j91K08K56O96J611
$$ plain form
59338 759178 776660 792820 806573 816924 823642 827176 827933 826054 821830 815659 807386 796375 782622
59325 782622 767269 751672 736521 722217 709318 697903 687119 676271 665964 657267 650078 643270
59313 643270 636353 629988 624863 620996 618354 617229 617637 619115 621539 625589 632057 641215 653203 668359
59299 668359 686469 705867 723632 736649 742536 740323 730882 716529 699731 682163 664999 649508
59287 649508 636793 627116 619992 614907 611615 609858 609287 609732 611294 614045 617846 622480 627808 633727
59273 633727 640233 647644 656604 667631 680569 694585 708808 722935 737062 750898 763350 773124
59261 773124 779636 783157 784113 782510 778108 770870 761127 749426 736447 723033 710123 698443 688160
59248 688160 678918 670390 662813 656746 652204 648337 644287 640215 637127 635680 635489 635697 635953 636649 638260
59233F38260K358K289J449M70k16q83j952l193l907l904l816m321n427o641p522
59218F03044p992q324q840r413r341q218o693n802n581n118m024l005k668k570
59204E15455j980r26P4P50J075J018Q41J182K242L363L888M052M435M971N183
59189E45623N043M955N008M890M451L911L593L739M421N308N822N785N583N418
59175F13550M960M116L559L862M610M969M777M436M166M059M461N470O428O673
59161F80096O493O497O378N328L500J960J113J71j573l804n772p164q022q469
59147F76732q755r060r101q368o967n663m924m463l930l483l385l545l695l678
59133E97715l320k423j127M2P81J338K042K801L334L673M154M984O021O982P746
$$ plain form
59233 638260 640618 642907 644356 644826 644610 643727 641775 638582 634675 630771 626955 622634 617207 610566 603044
59218 603044 595052 586728 577888 568475 559134 550916 544223 538421 532840 527722 523698 520693 518025 515455
59204 515455 513475 512549 512623 513373 514448 515466 516307 517489 519731 523094 526982 531034 535469 540440 545623
59189 545623 550666 555621 560629 565519 569970 573881 577474 581213 585634 590942 596764 602549 608132 613550
59175 613550 618510 622626 626185 630047 634657 639626 644403 648839 653005 657064 661525 666995 673423 680096
59161 680096 686589 693086 699464 704792 708292 710252 711365 711536 709963 706159 700387 693223 685201 676732
59147 676732 667977 658917 649816 641448 634481 628818 623894 619431 615501 612018 608633 605088 601393 597715
59133 597715 594395 591972 590845 590887 591668 593006 595048 597849 601183 604856 609010 613994 620015 626997 634743
59118F34743Q401Q991R337R309R179R364R755R784R299Q770Q331P330N445L597
59104G51635K865K898K392R79l76q74q36r10j204j550j969k479k907l142l226
59089G41296l065k512j898j859k435k936k985l191m282n973p220p426p057p035
59075F81422p824r073j0003j0134r566q645p536o262n021m161l903m267n064n746
59061E84217n583m419l059k455k686l164l591m132m722m911m494l747k962k191
59047E32101j544j270j361j496j506j510j515j213l93P86J964K890L470L736L780
59032E36919L628L262K987L401M756O522P992R102J0264J1672J3269J5201J7615
59019F46590K0129K1966K2690K2327K0919J8387J4779J0260N027m58n347q982
$$ plain form
59118 634743 643144 652135 661472 670781 679960 689324 699079 708863 718162 726932 735263 742593 748038 751635
59104 751635 754500 757398 759790 760769 760393 759519 758683 757773 756569 755019 753050 750571 747664 744522 741296
59089 741296 738231 735719 733821 731962 729527 726591 723606 720415 716133 710160 702940 695514 688457 681422
59075 681422 673598 664525 654522 644388 634822 626177 618641 612379 607358 603197 599294 595027 589963 584217
59061 584217 578634 574215 571156 568701 566015 562851 559260 555128 550406 545495 541001 537254 534292 532101
59047 532101 530557 529287 527926 526430 524924 523414 521899 520686 520293 521079 523043 525933 529403 533139 536919
59032 536919 540547 543809 546796 550197 554953 561475 569467 578569 588833 600505 613774 628975 646590
59019 646590 666719 688685 711375 733702 754621 773008 787787 798047 803074 802616 797269 788287
59007G88287j1305j2370j2022j0582r168q436p498n237k216q9O91J214K101K624
58993G15994K131J106K24n47j361j932k186k676l732m899n740o475p292p704p258
58978F67653o308n434m519l107j258M83J791K760L673M859O518Q364R739J0342
58964F95556J0504J0538J0319R781R381R534R844R350P471M541J438j191l450
58951G83616n962q881j1422j2697j2809j2621j2619j2603j2354j1820j0736q920
58939F50172o973n774n153l983j926j21L57j16m25j84J80K90K10K24N61J133J377
58922F29849P65m63j588k456l558m952n892n869n280m718m259l755l252k710j942
58907E79920j051l39M32J908M014N852P066Q361J0105J1403J1359J0497J0038
$$ plain form
59007 788287 776982 764612 752590 742008 732840 724404 716906 711669 709453 709364 710055 711269 713370 715994
58993 715994 718125 719231 719455 718908 717547 715615 713429 710753 707021 702122 696382 689907 682615 674911 667653
58978 667653 661345 655911 651392 648285 647027 647510 649301 652061 655734 660593 667111 675475 685214 695556
58964 695556 706060 716598 726917 736698 746079 755613 765457 774807 782278 786819 788257 787066 783616
58951 783616 777654 768773 757351 744654 731845 719224 706605 694002 681648 669828 659092 650172
58939 650172 643199 637425 632272 628289 626363 626242 626599 626483 626058 625874 626054 626344 626554 626778 627339 628472 629849
58922 629849 630614 630151 628563 626107 622549 617597 611705 605836 600556 595838 591579 587824 584572 581862 579920
58907 579920 578869 578530 578962 580870 584884 590736 597802 606163 616268 627671 639030 649527 659565
58894F59565J0276J0514J0249R676R331R715J1113J3254J5414J7107J8345J9107
58882H13666J9086J8209J6751J4742J1927Q551N412K715k30l825p539j0931j4243
58869H74291j7393j9365j9475j8364j6913j5029j2516j0235r118q694p818o562
58857G12809o044o574p164o932o031n000m030l038j962q22K09Q51J072J159J182
58842F69685P69k86j735l454n682q199r997j0476j0328j0428j0500r724q198o815
58828E74632n913n082m094l257k838k754k747k466j567k04R42J465J637J665J293
58813E50712O18M32R78J271N45l99l81L49O97M84K88N3o48j319j044k18k63j473
58795E50682k569k654k259k077j935j630j701k521l375l214j889j16J428K571
$$ plain form
58894 659565 669841 680355 690604 700280 709611 719326 730439 743693 759107 776214 794559 813666
58882 813666 832752 850961 867712 882454 894381 902932 908344 911059 910829 907004 899465 888534 874291
58869 874291 856898 837533 818058 799694 782781 767752 755236 745001 735883 727189 719371 712809
58857 712809 706765 700191 693027 686095 680064 675064 671034 667996 666034 665212 665421 666272 667344 668503 669685
58842 669685 670454 670168 668433 664979 659297 651098 641101 630625 620297 609869 599369 589645 581447 574632
58828 574632 568719 563637 559543 556286 553448 550694 547947 545481 543914 543710 544652 546117 547754 549419 550712
58813 550712 551330 551762 552740 554011 554556 554157 553776 554125 554822 555306 555594 555647 554999 553680 552636 552418 552155 550682
58795 550682 548113 545459 543200 541123 539188 537558 535857 533336 529961 526747 524858 524742 526170 528741
58781E28741L522M601N832O717O687N873N035M683M641M440L731K301K11k016
58767E84999l695m596m916m761m072l026k024j226m75K81Q08R75J034J454K518
58752E63278L985N086N131M225L179K560K251J966J709J461J055O90R76K071L299
58737F02922M082M633N252N721N942O436P481Q367Q360P753P247O796O013N050
58723F92055M137K726J92k905n253o232o152n425m380l484k797j622M34K453L267
58708F67014L019K631K160R66p93k253l256m473o100p667r117j0908j2878j4225
58694F04120j4716j4868j4819j4033j2406j0585r000p457n893m691l965l378k866
58681D85443k788l176l569l643l373k624j369k60k2l09o0R27J788K108K590L854
$$ plain form
58781 528741 532263 536864 542696 549413 556100 561973 567008 571691 576332 580772 584503 586804 587015 584999
58767 584999 581304 576708 571792 567031 562959 559933 557909 556683 556208 556489 557297 558272 559306 560760 563278
58752 563278 567263 572349 577480 581705 584884 587444 589695 591661 593370 594831 595886 596576 597552 599623 602922
58737 602922 607004 611637 616889 622610 628552 634988 642469 650836 659196 666949 674196 680992 687005 692055
58723 692055 696192 698918 699110 696205 690952 684720 678568 673143 668763 665279 662482 660860 661294 663747 667014
58708 667014 670033 672664 674824 675790 674997 672744 669488 665015 658915 651248 642131 631223 618345 604120
58694 604120 589404 574536 559717 545684 533278 522693 513693 506236 500343 495652 491687 488309 485443
58681 485443 482655 479479 475910 472267 468894 466270 464901 464641 464619 464310 464250 465177 466965 469073 471663 475517
58665D75517N492O783P715Q775J0131J1345J1682J0606Q247N324K407m25k956
58652E60643m487m736m495m670n113n203m973m753m248l158k185k288l157l643
58638E03534l407k978k387j125O71K219L244L990M242L578K488J903J707Q81p96
58623E17764k496l680m447m588l639j958m34R22K784M959O474P255Q180R317R613
58608E46026Q641P214N845M148K147P37K41j42q60j299j060p90j037j440j646
58593E66725j995k697l194k928j940m34J472L360M764N984P669R536J0629J0815
58579F07766J0915J1216J1195J0712J0143R264P516N489M554M798M933M508M506
58566G07515N445O667Q028J0423J3916J7104J9204K1083K3367K5117K5416K4673
$$ plain form
58665 475517 481009 487792 495507 504282 514413 525758 537440 548046 556293 561617 564024 563599 560643
58652 560643 556156 551420 546925 542255 537142 531939 526966 522213 517965 514807 512622 510334 507177 503534
58638 503534 500127 497149 494762 493637 494308 496527 499771 503761 508003 511581 514069 515972 517679 518560 517764
58623 517764 515268 511588 507141 502553 498914 496956 496522 497444 500228 505187 511661 518916 527096 536413 546026
58608 546026 554667 561881 567726 571874 574021 574758 574999 574857 573997 572698 571638 570848 569811 568371 566725
58593 566725 564730 562033 558839 555911 553971 553537 555009 558369 563133 569117 576786 586322 596951 607766
58579 607766 618681 629897 641092 651804 661947 671211 678727 684216 688770 693568 698501 703009 707515
58566 707515 712960 719627 727655 738078 751994 769098 788302 809385 832752 857869 883285 907958
58554I07958K3402K1127J7650J3997J0973Q038M628J330j265l710o503r007j0531
58541I78087j1548j2734j3919j4912j6333j8558k0765k2045k2523k2553k1772
58530G80425j9924j7623j5463j3215j0733q614p183n813m060k505j627q96J79
58517F72948J111J311J062Q63P41P56J185J686J432N76K60O60N08p75k092k616
58501F79616l070m016m515l797k764k549k822k778k592k587k201j031J66O99J127
58486F46886K123L272M127N306P330R457J0822J1717J2717J3653J4493J5921J7945
58473G75769J9032J7854J4805J0969O705K270j591m721p931j1240j3187j2954
58461G95780j1675j0523r057o694m184k247k70K246M479N931P561R768J0888R413
$$ plain form
58554 907958 931360 952487 970137 984134 995107 1003145 1007773 1009103 1007838 1004128 997625 988618 978087
58541 978087 966539 953805 939886 924974 908641 890083 869318 847273 824750 802197 780425
58530 780425 760501 742878 727415 714200 703467 694853 687670 681857 677797 675292 673665 672769 672948
58517 672948 674059 675370 676432 677295 678036 678792 679977 681663 683095 683671 683931 684591 685099 684324 682232 679616
58501 679616 676546 672530 668015 664218 661454 658905 656083 653305 650713 648126 645925 644894 645060 645759 646886
58486 646886 649009 652281 656408 661714 669044 678501 689323 701040 713757 727410 741903 757824 775769
58473 775769 794801 812655 827460 838429 845134 847404 845813 841092 833161 821921 808734 795780
58461 795780 784105 773582 764525 757831 753647 751400 751130 753376 757855 763786 771347 781115 792003 801416
58447H01416O243L083J21l023n641p076q116r433j0012q910p099n785m413k205
58433G39150j58N92R45K211L698M035L697M058N162O421Q208J0593J1969J1168
58419H11749R606R011Q443O153K999J177N42r06l537n846p184q195q917q797q287
58404G98011q174p826o201m132l363l792l640k107JJ820K962L087K523K506L374
58389G75049L663K473J229J355J934J713J569K591L518K837J722K014K802K139
58375H06608P07N91J584K031K199L502N243N595N028N506O947P799Q360J0112
58361H71812J2359J3025J2386J2584J3756J4008J3008J2212J1733J0229P871O254
58349A011237N391L836J647L17j5l67l17J403M073N747O415P447Q593Q693Q585
$$ plain form
58447 801416 807659 810742 810863 807840 802199 795123 787007 777574 767562 758652 751553 745768 741355 739150
58433 739150 738992 739584 740529 742740 746438 750473 754170 758228 763390 769811 778019 788612 800581 811749
58419 811749 821355 830366 838809 844962 847961 849138 849680 848774 845237 839391 832207 824012 815095 806298 798011
58404 798011 789837 782011 775810 771678 768315 764523 760883 758776 758777 760597 763559 766646 769169 771675 775049
58389 775049 778712 781185 782414 783769 785703 787416 788985 791576 795094 797931 799653 801667 804469 806608
58375 806608 807315 807906 809490 811521 813720 817222 822465 828060 833088 838594 845541 853340 861700 871812
58361 871812 884171 897196 909582 922166 935922 949930 962938 975150 986883 997112 1004983 1011237
58349 1011237 1016628 1020464 1022111 1022428 1022413 1022046 1021729 1023132 1027205 1032952 1039367 1046814 1055407 1064100 1072685
58334A072685R946J1980J2651J2487J3477J5001J4804J3305J2865J3196J1792
58323A214189Q665O409N590M343K551K178L259L731L440M164N606N647M781N847
58309A280400Q963J1136J1400J1924J3475J4178J3604J3778J5274J6323J6551
58298A427006J7528J9113J9240J7881J7138J7156J6186J4785J5396J7532J8192
58287A617153J7392J8298K1319K3197K2738K2397K3338K3928K3973K5424K8006
58276A867163K9128K8899L0110L2701L3730L3428L5477M0314M4060M5193M6458
58265B266661M8983N0510N0816N2890N7275O1011O3319O6329O9377O9118O6314
58254B922603O5581O7281O6886O3597O2043O3814O5278O5628O8918P5801Q1517
$$ plain form
58334 1072685 1082631 1094611 1107262 1119749 1133226 1148227 1163031 1176336 1189201 1202397 1214189
58323 1214189 1222854 1229263 1234853 1239196 1241747 1243925 1247184 1250915 1254355 1258519 1264125 1269772 1274553 1280400
58309 1280400 1289363 1300499 1311899 1323823 1337298 1351476 1365080 1378858 1394132 1410455 1427006
58298 1427006 1444534 1463647 1482887 1500768 1517906 1535062 1551248 1566033 1581429 1598961 1617153
58287 1617153 1634545 1652843 1674162 1697359 1720097 1742494 1765832 1789760 1813733 1839157 1867163
58276 1867163 1896291 1925190 1955300 1988001 2021731 2055159 2090636 2130950 2175010 2220203 2266661
58265 2266661 2315644 2366154 2416970 2469860 2527135 2588146 2651465 2717794 2787171 2856289 2922603
58254 2922603 2988184 3055465 3122351 3185948 3247991 3311805 3377083 3442711 3511629 3587430 3668947
58243C668947Q4616Q9464R7465J04246J08453J14653J24407J33124J39042J46475
58233D810892J56939J66172J73331J83678J98610K12809K24831K40348K61165
58224F628775K81721L00360L22837L50639L77834M03906M36942M79173N22783
58215A0104970N65402O15599O77257P43764Q14174Q99089J003251J119496J247729
58206A7790731J401612J587757J798516K036018K323016K680170L117257L660088
58198C6395165M359961N260626O383006P758835R449268J1516028J4017109J7052547
58190A12192545K0751311K5143432L0036771L4970069L9113162M1105943L9224854
58183C42538087L2200348K0246430N340081r635910k2191591l0991457l5820700
$$ plain form
58243 3668947 3753563 3843027 3940492 4044738 4153191 4267844 4392251 4525375 4664417 4810892
58233 4810892 4967831 5134003 5307334 5491012 5689622 5902431 6127262 6367610 6628775
58224 6628775 6910496 7210856 7533693 7884332 8262166 8666072 9103014 9582187 10104970
58215 10104970 10670372 11285971 11963228 12706992 13521166 14420255 15423506 16543002 17790731
58206 17790731 19192343 20780100 22578616 24614634 26937650 29617820 32735077 36395165
58198 36395165 40755126 46015752 52398758 60157593 69606861 81122889 95139998 112192545
58190 112192545 132943856 158087288 188124059 223094128 262207290 303313233 342538087
58183 342538087 374738435 394984865 400324946 390689036 368497445 337505988 301685288
58176C01685288l7187405l5956784l3069564k9323962k5290602k1358655j7787905
58169A01710411j4706312j2123364r995541q274767o901307n797777m898739m167995
58161C4844609l576093l084897k666891k317161k031935j793001j584334j406107
58153A6384190j259913j135439j022510r22235q36058p56788o79873o11223n54880
58144H605271n04320m54151m09205l73967l43786l14610k91125k77024k66502
58135E370581k53331k39765k29128k17991k03065j88108j76846j66220j53247
58126C542880j41434j33872j26871j16893j07344j02041r8124r1808q5270q1637
58116B457586p8528p2804o6798o3887o2345n9057n5150n2774n0512m6862m4199
$$ plain form
58176 301685288 264497883 228541099 195471535 166147573 140856971 119498316 101710411
58169 101710411 87004099 74880735 64885194 56610427 49709120 43911343 39012604 34844609
58161 34844609 31268516 28183619 25516728 23199567 21167632 19374631 17790297 16384190
58153 16384190 15124277 13988838 12966328 12044093 11208035 10451247 9771374 9160151 8605271
58144 8605271 8100951 7646800 7237595 6863628 6519842 6205232 5914107 5637083 5370581
58135 5370581 5117250 4877485 4648357 4430366 4227301 4039193 3862347 3696127 3542880
58126 3542880 3401446 3267574 3140703 3023810 2916466 2814425 2716301 2624493 2539223 2457586
58116 2457586 2379058 2306254 2239456 2175569 2113224 2054167 1999017 1946243 1895731 1848869 1804670
58105A804670m4558m5392m3941m1952m1738m1560l9221l6504l5708l5367l3416
58094A365313l1157l0224k9045k6096k3304k2535k2053j9923j7613j6814j6108
58083A110441j4117j2659j3385j4668j4905j5479j7341j8361j7343j6972j9212
58072I35999k1508k1138j9767j9862k0077j8266j5834j5006j4630j2775j0761
58061G46375j0570j0805r265p185p012q059q183p796q482r498r167q185q175q586
58047F25407q062p201p014o496m666l103l488m542m346l781m538n674n369m345
58033E52782m376n016m880m707n982p912q679q454q432q247p164o365p197q402
58019D56969p842n850m304l577k926k667l374m103l755l070l074k957j671j63
$$ plain form
58105 1804670 1760112 1714720 1670779 1628827 1587089 1545529 1506308 1469804 1434096 1398729 1365313
58094 1365313 1334156 1303932 1274887 1248791 1225487 1202952 1180899 1160976 1143363 1126549 1110441
58083 1110441 1096324 1083665 1070280 1055612 1040707 1025228 1007887 989526 972183 955211 935999
58072 935999 914491 893353 873586 853724 833647 815381 799547 784541 769911 757136 746375
58061 746375 735805 725000 715735 708550 701538 693479 685296 677500 669018 659520 650353 642168 633993 625407
58047 625407 617345 610144 603130 596634 591968 588865 585377 580835 576489 572708 568170 562496 557127 552782
58033 552782 548406 543390 538510 533803 527821 519909 511230 502776 494344 486097 478933 472568 465371 456969
58019 456969 449127 443277 438973 435396 432470 429803 426429 422326 418571 415501 412427 409470 407799 407636
58005D07636K67L06R57J269J37j238j185l32%M98K226L897L644K244J823K478
57989D24627K794K547K342J766M58l30K82O03j171l709m534l918l854m462m418
57974D09023l975m421n272m991l881l420l431k612j274q18j063o90J91M86M60
57959C74312J126J986J870J393J926K855K481J031J75J30j42m98j7O90L04n76
57943C89046l22P88J266J462K955N283O355N996O113P289Q111Q020Q025Q267P569
57928D66223N778M108K815Q45j848m010n331o809q614r798j0231j0644j0727r500
57914D02257p651p012p542p326n820m534m113l319j555NN86Q39R56O9j652k443
57898C51745j527l69l83j069j355j182r15n62l24n54p57k2J223J410K22q43p54
$$ plain form
58005 407636 407903 408209 409166 410435 410572 409334 408149 407817 407817 408315 410541 414438 418082 420326 422149 424627
57989 424627 427421 429968 432310 434076 434534 434204 434486 435089 433918 430209 425675 421757 417903 413441 409023
57974 409023 405048 400627 395355 390364 386483 383063 379632 377020 375746 374928 373865 373175 373366 373852 374312
57959 374312 375438 377424 379294 380687 382613 385468 387949 388980 389155 389285 389143 388645 388628 389318 389622 389046
57943 389046 388724 389512 390778 392240 395195 400478 406833 412829 418942 426231 434342 442362 450387 458654 466223
57928 466223 472001 476109 478924 479769 477921 473911 468580 461771 453157 443359 433128 422484 411757 402257
57914 402257 394606 387594 380052 372726 366906 362372 358259 354940 353385 353390 353976 354815 355771 355840 354188 351745
57898 351745 350218 349849 349466 348397 347042 345860 344945 344383 344059 343505 342748 342726 343949 345359 345581 344738 343984
57881C43984k12j86o84j490k621l636l882l755m281n295n512m704m037m006l756
57866B95927k880k145j885j332j66Q17J184J582K403L112L418L836M593N220N540
57851C19224N854N962N349M476M363M786M475L137J771Q55mo16l60L3j018l205
57835C55082m228l075j286k76M54J549K316K225K063K385K436J738J193J480J850
57820C65906J685J688K309K450J162o20j406j177r37j217k246m477p643j0126
57806C45351j0500r208p757o955o726o822o828o183m985m080l762l247k030q09
57792B65459k67k4M42P89P11Q57J813K924L187K773K725L528M766N800O290O396
57776C08169O774P870R017Q956P437N499L985K785J708R06K9j731m189n928o193
$$ plain form
57881 343984 343772 343586 342902 341412 338791 335155 331273 327518 323237 317942 312430 307726 303689 299683 295927
57866 295927 293047 290902 289017 287685 287519 288336 289520 291102 293505 296617 300035 303871 308464 313684 319224
57851 319224 325078 331040 336389 340865 345228 350014 354489 357626 359397 360252 360248 359632 359272 359305 358287 355082
57835 355082 350854 347779 346493 346217 346671 348220 350536 352761 354824 357209 359645 361383 362576 364056 365906
57820 365906 367591 369279 371588 374038 375200 374580 373174 371997 371060 369843 367597 363120 355477 345351
57806 345351 334851 325643 317886 310931 304205 297383 290555 284372 279387 275307 271545 268298 266268 265459
57792 265459 265192 265168 265610 266399 267110 267967 269780 272704 275891 278664 281389 284917 289683 295483 301773 308169
57776 308169 314943 322813 331830 340786 348223 353722 357707 360492 362200 363106 363135 361404 357215 351287 345094
57761C45094n865n961o332o595p053p734p632o083l997k613j791o44Q26J834K128
57746B87582K185K243J922Q11j008k840l688l095j775r25q30q44n97l44j40L03
57730B78960Q18Q90O61P43R94P82M36R16J910J974R41L59R00J232L82o11n88j77
57712B91522m65j183j619k048k862l385l034k588k974l642l596l073k856k729
57698B55468k132j565j837k461k262j212l51j70k45k21j42K3K93L83K56M84J381
57681B45690K337K757L085M093N847Q098J0988J4559J8388K2569K8259L6252M5820
57668D48742N5964O6785P8129Q7317Q9502Q0422N8685K6748r040m0592o2271p3447
57656H06944p6596p3935o6948n7782m8840m1051l3968k7462k1977j7415j3262
$$ plain form
57761 345094 339229 333268 326936 320341 313288 305554 297922 291839 287842 285229 283438 282794 283620 285454 287582
57746 287582 289767 292010 293932 294743 293735 290895 287207 284112 282337 281412 280582 279738 279141 278797 278657 278960
57730 278960 279778 280668 281329 282072 283066 283848 284284 285200 287110 289084 290025 290384 291284 292516 292898 292287 291699 291522
57712 291522 291057 289874 288255 286207 283345 279960 276926 274338 271364 267722 264126 261053 258197 255468
57698 255468 253336 251771 249934 247473 245211 243999 243648 243478 243233 243012 242870 242893 243186 243569 243825 244309 245690
57681 245690 248027 250784 253869 257962 263809 271907 282895 297454 315842 338411 366670 402922 448742
57668 448742 504706 571491 649620 736937 826439 906861 965546 992294 983254 942662 880391 806944
57656 806944 730348 656413 589465 531683 482843 441792 407824 380362 358385 340970 327708
57645C27708r778p760p044o477n481m559m112l706k774j322K33J365J701J403
57631B79397J092J022P47P2l90k64k88j177k336k743k490k375k544k633k829l489
57615B58772m091l807k892k351k431k571k596k810l031k700j837r45r6R03J705
57600B29222J890J936K552L257K863J297l29j450k554l763m275l644k620k163
57586B22219k357k686k812k745k640k576k376j770j028r24j606k064j489n06k47
57571A94393p01j028r85r39q44m35p0j86l07J87O29p1j377j590m15N71L39k84
57553A86887k86O8J54J85O05J148J375J360J286R13J74l03R3J101J977K382K459
57536B01578K361K194K189K511K870K641J547J70m40J16R47R14J51j33N17J124
$$ plain form
57645 327708 317930 310170 303126 296649 291168 286609 282497 278791 276017 274695 274928 276293 277994 279397
57631 279397 280489 281511 282258 282330 281940 281676 281388 280211 277875 275132 272642 270267 267723 265090 262261 258772
57615 258772 254681 250874 247982 245631 243200 240629 238033 235223 232192 229492 227655 226710 226614 227517 229222
57600 229222 231112 233048 235600 238857 241720 243017 242688 241238 238684 234921 230646 227002 224382 222219
57586 222219 219862 217176 214364 211619 208979 206403 204027 202257 201229 200305 198699 196635 195146 194640 194393
57571 194393 193692 192664 191679 190740 189896 189461 189391 189205 188898 189085 189714 189643 188266 186676 186261 186832 187171 186887
57553 186887 186601 186669 186823 187008 187613 188761 190136 191496 192782 193695 193869 193566 193659 194760 196737 199119 201578
57536 201578 203939 206133 208322 210833 213703 216344 217891 218061 217621 217737 218684 219598 219749 219616 220133 221257
57520B21257Q20J02j24J84O16J173J719J511L56n95l60K83P5o43o85k16l99j236
57502B23838j594j282j270j747j740j017p01j472k540k962k750k225j518j054
57488A99966j368k048j989j056l02k52k53O1K1p27j443j475j191j025o71N2N61
57471A86861M44J52J08m3n97j063r66o35n61o26n84o20q66j010q98r00j245j585
57453A75366j603j388r75j93O72R32N53K95N03N70P5n31p95q88q36j08J377K670
57435A75696K968K580K178J822J394J193J325J214M28n37j024j084r79m41P90
57420A87523K144K662K021O89o19j271j010k71K22L80O63J070J036N92N83J285
57404A97699J818J498Q08L90J8o11j035q03l77l56m95l49j86l83m95P9J011J504
$$ plain form
57520 221257 222077 222179 222055 222239 222855 224028 225747 227258 227614 227019 226659 226942 227017 226374 225689 225473 225074 223838
57502 223838 222244 220962 219692 217945 216205 215188 214487 213015 210475 207513 204763 202538 201020 199966
57488 199966 198598 196550 194561 193505 193203 192951 192698 192759 192780 192053 190610 189135 187944 186919 186248 186300 186861
57471 186861 187305 187457 187565 187522 186925 185862 184896 184261 183700 183074 182490 181870 181004 179994 179096 178196 176951 175366
57453 175366 173763 172375 171400 171207 171879 172811 173364 173659 174162 174732 174807 174276 173481 172593 171757 171649 173026 175696
57435 175696 178664 181244 183422 185244 186638 187831 189156 190370 190798 190261 189237 188153 187174 186733 187523
57420 187523 189667 192329 194350 195039 194420 193149 192139 191868 192090 192470 193133 194203 195239 195831 196414 197699
57404 197699 199517 201015 201823 202213 202231 201620 200585 199782 199405 199049 198554 198205 198019 197636 197141 197220 198231 199735
57386A99735J421J169Q98N98O13J150J649J409N91o8j71K11R23J601J615P88k05
57369B13927p41j025j356j306n12L52L77j77k86K62O87N68L93P09J425K064K245
57352B17606J863J169O15L49R3k15j03P21J781K444K626K472J825P08j95k50K38
57335B33747N20M44L56L24J90J55O27J506K202K259J630N39n10r56p78n12m15
57318B41328j43L77M98j22p45n39K17P77J055J365J534J350J347K058K835K616
57302B55808J681J410K264L138K974K052J323J178J328J425J375J301J307J252
57288B79816R56O97J092K129K847K520J651J152J042Q12N88R47J799K439K672
57273C03159K955L371L440L088K949L422M091M367M183L832L505L241L015K772
$$ plain form
57386 199735 201156 202325 203223 203821 204434 205584 207233 208642 209233 209165 208994 209205 210128 211729 213344 214132 213927
57369 213927 213186 212161 210805 209499 208987 209339 209716 209539 209253 209515 210202 210770 211163 211872 213297 215361 217606
57352 217606 219469 220638 221253 221602 221695 221480 221377 222098 223879 226323 228949 231421 233246 233954 233759 233509 233747
57335 233747 234267 234711 235067 235391 235581 235736 236363 237869 240071 242330 243960 244499 243989 243033 242255 241743 241328
57318 241328 241185 241562 242060 241938 241193 240654 240871 241648 242703 244068 245602 246952 248299 250357 253192 255808
57302 255808 257489 258899 261163 264301 267275 269327 270650 271828 273156 274581 275956 277257 278564 279816
57288 279816 280772 281469 282561 284690 287537 290057 291708 292860 293902 294714 295302 296249 298048 300487 303159
57273 303159 306114 309485 312925 316013 318962 322384 326475 330842 335025 338857 342362 345603 348618 351390
57259C51390K541K478K579K592K580L130M506N816N814M424K862K221K515L056
57245C98504L222K731J707P25M54J073K102K862K969K634K483K943L637L828L438
57230D35312L146L265L265K756K245K354K959L645M421N293N777N566N169N133
57216D90306N146M724M212M236M664N031N491O354P146P163O698O572O806O830
57202E71379O751P161P821P812P078O722P476Q856R939J0252R716Q660P964Q399
57188F85986R624J0590J0863J0863J0840J0586J0164R996J0088J0038R919J0335
57176H09892J1404J2482J3106J3495J3954J4449J4918J5449J6066J6864J8275
57165I70354K0563K3092K4852K5621K6035K6589K7292K8070K8802K9115K8938
$$ plain form
57259 351390 353931 356409 358988 361580 364160 367290 371796 377612 383426 387850 390712 392933 395448 398504
57245 398504 401726 404457 406164 406889 407343 408416 410518 413380 416349 418983 421466 424409 428046 431874 435312
57230 435312 438458 441723 444988 447744 449989 452343 455302 458947 463368 468661 474438 480004 485173 490306
57216 490306 495452 500176 504388 508624 513288 518319 523810 530164 537310 544473 551171 557743 564549 571379
57202 571379 578130 585291 593112 600924 608002 614724 622200 631056 640995 651247 660963 669623 677587 685986
57188 685986 695610 706200 717063 727926 738766 749352 759516 769512 779600 789638 799557 809892
57176 809892 821296 833778 846884 860379 874333 888782 903700 919149 935215 952079 970354
57165 970354 990917 1014009 1038861 1064482 1090517 1117106 1144398 1172468 1201270 1230385 1259323
57154A259323K9013K9993L1371L2150L2283L2426L2690L2796L3108L4220L5653
57143A615026L6353L6376L6730L7666L8581L9528M1250M3596M5571M7163M9480
57132B067320N2727N5764N8160O0957O4737O8567P1695P4803P8596Q2672Q6684
57121B822682R1290R6815J02367J07415J13093J20704J29937J39777J50264J62150
57111D036494J75659J90808K08340K29207K53684K81862L14515L52874L98282
57102F441725M52781N19202O00078O97589Q15486R59985J137862J354457J613902
57093A4593067J919099K269625K660513L084205L532039L991896M445419M868976
57085D1364839N236368N520017N693294N735070N628353N347702M849920M089949
$$ plain form
57154 1259323 1288336 1318329 1349700 1381850 1414133 1446559 1479249 1512045 1545153 1579373 1615026
57143 1615026 1651379 1687755 1724485 1762151 1800732 1840260 1881510 1925106 1970677 2017840 2067320
57132 2067320 2120047 2175811 2233971 2294928 2359665 2428232 2499927 2574730 2653326 2735998 2822682
57121 2822682 2913972 3010787 3113154 3220569 3333662 3454366 3584303 3724080 3874344 4036494
57111 4036494 4212153 4402961 4611301 4840508 5094192 5376054 5690569 6043443 6441725
57102 6441725 6894506 7413708 8013786 8711375 9526861 10486846 11624708 12979165 14593067
57093 14593067 16512166 18781791 21442304 24526509 28058548 32050444 36495863 41364839
57085 41364839 46601207 52121224 57814518 63549588 69177941 74525643 79375563 83465512
57077H3465512L059190J812936M58753q85345k129064l221630m141322m878990
57069G3540040n426951n776769n924746n879901n667286n323823m890584m406985
57061C0242995l907877l421392k966851k554726k189256j871398j599730j370189
57053A0361576j176883j014062q77146p62060o64625n81174n09322m47569l94438
57044C934297l48404l08293k73196k42210k14648j90279j68854j49560j31417
57035A907436j14132r8072q3337o9112n4010l6918j7559L525K5084M4328N5585
57024A562818N1206K6508j4659o0131r6708j17771j24541j21809j13854j03343
57014H87716r1699p9523o7314n6081m6939m0124l5018l1010k7786k4943k2061
$$ plain form
57077 83465512 86524702 88337638 88796391 87911046 85781982 82560352 78419030 73540040
57069 73540040 68113089 62336320 56411574 50531673 44864387 39540564 34649980 30242995
57061 30242995 26335118 22913726 19946875 17392149 15202893 13331495 11731765 10361576
57053 10361576 9184693 8170631 7293485 6531425 5866800 5285626 4776304 4328735 3934297
57044 3934297 3585893 3277600 3004404 2762194 2547546 2357267 2188413 2038853 1907436
57035 1907436 1793304 1695232 1611895 1542783 1488773 1451855 1434296 1437821 1462905 1507233 1562818
57024 1562818 1614024 1640532 1625873 1565742 1469034 1351263 1226722 1104913 991059 887716
57014 887716 796017 716494 649180 593099 546160 506036 471018 440008 412222 387279 365218
57003C65218j9240j6966j5425j4388j3671j3207j2690j1782j0583r380q064o322
56991B13500m332k628j264K68K260M529O952R647J2422J4440J4640J2283P313
56978B90030O65n895j0888j4168j6465j7991j8118j6496j3813j1134q945p073
56966A49709n229l265j119J293M100P370J0940J4461J7767K0924K3542K4326K1856
56953B86675J5880P545j530j0050j7054k1681k3389k2395j9821j7137j5095j3177
56941A48771j0404o730l073N0L208P007J1134J5052J8939K3190K7421L0660L1980
56928B97205L0252K4097J3282pj2437k2015k8533l2058l2459l0476k7745k5140
56916A53966k2052j7894j3469j0191q541p866p283o343n122m021l280k587j479
$$ plain form
57003 365218 345978 329012 313587 299199 285528 272321 259631 247849 237266 227886 219822 213500
56991 213500 209168 206540 205276 205544 207804 212333 219285 228932 241354 255794 270434 282717 290030
56978 290030 290695 284800 273912 259744 243279 225288 207170 190674 176861 165727 156782 149709
56966 149709 144480 141215 140096 141389 145489 152859 163799 178260 196027 216951 240493 264819 286675
56953 286675 302555 310100 308570 298520 281466 259785 236396 214001 194180 177043 161948 148771
56941 148771 138367 131637 128564 128614 131822 138829 149963 165015 183954 207144 234565 265225 297205
56928 297205 327457 351554 364836 364829 352392 330377 301844 269786 237327 206851 179106 153966
56916 153966 131914 114020 100551 90360 81819 73953 66670 60327 55205 51184 47904 45317 43838
56903D3838j21Q30J171J417K068L123M485O207Q146R961J1652J3537J5554J7255
56889A39123J8740K0820K3880K7121K9365K9959K8473K4209J6876P573j637r139
56877C55363j4441j7739j9323j9450j8351j6207j3209r612n684j647K347O387
56865B28434J0914J6451K3086L0415L7963M5291N1576N5270N4384M7199L3295
56854F34278J4504n258k1920l3455m0063m2487m1028l6300k9854k3228j6808j0182
56842C48199l199L945J1394J9596K8691L8493M9108O0876P3409Q4934R2564R2947
56830I00957Q3013O1402L0238m621l6057n9254p3183p9245p9200p4495o6634n7161
56818E45760m7127l6970k6962j7393q369J76Q278J6196K4770L4823M5988N6499
$$ plain form
56903 43838 43717 44547 45718 47135 49203 52326 56811 63018 71164 81125 92777 106314 121868 139123
56889 139123 157863 178683 202563 229684 259049 289008 317481 341690 358566 366139 364502 355363
56877 355363 340922 323183 303860 284410 266059 249852 236643 227031 221347 219700 222047 228434
56865 228434 239348 255799 278885 309300 347263 392554 444130 499400 553784 600983 634278
56854 634278 648782 643524 621604 588149 548086 505599 464571 428271 398417 375189 358381 348199
56842 348199 345000 348945 360339 379935 408626 447119 496227 557103 630512 715446 808010 900957
56830 900957 983970 1045372 1075610 1070989 1034932 975678 902495 823250 744050 669555 602921 545760
56818 545760 498633 461663 434701 417308 408939 409115 417393 433589 458359 493182 539170 595669
56806E95669O4133O6728O1956M8012K5643r88k6338m6405n9602o5871o6089o2056
56794E34792n5836m8711m1117l3334k5774j8759j2586p587l486R49O868J4061
56782C09480K1331K7851L3213L6281L5047K8149J6171J422j3162k5119l3357l8196
56770C99111m0295l9770l6823l2616k8535k4759k0588j6162j2721j0978j0223
56759A25641r400q164o614m904l485k931l118l234k959k819l030k905k047j263
56745F8768j464k224k339j549q54j133k017k331j441K8Q28M33l60m48K97J119
56729E5313J469J368Q81M5o79o95j65J78J85M67J118J319O32r5J61J274K337K853
56711F7966K872K480J822J333J314J492J463J326J382J499J301P91K80j74p57
$$ plain form
56806 595669 659802 726530 788486 836498 862141 861153 834815 788410 728808 662937 596848 534792
56794 534792 478956 430245 389128 355794 330020 311261 298675 291088 287602 288551 295419 309480
56782 309480 330811 358662 391875 428156 463203 491352 507523 508945 495783 470664 437307 399111
56770 399111 358816 319046 282223 249607 221072 196313 175725 159563 146842 135864 125641
56759 125641 116241 108077 101463 96559 93074 90143 87025 83791 80832 78013 74983 72078 70031 68768
56745 68768 67304 65080 62741 61192 60338 59205 57188 54857 53416 53444 54272 54705 54345 53897 54194 55313
56729 55313 56782 58150 59031 59076 58397 57702 57537 57715 57900 58367 59485 60804 61436 61341 61502 62776 65113 67966
56711 67966 70838 73318 75140 76473 77787 79279 80742 82068 83450 84949 86250 87041 87321 87147 86390
56696H6390j320j340o67M8K5o57j071o56%p2q30j291r91n65n98p73o99p17j094
56677G3122j217o18j04o12j540j556o89j24k08j60K72N52P55J528K466K208O95
56660G4770m35k41L16K73R3L17L79o3o9J024K223K406K102K376K949K907K526
56643I3853K834L876M777N142N272N322N259N274N330M783L356J891J210R05K78
56628A49362k30J77J050J228O09M8j95o73j551k370k881l208l262k979k857l282
56612A28986l670l295k619k603l009k633j215J61O08K80l96j211j782j628r13
56597A05061l09n6J40L85N16O67J010J088L40p98j239p09Q6O74J152J367R08M4
56579A10327l52p7K02K59O56J536K053J613P92M63O23P22O44P47J251J980K588
$$ plain form
56696 86390 85070 83730 83063 83111 83136 82479 81408 80752 80752 80680 79850 78559 77568 77003 76405 75632 74933 74216 73122
56677 73122 71905 71287 71183 70571 69031 67475 66786 66662 66454 66294 66566 67118 67873 69401 71867 74075 74770
56660 74770 74335 74094 74410 74683 74776 75093 75472 75409 75340 76364 78587 80993 83095 85471 88420 91327 93853
56643 93853 96687 100563 105340 110482 115754 121076 126335 131609 136939 141722 145078 146969 148179 149084 149362
56628 149362 149132 149309 150359 151587 152196 152244 152049 151376 149825 147455 144574 141366 138104 135125 132268 128986
56612 128986 125316 122021 119402 116799 113790 111157 109942 110103 110711 110991 110595 109384 107602 105974 105061
56597 105061 104752 104696 104836 105221 105737 106404 107414 108502 108842 108044 106805 106096 106182 106856 108008 109375 110283 110327
56579 110327 109975 109898 110100 110359 111015 112551 114604 116217 117009 117472 118095 118817 119461 120208 121459 123439 126027
56562A26027K851K949L484M936P025Q875R722R278P661N414L394K149J477R59
56548A96201N78M11J37m96j073j063o28k26J19L48k48k001l713l794k452j455
56532A80645j738k525k923l008k952k399j315m29k05j87O3K35rl38m16n87j220
56515A60692j930k121j950k047k550k953k884k528k284k244k127j679j053o20
56501A31722m26p8N79J139J205R41O74M03J64L35R88J394R52J75k5K92L93J77
56483A41004J83N00O48N12M10K95j42n58j62J047K126K375J959J252M24k56m82
56466A51135m09m38n08k74J81N43R70J704K226J790P35J98N25R28P38Q0p00j296
56448A58128j171q0J153J348M83m41q55r39p15o5M13j5q68r41j28N78Q05J032
$$ plain form
56562 126027 128878 131827 135311 140247 147272 156147 165869 175147 182808 188222 191616 193765 195242 196201
56548 196201 196779 197190 197327 196831 195758 194695 194067 193841 193960 194308 194060 192059 188346 184552 182100 180645
56532 180645 178907 176382 173459 170451 167499 165100 163785 163356 163151 162964 163027 163262 163253 162915 162499 161912 160692
56515 160692 158762 156641 154691 152644 150094 147141 144257 141729 139445 137201 135074 133395 132342 131722
56501 131722 131296 131218 131797 132936 134141 135082 135756 136159 136323 136658 137646 139040 139992 140167 140142 140434 140827 141004
56483 141004 141187 141687 142335 142847 143257 143552 143410 142852 142690 143737 145863 148238 150197 151449 151873 151617 151135
56466 151135 150726 150288 149780 149506 149687 150230 151200 152904 155130 156920 157655 157853 158378 159306 160044 160124 159424 158128
56448 158128 156957 156877 158030 159378 159861 159420 158565 157626 156911 156846 157259 157244 156376 155435 155307 155885 156690 157722
56430A57722J159N85j60L12J890K740J957P48K80J11l79o66k82J49R7Q7M61N18
56412A67329l1j23R36K011J747N64j96k67l06n08o25p15q33n36L43J125J305J453
56394A72673K169K917K882K330K080K198K186J899J427N86o30j661k186k627l219
56379A83024l246k120m70O88J252J644J825J564J189J137J338J647K214K772K455
56364A96913J164K10N95J480J460N97L1J74N71J035J658K114J993J674J809K205
56348B15683K133J491P79K21k47m32j15M06P38J036J577K101K211K076J974J640
56332B33272P85j03k66K67P60O63M3n61l98Q34K349K936K535K252K589K733K112
56315B52802J350R98N46l93j058p60p3K37M17Q58J086P88P56J541K268K151K063
$$ plain form
56430 157722 158881 159466 159306 159618 161508 164248 166205 166953 167233 167344 166965 166299 166017 166166 166263 166350 166811 167329
56412 167329 167298 167175 168111 170122 171869 172433 172237 171970 171664 171156 170531 169816 168983 168447 168790 169915 171220 172673
56394 172673 174842 177759 180641 182971 185051 187249 189435 191334 192761 193347 192717 191056 188870 186243 183024
56379 183024 179778 177658 177188 177876 179128 180772 182597 184161 185350 186487 187825 189472 191686 194458 196913
56364 196913 198077 198287 198882 200362 201822 202419 202450 202624 203195 204230 205888 208002 209995 211669 213478 215683
56348 215683 217816 219307 220086 220307 220060 219628 219513 219919 220657 221693 223270 225371 227582 229658 231632 233272
56332 233272 234057 233954 233688 233955 234715 235378 235421 234860 234462 235296 237645 240581 243116 245368 247957 250690 252802
56315 252802 254152 255150 255696 255303 254245 253485 253412 253649 254066 254924 256010 256798 257554 259095 261363 263514 265577
56298B65577L083M401M467L445K753K736K559K022J717J621J168O08P88J677K412
56283C01034K764L183L568L403L027L406M516N253N091M678M577M548M411M635
56269C58094N674P212Q417Q665Q031P288P293Q185R565J1332J3591J5752J6914
56256D86013J7484J9053K2133K5423K8101L1230L5797M0948M5559N0127N5531
56245H57399O1118O5706O9348P2491P4492P4627P3567P2038O9074O3427N5735
56234A609022M7276L7627K5678J2228o86j2396k3466l3532m1531m7700n3117n7551
56222A461852n9865o0315o0316o0109n8740n6198n3492n0723m7142m3120m0016
56211H71816l7966l5758l2937l0259k7970k5507k2914k0834j9090j6892j4396
$$ plain form
56298 265577 268660 273061 277528 280973 283726 286462 289021 291043 292760 294381 295549 296157 296945 298622 301034
56283 301034 303798 306981 310549 313952 316979 320385 324901 330154 335245 339923 344500 349048 353459 358094
56269 358094 363768 370980 379397 388062 396093 403381 410674 418859 428424 439756 453347 469099 486013
56256 486013 503497 522550 544683 570106 598207 629437 665234 706182 751741 801868 857399
56245 857399 918517 984223 1053571 1126062 1200554 1275181 1348748 1420786 1489860 1553287 1609022
56234 1609022 1656298 1693925 1719603 1731831 1731145 1718749 1695283 1661751 1620220 1572520 1519403 1461852
56222 1461852 1401987 1341672 1281356 1221247 1162507 1106309 1052817 1002094 954952 911832 871816
56211 871816 833850 798092 765155 734896 706926 681419 658505 637671 618581 601689 587293
56200E87293j2411j0866r209p939p808p973o969n205m282m208l546k126j260j266
56186E02225j151p50q65j239p54K70L94k67j13J061J750J517J566K167K146J382
56170E09339J385K590L548L421L099L240L396L638M774O408P076O848P376Q862
56156E75000R564R032R119J0855J2851J3969J5155J7429K0283K3291K7259L2538
56144G76345L8243M4216N1889O2163P4203Q7127J00826J14156J24398J29435J28728
56133A731729J21790J08201R0151P2506N9065N0389M5718M4241M3474L9172K8955
56122B435391J4530n16j3368k1975k5367k5609k7337l3855m5093n9798p7106r4929
56110B024968j09447j17923j20260j16999j08232r5528q2307p0631n9761m8960
$$ plain form
56200 587293 574882 564016 554807 546868 539060 531087 524118 518913 514631 510423 506877 504751 503491 502225
56186 502225 501074 500324 499459 498220 497466 497736 498130 497863 497750 498811 500561 502078 503644 505811 507957 509339
56170 509339 510724 513314 516862 520283 523382 526622 530018 533656 538430 544838 551914 558762 566138 575000
56156 575000 584564 593596 602715 613570 626421 640390 655545 672974 693257 716548 743807 776345
56144 776345 814588 858804 910693 972856 1047059 1134186 1235012 1349168 1473566 1603001 1731729
56133 1731729 1853519 1961720 2051871 2124377 2183442 2233831 2279549 2323790 2367264 2406436 2435391
56122 2435391 2449921 2449405 2436037 2414062 2388695 2363086 2335749 2301894 2256801 2197003 2119897 2024968
56110 2024968 1915521 1797598 1677338 1560339 1452107 1356579 1274272 1203641 1143880 1094920
56100A094920l9315l1593k4743j8101j2797r533p168m822l229k716k103q14J69
56087I38155N41J446L001L654L094L101M378N355N299N670P069P962P817Q357
56073A004899J0151J1174J0413R751J0555J1623J2165J3505J5891J7163J6601
56062A143891J6584J8397J9920J9752J9877K1696K3082K2147K0439J9611J8388
56051A363784J5803J3961J4481J5380J4622J3596J4123J5165J5536J6611J9322
56040A532384K1651K2140K2646K4732K6757K7426K8578L1375L3615L3950L4766
56029A840020L7550L9646L9207L8984M1248M3459M3173M2831M5079M7681M8007
56018B306885M8314N1463N5378N6992N7929O1076O5118O7669P0104P4294P8271
$$ plain form
56100 1094920 1055605 1024012 999269 981168 968371 958838 951670 946848 943619 940903 938800 937986 938155
56087 938155 938696 940142 943143 946797 949891 952992 957370 962725 968024 973694 980763 988725 996542 1004899
56073 1004899 1015050 1026224 1036637 1046388 1056943 1068566 1080731 1094236 1110127 1127290 1143891
56062 1143891 1160475 1178872 1198792 1218544 1238421 1260117 1283199 1305346 1325785 1345396 1363784
56051 1363784 1379587 1393548 1408029 1423409 1438031 1451627 1465750 1480915 1496451 1513062 1532384
56040 1532384 1554035 1576175 1598821 1623553 1650310 1677736 1706314 1737689 1771304 1805254 1840020
56029 1840020 1877570 1917216 1956423 1995407 2036655 2080114 2123287 2166118 2211197 2258878 2306885
56018 2306885 2355199 2406662 2462040 2519032 2576961 2638037 2703155 2770824 2840928 2915222 2993493
56007B993493Q0204Q2623Q7761R2923R5617R8640J04753J11163J14958J19003
55997C981138J26386J34403J40241J47083J57817J68572J75734J83464J96543
55988E411381K11760K24627K38425K57750K79308K98420L18638L45138L74791
55979G960238M02888M33336M71654N14397N56637O03120O60468P25555P93958
55970A3122251Q72121R68155J079072J201202J344271J520084J727575J966320
55962B3801051K254527K615905L061737L607731M295721N174497O272457P615150
55954E8698776R254834J1256733J3681971J6621909K0211410K4525582K9429889
55947A83681104L4499479L8934848M1396828M0069221L3399469K1293567N723174
$$ plain form
56007 2993493 3073697 3156320 3244081 3337004 3432621 3531261 3636014 3747177 3862135 3981138
55997 3981138 4107524 4241927 4382168 4529251 4687068 4855640 5031374 5214838 5411381
55988 5411381 5623141 5847768 6086193 6343943 6623251 6921671 7240309 7585447 7960238
55979 7960238 8363126 8796462 9268116 9782513 10339150 10942270 11602738 12328293 13122251
55970 13122251 13994372 14962527 16041599 17242801 18587072 20107156 21834731 23801051
55962 23801051 26055578 28671483 31733220 35340951 39636672 44811169 51083626 58698776
55954 58698776 67953610 79210343 92892314 109514223 129725633 154251215 183681104
55947 183681104 218180583 257115431 298512259 338581480 371980949 393274516 398997690
55940C98997690j0031464k2998141l1684417l6100367l7066532l5590421l2593263
55933A92933085k8823259k4822631k0953555j7451751j4441854j1936262r878301
55926F4625472q204334o859300n779438m899390m176494l586726l102290k693298
55918B5324202k345191k054286j809714j596288j410015j253946j122267j003411
55910A2729084q95144q02394p23426o51389n86415n33473m90637m51076m14159
55901G180971l83810l58442l32902l07890k87537k70154k50970k31416k16314
55892D541536k04224j89880j74048j61728j52425j41200j27899j16769j08160
55883C165203r8969r0372q6938q8526r0382r0831r1860r2772r0211q4328p8620
$$ plain form
55940 398997690 388966226 365968085 334283668 298183301 261116769 225526348 192933085
55933 192933085 164109826 139287195 118333640 100881889 86440035 74503773 64625472
55926 64625472 56421138 49561838 43782400 38883010 34706516 31119790 28017500 25324202
55918 25324202 22979011 20924725 19115011 17518723 16108708 14854762 13732495 12729084
55910 12729084 11833940 11031546 10308120 9656731 9070316 8536843 8046206 7595130 7180971
55901 7180971 6797161 6438719 6105817 5797927 5510390 5240236 4989266 4757850 4541536
55892 4541536 4337312 4147432 3973384 3811656 3659231 3518031 3390132 3273363 3165203
55883 3165203 3066234 2975862 2888924 2800398 2710016 2619185 2527325 2434553 2344342 2260014 2181394
55872B181394p4005o8821o3940o1905o1661n9826n6548n4612n3619n0700m6237
55861A529520m3266m1760l8937l4783l2008l0951k9475k7443k6460k5890k3930
55850A174617k1847k2306k4271k4600k3771k4776k7012k6805k3899k2059k2806
55839I10465k3546k2488k0863j9619j8066j6389j5765j5622j4291j2383j1952
55828G19481j2524j1726r567q266q062p147n694n988q301j0350j1048j1375j1557
55815E97876j0783r734r937j0702j0029q255p394p286o070m063l265l287j813
55802E05258R61K460K352L002M898N801M934M106L944K872O46q68j332k707n394
55787E30933p066o529n382m772l767k188j917l909o681q946j1131j3210j3717
$$ plain form
55872 2181394 2107389 2038568 1974628 1912723 1851062 1791236 1734688 1680076 1626457 1575757 1529520
55861 1529520 1486254 1444494 1405557 1370774 1338766 1307815 1278340 1250897 1224437 1198547 1174617
55850 1174617 1152770 1130464 1106193 1081593 1057822 1033046 1006034 979229 955330 933271 910465
55839 910465 886919 864431 843568 823949 805883 789494 773729 758107 743816 731433 719481
55828 719481 706957 695231 685664 677398 669336 662189 656495 650507 642206 631856 620808 609433 597876
55815 597876 587093 577359 567422 556720 546691 538436 531042 523756 517686 513623 510358 507071 505258
55802 505258 506219 508679 511031 514033 518931 524732 529666 533772 537716 540588 541234 540366 539034 536327 530933
55787 530933 523867 517338 511956 507184 503417 501229 499312 495403 488722 479776 468645 455435 441718
55774D41718j2079r592p023l656N73M388P300R843J1065Q663K660l701p743r743
55760D32673j0674j0380r139q477r011r509r223r032r382r277q329p723q071q360
55746C06086p962p687p808p165n287l507k863k642j967j189q06n89n21j086k067
55731B52940k534k369k226j974j114o90k412n583p388o746n417m768m010k540
55717B03169j433j351j214j54J156K129L269M662N400N373N632O174N502L281
55703B41595J221L20n67k347m068m890n560o645p282o931o440o203n250l401k238
55688A81314k513k660j345L80J056J084J406J676J480J772L338N162N901N675
55674B03726N093L843J812J20m19o43j404j943j442q00j196k012j935j103n54
$$ plain form
55774 441718 429639 420047 413024 409368 409941 414329 421629 431472 442537 451200 453860 450159 442416 432673
55760 432673 421999 411619 402480 394003 384992 375483 366260 357228 347846 338569 330240 322517 314446 306086
55746 306086 298124 290437 282629 275464 270177 266670 263807 261165 259198 258009 257203 256614 256093 255007 252940
55731 252940 250406 248037 245811 243837 242723 242033 239621 234038 226650 219904 214487 209719 205709 203169
55717 203169 201736 200385 199171 199017 200173 202302 205571 210233 215633 221006 226638 232812 238314 241595
55703 241595 242816 243136 242569 240222 236154 231264 225704 219059 211777 204846 198406 192203 186953 183552 181314
55688 181314 178801 176141 174796 175176 176232 177316 178722 180398 181878 183650 186988 192150 198051 203726
55674 203726 208819 212662 214474 214594 214175 213532 212128 210185 208743 207943 206747 204735 202800 201697 201143
55659B01143l19K91J184J717J879K019J872J011j97r36q36j8J063J441L41j484
55643B10171k322j868j652k572l629l927m186n181o198o374o228o466o544n699
55629A47325m415l569l089k550k089j791j148j35L06k35q23p95q74j641k280k007
55613A20190j448j387j378q92n64r71j377j019n18o75j002q26p01j303j926j598
55597A02605p76m84n98m43k65p08j437j581j029k99K83M14l13j518k007j379n66
55580H9899j14O40J816K183J295P29J602K596K179J224J417K412K758K511K703
55565A15850L097K665J699J362J535J057k84j655k708l610m010l591l038l011
55551A05358k804j568j04K69j00LM44K53k60J2Q39J020N86O35J211J349J046J190
$$ plain form
55659 201143 200824 201115 202299 204016 205895 207914 209786 210797 210600 209664 208828 208810 209873 211314 211655 210171
55643 210171 207849 205981 204329 201757 198128 194201 190015 184834 178636 172262 166034 159568 153024 147325
55629 147325 142910 139341 136252 133702 131613 129822 128674 128539 128845 128610 127787 126992 126118 124477 122197 120190
55613 120190 118742 117355 115977 115085 114521 113550 112173 111154 110636 109961 108959 108133 107432 106129 104203 102605
55597 102605 101829 101345 100747 100304 100039 99331 97894 96313 95284 94985 95268 95682 95369 93851 91844 90465 89899
55580 89899 89785 90425 92241 94424 95719 96448 98050 100646 102825 104049 105466 107878 110636 113147 115850
55565 115850 118947 121612 123311 124673 126208 127265 126981 125326 122618 119008 114998 111407 108369 105358
55551 105358 102554 100986 100882 101151 101051 101054 101498 101751 101491 101503 102342 103362 103948 104583 105794 107143 108189 109379
55533A09379J583J084j46n76K97J260J404J119P98J57o94j037p96p17j016j114
55517A10985r23j112j734j926j300n29k38l14m91o92o98m28n04j590l215m266
55501I1025m488m462m340l740k714j677o13N37J123O62J19P89K174K608J790J017
55485G9810R56R10M67J25Jn35j478j898j453q99p02m69n4J3l43m30k6K08m9k51
55465G3903J0M51Q22J167J188N15l33m08Q8Oq99j614j593j390j287q00RJ86m66
55446F9555q07j31O97P12K86K59N75O75M94K99J68J51L63N43J57p23j365j436
55428G0472j256r20r5J028J622J424J062Q79N18k0j9O70J182R85O74P82Q53M07
55410H0248j22j81l7j61m12m88n56p72q28n61m29q27j495j968k085j757r19pK31
$$ plain form
55533 109379 110962 112046 111900 111324 111621 112881 114285 115404 116202 116359 115665 114628 113832 113115 112099 110985
55517 110985 110062 108950 107216 105290 103990 103461 103223 102909 102418 101726 101028 100600 100096 98506 95291 91025
55501 91025 86537 82075 77735 73995 71281 69604 68991 69528 70651 71313 71432 72221 74395 77003 78793 79810
55485 79810 80766 81676 82143 82268 82269 81734 80256 78358 76905 76006 75304 74835 74781 74794 74451 74021 73995 74203 74154 73903
55465 73903 73913 74364 75186 76353 77541 78056 77723 77315 77403 77409 76510 74896 73303 71913 70626 69826 69835 70021 69555
55446 69555 68748 68617 69314 70026 70312 70571 71146 71821 72315 72614 72782 72933 73296 73839 73996 73273 71908 70472
55428 70472 69216 68296 68201 69229 70851 72275 73337 74216 74734 74714 74695 75365 76547 77532 78206 78988 79841 80248
55410 80248 80126 79945 79908 79747 79335 78847 78291 77519 76691 76130 75701 74874 73379 71411 69326 67569 66650 66643 66874
55391F6874j99l74L17J449K278K410J643R4j288j399n55k80j145j995j871j360
55375F4599j240j067k44N46K88o77j164r17p44j089j494j369n95N54J570J930
55359E8887J596J125R22Q11N61L99N87R66J294J536J538J018K39M8O91J256Q64
55342G4338j54q03p43m12k43k82l30j39K80L94k64j170j180j07R16R86N10K62
55324G1859K44J17J4J20J03k90o32m77j23j4M5L54N29P8o55r16o22l43m06p00
55304F8285j025j132o54L56J133J055N18L72P52J082R77N58M4m04n36k28K67O71
55286G2091J058J498J623J039k6r62j481j671j543j044m07l2j0n9R6N02J017J379
55268G3068J351R20L63l3j65j52k55o68j144j046k01O54P39L00R8J80Q5M7P32
$$ plain form
55391 66874 66675 66301 66618 68067 70345 72755 74398 74492 73204 71805 71250 70970 69825 67830 65959 64599
55375 64599 63359 62292 62048 62594 62882 62205 61041 60124 59380 58291 56797 55428 54833 55387 56957 58887
55359 58887 60483 61608 62530 63341 63902 64301 64888 65854 67148 68684 70222 71240 71479 71527 72218 73474 74338
55342 74338 74184 73381 72638 72226 71983 71701 71371 71232 71512 71906 71642 70472 69292 69185 70101 71087 71597 71859
55324 71859 72103 72220 72234 72354 72457 72167 71535 71058 70935 70921 70966 71320 71849 71927 71272 70356 69734 69391 68985 68285
55304 68285 67260 66128 65474 65830 66963 68018 68536 68908 69660 70742 71719 72277 72321 71917 71381 71153 71420 72091
55286 72091 73149 74647 76270 77309 77283 76321 74840 73169 71626 70582 70175 70143 70133 70074 70170 70672 71689 73068
55268 73068 74419 75339 75702 75669 75504 75352 75097 74429 73285 72239 72038 72692 73431 73731 73829 74009 74094 74141 74873
55249G4873J803J978R59NJ35P86R34N03m1n88j063j051n82m74j113j625j143j88
55231G4108J86nQ8P19J360J577J268L47j016k026k001j243n61k16L0K06J89K09
55213G3219N59R73R19L38m06r80j070m26N75R19K12n65l56M41O79K48J13O83J255
55194G7330J128M78q0j69J92O52O75O4p78j329j510j406r32k29O9l06n60J69J432
55175G4890J944J274K50k52j61J10J64k85j168j854j688p49L27J122J565J548
55159G7037J072O44Q32J375J428O72l33j001j341j545j518j086l69K71N75N91
55143G7304O18Q70J168J100N72j6k49p9K65M12q7j240k193j965p96P5J32J37N93
55124G6621Q00J77m65j10Q26J210R29P30P15K93n19r28n16L08J016J336J022J50
$$ plain form
55249 74873 76676 78654 79613 79618 79753 80539 81473 81976 81935 81347 80284 79233 78651 78177 77064 75439 74296 74108
55231 74108 74294 74289 74377 75096 76456 78033 79301 79648 78632 76606 74605 73362 72801 72585 72615 72821 73010 73219
55213 73219 73778 74751 75670 76008 75602 74622 73552 73126 73701 74620 74832 74267 73911 74352 75031 75279 75392 76075 77330
55194 77330 78458 78936 78856 78687 78879 79531 80206 80270 79492 78163 76653 75247 74315 74086 74155 73849 73289 73458 74890
55175 74890 76834 78108 78358 78106 77945 78055 78219 77934 76766 74912 73224 72475 72802 73924 75489 77037
55159 77037 78109 78753 79585 80960 82388 83060 82727 81726 80385 78840 77322 76236 75867 76138 76713 77304
55143 77304 77922 78792 79960 81060 81632 81616 81367 81288 81553 81965 81878 80638 78445 76480 75684 75759 75891 76028 76621
55124 76621 77421 77598 77133 77023 77849 79059 79988 80718 81433 81726 81207 80279 79763 80071 81087 82423 83445 83595
55106H3595n12k45N31P65K15m26p33r35j069p29J49J014J425J469J318R71N22
55089H7325J87%l1L20J029J364O50o19j242q40j46J61J15o5l46n66m65j92j47
55070H6492l38l82j90k5M5J20J1m74q87o26L8J93l29p42n35q8J55K83M32M51L12
55049H3916K28J52k34q11j008o65k88j78kM96R81J023O62J83j73j78K36O40M67
55030H5447k04p20p84p27p51o09j99J34J64O7k5k10l89k38K08N33O51R13J339
55011H4600J382P52p5m69k53M31J320J869J528N19k31j86K27L52J01k87o89r68
54993H9923q74l82K57R20J663K200J935Q56k08n08k25rj58m80o21k72N51J322
54975I5890J459J090Q70R40P17n8p42o73r2K70J37j83k71J32R46J566J256J05
$$ plain form
55106 83595 83083 82838 83369 84134 84349 83923 83190 82255 81186 80457 80606 81620 83045 84514 85832 86803 87325
55089 87325 87512 87512 87481 87801 88830 90194 90844 90225 88983 88143 87997 88158 88273 88208 87862 87296 86831 86639 86492
55070 86492 86154 85772 85582 85557 85602 85722 85733 85259 84372 83746 83784 83977 83648 82906 82371 82283 82438 82721 83153 83604 83916
55049 83916 84144 84296 84062 83251 82243 81578 81290 81112 81110 81606 82587 83610 84272 84455 84282 84104 84340 84980 85447
55030 85447 85243 84523 83739 83012 82261 81652 81453 81587 81751 81818 81793 81583 81194 80956 81164 81697 82348 83261 84600
55011 84600 85982 86734 86659 86190 85937 86368 87688 89557 91085 91604 91373 91187 91414 91766 91867 91580 90891 89923
54993 89923 89049 88667 88924 89844 91507 93707 95642 96498 96290 95782 95557 95548 95390 94910 94289 94017 94568 95890
54975 95890 97349 98439 99309 100249 100966 100908 100166 99493 99401 99671 99808 99625 99354 99486 100432 101998 103254 103359
54957A03359q66r06m19k78n52n13K40J159J403P66j13n04l97l82p47j031p74k28
54939I9217J37M21R63J465J292N29q4k73m19n85l30K99N78L26M04J471K976M002
54921A12389M487N003N803O681P419P799P576O896O395O427O456N663L840J292
54907A94126j669m678p033q142q193p914p680p234o279n060m145l772l570k985
54893A15772j985j029l42L63J160J441P89q6j32N49R35P55Q74J793K825L175L046
54876A29903L150L819N037O702Q353R176Q848P886O786N357L297Q95j412l671
54862A94126o059q205r490r722r200q242p038n723m348l016k107k005k492k835
54848A13644k667k246j785j157m49j68n52j224j774k091j908q96M70R68J96p23
$$ plain form
54957 103359 102493 101587 101168 100890 100338 99825 100065 101224 102627 103393 103280 102776 102379 101997 101250 100219 99445 99217
54939 99217 99354 99775 100738 102203 103495 104024 103940 103667 103248 102663 102333 102632 103210 103536 103940 105411 108387 112389
54921 112389 116876 121879 127682 134363 141782 149581 157157 164053 170448 176875 183331 188994 192834 194126
54907 194126 192457 187779 180746 172604 164411 156497 148817 141583 135304 130244 126099 122327 118757 115772
54893 115772 113787 112758 112416 112779 113939 115380 116169 116083 115951 116500 117435 118190 119064 120857 123682 126857 129903
54876 129903 133053 136872 141909 148611 156964 166140 174988 182874 189660 195017 198314 199209 197797 194126
54862 194126 188067 179862 170372 160650 151450 143208 136170 130447 126099 123083 120976 118971 116479 113644
54848 113644 110977 108731 106946 105789 105340 105172 104620 103396 101622 99531 97623 96727 97197 98165 98361 97638
54832I7638o54O9M60M82Q37J515J676Q32n04j475j622j050k91O1p7j50L17J063
54814I9127J440J115K33q00j431j213l49L91O11P31J166J507J026k93j652k200
54798I9409j604j87J205J788J552J164J011P73J26o39j022r01m67N2M01M59N55
54781A03675J080J749J878J450J108R95O27J19L92J643K790L064L072L490L862
54766A30994L690L674M669O212P349Q194R380J0518J0526R138O929M166Q97k210
54752B14126m366n858p512r127r661q946q013p524p050o076m782l518k403j624
54738A27666j400j458j240p06k71L8N15R67Q55L75M56J416K426K672K345K131
54722A36787K319K800L535M652O206P906Q937Q362O217L818K429J739M63j817
$$ plain form
54832 97638 96984 97053 97513 97995 98832 100347 102023 102855 102351 100876 99254 98204 97913 97974 97897 97747 98064 99127
54814 99127 100567 101682 101915 101115 99684 98471 98122 98513 99124 99855 101021 102528 103554 103261 101609 99409
54798 99409 97805 97618 98823 100611 102163 103327 104338 105111 105237 104598 103576 102675 102208 102260 102661 103120 103675
54781 103675 104755 106504 108382 109832 110940 111935 112562 112681 113073 114716 117506 120570 123642 127132 130994
54766 130994 134684 138358 143027 149239 156588 164782 174162 184680 195206 204344 211273 215439 216336 214126
54752 214126 209760 203902 196390 187263 177602 168656 160643 153119 146069 139993 135211 131693 129290 127666
54738 127666 126266 124808 123568 122862 122591 122629 123144 124111 124966 125341 125797 127213 129639 132311 134656 136787
54722 136787 139106 141906 145441 150093 156299 164205 173142 181504 187721 191539 193968 195707 196170 194353
54708A94353m232n989p161p981q308q094p612o843n400l427j921j644k116k218
54694A21407j521o49m38j031j777j887j252n07k81n47r40j298j548j369n55M73
54678A06280J060J078Q71N58k6p52j132r00k96K18L03l1k73J41R50J111J98q70
54660A08488j064o47m70n46l46j10n61j444j638q06J68N50N04K80k33q03p28P5
54642A00669P37P03N25Q53J367J350Q19L77L07L32J81j00l11l74m25o02p61n65
54624A05082q2J35r7j62L77Q38L15q18j288o87K04P63J183J573J506Q48J85jR8
54605A09972J31N4j69o12r40o16K02P12N65K10n2m51r00p10M00J661K144J690
54587A13291O59n24j272j048j35M72L23j0l4r5n68j127j389j532j607j045M32
$$ plain form
54708 194353 190121 184132 176971 168990 160682 152588 144976 138133 132733 129306 127385 125741 123625 121407
54694 121407 119886 119237 118799 117768 115991 114104 112852 112345 112064 111517 110577 109279 107731 106362 105807 106280
54678 106280 107340 108418 109289 109847 109821 109069 107937 107037 106741 106959 107262 107231 106958 107099 108049 109160 109358 108488
54660 108488 107424 106777 106307 105761 105415 105305 104744 103300 101662 100856 101024 101574 102078 102358 102125 101322 100594 100669
54642 100669 101406 102109 102634 103487 104854 106204 107023 107400 107707 108039 108220 108120 107809 107435 107010 106408 105647 105082
54624 105082 105000 105135 105038 104876 105253 106091 106406 105588 104300 103613 103817 104580 105763 107336 108842 109690 109875 109874 109972
54605 109972 110103 110157 109988 109376 108436 107820 108022 108734 109299 109509 109457 109006 108106 107396 107796 109457 111601 113291
54587 113291 113950 113426 112154 111106 110971 111443 111766 111756 111722 111627 111059 109932 108543 107011 105404 104359 104791
54570A04791J929K276J396J92n79p02k75K91L64j98o94m70J67M97M33M65P88J122
54552A11793J197R42L88k25m55k29r8m99j003q38M2R49J376J446J466J471J313
54535A19036R94P62Q80J205J160M32m43o48k23J2k38k64M87J430J573P56m07j362
54517A25142j862j706q63J85P47N94J59O7N58J192J131j9j583k424k190j522r54
54500A16652k79P63J745J997J428M66m67j086j175p44j50J66K8m29p74n26K68
54483A17883Q07M21m57q70o31l19o8M71J027P94m4j63R88K287K637K389K267J995
54465A31414J185O03J167K304K571J622L95m14r54j377j476j228r25p31o38p60
54449A32758j095j169o23M6M5o12j166j134o98j84J47no51j204j054l72K54O87
$$ plain form
54570 104791 106720 108996 110392 110584 110005 109303 109028 109319 109683 109485 108791 108321 108488 108985 109418 109883 110671 111793
54552 111793 112990 113932 114320 114095 113640 113411 113313 112814 111811 110973 111015 111964 113340 114786 116252 117723 119036
54535 119036 120030 120792 121672 122877 124037 124469 124026 123378 123155 123167 122929 122665 123152 124582 126155 126911 126504 125142
54517 125142 123280 121574 120711 120896 121643 122237 122396 122463 123021 124213 125344 125325 123742 121318 119128 117606 116652
54500 116652 116373 117136 118881 120878 122306 122772 122305 121219 120044 119300 119150 119316 119344 118915 118141 117615 117883
54483 117883 118690 119111 118654 117784 117153 116834 116766 117237 118264 119058 119014 118851 119839 122126 124763 127152 129419 131414
54465 131414 132599 133202 134369 136673 139244 140866 141261 140847 139893 138516 137040 135812 134887 134156 133518 132758
54449 132758 131663 130494 129871 129917 129962 129350 128184 127050 126352 126168 126315 126310 125659 124455 123401 123029 123283 123970
54431A23970J135J424J111K65n14q43p69l68K43O55N62L05M15O96N04j38m78j32
54413A28043M13N91M22J49k70q91j361j133m5J383K265K123J401R83J157J360
54397A36590J121P12N79O27N73N56Q01J029Q22L14r7l92p73j086j067q72q13p51
54379A37873m31j12j99m34k88N7p9o38p25J52J353J887J460N49j21p7N23R74P32
54360A42456N4l81k97L4L02M01L29K18K94M91M14L9J8P31J491J372N16j76m22
54341A47884p78j584k403k596j938p06M65R69R23J063J611J809J187N93R82J804
54325A49285J801R56L73L95K79k80p25q76j246j814j781r89m56q77j615j723j186
54308A39521n17L6L78L32N0MK35K32r7j62K43M34l8o13o30k69OK13M37K82m06
$$ plain form
54431 123970 125105 126529 127640 127905 127391 126548 125779 125411 125654 126309 126871 127176 127591 128287 128791 128653 128175 128043
54413 128043 128456 129047 129469 129618 129348 128457 127096 125963 125918 127301 129566 131689 133090 134073 135230 136590
54397 136590 137711 138423 139002 139629 140202 140758 141559 142588 143410 143724 143627 143235 142462 141376 140309 139437 138624 137873
54379 137873 137442 137330 137131 136697 136409 136466 136387 135749 135024 135176 136529 138416 139876 140425 140304 140227 140750 141724 142456
54360 142456 142510 142129 141832 141866 142168 142569 142898 143116 143410 143901 144315 144354 144372 145103 146594 147966 148482 148306 147884
54341 147884 147106 145522 143119 140523 138585 137879 138344 139313 140236 141299 142910 144719 145906 146499 147481 149285
54325 149285 151086 152042 152415 152810 153089 152809 152084 151208 149962 148148 146367 145378 144922 144045 142430 140707 139521
54308 139521 139004 139040 139418 139750 139800 139804 140039 140271 140174 140012 140255 140689 140651 140038 139408 139139 139145 139358 139795 140077 139671
54287A39671q76l75P16J327J036K84m58r70j060o82j88N7K10O00J014Q82J49n48
54269A40789o37k42K8j80n41l91M57J364J611J271R54Q66O97L84K55L19J73j78
54251A46999j76L35P42O26L35J94j25p98j234r11l00j22l00l81n17j053j580j396
54233A40338p94q03j613k212j835r46l69j57J87P41J014P28L27M65J123J436O97
54216A38327o44j359r30j53j3m53p54o60n15m46j62M31R27R22M30k10o01m63R6
54197A33770N90O86O39Q62J194J197R86J091J405J101k8r16n74M42O56l25j353
54180A41423j336n38N8P7j33l16n37p19n21J19P69J022R13O82L94P1j41j70k24
54161A40893n04q31q49n42k87m23r09j360j358p73J22R08J379J565J503J275J121
$$ plain form
54287 139671 138795 138420 139136 140463 141499 141783 141325 140355 139295 138613 138425 138482 138692 139292 140306 141188 141337 140789
54269 140789 140152 139910 139938 139758 139217 138826 139283 140647 142258 143529 144483 145349 146046 146430 146685 147004 147177 146999
54251 146999 146823 147158 147900 148526 148861 149055 148930 148132 146898 145987 145687 145565 145265 144884 144367 143314 141734 140338
54233 140338 139544 138741 137128 134916 133081 132135 131766 131609 131796 132537 133551 134279 134606 135071 136194 137630 138327
54216 138327 137683 136324 135394 135241 135228 134775 134021 133361 132846 132400 132238 132669 133596 134518 134948 134738 134137 133674 133770
54197 133770 134360 135046 135685 136547 137741 138938 139924 141015 142420 143521 143493 142577 142003 142445 143101 142776 141423
54180 141423 140087 139549 139607 139684 139551 139235 138698 137979 137458 137577 138346 139368 140281 140963 141357 141428 141287 141117 140893
54161 140893 140389 139558 138709 138167 137880 137457 136548 135188 133830 133057 133179 134087 135466 137031 138534 139809 140930
54144A40930J143R26M7j043j334o05K26M55M05M73K56n35j135p39J75N82N45Q91
54126A41663J602J763J071J59o20j502k295k203j024M44J494K101K281J783Q10
54111A47527M7l19o51q27k60P61R97J34n60k02L07j64j136j350o56J21N86Q81
54093A45236Q54K56n06q17p83q40p59j5J127J790J702J309Q87L76m0m1J92L20
54075A50248O48J704K941K986J438m36j140m99N47J048O65k46q21l91O90J350
54059A60732J164Q64J233J962K162J607R36O91P83Q89R78J228J698K365L214M084
54043A86590M505M133L401L339M432N979O884O896O687O877P498Q300Q986R151
54029B73658Q573P737P510Q085Q676Q548P827P167P006P426Q324R384J0173J0347
$$ plain form
54144 140930 142073 142999 143046 142003 140669 140064 140290 140745 141150 141623 141879 141344 140209 139470 139645 140227 140772 141663
54126 141663 143265 145028 146099 146258 145638 144136 141841 139638 138614 139058 140552 142653 144934 146717 147527
54111 147527 147574 147255 146604 145777 145517 146278 147275 147409 146849 146647 146954 146790 145654 144304 143648 143769 144355 145236
54093 145236 146090 146346 145840 145023 144240 143400 142641 142626 143753 145543 147245 148554 149441 149817 149777 149736 149928 150248
54075 150248 150896 152600 155541 158527 159965 159529 158389 157890 158437 159485 160150 159904 159083 158692 159382 160732
54059 160732 161896 162760 163993 165955 168117 169724 170660 171351 172134 173023 174001 175229 176927 179292 182506 186590
54043 186590 191095 195228 198629 201968 206400 212379 219263 226159 232846 239723 247221 255521 264507 273658
54029 273658 282231 289968 297478 305563 314239 322787 330614 337781 344787 352213 360537 369921 380094 390441
54015C90441R502O964K383l345q494j2076j4399j5942j6566j6215j5412j4485
54003B92356j3073j1062r225q187p438o248m896m037l482k610j608j216j500j883
53989B15891k205k761l316l151k195j237q73q97q54n98j99J02o4o95j083o30J75
53972A95410L59j30m55l05l38r54j543j349m72M18Q80R12P17N41N13N45N40O54
53954A95943R95J317J383J423J699J871J516J082J477K736L941M530M850N246
53940B30009N442N243N119N539O316O999P491P859P950P627P064O454N797N157
53926C20066M749M493L953L068K592L278M796N962N973N181M592M846N746O711
53912C86006P578Q704J0101J0883J0041P761N341L732K643J335k29j458k082k507
$$ plain form
54015 390441 399943 406907 409290 405945 397451 385375 370976 355034 338468 322253 306841 292356
54003 292356 279283 268221 258996 250809 243371 237123 232227 228190 224708 222098 220490 219274 217774 215891
53989 215891 213686 210925 207609 204458 202263 201026 200153 199256 198402 197804 197605 197707 197643 196948 195865 195235 195410
53972 195410 195769 195639 195184 194879 194541 193587 192044 190695 190223 190641 191521 192433 193150 193691 194204 194749 195289 195943
53954 195943 196938 198255 199638 201061 202760 204631 206147 207229 208706 211442 215383 219913 224763 230009
53940 230009 235451 240694 245813 251352 257668 264667 272158 280017 287967 295594 302658 309112 314909 320066
53926 320066 324815 329308 333261 336329 338921 342199 346995 352957 358930 364111 368703 373549 379295 386006
53912 386006 393584 402288 412389 423272 433313 441074 446415 450147 452790 454125 453896 452438 450356 447849
53898D47849l192m064m702n001n403o280p283p680p361p131p708q827r685r942
53884C53590r801r408q710p852p094o322n162l714k712k757l623m486m643m024
53870B73282l062k126j127J17J244J675J733K719N366Q802J1684J3744J5424J6409
53856C45884J5533J2035O144j252q713j4420j7277j7917j7700j6914j4958j2093
53844B58352r653q303p319n970m587l753l397l184l004k619j683n49j88q42j582
53829B01719j607j146n72L10J400J786J010P2J31Q93J293J166J142J312J235J058
53813B11202J383K091K403K224K381L232L991L985L750M266N505O457O427N768
53799B65065N312N443N907O262O257N821N002M068L469L409L567L440K887K044
$$ plain form
53898 447849 444657 440593 435891 430890 425487 419207 411924 404244 396883 389752 382044 373217 363532 353590
53884 353590 343789 334381 325671 317819 310725 304403 299241 295527 292815 290058 286435 281949 277306 273282
53870 273282 270220 268094 266967 267084 268328 270003 271736 274455 279821 288623 300307 314051 329475 345884
53856 345884 361417 373452 379596 378344 369631 355211 337934 320017 302317 285403 270445 258352
53844 258352 248699 240396 233077 227107 222520 218767 215370 212186 209182 206563 204880 204331 204143 203301 201719
53829 201719 200112 198966 198394 198704 200104 201890 202900 202972 203103 203996 205289 206455 207597 208909 210144 211202
53813 211202 212585 214676 217079 219303 221684 224916 228907 232892 236642 240908 246413 252870 259297 265065
53799 265065 270377 275820 281727 287989 294246 300067 305069 309137 312606 316015 319582 323022 325909 327953
53785C27953R35m03j495j823j637j883k964m269n086n499n982o530o787o679o484
53770B71367o330o044n391m319l021j921j381j355j528j824k396l035l161k633
53756B27028k103k187k615k590j782o61k9l81j460k313k117j108l26l43p59j082
53740B05172j424j923k148j710r93o26n60k96K34O72R27J254J668J860J797J860
53724B05764K258K592K310J403N36L39O80Q01L23j76M0P90J256J273J528K332
53708B24049L003K899K380K258K728L347L654L381K521J569J267J730K230K299
53694B59315K437L187M078M223L594K925K630K458K061J288J18j153j872j714
53680B83575j202r87r68o54j66n9l56n18l47k04l00l90l23l19n17o50l89J95O53
$$ plain form
53785 327953 328888 328485 326990 325167 323530 321647 318683 314414 309328 303829 297847 291317 284530 277851 271367
53770 271367 265037 258993 253602 249283 246262 244341 242960 241605 240077 238253 235857 232822 229661 227028
53756 227028 224925 222738 220123 217533 215751 215090 215061 214680 213220 210907 208790 207682 207356 207013 206254 205172
53740 205172 203748 201825 199677 197967 196974 196348 195788 195492 195726 196398 197325 198579 200247 202107 203904 205764
53724 205764 208022 210614 212924 214327 214863 215202 215882 216683 217006 216830 216870 217660 218916 220189 221717 224049
53708 224049 227052 229951 232331 234589 237317 240664 244318 247699 250220 251789 253056 254786 257016 259315
53694 259315 261752 264939 269017 273240 276834 279759 282389 284847 286908 288196 288314 287161 285289 283575
53680 283575 282373 281386 280418 279764 279598 279539 279183 278665 278318 278114 277814 277424 277101 276782 276265 275615 275226 275421 276074
53661B76074M64n01j771k585k605k059j259m07O8k42q51o29O03J569J417J053
53645B68339J610K374J817J30q99n34P2k9j55O09J804K355K118J834J984K394
53629B85823K740K875K859K913L150L214K608J453N46N21J383K825M419N406N075
53614C27810L711K553K425K880L087L005L180L742M207M119L517K851K625K972
53600C72684L458L496L018K467K092J627Q16j36q65j245j285r36k53M40P11K81
53584C86370p73j947k530k323j899j825j812j258m04j29o41j212j322j151q32
53569C66312r7Q87J365J212J411K588L883M100L298K291J161n48k498l643l731
53554C77991l676m121m478l850k388j174r74j379j225J34K003L049K854K425K811
$$ plain form
53661 276074 276538 276037 274266 271681 269076 267017 265758 265351 265419 265177 264326 263697 264300 265869 267286 268339
53645 268339 269949 272323 274140 274270 273371 272837 272909 272880 272725 273334 275138 277493 279611 281445 283429 285823
53629 285823 288563 291438 294297 297210 300360 303574 306182 307635 308181 308702 310085 312910 317329 322735 327810
53614 327810 331521 334074 336499 339379 342466 345471 348651 352393 356600 360719 364236 367087 369712 372684
53600 372684 376142 379638 382656 385123 387215 388842 389658 389522 388657 387412 386127 385191 384938 385378 386089 386370
53584 386370 385597 383650 381120 378797 376898 375073 373261 372003 371599 371470 370829 369617 368295 367144 366312
53569 366312 366215 367102 368467 369679 371090 373678 377561 381661 384959 387250 388411 387863 385365 381722 377991
53554 377991 374315 370194 365716 361866 359478 358304 357330 355951 354726 354860 356863 359912 362766 365191 368002
53539C68002L754M325M354M422M628M427L827L776M940O739Q167Q963R504R984
53525D49812J0358J0842J1710J2716J3269J3285J3361J3975J4901J5683J6299
53514E96211J7081J8171J9408K0690K2080K3512K4656K5279K5610K6090K6818
53503H45606K7361K7200K6241K4850K3484K2395K1655K1336K1483K1902K2153
53492A105666K1902K1258K0574K0016J9508J9077J8870J8723J8143J7016J6035
53481A316788J5941J6596J7183J7318J7290J7214J6558J4867J2494J0171Q042
53470A480462N596K464j114m609p743j0569j3162j5410j7066j8006j8274j7958
53458A364611j7120j6071j5523j6090j7616j9274k0493k1443k2403k3003k2605
$$ plain form
53539 368002 371756 376081 380435 384857 389485 393912 397739 401515 406455 413194 421361 430324 439828 449812
53525 449812 460170 471012 482722 495438 508707 521992 535353 549328 564229 579912 596211
53514 596211 613292 631463 650871 671561 693641 717153 741809 767088 792698 818788 845606
53503 845606 872967 900167 926408 951258 974742 997137 1018792 1040128 1061611 1083513 1105666
53492 1105666 1127568 1148826 1169400 1189416 1208924 1228001 1246871 1265594 1283737 1300753 1316788
53481 1316788 1332729 1349325 1366508 1383826 1401116 1418330 1434888 1449755 1462249 1472420 1480462
53470 1480462 1486058 1488522 1487408 1482799 1475056 1464487 1451325 1435915 1418849 1400843 1382569 1364611
53458 1364611 1347491 1331420 1315897 1299807 1282191 1262917 1242424 1220981 1198578 1175575 1152970
53447A152970k1276j9925j9316j9279j9046j8146j6751j5269j3830j2245j0320
53436I67567q187o288n057m539m320l813k656r22J061K952M557N812O776P594
53422I60537Q440R403J0556J2026J3944J6184J8291J9755K0445K0800K1558K3182
53410A155121K5423K7558K9183L0597L2280L4145L5755L7178L9078M1834M4986
53399A533138M7870N0285N2244N3503N3938N4115N4859N6304N7835N8905N9426
53388B132422N9401N8727N7481N5914N4114N1952M9506M7090M4761M2199L9189
53377B692756L5813L2017K7469K2244J7192J3160R988O678K393l075r685j7376
53365B829574k5739l3877m0922m6652n1322n4979n7289n8134n8071n7841n7510
$$ plain form
53447 1152970 1131694 1111769 1092453 1073174 1054128 1035982 1019231 1003962 990132 977887 967567
53436 967567 959380 953092 948035 943496 939176 935363 932707 931785 932846 935798 940355 946167 952943 960537
53422 960537 968977 978380 988936 1000962 1014906 1031090 1049381 1069136 1089581 1110381 1131939 1155121
53410 1155121 1180544 1208102 1237285 1267882 1300162 1334307 1370062 1407240 1446318 1488152 1533138
53399 1533138 1581008 1631293 1683537 1737040 1790978 1845093 1899952 1956256 2014091 2072996 2132422
53388 2132422 2191823 2250550 2308031 2363945 2418059 2470011 2519517 2566607 2611368 2653567 2692756
53377 2692756 2728569 2760586 2788055 2810299 2827491 2840651 2850639 2857317 2859710 2856635 2846950 2829574
53365 2829574 2803835 2769958 2729036 2682384 2631062 2576083 2518794 2460660 2402589 2344748 2287238
53354B287238n6555n4767n2604n0457m8134m5521m3313m2410m2751m3461m4055
53343A763210m4734m5430m5375m4097m2145m0292l8494l6230l3517l0867k8421
53332A333608k5805k2851j9968j7612j5918j4909j4619j4811j5036j5205j5644
53321A141230j6303j6388j5239j3291j1550j0361r322q249p349o363m494j668
53309A020653R76K458L230M253N473O289P097R016J1981J4489J5638J6333J7791
53296A135677J9924K1936K3680K5417K6923K7835K8521K9539L0475L0338K9009
53285A429274K7370K6012K4585K2642K0262J7719J5141J2693J0520Q320N464J742
53273A621744k314n922q526j0003j0857j2129j4487j7453k0120k2383k4748k7010
$$ plain form
53354 2287238 2230683 2175916 2123312 2072855 2024721 1979200 1935887 1893477 1850726 1807265 1763210
53343 1763210 1718476 1673046 1627671 1583574 1541429 1501137 1462643 1426413 1392896 1362029 1333608
53332 1333608 1307803 1284952 1264984 1247372 1231454 1216545 1201926 1187115 1172079 1156874 1141230
53321 1141230 1124927 1108539 1093300 1080009 1068459 1058098 1048776 1040527 1033178 1026815 1022321 1020653
53309 1020653 1021629 1024087 1027317 1031570 1037043 1043332 1050429 1059445 1071426 1085915 1101553 1117886 1135677
53296 1135677 1155601 1177537 1201217 1226634 1253557 1281392 1309913 1339452 1369927 1400265 1429274
53285 1429274 1456644 1482656 1507241 1529883 1550145 1567864 1583005 1595698 1606218 1614538 1620002 1621744
53273 1621744 1619430 1613508 1604982 1594979 1584122 1571993 1557506 1540053 1519933 1497550 1472802 1445792
53261A445792k8152k7835k7072k6986k7624k8363k8892k9239k9336k9087k8559
53250A134647k7799k6711k5485k4727k4815k5378k5700k5455k4856k4347k4280
53239H55094k4642k4981k4804k4077k3062k1729j9836j7476j5050j2743j0559
53228F36135q883q247q497q910r262r929j0803j1134j0842j1018j2418j4221j5056
53215D96915j4682j3899j3256j2607j1696j0458q948p478o575o390o382o004n402
53202C73138n026m968n111n563o389p219p602p526p193o587n719m933m535m394
53188B90373m228l983l607k983k397k487l168l313k178o19m6n86j149j042o19
53173B57968m86q02j337j607j096Q5R86Q74K23M5N10R77J088R25L08j017k519
$$ plain form
53261 1445792 1417640 1389805 1362733 1335747 1308123 1279760 1250868 1221629 1192293 1163206 1134647
53250 1134647 1106848 1080137 1054652 1029925 1005110 979732 954032 928577 903721 879374 855094
53239 855094 830452 805471 780667 756590 733528 711799 691963 674487 659437 646694 636135
53228 636135 627252 619005 610508 601598 592336 582407 571604 560470 549628 538610 526192 511971 496915
53215 496915 482233 468334 455078 442471 430775 420317 411369 403891 397316 390926 384544 378540 373138
53202 373138 368112 363144 358033 352470 346081 338862 331260 323734 316541 309954 304235 299302 294767 290373
53188 290373 286145 282162 278555 275572 273175 270688 267520 264207 262029 261410 261364 260778 259629 258587 257968
53173 257968 257482 256680 255343 253736 252640 252725 253711 254585 254808 254853 255363 256340 257428 258353 258661 257644 255125
53156B55125l124k548j631j118q38l14L97Q14O06r3p06o65j02J68k65p55o14k61
53138B44076n28j180j281p32l07k14Q8N58M13l64o54R9R37Q77K50k20o79j455
53120B39684j937j300J13J162J396J183O94k23j199j425p69o9j27q84j740k142
53104B32417j854j065m19m34q33r18o02m72p02o49J9M94r4j178j281r3R38M99
53086B23773q26j405o93L31P08N57L92K37j20n15o20m34r1N18J425K162K143J398
53068B28940M37l88r62j074o26j6K67L05N04P38N36J1j63J64L39n9o27q45p63
53049B26718n74j90L78P60P53O75P26N54n8n47k91M26P56M18j63o38j031j321
53031B27351j379j325j400j450j063k97K14J06k26j78L15R08J336J501J231L93
$$ plain form
53156 255125 252001 249453 247822 246704 245866 245552 245949 246763 247369 247276 246570 245905 245803 245971 245706 244951 244337 244076
53138 244076 243548 242368 241087 240355 240048 239834 239922 240480 240893 240529 239875 239974 240911 241788 242038 241818 241139 239684
53120 239684 237747 236447 236560 237722 239118 240301 240995 240772 239573 238148 237379 237310 237183 236299 234559 232417
53104 232417 230563 229498 229079 228645 227812 226894 226292 225820 225118 224469 224488 224982 224888 223710 222429 222336 223274 223773
53086 223773 222947 221542 220849 221180 221888 222445 222837 223074 222954 222439 221819 221385 221294 221812 223237 225399 227542 228940
53068 228940 229377 228989 228027 226953 226327 226311 226578 226883 227387 228125 228661 228672 228509 228673 229012 228953 228326 227481 226718
53049 226718 226144 225954 226332 227092 227845 228520 229246 229800 229742 229195 228904 229330 230086 230504 230341 229703 228672 227351
53031 227351 225972 224647 223247 221797 220734 220437 220651 220757 220531 220353 220668 221576 222912 224413 225644 226037
53015B26037p11j386j152k17P61J327J547J687J733J417O19l64j037j107n99K43
52999B28798J054J453J244N98l4k96j87N6K71N16Q63J212J390J331J055N94R7
52982B40015n9L63J040J342J140R14R99J104Q93N96O39R74J223J264J180R33N56
52965B55116M46Q70J338J134M47J83O05R46N61k06p21r75j283j571j507j100o33
52948B53650k47kj13o97j345j480j153r64j115r94n1J198J532M27j285k323k320
52931B42718j887j565j208n77Q8M04M39M56M45L29L46O15O16j40j105j214m61
52914B38299M1j92k41O70J720J523P8j266j585j255j023j054j130j198j316j357
52898B30714j105n23K32R84J536J659J279O40J20j86n04r03r80l04Q46J624J511
$$ plain form
53015 226037 225326 223940 222788 222571 223332 224659 226206 227893 229626 231043 231662 231298 230261 229154 228555 228798
52999 228798 229852 231305 232549 233147 233113 232817 232630 232686 232957 233473 234336 235548 236938 238269 239324 239918 240015
52982 240015 239956 240319 241359 242701 243841 244755 245754 246858 247751 248347 248986 249960 251183 252447 253627 254560 255116
52965 255116 255562 256432 257770 258904 259351 259534 260139 261085 261646 261440 260719 259744 258461 256890 255383 254283 253650
52948 253650 253403 253401 253288 252591 251246 249766 248613 247649 246534 245540 245489 246687 248219 248646 247361 245038 242718
52931 242718 240831 239266 238058 237481 237569 237973 238412 238868 239313 239642 239988 240603 241219 241079 239974 238760 238299
52914 238299 238340 238148 237907 238577 240297 241820 241898 240632 239047 237792 236769 235715 234585 233387 232071 230714
52898 230714 229609 229086 229318 230302 231838 233497 234776 235416 235536 235350 234846 233943 232963 232659 233505 235129 236640
52881B36640P96m5r37j889k493k380j846j455j195o14K61R57J359J761K084J858
52865B32862J229J103J878K787K902K205J168Oj099j646j435j128j486k297k713
52850B34336k381j616p69j22j23j000k175k756k584k188j872j490j058q30p02
52835B12670k78L02L95o3l55j36l9n27q76j56J214J828J136mo87j027j488j808
52817B10101j307NJ274J733J390Q11N84R89J834K503K491J999J652J592J316N67
52801B29534k04o39j160k213l291l508k932k429k255j702m93M69L17n04q45l88
52785B07757J47K03J7J4P7j81o73p19J53J451K037J406L60L9N32R50P77M63N12
52766B15322O65M00k23p17q46p36m95j71L1j55p90j650k337k424j742o57J77M54
$$ plain form
52881 236640 237436 237391 236454 234565 232072 229692 227846 226391 225196 224582 224843 225800 227159 228920 231004 232862
52865 232862 234091 235194 237072 239859 242761 244966 246134 246140 245041 243395 241960 240832 239346 237049 234336
52850 234336 231955 230339 229570 229448 229325 228325 226150 223394 220810 218622 216750 215260 214202 213372 212670
52835 212670 212392 212694 213089 213026 212671 212535 212496 211969 211093 210937 212151 213979 215115 215111 214424 213397 211909 210101
52817 210101 208794 208799 210073 211806 213196 214007 214591 215580 217414 219917 222408 224407 226059 227651 228967 229534
52801 229534 229330 228691 227531 225318 222027 218519 215587 213158 210903 209201 208708 209177 209494 208990 208145 207757
52785 207757 207904 208107 208124 208138 208215 208034 207361 206642 206795 208246 210283 211689 212049 212088 212620 213570 214347 214810 215322
52766 215322 215987 216387 216164 215447 214601 213865 213370 213199 213230 213075 212285 210635 208298 205874 204132 203475 203652 204106
52748B04106L32k2n62r16n01O31J594J759J531J618J930J944J670J625J969K303
52732B21011K318K097J835J599J401J183Q18M48N09J064J397Q10l23r22n65N5
52716B34735J14l66p52o81m36n45j069j406r17K45J266J603J438J040L49n80j234
52699B32804j284j078r66p12j45J20m48j156q28M91J606J897J912K129K222J915
52683B38479J638J679J567R21K53K46O22M90l97j337j623j259p51n14n85p43q39
52666B37847r41j110j117p27k19k13p96j233p92L82J494J932J636R42M16N98J477
52649B39576K207J827L44j155j663j335j128j543k009j715p34J5n8n48p26m86
52633B30869k02N7O37J551K173J941J122N24O14J036J051L58n46q55l33M21O04
$$ plain form
52748 204106 204438 204416 203854 202938 202437 203068 204662 206421 207952 209570 211500 213444 215114 216739 218708 221011
52732 221011 223329 225426 227261 228860 230261 231444 232262 232710 233219 234283 235680 236490 236167 235245 234680 234735
52716 234735 234849 234483 233731 233050 232614 232069 231000 229594 228677 228922 230188 231791 233229 234269 234618 234038 232804
52699 232804 231520 230442 229476 228764 228619 228739 228291 227135 226307 226798 228404 230301 232213 234342 236564 238479
52683 238479 240117 241796 243363 244284 244537 244783 245405 245895 245498 244161 242538 241279 240528 240014 239429 238686 237847
52666 237847 236906 235796 234679 233952 233733 233520 232724 231491 230699 231081 232575 234507 236143 237085 237501 238099 239576
52649 239576 241783 243610 243954 242799 241136 239801 238673 237130 235121 233406 232672 232687 232629 232081 231355 230869
52633 230869 230667 230724 231361 232912 235085 237026 238148 238672 239286 240322 241373 241731 241185 240330 239997 240418 241022
52616B41022N7o71r85p79l86j53j30j29o4j19l82m63Q3R61J348J069R15J372J738
52597B44304J229M02M16J239J676J240Q14J107J531J322Q81J132K005K488K035
52582B63821J109L58p2k60j67J13J86j90o71p39m06k33n59j031j095p24m33n67
52564B58440r42j204j263j201r85n42K4M49N45K53l42r69j261j119q77q67j025
52547B47114j060q90o34l27N7L90N23N79P96J087J056N24j60m27k7P60J380J477
52529B52218J172P72L45j93o45o46l09k52p22j224j271j019p54l37L02O62L91
52512B48490Q4N35J485J971J829J897K673L639M042L610K364M76j425k507k635
52497B66528k506k653k796k497j894j383j081r54j094j482j700j288l28N69P85
$$ plain form
52616 241022 241079 240408 239423 238644 238258 238105 237975 237846 237782 237663 237281 236818 236901 237862 239210 240279 241194 242566 244304
52597 244304 245533 245935 246351 247590 249266 250506 251320 252427 253958 255280 256161 257293 259298 261786 263821
52582 263821 264930 265288 265216 264956 264789 264902 265088 264898 264227 263488 263082 262849 262290 261259 260164 259440 259007 258440
52564 258440 257498 256294 255031 253830 252845 252303 252327 252776 253321 253574 253232 252263 251002 249883 249006 248139 247114
52547 247114 246054 245164 244530 244203 244260 244650 245173 245752 246548 247635 248691 249215 249055 248628 248601 249361 250741 252218
52529 252218 253390 254162 254507 254314 253669 253023 252714 252462 251740 250516 249245 248226 247472 247135 247437 248099 248490
52512 248490 248574 249109 250594 252565 254394 256291 258964 262603 266645 270255 272619 273095 271670 269163 266528
52497 266528 264022 261369 258573 256076 254182 252799 251718 250764 249670 248188 246488 245200 244872 245441 246226
52482B46226K12o04q35j41R30J506J301P52M49P16J473K168K024R26k35n61k02
52465B56105K45R71K494M274M993M436L859M042M080K838O28j325k463l092l500
52450B78585l644l494l105k521k022k090k738l261l039k273j487p30K32J198J628
52435B51239J271L96m97r30o78p4K18J2j45K25Q20R81N44j38o47o92j72O11J063
52416B53407R56P14P79J049J229J376J733K325L115M228N706P338Q975J0679J2218
52401C15827J2791J1599Q507M023r92n379q159r302r668r787r234p601n406l541
52387B83678k273j369p39l47P7O38Q90N08m7l2O84J710K690L318L227K559K191
52370B97363K780L974N077N934O490O216M887L351K441J633oj913k470j304J87
$$ plain form
52482 246226 246438 245834 244999 244858 245788 247294 248595 249347 249796 250512 251985 254153 256177 257103 256868 256307 256105
52465 256105 256350 257321 259815 264089 269082 273518 277377 281419 285499 288337 288965 287640 285177 282085 278585
52450 278585 274941 271447 268342 265821 263799 261709 258971 255710 252671 250398 248911 248181 248413 249611 251239
52435 251239 252510 252906 252409 251479 250801 250727 250945 250957 250812 251037 251857 252838 253382 253244 252597 251905 251733 252344 253407
52416 253407 254363 255077 255856 256905 258134 259510 261243 263568 266683 270911 276617 283955 292930 303609 315827
52401 315827 328618 340217 348724 352747 351755 346376 338217 328915 319247 309460 300226 292625 287219 283678
52387 283678 281405 280036 279297 278950 279027 279665 280555 281063 281016 280984 281668 283378 286068 289386 292613 295172 297363
52370 297363 300143 304117 309194 315128 321618 327834 332721 336072 338513 340146 340140 338227 335757 334453 334640
52355C34640P80O59M51K20p0r0K76O71R73J574K494L045K840K460K600L149L645
52338C60317M089M732N506O242P015P877Q600R168J0108J1785J3637J4785J5226
52325D79087J5850J7320J9324K1052K2001K2274K2288K2330K2317K1893K0822
52314G06558J9304J7917J7229J7350J7795J7850J7308J6677J6436J6268J5402
52303H96094J3719J2019J1046J0595R912Q668P284O294N613M554K543k51l110
52290I84980n547p606r373j0547j0764j0062q799p368o206n667n518m922l450
52277H89151j632nJ883M670P778R886J0751J1512J2992J4733J5945J6512J6579
52264A010755J6015J4891J3853J3417J3381J3379J3471J3700J3616J2915J2044
$$ plain form
52355 334640 335420 336079 336530 336750 336680 336590 336866 337537 338510 340084 342578 345623 348463 350923 353523 356672 360317
52338 360317 364406 369138 374644 380886 387901 395778 404378 413546 423654 435439 449076 463861 479087
52325 479087 494937 512257 531581 552633 574634 596908 619196 641526 663843 685736 706558
52314 706558 725862 743779 761008 778358 796153 814003 831311 847988 864424 880692 896094
52303 896094 909813 921832 932878 943473 953385 962053 969337 975631 981244 985798 988341 988090 984980
52290 984980 979433 971827 962454 951907 941143 931081 922282 914914 908708 903041 897523 892601 889151
52277 889151 887519 887514 889397 894067 901845 911731 922482 933994 946986 961719 977664 994176 1010755
52264 1010755 1026770 1041661 1055514 1068931 1082312 1095691 1109162 1122862 1136478 1149393 1161437
52253A161437J1544J1165J0260Q810P346O076M752L214J455p34l474o203q016
52240A207632q771r185r740j0067r685q788p884p086o189n168m195l259k241j323
52226A114051q82q86p53kJ151K105K571K703K703K739L211M533O373P608P493
52211A154718O691O573P578Q803R321R338R650J0331J0524R549P819O448O061
52198A263404O218O078N456M978N226N966O446O264N626M951M472M185L832L013
52184A336115J613J20q78j565k816n061p661r733j1209j2522j3467j3109j1143
52171A248684q726p431p448p438o273m372k928k242j575m24P88J582K228L182
52157A207607M136M288L407K072R26J32m45r31j359j683j751j480j056p41o32
$$ plain form
52253 1161437 1172981 1184146 1194406 1203216 1210562 1216638 1221390 1224604 1226059 1225325 1221851 1215648 1207632
52240 1207632 1198861 1189676 1179936 1169869 1160184 1151396 1143512 1136426 1130237 1125069 1120874 1117615 1115374 1114051
52226 1114051 1113169 1112283 1111530 1111528 1112679 1114784 1117355 1120058 1122761 1125500 1128711 1133244 1139617 1147225 1154718
52211 1154718 1161409 1167982 1175560 1184363 1193684 1203022 1212672 1223003 1233527 1243076 1250895 1257343 1263404
52198 1263404 1269622 1275700 1281156 1286134 1291360 1297326 1303772 1310036 1315662 1320613 1325085 1329270 1333102 1336115
52184 1336115 1337728 1337848 1336970 1335405 1332589 1327528 1319867 1310134 1298925 1286403 1272936 1259827 1248684
52171 1248684 1239958 1232527 1225079 1217641 1211368 1206996 1204068 1201826 1200251 1199827 1200615 1202197 1204425 1207607
52157 1207607 1211743 1216031 1219438 1221510 1222436 1222568 1222123 1221192 1219833 1218150 1216399 1214919 1213863 1213122 1212490
52142A212490o95q86j105j227j441k158l287l954l421k013n34R01K777N083P168
52127A207698Q826J0713J3421J6694J9841K2438K4400K5803K6990K8298K9544
52116A434666L0104K9781K9096K8433K7406K5491K2875K0181J7600J4810J1725
52105A692168Q814O633N241M195K984J546L68j00m5k09j083k449l776m886o093
52090A703308p808j0108j2574j4543j5710j6416j7058j7304j6247j3393r213m722
52078A548212q28J932L559M735O358Q683J1107J2955J4196J5256J6478J7912J9309
52065A679864K0132J9894J8771J7553J6803J6247J5164J3113J0168O812L817J817
52053A840155O27o91k789n255p285q847j0688j3279j6234j8855k0894k2555k3998
$$ plain form
52142 1212490 1211795 1210909 1209804 1208577 1207136 1204978 1201691 1197737 1194316 1192303 1191769 1192670 1195447 1200530 1207698
52127 1207698 1216524 1227237 1240658 1257352 1277193 1299631 1324031 1349834 1376824 1405122 1434666
52116 1434666 1464770 1494551 1523647 1552080 1579486 1604977 1627852 1648033 1665633 1680443 1692168
52105 1692168 1700982 1707615 1712856 1717051 1720035 1721581 1721949 1721849 1721804 1721595 1720512 1718063 1714287 1709401 1703308
52090 1703308 1695500 1685392 1672818 1658275 1642565 1626149 1609091 1591787 1575540 1562147 1552934 1548212
52078 1548212 1547384 1549316 1552875 1557610 1563968 1572651 1583758 1596713 1610909 1626165 1642643 1660555 1679864
52065 1679864 1699996 1719890 1738661 1756214 1773017 1789264 1804428 1817541 1827709 1834521 1838338 1840155
52053 1840155 1840782 1840091 1837302 1832047 1824762 1815915 1805227 1791948 1775714 1756859 1735965 1713410 1689412
52040A689412k5144k5886k6258k6274k5750k4420k2219j9348j6142j3109j0893
52029A453969r796r314q699q052q155r041r586r164q841r933j1964j3273j3309
52016A324842j3067j3242j3394j3114j2838j2943j3127j3233j3694j4701j5814
52005A175675j6975j8812k1289k3085k3310k2940k3406k4479k4803k3992k2864
51994I29720k1773k0134j7751j5386j3672j2433j1504j1320j2059j2905j2911
51983G67872j2245j1925j2421j3081j3107j2635j2510j3148j4021j4340j3907
51972F24532j3084j2160j1129r885q263o025l310r19M91J387K748M501N549N505
51958E79938N337N746N922M810K739P70r78l199n829p810q393p884o972o019n040
$$ plain form
52040 1689412 1664268 1638382 1612124 1585850 1560100 1535680 1513461 1494113 1477971 1464862 1453969
52029 1453969 1444173 1434859 1426160 1418108 1409953 1400912 1391326 1382162 1373321 1363388 1351424 1338151 1324842
52016 1324842 1311775 1298533 1285139 1272025 1259187 1246244 1233117 1219884 1206190 1191489 1175675
52005 1175675 1158700 1139888 1118599 1095514 1072204 1049264 1025858 1001379 976576 952584 929720
51994 929720 907947 887813 870062 854676 841004 828571 817067 805747 793688 780783 767872
51983 767872 755627 743702 731281 718200 705093 692458 679948 666800 652779 638439 624532
51972 624532 611448 599288 588159 578274 570011 563986 560676 559757 560248 561635 564383 568884 574433 579938
51958 579938 585275 591021 596943 601753 604492 605262 604284 601085 595256 587446 579053 571169 564197 558178 553138
51943E53138l809j940O18L241N271O862Q584J0397J1662J2099J1973J1322R805
51930F39223P449M889K566J61k843o420j0019j3006j4977j5926j6179j6017j5436
51917E43465j4520j3696j3177j2446j0996r340q499q455q015o439m407k906j907
51904D28662o62J123L073M797O212P363Q320R159R677R294P608N002K264l00k989
51889D98603n819p995q630p749o072l945j040K654O252Q820J0487J2003J3433
51876E11002J4072J3623J2538J1071Q775N430J747j368l670n264o164o779q077
51863E46936j0413j2647j3340j2473j1181j0053q757p056n204l330j357L34J115
51850D52574J146J337K002K293J368m66k225l350m000m573n270n942o227o004
$$ plain form
51943 553138 549329 547389 548007 551248 556519 563381 571965 582362 594024 606123 618096 629418 639223
51930 639223 646672 651561 654127 654288 651445 645025 635006 622000 607023 591097 574918 558901 543465
51917 543465 528945 515249 502072 489626 478630 469290 460791 452336 444321 437882 433475 430569 428662
51904 428662 428000 429123 432196 436993 443205 450568 458888 468047 477724 487018 494626 499628 501892 501592 498603
51889 498603 492784 484789 476159 468410 462338 458393 457353 460007 466259 475079 485566 497569 511002
51876 511002 525074 538697 551235 562306 571081 576511 578258 576890 573220 567956 561792 555013 546936
51863 546936 536523 523876 510536 498063 486882 476829 468072 461016 455812 452482 451125 451459 452574
51850 452574 453720 455057 457059 459352 460720 460254 458029 454679 450679 446106 440836 434894 428667 422663
51836D22663n596n276m768l676k217r16K53J690L209M018L773K940J982R29j70
51821D18838j084j865k736l381l153k297j988k635l039j942K62K105K890L072
51807D03047L174L092K511J393jj288k162k608k821k758k136j004l5R0o90j946
51791C95858l154l725l231j987j027r49j183q69j52N2n89j365j465q77k28o9m39
51774C74601q97r16m15J35L39M66J226K919N084O961Q120Q624Q758Q719Q463P771
51758D39958O439M401J781j143m007o462q255r205r301q830q165p338o135m753
51744C78985l958m144m560m064k422l60J484L021M289N331O471P921R069Q935
51730D05998P433N494L803K304J013M40P41J393K073K947L645L034P77j756l123
$$ plain form
51836 422663 417067 411791 407023 403347 401130 400214 400467 402157 405366 409384 413157 416097 418079 419008 418838
51821 418838 417754 415889 413153 409772 406619 404322 402334 399699 396660 394718 394980 397085 399975 403047
51807 403047 406221 409313 411824 413217 413216 411928 409766 407158 404337 401579 399443 398439 398404 398494 397804 395858
51791 395858 392704 388979 385748 383761 382734 381785 380602 379733 379581 379633 379044 377679 376214 375337 375109 375040 374601
51774 374601 373704 372788 372373 372508 372847 373313 374539 377458 382542 389503 397623 406247 415005 423724 432187 439958
51758 439958 446397 450798 452579 451436 447429 440967 432712 423507 414206 405376 397211 389873 383738 378985
51744 378985 375027 370883 366323 362259 359837 359477 360961 363982 368271 373602 380073 387994 397063 405998
51730 405998 413431 418925 422728 425032 426045 426485 427226 428619 430692 433639 437284 440318 441095 439339 436216
51715D36216l503l814l941l183j947j547k373l473m021m083l804k922j402L69
51701C96572K231M175N419M643J824j067k037j191j82kj69J64J106K108K520J900
51685D18014K21k035m190n878p047p564p175o007m705l780k977j618M73K685M263
51670C72680M929M787M033L008K327K508L496M789N881O255N220K422j381m632
51656D16322o349o809o690o108m791k717m2L196O716R519J0444R154O213K357
51642D30415j809n552q105r294r621r562r092q018o495n001l947l450l297l089
51628C44083k474j446k91O61J209J320J146R81R76R42O53K52K00P51J637K254
51612C52854K087J154Q7l39PM46L11k89q10j098j344j355n40J101K580K999K796
$$ plain form
51715 436216 432713 428899 424958 421775 419828 418281 415908 412435 408414 404331 400527 397605 396203 396572
51701 396572 398803 402978 408397 413040 414864 413797 411760 410569 410387 410385 410216 410380 411486 413594 416114 418014
51685 418014 418235 416200 412010 406132 399085 391521 384346 378339 373634 369854 366877 365259 365732 368417 372680
51670 372680 377609 382396 386429 389437 391764 394272 397768 402557 408438 414693 419913 422335 420954 416322
51656 416322 409973 403164 396474 390366 385575 382858 382816 386012 392728 402247 412691 421845 428058 430415
51642 430415 428606 423054 414949 405655 396034 386472 377380 369362 362867 357866 353919 350469 347172 344083
51628 344083 341609 340163 339872 340533 341742 343062 344208 345189 346165 347107 347760 348012 348212 348963 350600 352854
51612 352854 354941 356095 356182 355843 355850 356296 356607 356318 355508 354410 353066 351711 351171 352272 354852 357851 360647
51595C60647L357N392Q103J0117J0896J0845J0187Q343M802L04l433n265n435
51582D18860m787l714k301q91J34J094K850N755R226J2417J4901J6522J7152J6952
51568E04170J6694J7207J8517J9741J9987J9183J8020J7225J7198J8265K0927
51557G07134K5454L1236L6912M1195M3322M2639L8312L0123J9301P922k726j2774
51545A008050k2635l1760l8941m3534m5842m6420m5494m3229m0082l6533l2647
51534E80933k8317k3818j9789j6585j3972j1633r631q179p170o256n315m517l985
51521D21766l658l456l392l489l730m012m008l279j894p13o28j544k500k782k501
51506C80180k067j675j447j546j885k065j859j475j223j227j561k195k663k348
$$ plain form
51595 360647 364004 369396 377499 387616 398512 409357 419544 427887 432689 432993 429560 424295 418860
51582 418860 414073 410359 408058 407167 407301 408395 411245 417000 426226 438643 453544 470066 487218 504170
51568 504170 520864 538071 556588 576329 596316 615499 633519 650744 667942 686207 707134
51557 707134 732588 763824 800736 841931 885253 927892 966204 996327 1015628 1023550 1020824 1008050
51545 1008050 985415 953655 914714 871180 825338 778918 733424 690195 650113 613580 580933
51534 580933 552616 528798 509009 492424 478452 466819 457188 449009 441839 435583 430268 425751 421766
51521 421766 418108 414652 411260 407771 404041 400029 396021 392742 390848 390135 389507 387963 385463 382681 380180
51506 380180 378113 376438 374991 373445 371560 369495 367636 366161 364938 363711 362150 359955 357292 354944
51492C54944j288k48K69N76J078J604J896K164K620K963K867K534K132J240l10
51477C75041j548j372k15L50k94j176j416j428j970k843l319l327l440l898m263
51462C44882m099l537l009k736k536k139j547j068q95q36n19J31Q14J220J299
51447C25425J244J445K393M314O905R525J1734J3465J4759J5475J5160J3155R130
51434D44129L879o78k860k608j258r9L37k36k177n282q342j0027j0084r330q512
51419C86852p576o144m347k843k004j450o61J35K22m14p66r0J008J361Q27L42
51403C64452N14R68J191J331J684J986J788J264J116J681K535L055L141L227L751
51388C93684M768O107P752R844J2359J5080J7999K1520K6013L1304L6825M2079
$$ plain form
51492 354944 353656 353408 353677 354253 355331 356935 358831 360995 363615 366578 369445 371979 374111 375351 375041
51477 375041 373493 372121 371906 372256 371962 370786 369370 367942 365972 363129 359810 356483 353043 349145 344882
51462 344882 340783 337246 334237 331501 328965 326826 325279 324211 323316 322480 321961 322092 322906 324126 325425
51447 325425 326669 328114 330507 334821 341726 351251 362985 376450 391209 406684 421844 434999 444129
51434 444129 448008 447330 444470 441862 440604 440505 440842 440606 438429 433147 424805 414778 404694 395364 386852
51419 386852 379276 373132 368785 365942 363938 362488 361827 361962 362184 361770 361004 360914 361922 363283 364110 364452
51403 364452 364966 365934 367125 368456 370140 372126 373914 375178 376294 377975 380510 383565 386706 389933 393684
51388 393684 398452 404559 412311 422155 434514 449594 467593 489113 515126 546430 583255 625334
51376F25334M6875N1293N5598N9705O2367O1374N5360M5282L3540K1707R765k575
51364A125625j4836k6326l6800m5922n2665n6066n6444n5243n3611n1537m8396
51353F27779m3983l8782l3468k8363k3493j9008j5316j2700j1017r919r135q355
51341C74240p143n439l950l467l825m000l355k218j190m62n9j53p21j299j518
51326C35441j561j712j749j244k86N51Q83P70L94j53o63p79l10N05J228J584J591
51309C34490J397J066N11l40j366k236k621k374j645p97j53K12L25L2q28j917
51293C23756k492k291j922j969k079j567n79J26M42J107K537M148N181N511N414
51278C35323N179N209N824O538O177M254J760J1p72j179j491j581j561j670j665
$$ plain form
51376 625334 672209 723502 779100 838805 901172 962546 1017906 1063188 1096728 1118435 1128200 1125625
51364 1125625 1110789 1084463 1047663 1001741 949076 893010 836566 781323 727712 676175 627779
51353 627779 583796 545014 511546 483183 459690 440682 425366 412666 401649 391730 382595 374240
51341 374240 367097 361658 357708 354241 350416 346416 343061 340843 339653 339191 339132 338979 338258 336959 335441
51326 335441 333880 332168 330419 329175 328889 329440 330323 331093 331487 331334 330671 329892 329582 330087 331315 332899 334490
51309 334490 335887 336953 337464 337124 335758 333522 330901 328527 326882 326085 325932 326144 326469 326501 325673 323756
51293 323756 321264 318973 317051 315082 313003 311436 310857 310983 311425 312532 315069 319217 324398 329909 335323
51278 335323 340502 345711 351535 358073 364250 368504 370264 370275 369503 368324 366833 365252 363691 362021 360356
51263C60356j123k90Q0k68q95j450j942k237k085j807k093k818k945k111j443
51248C36929j995l019k906j508l02j99l72K13J151J297N13k03j53L53P13P33N14
51231C31759K24J89O76J370J496P48k82q64r17p64n15r6M05Q46J270J714J989
51214C39248J956J796J683J494J180J039J177J100M73n1M48J790K774K711K085
51199C60903J689J674J685J345M77p21j590j613j085p44p82q02o60n40k64N71
51183C59543J592J813J153P53J313K017J835J013M36J28n44j583k265k245j951
51168C63008j893k161k565k801k551j811r87l44K88R66J312J218J306J921K185
51153C57091J046j020k433k526k114j987j905j397n97J24O77J009R70P58Q68J203
$$ plain form
51263 360356 359233 358943 359023 358755 357860 356410 354468 352231 350146 348339 346246 343428 340483 338372 336929
51248 336929 334934 331915 329009 327501 327199 327000 326628 326841 327992 329289 329802 329599 329446 329799 330512 331245 331759
51231 331759 331983 332172 332848 334218 335714 336462 336180 335316 334399 333635 333120 333024 333429 334275 335545 337259 339248
51214 339248 341204 343000 344683 346177 347357 348396 349573 350673 351146 351095 351543 353333 356107 358818 360903
51199 360903 362592 364266 365951 367296 367773 367052 365462 363849 362764 362020 361238 360436 359776 359236 358972 359543
51183 359543 361135 362948 364101 364854 366167 368184 370019 371032 371468 371596 371052 369469 367204 364959 363008
51168 363008 361115 358954 356389 353588 351037 349226 348239 347895 348183 349149 350461 351679 352985 354906 357091
51153 357091 358137 357117 354684 352158 350044 348057 346152 344755 344158 344282 344959 345968 346938 347696 348564 349767
51137C49767R53k13j403j620j029m98l74m24o23j110j493j087O6J100J463J535
51121C45010J926K666L446M144M716M891M455L642K879K289J710J098N35L2m08
51106C83031n70k93J53L59L97O74J183J472J439J577K164K738K749K238J512O29
51090D01452k07l24O31J920K540K570K802L214K890J577L02m7J31n2p02j323j685
51073D15689j860j736j156l70K35O71J163J631J861K050K687L806M918N752O724
51058D42065Q377J0476J1856J1309Q665N077K101N83N22J742M103O979R197J0047
51044E33099J0076J0416J1325J1788J0529P337L375L13r48p55r5K21m05k596o525
51029E87155j1230j5082j7187j7786j7329j5885j3620j1103q630n943l057o92
$$ plain form
51137 349767 350720 350507 349104 347484 346455 345957 345583 345159 344536 343426 341933 340846 340912 342012 343475 345010
51121 345010 346936 349602 353048 357192 361908 366799 371254 374896 377775 380064 381774 382872 383407 383439 383031
51106 383031 382461 382168 382321 382680 383077 383751 384934 386406 387845 389422 391586 394324 397073 399311 400823 401452
51090 401452 401245 400921 401552 403472 406012 408582 411384 414598 417488 419065 419367 419320 419451 419399 418697 417374 415689
51073 415689 413829 412093 410937 410567 410802 411473 412636 414267 416128 418178 420865 424671 429589 435341 442065
51058 442065 450442 460918 472774 484083 492748 497825 499926 500509 501031 502773 506876 513855 523052 533099
51044 533099 543175 553591 564916 576704 587233 594570 597945 598258 597310 596555 596460 596681 596276 593680 587155
51029 587155 575925 560843 543656 525870 508541 492656 479036 467933 459303 453360 450303 449611
51017D49611O32J352K189L269M406N566O452O367N301M508N073O378P030O821
51003E14955O648O836O855O590O681P382Q185Q786R388R855R662R167R770J2112
50989F32872J4901J6344J6197J5659J5660J5988J6031J5697J5504J5923J6661
50978H07437J6676J5157J2472R712P346N030K890K143L808P341J1293J5096J9508
50965I35909K5263L2010L8700M4626M9746N4182N7828O0588O2763O4829O6732
50954A493176O7669O6868O4389O0831N6424N1005M4908L9281L5125L2326K9932
50943B041934K7333K5020K4226K5775K8961L1521L1169K7501K2215J7371J3579
50932B316605J0019N854J119l746q742j4415k1159k8750l6705m4826n3020o0780
$$ plain form
51017 449611 450243 451595 453784 457053 461459 467025 473477 479844 485145 489653 494726 501104 508134 514955
51003 514955 521603 528439 535294 541884 548565 555947 564132 572918 582306 592161 601823 610990 620760 632872
50989 632872 647773 664117 680314 695973 711633 727621 743652 759349 774853 790776 807437
50978 807437 824113 839270 851742 861454 868800 873830 876720 878863 882671 890012 901305 916401 935909
50965 935909 961172 993182 1031882 1076508 1126254 1180436 1238264 1298852 1361615 1426444 1493176
50954 1493176 1560845 1627713 1692102 1752933 1809357 1860362 1905270 1944551 1979676 2012002 2041934
50943 2041934 2069267 2094287 2118513 2144288 2173249 2204770 2235939 2263440 2285655 2303026 2316605
50932 2316605 2326624 2332478 2333597 2329851 2321109 2306694 2285535 2256785 2220080 2175254 2122234 2061454
50920B061454o7388p2777p7512q1559q3686q2754p9159p4315o9090o3526n7864
50909A251824n2722m8166m3530l8527l3758k9743k6244k2972k0286j8588j7446
50898H99842j6030j4167j2320j0775r309p738o375n713n807o031n570m263k855
50885G92889k142k030j777j019m5R03J887K747L106L212L998N783P583Q384Q537
50870H32016R193J0710J2414J3731J4702J5460J5938J6370J7348J9188K1567K4052
50858A022689K6601K9412L2601L6245M0528M5600N1406N7819O4792P2310Q0306
50847A560309Q8760R7727J07098J16375J24931J32582J39640J46206J51472J54188
50837B819288J53783J50567J44593J34932J20844J03428Q5242O8181N2451L7845
$$ plain form
50920 2061454 1994066 1921289 1843777 1762218 1678532 1595778 1516619 1442304 1373214 1309688 1251824
50909 1251824 1199102 1150936 1107406 1068879 1035121 1005378 979134 956162 935876 917288 899842
50898 899842 883812 869645 857325 846550 837241 829503 823128 817415 811608 805577 800007 795744 792889
50885 792889 790747 788717 786940 785921 785876 786779 788666 791413 794519 797731 801729 807512 815095 823479 832016
50870 832016 841209 851919 864333 878064 892766 908226 924164 940534 957882 977070 998637 1022689
50858 1022689 1049290 1078702 1111303 1147548 1188076 1233676 1285082 1342901 1407693 1480003 1560309
50847 1560309 1649069 1746796 1853894 1970269 2095200 2227782 2367422 2513628 2665100 2819288
50837 2819288 2973071 3123638 3268231 3403163 3524007 3627435 3712677 3780858 3833309 3871154
50827C871154K5153J5603R530O443O304R899J7714K8848M1305N3084O2800O9303
50815D217140P1142O6760N5423L7862J5740r389l6387o4081r1190j16776j40207
50804D006037j60563j76645j87871j94541j96848j94269j86541j74744j60707
50795B373308j45651j30037j14386r9307q4895p0907n7641m5912l6011k7423j9748
50784A541390j3212q146m518k356j834k577l517m046m796o618r146j1177j2326
50771A457121j3383j4994j6728j7963j9069k1070k4266k7669k9935l0579l0182
50760A211283k9616k9232k8696k7442k5250k2420j9546j7032j4842j2635j0134
50749I74438p430m869k633n12J853M545P320J0001J2741J5721J8772K1549K4141
$$ plain form
50827 3871154 3896307 3911910 3921440 3927883 3934187 3944086 3961800 3990648 4031953 4085037 4147837 4217140
50815 4217140 4288282 4355042 4410465 4448327 4464067 4454678 4418291 4354210 4263020 4146244 4006037
50804 4006037 3845474 3668829 3480958 3286417 3089569 2895300 2708759 2534015 2373308
50795 2373308 2227657 2097620 1983234 1883927 1799032 1728125 1670484 1624572 1588561 1561138 1541390
50784 1541390 1528178 1520032 1515514 1513158 1511324 1508747 1505230 1501184 1496388 1489770 1480624 1469447 1457121
50771 1457121 1443738 1428744 1412016 1394053 1374984 1353914 1329648 1301979 1272044 1241465 1211283
50760 1211283 1181667 1152435 1123739 1096297 1071047 1048627 1029081 1012049 997207 984572 974438
50749 974438 967008 962139 959506 958994 960847 965392 972712 982713 995454 1011175 1029947 1051496 1075637
50736A075637K7212L1380L6641M2472M8364N4054N9383O4202O8479P2281P5571
50725A655676P8215Q0163Q1489Q2177Q2046Q0895P8585P4839O9078O0715M9612
50714B473490L6267K1647P029o050j6047k1950k3697k1953j7458j0633j837Q193
50702B427001J8356K7627L5364M1169M4615M5075M1717L3689K0652L285j6776
50691B721774l7663n7862p6188r1482j02687j09210j11152j09192j04259r7138
50681A824941q8296p8050o6898n5511m4393l3714k3461j3577l956N421J4281K2254
50669A459041K9259L5353M0183M3113M3973M3211M1100L7383L2126K6354K1305
50658A852401J7385J4335J2118J0895J0325R558Q028N898L749K121J291J180J608
$$ plain form
50736 1075637 1102849 1134229 1170870 1213342 1261706 1315760 1375143 1439345 1507824 1580105 1655676
50725 1655676 1733891 1814054 1895543 1977720 2059766 2140661 2219246 2294085 2363163 2423878 2473490
50714 2473490 2509757 2531404 2538433 2532383 2516336 2494386 2470689 2448736 2431278 2420645 2418808 2427001
50702 2427001 2445357 2472984 2508348 2549517 2594132 2639207 2680924 2714613 2735265 2738550 2721774
50691 2721774 2684111 2626249 2550061 2458579 2355892 2246682 2135530 2026338 1922079 1824941
50681 1824941 1736645 1658595 1591697 1536186 1491793 1458079 1434618 1421041 1417085 1422506 1436787 1459041
50669 1459041 1488300 1523653 1563836 1606949 1650922 1694133 1735233 1772616 1804742 1831096 1852401
50658 1852401 1869786 1884121 1896239 1907134 1917459 1927017 1935045 1940943 1944692 1946813 1948104 1949284 1950892
50645A950892K809N327R164J3545J7939K2797K8637L4900M0566M5378M9540N2517
50633B274011N3388N2435N1109N0086M8470M5496M2045L9425L6989L1763K0608
50622B745825K626k0094m3588o3721p7464q3425q2108p5705o6849n6882m5647
50611B132968l3190k0846j0005p08P439J3705J6970J7480J6231J2820N781m774
50599B153871j6620k7992l9018m9889n9308o5913o9959p2351p3089p1835o9125
50588A538772o5819o1994n7453n2669m8132m3424l8029l2516k7823k3830j9796
50577A067287j5730j2273r510p026m858l302k035m70J135K017K231K590L423M390
50563A027869N517P332R830J2396J4799J7422K0262K2807K5108K8075L2175L6666
$$ plain form
50645 1950892 1953701 1959028 1968192 1981737 1999676 2022473 2051110 2086010 2126576 2171954 2221494 2274011
50633 2274011 2327399 2379834 2430943 2481029 2529499 2574995 2617040 2656465 2693454 2725217 2745825
50622 2745825 2748451 2728357 2684769 2621048 2543584 2460159 2378051 2302346 2235497 2178615 2132968
50611 2132968 2099778 2078932 2068927 2068219 2075658 2089363 2106333 2123813 2140044 2152864 2158645 2153871
50599 2153871 2137251 2109259 2070241 2020352 1961044 1895131 1825172 1752821 1679732 1607897 1538772
50588 1538772 1472953 1410959 1353506 1300837 1252705 1209281 1171252 1138736 1110913 1087083 1067287
50577 1067287 1051557 1039284 1029774 1022748 1017890 1014588 1012553 1012083 1013218 1015235 1017466 1020056 1023479 1027869
50563 1027869 1033386 1040718 1050548 1062944 1077743 1095165 1115427 1138234 1163342 1191417 1223592 1260258
50551A260258M0530M3506M5692M6759M6218M4128M1070L7575L4012L0866K8743
50540A699357K8060K8802L0594L3036L6110M0184M5484N1622N7848O3639O8962
50529B183698P4222Q0211Q7784R7118J07335J17145J25753J32918J38494J42280
50519C286958J44081J43491J39764J32360J21405J07293R0082O9749M6859K2509
50509D304551k325k7087n1392p4798r6486j15036j28982j37894j42380j42663
50499C385508j37823j27117j11447r2686p2090n0180k7667n487J5818L5640N2389
50488B864858O3986O9174O7513N8459M1685J8462q358l5975o2464q6166j05419
50477B885755j19378j28238j32444j32430j29270j24506j18974j12481j04960
$$ plain form
50551 1260258 1300788 1344294 1389986 1436745 1482963 1527091 1568161 1605736 1639748 1670614 1699357
50540 1699357 1727417 1756219 1786813 1819849 1855959 1896143 1941627 1993249 2051097 2114736 2183698
50529 2183698 2257920 2338131 2425915 2523033 2630368 2747513 2873266 3006184 3144678 3286958
50519 3286958 3431039 3574530 3714294 3846654 3968059 4075352 4165434 4235183 4282042 4304551
50509 4304551 4302226 4275139 4223747 4148949 4052463 3937427 3808445 3670551 3528171 3385508
50499 3385508 3247685 3120568 3009121 2916435 2844345 2794165 2766498 2761011 2776829 2812469 2864858
50488 2864858 2928844 2998018 3065531 3123990 3165675 3184137 3175779 3139804 3077340 2991174 2885755
50477 2885755 2766377 2638139 2505695 2373265 2243995 2119489 2000515 1888034 1783074
50468A783074r7065q9344q1648p3805o6194n9164n2573m6289m0660l6027l2275
50457A108030k9045k5849k1969j7002j1773p859n776m413k692r52k8K35P12J765
50443I83384L049M283N420O221O318N774N144M933N218N778O447P356Q815J0795
50429A068935J2731J4142J5343J6968J8871K0047J9858J8791J7868J7766J8614
50418A259934K0189K2194K4753K8533L3834L9786M5272N0489N6586O3630P0165
50407A715365P5072P8679Q1490Q3036Q2817Q1254P8718P4447O7630N8949M9817
50396B527274M0391K9502J6427J712j3750k9516m5238o0208p3444q3938r0873
50385B218339r3934r3397q9673q3002p3858o3161n1634l9335k6385j3660k125
$$ plain form
50468 1783074 1686009 1596665 1515017 1441212 1375018 1315854 1263281 1216992 1176332 1140305 1108030
50457 1108030 1078985 1053136 1031167 1014165 1002392 994533 988757 984344 981652 980700 980672 980907 981619 983384
50443 983384 986433 990716 996136 1002357 1008675 1014449 1019593 1024526 1029744 1035522 1041969 1049325 1058140 1068935
50429 1068935 1081666 1095808 1111151 1128119 1146990 1167037 1186895 1205686 1223554 1241320 1259934
50418 1259934 1280123 1302317 1327070 1355603 1389437 1429223 1474495 1524984 1581570 1645200 1715365
50407 1715365 1790437 1869116 1950606 2033642 2116459 2197713 2276431 2350878 2418508 2477457 2527274
50396 2527274 2567665 2597167 2613594 2615306 2601556 2572040 2526802 2466594 2393150 2309212 2218339
50385 2218339 2124405 2031008 1941335 1858333 1784475 1721314 1669680 1630345 1603960 1590300 1588175
50374A588175Q177J7588K5519L0565L1891K9734K4561J6551O157n653j8015l0493
50362A724757m2345n2120n8460o1210o1400o0275n8505n6203n3314n0034m6854
50351A124037m4178m1888l9435l6414l2871k9075k5153k1226j7706j5110j3452
50340H07529j2025j0159q059o514n699m791l104j138N9L16M34R84J700K185K545
50325G64263L043L721M564N631O773P597Q037Q492R232J0056J0707J1155J1294
50312H64565J0958J0548J1046J2943J5545J7761J9129J9571J8605J5623J0814
50301A027108N338M83l065n283o478o812o036l895q19K126M111N082N355N197
50287A022412M957N003N261N320N248N737P141R015J0879J2661J3776J2737Q603
$$ plain form
50374 1588175 1596352 1613940 1639459 1670024 1701915 1731649 1756210 1772761 1778918 1773265 1755250 1724757
50362 1724757 1682412 1630292 1571832 1510622 1449222 1388947 1330442 1274239 1220925 1170891 1124037
50351 1124037 1079859 1037971 998536 962122 929251 900176 875023 853797 836091 820981 807529
50340 807529 795504 785345 777286 770772 765073 760282 757178 756040 756099 756415 756849 757833 759533 761718 764263
50325 764263 767306 771027 775591 781222 787995 795592 803629 812121 821353 831409 842116 853271 864565
50312 864565 875523 886071 897117 910060 925605 943366 962495 982066 1000671 1016294 1027108
50301 1027108 1032446 1032929 1029864 1024581 1018103 1011291 1005255 1001360 1000541 1002667 1006778 1011860 1017215 1022412
50287 1022412 1027369 1032372 1037633 1042953 1048201 1053938 1061079 1070094 1080973 1093634 1107410 1120147 1128750
50274A128750K446l435p460r403r703r082q474q337q157p370o525o686p837q817
50260A029910q832q144p211n981m367k620r60O24J970K676K739K824L571M923
50246A011122O346P404P946Q017P805P566P370P147O891O743O758O745O421N643
50232A109924M546L461K628J946J190M63J36L68J076K444M948Q618J2744J6622
50218A171114K0144K3258K5429K6140K5609K4467K3028K1371J9817J8839J8644
50207A417860J9177K0186K0946K0381J7905J3677P744l03j0182k0278k9116l6743
50195A441254m3585m8616n0168m8402m5313m2187l8363l3053k7045k1867j8187
50184A024468j5823j4759j5361j7719k1245k4745k6963k7429k6804k5966k4790
$$ plain form
50274 1128750 1131196 1127761 1120301 1110898 1101195 1092113 1083639 1075302 1067145 1059775 1053250 1046564 1038727 1029910
50260 1029910 1021078 1012934 1005723 999742 995375 992755 991795 992419 994389 997065 999804 1002628 1006199 1011122
50246 1011122 1017468 1024872 1032818 1040835 1048640 1056206 1063576 1070723 1077614 1084357 1091115 1097860 1104281 1109924
50232 1109924 1114470 1117931 1120559 1122505 1123695 1124158 1124294 1124662 1125738 1128182 1133130 1141748 1154492 1171114
50218 1171114 1191258 1214516 1239945 1266085 1291694 1316161 1339189 1360560 1380377 1399216 1417860
50207 1417860 1437037 1457223 1478169 1498550 1516455 1530132 1537876 1537573 1527391 1507113 1477997 1441254
50195 1441254 1397669 1349053 1298885 1250483 1205170 1162983 1124620 1091567 1064522 1042655 1024468
50184 1024468 1008645 993886 978525 960806 939561 914816 887853 860424 833620 807654 782864
50173G82864k2516j9236j6191j4282j3060j1586r690p921o664n835n079m078k817
50160F43909j705j078o08K92J460K129K217K739M464O783Q482R083Q955Q421P479
50145G03022O153M643L089J555J49j054k125l064l525l062j602L92K238L607M785
50130G15201O251P934R064R122Q593Q375Q664Q995R286J0001J1242J2390J2978
50117H38096J3355J4090J5261J6604J7969J9275K0419K1615K3480K6412L0139
50106A056715L4191L8491M3179M8129N3034N7754O2209O6061O8679O9480O8218
50095A666140O5304O1963N9680N9218O0255O2073O4069O5381O4550O0197N1936
50084B340766M0311K6037R833p159k3470l8001n0377o0476o8023p2840p5280p6028
$$ plain form
50173 782864 760348 741112 724921 710639 697579 685993 676303 668382 661718 655883 650804 646726 643909
50160 643909 642204 641126 640518 640810 642270 644399 646616 649355 653819 660602 669084 678167 687122 695543 703022
50145 703022 709175 713818 716907 718462 718611 717557 715432 712368 708843 705781 704179 704571 706809 710416 715201
50130 715201 721452 729386 738450 747572 756165 764540 773204 782199 791485 801486 812728 825118 838096
50117 838096 851451 865541 880802 897406 915375 934650 955069 976684 1000164 1026576 1056715
50106 1056715 1090906 1129397 1172576 1220705 1273739 1331493 1393702 1459763 1528442 1597922 1666140
50095 1666140 1731444 1793407 1853087 1912305 1972560 2034633 2098702 2164083 2228633 2288830 2340766
50084 2340766 2381077 2407114 2416947 2409788 2386318 2348317 2297940 2237464 2169441 2096601 2021321 1945293
50072A945293p5451p3409o9813o5156o0239n5405n0350m4902l9751l6064l4306
50061A340447l3721l3063l1713k9962k8222k6330k3787k0647j7712j5605j3934
50050A065751j1844r189o603m462k488m93J225K573M044N873P432Q075Q088Q162
50036A076144Q337Q202P720P076O043M343K503J428J155P63m44k322m387o289
50022A110272p815r080j0650j2765j4603j5146j4644j4344j4731j5093j4922j4682
50010I51797j4802j4805j4023j2529j0821r163p590o088m475k551n24J281L250
49997H58957O240J0281J4284J7372J9628K1129K1216J9550J7282J6225J7078J9161
49985A058403K1604K4140K6818K9486L1741L3127L3419L2735L1270K8999K5958
$$ plain form
50072 1945293 1869842 1796433 1726620 1661464 1601225 1545820 1495470 1450568 1410817 1374753 1340447
50061 1340447 1306726 1273663 1241950 1211988 1183766 1157436 1133649 1113002 1095290 1079685 1065751
50050 1065751 1053907 1044718 1038115 1033653 1031165 1030672 1031897 1034470 1038514 1044387 1051819 1059894 1067982 1076144
50036 1076144 1084481 1092683 1100403 1107479 1113522 1117865 1120368 1121796 1122951 1123714 1123270 1120948 1116561 1110272
50022 1110272 1102457 1093377 1082727 1069962 1055359 1040213 1025569 1011225 996494 981401 966479 951797
50010 951797 936995 922190 908167 895638 884817 875654 868064 861976 857501 854950 854426 855707 858957
49997 858957 865197 875478 889762 907134 926762 947891 969107 988657 1005939 1022164 1039242 1058403
49985 1058403 1080007 1104147 1130965 1160451 1192192 1225319 1258738 1291473 1322743 1351742 1377700
49974A377700K2681J9927J8004J6939J7120J8940K1588K3031K1605J7069R876
49963A584480L11j1198k3596l5596m6196n4503n9715o1701o1051n8256n3390m6901
49951A072688l9908l3154k6428j9606j3510r084o325m709m087m388n022n447n895
49938H95125o748p575p725p638q631j1377j5219j8970k1819k3461k3981k3682
49926G18299k2825k1471j9689j7640j5359j2849j0485q748p378n470k810l66R78
49913E74187J460J645J440P49L03Q72K113L239M285N782P475Q574R054R746J1124
49898F42048J2854J4489J5749J6167J5237J3004R966O494K982J98j372k395m023
49885G41398o429q769j0490j1870j3175j4198j4752j4903j4698j4175j3689j3495
$$ plain form
49974 1377700 1400381 1420308 1438312 1455251 1472371 1491311 1512899 1535930 1557535 1574604 1584480
49963 1584480 1584791 1573593 1549997 1514401 1468205 1413702 1353987 1292286 1231235 1172979 1119589 1072688
49951 1072688 1032780 999626 973198 953592 940082 930998 924673 919964 915877 911489 906467 901020 895125
49938 895125 888377 880802 873077 865439 856808 845431 830212 811242 789423 765962 741981 718299
49926 718299 695474 674003 654314 636674 621315 608466 597981 589233 581855 576385 573575 573209 574187
49913 574187 575647 577292 578732 579481 579784 580656 582769 586008 590293 596075 603550 612124 621178 630924 642048
49898 642048 654902 669391 685140 701307 716544 729548 739514 746008 748990 749188 747816 745421 741398
49885 741398 734969 726200 715710 703840 690665 676467 661715 646812 632114 617939 604250 590755
49873E90755j3205j2258j0854r589q394o744m869l617l023k133n80Q07J434J990
$$ plain form
49873 590755 577550 565292 554438 544849 536455 529711 524842 521225 518202 516069 515489 516296 517730 519720
$$ [...]
##END NTUPLES=NMR SPECTRUM
##END=
