
##TITLE=AC1365_HAWAS12179_7163953_Rh0BGGhK0Q
##JCAMPDX= 6.0         $$ Bruker NMR JCAMP-DX V2.0
##DATA TYPE= NMR SPECTRUM
##DATA CLASS= NTUPLES
##ORIGIN= BRUKER
##OWNER= Administrator
$$ 1.72 TOPSPIN		Version 2.1
$$ 2012-12-01 15:50:23.901 -0500  Administrator@X
$$ Compression mode = diff/dup
##.OBSERVE FREQUENCY= 400.02188249412
##.OBSERVE NUCLEUS= ^1H
##.ACQUISITION MODE= SIMULTANEOUS (DQD)
##.ACQUISITION SCHEME= undefined
##.AVERAGES= 64
##.DIGITISER RES= 22
##SPECTROMETER/DATA SYSTEM= spect
##.PULSE SEQUENCE= noesygpps1d.comp
##.SOLVENT NAME= COFFEE_meoh
##.SHIFT REFERENCE= INTERNAL, COFFEE_meoh, 1, 14.96205
##AUDIT TRAIL= $$ (NUMBER, WHEN, WHO, WHERE, PROCESS, VERSION, WHAT)
$$ ##TITLE= Audit trail, TOPSPIN		Version 2.1
$$ ##JCAMPDX= 5.01
$$ ##ORIGIN= Bruker BioSpin GmbH
$$ ##OWNER= Administrator
$$ $$ E:\/data/COFFEE/nmr/AC1365_HAWAS12179_7163953_Rh0BGGhK0Q/12/pdata/1/auditp.txt
$$ ##AUDIT TRAIL=  $$ (NUMBER, WHEN, WHO, WHERE, PROCESS, VERSION, WHAT)
(   1,<2012-12-01 15:50:20.040 -0500>,<Administrator>,<X>,<go>,<TOPSPIN 2.1>,
      <created by zg
	started at 2012-12-01 15:38:49.531 -0500,
	POWCHK enabled, PULCHK disabled,
       configuration hash MD5:
       86 BA 57 50 F2 9D 5C 9B 26 00 A9 28 5F 66 2E 89
       data hash MD5: 64K
       B5 F1 92 5D C9 C4 D1 3C C7 D9 3E B5 25 C1 E0 16>)
(   2,<2012-12-01 15:50:22.115 -0500>,<Administrator>,<X>,<proc1d>,<TOPSPIN 2.1>,
      <Start of raw data processing
       efp LB = 0.3 FT_mod = 6 PKNL = 1 PHC0 = 0 PHC1 = 0 SI = 128K 
       data hash MD5: 128K
       DE EB 0F E0 7A 5E DF D5 D4 77 00 B3 8B 5F B6 37>)
(   3,<2012-12-01 15:50:22.811 -0500>,<Administrator>,<X>,<proc1d>,<TOPSPIN 2.1>,
      <pk PHC0 = -81.35925 PHC1 = 0 
       data hash MD5: 128K
       CA 8D 15 B6 B8 09 47 C9 B7 49 D0 13 A3 DD F4 D7>)
(   4,<2012-12-01 15:50:23.285 -0500>,<Administrator>,<X>,<proc1d>,<TOPSPIN 2.1>,
      <abs ABSG = 1 
       data hash MD5: 128K
       4D 43 73 0A D1 CD 05 72 C2 82 1D 14 1D FE D0 57>)
(   5,<2012-12-01 15:50:23.396 -0500>,<Administrator>,<X>,<proc1d>,<TOPSPIN 2.1>,
      <abs ABSG = 2 
       data hash MD5: 128K
       02 88 80 88 D0 C7 F9 56 30 C0 70 94 AE 4C F1 8C>)
(   6,<2012-12-01 15:50:23.497 -0500>,<Administrator>,<X>,<proc1d>,<TOPSPIN 2.1>,
      <abs ABSG = 3 
       data hash MD5: 128K
       23 3C A8 2E 4B 2B E5 15 24 31 15 74 24 C2 A0 5D>)
(   7,<2012-12-01 15:50:23.608 -0500>,<Administrator>,<X>,<proc1d>,<TOPSPIN 2.1>,
      <abs ABSG = 4 
       data hash MD5: 128K
       13 BF 4F C4 C6 8F 22 15 F5 57 90 FB 7A EB FA 4C>)
(   8,<2012-12-01 15:50:23.719 -0500>,<Administrator>,<X>,<proc1d>,<TOPSPIN 2.1>,
      <abs ABSG = 5 
       data hash MD5: 128K
       C4 BB B0 B4 8E BA A3 1A 84 FF CA 0C 72 25 D1 B5>)
$$ ##END=
$$ 
$$ $$ hash MD5
$$ $$ 1A 47 89 1E 64 E1 2B 23 6B E3 B6 7A 22 57 49 8D
##$RELAX= 
##$RELAX= 
##$RELAX= 
##$RELAX= 
##$RELAX= 
##$RELAX= 
##$RELAX= 
##$RELAX= 
$$ Bruker specific parameters
$$ --------------------------
##$DU= <E:\>
##$EXPNO= 12
$$ [...]
##$TP07= 0
##$TPNAME0= <>
##$TPNAME1= <>
##$TPNAME2= <>
##$TPNAME3= <>
##$TPNAME4= <>
##$TPNAME5= <>
##$TPNAME6= <>
##$TPNAME7= <>
##$TPOAL= (0..7)
0.5 0.5 0.5 0.5 0.5 0.5 0.5 0.5
##$TPOFFS= (0..7)
0 0 0 0 0 0 0 0
##$TUNHIN= 0
##$TUNHOUT= 0
##$TUNXOUT= 0
##$USERA1= <user>
##$USERA2= <user>
##$USERA3= <user>
##$USERA4= <user>
##$USERA5= <user>
##$V9= 5
##$VALIST= <valist>
##$VCLIST= <CCCCCCCCCCCCCCC>
##$VD= 0
##$VDLIST= <DDDDDDDDDDDDDDD>
##$VPLIST= <PPPPPPPPPPPPPPP>
##$VTLIST= <TTTTTTTTTTTTTTT>
##$WBST= 1024
##$WBSW= 4
##$XGAIN= (0..3)
0 0 0 0
##$XL= 0
##$YL= 0
##$YMAX_a= 7757542
##$YMIN_a= -16508661
##$ZGOPTNS= <>
##$ZL1= 120
##$ZL2= 120
##$ZL3= 120
##$ZL4= 120
##$ABSF1= 14.96205
##$ABSF2= -5.596131
##$ABSG= 5
##$ABSL= 3
##$ALPHA= 0
##$AQORDER= 0
##$ASSFAC= 0
##$ASSFACI= 0
##$ASSFACX= 0
##$ASSWID= 0
##$AUNMP= <proc_prof1d_extract.lims>
##$AXLEFT= 0
##$AXNAME= <>
##$AXNUC= <1H>
##$AXRIGHT= 0
##$AXTYPE= 0
##$AXUNIT= <>
##$AZFE= 0.1
##$AZFW= 0.1
##$BCFW= 0
##$BC_mod= 0
##$BYTORDP= 0
##$COROFFS= 0
##$CY= 15
##$DATMOD= 1
##$DC= 0
##$DFILT= <>
##$DTYPP= 0
##$F1P= 0
##$F2P= 0
##$FCOR= 0.5
##$FTSIZE= 131072
##$FT_mod= 6
##$GAMMA= 0
##$GB= 0
##$INTBC= 1
##$INTSCL= 1
##$ISEN= 128
##$LB= 0.3
##$LEV0= 0
##$LPBIN= 0
##$MAXI= 10000
##$MC2= 0
##$MEAN= 0
##$ME_mod= 0
##$MI= 0
##$NCOEF= 0
##$NC_proc= -2
##$NLEV= 6
##$NOISF1= 0
##$NOISF2= 0
##$NSP= 0
##$NTH_PI= 0
##$NZP= 0
##$OFFSET= 14.96205
##$PC= 1
##$PHC0= -81.35925
##$PHC1= 0
##$PH_mod= 1
##$PKNL= yes
##$PPARMOD= 0
##$PPDIAG= 0
##$PPIPTYP= 0
##$PPMPNUM= 2147483647
##$PPRESOL= 1
##$PSCAL= 4
##$PSIGN= 0
##$PYNMP= <proc.py>
##$REVERSE= no
##$SF= 400.020009216168
##$SI= 131072
##$SIGF1= 0
##$SIGF2= 0
##$SINO= 400
##$SIOLD= 131072
##$SPECTYP= <>
##$SREGLST= <1H.CDCl3>
##$SSB= 0
##$STSI= 131072
##$STSR= 0
##$SW_p= 8223.68421052631
##$SYMM= 0
##$S_DEV= 0
##$TDeff= 65536
##$TDoff= 0
##$TI= <>
##$TILT= no
##$TM1= 0
##$TM2= 0
##$TOPLEV= 0
##$USERP1= <user>
##$USERP2= <user>
##$USERP3= <user>
##$USERP4= <user>
##$USERP5= <user>
##$WDW= 1
##$XDIM= 131072
##$YMAX_p= 432197425
##$YMIN_p= -11297
##$CURPLOT= <Network HP LaserJet P1505>
##$CURPRIN= <$Network HP LaserJet P1505>
##$DFORMAT= <normdp>
##$LAYOUT= <+/1D_H.xwp>
##$LFORMAT= <normlp>
##$PFORMAT= <normpl>
##$SURQMSG= 1
$$ End of Bruker specific parameters
$$ ---------------------------------
##NTUPLES= NMR SPECTRUM
##VAR_NAME=  FREQUENCY,     SPECTRUM/REAL,   SPECTRUM/IMAG
##SYMBOL=    X,             R,               I
##VAR_TYPE=  INDEPENDENT,   DEPENDENT,       DEPENDENT
##VAR_FORM=  AFFN,          ASDF,            ASDF
##VAR_DIM=   131072,        131072,          131072
##UNITS=     HZ,            ARBITRARY UNITS, ARBITRARY UNITS
##FACTOR=    0.0627417313425164, 1,          1
##FIRST=     8223.62146879497, -2963,        -66271
##LAST=      0,             220,             -67369
##MIN=       0,             -11297,          0
##MAX=       8223.62146879497, 432197425,    0
$$ Real data points
##PAGE= N=1
##DATA TABLE= (X++(R..R)), XYDATA
$$ [...]
61017I85743K3408K4516K6010K7401K8530K9775L1509L3841L6729L9959M3148
61006A330569M5920M7951M9017M9671N1627N6501O4145P3204Q3251R5003J08283
60995B055142J21514J33935J46965J62874J83700K12192K52049L06161L76255
60986C950787M65314N78436P20048Q91966J094762J328120J588913J872214K171509
60977A4662069K461574K666784K659210K327242J679501Q83278J81136k48248
60969B7272546l63139k25370O4325L81983N66154M52719k7219p74833j564336
60960B5782830k174210k497655k554097k425962k196099j924954j652544j401611
60952H955698j179971r87503q23182o85864n72168m77689l99877l37676k89079
$$ plain form
61017 985743 1009151 1033667 1059677 1087078 1115608 1145383 1176892 1210733 1247462 1287421 1330569
61006 1330569 1376489 1424440 1473457 1523128 1574755 1631256 1695401 1768605 1851856 1946859 2055142
60995 2055142 2176656 2310591 2457556 2620430 2804130 3016322 3268371 3574532 3950787
60986 3950787 4416101 4994537 5714585 6606551 7701313 9029433 10618346 12490560 14662069
60977 14662069 17123643 19790427 22449637 24776879 26456380 27339658 27520794 27272546
60969 27272546 26909407 26684037 26748362 27130345 27696499 28149218 28121999 27347166 25782830
60960 25782830 23608620 21110965 18556868 16130906 13934807 12009853 10357309 8955698
60952 8955698 7775727 6788224 5965042 5279178 4707010 4229321 3829444 3491768 3202689
60943C202689k50905k20403j95570j74422j55509j38787j24684j12575j01236
60934A728598r0389q0565p1827o3904n7413n3549n2311n2003n0869m8506m5584
60923A061678m2815m0442l8222l5658l2574k9440k6850k4777k2787k0815j9231
60912G28067j8133j7132j5858j4408j3101j2144j1473j0771r625p998o458n612
60900E85354n363n059m393l786l738m104m268l891l208k523j766p74J52M47J56
60885E43236L6N21R69M93q24k082k772l131l414l527l467l473l642l867m193m741
60869E06122n231n182m592l842l002j930j007p78q33j21J378K375K226J986K846
60854D90415M431N648O420P520R160J0788J2009J2842J3306J3468J3724J4295
$$ plain form
60943 3202689 2951784 2731381 2535811 2361389 2205880 2067093 1942409 1829834 1728598
60934 1728598 1638209 1557644 1485817 1421913 1364500 1310951 1258640 1206637 1155768 1107262 1061678
60923 1061678 1018863 978421 940199 904541 871967 842527 815677 790900 768113 747298 728067
60912 728067 709934 692802 676944 662536 649435 637291 625818 615047 605422 597424 590966 585354
60900 585354 579991 574932 570539 566753 563015 558911 554643 550752 547544 545021 543255 542481 542633 543080 543236
60885 543236 543272 543793 544762 545255 544431 542349 539577 536446 533032 529505 526038 522565 518923 515056 510863 506122
60869 506122 500891 495709 491117 487275 484273 482343 481336 480558 479725 479604 480982 483357 485583 487569 490415
60854 490415 494846 500494 506914 514434 523594 534382 546391 559233 572539 586007 599731 614026
60842F14026J4591J3780J1849R550P488N838M759M322M103L450K172N83j052k590
60828F92869l765m333m495m721n180n623n688n145m156l514m099n641o586n864
60814F24059m338l737m507n571n983n824n512n174m908m912n069m950m413l853
60800E55308l612l555l287k554j460n72m93r73q12O70K504L218K860K793L629
60785E53664M515M753M883N555O321O417O067O106O650O989O694O142N931O214
60771F36901O703O949O589N568M298L443L422M009M390L808K347R82N61P96O82
60756F91448j69j040j133n78j36k17n76q08q17q05r53j164j184j076j402k657
60740F76733m554o285p399q064q414q275p717p334p467p610p009n655m209l134
$$ plain form
60842 614026 628617 642397 654246 663796 671284 677122 681881 686203 690306 693756 695928 696511 695459 692869
60828 692869 689104 684771 680276 675555 670375 664752 659064 653919 649763 646249 642150 636509 629923 624059
60814 624059 619721 615984 611477 605906 599923 594099 588587 583413 578505 573593 568524 563574 559161 555308
60800 555308 551696 548141 544854 542300 540840 540268 539775 538802 537990 538660 541164 544382 547242 550035 553664
60785 553664 558179 562932 567815 573370 579691 586108 592175 598281 604931 611920 618614 624756 630687 636901
60771 636901 643604 650553 657142 662710 667008 670451 673873 677882 682272 686080 688427 689409 689970 690766 691448
60756 691448 691279 690239 689106 688528 688392 688175 687599 686791 685974 685169 684216 683052 681868 680792 679390 676733
60740 676733 672179 665894 658495 650431 642017 633742 626025 618691 611224 603614 596605 590950 586741 583607
60726E83607k388j873j642j649j672j565j340r52k69O66J551K097K206J894J302
60711E79973P51N07M19Q1m97p74m75r7k87r34j452j782k491l734m753m848m418
60694E55189m484n365o379o859o907o991p137o854n824m432l602l975n199o170
60680D75011o139n426m859m682m445l848l155k676k270j645q95m58o01j044j076
60665D31792j96J216K091J930J591K253L720M587M174L485L773M924N813N845
60651D76998N468N392N867O627P230P489P601P689P301N957M180L168L159L038
60637E57164K097J224J506K528L147L322L909M979N711N859O046O382O120N057
60623F15051M136M081M328L950K916J744N86o26j596k008k165k613l263l492l015
$$ plain form
60726 583607 581219 579346 577704 576055 574383 572818 571478 570526 570257 570923 572474 574571 576777 578671 579973
60711 579973 580724 581231 581650 581731 581234 580460 579985 579888 579601 578667 577215 575433 572942 569208 564455 559607 555189
60694 555189 550705 545340 538961 532102 525195 518204 511067 504213 498389 493957 490355 486380 481181 475011
60680 475011 468872 463446 458587 453905 449460 445612 442457 439781 437511 435866 434971 434513 433912 432868 431792
60665 431792 431596 432812 434903 436833 438424 440677 444397 448984 453158 456643 460416 465340 471153 476998
60651 476998 482466 487858 493725 500352 507582 515071 522672 530361 537662 543619 547799 550967 554126 557164
60637 557164 559261 560485 561991 564519 567666 570988 574897 579876 585587 591446 597492 603874 609994 615051
60623 615051 619187 623268 627596 631546 634462 636206 636792 636166 634570 632562 630397 627784 624521 621029 618014
60608F18014k200j490j035q59r89j275j378j120p02m80p02j448k601l749m362
60593E93624m276l946l927m062l536j892K52J814K421K631L070L800M533N015
60579E95521N077M729M359M402M660M451L551K503J752J150N97M86Q97J077M26
60564F35638n22r15q49r62j217j083p01p33j155j225p94m93n42k34R76K698M315
60547F32202N731P075Q360R849J2158J5553J9585K3781K8278L3497L9630M6601
60535H82300N4015O0886O5931O8308O7619O3197N4172M0624K3996O088j1697k7889
60523A347550m0731m9155n3306n3654n0332m4044l6774l0410k5009j9506j3828
60512I30801r160o160m048j796O16K642M222N882Q135J1159J4915J9265K4186
$$ plain form
60608 618014 615814 614324 613289 612430 611441 610166 608788 607668 606966 606486 605784 604336 601735 597986 593624
60593 593624 589348 585402 581475 577413 573877 571985 572237 574051 576472 579103 582173 585973 590506 595521
60579 595521 600598 605327 609686 614088 618748 623199 626750 629253 631005 632155 632752 633238 634135 635212 635638
60564 635638 635116 634201 633352 632390 631173 630090 629389 628656 627501 626276 625482 624989 624447 624213 625189 627887 632202
60547 632202 637933 645008 653368 663217 675375 690928 710513 734294 762572 796069 835699 882300
60535 882300 936315 997201 1063132 1131440 1199059 1262256 1316428 1357052 1381048 1387136 1375439 1347550
60523 1347550 1306819 1257664 1204358 1150704 1100372 1056328 1019554 989144 964135 944629 930801
60512 930801 921641 915481 911433 909637 910253 912895 917117 922999 931134 942293 957208 976473 1000659
60499A000659K9932L6807M4644N2827O1100O9914P9537Q8870R5779R8816R8401
60488A757286R6161R3441R0986Q9862R2109J00093J15294J37813J66620J99961
60478B939626K35453K69792K98236L14658L12943K89062K42138J74000Q8784o603
60468E158089j02673j89501k59481l08459l35516l42677l34386l15787k90938
60459B678671k62705k33646k05903j80407j57218j36678j19280j04488r0979p8342
60449A109025o7478n8934n1906m5391l9388l4297l0018k6347k3513k1528j9686
60438F90539j7369j4953j3171j2110j1393j0946j0819j0703j0207r443q710p916
60426E52799o799n449m230l419l209l631m151l874k593j148l21O1M52P48P68R36
$$ plain form
60499 1000659 1030591 1067398 1112042 1164869 1225969 1295883 1375420 1464290 1560069 1658885 1757286
60488 1757286 1853447 1946888 2037874 2127736 2219845 2319938 2435232 2573045 2739665 2939626
60478 2939626 3175079 3444871 3743107 4057765 4370708 4659770 4901908 5075908 5164692 5158089
60468 5158089 5055416 4865915 4606434 4297975 3962459 3619782 3285396 2969609 2678671
60459 2678671 2415966 2182320 1976417 1796010 1638792 1502114 1382834 1278346 1187367 1109025
60449 1109025 1041547 982613 930707 885316 845928 811631 781613 755266 731753 710225 690539
60438 690539 673170 658217 645046 632936 621543 610597 599778 589075 578868 569425 560715 552799
60426 552799 546000 540551 536321 532902 529693 526062 521911 518037 515444 514296 513975 514036 514488 515236 516004 516940
60410E16940J652K494K824K807K959L134K806K121J813K135K643K926K973K952
60396E53179L230M246N842P030P165O873P025P266O595N118L942L426K831J846
60382F25614J144J001N08j065k976l917l713l365l635m224m321l530k194j053
60368E94274o26r35j744k772l540l391k097l47R16J506J954K624L350L924M353
60353E97449M681M951N342N912O350O381O258O280O149N497M844N081N986O249
60339F77410N197L636K590K080J622J211J176J599K410L693N386O986Q089Q862
60325G31947R566R849R130P475N513L548J271j561m538o934q338q881q935q842
60311G30270q776q731q456p654o397n297m939n165n274m985m748m872m889m267
$$ plain form
60410 516940 518592 521086 523910 526717 529676 532810 535616 537737 539550 541685 544328 547254 550227 553179
60396 553179 556409 560655 566497 573527 580692 587565 594590 601856 608451 613569 617511 620937 623768 625614
60382 625614 626758 627759 628267 627202 624226 620309 616596 613231 609596 605372 601051 597521 595327 594274
60368 594274 593648 592713 590969 588197 584657 581266 579169 578822 579738 581244 583198 585822 589172 593096 597449
60353 597449 602130 607081 612423 618335 624685 631066 637324 643604 649753 655250 660094 665175 671161 677410
60339 677410 682607 686243 688833 690913 692535 693746 694922 696521 698931 702624 708010 714996 723085 731947
60325 731947 741513 751362 760492 767967 773480 777028 778299 776738 772200 765266 756928 748047 739112 730270
60311 730270 721494 712763 704307 696653 690256 684959 680020 674855 669581 664596 659848 654976 650087 645820
60297F45820l320k791k761k699k417k231k209j991j510j199j278j415j338j222
60283F17439j179q40J02J349K360L052L782M754N726O302O373O276O508P175P804
60268F76983P834P189O251N500N409O298P841R051R355R479J0597J2770J4907
60255G89464J6238J7019J7736J8462J9210K0192K1431K2784K4583K7510L1536
60244A026165L5735L9563M3540M8205N3162N7884O2758O8453P4646Q0304Q5075
60233A675490Q9509R3852R7276R8591R7320R3890Q8990Q2908P5371O6044N5135
60222B614376M3373L1458J9724Q332k608j3163k3244l2007l8151m1186m1869m1031
60210B484004l8547l4020k7948k1360j4582p092J440J0775K0706L1380M2745N4221
$$ plain form
60297 645820 642500 639709 636948 634249 631832 629601 627392 625401 623891 622692 621414 619999 618661 617439
60283 617439 616260 615420 615522 616871 619231 622283 626065 630819 636545 642847 649220 655496 662004 669179 676983
60268 676983 684817 692006 698257 703757 709166 715464 723305 732356 741711 751190 761787 774557 789464
60255 789464 805702 822721 840457 858919 878129 898321 919752 942536 967119 994629 1026165
60244 1026165 1061900 1101463 1145003 1193208 1246370 1304254 1367012 1435465 1510111 1590415 1675490
60233 1675490 1764999 1858851 1956127 2054718 2152038 2245928 2334918 2417826 2493197 2559241 2614376
60222 2614376 2657749 2689207 2708931 2717263 2714655 2701492 2678248 2646241 2608090 2566904 2525035 2484004
60210 2484004 2445457 2411437 2383489 2362129 2347547 2340455 2341895 2352670 2373376 2404756 2447501 2501722
60198B501722O5132P5193Q4388R2619R9538J04494J06623J05281J00429R2499
60188C427918Q1976O9435N5700M1400K6346J0036p130k3700l8558n1868o4087
60177C527468p4600q1972q5474q5568q2920p7594o9543n9314m7765l5459k2675
60166B804584r887K312J3695K4513L5039M5174N4363O1655O6094O7445O6327O3233
60154C294547N7644M8873L7619K5797J4688M163o006j5090k2230k7318l0244l0157
60142C352286k6519k0265j2762m075O546J8875L1717M4579N7945P1854Q5721R9820
60130C705722J15572J33734J53436J73633J94400K15994K37571K57741K75680
60121E463483K90907L02552L09803L12506L10473L02648K87899K66343K39120
$$ plain form
60198 2501722 2566854 2642047 2726435 2819054 2918592 3023086 3129709 3234990 3335419 3427918
60188 3427918 3509894 3579329 3635029 3676429 3702775 3712811 3705681 3681981 3643423 3591555 3527468
60177 3527468 3452868 3370896 3285422 3199854 3116934 3039340 2969797 2910483 2862718 2827259 2804584
60166 2804584 2794697 2797009 2810704 2835217 2870256 2915430 2969793 3031448 3097542 3164987 3231314 3294547
60154 3294547 3352191 3401064 3438683 3464480 3479168 3483331 3477325 3462235 3440005 3412687 3382443 3352286
60142 3352286 3325767 3305502 3292740 3288665 3295211 3314086 3345803 3390382 3448327 3520181 3605902 3705722
60130 3705722 3821294 3955028 4108464 4282097 4476497 4692491 4930062 5187803 5463483
60121 5463483 5754390 6056942 6366745 6679251 6989724 7292372 7580271 7846614 8085734
60112H085734K07130J70767J30679Q7858M2934l863n1828r9342j44460j85553
60102H240056k21354k50715k72529k85894k90502k86995k76696k60738k39669
60093E854964k14014j84900j53867j22279r1096o0776l1246k491K4438M7616O5784
60082E132133P9223Q8613R3653R3501Q8164P8677O6205N1591L5550J8591R03j7032
60070E809772l4051m9168o2687p5636q8228r9686j09487j18050j25902j32835
60060D914042j38090j40897j40811j37837j32423j25000j15586j04165r1208p7360
60050C710665o2876m7896l2959j8536m142J1168K7332M3127N7535P0547Q2415
60039C836380R2916J01641J08236J11911J11458J06320R7179Q5025P0061N2147
$$ plain form
60112 8085734 8292864 8463631 8594310 8682168 8725102 8721239 8669411 8570069 8425609 8240056
60102 8240056 8018702 7767987 7495458 7209564 6919062 6632067 6355371 6094633 5854964
60093 5854964 5640950 5456050 5302183 5179904 5088808 5028032 4996786 4994295 5018733 5066349 5132133
60082 5132133 5211356 5299969 5393622 5487123 5575287 5653964 5720169 5771760 5807310 5825901 5826804 5809772
60070 5809772 5775721 5726553 5663866 5588230 5500002 5400316 5290829 5172779 5046877 4914042
60060 4914042 4775952 4635055 4494244 4356407 4223984 4098984 3983398 3879233 3788025 3710665
60050 3710665 3647789 3599893 3566934 3548398 3544256 3555424 3582756 3625883 3683418 3753965 3836380
60039 3836380 3929296 4030937 4139173 4251084 4362542 4468862 4566041 4651066 4721127 4773274
60029D773274L1910J0719j0397l1239n1790p1423q8924j03149j13654j20711j24709
60018D099907j25606j23116j17332j08872r8467q6674p4030o1022m7799l4205
60008C222784k0271o354P335K1041L5134M9731O4782Q0179R5650J10751J25088
59997C785850J38213J49251J56932J60232J58622J51783J39594J22738J02653
59988E065868Q0430N6230L0253L727k1877m6187o9576r1512j10194j24060j32838
59977D640264j36832j36002j30278j20283j07002r1110p3188n4278l5483j7127
59967C738681J002J8519L4226M7233N7725O6393P3587P9375Q3838Q6870Q7969
59956D375418Q6802Q3688P9155P3211O5562N6387M6451L6536K7088J8321J0221
$$ plain form
60029 4773274 4805184 4815903 4805506 4774267 4722477 4651054 4562130 4458981 4345327 4224616 4099907
60018 4099907 3974301 3851185 3733853 3624981 3526514 3439840 3365810 3304788 3256989 3222784
60008 3222784 3202513 3196159 3203494 3224535 3259669 3309400 3374182 3454361 3550011 3660762 3785850
59997 3785850 3924063 4073314 4230246 4390478 4549100 4700883 4840477 4963215 5065868
59988 5065868 5146298 5202528 5232781 5236508 5214631 5168444 5098868 5007356 4897162 4773102 4640264
59977 4640264 4503432 4367430 4237152 4116869 4009867 3918757 3845569 3791291 3755808 3738681
59967 3738681 3739683 3758202 3792428 3839661 3897386 3963779 4037366 4116741 4200579 4287449 4375418
59956 4375418 4462220 4545908 4625063 4698274 4763836 4820223 4866674 4903210 4930298 4948619 4958840
59945D958840K726l713p950r089p322l085M323J6317L3146N3430P5873J00559
59933E214055J28117J58376J90498K23657K56887K88644L17091L40597L57491
59924G475413L65743L63349L48743L20688K78487K22927J56671Q3360O805o8782
59914I553404j38967k00561k52367k93640l22612l37912l40902l35056l23003
59905G008384l05448k82961k57215k29782k00970j70761j40035j09930q0534n1152
59895E179596k1663P083L4176N9401Q3023J05159J25422J42842J56041J63521
59885F034601J63912J56176J39886J15342Q3455M5566L448m0788q5087j27513
59875F488998j65882j97834k21894k38288k48222k52522k51428k45439k35590
$$ plain form
59945 4958840 4961566 4957853 4949903 4940814 4933492 4930407 4934730 4951047 4984193 5037623 5113496 5214055
59933 5214055 5342172 5500548 5691046 5914703 6171590 6460234 6777325 7117922 7475413
59924 7475413 7841156 8204505 8553248 8873936 9152423 9375350 9532021 9615381 9622186 9553404
59914 9553404 9414437 9213876 8961509 8667869 8345257 8007345 7666443 7331387 7008384
59905 7008384 6702936 6419975 6162760 5932978 5732008 5561247 5421212 5311282 5230748 5179596
59895 5179596 5157933 5165016 5199192 5258593 5341616 5446775 5572197 5715039 5871080 6034601
59885 6034601 6198513 6354689 6494575 6609917 6693372 6738938 6742386 6701598 6616511 6488998
59875 6488998 6323116 6125282 5903388 5665100 5416878 5164356 4912928 4667489 4431899
59866D431899k22958k08382j92686j76494j59862j42629j25222j08471r2742p7903
59856B924550o4155n2192m2352l4335k7950k3436k0872j9831j9831k0448k0882
59845B578266k0205j8395j6302j4170j1065o427j468J824K620J435j163n088j0103
59832B479759j5495k0579k4935k8156k9822k9940k9067k7868k6779k6065k5883
59821B195170k6020k5722k3974k0158j4633q705l814n51J551L417N798R145J3630
59808B105134J9033K4828L0621L6357M1910M6698M9865N0851M9640M6536M1766
59797B543239L5399K7697J9525J2099O204J889r19j914q68J810N581J0583J7302
59784B677627K5617L4915M5054N6489O9472Q3961J00344J19420J41423J65859
$$ plain form
59866 4431899 4208941 4000559 3807873 3631379 3471517 3328888 3203666 3095195 3002453 2924550
59856 2924550 2860395 2808203 2765851 2731516 2703566 2680130 2659258 2639427 2619596 2599148 2578266
59845 2578266 2558061 2539666 2523364 2509194 2498129 2491702 2490234 2492058 2494678 2496113 2494950 2489862 2479759
59832 2479759 2464264 2443685 2418750 2390594 2360772 2330832 2301765 2273897 2247118 2221053 2195170
59821 2195170 2169150 2143428 2119454 2099296 2084663 2075958 2072144 2071593 2073144 2076561 2082359 2091504 2105134
59808 2105134 2124167 2148995 2179616 2215973 2257883 2304581 2354446 2405297 2454937 2501473 2543239
59797 2543239 2578638 2606335 2625860 2637959 2644163 2646052 2645133 2643219 2642351 2644161 2649742 2660325 2677627
59784 2677627 2703244 2738159 2783213 2839702 2909174 2993135 3093479 3212899 3354322 3520181
59774C520181J92486K21554K52652K84014L13261L37991L54985L59547L46279
59765F182950L10667K50622J68383P1979k6239j14223j84258k33294k61320k70655
59755E894612k65748k51636k32036k09263j85325j61947j39772j18597r8410p9488
59745D152390o1719m4810k9091j5091k383J0232K3294L6338M9113O2187P6049
59734D256509R0485J05282J20818J37530J55390J74316J94756K17331K42284K69514
59724E964215K98866L30139L63064L97395M32643M67583N00334N29082N52299
59715I835620N68188N74579N69874N54066N28834M97135M62825M30057M02399
59706A4423577L82329L71446L70459L78606L93313M10879M27420M39108M42121
$$ plain form
59774 3520181 3712667 3934221 4186873 4470887 4784148 5122139 5477124 5836671 6182950
59765 6182950 6493617 6744239 6912622 6984601 6958362 6844139 6659881 6426587 6165267 5894612
59755 5894612 5628864 5377228 5145192 4935929 4750604 4588657 4448885 4330288 4231878 4152390
59745 4152390 4090671 4045861 4016770 4001679 3999296 4009528 4032822 4069160 4118273 4180460 4256509
59734 4256509 4346994 4452276 4573094 4710624 4866014 5040330 5235086 5452417 5694701 5964215
59724 5964215 6263081 6593220 6956284 7353679 7786322 8253905 8754239 9283321 9835620
59715 9835620 10403808 10978387 11548261 12102327 12631161 13128296 13591121 14021178 14423577
59706 14423577 14805906 15177352 15547811 15926417 16319730 16730609 17158029 17597137 18039258
59697A8039258M33077M09777L71565L19241K54898J81693J03446K4310n1397j19475
59687A9966393j76326k19267k46540k57556k53189k35369k05948j66128j16978
59678A8089092n9903L864P3795J49425K29399L11875L95802M80957N66185O47910
59668B0888401P20731P79059Q17798Q31753Q15275P63164O72190N42190L76470
59659B7207031J82015l0509k47502m54345o37873p88213q99359r68982r98227
59650B2364036r91524r55802q99011q28729p51730o74488o03775n46635n09568
59641A5602774m97096n10052n44375n91332o39582o78393p00458p03125o87763
59632A0050598o58026o18183n72200n23506m74930m28485l85256l45578l09431
$$ plain form
59697 18039258 18472335 18882112 19253677 19572918 19827816 20009509 20112955 20137265 20085868 19966393
59687 19966393 19790067 19570800 19324260 19066704 18813515 18578146 18372198 18206070 18089092
59678 18089092 18029189 18033053 18106848 18256273 18485672 18797547 19193349 19674306 20240491 20888401
59668 20888401 21609132 22388191 23205989 24037742 24853017 25616181 26288371 26830561 27207031
59659 27207031 27389046 27358537 27111035 26656690 26018817 25230604 24331245 23362263 22364036
59650 22364036 21372512 20416710 19517699 18688970 17937240 17262752 16658977 16112342 15602774
59641 15602774 15105678 14595626 14051251 13459919 12820337 12141944 11441486 10738361 10050598
59632 10050598 9392572 8774389 8202189 7678683 7203753 6775268 6390012 6044434 5735003
59623E735003k76712k47269k20788j96795j74843j54738j36473j19897j04616
59614D102872r0402p7570o6634n7649n0163m3785l8526l4679l2770l3517l7199
59603C539978m2873m8885n4404n9849o5425p0070p2568p3059p2514p1134o8358
59592B840839o4238n9679n5163n0273m4721l9011l3671k8561k3386j8242j3302
59581B410592q467l762M09L792O611R144J1394J3387J5275J6874J7725J7921J8331
59568B529226J9549K1184K2642K4012K5744K7968L0741L4492L9534M5501N1794
59557B872387N8327O5327P2872Q1143R0635J01475J12960J24464J36425J49575
59547C865590J63596J77381J90418K02821K14089K22981K28862K32156K33056
$$ plain form
59623 5735003 5458291 5211022 4990234 4793439 4618596 4463858 4327385 4207488 4102872
59614 4102872 4012470 3934900 3868266 3810617 3760454 3716669 3678143 3643464 3610694 3577177 3539978
59603 3539978 3497105 3448220 3393816 3333967 3268542 3198472 3125904 3052845 2980331 2909197 2840839
59592 2840839 2776601 2716922 2661759 2611486 2566765 2527754 2494083 2465522 2442136 2423894 2410592
59581 2410592 2402125 2398363 2398772 2402564 2409175 2418319 2429713 2443100 2458375 2475249 2492974 2510895 2529226
59568 2529226 2548775 2569959 2592601 2616613 2642357 2670325 2701066 2735558 2775092 2820593 2872387
59557 2872387 2930714 2996041 3068913 3150056 3240691 3342166 3455126 3579590 3716015 3865590
59547 3865590 4029186 4206567 4396985 4599806 4813895 5036876 5265738 5497894 5730950
59538E730950K30657K24090K13786K00714J84558J63596J36815J05835P4439M6155
59528G311595K2318K236j5167l0209m2527n1607n6918n7863n3914m4705l0002
59517F953237r952J4596M2364P2272J03300J33521J59972J79782J91028J92207
59507H032327J81784J58977J24524Q0097K7519l0908r1881j51848k07980k57847
59497G864764k98803l28727l47184l54961l52848l41804l23847l01531k76558
59488D938501k49913k23094j97806j74320j51567j29192j08336q9823p2824n6049
59478C485577l9365k3322p835P785K3895M0322N6862P3506R0400J07799J25613
59467C941237J42893J58364J71796J84002J94959K02746K05006K00910J90845
$$ plain form
59538 5730950 5961607 6185697 6399483 6600197 6784755 6948351 7085166 7191001 7265440 7311595
59528 7311595 7333913 7336149 7320982 7290773 7248246 7196639 7139721 7081858 7027944 6983239 6953237
59517 6953237 6943285 6957881 7000245 7072517 7175817 7309338 7469310 7649092 7840120 8032327
59507 8032327 8214111 8373088 8497612 8577709 8605228 8574320 8482439 8330591 8122611 7864764
59497 7864764 7565961 7237234 6890050 6535089 6182241 5840437 5516590 5215059 4938501
59488 4938501 4688588 4465494 4267688 4093368 3941801 3812609 3704273 3614450 3541626 3485577
59478 3485577 3446212 3422890 3415055 3422840 3446735 3487057 3543919 3617425 3707825 3815624 3941237
59467 3941237 4084130 4242494 4414290 4598292 4793251 4995997 5201003 5401913 5592758
59458E592758J74780J51888J21803Q5412M4521J296m1982q3313j21290j54856
59448E771017j82889k04488k19552k28679k32520k31583k26486k17992k06899
59439C819929j94158j80943j68135j55782j43475j31179j19329j08169r7519q7194
59429B434046p7308o8036n9432n1600m4662l8441l2441k6381k0452j4883r448
59418A990962l724K281Q033J3060J7399K1404K5298K9018L2175L3787L2184K6000
59406B227877J5854M931k737m972k502K392Q013J4084K0968K8302L4363L6774
59394B383347L4283K8242K2270K0025K2871K9496L7650M6206N5603O6646P9295
59383B825934R2763J06442J20332J34814J50576J68722J90249K15069K42055K70438
$$ plain form
59458 5592758 5767538 5919426 6041229 6126641 6171162 6172458 6130476 6047163 5925873 5771017
59448 5771017 5588128 5383640 5164088 4935409 4702889 4471306 4244820 4026828 3819929
59439 3819929 3625771 3444828 3276693 3120911 2977436 2846257 2726928 2618759 2521240 2434046
59429 2434046 2356738 2288702 2229270 2177670 2133008 2094567 2062126 2035745 2015293 2000410 1990962
59418 1990962 1987238 1989519 1997552 2010612 2028011 2049415 2074713 2103731 2135906 2169693 2201877 2227877
59406 2227877 2243731 2248662 2245925 2240953 2238451 2240843 2248856 2262940 2283908 2312210 2346573 2383347
59394 2383347 2417630 2445872 2468142 2488167 2511038 2540534 2578184 2624390 2679993 2746639 2825934
59383 2825934 2918697 3025139 3145471 3280285 3430861 3599583 3789832 4004901 4246956 4517394
59373D517394L00611L33091L67146M01021M33073M61862M85332N00849N06403
59364H306782N01382M86297M62368M31569L96502L59821L23695K89606K58213
59355A1816235K29513K03321J79401J56764J33180J06069P3803L5730q521n8849
59345A2866646j13851j71038k27946k82388l31877l73959m07478m32683m49945
59336A0075481m59175m60738m55801m45306m29389m08377l83650l56947l29439
59327F346659l01881k74944k48728k22723j96955j72615j50802j31249j12969
59318D533793r5711p9907o5729n3121m2555l4656k9060k4539k0502j7679j7052
59307D053282j8565k1224k4118k7018l0085l3245l6012l7967l9303m0496m1506
$$ plain form
59373 4517394 4818005 5151096 5518242 5919263 6352336 6814198 7299530 7800379 8306782
59364 8306782 8808164 9294461 9756829 10188398 10584900 10944721 11268416 11558022 11816235
59355 11816235 12045748 12249069 12428470 12585234 12718414 12824483 12898286 12934016 12925495 12866646
59345 12866646 12752795 12581757 12353811 12071423 11739546 11365587 10958109 10525426 10075481
59336 10075481 9616306 9155568 8699767 8254461 7825072 7416695 7033045 6676098 6346659
59327 6346659 6044778 5769834 5521106 5298383 5101428 4928813 4778011 4646762 4533793
59318 4533793 4438082 4358175 4292446 4239325 4196770 4162114 4133054 4108515 4088013 4070334 4053282
59307 4053282 4034717 4013493 3989375 3962357 3932272 3899027 3863015 3825048 3785745 3745249 3703743
59296C703743m1646m0423l8064l5014l1335k6915k1877j6419j0483l863L577J2055
59284C453336K1823L2757M4325N6164O8299Q0626R2753J04594J16322J27132J34832
59273D332963J37683J36424J33688J31401J29349J26020J20042J10714R7813Q1371
59263E537468O1575L8941J4504j0488l5287n9552q2333j01831j16808j27699j35680
59252D982810j41082j43593j43529j41893j39173j35072j29492j22985j15987
59243C770004j08413j00294r2108q4151p6106o7620n8906n0417m2196l3913k5299
59232C030581j6322p052K538J2633K3537L5487M8599O3029P9080R6959J16680
59221C485749J38329J62154J88057K15340K43252K71399K99139L24851L46312
$$ plain form
59296 3703743 3662097 3621674 3583610 3548596 3517261 3490346 3468469 3452050 3441567 3437704 3441281 3453336
59284 3453336 3475159 3507916 3552241 3608405 3676704 3757330 3850083 3954677 4070999 4198131 4332963
59273 4332963 4470646 4607070 4740758 4872159 5001508 5127528 5247570 5358284 5456097 5537468
59263 5537468 5599043 5637984 5652488 5642000 5606713 5547161 5464828 5362997 5246189 5118490 4982810
59252 4982810 4841728 4698135 4554606 4412713 4273540 4138468 4008976 3885991 3770004
59243 3770004 3661591 3561297 3469189 3385038 3308932 3241312 3182406 3131989 3089793 3055880 3030581
59232 3030581 3014259 3007207 3009745 3022378 3045915 3081402 3130001 3193030 3272110 3369069 3485749
59221 3485749 3624078 3786232 3974289 4189629 4432881 4704280 5003419 5328270 5674582
59212E674582L61416L67957L63247L45050L13061K68727K13662J49041P6737J36
59202H133616p6628j49770k15987k72263l16193l46462l62925l66572l59548l44630
59192E322638l24277l00326k74459k48376k23194j99202j76581j55904j37683
59183C282636j21887j08277r6774q7006p7876o8270n8204m8846m1301l5601l0786
59172B507808k5791k0181j4237q428k887K458P407J1526J4723J7408J9990K2474
59160B532270K4777K6979K9021L0493L1129L1213L1092L0535K8924K6028K2084
59149B844545J7334J1951O420J438k696o267r600j2720j5649j8536k1163k2688
59137B772369k2438k0808j8938j7546j6406j4935j2830j0057o622k617J851O964
$$ plain form
59212 5674582 6035998 6403955 6767202 7112252 7425313 7694040 7907702 8056743 8133480 8133616
59202 8133616 8056988 7907218 7691231 7418968 7102775 6756313 6393388 6026816 5667268 5322638
59192 5322638 4998361 4698035 4423576 4175200 3952006 3752804 3576223 3420319 3282636
59183 3282636 3160749 3052472 2955698 2868692 2790816 2722546 2664342 2615496 2574195 2538594 2507808
59172 2507808 2482017 2461836 2447599 2439171 2436284 2438742 2446149 2457675 2472398 2489806 2509796 2532270
59160 2532270 2557047 2584026 2613047 2643540 2674669 2705882 2736974 2767509 2796433 2822461 2844545
59149 2844545 2861879 2873830 2880250 2881688 2878992 2872725 2863125 2850405 2834756 2816220 2795057 2772369
59137 2772369 2749931 2729123 2710185 2692639 2676233 2661298 2648468 2638411 2631789 2629172 2631023 2637987
59125B637987J3052J9946K6866L3312L9702M6655N4010O1174O8184P5609Q3320
59114C159817R0306R6015J01188J06785J12672J17959J22286J26078J29636J32647
59104D295389J34621J35407J35179J34323J33269J32190J30671J28004J23689
59095E482742J17367J08192R4654P5401N0136J9621j4958n2313r0737j27914j61455
59084E500736j89716k11958k27765k36777k39189k36109k28995k18905k06657
59075C504665j93366j80166j67380j54685j42172j30625j20483j11208j02080
59066B202500r3168q5058p8000p1779o6082o0629n5165m9709m4596l9977l5499
59055A522838l0816k6086k1606j7282j2889q586m732j336J822M658O796Q022Q350
$$ plain form
59125 2637987 2651039 2670985 2697851 2731163 2770865 2817520 2871530 2932704 3000888 3076497 3159817
59114 3159817 3250123 3346138 3447326 3554111 3666783 3784742 3907028 4033106 4162742 4295389
59104 4295389 4430010 4565417 4700596 4834919 4968188 5100378 5231049 5359053 5482742
59095 5482742 5600109 5708301 5802955 5878356 5928492 5948113 5933155 5880842 5790105 5662191 5500736
59084 5500736 5311020 5099062 4871297 4634520 4395331 4159222 3930227 3711322 3504665
59075 3504665 3311299 3131133 2963753 2809068 2666896 2536271 2415788 2304580 2202500
59066 2202500 2109332 2024274 1946274 1874495 1808413 1747784 1692619 1642910 1598314 1558337 1522838
59055 1522838 1492022 1465936 1444330 1427048 1414159 1405573 1400841 1399505 1401327 1405985 1412781 1420803 1429153
59042A429153P740O065L412J24l363o565q981j0312j0557r819q216o181m382l051
59028A375067j635M92L186N779P897R699J1271J2287J2272J1077R112P113N572
59015A469189M397L313K520K524L348M449N478O509P436P808P517O969O302N147
59001A542906L488J864K07k586p126j2260j6267j8740k0451k1784k2407k2270
58989A404574k1915k1669k1151j9696j7026j3635j0630q759p452n476k767o55
58977A253743K13R84K786N026O606P878R873J2391J4434J6023J7962K0181K1872
58964A389972K3024K4265K5331K5360K4586K4153K4164K3663K2704K2594K3654
58953A653470K4481K4162K3642K4064K5146K6056K6673K7007K6578K5417K4807
$$ plain form
59042 1429153 1436893 1442958 1446370 1446494 1443131 1436566 1427585 1417273 1406716 1396897 1388681 1382500 1378118 1375067
59028 1375067 1373432 1373924 1377110 1382889 1390786 1400485 1411756 1424043 1436315 1447392 1456504 1463617 1469189
59015 1469189 1473586 1476899 1479419 1481943 1485291 1489740 1495218 1501727 1509163 1516971 1524488 1531457 1537759 1542906
59001 1542906 1546394 1548258 1548465 1545879 1538753 1526493 1510226 1491486 1471035 1449251 1426844 1404574
58989 1404574 1382659 1360990 1339839 1320143 1303117 1289482 1278852 1270093 1262641 1257165 1254398 1253743
58977 1253743 1253956 1254940 1257726 1262752 1269358 1277236 1287109 1299500 1313934 1329957 1347919 1368100 1389972
58964 1389972 1412996 1437261 1462592 1487952 1512538 1536691 1560855 1584518 1607222 1629816 1653470
58953 1653470 1677951 1702113 1725755 1749819 1774965 1801021 1827694 1854701 1881279 1906696 1931503
58942A931503K5920K8373L0982L3272L5550L8085M1099M4896M9402N3983N8367
58931B371432O3149O8926P5515Q2466Q9690R7160J04796J13164J23303J35182
58921C324783J47286J58626J70274J84000K00131K17948K37495K59546K84065
58912E184154L10064L37114L65850L96637M28692M60791M92167N22204N49615
58903I047288N72379N88225N94818N89656N70214N34585M82067M13113L28916
58894A3721261K31435J24105J1945r9480k05261l01263l83832m50350m99993n33365
58884A1615202n51608n56490n50751n37142n17028m90951m60549m28633l97240
58875G124810l66712l37066l09100k83660k60947k41043k24231k10218j98036
$$ plain form
58942 1931503 1957423 1985796 2016778 2050050 2085600 2123685 2164784 2209680 2259082 2313065 2371432
58931 2371432 2434581 2503507 2579022 2661488 2751178 2848338 2953134 3066298 3189601 3324783
58921 3324783 3472069 3630695 3800969 3984969 4185100 4403048 4640543 4900089 5184154
58912 5184154 5494218 5831332 6197182 6593819 7022511 7483302 7975469 8497673 9047288
58903 9047288 9619667 10207892 10802710 11392366 11962580 12497165 12979232 13392345 13721261
58894 13721261 13952696 14076801 14088746 13989266 13784005 13482742 13098910 12648560 12148567 11615202
58884 11615202 11063594 10507104 9956353 9419211 8902183 8411232 7950683 7522050 7124810
58875 7124810 6758098 6421032 6111932 5828272 5567325 5326282 5102051 4891833 4693797
58866D693797j87153j77780j69554j61120j51703j42086j33155j24448j15196
58857C331602j05877r7641r0673q4144p7383p0296o2998n5777m9049m2796l6534
58846B558434l0244k4633j9922j5227r886m511J20M443R302J4473J9067K3009
58834B524425K7037L1593L6606M2077M8013N4048N9865O5664P1675P7731Q3926
58823C122660R1062R9579J08767J17930J27624J38828J51521J65133J79847J96230
58813D499181K14207K33538K54861K78948L05367L33158L62459L93988M27155
58804G302862M60131M91602N20881N46196N64414N72849N69997N54219N23109
58795A2106260M74970M09966L29519K35675J31729K2476q6974j92160k88817l72640
$$ plain form
58866 4693797 4506644 4328864 4159310 3998190 3846487 3704401 3571246 3446798 3331602
58857 3331602 3225725 3128084 3037411 2953267 2875884 2805588 2742590 2686813 2637764 2594968 2558434
58846 2558434 2528190 2503557 2483635 2468408 2458522 2454011 2454131 2458574 2467876 2482349 2501416 2524425
58834 2524425 2551462 2583055 2619661 2661738 2709751 2763799 2823664 2889328 2961003 3038734 3122660
58823 3122660 3213722 3313301 3422068 3539998 3667622 3806450 3957971 4123104 4302951 4499181
58813 4499181 4713388 4946926 5201787 5480735 5786102 6119260 6481719 6875707 7302862
58804 7302862 7762993 8254595 8775476 9321672 9886086 10458935 11028932 11583151 12106260
58795 12106260 12581230 12991196 13320715 13556390 13688119 13710595 13623621 13431461 13142644 12770004
58785A2770004m40527m91747n27263n48234n55733n51513n38323n19158m96321
58776H101185m71087m44151m16430l89384l64348l41657l20647l00460k80659
58767D772362k61266k42569k24815k07920j91676j76339j62543j50397j39199
58758C015638j28478j18677j10141j02129r3674q4953p6823o9384o2022n4652
58748B114705m7838m1783l6213l1265k7377k4262k1041j7648j5052j3733j2866
58737A825627j1599j0396j0453j2300j5405j8853k1907k4191k5678k6575k7065
58726A621205k7273k7356k7435k7545k7835k8571k9621l0290l0085k9427k9106
58715A306661k9271k9481k9492k9403k9169k8571k7539k6084k4146k1943k0149
$$ plain form
58785 12770004 12329477 11837730 11310467 10762233 10206500 9654987 9116664 8597506 8101185
58776 8101185 7630098 7185947 6769517 6380133 6015785 5674128 5353481 5053021 4772362
58767 4772362 4511096 4268527 4043712 3835792 3644116 3467777 3305234 3154837 3015638
58758 3015638 2887160 2768483 2658342 2556213 2462539 2377586 2300763 2231379 2169357 2114705
58748 2114705 2066867 2025084 1988871 1957606 1930229 1905967 1884926 1867278 1852226 1838493 1825627
58737 1825627 1814028 1803632 1793179 1780879 1765474 1746621 1724714 1700523 1674845 1648270 1621205
58726 1621205 1593932 1566576 1539141 1511596 1483761 1455190 1425569 1395279 1365194 1335767 1306661
58715 1306661 1277390 1247909 1218417 1189014 1159845 1131274 1103735 1077651 1053505 1031562 1011413
58704A011413j9092j8132j6504j4445j2807j1892j1428j1369j1803j2329j2470
58693H59142j2509j2968j3500j3332j2675j2511j2985j3102j2247j0880r478p833
58681G15122n809l830k189o13J050K439L381M347N754P331Q495Q888Q379P080
58667G59825N554M517M080L695K980K037R39n30k437m550o664q609r965j0302
58653G40570r753q821p712o439n422n105n047m270k629r96J02J117K512L978N075
58638F97160N917O839P870Q921J0059J1258J2294J3035J3598J4188J5103J6784
58626H33026J9352K2300K5162K8245L2031L6113L9630M2678M6296N1063N6682
58615A232578O3012P0480P9164Q8375R7588J07100J17404J28505J40006J51333
$$ plain form
58704 1011413 992321 974189 957685 943240 930433 918541 907113 895744 883941 871612 859142
58693 859142 846633 833665 820165 806833 794158 781647 768662 755560 743313 732433 722955 715122
58681 715122 709313 705483 703294 702681 703731 706170 709551 713898 719652 726983 735478 744366 752745 759825
58667 759825 765379 769896 773976 777671 780651 782688 783627 783097 780660 776110 769446 760837 750872 740570
58653 740570 730817 721996 714284 707845 702423 697318 692271 688001 685372 684376 684478 685595 688107 692085 697160
58638 697160 703077 709916 717786 726707 736766 748024 760318 773353 786951 801139 816242 833026
58626 833026 852378 874678 899840 928085 960116 996229 1035859 1078537 1124833 1175896 1232578
58615 1232578 1295590 1366070 1445234 1533609 1631197 1738297 1855701 1984206 2124212 2275545
58605B275545J61658J70144J76308J79580J78555J71376J57033J35748J08306
58596C714253P5733L9645K096l4973o9559r9394j22837j39898j51437j57692j58677
58585B897260j55613j50371j43593j34759j24252j13631j03620r3473q2809p2573
58575A722566o3421n4717m6072l8489l2894k8558k4149j9486j5326j2047r432
58564A377975p162m874k250L26J858J909R65q01m161r606j6272k2772k8332l2536
58550A254267l4875l5372l4880l3980l2259k9392k6194k3763k2118k0476j8448
58539I42510j6244j4184j2640j2031j2272j2589j2394j1914j1559j1257j0821
58528H04605j0411j0174r920r626r683j0275j0972j1333j1299j0823r690q151
$$ plain form
58605 2275545 2437203 2607347 2783655 2963235 3141790 3313166 3470199 3605947 3714253
58596 3714253 3789986 3829631 3831727 3796754 3727195 3627801 3504964 3365066 3213629 3055937 2897260
58585 2897260 2741647 2591276 2447683 2312924 2188672 2075041 1971421 1877948 1795139 1722566
58575 1722566 1659145 1604428 1558356 1519867 1486973 1458415 1434266 1414780 1399454 1387407 1377975
58564 1377975 1370813 1365939 1363689 1364015 1365873 1367782 1368747 1367946 1363785 1354179 1337907 1315135 1286803 1254267
58550 1254267 1219392 1184020 1149140 1115160 1082901 1053509 1027315 1003552 981434 960958 942510
58539 942510 926266 912082 899442 887411 875139 862550 850156 838242 826683 815426 804605
58528 804605 794194 784020 774100 764474 754791 744516 733544 722211 710912 700089 690399 682248
58516F82248o948o439o264o097o013n834n078l815k722j958r59K83Q47L18m23
58501F31146m60N6O42J392K525L862N320P056Q688R403R371R894J1512J3116J3680
58486G27203J3632J3619J3095J1340Q871O703M928L128J427L0j579l973o824r438
58472G82162j1641j3331j3940j3265j2128j1399j1006j0629j0461j0394r483p324
58460F47161n178m495m954n109m428l499k756k136j703j595j600j473j320j055
58446F05860j28J519K912L288L188L532M332N124N958P026Q030Q733R485J0336
58432F79195J0522R707Q811Q525P967O049L326J098n84k544m637n805n788n388
58418G10454n128m710l816k518r80N06J412J630J926L068M851O540P885R048J0084
$$ plain form
58516 682248 675300 668861 662597 656500 650487 644653 639575 635760 633038 631080 630121 630404 631251 631569 631146
58501 631146 630686 630742 631384 632776 635301 639163 644483 651539 660227 669630 679001 688895 700407 713523 727203
58486 727203 740835 754454 767549 778889 787760 794463 799391 802519 803946 803976 802397 798424 791600 782162
58472 782162 770521 757190 743250 729985 717857 706458 695452 684823 674362 663968 654485 647161
58460 647161 641983 637488 632534 627425 622997 619498 616742 614606 612903 611308 609708 608235 606915 605860
58446 605860 605732 607251 610163 613451 616639 620171 624503 629627 635585 642611 650641 659374 668859 679195
58432 679195 689717 699424 708235 716760 724727 730776 734102 735200 734616 732072 727435 721630 715842 710454
58418 710454 705326 700616 696800 694282 693302 693808 695220 696850 698776 701844 706695 713235 721120 730168 740252
58403G40252J1030J1915J2243J1254R184P340O200M535J339k418m987n959o127
58390G95801o011n608n016m300l282k123j328o64Q00K995M451M505M412N208N880
58375G95720N130L570K610K335K054J937K386K713K126J367J754L256M866O125
58361H37949P019P197O697O637P813R433J0533J1524J2933J3880J3520J2931J3652
58348I71718J5164J5702J4841J3520J2160J0467Q473O272L415K8k382k721k030
58335A064627j750j485j89J578K556L003L990N324O145O796Q118R660J0495J1049
58321A129917J2249J3690J4469J4971J5960J6908J7174J7683J9377K1159K1554
58310A315111K1296K1910K2791K2252K0450J8799J7316J5124J2733J1281J0294
$$ plain form
58403 740252 751282 763197 775440 786694 795878 803218 809418 813953 815292 812874 807887 801928 795801
58390 795801 789790 784182 779166 774866 771584 769461 768133 767469 768269 771264 775715 780220 784632 789840 795720
58375 795720 800850 804420 807030 809365 811419 813356 815742 818455 820581 821948 823702 826958 831824 837949
58361 837949 844968 852165 858862 865499 873312 882745 893278 904802 917735 931615 945135 958066 971718
58348 971718 986882 1002584 1017425 1030945 1043105 1053572 1062045 1068317 1071732 1071760 1069378 1066657 1064627
58335 1064627 1062877 1061392 1061203 1062781 1065337 1068340 1072330 1077654 1083799 1090595 1098713 1108373 1118868 1129917
58321 1129917 1142166 1155856 1170325 1185296 1201256 1218164 1235338 1253021 1272398 1293557 1315111
58310 1315111 1336407 1358317 1381108 1403360 1423810 1442609 1459925 1475049 1487782 1499063 1509357
58299A509357Q727P467Q171J0314J2007J3065J4761J7113J8981K0280K1688K2869
58287A684800K3255K3783K5525K7643K9007L0532L3423L6469L7943L8781M0946
58276B032107M4007M6395M8578N1685N4480N5240N5274N6842N8902N8689N6380
58265B618579N4221N2218M8844M5064M3579M4670M6640M9365N3584N7817O0205
58254C174786O2266O6619P2211P6115P8698Q2441Q6987R0243R3051R7699J03158
58243D084274J07030J10860J17961J27277J35120J41699J50011J59610J67782
58234E301624J75654J86631J99805K11647K23062K37910K55624K72529K89283
58225G353769L09585L32699L55175L78756M08207M42551M77175N13433N56875
$$ plain form
58299 1509357 1518084 1525551 1533722 1544036 1556043 1569108 1583869 1600982 1619963 1640243 1661931 1684800
58287 1684800 1708055 1731838 1757363 1785006 1814013 1844545 1877968 1914437 1952380 1991161 2032107
58276 2032107 2076114 2122509 2171087 2222772 2277252 2332492 2387766 2444608 2503510 2562199 2618579
58265 2618579 2672800 2725018 2773862 2818926 2862505 2907175 2953815 3003180 3056764 3114581 3174786
58254 3174786 3237052 3303671 3375882 3451997 3530695 3613136 3700123 3790366 3883417 3981116 4084274
58243 4084274 4191304 4302164 4420125 4547402 4682522 4824221 4974232 5133842 5301624
58234 5301624 5477278 5663909 5863714 6075361 6298423 6536333 6791957 7064486 7353769
58225 7353769 7663354 7996053 8351228 8729984 9138191 9580742 10057917 10571350 11128225
58216A1128225O07175O59674P15953P82602Q60483R45938J041592J154778J286576
58207A9182996J434647J605656J812321K060084K351025K699468L129189L658732
58199C7934118M308388N121304O160433P487730R166282J1276129J3895591J7055563
58191A12405538K0722856K4817137K9216353L3735021L8048421M1475430M2692209
58184C43112965L9826225L1356658J7437609M63968j5891365k8517701l6110787
58177C51677572l9072895l8618683l6019124l2306099k8215231k4187585k0440704
58170A32817251j7077791j4138270j1595482r383209p446236n748369m248474
58163F3179420k902255j679301n65180M05940J069466J132360L77844j076163
$$ plain form
58216 11128225 11735400 12395074 13111027 13893629 14754112 15700050 16741642 17896420 19182996
58207 19182996 20617643 22223299 24035620 26095704 28446729 31146197 34275386 37934118
58199 37934118 42242506 47363810 53524243 61011973 70178255 81454384 95349975 112405538
58191 112405538 133128394 157945531 187161884 220896905 258945326 300420756 343112965
58184 343112965 382939190 414295848 431733457 432197425 416306060 387788359 351677572
58177 351677572 312604677 273985994 237966870 205660771 177445540 153257955 132817251
58170 132817251 115739460 101601190 90005708 80622499 73176263 67427894 63179420
58163 63179420 60277165 58597864 58032684 58438624 59508090 60640450 61018294 59942131
58155E9942131k763187m153253m956301n181749m994309m569633m042797l504077
58147B5776825l000608k549703k158748j830470j558210j330673j141217r85789
58139A1221407q56472p45265o50793n74468n13360m62448m20169l86444l58824
58130F253164l34849l14586k97121k78604k57256k36079k17413j99248j80044
58121C937964j62382j48395j36035j23535j13425j08507j07358j06981j06446
58112B824900j05190j01375r4819q8273q3338p8358p2393o7515o4960o2689n9186
58101A946804n6004n4178n1762m7469m3279m0845l8571l4828l1003k8713k6969
58090A493183k4630k3044k3644k5305k6355k7051k8163k9234k9924l0868l1860
$$ plain form
58155 59942131 57178944 53025691 48069390 42887641 37893332 33323699 29280902 25776825
58147 25776825 22776217 20226514 18067766 16237296 14679086 13348413 12207196 11221407
58139 11221407 10364935 9619670 8968877 8394409 7881049 7418601 6998432 6611988 6253164
58130 6253164 5918315 5603729 5306608 5028004 4770748 4534669 4317256 4118008 3937964
58121 3937964 3775582 3627187 3491152 3367617 3254192 3145685 3038327 2931346 2824900
58112 2824900 2719710 2618335 2523516 2435243 2351905 2273547 2201154 2133639 2068679 2005990 1946804
58101 1946804 1890800 1836622 1784860 1737391 1694112 1653267 1614696 1579868 1548865 1520152 1493183
58090 1493183 1468553 1445509 1421865 1396560 1370205 1343154 1314991 1285757 1255833 1224965 1193105
58079A193105l1519k9948k9127k9497k9081k7157k5718k5815k5665k4005k2204
58068H93369k1249j9792j7082j4784j3831j2428r400o587n630n259m147l735n495
58055G53950p858q633q388q785r456r151q280p918p753p259p362q730r899r234
58041F35244p452o226n659n083m873n415n613m395k612j639j311q86q44j857l169
58026E78210l671l648l830l795k873j646r89n68L83J677K770L726M518M468L510
58011E78242K773K845K761J731N06j38p24j688k083j113M21J490K302L182L467
57996E93974K846K371K690K690J327o65k376m498p800j1127j2723j2567j1757
57983E42385j0679r317q304q093p958p205o366n907n076l358j771j104k81J725
$$ plain form
58079 1193105 1161586 1131638 1102511 1073014 1043933 1016776 991058 965243 939578 915573 893369
58068 893369 872120 852328 835246 820462 806631 794203 784803 778216 772586 767327 763180 759445 753950
58055 753950 746092 737459 729071 720286 710830 701679 693399 685481 677728 670469 663107 654377 644478 635244
58041 635244 627792 621566 615907 610824 605951 600536 594923 590528 587916 586277 584966 584080 583236 581379 578210
58026 578210 574539 570891 567061 563266 560393 558747 557758 557190 557573 559250 562020 565746 570264 574732 578242
58011 578242 581015 583860 586621 588352 588858 588720 587996 586308 584225 583112 583533 585023 587325 590507 593974
57996 593974 596820 599191 601881 604571 605898 605233 602857 598359 590559 579432 566709 554142 542385
57983 542385 531706 522389 514085 505992 498034 490829 484463 478556 473480 470122 468351 467247 466966 468691
57969D68691L731M080L443L793N358O659O978O928O954O979P126P328O763M939
57955E49750K761J158m23k763n002n742n194m521l773k222j50J528K860M366N471
57940E38104N234M197L697L646K775Q43j107k600m105n701o951q098r796j1685
57926E08453j2775j3207j4039j5260j5599j4588j3240j2317j1333r759p979o529
57914C61828n397m484l922l467k424n64J504L139M332N424O619P842Q760Q974
57900C88164Q582Q249Q329Q346P839P159O750O228M962L118J237p02k876m702
57886D50683n408n221m999m987m854m680m797m863m203l026k281k253k219j566
57872C95326m71O46J603K330K878L596M776O126P004P132O743O186N676N153M166
$$ plain form
57969 468691 472422 476502 479945 483738 489096 495755 502733 509661 516615 523594 530720 538048 544811 549750
57955 549750 552511 553669 553246 550483 545481 539739 534545 530024 526251 524029 523879 525407 528267 532633 538104
57940 538104 543338 547535 551232 554878 557653 558496 557389 554789 550684 544983 538032 529934 520138 508453
57926 508453 495678 482471 468432 453172 437573 422985 409745 397428 386095 376336 368357 361828
57914 361828 356431 351947 348025 344558 342134 341570 343074 346213 350545 355969 362588 370430 379190 388164
57900 388164 396746 404995 413324 421670 429509 436668 443418 449646 454608 457726 458963 458261 455385 450683
57886 450683 445275 440054 435055 430068 425214 420534 415737 410874 406671 403645 401364 399111 396892 395326
57872 395326 394855 395501 397104 399434 402312 405908 410684 416810 423814 430946 437689 443875 449551 454704 458870
57857D58870K385M00o92q61j406l099n014n953o069o128o084n522m821m567m335
57842D07104l296j651l01N93J598K812L720M054L890L199K072J026K49q87k757
57827D21425m560n524o268p742r480j0307j0282j0401j0791j0752j0331j0279
57815C14708j0442r837q391p163o633o113n176m290l725k993j821o59J53Q82J831
57800B50331L095M889P209R067R199P701O020N179M976N039N523O440P376Q292
57786C40336R633J1223J1978J1266R770Q348O796M311P88k937n926p909r309j0655
57772C77713j1851j2217j1349r700p980o441n105m174l583k687j215k9o1r32j580
57757B98809j822k137k276j467O3J110J161R87J402K479M078O094P909Q596P982
$$ plain form
57857 458870 461255 461655 460963 460102 458696 455597 450583 444630 438561 432433 426349 420827 416006 411439 407104
57842 407104 403808 402157 401856 402449 404047 406859 410579 414633 418523 421722 423794 424820 425069 424182 421425
57827 421425 416865 411341 405073 397331 387851 377544 367262 356861 346070 335318 324987 314708
57815 314708 304266 294429 286038 278875 272242 266129 260953 256663 252938 249945 248124 247465 247618 248500 250331
57800 250331 253426 258315 265524 274591 283790 291491 297511 302690 307666 312705 318228 324668 332044 340336
57786 340336 349969 361192 373170 384436 394206 402554 409350 413661 414449 411512 405586 397677 388368 377713
57772 377713 365862 353645 342296 332596 324616 318175 313070 308896 305313 302626 301411 301382 301321 300389 298809
57757 298809 296987 294850 292574 291107 291170 292280 293441 294428 295830 298309 302387 308481 316390 324986 332968
57742C32968O771N473M003K386J063K73j54k76n0J64q1n66p04n27m90m48K36J583
57724C51624K938M010M967N647N690N442N620O039N780M705L664L134K772K427
57710D14459K416K666K713K834L965O203Q509J0194J1518J2644J3211J3420J4218
57697E18970J5941J7750J9018K0147K1674K3615K6106K9553L3600L7203M0263
57686H03840M4110M9677N6335O3261P0844P9996R1029J04071J19552J37420J56652
57675A776787J76498J97439K20051K43501K65883K85405L00432L08874L07827
57666D082697K92960K58070J97336J10603P016r7508j87176k52099k89981l04474
57656C817444l01941k88299k67755k43505k18422j94469j72285j51995j33912
$$ plain form
57742 332968 339739 345212 349215 351601 352664 352937 352783 352507 352457 352621 352540 351974 351270 350743 350253 349805 350041 351624
57724 351624 354562 358572 363539 369186 374876 380318 385938 391977 397757 402462 406126 409260 412032 414459
57710 414459 416875 419541 422254 425088 429053 435256 443765 453959 465477 478121 491332 504752 518970
57697 518970 534911 552661 571679 591826 613500 637115 663221 692774 726374 763577 803840
57686 803840 847950 897627 953962 1017223 1088067 1168063 1259092 1363163 1482715 1620135 1776787
57675 1776787 1953285 2150724 2370775 2614276 2880159 3165564 3465996 3774870 4082697
57666 4082697 4375657 4633727 4831063 4941666 4948682 4851174 4663998 4411899 4121918 3817444
57656 3817444 3515503 3227204 2959449 2715944 2497522 2303053 2130768 1978773 1844861
57647A844861j18071j03937r1187q0097p0576o1657n2739m4524l7788l1967k5922
57636A126396j9630j4044r608n850k220J523N603J0144J4786J9019K2883K6915
57624A175917L1549L6852M2711M9060N6183O4722P4900Q5738R5928J05540J15750
57613A934850J26516J35737J41410J43397J42098J36453J24613J05955Q1324N1919
57603C124272J9193j4577m6888p6157j01414j21394j35094j42993j46598j46768
57593B211582j43461j37047j28832j20132j11617j03578r6047q8623q0868p3023
57583A128354o5748n9318n3562m8505m4373m1005l7895l4790l1736k8708k5663
57572F57051k2864k0571j8622j6810j5317j4292j3321j2020j0755j0010r427q324
$$ plain form
57647 1844861 1726790 1622853 1531666 1451569 1380993 1319336 1266597 1222073 1184285 1152318 1126396
57636 1126396 1106766 1092722 1083114 1077264 1075044 1076567 1082170 1092314 1107100 1126119 1149002 1175917
57624 1175917 1207466 1244318 1287029 1336089 1392272 1456994 1531894 1617632 1713560 1819100 1934850
57613 1934850 2061366 2197103 2338513 2481910 2624008 2760461 2885074 2991029 3072353 3124272
57603 3124272 3143465 3128888 3082000 3005843 2904429 2783035 2647941 2504948 2358350 2211582
57593 2211582 2068121 1931074 1802242 1682110 1570493 1466915 1370868 1282245 1201377 1128354
57583 1128354 1062606 1003288 949726 901221 856848 815843 777948 743158 711422 682714 657051
57572 657051 634187 613616 594994 578184 562867 548575 535254 523234 512479 502469 493042 484718
57560D84718o826n539m357k770j131l85l94J63J869L666M502M858N850P545R108
57545E00877J0133J1019J2089J3155J4022J4873J5914J6908J7412J7424J7593
57534F61419J8625K0597K3048K5679K8658L2188L6127M0233M4488M9025N4019
57523A034106N9879O7151P5866Q5235R4284J02455J09381J14311J16208J14144
57513A973020J07426R5735P9499N9734L7252J2536j3241l7783n8953p6089q9442
57502B089694r8880j04053j05388j03946j00357r4820q8027q1121p4661o8355
57492A170086o2001n5920n0353m5080l9918l4997l0403k5993k1756j7893j4495
57481G71277j1538r142p307n421k717O57L712N980Q127J0938J4194J7218K0094
$$ plain form
57560 484718 477892 472353 467996 465226 464095 463710 463316 463479 465348 469014 473516 478374 484224 491769 500877
57545 500877 511010 522029 534118 547273 561295 576168 592082 608990 626402 643826 661419
57534 661419 680044 700641 723689 749368 778026 810214 846341 886574 931062 980087 1034106
57523 1034106 1093985 1161136 1237002 1322237 1416521 1518976 1628357 1742668 1858876 1973020
57513 1973020 2080446 2176181 2255680 2315414 2352666 2365202 2351961 2314178 2255225 2179136 2089694
57502 2089694 1990814 1886761 1781373 1677427 1577070 1482250 1394223 1313102 1238441 1170086
57492 1170086 1108085 1052165 1001812 956732 916814 881817 851414 825421 803665 785772 771277
57481 771277 759739 750597 743290 737869 735152 735809 739521 745501 753628 764566 778760 795978 816072
57468H16072K3785K8976L5246M1566M7513N3780O1296P0023P8924Q7144R4687
57457A439012J01616J07193J10379J10721J07985J01183Q8944P1002M8620K3444
57447B310099l403l0773n6813p9363r6901j08906j15701j18227j17627j14671
57437A467714j09628j02834r5153q7561q0426p3394o6080n8794n2428m7587m3951
57426F49878m0680l7382l4318l1620k8875k5775k2742k0460j8975j7709j6163
57415C55179j4183j1854r559p978p476p560p404o779o102n700n567n709o151o590
57401B46567o522n811m806l927l406l329l562l805l993m397m916m690l137j060
57387A89206P6m2l99k38P2j1l39o05r97j648k011j500m50K48L82O84J708L007
$$ plain form
57468 816072 839857 868833 904079 945645 993158 1046938 1108234 1178257 1257181 1344325 1439012
57457 1439012 1540628 1647821 1758200 1868921 1976906 2078089 2167033 2238035 2286655 2310099
57447 2310099 2306696 2275923 2219110 2139747 2042846 1933940 1818239 1700012 1582385 1467714
57437 1467714 1358086 1255252 1160099 1072538 992112 918718 852638 793844 741416 693829 649878
57426 649878 609198 571816 537498 505878 477003 451228 428486 408026 389051 371342 355179
57415 355179 340996 329142 319583 311605 304129 296569 289165 282386 276284 270584 265017 259308 253157 246567
57401 246567 240045 234234 229428 225501 222095 218766 215204 211399 207406 203009 198093 193403 190266 189206
57387 189206 189282 189240 188841 188603 188675 188664 188325 187720 186723 185075 183064 181564 181114 181362 181744 182428 184136 187143
57369A87143L633L252K408J742J338R77P49R84J609K039J940J669J710J961J925
57354B15079J410O70N8k18o6M40J064J643K121K319K002J297O62K53j77n55l22
57337B27680O91J775K287K435K610K598K191J900K198K592K457K239K741L568
57323B59962L629K985K809L447L886L480K959L138L665L775L473L384L898M959
57309C09449O236P142P215O794O795P488Q082P887P323P318Q128R227J0035J0410
57295D19529J0594J0924J1531J2186J2757J3631J5285J7420J9045J9619J9654
57284E82175K0070K1350K3358K5530K7114K7683K7486K7042K6447K5524K4330
57273H58109K2985K1120J8303J4806J1172P204K341k984p539j0951j3968j6833
$$ plain form
57369 187143 190776 194028 196436 198178 199516 200493 201242 202226 203835 205874 207814 209483 211193 213154 215079
57354 215079 216489 217159 217217 216999 216933 217373 218437 220080 222201 224520 226522 227819 228481 228734 228557 228002 227680
57337 227680 228371 230146 232433 234868 237478 240076 242267 244167 246365 248957 251414 253653 256394 259962
57323 259962 263591 266576 269385 272832 276718 280198 283157 286295 289960 293735 297208 300592 304490 309449
57309 309449 315685 322827 330042 336836 343631 351119 359201 367088 374411 381729 389857 399084 409119 419529
57295 419529 430123 441047 452578 464764 477521 491152 506437 523857 542902 562521 582175
57284 582175 602245 623595 646953 672483 699597 727280 754766 781808 808255 833779 858109
57273 858109 881094 902214 920517 935323 946495 953699 956040 953056 945517 934566 920598 903765
57261I03765j8633j8859j8355j7931j7061j4963j2176r964q648p519o036m284
57249G49336k465o96Q10J907K766L586M308M980N952P348Q654R299R307R025Q685
57234H22802Q574R075J0054J0750J0818J0936J1756J2827J3278J3084J2922J3157
57222I60033J3699J4532J5583J6338J6427J6361J6853J7609J7659J6835J6094
57211A138023J6245J7102J7984J8460J8464J8237J8249J8694J9125J8999J8550
57200A338132J8488J8939J9364J9529J9798K0366K0930K1378K2092K3214K4198
57189A566428K4565K4618K4987K5828K6849K7798K8471K8568K7984K7078K6280
57178A859454K5615K5008K4817K5478K6725K7649K7760K7502K7558K7917K8034
$$ plain form
57261 903765 885132 866273 847918 829987 812926 797963 785787 775823 767175 759656 753620 749336
57249 749336 746871 746175 746985 748892 751658 755244 759552 764532 770484 777832 786486 795785 805092 814117 822802
57234 822802 831376 840451 850505 861255 872073 883009 894765 907592 920870 933954 946876 960033
57222 960033 973732 988264 1003847 1020185 1036612 1052973 1069826 1087435 1105094 1121929 1138023
57211 1138023 1154268 1171370 1189354 1207814 1226278 1244515 1262764 1281458 1300583 1319582 1338132
57200 1338132 1356620 1375559 1394923 1414452 1434250 1454616 1475546 1496924 1519016 1542230 1566428
57189 1566428 1590993 1615611 1640598 1666426 1693275 1721073 1749544 1778112 1806096 1833174 1859454
57178 1859454 1885069 1910077 1934894 1960372 1987097 2014746 2042506 2070008 2097566 2125483 2153517
57167B153517K7706K7447K7912K9129L0427L1088L0952L0387K9791K9287K8977
57156B476620K9124K9789L0440L0445K9994L0098L1298L2791L3198L1955K9570
57145B815322K6741K3827K1109J8874J7077J5372J3644J2165J1151J0623J0834
57134B996739J2295J5144J8810K2422K5236K6667K6570K5592K4652K3801K2222
57123C240150J9473J6040J2412Q604N153L640N429J0440J7777K6818L6746M5752
57111C448434N1951N5078N6632N8544O2337O9276Q0457R6642J18285J45587J78539
57100D421762K17594K64665L22844L94964M82985N88383P11480Q49862R98461
57091I253000J150946J299256J432230J537669J605917J629055J600195J524291
$$ plain form
57167 2153517 2181223 2208670 2236582 2265711 2296138 2327226 2358178 2388565 2418356 2447643 2476620
57156 2476620 2505744 2535533 2565973 2596418 2626412 2656510 2687808 2720599 2753797 2785752 2815322
57145 2815322 2842063 2865890 2886999 2905873 2922950 2938322 2951966 2964131 2975282 2985905 2996739
57134 2996739 3009034 3024178 3042988 3065410 3090646 3117313 3143883 3169475 3194127 3217928 3240150
57123 3240150 3259623 3275663 3288075 3296679 3301832 3305472 3310901 3321341 3339118 3365936 3402682 3448434
57111 3448434 3500385 3555463 3612095 3670639 3732976 3802252 3882709 3979351 4097636 4243223 4421762
57100 4421762 4639356 4904021 5226865 5621829 6104814 6693197 7404677 8254539 9253000
57091 9253000 10403946 11703202 13135432 14673101 16279018 17908073 19508268 21032559
57083B1032559J432891J373539J366212J369332J302941J113668Q13423M55220
57075C0259785Q3121k87352o51645r96275j298800j538393j703039j791811j814023
57066B0261568j783957j714200j614213j493573j362696j229489j097856r70426
57058H995158q50749p42223o46742n65159m97582m42760l98463l62735l33814
57049D154931l09262k86807k65949k47214k30032k13023j96161j80738j67061
57040B058684j53927j40641j27878j16256j05553r5638q6767p8627p0462o2303
57030A020632n4895m8395m2401l7202l3463l0609k7134k2774j8903j6433j4665
57019F73758j2541r685o006j524L224P908J3533K1429L1253M1663N3082O7757
$$ plain form
57083 21032559 22465450 23838989 25205201 26574533 27877474 28991142 29804565 30259785
57075 30259785 30342906 30055554 29403909 28407634 27108834 25570441 23867402 22075591 20261568
57066 20261568 18477611 16763411 15149198 13655625 12292929 11063440 9965584 8995158
57058 8995158 8144409 7402186 6755444 6190285 5692703 5249943 4851480 4488745 4154931
57049 4154931 3845669 3558862 3292913 3045699 2815667 2602644 2406483 2225745 2058684
57040 2058684 1904757 1764116 1636238 1519982 1414429 1318791 1232024 1153397 1082935 1020632
57030 1020632 965737 917342 874941 837739 804276 773667 746533 723759 704856 688423 673758
57019 673758 661217 651532 645526 644002 647226 655134 668667 690096 721349 763012 816094 883851
57007H83851Q6650J07894J28238J43280J45579J26153Q1603J9833m3082r2314
56997A587685j21224j31514j29117j19920j07617r4072q0659o8433n7424m7009
56987F30696l7402k9627k3853j8943j4190j0426q831r715j2907j8153k4367k9564
56975C92718l2379l3002l2134k9974k6791k3359k0038j6286j1744o961k442K039
56963A59647O527J0353J3281J6239J9991K3906K6837K8404K8498K6376K1234J3394
56951C94687M236m592j1546j5624j7068j7044j6179j4175j1142q182n974l886
56939B73511j187J847M828Q149J2142J6272K0112K4165K8695L2564L4005L1842
56927D86945K5326J4209J89j2906k1962k6973k9590l0385k8997k6022k2846j9932
$$ plain form
57007 883851 970501 1078395 1206633 1349913 1495492 1621645 1703248 1723081 1679999 1587685
56997 1587685 1466461 1334947 1205830 1085910 978293 884221 803562 735129 677705 630696
56987 630696 593294 563667 539814 520871 506681 496255 487424 477709 464802 446649 422282 392718
56975 392718 360339 327337 295203 265229 238438 215079 195041 178755 167011 160050 157608 159647
56963 159647 166174 176527 189808 206047 226038 249944 276781 305185 333683 360059 381293 394687
56951 394687 398923 394331 382785 367161 350093 333049 316870 302695 291553 283371 277397 273511
56939 273511 272324 274171 278999 287148 299290 315562 335674 359839 388534 421098 455103 486945
56927 486945 512271 526480 526669 513763 491801 464828 435238 404853 375856 349834 326988 307056
56915C07056j6868j3788j1377r638q045o662n892n382m476l513l328l627l151
56902B11309j474N08J913K555K464J779J171J292J875K329K961M509O754Q846
56888B48791J0954J4135J8417K2230K3947K2892J8809J1752K960n257j1223j4738
56876C63669j6222j5927j4265j1880q937n184r38K929O284J0119J5162K1045K7201
56863C73056L3721M0714M7649N3881N9046O2121O0743N2454L6759J5885o191k5265
56851H04573l8405m4921m6073m3649l8904l2686k5868j9061j2130m404M527J4393
56839E17392K4518L4616M5168N6813O9245Q1181R1390R8725J00332R1198O7657
56828A278235L2007p552m2111o6869q1463q7512q6961q1700p3364o3203n2308
$$ plain form
56915 307056 290188 276400 265023 255385 247340 240678 234786 229404 224928 221415 218087 214460 211309
56902 211309 209835 210343 212256 214811 217275 219054 220225 221517 223392 225721 228682 233191 239945 248791
56888 248791 259745 273880 292297 314527 338474 361366 380175 391927 394887 389630 378407 363669
56876 363669 347447 331520 317255 305375 296438 291254 290316 293245 299529 309648 324810 345855 373056
56863 373056 406777 447491 495140 549021 608067 670188 730931 783385 820144 836029 829838 804573
56851 804573 766168 721247 675174 631525 592621 559935 534067 515006 502876 498472 502999 517392
56839 517392 541910 576526 621694 678507 747752 828933 920323 1019048 1119380 1210578 1278235
56828 1278235 1310242 1302690 1260579 1193710 1112247 1024735 937774 856074 782710 719507 667199
56817F67199m1497l0865k0076r351N45R626J9064K9662M0716N1110O0579O8641
56805H45353P2670O8448N3280K8408j326k9691n1544o4643o9956p0021o6750o0807
56793F53421n2747m3865l5549k8232k1407j4496p446n82N812J1755J7591K3686
56781E07941K9893L5187L7788L5841K8259J5447n24j6579k9935l9143m4120m5485
56769E14570m4098m1008l7210l3162k8785k4239k0273j7445j5398j3471j1727
56758B27754j0606r728q023n334l007k311k876l244k537j118J08N43K36k20l05
56743A79332j92m45j001j048k52O36Q00M47K26J79r8o31j183j782k441k702k222
56726A67623j544j441j717j480m95N33J044J203J326J373J157O02k16r31r49j67
$$ plain form
56817 667199 625702 594837 574761 565410 565955 575581 594645 624307 665023 716133 776712 845353
56805 845353 918023 986471 1039751 1068159 1066833 1037142 985598 920955 850999 780978 714228 653421
56793 653421 600674 556809 521260 493028 471621 457125 449679 449097 454909 466664 484255 507941
56781 507941 537834 573021 610809 646650 674909 690356 689832 673253 643318 604175 560055 514570
56769 514570 470472 429464 392254 359092 330307 306068 285795 268350 252952 239481 227754
56758 227754 217148 207420 199397 194063 191056 188745 185869 182625 180088 178970 179078 179621 179857 179637 179332
56743 179332 179140 178695 177694 176646 176394 177030 177830 178277 178503 178682 178584 177953 176770 174988 172547 169845 167623
56726 167623 166079 164638 162921 161441 160946 161479 162523 163726 165052 166425 167582 168184 167968 167037 166088 165921
56710A65921O59P93M88M06L65l35j487j932j128M3L66m46j757k725k821k145j417
56693A52848j195j125m90N89J186Q32N4m83o93p27n88l13o4J70N64J007J172J069
56675A53813J043J149J095Q61Q12J020J144J091J218J645J935J736J278R26O35
56660A71401R5q56k096l240l776l509k815k165j498n19O06J370J601J492J081
56645A57172L73j61M3Q20J440J563J415J097N05j82o85j205k061k886l062k810
56629A51376k808k926k491j786j815k408k084l88J185J391J039J550K707L215
56615A45757K752K247K399K972L426L439K927K141J632J703K081K401K613K621
56601A81111K100J121L90L38M61J26m10m15K54J050J424J093L3j317k152k089
$$ plain form
56710 165921 166580 167373 167861 168267 168632 168297 166810 164878 163750 163793 164159 163713 161956 159231 156410 154265 152848
56693 152848 151653 150528 150038 150627 151813 152645 152699 152216 151523 150796 150208 149895 149831 150001 150565 151572 152744 153813
56675 153813 154856 156005 157100 157961 158773 159793 160937 162028 163246 164891 166826 168562 169840 170766 171401
56660 171401 171496 170640 168544 165304 161528 158019 155204 153039 151541 151022 151628 152998 154599 156091 157172
56645 157172 157545 157384 157427 158247 159687 161250 162665 163762 164267 164085 163400 162195 160134 157248 154186 151376
56629 151376 148568 145642 143151 141365 139550 137142 135058 134670 135855 137246 138285 139835 142542 145757
56615 145757 148509 150756 153155 156127 159553 162992 165919 168060 169692 171395 173476 175877 178490 181111
56601 181111 183211 184332 184722 185060 185521 185647 185237 184822 185076 186126 187550 188643 188676 187359 185207 183118
56585A83118j590j252j092q67o47n20k05M39Q97O47N9K6P68J533J486N63n08q34
56567A82021r7J130J954K065J849J692J686K030K989M264N123N425N773O340O357
56552B30601N327L969L243L079K804K272J730J043q7j310j927j857j690j834k166
56537B43197k461k695k917l275l925m617m678l769k483j726j712j969k053j835
56523B03082j292n50q7l81j379k514l223l322l000k620k429k350k178j947j777
56508A74033j511q95j83O7k24n97q10r95j019m66N14J151J077O77K55l69j116
56491A69589j447j278j187j332j075j88N85P93J077J996L003L411L388L158K211
56476A82704L96j056q72N44J801K380K659K681K229J736J910K586L021L061L061
$$ plain form
56585 183118 181528 180276 179184 178317 177670 177150 176945 177384 178281 178928 178987 179013 179781 181314 182800 183363 182855 182021
56567 182021 181924 183054 185008 187073 188922 190614 192300 194330 197319 201583 206706 212131 217904 224244 230601
56552 230601 235928 239897 243140 246219 249023 251295 253025 254068 253981 252671 250744 248887 247197 245363 243197
56537 243197 240736 238041 235124 231849 227924 223307 218629 214860 212377 210651 208939 206970 204917 203082
56523 203082 201790 201240 201153 200772 199393 196879 193656 190334 187334 184714 182285 179935 177757 175810 174033
56508 174033 172522 171627 171444 171511 171287 170690 169880 168885 167866 167400 167914 169065 170142 170819 171074 170705 169589
56491 169589 168142 166864 165677 164345 163270 163082 163667 164460 165537 167533 170536 173947 177335 180493 182704
56476 182704 183100 182044 181172 181716 183517 185897 188556 191237 193466 195202 197112 199698 202719 205780 208841
56461B08841K962K495K044K162K566K535K137J905J648P78l21n83k5P5r50k245
56445B26024k774k596k384k400k466k396k078j535j070r83j101r91o48m51n56
56430B01595p83j047j370j564j394j024p79o28l32J2J43J62L14L97jp51j227j083
56412A90640o18l86p15j457j914j405j73O84N78Q7j07k55p91j325j250q40p84
56395A79969j039j055q21p82r94j169j235j180o71L71J335J801K309L390M406
56380A84635M378L449K438J539O03K09R42K035K130J242O02O95Q07M94J10q3q9
56363B06136N04K098M006N081N364N760O166N571M149L440L989M402L542K169
56349B62377J532J514J250O38K16J23J51L69R97J832K323K142J454P86O18Q95
$$ plain form
56461 208841 211803 214298 216342 218504 221070 223605 225742 227647 229295 230073 229752 229169 229144 229219 228269 226024
56445 226024 223250 220654 218270 215870 213404 211008 208930 207395 206325 205342 204241 203250 202602 202151 201595
56430 201595 200812 199765 198395 196831 195437 194413 193634 193006 192674 192686 192829 192991 193305 193702 193701 192950 191723 190640
56412 190640 190022 189636 188921 187464 185550 184145 183972 184656 185234 185321 185214 184959 184168 182843 181593 180753 179969
56395 179969 178930 177875 177054 176272 175278 174109 172874 171694 171023 171394 172729 174530 176839 180229 184635
56380 184635 189013 192462 194900 196439 197042 197251 198193 200228 202358 203600 204202 204897 205704 206198 206308 206225 206136
56363 206136 206640 208738 212744 217825 223189 228949 235115 240686 244835 248275 252264 256666 260208 262377
56349 262377 263909 265423 266673 267311 267527 267650 267801 268170 269167 270999 273322 275464 276918 277704 278322 279217
56333B79217J056R10J070J941K782K622J783J476K048K674K756K610K633K736
56319C08314K752K705K620K682L304M405M999M399L370L063L343L337L097L298
56305C55688L729L595L146L328L962L878K937K236K202K084J540J176J224J198
56291C91923J101J482K069J870R23M42R85J950L017M429N723O004N751O500Q302
56276D42471R511R540R776J1124J2712J3902J5495J7896K0024K1329K3033K6094
56264F32907K9663L2867L6469M1299M6619N1493N6374O1818O7105P1645P6513
56253A204772Q2762Q9365R4350R7089R8029R7152R4213Q9619Q3632P5541O4986
56242B171510N3165M1358K9217J6147L481o480j3260j8472k3545k8510l2779l5943
$$ plain form
56333 279217 280273 281183 282253 284194 286976 289598 291381 292857 294905 297579 300335 302945 305578 308314
56319 308314 311066 313771 316391 319073 322377 326782 331781 336180 339550 342613 345956 349293 352390 355688
56305 355688 359417 363012 366158 369486 373448 377326 380263 382499 384701 386785 388325 389501 390725 391923
56291 391923 393024 394506 396575 398445 399368 399810 400795 402745 405762 410191 415914 421918 427669 434169 442471
56276 442471 451982 461522 471298 482422 495134 509036 524531 542427 562451 583780 606813 632907
56264 632907 662570 695437 731906 773205 819824 871317 927691 989509 1056614 1128259 1204772
56253 1204772 1287534 1376899 1471249 1568338 1666367 1763519 1857732 1947351 2030983 2106524 2171510
56242 2171510 2224675 2266033 2295250 2311397 2314878 2308398 2295138 2276666 2253121 2224611 2191832 2155889
56230B155889l7891l8990l9954m1055m2066m3376m6135n0456n4626n7156n8598
56219A645586o0279o2160o3259o3378o3001o2114o0377n8016n5446n2458m8776
56208I96322m4858m1254l7764l4114l0761k8111k5676k2888k0110j7890j6014
56197F76882j4141j2618j1743j1004r922q849q086p139n745m626m297m067l240
56184E71405k262j762j477j124j148j554j235L23J857K151J899K361L386M209
56170E77029N042O295P275P320P303Q360R990J1043J1678J2697J3783J4197J4446
56157G06458J5475J6789J7185J6929J7400J8928K0551K1720K2874K4676K7787
56146I26772L2976M0334M8893N8179O9311Q3519J00330J18474J37501J57006J75099
$$ plain form
56230 2155889 2117998 2079008 2039054 1997999 1955933 1912557 1866422 1815966 1761340 1704184 1645586
56219 1645586 1585307 1523147 1459888 1396510 1333509 1271395 1211018 1153002 1097556 1045098 996322
56208 996322 951464 910210 872446 838332 807571 779460 753784 730896 710786 692896 676882
56197 676882 662741 650123 638380 627376 617454 608605 600519 593380 587635 583009 578712 574645 571405
56184 571405 569143 567381 565904 564780 563632 562078 560843 561166 563023 565174 567073 569434 572820 577029
56170 577029 582071 588366 595641 602961 610264 618624 628614 639657 651335 664032 677815 692012 706458
56157 706458 721933 738722 755907 772836 790236 809164 829715 851435 874309 898985 926772
56146 926772 959748 1000082 1048975 1107154 1176465 1259984 1360314 1478788 1616289 1773295 1948394
56135A948394J89109J97050J97294J88148J69768J45844J21740J01295Q6255P7108
56125C422005P2330O7689N8624M3525K3942K694j6959l1911m1293m7614n4591
56114C498441o4655p9412j00250j26050j51656j71297j82844j87048j84140j73942
56104B077147j58298j40434j22112j03671q6265p1641n9898m9620m0028l1213
56094A213967k2982j5337r389n823l314m30J890J982N34m48q13j987m126o071
56080A147653p460q603q876p593n787m883m411l165j578o35M42K816N481O759
56066A110160P207Q356R800J0377J0921J2706J4445J4184J2953J3064J3933J3361
56054A251467J1917J2139J4011J5306J5789J7171J9258K0192K0195K1201K2993
$$ plain form
56135 1948394 2137503 2334553 2531847 2719995 2889763 3035607 3157347 3258642 3344897 3422005
56125 3422005 3494335 3562024 3620648 3664173 3688115 3690809 3673850 3641939 3600646 3553032 3498441
56114 3498441 3433786 3354374 3254124 3128074 2976418 2805121 2622277 2435229 2251089 2077147
56104 2077147 1918849 1778415 1656303 1552632 1466367 1394726 1334828 1285208 1245180 1213967
56094 1213967 1190985 1175648 1166259 1160436 1157122 1156692 1158582 1160564 1161098 1160650 1159837 1157850 1153724 1147653
56080 1147653 1140193 1131590 1122714 1115121 1109334 1104451 1100040 1096875 1095297 1094662 1095104 1097920 1103401 1110160
56066 1110160 1117367 1125723 1135523 1145900 1156821 1169527 1183972 1198156 1211109 1224173 1238106 1251467
56054 1251467 1263384 1275523 1289534 1304840 1320629 1337800 1357058 1377250 1397445 1418646 1441639
56043A441639K3600K3310K4303K6442K7425K7031K7300K8560K9174K9142L0043
56032A737969L1548L1967L1985L3811L6830L8332L8316L9295M1678M3717M5648
56021B151096M9234N3558N6129N7866O1920O7788P1842P3618P6119P9874Q2241
56010B881285Q2887Q4306Q6613Q7504Q7698R0552R5931J00368J03718J09409J17742
55999C928013J25277J31428J39059J48186J55868J62900J73352J86716J98002
55990E348801K06572K17182K31322K45464K59084K76108K97041L18097L39488
55981G739159L65893L97404M29237M61771N01000N47566N95823O45618P03978
55972A2387449P73084Q48317R30633J028453J144738J275388J423665J602456
$$ plain form
56043 1441639 1465239 1488549 1512852 1539294 1566719 1593750 1621050 1649610 1678784 1707926 1737969
56032 1737969 1769517 1801484 1833469 1867280 1904110 1942442 1980758 2020053 2061731 2105448 2151096
56021 2151096 2200330 2253888 2310017 2367883 2429803 2497591 2569433 2643051 2719170 2799044 2881285
56010 2881285 2964172 3048478 3135091 3222595 3310293 3400845 3496776 3597144 3700862 3810271 3928013
55999 3928013 4053290 4184718 4323777 4471963 4627831 4790731 4964083 5150799 5348801
55990 5348801 5555373 5772555 6003877 6249341 6508425 6784533 7081574 7399671 7739159
55981 7739159 8105052 8502456 8931693 9393464 9894464 10442030 11037853 11683471 12387449
55972 12387449 13160533 14008850 14939483 15967936 17112674 18388062 19811727 21414183
55964B1414183J819260K074198K376857K749543L210924L775473M475489N366375
55956D7262302O506479P952572R778172J2066669J4869046J8178974K1942701
55949A38556915K6061521L0377338L4646550L8406171M0673724L9797611L4009521
55942C82529351K2674815P271998q971489k2683403l1897013l6435996l7246397
55935B75241866l5559840l2454027k8739066k4942856k1351228j8105143j5275615
55928I8814091j2874035j0858522r174537p781962o640230n696930m907542m248456
55920C6631877l700173l235389k833028k487468k194217j940034j714579j518172
55912A7008817j350497j203553j072122r59376q65831p83588p07404o40946n86348
$$ plain form
55964 21414183 23233443 25307641 27684498 30434041 33644965 37420438 41895927 47262302
55956 47262302 53768781 61721353 71499525 83566194 98435240 116614214 138556915
55949 138556915 164618436 194995774 229642324 268048495 308722219 348519830 382529351
55942 382529351 405204166 412476164 403504675 380821272 348924259 312488263 275241866
55935 275241866 239682026 207227999 178488933 153546077 132194849 114089706 98814091
55928 98814091 85940056 75081534 65906997 58125035 51484805 45787875 40880333 36631877
55920 36631877 32931704 29696315 26863287 24375819 22181602 20241568 18526989 17008817
55912 17008817 15658320 14454767 13382645 12423269 11557438 10773850 10066446 9425500 8839152
55903H839152n37609m90071m47142m11832l80189l48732l20391k97736k77521
55894E327929k56914k38314k23438k09236j93894j80538j70904j61517j50059
55885C543115j39440j31802j24512j15810j08519j04290r9921r3202q6922q3163
55875B455534p9092p2360o5616o1465n7651n1418m4453l9507l5993l2606l0517
55864A884856l0396k9849k7153k4358k3826k5072k7654l3173m1351m7893m9546
55853A524585m8067m6274m3747l9508l5499l3789l3209l1923l0637l0321k9562
55842A122049k7162k4774k3939k3130k0559j7483j5825j4802j2821j0507r119
55831I21928p972o114m593m518m732l825k666k718l670m892p234j1151j4934j7049
$$ plain form
55903 8839152 8301543 7811472 7364330 6952498 6572309 6223577 5903186 5605450 5327929
55894 5327929 5071015 4832701 4609263 4400027 4206133 4025595 3854691 3693174 3543115
55885 3543115 3403675 3271873 3147361 3031551 2923032 2818742 2718821 2625619 2538697 2455534
55875 2455534 2376442 2304082 2238466 2177001 2119350 2067932 2023479 1983972 1947979 1915373 1884856
55864 1884856 1854460 1824611 1797458 1773100 1749274 1724202 1696548 1663375 1622024 1574131 1524585
55853 1524585 1476518 1430244 1386497 1346989 1311490 1277701 1244492 1212569 1181932 1151611 1122049
55842 1122049 1094887 1070113 1046174 1023044 1002485 985002 969177 954375 941554 931047 921928
55831 921928 913956 907842 903249 898731 893999 890174 887508 884790 881120 876228 868994 857843 842909 825860
55817H25860j8408k0198k1409k0762j9228j8353j7734j6311j4547j3225j1656
55806F34029r159o859n997n848n069l736k287j47K859N277N950N768N909N889
55792F26579M891L419K047K72j916l163l006l107m559n901n635m649m229l664
55778E97379k049p31j569m238p243j0212j3088j4647j4065j2680j2103j1784j0427
55765D82543q543p485p183o861o913q040r547j0371j0798j1331j1124r446p580
55752C67321p203p921q247q086q310q688q312p361o773o706o713o683o381n160
55738B64777l316k407k934l172j799k8N86O58J257J460J7j948k526k172k785m452
55722B41216n639n861n823n487m394l297l301l760l210j912j366j662j423j64
$$ plain form
55817 825860 807452 787254 765845 745083 725855 707502 689768 673457 658910 645685 634029
55806 634029 624870 618011 612014 606166 601097 597361 595074 594927 597786 603063 609013 614781 620690 626579
55792 626579 631470 634889 636936 637208 635292 632129 629123 626016 621457 615556 609921 605272 601043 597379
55778 597379 595330 594599 593030 588792 581549 571337 558249 543602 529537 516857 504754 492970 482543
55765 482543 474000 466515 459332 452471 445558 437518 427971 417600 406802 395471 384347 374901 367321
55752 367321 360118 352197 343950 335864 327554 318866 310554 303193 296420 289714 283001 276318 269937 264777
55738 264777 261461 259054 256120 252948 251149 251121 251707 252365 253622 255082 255099 253151 250625 248453 245668 241216
55722 241216 235577 229716 223893 218406 214012 210715 207414 203654 200444 198532 197166 195504 194081 193917
55708A93917J233K217K949L342L324L602M555M989L626J130r86k558m066m818
55694B12456m013k743k530k707j693j19J45n16J41K372L975M002M039N210O485
55679B24504O869O957P289P174O116M746L415J469j258l589m556m510m107l348
55665B47171k248j276n64L37J573K703L507M089M282L939L669M027M291L531K603
55650B81634L235N107N884M433K155N66n29j687k495k650k957m075n330n730n373
55635B72188m962m742m624m730n123n472n470n174m805m725n480p096q483q487
55621A92815p480o806o796o575n873n530n859n904m919l481k577k447k760l026
55607A22782k612j276K4o2j394k341j957j024n94o85r28j327j766j759j297j058
$$ plain form
55708 193917 195150 197367 200316 203658 206982 210584 215139 220128 223754 224884 223898 221340 217274 212456
55694 212456 208443 205700 203170 200463 198770 198651 198796 198280 198421 200793 204768 208770 212809 218019 224504
55679 224504 231373 238330 245619 252793 258909 263655 267070 268539 267281 263692 259136 254626 250519 247171
55665 247171 244923 243647 243083 243420 244993 247696 251203 255292 259574 263513 267182 271209 275500 279031 281634
55650 281634 284869 289976 295860 300293 302448 303014 302485 300798 298303 295653 292696 288621 283291 277561 272188
55635 272188 267226 262484 257860 253130 248007 242535 237065 231891 227086 222361 216881 209785 201302 192815
55621 192815 185335 178529 171733 165158 159285 153755 147896 141992 137073 133592 131015 128568 125808 122782
55607 122782 120170 118894 118918 118856 117462 115121 113164 112140 111546 110861 109933 108606 106840 105081 103784 102726
55591A02726j273j320r16p07j104j503j373j167j400j663j406r83j116j737k174
55576H2884k090j717j400j451j996k699k892k290j241j66P56J352J526J670K195
55561G2441K601J859J7j516j737j221r75r66m95N66J662K302K345J872J243R74
55545H0972J083Q87j66j635k437j964o41M87O80K44K32J183K303K426J630J232
55529H6516K157L924N467O293O638O984P596Q211Q127P010N570M837M836M644
55515A68810L791K891K637K891L022K623J626J84j213j946j823j275q99j001j573
55500A78745k441l457m680o167p480p934p615p481p923q029p031n675n055m828
55486I2949l982k888k862l818m049k723j093n95j052j423j419j516k012k710l157
$$ plain form
55591 102726 101453 100133 99217 98510 97406 95903 94530 93363 91963 90300 88894 87911 86795 85058 82884
55576 82884 80794 79077 77677 76226 74230 71531 68639 66349 65108 64942 65698 67050 68576 70246 72441
55561 72441 75042 76901 76918 75402 73665 72444 71469 70503 70008 70574 72236 74538 76883 78755 79998 80972
55545 80972 82055 82942 82776 81141 78704 76740 76099 76586 77266 77510 77742 78925 81228 83654 85284 86516
55529 86516 88673 92597 98064 104357 110995 117979 125575 133786 141913 148923 154493 159330 164166 168810
55515 168810 172601 175492 178129 181020 184042 186665 188291 188475 187262 185316 183493 182218 181319 180318 178745
55500 178745 176304 172847 168167 162000 154520 146586 138971 131490 123567 115538 108507 102832 97777 92949
55486 92949 88967 86079 83217 79399 75350 72627 71534 70939 69887 68464 67045 65529 63517 60807 57650
55471E7650k919j992j009n89n62m18k97p27j477j726j322r05p69o09m31o15j011
55454D0272r93n65l65m60k69K33M12K18K47M06j32j235j615q28j40n71j376j324
55436C1915m34N07J178J611J591J074N77M69L78l2l96k55K45P26J035R69L21m90
55418D0989o13N9P37R74J062J002L32o09o24M65J211O14m54q14p60j104j498j037
55400C9932J53J136J495J402R21J19n43p89j049j683k238k139j547r01k61K93
55384C4301L40r0k08L32P35L76j33p5J07k64p36m91K03M89L08J43q8p47j502j753
55364C1247j624j540j326p32l58q34j519j276j91O33Q16R34J174J025L79j57k54
55347B6397k32l48m46m26l85k74J3K71K29J02K66O61J022J366J705J673J066L98
$$ plain form
55471 57650 54731 52739 51730 51141 50579 50161 49864 49137 47660 45934 44612 43707 42938 42329 41898 41283 40272
55454 40272 39279 38714 38349 37889 37620 37853 38265 38483 38730 39136 39004 37769 36154 35326 35186 34615 33239 31915
55436 31915 31481 31988 33166 34777 36368 37442 38019 38488 38866 38834 38438 38183 38428 39154 40189 41158 41479 40989
55418 40989 40376 40435 41172 42146 43208 44210 44542 43933 43309 43774 44985 45599 45145 44331 43571 42467 40969 39932
55400 39932 40085 41221 42716 44118 45039 45158 44615 43826 42777 41094 38856 36717 35170 34269 34008 34301
55384 34301 34641 34551 34343 34675 35410 35786 35653 35578 35685 35421 34685 34194 34397 34886 35194 35337 35249 34502 33000 31247
55364 31247 29623 28083 26757 26025 25667 24833 23314 22038 21847 22480 23296 24230 25404 26429 26808 26651 26397
55347 26397 26165 25817 25371 24945 24560 24286 24299 24570 24799 24901 25167 25828 26850 28216 29921 31594 32660 33058
55329C3058K22K94R9l23p24j212j690j374M7J395J289J7j027j294j220q81J2R64
55311B7652J008K93m0L73O90M06M8O1J43Q2J60L64K04k99m33M7M18J67k40k28
55291C0876l2j83o58j042j087p98l40q8l03o94p33m33k35j12L63J011R92K9j072
55272B5461j526j476j350j028j96R03J658J740J266N89J95M55J183J716J631J136
55256C2357O30K33r4l21m93p67j124j244r27m05j24k24l56M2J134K255K415J439
55238C4426L08nL14L74j26o89r19q97p21l55l7j85p27r95m95N14J328J357M95
55219C2965p27j306o57O59J410J054K59N2O98J565J851J355N37j92r67j952k527
55202C4077j819k03O43k05j654k074j399p94q37j049r21m13L77J201J465R09J95
$$ plain form
55329 33058 33280 33574 33673 33350 32626 31414 29724 28350 28397 29792 31081 31098 30071 28777 27557 26676 26688 27652
55311 27652 28660 28953 28913 29286 29976 30382 30430 30491 30634 30716 30876 31240 31444 31145 30712 30759 31177 31344 31104 30876
55291 30876 30844 30661 30003 28961 27874 27076 26736 26648 26345 25651 24918 24485 24250 24138 24501 25512 26504 26533 25461
55272 25461 23935 22459 21109 20081 19885 20788 22446 24186 25452 26041 26236 26691 27874 29590 31221 32357
55256 32357 32987 33220 33126 32805 32312 31545 30421 29177 28250 27845 27721 27497 27141 27183 28317 30572 32987 34426
55238 34426 34734 34729 35043 35417 35291 34602 33683 32786 32065 31710 31673 31488 30761 29766 29271 29785 31113 32470 32965
55219 32965 32238 30932 30275 30934 32344 33398 33657 33709 34407 35972 37823 39178 39715 39523 38556 36604 34077
55202 34077 32258 32055 32698 32493 30839 28765 27366 26572 25735 24686 23765 23352 23729 24930 26395 27304 27499
55185B7499L1Q5k93p40m20L96N94pn20n88q23j356j366n35K53K34j79k76r1O0
55165B1958K59N63O03K44K6M20J065J311J016M52j18m42l42r5k64q50j119o20
55147B4067K06P23Q36P16L21l48r13r81n73K6N17O28L34Q2L05O93N82J53L34J346
55127B9054K216K115J426R44P75O72P37J146J603J710J565J399J025K71l79k19
55111D6060O17J182P99k18r98r98m17J41L18K51J91Q6j64l12o5L41L77n1n28p65
55091D5847q11o97l84q7j20l77m49j91K09O52J072J168Q13M80N97O98Q9q93j291
55072D6325r61n64k91K10O57L53l29j65Q67J276M34l09K68J442J842J398P88j3
55054E3228j276k394k473j645p53j87Q9q4o23p34J21J208J518J270J379J780J570
$$ plain form
55185 27499 27530 27615 27322 26582 26162 26558 27152 27145 26625 26037 25214 23858 22492 21957 22210 22444 22265 21989 21898 21958
55165 21958 22217 22780 23383 23627 23653 24073 25138 26449 27465 27917 27799 27357 27015 26920 26656 25806 24687 24067
55147 24067 24273 24996 25832 26548 26869 26521 25608 24627 24054 24080 24597 25225 25559 25641 25946 26639 27221 27374 27708 29054
55127 29054 31270 33385 34811 35755 36530 37202 37939 39085 40688 42398 43963 45362 46387 46658 46279 46060
55111 46060 46677 47859 48658 48440 47442 46444 46027 46168 46486 46737 46928 47014 46850 46538 46473 46814 47191 47140 46612 45847
55091 45847 45036 44339 43955 43868 43748 43371 42922 42731 42940 43592 44664 45832 46645 47125 47722 48420 48509 47616 46325
55072 46325 45364 44800 44509 44719 45376 45729 45400 45235 46102 47378 47812 47503 47771 49213 51055 52453 53241 53228
55054 53228 51952 49558 47085 45440 44687 44500 44589 44505 43882 43148 43269 44477 45995 47265 48644 50424 51994
55037E1994N81l02m65j39L17Q42J251J200P39L38K71M19O55Q65P35J02n97p80
55019E8026n26l11j87J77P09R54Q39P71R40J044Q25L66r7k94M9Q43J440J252N34
55000F7354J9RK39M84O06K34q78k130k485j759q82o52q28p70m11j53j44j54j1
54981E7688J86L61O40J124J586J615J099L96q3l08m26l62L0N16O59M67L76O09
54963F6173R10J063J107J063R31J061J809K806L251L127L261L897M236L872L716
54948A02283M645O096O965P294Q037R495J1038J2210J3226J4262J4983J4840J3468
54935B38842J0836P318L423p76n497j0286j3822j5255j5199j4860j4669j4334
54923A55721j3612j2343j0321p910o174n598n222m016k401j443j094n24K77O52
$$ plain form
55037 51994 52575 52273 51808 51669 51986 52828 54079 55279 56018 56356 56627 57046 57701 58566 59301 59403 58806 58026
55019 58026 57500 57189 57002 57179 57888 58842 59681 60452 61392 62436 63261 63627 63530 63236 63285 64128 65568 66820 67354
55000 67354 67373 67382 67621 68105 68711 68945 68067 65937 63452 61693 60811 60159 59331 58561 58150 57997 57853 57699 57688
54981 57688 57874 58235 58875 59999 61585 63200 64299 64695 64612 64304 63878 63516 63546 64062 64721 65188 65564 66173
54963 66173 67083 68146 69253 70316 71247 72308 74117 76923 80174 83301 86562 90459 94695 98567 102283
54948 102283 106928 113024 119989 127283 135320 144815 155853 168063 181289 195551 210534 225374 238842
54935 238842 249678 256996 260419 259643 254146 243860 230038 214783 199584 184724 170055 155721
54923 155721 142109 129766 119445 111535 105361 99763 94541 90525 88124 86681 85587 85063 85340 85992
54909H5992O95J151J985K528K977M277O286P596P631P608Q790J0991J3338J5433
54895A77278J6880J6814J4816J1684Q359M686Q4m977r180j1851j3498j4804j5683
54882A80608j5546j4172j2131j0296q966p632n861m130l289l382l633l616l590
54869H4364l544k782j090N01P82j20j042j342j385j544j479p62K15M96l08j499
54853F9461k045j683j037p30p54p57o14m53m22o06j049j586j913j953j904j803
54837E0152j425p96l30j29K46R18J218P25Q4P5L05j27j029j261l71Q41J485J409
54819E1990R17M14L67Q42J150P20J88O14J716K063J193K89L43Q34Q53N45N96R83
54801F6617J122Q38O08R92K236M057N604O136N924N983O756P724Q613J0027J2312
$$ plain form
54909 85992 86687 87838 89823 92351 95328 99605 105891 113487 121118 128726 137516 148507 161845 177278
54895 177278 194158 210972 225788 237472 245831 250517 250601 245624 236444 224593 211095 196291 180608
54882 180608 165062 150890 138759 128463 119497 111865 106004 101874 98585 95203 91570 87954 84364
54869 84364 80820 78038 76948 77449 78231 78111 77069 75727 74342 72798 71319 70557 70772 71268 70960 69461
54853 69461 67416 65733 64696 63966 63212 62455 61841 61388 60966 60360 59311 57725 55812 53859 51955 50152
54837 50152 48727 47931 47601 47472 47718 48636 49854 50579 50663 50738 51043 50916 49887 48626 48255 49096 50581 51990
54819 51990 52907 53321 53688 54530 55680 56400 56588 57202 58918 60981 62174 62463 62806 63640 64493 65038 65634 66617
54801 66617 67739 68577 69185 70177 72413 76470 82074 88210 94134 100117 106873 114597 123210 133237 145549
54786A45549J4628J5933J6341J6599J6646J5504J2560Q238L447j090m989q178
54774B51188j0734j2561j3273j2649j1101r447q260p565o939n900m414l097k577
54761A42671k642k434j549m29M93J336K219K848L129L623M810O333P600Q767J0378
54746A87153J2330J3848J4510J4641J4650J4474J3740J2161R627O191K099k329
54734C13095o809j1005j4424j6686j7792j7990j7410j6091j4383j2922j2058j1432
54722A44093j0382q807p330o461n778m499k746j634j810k510k584j987j524j537
54708H4504j628j524j375j170p17k97n06j257j644j101r5N64N64J10l78l95J72
54691G3827O54K86n69p02K70J346J510Q07k41j371k192k030q98J64M30M94J187
$$ plain form
54786 145549 160177 176110 192451 209050 225696 241200 253760 261998 265445 264355 259366 251188
54774 251188 240454 227893 214620 201971 190870 181423 173163 165598 158659 152759 148345 145248 142671
54761 142671 140029 137595 136046 135617 136110 137446 139665 142513 145642 149265 154075 160408 168008 176775 187153
54746 187153 199483 213331 227841 242482 257132 271606 285346 297507 307134 313325 315424 313095
54734 313095 306286 295281 280857 264171 246379 228389 210979 194888 180505 167583 155525 144093
54722 144093 133711 124904 117574 111113 105335 100836 98090 96456 94646 92136 89552 87565 86041 84504
54708 84504 82876 81352 79977 78807 78090 77793 77287 76030 74386 73285 73190 73754 74318 74428 74050 73655 73827
54691 73827 74481 74767 74198 73496 73766 75112 76622 77429 77188 75817 73625 71595 70697 70861 71291 71785 72972
54674G2972K206K686K589K547K666K490J926J367J008P23M74K70q5n80o40J24
54658I2743J086J301Q72P78J437K245K626K741K933L193L443L826M371M781M895
54643A33271N069N815P156Q549R426R739R923J0283J0449R697P808N384L107J015
54629B36691j284l988o789r104j0418j0709j0524j0363j0003q931p405o340o005
54616A34828n667m875m164l961l668k727j749j548j713j269m35m03j493k685l038
54601I5433k567j632m93K67r5j421k530k644k332k477k970k971k201j276q28p75
54585F8488n88m8M39L00m64j187j242o45J54P68R85O59r3p55q80n39j18J61K45
54566F5640K9m61r11j086j107j076p88j92L00N05R02J716K078J094n83j326o31
$$ plain form
54674 72972 75178 77864 80453 83000 85666 88156 90082 91449 92457 93180 93654 93924 93839 93259 92619 92743
54658 92743 93829 95130 96002 96780 98217 100462 103088 105829 108762 111955 115398 119224 123595 128376 133271
54643 133271 138340 144155 151311 159860 169286 179025 188948 199231 209680 219377 227185 232569 235676 236691
54629 236691 235407 231419 224630 215526 205108 194399 183875 173512 163509 154578 147173 140833 134828
54616 134828 129161 124286 120122 116161 112493 109766 108017 106469 104756 103487 103052 102649 101156 98471 95433
54601 95433 92866 91234 90741 91008 90913 89492 86962 84318 81986 79509 76539 73568 71367 70091 69263 68488
54585 68488 67900 67852 68291 68591 68127 66940 65698 65053 65207 65975 66960 67619 67526 66771 65891 65352 65234 65395 65640
54566 65640 65669 65208 64297 63211 62104 61028 60240 60048 60348 60853 61755 63471 65549 66643 66060 64734 64103
54549F4103L85P06N85P19J138J434J369R57L94J82P48J745K357K488K866L775
54533H5951M500M489M233M333M433L963L339L401L901L656K283Q09J71r8j102
54518A28262k837m082l995l190k889l399l986m063l844l658l273k398j426j026
54504H4196j239j498j490j370j230r28n82o23j163j732j816j384p30j54J39J28
54488F8524Q9K43L40m2p64j159q60j55N83J220J546J240N00J02M36R06P54J15
54470G3618k62j16O4j89p20j005p04J10J086J832K075J731J021M85O05J155J241
54453H2027L70q23j363j240j211j489j462q71l33l83p19q04o17k88L06J017J149
54436G3266M05l84k73M08N38j91j044j440j490j291o27L10P53L93lL73J111J100
$$ plain form
54549 64103 64488 65194 65779 66498 67636 69070 70439 71396 71790 71972 72720 74465 76822 79310 82176 85951
54533 85951 90451 94940 99173 103506 107939 111902 115241 118642 122543 126199 128482 129291 129462 129364 128262
54518 128262 125425 121343 117348 114158 111269 107870 103884 99821 95977 92319 89046 86648 85222 84196
54504 84196 82957 81459 79969 78599 77369 76441 75859 75236 74073 72341 70525 69141 68411 68257 68396 68524
54488 68524 68613 68856 69196 69154 68390 67231 66371 66216 66799 68019 69565 70805 71305 71407 71843 72749 73503 73618
54470 73618 73356 73240 73304 73115 72395 71390 70686 70796 71882 73714 75789 77520 78541 79026 79631 80786 82027
54453 82027 82397 81574 80211 78971 77760 76271 74809 73938 73605 73222 72503 71699 71082 70794 71100 72117 73266
54436 73266 73671 73287 73014 73422 73960 73769 72725 71285 69795 68504 67877 68187 68940 69333 69330 69703 70814 71914
54418G1914J79m15M59K253L144K046j36j515j225p6P81J125J345J470J214Q02
54402H3365R00J605K167K021J581J618K178K677K732K429J799O87p48j758j672
54387A01581o29N12R84O82J6o00j014j251j312j190j014j036j305j561j540j341
54371H9982j243j250j116q01n24l52j04J11j29q30j242p94Q5O65R94J510J912
54354H6874J478M24j41J20K98j51m42J68R61Q35O5j17O53J577K048K203K102J472
54336A00427M02n02r56j226j269n83O97J363N06j142k058j833j530k072k952k897
54320H4375j556q1J48r89k351k992k991k824k409j405p1Q02P87J75m75p25l57
54303F7061L59O40p0j289j996j827j226n14L70J169J208L74m91o07j55K15K55
$$ plain form
54418 71914 72093 71678 72137 74390 77534 79580 79444 77929 76704 76628 77409 78534 79879 81349 82563 83365
54402 83365 84265 85870 88037 90058 91639 93257 95435 98112 100844 103273 105072 105759 105011 103253 101581
54387 101581 100952 101464 102448 103130 103146 102546 101532 100281 98969 97779 96765 95729 94424 92863 91323 89982
54371 89982 88739 87489 86373 85572 85048 84696 84592 84703 84574 83744 82502 81708 81793 82458 83452 84962 86874
54354 86874 88352 88776 88635 88755 89053 88902 88460 88628 89589 90424 90489 90372 91025 92602 94650 96853 98955 100427
54336 100427 100829 100327 99371 98145 96876 96293 96990 98353 98859 97717 95659 93826 92296 90224 87272 84375
54320 84375 82819 82738 82886 81897 79546 76554 73563 70739 68330 66925 66854 67656 68443 68618 68143 67418 67061
54303 67061 67420 68060 67990 66701 64705 62878 61652 61138 61508 62677 63885 64259 63768 63161 63006 63221 63476
54286F3476J3n50j369j894j545m17P48J217P31m01j450j726j168l37K70O63J029
54269E7290J338J457J337R09J12p88j297j284j173j228j081l24P77J522J542R61
54253F0070J46m12k07P56J640J495L44p38q12q2M40J86l24k37M39Q51N58K05N13
54234F4831J148J272Q87O99Q01N54j34m56MN06L45q0r8R1j00n10n17j17R0r3k37
54213F8886m0L00N11N74N79O13P33P89M40l71j164j468j386j243j066q23q36j279
54195F3749j566r92J55Q34O00L9k20k14j78j06m8k60o59o37J23J026J262Q85O09
54176F4402O68N58M1k58K63J077J049Lr19p44R0M92K22r8j62k57l75%Q73J366
54156F8291Q45j50p37q95j169j595j685j273o98k29J25K14j96q39q86J54J710
$$ plain form
54286 63476 63489 62939 61570 59676 58131 57714 58462 59679 60410 60009 58559 56833 55665 55328 55598 56261 57290
54269 57290 58628 60085 61422 62331 62443 61655 60358 59074 57901 56673 55592 55268 56045 57567 59109 60070
54253 60070 60216 59804 59597 60353 61993 63488 63832 63094 62282 62200 62640 62826 62502 62265 62704 63555 64113 64318 64831
54234 64831 65979 67251 68138 68837 69638 70192 70058 69602 69606 70112 70457 70377 70279 70370 70270 69760 69243 69126 69216 69123 68886
54213 68886 68846 69146 69657 70231 70810 71423 72156 72945 73385 73014 71850 70382 68996 67753 66687 65864 65028 63749
54195 63749 62183 61191 61346 62180 62780 62819 62599 62385 62207 62101 62053 61793 61134 60497 60620 61646 62908 63793 64402
54176 64402 65070 65628 65669 65411 65674 66751 67800 67803 66884 66140 66230 66722 66944 66846 66684 66427 66052 66052 66925 68291
54156 68291 69136 68986 68249 67354 66185 64590 62905 61632 60934 60705 60830 61044 60848 60009 59123 59277 60987
54139F0987K570K047O05o79j221j343j462j333n47M83P70J12n99o84m76m25k12
54122E8593N52J330J276M62k84n18l97l7N36R39O88l4n42n68m46m04k96j11j05
54103F0634l45n60n62l95j02K18K48q5j56O24J691J679K11j400j636m20J040J709
54085F2393J542J101Q03N78J61l95o39k60M33Q03N63n5o37q07l54N03J132J107
54067F7972O75L73M11P96J596K538K780J799L21m36k72L2O3J95O68J185J567J992
54049H4255K380K348J959J744J842J853J763K085K812L178K905K760L310M066
54035A19260M470M891N793O694O952O960P483Q201Q068O965N912N592N623N425
54021B08289N034M684M316L829L357K967K473J756J026M74J6n09j126j854k779
$$ plain form
54139 60987 63557 65604 66209 65530 64309 62966 61504 60171 59624 60107 60877 60989 60390 59706 59230 58805 58593
54122 58593 59145 60475 61751 62213 61929 61411 61014 60977 61513 62452 63140 63106 62564 61996 61550 61146 60850 60739 60634
54103 60634 60289 59729 59167 58772 58670 58888 59136 59051 58895 59519 61210 62889 63100 61700 60064 59644 60684 62393
54085 62393 63935 65036 65839 66417 66578 66183 65544 65284 65717 66520 67083 67028 66391 65584 65230 65733 66865 67972
54067 67972 68647 69020 69431 70227 71823 74361 77141 78940 79261 78825 78553 78585 78648 78843 79511 80696 82263 84255
54049 84255 86635 88983 90942 92686 94528 96381 98144 100229 103041 106219 109124 111884 115194 119260
54035 119260 123730 128621 134414 141108 148060 155020 162503 170704 178772 185737 191649 197241 202864 208289
54021 208289 213323 218007 222323 226152 229509 232476 234949 236705 237731 238205 238221 237712 236586 234732 231953
54006B31953l760m397m541m609n074n762o068n794n354n045m595l731k879k754
53992A67590l337l828l700l260k916k470j615p27n29j181k183l014l350k892j686
53977A30902n29k73p08q26l20K1l98j082j281r81n72j55K00J11n31j040p68j12
53959A21658N2l12m35l0L39K54J34N78J513K357K742K742K627K659L019L694M436
53942A48027N007N445O047P024Q193R045R180Q679Q007P552P289O789N534L342
53928B45160P35j295k105j989j675j424r73k05O86J711L114M667N546N356M763
53913B62072M726N421O399P392Q383R132R228Q705Q049P554O953N846M195K337
53899C56392O44p36j863k733l149k998k593k506k978l799m774n960p320q509r210
$$ plain form
54006 231953 228193 223796 219255 214646 209572 203810 197742 191948 186594 181549 176954 173223 170344 167590
53992 167590 164253 160425 156725 153465 150549 148079 146464 145737 145208 144027 141844 138830 135480 132588 130902
53977 130902 130373 130100 129392 128566 128246 128267 127869 126787 125506 124525 123953 123798 123998 124109 123578 122538 121770 121658
53959 121658 121710 121398 120963 120933 121272 121526 121660 122238 123751 126108 128850 131592 134219 136878 139897 143591 148027
53942 148027 153034 158479 164526 171550 179743 188788 197968 206647 214654 222206 229495 236284 241818 245160
53928 245160 245895 244600 242495 240506 238831 237407 236434 236229 236915 238626 241740 246407 251953 257309 262072
53913 262072 266798 272219 278618 286010 294393 303525 312753 321458 329507 337061 344014 349860 354055 356392
53899 356392 357036 356300 354437 351704 348555 345557 342964 340458 337480 333681 328907 322947 315627 307118 297908
53884B97908r392r154q695q460q792r268q964p706o429n937n926n700n198m695
53870A93592m146l535l350l834m259l934l424l724m541m658l929l449l610l387
53856A39812k183j063j268k362k938k559j989j799j706j310p39m43o95j400k089
53841A15269k215j710j070p60o39l00K41N89N67L58J63J2p8n5M7K03N25J055J494
53822A13696J464J015N82M22M03M19O63J285J970K199J846J316J043J059J173
53807A30555J366J744K207K504K757L495M908O327O917O754O734P366Q237Q682
53793B00553Q517P829O591M930L461K807K918L176L110K603J723O98j9j38J3j85
53777B48587q55j622k324l269m557n637n868n299m606m387m716n215n371m946
$$ plain form
53884 297908 288516 279362 270667 262207 253415 244147 235183 227477 221048 215111 209185 203485 198287 193592
53870 193592 189446 185911 182561 178727 174468 170534 167110 163386 158845 154187 150258 146809 143199 139812
53856 139812 137629 136566 135298 132936 129998 127439 125450 123651 121945 120635 119896 119453 118758 117358 115269
53841 115269 113054 111344 110274 109514 108875 108575 108816 109405 109972 110330 110493 110505 110427 110372 110419 110622 111147 112202 113696
53822 113696 115160 116175 116757 117179 117582 118001 118664 119949 121919 124118 125964 127280 128323 129382 130555
53807 130555 131921 133665 135872 138376 141133 144628 149536 155863 162780 169534 176268 183634 191871 200553
53793 200553 209070 216899 223490 228420 231881 234688 237606 240782 243892 246495 248218 248916 248897 248759 248772 248587
53777 248587 247732 246110 243786 240517 235960 230323 224455 219156 214550 210163 205447 200232 194861 189915
53763A89915m245l899m218m880n315n205m514l383k265j848k349l032k871j759
53749A40132p04o72j483k052j517l0J421J878J244L64J76P40J246R73O3p74j083
53732A39922r80p79o24m58k67j93l79o86o99j20Q20J537J721J628J618J660J446
53715A45167R24M17K13K26K25K09M02Q24J110R29N40N71J178J780J896J856K242
53698A60709K943L350L393L592M047M161L719L379L638L952L545K622J991J862
53684B06903J769J573J664K223K926L376L322K547J177O9J48J249K232K329J779
53669B35286J037J78o56r63n06K69P99R74Q49L59k87m86m0K96k77j471k211j947
53651B31203j165o88q39j312j513j096l49R5K7j22RJ76Q1j5L16R16J208J015O89
$$ plain form
53763 189915 185670 181771 177553 172673 167358 162153 157639 154256 151991 150143 147794 144762 141891 140132
53749 140132 139428 138756 137273 135221 133704 133674 135095 136973 138217 138581 138757 139497 140743 141716 141779 141005 139922
53732 139922 138942 138163 137539 137081 136814 136621 136242 135556 134857 134737 135557 137094 138815 140443 142061 143721 145167
53715 145167 146091 146508 146721 146947 147172 147381 147783 148607 149717 150646 151186 151757 152935 154715 156611 158467 160709
53698 160709 163652 167002 170395 173987 178034 182195 185914 189293 192931 196883 200428 203050 205041 206903
53684 206903 208672 210245 211909 214132 217058 220434 223756 226303 227480 227549 227697 228946 231178 233507 235286
53669 235286 236323 236501 235845 234882 234376 234645 235444 236418 237267 237626 237339 236853 236813 237109 236832 235361 233150 231203
53651 231203 230038 229350 228511 227199 225686 224590 224241 224336 224363 224241 224250 224426 224507 224492 224808 225724 226932 227947 228636
53632B28636M86L41J75R8J98M81R89J693K267K343J972J680J902K582L268L543
53616B52654L348L016K879K879K779K754L335M575N721O046N664N198N028N230
53602C11106N779O258N886M536L381L591M678N140M649M402N045N544M884L831
53588C78710L932N196N980N175L492K279J873J695J511J741K484K892K073L49
53574D19382j002j248r36q97j090r83n92m44o14o20l20k65q68j807k541k890k814
53557C99451k071p28M37N81k37j218j791j997k027j885j594j261q66k89K98N00
53541C85303K74O8J60K46Q4J61J186K887M031L845L006K842L822N227O145O345
53525D25632O163O066O416P319Q374Q937Q819Q621R101J0320J1694J2732J3536
$$ plain form
53632 228636 229122 229463 229638 229736 229934 230415 231404 233097 235364 237707 239679 241359 243261 245843 249111 252654
53616 252654 256002 259018 261897 264776 267555 270309 273644 278219 283940 289986 295650 300848 305876 311106
53602 311106 316885 323143 329029 333565 336946 340537 345215 350355 355004 359406 364451 369995 374879 378710
53588 378710 382642 387838 393818 398993 402485 404764 406637 408332 409843 411584 414068 416960 419033 419382
53574 419382 418380 417132 416196 415299 414209 413226 412634 412190 411576 410956 410636 410371 409503 407696 405155 402265 399451
53557 399451 397380 396652 397089 397670 397433 396215 394424 392427 390400 388515 386921 385660 384794 384505 384803 385303
53541 385303 385577 385645 385805 386051 386135 386296 387482 390369 394400 398245 401251 404093 407915 413142 419287 425632
53525 425632 431795 437861 444277 451596 459970 468907 477726 486347 495448 505768 517462 530194 543730
53512E43730J4527J5897J7343J8235J8204J7675J7641J8715K0510K2179K3374
53501G48030K4370K5366K6146K6609K7148K8183K9457L0187K9913K9015K8232
53490A052656K7835K7545K7203K7152K7742K8744K9610L0193L0714L1068L0766
53479A371228K9797K8904K8613K8409K7433K5703K4028K2903K2119K1403K0786
53468A651326K0231J9477J8476J7519J6665J5570J4127J2819J1960J0954Q813
53457A817937N386J509k014n073p822j0066j1525j2457j3538j5127j6966j8730
53445A711514k0407k2044k3409k4350k5222k6495k7995k9012k9255k9196k9300
53434A424829k9371k8994k8188k7256k6240k4981k3548k2161k0770j9151j7350
$$ plain form
53512 543730 558257 574154 591497 609732 627936 645611 663252 681967 702477 724656 748030
53501 748030 772400 797766 823912 850521 877669 905852 935309 965496 995409 1024424 1052656
53490 1052656 1080491 1108036 1135239 1162391 1190133 1218877 1248487 1278680 1309394 1340462 1371228
53479 1371228 1401025 1429929 1458542 1486951 1514384 1540087 1564115 1587018 1609137 1630540 1651326
53468 1651326 1671557 1691034 1709510 1727029 1743694 1759264 1773391 1786210 1798170 1809124 1817937
53457 1817937 1823323 1824832 1822818 1817745 1809923 1799857 1788332 1775875 1762337 1747210 1730244 1711514
53445 1711514 1691107 1669063 1645654 1621304 1596082 1569587 1541592 1512580 1483325 1454129 1424829
53434 1424829 1395458 1366464 1338276 1311020 1284780 1259799 1236251 1214090 1193320 1174169 1156819
53423A156819j5688j4229j2654j0728q655o761n090l418j584L95K494M846P516
53410A093263J0263J2642J4450J5928J7330J8618J9802K1322K3513K5890K7605
53399A300626K8641K9828L1585L3481L5288L7583M0679M3763M5892M7324M9048
53388A723738N1506N4494N7901O1538O4512O5907O6160O6771O8499P0619P2058
53377B423703P2548P2282P1332O9712O7715O5693O3776O1837N9492N6221N1833
53366C136144M6863M2103L7906L4314L1451K9139K6387K2185J6711J1021N580
53355C439804Rn804j1493j7253k3908l1550l9163m6143n3052o0128o6083o9408
53343C015828p0194o9764o8954o7855o6753o6170o5990o5501o4462o3435o2876
$$ plain form
53423 1156819 1141131 1126902 1114248 1103520 1094865 1088104 1083014 1079596 1078012 1078407 1080901 1085747 1093263
53410 1093263 1103526 1116168 1130618 1146546 1163876 1182494 1202296 1223618 1247131 1273021 1300626
53399 1300626 1329267 1359095 1390680 1424161 1459449 1497032 1537711 1581474 1627366 1674690 1723738
53388 1723738 1775244 1829738 1887639 1949177 2013689 2079596 2145756 2212527 2281026 2351645 2423703
53377 2423703 2496251 2568533 2639865 2709577 2777292 2842985 2906761 2968598 3028090 3084311 3136144
53366 3136144 3183007 3225110 3263016 3297330 3328781 3357920 3384307 3406492 3423203 3434224 3439804
53355 3439804 3439813 3434009 3422516 3405263 3381355 3349805 3310642 3264499 3211447 3151319 3085236 3015828
53343 3015828 2945634 2875870 2806916 2739061 2672308 2606138 2540148 2474647 2410185 2346750 2283874
53332B283874o2586o2191o1693o1199o0457n9005n6757n4167n1785m9613m7066
53321A657355m3707l9893l6363l3330l0459k7709k5603k4405k3685k2940k2121
53310A327140k1209j9770j7467j4605j1778r334p476o398n832n009l590k213j453
53297A201006p73P34K877M570N395O151P765J0302J3198J5878J7979J9540K1081
53284A325703K3204K5920K8696L1060L2863L3956L4154L3609L2829L2180L1671
53273A665845L1215L0695K9807K8198K5968K3620K1465J9381J7255J5270J3575
53262A922294J2002J0347Q603O674M165P80l124o779r758j2330j5063j8283k1917
53249A877611k5637k8993l1600l3426l4917l6615l8511l9995m0542m0327l9845
$$ plain form
53332 2283874 2221288 2159097 2097404 2036205 1975748 1916743 1859986 1805819 1754034 1704421 1657355
53321 1657355 1613648 1573755 1537392 1504062 1473603 1445894 1420291 1395886 1372201 1349261 1327140
53310 1327140 1305931 1286161 1268694 1254089 1242311 1232977 1225501 1219103 1213271 1208262 1204672 1202459 1201006
53297 1201006 1200233 1200967 1203844 1208414 1213809 1219960 1227725 1238027 1251225 1267103 1285082 1304622 1325703
53284 1325703 1348907 1374827 1403523 1434583 1467446 1501402 1535556 1569165 1601994 1634174 1665845
53273 1665845 1697060 1727755 1757562 1785760 1811728 1835348 1856813 1876194 1893449 1908719 1922294
53262 1922294 1934296 1944643 1953246 1959920 1964085 1964865 1961741 1954962 1945204 1932874 1917811 1899528 1877611
53249 1877611 1851974 1822981 1791381 1757955 1723038 1686423 1647912 1607917 1567375 1527048 1487203
53238A487203l9197l8088l6454l4731l3422l2709l2503l2555l2424l1778l0854
53227A112488l0290l0404l0857l1180l1126l0434k8739k6092k3249k0998j9466
53216H09653j8227j6932j5520j4154j3165j2838j3017j3213j3266j3512j4087
53205F51722j4541j4546j4461j4635j4573j3521j1659j0089r584r960j0562j0945
53193E02646j0950j0640j0301j0172j0123r841r342r030r185r570r705r397q931
53180C75459q695q545p818o229m616m229n196o298o457n791m921m079l399l347
53166B95839m040m628m277l412l092l425l564l143k750k881l253l419l258k738
53152B47959j827r44p89j443k069j881j032l43m30j234k098k235j511o96o01r50
$$ plain form
53238 1487203 1448006 1409918 1373464 1338733 1305311 1272602 1240099 1207544 1175120 1143342 1112488
53227 1112488 1082198 1051794 1020937 989757 958631 928197 899458 873366 850117 829119 809653
53216 809653 791426 774494 758974 744820 731655 718817 705800 692587 679321 665809 651722
53205 651722 637181 622635 608174 593539 578966 565445 553786 543697 534113 524153 513591 502646
53193 502646 491696 481056 470755 460583 450460 440619 431277 422247 413062 403492 393787 384390 375459
53180 375459 366764 358219 350401 344172 339556 335327 330131 323833 317376 311585 306664 302585 299186 295839
53166 295839 291799 287171 282894 279482 276390 272965 269401 266258 263508 260627 257374 253955 250697 247959
53152 247959 246132 245188 244399 242956 240887 239006 237974 237631 237201 235967 233869 231634 230123 229427 228826 227876
53136B27876p73J00O51O0j174j923j769j177o22j81J52J45m29j392k161k208j622
53119B13553j044r88j344j710j943k092j996j435n81J53N93P93O19n3q55j190
53103B00480j047j020j432j964k283k453k554k436k057j669j364r27l26N7L5K4
53087A79064M63J109J320Q39M5m93m30J81Q95J124O11l38j194j680j871j963k047
53070A75635k004j678j160q71j105j629j930j861j731j794j918j839j529j271
53056A53315j398j902k227j747o49K5m37j446j873j444q26n29m80n50q04j110
53040A35918j152r67q78q14l98K09K95l63j064j151q26o42p49r81j265j537j631
53023A22004j586j622j627j159k80J88k73j084j359j084r31j138j254r16l68o4
$$ plain form
53136 227876 227103 227203 227854 227914 226740 224817 223048 221871 221249 221068 221220 221365 220936 219544 217383 215175 213553
53119 213553 212509 211521 210177 208467 206524 204432 202436 201001 200420 200573 201166 201959 202578 202525 201670 200480
53103 200480 199433 198413 196981 195017 192734 190281 187727 185291 183234 181565 180201 179274 178948 179005 179040 179064
53087 179064 179527 180636 181956 182795 182840 182347 181917 182098 182993 184117 184728 184390 183196 181516 179645 177682 175635
53070 175635 173631 171953 170793 169922 168817 167188 165258 163397 161666 159872 157954 156115 154586 153315
53056 153315 151917 150015 147788 146041 145392 145417 144980 143534 141661 140217 139391 138862 138382 137832 137028 135918
53040 135918 134766 133799 132921 132107 131709 131918 132213 131850 130786 129635 128809 128167 127418 126437 125172 123635 122004
53023 122004 120418 118796 117169 116010 115730 115918 115645 114561 113202 112118 111187 110049 108795 107879 107511 107447
53007A07447r2j13J96O75P50J02q23j241r53m11M5N36J134J517J436J075P08L57
52989A12345%k15k47k93m32m43j62L45J018J786K255J982J223P69Q32P73K72l1
52971A21777M56J297J726J710J626J395P67J20J24P34J170Q70j9r47j250m31J225
52954A32350K526K476J464P62R83J612J991K100K183K282K300K208K015J770J730
52939A60752K134K811L222K960K097J059L60L01P14J107J203J189J252J212Q82
52924A83255M76K93K56J41N4J77K73m0o29r42p32l00J3K06M14O18O26K54m12q46
52904A83155n65J65N25L56N68J731K854K453N70j155j439n50M86J007Q39P5p86
52887A90289j059n94K4K51K32L74P04Q94P25K64j38KQ30J700J638N79l86l46K42
$$ plain form
53007 107447 107355 107242 107438 108113 108863 108965 108142 106901 105948 105537 105582 106118 107252 108769 110205 111280 111988 112345
52989 112345 112345 112130 111883 111590 111158 110715 110553 110898 111916 113702 115957 117939 119162 119931 120763 121536 121808 121777
52971 121777 122233 123530 125256 126966 128592 129987 130754 130874 130998 131732 132902 133772 133753 132806 131556 131125 132350
52954 132350 134876 137352 138816 139578 140561 142173 144164 146264 148447 150729 153029 155237 157252 159022 160752
52939 160752 162886 165697 168919 171879 173976 175035 175395 175696 176410 177517 178720 179909 181161 182373 183255
52924 183255 183731 184024 184280 184421 184475 184652 184925 184885 184256 183314 182582 182282 182295 182501 182915 183533 184159 184413 184001 183155
52904 183155 182590 182755 183280 183636 184204 185935 188789 191242 191812 190657 189218 188668 189154 190161 191000 191075 190289
52887 190289 189230 188636 188660 188911 189143 189517 190221 191115 191840 192104 191966 191968 192798 194498 196136 196715 196329 195983 196225
52868A96225L09k30m07K60R73Q02Rl99j32J17j44n22m82k14j51j50K41R26J369
52849A98400J386J237R61L87j94k00J81m7j295k618k845j898n65M38P78L69m09
52832A94066r13j020j262j759j716o60N77R14M58k3n04j358k067j543K06J889
52816A85285K527K266J596P36n4m27n09p44j094j129r54j158j721j956j742j776
52800A79146k213k177j230l46o17j708k428k368k140k305k752l018k753j949j111
52785A50031q69j243j614j670j820k302k533j981j067n54m18k00j11q25k096k586
52769A28142j438N31J599R39p07j929k048j612j579k138k525k088j158o56j058
52754A12275k007k811k983k441j563r91j067j404j336p79l60n92j201j455j055
$$ plain form
52868 196225 196534 196304 195897 196157 197130 197932 197941 197542 197410 197527 197383 196861 196379 196165 196014 195864 196105 197031 198400
52849 198400 199786 201023 201984 202371 202177 201977 202158 202111 200816 198198 195353 193455 192890 193328 194106 194475 194066
52832 194066 193153 192133 190871 189112 187396 186736 187313 188227 188685 188662 188158 186800 184733 183190 183396 185285
52816 185285 187812 190078 191674 192410 192356 191929 191420 190676 189582 188453 187499 186341 184620 182664 180922 179146
52800 179146 176933 174756 173526 173180 172563 170855 168427 166059 163919 161614 158862 155844 153091 151142 150031
52785 150031 149162 147919 146305 144635 142815 140513 137980 135999 134932 134378 133960 133760 133649 132824 130728 128142
52769 128142 126704 127235 128834 129773 129066 127137 125089 123477 121898 119760 117235 115147 113989 113333 112275
52754 112275 110268 107457 104474 102033 100470 99479 98412 97008 95672 94893 94533 93941 92740 91285 90230
52739I0230m75l55p26r79o09J25M74O8o56r47n19K08N85L83l3j35J73N20N79L86
52719H8297Q9k65n51n33l26m74j092j367o04N49P67j29r45p94j07L12L33Q9n20
52700H2729j313j463n04P49J104M76k66o23p43o05J32J313K125K060J448Q08K45
52683H7672k14k63K09O68N02r5l33R7O58Q11P92J168J858K178J856J531J776K118
52665A02989J592K14q67q10l7N48P35Q13O83n0j204j948j816j254r83j155j390
52648I6060j304p80O1Q15R29K36p01j094p74k88j35k56l56l81l58j08M18P36L31
52629I3051m74p05q3N55M28j14k64l6o3m22m32K63J152J579J441J005N10J98L22
52610I7911Q01J195J165P97L44j0q6K19P24J076J167J092P80J42m51m88j75k23
$$ plain form
52739 90230 89755 89400 88674 87695 87086 87211 87685 87753 87097 86150 85631 85839 86424 86807 86774 86639 86812 87332 87911 88297
52719 88297 88386 88121 87570 87037 86711 86237 85145 83778 83174 83723 84490 84361 83416 82622 82515 82827 83160 83249 82729
52700 82729 81416 79953 79449 80198 81302 81778 81512 80889 80146 79541 79673 80986 83111 85171 86619 87427 87672
52683 87672 87458 87195 87404 88072 88574 88479 88146 88243 88901 89712 90504 91672 93530 95708 97564 99095 100871 102989
52665 102989 104581 104795 103928 103118 103081 103629 104364 105177 105860 105810 104606 102658 100842 99588 98605 97450 96060
52648 96060 94756 93976 94037 94852 95781 96017 95316 94222 93448 93160 93025 92769 92413 92032 91674 91566 91984 92720 93051
52629 93051 92577 91872 91789 92344 92772 92658 92394 92358 92295 91873 91441 91704 92856 94435 95876 96881 97391 97589 97911
52610 97911 98712 99907 101072 101869 102213 102203 102117 102336 103060 104136 105303 106395 107175 107317 106866 106378 106203 105980
52592A05980o30m96N80J723J999J646J457J530J498J464J766K108J892J292J119
52577A24928J602K116K189K026J886J662J329J182J306J367J217J237J728K360
52563A48135K589K343J951J614J354J260J456J826J963J513N16n48j082q84l23
52548A63683N4N4j64m59p71r11o66j28L66O92R12R09M73q1kQ34J465R89j61p84
52528A66304n28k17m77q30n45J79N20K54oL19J066J693J804J327M88j61j67K10
52510A71233J51o23j311j077k61J51o5k30l6k0m66p29k14N58O02j33q04r18p96
52491A65012p65n59J80J241K013K062J402M19k66j55O51J471J721J427R57M70
52475A77281m0l49q6O47J101O80k71q32n90j1K81K24P2j65o24j152j405j323j135
$$ plain form
52592 105980 105350 104854 105434 107157 109156 110802 112259 113789 115287 116751 118517 120625 122517 123809 124928
52577 124928 126530 128646 130835 132861 134747 136409 137738 138920 140226 141593 142810 144047 145775 148135
52563 148135 150724 153067 155018 156632 157986 159246 160702 162528 164491 166004 166520 165972 164890 164006 163683
52548 163683 163737 163791 163627 163168 162397 161486 160820 160692 161058 161750 162662 163571 164044 163963 163961 164795 166260 167249 167088 166304
52528 166304 165776 165559 165082 164252 163707 163886 164406 164660 164654 164973 166039 167732 169536 170863 171351 171190 171023 171233
52510 171233 171384 170761 169450 168373 168112 168263 168198 167968 167932 167912 167446 166717 166503 167061 167663 167530 166726 165808 165012
52491 165012 164247 163688 163868 165109 167122 169184 170586 171005 170739 170584 171235 172706 174427 175854 176811 177281
52475 177281 177241 176892 176806 177453 178554 179234 178963 178131 177541 177530 177811 178035 178107 177942 177318 176166 174761 173438 172303
52456A72303q58l05L66N95J49m46n36j43J66O2k63m57l65j7N14J131J683J917
52438A75496J596P77p6m74m52m50o56o81j61O04Q77K75q23j571j335k58P37P93
52420A74218K2o43o40m28o99j318j477p98K10P92P21L21l5l23p10j118j094l18
52402A66683Q76J759K036J997J836J342N31O2M88J408J936J810J504J386J346
52387A87000J297J420J680J685J300J026J349J952K088J625J242J415J727J538
52373B08344J061J117J852K363J968J278J400K346K957K452J327N49M47P37J116
52358B31314J435J504J218P67N55Q79J674K425K481J821J336J858L025L706L546
52343B59544L184K940K296J096K57M31R08P44L16O36J617K247K209K183K481K605
$$ plain form
52456 172303 171445 171140 171506 172101 172250 171804 171268 171125 171291 171353 171090 170633 170268 170251 170765 171896 173579 175496
52438 175496 177092 177869 177793 177319 176867 176417 175761 175080 174919 175523 176400 176675 175852 174281 172946 172688 173425 174218
52420 174218 174240 173597 172957 172529 171830 170512 169035 168237 168447 169239 169960 170281 170246 169923 169213 168095 167001 166683
52402 166683 167559 169318 171354 173351 175187 176529 177060 177122 177610 179018 180954 182764 184268 185654 187000
52387 187000 188297 189717 191397 193082 194382 195408 196757 198709 200797 202422 203664 205079 206806 208344
52373 208344 209405 210522 212374 214737 216705 217983 219383 221729 224686 227138 228465 229014 229461 230198 231314
52358 231314 232749 234253 235471 236238 236793 237672 239346 241771 244252 246073 247409 249267 252292 255998 259544
52343 259544 262728 265668 267964 269060 269317 269748 270656 271400 271716 272352 273969 276216 278425 280608 283089 285694
52327B85694K339K267K760L303L333L135L294L792M196M406M729N321O010O676
52313C41255P534Q850J0460J1658J1813J1187J0901J1816J3602J5170J5893J6043
52301D86182J6175J6521J7096J7932J8988K0004K0565K0379J9522J8505J7879
52290F89748J7705J7529J7010J6298J5644J4966J4068J2989J1861J0665R475Q511
52278H56469P715O591M908L181K029J399Q52K69k67r13j813k723l379l906m314
52263H66098m176l405k799k919l012k129p73j25j5Q40K597M006M559N336P125
52248H71208R091J0239J0958J2093J3420J4139J4221J4271J4484J4639J4740J4825
52236A028328J4473J3283J1686J0562J0155R923R342Q384P236O004M748L517K372
$$ plain form
52327 285694 288033 290300 293060 296363 299696 302831 306125 309917 314113 318519 323248 328569 334579 341255
52313 341255 348789 357639 368099 379757 391570 402757 413658 425474 439076 454246 470139 486182
52301 486182 502357 518878 535974 553906 572894 592898 613463 633842 653364 671869 689748
52290 689748 707453 724982 741992 758290 773934 788900 802968 815957 827818 838483 847958 856469
52278 856469 864184 870775 875683 878864 880893 882292 883144 883413 883146 882233 880420 877697 874318 870412 866098
52263 866098 861922 858517 855718 852799 849787 847658 846885 846760 846745 847585 850182 854188 858747 864083 871208
52248 871208 880299 890538 901496 913589 927009 941148 955369 969640 984124 998763 1013503 1028328
52236 1028328 1042801 1056084 1067770 1078332 1088487 1098410 1107752 1116136 1123372 1129376 1134124 1137641 1140013
52223A140013J423O74j54j279k387l049l607m896o842q195q148p509p571q425
52209A080048r090q873p874o564n521n249n564n408m019k046p71m31j32O71J471
52194A020648J599J117N59L28N62J210K011K659L043L118K638J464J10n06o6P34
52178A041228R82M81k84q72j280j665j973j993j820j954k718l697m168m084m187
52163A011996m970n944o286n831n057m344l740l290l173l442l899m316m550m585
52149I48569m580m789n268n751n936n759n311m735m273m126m148m032l866m143
52135H81852m952n614n455m552l463k628k376l012m225m936m390l226k688k960
52121H27375l106k544j760j339j073m12P15J983L193M393N638O968Q460J0000
$$ plain form
52223 1140013 1141436 1142110 1141956 1140677 1138290 1135241 1131634 1126738 1119896 1111701 1103553 1096044 1088473 1080048
52209 1080048 1070958 1062085 1054211 1047647 1042126 1036877 1031313 1025905 1021886 1019840 1019069 1018638 1018506 1019177 1020648
52194 1020648 1022247 1023364 1023923 1024251 1024813 1026023 1028034 1030693 1033736 1036854 1039492 1040956 1041066 1040560 1040494 1041228
52178 1041228 1042210 1042691 1042407 1041535 1040255 1038590 1036617 1034624 1032804 1030850 1028132 1024435 1020267 1016183 1011996
52163 1011996 1007026 1001082 994796 988965 983908 979564 975824 972534 969361 965919 962020 957704 953154 948569
52149 948569 943989 939200 933932 928181 922245 916486 911175 906440 902167 898041 893893 889861 885995 881852
52135 881852 876900 871286 865831 861279 857816 855188 852812 849800 845575 840639 836249 833023 830335 827375
52121 827375 824269 821725 819965 818626 817553 817141 817856 819839 823032 827425 833063 840031 848491 858491
52107H58491J1186J1757J2060J2822J4385J6313J7889J8883J9651K0596K1733
52096A035766K2877K3959K4882K5280K4820K3731K2640K1800K0852J9388J7447
52085A283442J5324J3217J1215R349P535N694M013K736J632J13j912l779m887
52072A343692n405n896o575p278p904q511r136r680r843r157p488n488m070l333
52058A243928k565j408l18L77J083K188L374M226M842N380N625N641O115P359
52044A285847Q517Q629P910P217O753O199N622N261M795L800K640J829Q81j073
52030A354827l665n529o176o483p216q173r033r999j1213j2370j3257j3944j4291
52017A233478j4117j3959j4696j6128j6983j6758j6545j7386j8813j9701j9785
$$ plain form
52107 858491 869677 881434 893494 906316 920701 937014 954903 973786 993437 1014033 1035766
52096 1035766 1058643 1082602 1107484 1132764 1157584 1181315 1203955 1225755 1246607 1265995 1283442
52085 1283442 1298766 1311983 1323198 1332547 1340082 1345776 1349789 1352525 1354157 1354270 1352358 1348579 1343692
52072 1343692 1338287 1332391 1325816 1318538 1310634 1302123 1292987 1283307 1273464 1264307 1256819 1251331 1247261 1243928
52058 1243928 1241363 1239955 1239637 1240014 1241097 1243285 1246659 1250885 1255727 1261107 1266732 1272373 1278488 1285847
52044 1285847 1294364 1302993 1310903 1318120 1324873 1331072 1336694 1341955 1346750 1350550 1353190 1355019 1355900 1354827
52030 1354827 1351162 1345633 1339457 1332974 1325758 1317585 1308552 1298553 1287340 1274970 1261713 1247769 1233478
52017 1233478 1219361 1205402 1190706 1174578 1157595 1140837 1124292 1106906 1088093 1068392 1048607
52006A048607j9559j9306j9134j9412k0309k1118k0964j9972j9095j8895j9115
51995H31728j9436j9978k0941k2103k2913k2946k2323k1649k1361k1147k0397
51984E96534j9232j8544j8754j9083j8548j7264j6116j5468j4798j3638j2249
51973D12840j1270j0986j1085j0971j0278r201q293p823p462o776n875n289n268
51960C02263n451n370n010m699m534m231l661l272l626m545n168m981m342l821
51946B39552l493l262l331l708l729k827j593j212j923k745k829k315j787j581
51932B03217j783k201k214j366k25J08m48q13l62K14J89j01q9j31q87k093k870
51915A88145k921k567j920r03P0K74l56j089j287j000o24l97l53m49o33r47j423
$$ plain form
52006 1048607 1029048 1009742 990608 971196 950887 929769 908805 888833 869738 850843 831728
51995 831728 812292 792314 771373 749270 726357 703411 681088 659439 638078 616931 596534
51984 596534 577302 558758 540004 520921 502373 485109 468993 453525 438727 425089 412840
51973 412840 401570 390584 379499 368528 358250 349049 340756 332933 325471 318695 312820 307531 302263
51960 302263 296812 291442 286432 281733 277199 272968 269307 266035 262409 257864 252696 247715 243373 239552
51946 239552 236059 232797 229466 225758 222029 219202 217609 216397 214474 211729 208900 206585 204798 203217
51932 203217 201434 199233 197019 195653 195428 195536 195088 194275 193913 194127 194316 194215 194126 193995 193108 191015 188145
51915 188145 185224 182657 180737 179834 179904 180178 179822 178733 177446 176446 175822 175425 175072 174623 173990 173043 171620
51898A71620j819j773j415j414k073k809k977k728k506k102j028L59R94M32o57
51883A50104j371j419r66k70L57O85Q60J197J553J379N45k48l02K26N61K57l66
51866A52782o64l14M08R07Q00K74j39p0L88Q19Q66N55K71K88M01K32q2N5Q15J552
51846A60144J639J291J090J044P24J49j33J27N87R31J245J596J702J345P72M16
51830A74669M29O52Q75R73R61R50J017J059R60Q55R18R42M81m79j351j611j306
51813A80994p02J33J053J486R01l70j329j438j205j383j878j836p67Q00J962K356
51797A78777K183J626P62jL5R71J927J933J084L49L83Q87J188J020O44M13M26
51780A94607M70K76j2K68J606L542M915N021M197L145K141J216O39O59R35Q93
$$ plain form
51898 171620 169801 168028 166613 165199 163126 160317 157340 154612 152106 150004 148976 149335 150329 150761 150104
51883 150104 148733 147314 146348 146078 146435 147120 147980 149177 150730 152109 152654 152406 152104 152330 152891 153148 152782
51866 152782 152118 151804 152212 153119 153919 154193 154054 153984 154372 155191 156057 156612 156883 157171 157572 157804 157722 157777 158592 160144
51846 160144 161783 163074 164164 165208 165932 166081 165948 166075 166662 167593 168838 170434 172136 173481 174253 174669
51830 174669 175098 175750 176625 177598 178559 179509 180526 181585 182545 183400 184318 185260 185741 185262 183911 182300 180994
51813 180994 180292 180425 181478 182964 183865 183495 182166 180728 179523 178140 176262 174426 173659 174459 176421 178777
51797 178777 180960 182586 183348 183347 183382 184353 186280 188213 189297 189646 190029 190916 192104 193124 193768 194181 194607
51780 194607 195077 195353 195341 195609 197215 200757 205672 210693 214890 218035 220176 221392 222031 222690 223625 224518
51764B24518N71N13P44M95o23j829k141j702j402j437j161m02R1j13l46J27Q74
51747B16777J001N78M68R43J363J241P82K60l24p83o41N8N67L87r6k60l1M17J096
51728B23803J847K037J332L73R4N55J048J159J130J244J408J420J184P09J71j36
51712B39378j76l34q15j182r41l51r5k66l46j11J7l11q75j167q42J58J441K226
51694B35408K019J306R89J184J176O49K31N25J296J968K390K640K600K173J577
51679B58131Q92k64k089l889m686m361l669l260l165l200l259l157k712k169k072
51664B17071k523k923k764k246j862j709j590j511j601j632j214n49l93j011j602
51649A91941j195Q7J175J357R17M51J08k01l97m26n91j106j454q57N43J494R88
$$ plain form
51764 224518 225089 225602 226346 226841 226218 224389 222248 220546 219144 217707 216546 216144 216235 216122 215776 215903 216777
51747 216777 217778 218356 218824 219767 221130 222371 223153 223413 223089 222306 221665 221723 222290 222677 222581 222321 222290 222707 223803
51728 223803 225650 227687 229019 229392 229486 230041 231089 232248 233378 234622 236030 237450 238634 239343 239514 239378
51712 239378 239202 238868 238053 236871 235930 235579 235484 235218 234872 234761 234778 234467 233592 232425 231583 231741 233182 235408
51694 235408 237427 238733 239722 240906 242082 242731 242962 243487 244783 246751 249141 251781 254381 256554 258131
51679 258131 259023 258759 256670 252781 248095 243734 240065 236805 233640 230440 227181 224024 221312 219143 217071
51664 217071 214548 211625 208861 206615 204753 203044 201454 199943 198342 196710 195496 194947 194554 193543 191941
51649 191941 190746 190833 192008 193365 194282 194733 194841 194640 194243 193817 193226 192120 190666 189809 190352 191846 192834
51632A92834n65j891k240j864j234m68L55Q36O34l9o39r05r16o62nQ82J453J398
51614A86964J046Q86J028J276J534J746J663J176O76O77J041J057L78m88p29j8
51598A99913J298K477K768J960O87j53l32l40n00n54l14j29l69q20r99p73k88
51581B03532L14Q20Q62L45k96n53l69J11Q63J659J882J285O33Q87J918K626K364
51564B18883J504O48r3p35j018p10p0L88M10K08J63M72R26J067O03l09j231j781
51546B19325j809j498j332j556j626p83O10J060j11j592j673n26K63M0l12j46
51530B08334J3k87l90L59J409J663Q96j92r64j167p01K91J183J324P53J12j62
51513B12474j70k57o20j159j509j274n06K33M09J27o1J88O68R42Q30N95N99Q04
$$ plain form
51632 192834 192269 190378 188138 186274 185040 184572 184927 185763 186397 186358 185719 184814 183898 183236 183231 184113 185566 186964
51614 186964 188010 188896 189924 191200 192734 194480 196143 197319 197995 198672 199713 200770 201148 200660 199931 199913
51598 199913 201211 203688 206456 208416 209103 208950 208618 208278 207778 207224 206910 206781 206412 205592 204593 203820 203532
51581 203532 203846 204666 205528 205873 205577 205024 204655 204766 205629 207288 209170 210455 211088 211975 213893 216519 218883
51564 218883 220387 221035 220942 220207 219189 218479 218409 218797 219207 219415 219578 220050 220976 222043 222646 222337 221106 219325
51546 219325 217516 216018 214686 213130 211504 210721 211331 212391 212280 210688 209015 208489 208752 208792 208480 208334
51530 208334 208347 208060 207670 208029 209438 211101 211997 211805 210841 209674 208973 209264 210447 211771 212524 212636 212474
51513 212474 212304 212047 211427 210268 208759 207485 206979 207212 207621 207748 207687 207875 208543 209485 210315 210910 211509 212313
51495B12313Q06M80L82J058K170K808K657K298K288K509K587K389J909J179N82
51480B38415O99J492K177K246K123K382K809K795K223J499J044J119J750K319
51466B65092J801N2j614j879j141q18j288j575j049l78l99q93j080p38l52m74
51450B53267j205k094k312j397QN53l04j621k120j667j133j065j173j047q55j004
51434B34831j414j525j035l55j37m37o66m27p9j33m46m87l02n24j317j969j884
51417B21694j448j420j872k294k516k833l297l543l397l118k826k243j330o65
51403A88892p31j207j421j267j149j245j368j535j975k481k426j671r06p07p51
51388A68052m79o5l3k81k24J16J3q43j807k131j818j341r95q94j105j389j242
$$ plain form
51495 212313 213119 213599 213981 215039 217209 220017 222674 224972 227260 229769 232356 234745 236654 237833 238415
51480 238415 239114 240606 242783 245029 247152 249534 252343 255138 257361 258860 259904 261023 262773 265092
51466 265092 266893 266945 265331 263452 262311 261493 260205 258630 257581 257203 256804 255911 254831 254093 253741 253267
51450 253267 252062 249968 247656 246259 246267 246820 246516 244895 242775 241108 239975 238910 237737 236690 235835 234831
51434 234831 233417 231892 230857 230502 230365 229928 229262 228835 228756 228623 228177 227690 227388 226864 225547 223578 221694
51417 221694 220246 218826 216954 214660 212144 209311 206014 202471 199074 195956 193130 190887 189557 188892
51403 188892 188161 186954 185533 184266 183117 181872 180504 178969 176994 174513 172087 170416 169510 168803 168052
51388 168052 167573 167508 167475 167194 166970 167086 167099 166256 164449 162318 160500 159159 158164 157270 156165 154776 153534
51371A53534o12k38p21j614k028j910j958k325k268j329j04N70O90Q22J155J354
51355A43018J250J046Q59N29N1j46L50J356K212K412J908R49j98j198j569r88
51339A51841K58J304J402N78m82j131j238j035q15q67j382k186k673k388j597
51324A39589r85q26p84n52k87k48l50m31n85r50j344j516j545j590j488j017m21
51307A24670j26p8O8J55l03j093j282n38K30J35m97p60m77p8L23R02J387J220
51289A23858M64k17n09p36j073j152o74J02O80Q57P00M14K87M66O64M16l41j247
51271A22959k004k452k332j507m88p0l24n38k80P1J10J8K3j04n14p86m92Qj5o68
51251A10615j295j304p92l11k17j98M05J674K697K536J508P96P99Q08M42L37Q70
$$ plain form
51371 153534 152922 152684 151963 150349 148321 146411 144453 142128 139860 138531 138427 138997 139687 140509 141664 143018
51355 143018 144268 145314 146173 146702 146753 146607 146957 148313 150525 152937 154845 155794 155596 154398 152829 151841
51339 151841 152099 153403 154805 155383 154901 153770 152532 151497 150682 149815 148433 146247 143574 141186 139589
51324 139589 138604 137778 136994 136442 136155 135907 135557 135126 134541 133591 132247 130731 129186 127596 126108 125091 124670
51307 124670 124544 124466 124534 124689 124386 123293 122011 121473 121703 121838 121341 120581 120104 120026 120349 121251 122638 123858
51289 123858 124322 124105 123596 122860 121787 120635 119961 120063 120743 121600 122300 122714 123001 123467 124131 124547 124206 122959
51271 122959 120955 118503 116171 114664 114176 114106 113782 113244 112964 113035 113145 113163 113186 113082 112568 111782 111290 111298 111283 110615
51251 110615 109320 108016 107224 106913 106696 106498 106903 108577 111274 113810 115318 116114 116913 117721 118163 118500 119370
51234A19370J204N63l31k35P61J484J463J310J402J344R01M71K87N5l03k98L18
51217A29766J015J222J036Q37P00N99P59J262J695J659J372J320J479J408R92
51202A47121O15N72O62N63L11K43M98P27M18m83j342j469q88l13k58m56l91r2
51184A46038o8n04r82j084r97j127j430j490j312j493k328l088k749j356r4J00
51168A26036m32p04l46J78L45P8m04q49j005p10j26L41L99J29j66k34k2L05M63
51149A23276K27m44j347k032j976j062J26Q05Q32P22P10L64n56j428j466q01j85
51132A15765J24M50P73N39l27r83p41q8r3r71j818j717p26L55R02R79J018J212
51114A14653J338J088N26Q6J61P63J521J974J903J452R71P16O85P27P29O97P40
$$ plain form
51234 119370 120574 121137 120806 120571 121332 122816 124279 125589 126991 128335 129236 129707 129994 130049 129746 129448 129766
51217 129766 130781 132003 133039 133876 134576 135175 135934 137196 138891 140550 141922 143242 144721 146129 147121
51202 147121 147736 148308 148970 149533 149844 150087 150585 151312 151730 151247 149905 148436 147548 147235 146977 146521 146130 146038
51184 146038 145970 145466 144484 143400 142403 141276 139846 138356 137044 135551 133223 130135 127386 126030 125936 126036
51168 126036 125604 124900 124554 124732 125077 125155 124751 123902 122897 122187 122061 122402 122801 122930 122764 122530 122508 122813 123276
51149 123276 123503 123059 121712 119680 117704 116642 116768 117573 118405 119127 119837 120201 119645 118217 116751 115950 115765
51132 115765 115889 116339 117112 117651 117324 116341 115600 115512 115419 114448 112630 110913 110187 110542 111444 112423 113441 114653
51114 114653 115991 117079 117605 117691 117852 118615 120136 122110 124013 125465 126436 127152 127837 128564 129293 129990 130730
51097A30730R83J408J758J786J545J312J172R94Q18R86J659K469K843K556J825
51082A54844J058O33O57Q41P19K39j65j40K10O60J131J392J059K53k06K50J116
51065A64551J527J425J294J116M46n35r34l49N64R61O20k99j712l313m320m053
51049A56989k684j130k28j85n58o46p7Q15J308J115P14P12J125J442J296Q71N94
51032A61473O23O83N03K62M03R93J510J435P97oo07o88k7J088J813J626J088J170
51014A74139J961K616K474J706Q48L55O14J785L329M236M028L218K617K535K795
50999B09256L136L411L606L913M515N265N762N826N661N555N715O274P151P918
50985B82964Q214Q246Q514R158J0019J1143J2616J4063J5050J5993J7827K0635
$$ plain form
51097 130730 131713 133121 134879 136665 138210 139522 140694 141688 142506 143492 145151 147620 150463 153019 154844
51082 154844 155902 156535 157192 158033 158752 158991 158826 158686 158896 159556 160687 162079 163138 163391 163185 163435 164551
51065 164551 166078 167503 168797 169913 170359 169824 168890 168541 169105 170066 170686 170387 168675 165362 161042 156989
51049 156989 154305 153175 152947 152762 152204 151558 151481 152296 153604 154719 155433 156145 157270 158712 160008 160879 161473
51032 161473 162096 162779 163282 163544 163947 164940 166450 167885 168682 168676 168069 167381 167354 168442 170255 171881 172969 174139
51014 174139 176100 178716 181190 182896 183744 184099 184713 186498 189827 194063 198091 201309 203926 206461 209256
50999 209256 212392 215803 219409 223322 227837 233102 238864 244690 250351 255906 261621 267895 275046 282964
50985 282964 291178 299424 307938 317096 327115 338258 350874 364937 379987 395980 413807 434442
50973D34442K3447K5662K7839L0702L4191L7917M1826M5781M9202N1871N4574
50962H57454N8147O2218O5630O7797O8930O9106O7909O5116O1123N6586N1851
50951A551867M6832M1171L4640K7661K1273J6281J2587R596P056N180M197M143
50939A782484N006O576Q277R434R685Q888O841L408j231o789j3193k0416k8105
50926A770865l5748m3034m9817n5867o1028o5420o9148p1845p2876p1999o9571
50915A104512o6158o2150n7733n3026m8200m3521l9193l5167l1337k7883k5017
50904F15127k2382j9316j5915j3193j1694j0575q806o713n486n343n151l942k065
50891D84546n93j74o34j282j304k99J321K644L113K893K482K268K560L560N194
$$ plain form
50973 434442 457889 483551 511390 542092 576283 614200 656026 701807 751009 802880 857454
50962 857454 915601 977819 1043449 1111246 1180176 1249282 1317191 1382307 1443430 1500016 1551867
50951 1551867 1598699 1639870 1674510 1702171 1723444 1739725 1752312 1761908 1768964 1774144 1778341 1782484
50939 1782484 1787490 1794066 1802343 1811777 1821462 1830350 1837191 1840599 1839368 1832579 1819386 1798970 1770865
50926 1770865 1735117 1692083 1642266 1586399 1525371 1459951 1390803 1318958 1246082 1174083 1104512
50915 1104512 1038354 976204 918471 865445 817245 773724 734531 699364 668027 640144 615127
50904 615127 592745 573429 557514 544321 532627 522052 513246 506533 501047 495704 490553 486611 484546
50891 484546 483953 483779 483145 481863 480559 480260 481581 484225 487338 490231 492713 494981 497541 501101 506295
50876E06295O994Q398R070R141R139R596J0473J1222J1621J2186J3475J5270J7041
50863F49921J8940K1630K5189K8815L1819L4431L7413M1358M6464N2662N9645
50852A048287O7048P4773Q2973R1752J01044J10682J20268J29111J36704J43128
50842B105770J48587J52610J54254J52993J48779J41300J30055J15401R8770Q1450
50832C429969O3843M6307L0005J6174N153l061p856q477n300L46P610J6384K5921
50819C617018L4127L8838L9305L5819K8286J6023r83k1338m2973o4338q4706j03775
50807C491303j21353j37209j50748j60846j66453j67493j64862j59401j51210
50798B111728j40238j27241j13677j00656q8347p6381o4492n2714m1305l0684
$$ plain form
50876 506295 513289 521687 530757 539898 549037 558633 569106 580328 591949 604135 617610 632880 649921
50863 649921 668861 690491 715680 744495 776314 810745 848158 889516 935980 988642 1048287
50852 1048287 1115335 1190108 1273081 1364833 1465877 1576559 1696827 1825938 1962642 2105770
50842 2105770 2254357 2406967 2561221 2714214 2862993 3004293 3134348 3249749 3348519 3429969
50832 3429969 3493812 3540119 3570124 3586298 3591451 3588390 3580534 3572057 3566757 3567103 3574713 3591097 3617018
50819 3617018 3651145 3689983 3729288 3765107 3793393 3809416 3808433 3787095 3744122 3679784 3595078 3491303
50807 3491303 3369950 3232741 3081993 2921147 2754694 2587201 2422339 2262938 2111728
50798 2111728 1971490 1844249 1730572 1629916 1541569 1465188 1400696 1347982 1306677 1275993
50788A275993k1263j3113n891P72O841J1894J5457J7318J7586J6573J4580J1810
50776A348557Q475M907J376k096n491q525j0875j2805j5148j8395k2065k5247
50764A242668k7681k9907l2354l4575l5605l4958l3080l0846k8707k6445k3685
50753I04825k0470j7218j4167j1106p780m374j319J381M275P760J1493J4952J8363
50740H86615K2584K7898L3500L8575M3442M9038N5570O2380O9061P5806Q2493
50729A446962Q8241R2389R5201R6994R7134R4805R0404Q5176P9433P2075O2121
50718B400935M9927L6478K2212P308p269j9837k9176l5093l7754l7009l2764k5755
50706B292203j7444r046r19O956J4087J9348K1751K1100J7713J1678K684r426
$$ plain form
50788 1275993 1254730 1241617 1235726 1236498 1243339 1255233 1270690 1288008 1305594 1322167 1336747 1348557
50776 1348557 1357032 1361939 1363315 1361219 1355728 1347203 1336328 1323523 1308375 1289980 1267915 1242668
50764 1242668 1214987 1185080 1152726 1118151 1082546 1047588 1014508 983662 954955 928510 904825
50753 904825 884355 867137 852970 841864 834084 829710 828391 829772 834047 841807 853300 868252 886615
50740 886615 909199 937097 970597 1009172 1052614 1101652 1157222 1219602 1288663 1364469 1446962
50729 1446962 1535203 1627592 1722793 1819787 1916921 2011726 2102130 2187306 2266739 2338814 2400935
50718 2400935 2450862 2487340 2509552 2516860 2509591 2489754 2460578 2425485 2387731 2350722 2317958 2292203
50706 2292203 2274759 2265713 2264794 2271750 2285837 2305185 2326936 2348036 2365749 2377427 2380111 2370685
50694B370685k4120m0162n6000p0120q1375q9207r3615r4837r3163q9082q3283
50683A555721p6278o8051n8490m8190l8396k9791k1704j3005l583N719J4602K3872
50671A242426L4023M4080N2579N9242O4755O9142P1394P0857O8029O3704N8083
50660A898314N1236M3718L6207K8946K2061J5932J0753O062J264l683q510j3150
50648B089150j7475k0909k3010k4272k5501k6497k6042k3411j9311j5019j0962
50637A856741o553j230M576R662J3122J5055J6003J5999J4627J2015R015O171
50625A965203L192j28l126n097o297p313p797o779l998j20M300R182J4264J8807
50611A974293K2148K4004K4230K2849K0339J7175J3165P862J566m827j1030j7629
$$ plain form
50694 2370685 2346565 2306403 2250403 2180283 2098908 2009701 1916086 1821249 1728086 1639004 1555721
50683 1555721 1479443 1411392 1352902 1304712 1266316 1236525 1214821 1201816 1198233 1203952 1218554 1242426
50671 1242426 1276449 1320529 1373108 1432350 1497105 1566247 1637641 1708498 1776527 1840231 1898314
50660 1898314 1949550 1993268 2029475 2058421 2080482 2096414 2107167 2113229 2114493 2110810 2102300 2089150
50648 2089150 2071675 2050766 2027756 2003484 1977983 1951486 1925444 1902033 1882722 1867703 1856741
50637 1856741 1850188 1848958 1853534 1863196 1876318 1891373 1907376 1923375 1938002 1950017 1959032 1965203
50625 1965203 1968395 1968267 1965141 1960044 1953747 1946434 1938637 1931858 1927860 1927740 1932040 1941222 1955486 1974293
50611 1974293 1996441 2020445 2044675 2067524 2087863 2105038 2118203 2126065 2127631 2122804 2111774 2094145
50599B094145k5010l2857m0859m9034n6989o3693o8432p1405p2987p3074p1541
50588A468264o8851o5624o2109n8343n4396n0129m5297m0256l5972l2871l0234
50577I24182k7137k3517j9824j6246j2815r783p176m512j622P60K040L052N281
50564H12683Q945J2765J5702J8035K0491K3087K5369K7310K9515L2593L6621M1163
50552A104279M5652M9786N3546N6887N9579O1392O2281O2188O0913N8369N4825
50541A729697N0701M6401M2529L9918L8984L9323M0302M1889M4337M7179M9303
50530B210563N0172N0522N1491N3342N5394N7078N8759O1320O5018O8918P1638
50519B854215P2571P2161P0912O8534O4205N7434M8285L6979K3730R040o199k1157
$$ plain form
50599 2094145 2069135 2036278 1995419 1946385 1889396 1825703 1757271 1685866 1612879 1539805 1468264
50588 1468264 1399413 1333789 1271680 1213337 1158941 1108812 1063515 1023259 987287 954416 924182
50577 924182 897045 873528 853704 837458 824643 814860 807684 803172 801550 802310 804350 807402 812683
50564 812683 821628 834393 850095 868130 888621 911708 937077 964387 993902 1026495 1063116 1104279
50552 1104279 1149931 1199717 1253263 1310150 1369729 1431121 1493402 1555590 1616503 1674872 1729697
50541 1729697 1780398 1826799 1869328 1909246 1948230 1987553 2027855 2069744 2114081 2161260 2210563
50530 2210563 2260735 2311257 2362748 2416090 2471484 2528562 2587321 2648641 2713659 2782577 2854215
50519 2854215 2926786 2998947 3069859 3138393 3202598 3260032 3308317 3345296 3369026 3378066 3371867 3350710
50507C350710l5540m9566o3350p6198q6650r3392r6261r5983r2990q6932p7572
50496B496276o5638n2327l8402k4309j0878Q65J0548J8489K4808K9030L0684K9713
50484B448859K5962J8796P663p097k4226m2131n9244p4169q6032r4778j00793
50473B012810j04186j04708j02452r8280r3263q7804q1718p5029o8319o2124n6367
50462A078560n0727m5277m0314l5773l1257k6692k2522j9093j6202j3441j0690
50451G66572q070n645l351j107J098L059M369M941N466O819Q943J0848J1945J2736
50437H18623J3886J5239J6427J7802J9897K2304K4048K5053K6259K8186L0193
50426A057917L1537L2411L3478L4975L6816L9032M1456M3336M4027M3964M4372
$$ plain form
50507 3350710 3315170 3265604 3202254 3126056 3039406 2946014 2849753 2753770 2660780 2573848 2496276
50496 2496276 2430638 2378311 2339909 2315600 2304722 2305587 2316135 2334624 2359432 2388462 2419146 2448859
50484 2448859 2474821 2493617 2501280 2494183 2469957 2427826 2368582 2294413 2208381 2113603 2012810
50473 2012810 1908624 1803916 1701464 1603184 1509921 1422117 1340399 1265370 1197051 1134927 1078560
50462 1078560 1027833 982556 942242 906469 875212 848520 825998 806905 790703 777262 766572
50451 766572 758502 752857 749506 748399 749497 752556 756925 761866 767332 774151 783094 793942 805887 818623
50437 818623 832509 847748 864175 881977 901874 924178 948226 973279 999538 1027724 1057917
50426 1057917 1089454 1121865 1155343 1190318 1227134 1266166 1307622 1350958 1394985 1438949 1483321
50415A483321M5890M8039N0103N1920N3666N5328N6781N7928N8382N7352N4409
50404B073119N0164M5650M1142L6136L0334K3995J7262R841J624p023j5930k5441
50392B280873l5576m5449n4150o1736o8707p4885p9589q2536q3733q2731p9014
50381A532767p3105o6321n9247n1369m2367l2862k3555j4537n941J511P229J1404
50369A183607J4417J6056J5869J3736R682L567m344j2937k0891k7594l3045l7273
50357A120850m0220m1885m2234m1352l9876l8642l7537l5450l1980k8369k5966
50346G17339k4445k2529j9993j7711j6022j4223j1851r412p567o381n574m906
50334E56725m037k664r56O03J933L389M945O011O306O457P345R103J0983J2127
$$ plain form
50415 1483321 1529211 1577250 1627353 1679273 1732939 1788267 1845048 1902976 1961358 2018710 2073119
50404 2073119 2123283 2168933 2210075 2246211 2276545 2300540 2317802 2327643 2329267 2322244 2306314 2280873
50392 2280873 2245297 2199848 2145698 2083962 2015255 1940370 1860781 1778245 1694512 1611781 1532767
50381 1532767 1459662 1393341 1334094 1282725 1240358 1207496 1183941 1169404 1163463 1164974 1172203 1183607
50369 1183607 1198024 1214080 1229949 1243685 1253367 1256934 1252590 1239653 1218762 1191168 1158123 1120850
50357 1120850 1080630 1038745 996511 955159 915283 876641 839104 803654 771674 743305 717339
50346 717339 692894 670365 650372 632661 616639 602416 590565 581153 573586 567205 561631 556725
50334 556725 552688 550024 549068 549671 551604 554993 559938 565949 572255 578712 586057 595160 606143 618270
50320F18270J2319J2118J2313J3159J4175J4826J5127J5460J6040J6854J7812
50309G78473J8663J9103J9284J9831K0903K1757K1797K1538K1707K1834K0842
50298A005732J8782J6895J5781J4619J2555R947P736O200M885L276J040k050o020
50285A109378j0583j5224j9266k2062k3491k4165k4627k4536k3241k1055j9108
50274H82020j7883j6780j5360j4066j3255j2293j0391p846n701m453l677k806
50262G57509j699m55Q80K238L348L825L561K998K779K957K813J789L50n78q18
50247G81497j016j631k507l469m578n628o091n895n750o274p181p692p429o667
50233G09689n923n506n223m546l258j839q25nJ210K700L709L957L977M163M269
$$ plain form
50320 618270 630589 642707 655020 668179 682354 697180 712307 727767 743807 760661 778473
50309 778473 797136 816239 835523 855354 876257 898014 919811 941349 963056 984890 1005732
50298 1005732 1024514 1041409 1057190 1071809 1084364 1094311 1102047 1108247 1113132 1116408 1117448 1115398 1109378
50285 1109378 1098795 1083571 1064305 1042243 1018752 994587 969960 945424 922183 901128 882020
50274 882020 864137 847357 831997 817931 804676 792383 781992 774146 768445 763992 760315 757509
50262 757509 755810 755355 756235 758473 761821 765646 769207 772205 774984 777941 780754 782543 782893 782315 781497
50247 781497 780481 778850 776343 772874 768296 762668 756577 750682 744932 738658 731477 723785 716356 709689
50233 709689 703766 698260 693037 688491 685233 683394 682569 682564 683774 686474 690183 694140 698117 702280 706549
50218G06549M103M013M327M849N238N401N273M752M015L328K397O60j641l478
50204G49786m488n436o850q118q582q658r060r531r377q678q190q229q471q620
50190F37498q609q336p776p221o916o657o149n511n054m827m786n001n337n352
50176E49966m946m580m471m130l202k145j514j116o13l19o41j293j857k679m211
50161E12249n935o874o917o695o486o183o072o476o823o196m814l840l716l673
50147D31549l133k489k135j777j150o00m91n81n50n55r19j581k138k139j337m0
50131D09934Q68Q68O81J487L238M610M710L995L275K727K339K409L043L780M258
50116D52222M697N247N505N248N061N583O529P174P427P706Q096Q322Q451Q912
$$ plain form
50218 706549 710652 714665 718992 723841 729079 734480 739753 744505 748520 751848 754245 754905 753264 749786
50204 749786 745298 739862 733012 724894 716312 707654 698594 689063 679686 671008 662818 654589 646118 637498
50190 637498 628889 620553 612777 605556 598640 591983 585834 580323 575269 570442 565656 560655 555318 549966
50176 549966 545020 540440 535969 531839 528637 526492 524978 523862 523249 522930 522289 520996 519139 516460 512249
50161 512249 506314 499440 492523 485828 479342 473159 467087 460611 453788 447592 442778 438938 435222 431549
50147 431549 428416 425927 423792 422015 420865 420265 419774 419193 418643 418088 417169 415588 413450 411311 409974 409934
50131 409934 410802 411670 412351 413838 417076 421686 426396 430391 433666 436393 438732 441141 444184 447964 452222
50116 452222 456919 462166 467671 472919 477980 483563 490092 497266 504693 512399 520495 528817 537268 546180
50102E46180R817J0845J1817J2838J3789J4190J3885J3484J3829J5098J6640J7766
50090G10178J8491J9442K1084K3258K5565K8041L1095L4908L9177M3492M7788
50079A042519N2442N8060O4945P2472P9103Q3489Q5455Q5554Q3888P9985P3773
50068A861685O6023N7757M9878M3433L9419L7852L7652L7728L7691L7134L4952
50057B341204K9888K1336R296n803k2673l9176n3612o5640p5423q2395q5743q5736
50045A885523q3659q0517p6608p2198o7674o2921n7505n1720m6680m2966l9858
50034A203217l6401l2613k9134k6077k2968j9650j6589j4190j2289j0485q641
50023I74180o812m939k971j198j19K15M50J239K436L246L181K556J975J599J126
$$ plain form
50102 546180 555997 566842 578659 591497 605286 619476 633361 646845 660674 675772 692412 710178
50090 710178 728669 748111 769195 792453 818018 846059 877154 912062 951239 994731 1042519
50079 1042519 1094961 1153021 1217966 1290438 1369541 1453030 1538485 1624039 1707927 1787912 1861685
50068 1861685 1927708 1985465 2035343 2078776 2118195 2156047 2193699 2231427 2269118 2306252 2341204
50057 2341204 2371092 2392428 2401724 2395921 2373248 2334072 2280460 2214820 2139397 2057002 1971259 1885523
50045 1885523 1801864 1721347 1644739 1572541 1504867 1441946 1384441 1332721 1286041 1243075 1203217
50034 1203217 1166816 1134203 1105069 1078992 1056024 1036374 1019785 1005595 993306 982821 974180
50023 974180 967368 962429 959458 958260 958141 958356 958806 960045 962481 965727 968908 971464 973439 975038 976164
50008I76164K27j158k768m148n001n541o285p337q188q437q316q195p946p252
49994H95819o318n740n718n840n657n000l858k392j048j86M95J703L626N739P600
49979H73225R406J1409J3326J4706J5596J6530J7923J9886K2371K5289K8473L1902
49967A100042L5927M1118M7798N5798O4594P3632Q2598R1469J00139J07997J14056
49956A915168J17566J18271J15992J10506J02263R2851Q4168P7073P1406O7085
49946B872349O4496O3447O2342N9031N2399M2643L0192J4893l501k4354m5954
49935C187983o6290q3991r8627j10295j18965j24391j26661j26643j25440j23413
49925B083267j20069j15043j08863j02413r5931q9084q1862p4837o8414o2425
$$ plain form
50008 976164 976391 975233 972465 968317 963316 957775 951490 944153 935965 927528 919212 911017 903071 895819
49994 895819 889501 883761 878043 872203 866546 861546 857688 855296 854248 854062 854557 856260 859886 865625 873225
49979 873225 882631 894040 907366 922072 937668 954198 972121 992007 1014378 1039667 1068140 1100042
49967 1100042 1135969 1177087 1224885 1280683 1345277 1418909 1501507 1592976 1693115 1801112 1915168
49956 1915168 2032734 2151005 2266997 2377503 2479766 2572617 2656785 2733858 2805264 2872349
49946 2872349 2936845 3000292 3062634 3121665 3174064 3216707 3246899 3261792 3258291 3233937 3187983
49935 3187983 3121693 3037702 2939075 2828780 2709815 2585424 2458763 2332120 2206680 2083267
49925 2083267 1963198 1848155 1739292 1636879 1540948 1451864 1370002 1295165 1226751 1164326
49915A164326n6650n1252m6319m1498l6627l2330k9294k7163k4958k2538k0753
49904G74944k0013j9586j8769j7857j7351j6877j5864j4701j4208j4215j3776
49893E91727j2751j1925j1431j0385q559p179p140p514o957n814n294n142l901
49880D87735j580k72j287l173l621k330p47L11J227K098K243J564J108J618K418
49865D87312K504K117K318L367M477N143N831P092Q614R634R937R992J0267J0857
49851E79462J1740J3000J4712J6847J9405K2514K6326L0924L6266M2089M7852
49840H61137N3182N8387O4315P1338P8648Q4604Q7712Q7199Q3106P6257O7908
49829A673793N9040M9965M0948L2988K7464K4957K4795K5793K6822K6636K3669
$$ plain form
49915 1164326 1107676 1056424 1010105 968607 931980 899650 870356 843193 818235 795697 774944
49904 774944 754931 735345 716576 698719 681368 664491 648627 633926 619718 605503 591727
49893 591727 578976 567051 555620 545235 536676 529497 522357 514843 507886 502072 496778 491636 487735
49880 487735 486155 485883 484596 481423 477802 475472 474725 475036 476263 478361 480604 482168 483276 484894 487312
49865 487312 489816 491933 494251 497618 502095 507238 513069 520161 528775 538409 548346 558338 568605 579462
49851 579462 591202 604202 618914 635761 655166 677680 704006 734930 771196 813285 861137
49840 861137 914319 972706 1037021 1108359 1187007 1271611 1359323 1446522 1529628 1605885 1673793
49829 1673793 1732833 1782798 1823746 1856734 1884198 1909155 1933950 1959743 1986565 2013201 2036870
49818B036870J6639N267r721k7073m5271o2722p7980q9834r7327j00128r9056
49807A449664r5691r1105q5364p8476p1216o4373n7699n0528m3294l7444l3614
49796G40860l0784k7663k4262k1491j9629j7984j5968j3904j2537j2088j1962
49785E32588j1306r730p680o124n694o049o202n578m572m025m295n080n914o420
49771D43919o201m996l251k002j812k058j783r42k93j81j62Q9K29j32p52j091
49755D18581r16l45L72Q48P41L17L62J162J932J692M76q31j424j068P2J419K214
49738D25604K248K163K458K595J820N56K8N14R70O47J24L01J028J369Q49q0o21
49721D42573l83L58Q70O22k10r01r12l10M76R99R57L87k77n93n39k86K23J026
$$ plain form
49818 2036870 2053509 2058776 2049055 2021982 1976711 1913989 1836009 1746175 1648848 1548720 1449664
49807 1449664 1353973 1262868 1177504 1099028 1027812 963439 905740 855212 811918 774474 740860
49796 740860 710076 682413 658151 636660 617031 599047 583079 569175 556638 544550 532588
49785 532588 521282 511552 503872 497748 492054 486005 479803 474225 469653 465628 461333 456253 450339 443919
49771 443919 437718 432722 429471 427469 425657 423599 421816 420874 420581 420400 420238 420327 420556 420424 419672 418581
49755 418581 417665 417320 417692 418540 419281 419598 419960 421122 423054 424746 425222 424391 422967 421899 421971 423390 425604
49738 425604 427852 430015 432473 435068 436888 437444 437472 437986 438956 439603 439727 440028 441056 442425 443274 443194 442573
49721 442573 442190 442548 443418 444040 443830 442929 442017 441707 442183 443182 444139 444526 444249 443656 443117 442831 443054 444080
49703D44080J671J648J223J137J410J206J70q81j037m45J49M80Q09J218J460J411
49687D55709J204J009R22R27R15Q23Q61J217J546J292N87K50O29J125J192J104
49671D71312J168R47R2p16n61K42N68J72l4N44J333J525J118O65N33P61J257J789
49653D82715J996J735J268R34Q06P33O28N51N92O51M34j43n40PJ462K754L005
49636D99588K558K309K377K182J610J228J282J301R26M95M98R94J820K804L568
49621E25540L674L288L158L628M204M475M790N517O195O148N553N140N166N427
49607E91903O048P291Q645R029Q232P396P648Q800R838J0277J0476J0894J1491
$$ plain form
49703 444080 445751 447399 448622 449759 451169 452375 452545 451664 450627 450182 450331 450811 451620 452838 454298 455709
49687 455709 456913 457922 458844 459771 460686 461509 462370 463587 465133 466425 467012 467262 467891 469016 470208 471312
49671 471312 472480 473427 473519 472803 472242 472484 473052 473224 473190 473734 475067 476592 477710 478375 478908 479669 480926 482715
49653 482715 484711 486446 487714 488648 489454 490187 490815 491366 491958 492609 493043 492900 492360 492367 493829 496583 499588
49636 499588 502146 504455 506832 509014 510624 511852 513134 514435 515361 515856 516354 517348 519168 521972 525540
49621 525540 529214 532502 535660 539288 543492 547967 552757 558274 564469 570617 576170 581310 586476 591903
49607 591903 597951 605242 613887 622916 631148 638544 646192 654992 664830 675107 685583 696477 707968
$$ [...]
##END NTUPLES=NMR SPECTRUM
##END=
