
##TITLE=AC1365_HAWAS12179_7163953_Rh0BGGhK0Q
##JCAMPDX= 6.0         $$ Bruker NMR JCAMP-DX V2.0
##DATA TYPE= NMR SPECTRUM
##DATA CLASS= NTUPLES
##ORIGIN= BRUKER
##OWNER= Administrator
$$ 1.72 TOPSPIN		Version 2.1
$$ 2013-01-30 02:31:36.221 -0500  Administrator@X
$$ Compression mode = diff/dup
##.OBSERVE FREQUENCY= 400.02188249412
##.OBSERVE NUCLEUS= ^1H
##.ACQUISITION MODE= SIMULTANEOUS (DQD)
##.ACQUISITION SCHEME= undefined
##.AVERAGES= 64
##.DIGITISER RES= 22
##SPECTROMETER/DATA SYSTEM= spect
##.PULSE SEQUENCE= noesygpps1d.comp
##.SOLVENT NAME= COFFEE_meoh
##.SHIFT REFERENCE= INTERNAL, COFFEE_meoh, 1, 14.96227
##AUDIT TRAIL= $$ (NUMBER, WHEN, WHO, WHERE, PROCESS, VERSION, WHAT)
$$ ##TITLE= Audit trail, TOPSPIN		Version 2.1
$$ ##JCAMPDX= 5.01
$$ ##ORIGIN= Bruker BioSpin GmbH
$$ ##OWNER= Administrator
$$ $$ E:\/data/COFFEE/nmr/AC1365_HAWAS12179_7163953_Rh0BGGhK0Q/22/pdata/1/auditp.txt
$$ ##AUDIT TRAIL=  $$ (NUMBER, WHEN, WHO, WHERE, PROCESS, VERSION, WHAT)
(   1,<2013-01-30 02:31:30.284 -0500>,<Administrator>,<X>,<go>,<TOPSPIN 2.1>,
      <created by zg
	started at 2013-01-30 02:20:00.159 -0500,
	POWCHK enabled, PULCHK disabled,
       configuration hash MD5:
       86 BA 57 50 F2 9D 5C 9B 26 00 A9 28 5F 66 2E 89
       data hash MD5: 64K
       1A 88 11 74 65 B2 E6 D8 A2 64 82 2A 0A 66 B7 12>)
(   2,<2013-01-30 02:31:33.362 -0500>,<Administrator>,<X>,<proc1d>,<TOPSPIN 2.1>,
      <Start of raw data processing
       efp LB = 0.3 FT_mod = 6 PKNL = 1 PHC0 = 0 PHC1 = 0 SI = 128K 
       data hash MD5: 128K
       6C 7B BD 69 92 A9 00 B6 7E D4 80 AD CF 18 EC CF>)
(   3,<2013-01-30 02:31:34.393 -0500>,<Administrator>,<X>,<proc1d>,<TOPSPIN 2.1>,
      <pk PHC0 = -77.4646 PHC1 = 0 
       data hash MD5: 128K
       27 67 7B 51 15 4C FD 1B 31 A0 9C C4 6C F5 F9 F9>)
(   4,<2013-01-30 02:31:35.112 -0500>,<Administrator>,<X>,<proc1d>,<TOPSPIN 2.1>,
      <abs ABSG = 1 
       data hash MD5: 128K
       E4 01 CF 99 B8 F2 5E 4B 05 CA C2 4C 89 3C C6 60>)
(   5,<2013-01-30 02:31:35.300 -0500>,<Administrator>,<X>,<proc1d>,<TOPSPIN 2.1>,
      <abs ABSG = 2 
       data hash MD5: 128K
       F8 C5 85 0C C2 C7 F3 3F 73 FE 71 E4 80 C6 0B 53>)
(   6,<2013-01-30 02:31:35.487 -0500>,<Administrator>,<X>,<proc1d>,<TOPSPIN 2.1>,
      <abs ABSG = 3 
       data hash MD5: 128K
       BD AF 45 B8 6F 38 2B A3 04 74 97 A0 A7 AA 9F 8C>)
(   7,<2013-01-30 02:31:35.675 -0500>,<Administrator>,<X>,<proc1d>,<TOPSPIN 2.1>,
      <abs ABSG = 4 
       data hash MD5: 128K
       0A 33 F4 E0 88 8D CE 5A 3C D4 27 D5 F9 D4 42 EB>)
(   8,<2013-01-30 02:31:35.862 -0500>,<Administrator>,<X>,<proc1d>,<TOPSPIN 2.1>,
      <abs ABSG = 5 
       data hash MD5: 128K
       D8 AA 66 DB F3 55 7B 6B 0A 64 4E 8B C4 10 A3 D9>)
$$ ##END=
$$ 
$$ $$ hash MD5
$$ $$ BA 81 9F 4F A3 17 0B B6 28 EE EB 46 56 C4 CB EE
##$RELAX= 
##$RELAX= 
##$RELAX= 
##$RELAX= 
##$RELAX= 
##$RELAX= 
##$RELAX= 
##$RELAX= 
$$ Bruker specific parameters
$$ --------------------------
##$DU= <E:\>
##$EXPNO= 22
$$ [...]
150 150 150 150 150 150 150 150
##$TP07= 0
##$TPNAME0= <>
##$TPNAME1= <>
##$TPNAME2= <>
##$TPNAME3= <>
##$TPNAME4= <>
##$TPNAME5= <>
##$TPNAME6= <>
##$TPNAME7= <>
##$TPOAL= (0..7)
0.5 0.5 0.5 0.5 0.5 0.5 0.5 0.5
##$TPOFFS= (0..7)
0 0 0 0 0 0 0 0
##$TUNHIN= 0
##$TUNHOUT= 0
##$TUNXOUT= 0
##$USERA1= <user>
##$USERA2= <user>
##$USERA3= <user>
##$USERA4= <user>
##$USERA5= <user>
##$V9= 5
##$VALIST= <valist>
##$VCLIST= <CCCCCCCCCCCCCCC>
##$VD= 0
##$VDLIST= <DDDDDDDDDDDDDDD>
##$VPLIST= <PPPPPPPPPPPPPPP>
##$VTLIST= <TTTTTTTTTTTTTTT>
##$WBST= 1024
##$WBSW= 4
##$XGAIN= (0..3)
0 0 0 0
##$XL= 0
##$YL= 0
##$YMAX_a= 8178233
##$YMIN_a= -17287289
##$ZGOPTNS= <>
##$ZL1= 120
##$ZL2= 120
##$ZL3= 120
##$ZL4= 120
##$ABSF1= 14.96227
##$ABSF2= -5.595912
##$ABSG= 5
##$ABSL= 3
##$ALPHA= 0
##$AQORDER= 0
##$ASSFAC= 0
##$ASSFACI= 0
##$ASSFACX= 0
##$ASSWID= 0
##$AUNMP= <proc_prof1d_extract.lims>
##$AXLEFT= 0
##$AXNAME= <>
##$AXNUC= <1H>
##$AXRIGHT= 0
##$AXTYPE= 0
##$AXUNIT= <>
##$AZFE= 0.1
##$AZFW= 0.1
##$BCFW= 0
##$BC_mod= 0
##$BYTORDP= 0
##$COROFFS= 0
##$CY= 15
##$DATMOD= 1
##$DC= 0
##$DFILT= <>
##$DTYPP= 0
##$F1P= 0
##$F2P= 0
##$FCOR= 0.5
##$FTSIZE= 131072
##$FT_mod= 6
##$GAMMA= 0
##$GB= 0
##$INTBC= 1
##$INTSCL= 1
##$ISEN= 128
##$LB= 0.3
##$LEV0= 0
##$LPBIN= 0
##$MAXI= 10000
##$MC2= 0
##$MEAN= 0
##$ME_mod= 0
##$MI= 0
##$NCOEF= 0
##$NC_proc= -2
##$NLEV= 6
##$NOISF1= 0
##$NOISF2= 0
##$NSP= 0
##$NTH_PI= 0
##$NZP= 0
##$OFFSET= 14.96227
##$PC= 1
##$PHC0= -77.4646
##$PHC1= 0
##$PH_mod= 1
##$PKNL= yes
##$PPARMOD= 0
##$PPDIAG= 0
##$PPIPTYP= 0
##$PPMPNUM= 2147483647
##$PPRESOL= 1
##$PSCAL= 4
##$PSIGN= 0
##$PYNMP= <proc.py>
##$REVERSE= no
##$SF= 400.020009127448
##$SI= 131072
##$SIGF1= 0
##$SIGF2= 0
##$SINO= 400
##$SIOLD= 131072
##$SPECTYP= <>
##$SREGLST= <1H.CDCl3>
##$SSB= 0
##$STSI= 131072
##$STSR= 0
##$SW_p= 8223.68421052631
##$SYMM= 0
##$S_DEV= 0
##$TDeff= 65536
##$TDoff= 0
##$TI= <>
##$TILT= no
##$TM1= 0
##$TM2= 0
##$TOPLEV= 0
##$USERP1= <user>
##$USERP2= <user>
##$USERP3= <user>
##$USERP4= <user>
##$USERP5= <user>
##$WDW= 1
##$XDIM= 131072
##$YMAX_p= 412412123
##$YMIN_p= -12114
##$CURPLOT= <Network HP LaserJet P1505>
##$CURPRIN= <$Network HP LaserJet P1505>
##$DFORMAT= <normdp>
##$LAYOUT= <+/1D_H.xwp>
##$LFORMAT= <normlp>
##$PFORMAT= <normpl>
##$SURQMSG= 1
$$ End of Bruker specific parameters
$$ ---------------------------------
##NTUPLES= NMR SPECTRUM
##VAR_NAME=  FREQUENCY,     SPECTRUM/REAL,   SPECTRUM/IMAG
##SYMBOL=    X,             R,               I
##VAR_TYPE=  INDEPENDENT,   DEPENDENT,       DEPENDENT
##VAR_FORM=  AFFN,          ASDF,            ASDF
##VAR_DIM=   131072,        131072,          131072
##UNITS=     HZ,            ARBITRARY UNITS, ARBITRARY UNITS
##FACTOR=    0.0627417313425164, 1,          1
##FIRST=     8223.62146879497, 972,          -72161
##LAST=      0,             4067,            -72451
##MIN=       0,             -12114,          0
##MAX=       8223.62146879497, 412412123,    0
$$ Real data points
##PAGE= N=1
##DATA TABLE= (X++(R..R)), XYDATA
$$ [...]
63286C37646l49k79l32m72m74k91k89o81r81o15J56N46L87K52M97Q83J191J510
63268C38305J731J472P92L43N00Q32Q24O43P18R81J069R89J134J613K077K181
63252C56204J991J957K558L875N344O177O169N921O004O283O308O154O345P193
63238D28483Q614J0477J2567J4270J5010J5144J5743J7140J8344J8390J7820J8055
63226F10057J9555K1277K1995K1542K0639K0064K0145K0688K1131K1016K0464
63215H38573J9960J9659J9321J8808J8139J6980J4741J1434P719L812r11o656
63203I81579j2305j6581j9601k2332k4914k6551k6862k6269k5029k2883j9924
63192G38328j6909j4303j1708q576m975j268K424O107R655J2930J5896J8492K0757
$$ plain form
63286 337646 337297 337018 336686 336214 335740 335449 335160 334479 333498 332883 333039 333585 333972 334224 334721 335604 336795 338305
63268 338305 340036 341508 342300 342643 343143 343975 344799 345442 346160 347141 348210 349199 350333 351946 354023 356204
63252 356204 358195 360152 362710 366585 371929 378106 384275 390196 396200 402483 408791 414945 421290 428483
63238 428483 437097 447574 460141 474411 489421 504565 520308 537448 555792 574182 592002 610057
63226 610057 629612 650889 672884 694426 715065 735129 755274 775962 797093 818109 838573
63215 838573 858533 878192 897513 916321 934460 951440 966181 977615 985334 989146 988235 981579
63203 981579 969274 952693 933092 910760 885846 859295 832433 806164 781135 758252 738328
63192 738328 721419 707116 695408 686832 681857 680589 683013 689120 698775 711705 727601 746093 766850
63179G66850K2949K5095K6496K6557K5986K6257K7612K8563K7906K6261K5053
63168A055585K4681K4523K4059K3139K1515J8930J5549J1614O906J084n581j2314
63156A209690j8482k3853k8401l2297l5799l8759m0535m0732l9683l7851l5203
63145H38095l1733k8079k4988k2482k0198j8145j6475j4730j2267r309o841n370
63133F27478m472l596k733k106j705j371r98n43k1M03N47M19J56j03j55J75P24
63116F12099J000Q00M49K09q5m86n93k40J9k41m55J13J102J506J207J050J424
63099F18878J744J569J310J501J978K246K191K108K273K728L223L303K723J860
63085F49635J444J834K794L876M776N352N627N787N927N925N797N879O339O822
$$ plain form
63179 766850 789799 814894 841390 867947 893933 920190 947802 976365 1004271 1030532 1055585
63168 1055585 1080266 1104789 1128848 1151987 1173502 1192432 1207981 1219595 1226501 1227585 1222004 1209690
63156 1209690 1191208 1167355 1138954 1106657 1070858 1032099 991564 950832 911149 873298 838095
63145 838095 806362 778283 753295 730813 710615 692470 675995 661265 648998 639689 632848 627478
63133 627478 623006 619410 616677 614571 612866 611495 610497 609954 609933 610336 610883 611302 611458 611355 611200 611375 612099
63116 612099 613099 613899 614348 614557 614472 613986 613393 613153 613172 612931 612476 612589 613691 615197 616404 617454 618878
63099 618878 620622 622191 623501 625002 626980 629226 631417 633525 635798 638526 641749 645052 647775 649635
63085 649635 651079 652913 655707 659583 664359 669711 675338 681125 687052 692977 698774 704653 710992 717814
63071G17814P040P390Q400R819J0892J1423J1870J2490J3093J3661J4488J5595
63059H53975J6645J7549J8592J9831K0965K1900K3012K4605K6563K8683L0950
63048A103270L3359L5796L8130M0154M1489M1915M1749M1527M1419M1335M1387
63037A541530M1760M2275M2665M3090M3816M4554M4747M4349M3540M1887L8613
63026B012826L3671K7704K0866J2626K844p722j8217k8239l7421m5245n1494n6170
63014A866029n8883n9121n7242n4291n0687m6010m0317l4499k8908k2754j5553
63003A397764q163j606M278J0136J5852K0909K5376K9611L3431L6502L9078M1517
62991A644685M3473M4452M4859M5473M6144M5988M4811M3341M1933L9852L6162
$$ plain form
63071 717814 724854 732244 740644 750463 761355 772778 784648 797138 810231 823892 838380 853975
63059 853975 870620 888169 906761 926592 947557 969457 992469 1017074 1043637 1072320 1103270
63048 1103270 1136629 1172425 1210555 1250709 1292198 1334113 1375862 1417389 1458808 1500143 1541530
63037 1541530 1583290 1625565 1668230 1711320 1755136 1799690 1844437 1888786 1932326 1974213 2012826
63026 2012826 2046497 2074201 2095067 2107693 2110537 2102815 2084598 2056359 2018938 1973693 1922199 1866029
63014 1866029 1807146 1748025 1690783 1636492 1585805 1539795 1499478 1464979 1436071 1413317 1397764
63003 1397764 1389601 1387995 1392273 1402409 1418261 1439170 1464546 1494157 1527588 1564090 1603168 1644685
62991 1644685 1688158 1732610 1777469 1822942 1869086 1915074 1959885 2003226 2045159 2085011 2121173
62980B121173L0640K3565J5135N454n216j6479k7971l9430n0670o1367p0704p7572
62968A846558q1483q3144q3641q3199q1242p7581p2934o8182o3553n8829n4005
62957A038765m9423m5353m1687l8079l4280l0388k6800k3978k2140k1065k0122
62946F85450j8719j6818j4934j3450j2199j0955j0001r690r629r021p864p079
62934E45091p189p579p409o742o245o234o506o774o842o569o074n711n509m947
62920D54761l692k259j467j460j708j800j767j723j652j560j534j638j885k240
62906D28376k476k289j730j328j473j928k185k053j644j077n80m93q25j003n54
62891D06738J92M96J81l02o46j022j620k304k827l007k693j906j075p78j125j624
$$ plain form
62980 2121173 2151813 2175378 2190513 2195967 2190751 2174272 2146301 2106871 2056201 1994834 1924130 1846558
62968 1846558 1765075 1681931 1598290 1515091 1433849 1356268 1283334 1215152 1151599 1092770 1038765
62957 1038765 989342 943989 902302 864223 829943 799555 772755 748777 726637 705572 685450
62946 685450 666731 649913 634979 621529 609330 598375 588374 578684 569055 560034 552170 545091
62934 545091 537902 530323 522914 516172 509927 503693 497187 490413 483571 477002 470928 465217 459708 454761
62920 454761 451069 448810 447343 445883 444175 442375 440608 438885 437233 435673 434139 432501 430616 428376
62906 428376 425900 423611 421881 420553 419080 417152 414967 412914 411270 410193 409613 409120 408295 407292 406738
62891 406738 406930 407426 407607 407305 406659 405637 404017 401713 398886 395879 393186 391280 390205 389427 388302 386678
62875C86678j808j736j672j556j080l01J45k69j147j495r95m91p81j375j213m05
62859C70499k30j237k371k554k189k235k518k097j021m54r57j730j895j704j812
62844C45495k072j768q22%R4l49q20j123j262j122o36j56j41n09p02m97l09m75
62826C32826o71m22J86P09R93J155J196J085J005R95O49k18q55m25O55J159Q58
62809C40880Q34J781L016L648L729L736L740L785M315N517O802P634Q269R059
62795D06745R620R520R264R743J1046J2662J4489J6722J9003K0655K1813K3429
62783E84711K6008K9067L1996L4819L7869M1197M4616M8088N1872N6302O1355
62772A047900O6388P0514P3430P5526P6975P7141P5203P1026O4953N7110M7385
$$ plain form
62875 386678 384870 383134 381462 379906 378826 378525 378670 378401 377254 375759 374764 374273 373492 372117 370904 370499
62859 370499 370269 369032 366661 364107 361918 359683 357165 355068 354047 353593 352636 350906 349011 347307 345495
62844 345495 343423 341655 340833 340833 340927 340578 339758 338635 337373 336251 335615 335459 335318 334809 334107 333610 333301 332826
62826 332826 332155 331733 331919 332628 333621 334776 335972 337057 338062 339057 339706 339488 338633 338208 338863 340022 340880
62809 340880 341714 343495 346511 350159 353888 357624 361364 365149 369464 374981 381783 389417 397686 406745
62795 406745 416365 425885 435149 444892 455938 468600 483089 499811 518814 539469 561282 584711
62783 584711 610719 639786 671782 706601 744470 785667 830283 878371 930243 986545 1047900
62772 1047900 1114288 1184802 1258232 1333758 1410733 1487874 1563077 1634103 1699056 1756166 1803551
62761A803551L5848K2735Q384o442k0520l3029m4134n4185o2761o9107p3170p5496
62749A431674p6376p5795p4047p1601o8471o4506o0155n6176n2523m8333m3213
62738G40478l7900l3406k9946k6993k4101k1413j9445j8312j7256j5283j2454
62727D83969r998q785q205p059n118l137j729r35n38j09R30K540L779M052M231
62712D53888N617Q100J0446J2109J3626J5358J7096J8973K1566K4808K7890L0544
62700F60021L3459L7099M1125M5241M9798N5008O0470O5867P1330P6723Q1323
62689A277464Q4622Q6771Q7771Q7051Q4161P9170P1914O1776M8708L3761J8000
62678B021169J674j4998l1031m5453n8219o9497p8672q4944q8506r0193r0268
$$ plain form
62761 1803551 1839399 1862134 1870518 1864076 1843556 1810527 1766393 1712208 1649447 1580340 1507170 1431674
62749 1431674 1355298 1279503 1205456 1133855 1065384 1000878 940723 884547 832024 783691 740478
62738 740478 702578 669172 639226 612233 588132 566719 547274 528962 511706 496423 483969
62727 483969 473971 465186 456981 449922 444804 441667 439938 439003 438465 438356 439286 441826 445605 449657 453888
62712 453888 459505 467605 478051 490160 503786 519144 536240 555213 576779 601587 629477 660021
62700 660021 693480 730579 771704 816945 866743 921751 982221 1048088 1119418 1196141 1277464
62689 1277464 1362086 1448857 1536628 1623679 1707840 1787010 1858924 1920700 1969408 2003169 2021169
62678 2021169 2022843 2007845 1976814 1931361 1873142 1803645 1724973 1640029 1551523 1461330 1371062
62667A371062q8395q4681p9918p4807o9599o4429n9397n4355m9164m4209m0063
62656F62045l6628l3113k9093k5142k2127k0164j8539j6637j4645j3225j2599
62645D20133j2248j1561j0528r502q633p927p551p481p088n802m154l358l736
62632C20564m371m474m252m083l745l032k365k123j951j466j037j185j587j484
62618B83409p98j17K22M15O99J194K012L022L673L614L309L481M147M821N391
62603C18494O105O844P216P431Q329J0305J2761J4905J6614J8268K0164K2370
62591D69806K4894K7737L0805L3859L6512L8357L9333L9797L9958L9343L7203
62580H57604L3349K8220K2242J5544Q279P74o686j3826k0102k4970k8600l1758
$$ plain form
62667 1371062 1282667 1197986 1118068 1043261 973662 909233 849836 795481 746317 702108 662045
62656 662045 625417 592304 563211 538069 515942 495778 477239 460602 445957 432732 420133
62645 420133 407885 396324 385796 376294 367661 359734 352183 344702 337614 331812 327658 324300 320564
62632 320564 316193 311719 307467 303384 299639 296607 294242 292119 290168 288702 287665 286480 284893 283409
62618 283409 282611 282494 282716 283131 283830 285024 287036 290058 293731 297345 300654 304135 308282 313103 318494
62603 318494 324599 331443 338659 346090 354419 364724 377485 392390 409004 427272 447436 469806
62591 469806 494700 522437 553242 587101 623613 661970 701303 741100 781058 820401 857604
62580 857604 890953 919173 941415 956959 965238 966012 959326 945500 925398 900428 871828 840070
62568H40070l4752l6922l7569l6905l5671l4170l2289l0153k8115k6034k3370
62557D84120k0123j7113j4972j3386j1821j0488r927r918r602q674p678o984o233
62544C37201n200m415m357m495l871k401r76l50m71q01q05j89Q46J699K127K724
62528C16266M111N925P203P697P954Q212Q178Q047Q760J0748J3181J5094J6618
62515D37994J8598K1364K4506K7517L0217L2697L5276L8233M1310M3737M5064
62504G96513M5632M5900M5610M3986M0545L5438K9149K2156J4612O195l374j3473
62492A108889k2709l0152l6034m0898m4560m6414m6357m4836m2271l9014l5604
62481F80040l2555k9904k7363k4834k2390j9966j7462j5049j3025j1493j0456
$$ plain form
62568 840070 805318 768396 730827 693922 658251 624081 591792 561639 533524 507490 484120
62557 484120 463997 446884 431912 418526 406705 396217 386290 376372 366770 358096 350418 343434 337201
62544 337201 332001 327586 323229 318734 314863 312462 311486 311136 310665 309864 309059 308870 309716 311415 313542 316266
62528 316266 320377 326302 333505 341202 349156 357368 365546 373593 382353 393101 406282 421376 437994
62515 437994 456592 477956 502462 529979 560196 592893 628169 666402 707712 751449 796513
62504 796513 842145 888045 933655 977641 1018186 1053624 1082773 1104929 1119541 1125736 1122362 1108889
62492 1108889 1086180 1056028 1019994 979096 934536 888122 841765 796929 754658 715644 680040
62481 680040 647485 617581 590218 565384 542994 523028 505566 490517 477492 465999 455543
62470D55543r988r928r672q769p491o441n703m892l920l193k998l097l012k495
62456C73944j626o55K71J211K184K837K782K304K232K826L325L006K244J954K353
62441D01192K857K947K521J555J02j499k860l982n006n760o026o081o388o870
62427C66702p060o881o637o370n784m862l890k887j643l60L82M73M97R25J607
62412C24212K196K611K838K846K890L456M607N825O721P515Q492R417R835R694
62398D03155R321R047R056R368R728R691R017P832O333M632L014J871J139J74
62384D93378j427l218m478n084n341n229m399k908j365j93Q11K105L885O104Q615
62369D81256J1151J3461J5735J8520K1904K5164K7673K9913L2976L7124M1522
$$ plain form
62470 455543 445555 435627 425955 417186 409695 403254 397551 392659 388739 385546 382548 379451 376439 373944
62456 373944 372318 371663 371934 373145 375329 378166 380948 383252 385484 388310 391635 394641 396885 398839 401192
62441 401192 404049 406996 409517 411072 411174 409675 406815 402833 397827 392067 386041 379960 373572 366702
62427 366702 359642 352761 346124 339754 333970 329108 325218 322331 320688 320328 320710 321183 321680 322605 324212
62412 324212 326408 329019 331857 334703 337593 341049 345656 351481 358202 365717 374209 383626 393461 403155
62398 403155 412476 421523 430579 439947 449675 459366 468383 476215 482548 487180 490194 492065 493204 493378
62384 493378 491951 488733 484255 479171 473830 468601 464202 461294 459929 459736 460547 462652 466537 472641 481256
62369 481256 492407 505868 521603 540123 562027 587191 614864 644777 677753 714877 756399
62358G56399M5525M9444N3622N7370N9552N9861N8859N6813N3243M7661M0197
62347A338546L1410K1964J2626L991m004j1834j9585k6751l2994l8449m3115m6566
62335A185239m8680n0039n1058n1151m9474m6142m2176l8363l4763l1185k7590
62324G14618k4001k0531j7504j5187j3408j1782j0282r158q338p269n554l407
62312E68197j410M9J057J994L077M021M251L563K437J539J098Q34K79r39k829
62297E87218m799n998o166n909n877n988n715m843l645k560j964j953k061j555
62283E28185l52Q16J439J903K594L022K646K141K750M498O047O488O433P054Q712
62268E84376J0841J2704J3968J4947J6472J9191K2835K6445K9475L2317L5712
$$ plain form
62358 756399 801924 851368 904990 962360 1021912 1081773 1140632 1197445 1250688 1298349 1338546
62347 1338546 1369956 1391920 1404546 1408537 1404533 1392699 1373114 1346363 1313369 1274920 1231805 1185239
62335 1185239 1136559 1086520 1035462 984311 934837 888695 846519 808156 773393 742208 714618
62324 714618 690617 670086 652582 637395 623987 612205 601923 592765 584427 577158 571604 568197
62312 568197 566787 566836 567893 569887 572964 576985 581236 584799 587236 588775 589873 590707 590986 590047 587218
62297 587218 582419 576421 570255 564346 558469 552481 546766 541923 538278 535718 533754 531801 529740 528185
62283 528185 527833 528649 530088 531991 534585 537607 540253 542394 545144 549642 555689 562177 568610 575664 584376
62268 584376 595217 607921 621889 636836 653308 672499 695334 721779 751254 783571 819283
62257H19283L9874M4363M8537N2028N4806N6791N7410N5828N1743M5596L7837
62246A364096K8549J8120P671j816j0362j8273k5162l0408l4271l7501m0242m2216
62234A178185m3701m5037m5405m3443l9331l4926l1528k8671k5558k2409j9694
62223G98482j7126j4292j1505r215p238n299l678k559j451k2J109J327J155J532
62209G31220K328K710K660L035M186N531O615P614Q569R050R002R310J0894J3574
62195H26298J6260J8074J9032J9777K0919K2526K4109K5129K5574K5945K6671
62184A070314K7597K8091K7528K5677K2716J8939J4503R598M828J098j096k059
62172A247734k280j575P56M935J0241J5711K1036K6410L1672L5980L8537L9348
$$ plain form
62257 819283 859157 903520 952057 1004085 1058891 1115682 1173092 1228920 1280663 1326259 1364096
62246 1364096 1392645 1410765 1418436 1416620 1406258 1387985 1362823 1332415 1298144 1260643 1220401 1178185
62234 1178185 1134484 1089447 1044042 1000599 961268 926342 894814 866143 840585 818176 798482
62223 798482 781356 767064 755559 746344 739106 733807 730129 727570 726119 726097 727206 728533 729688 731220
62209 731220 733548 736258 738918 741953 746139 751670 758285 765899 774468 783518 792520 801830 812724 826298
62195 826298 842558 860632 879664 899441 920360 942886 966995 992124 1017698 1043643 1070314
62184 1070314 1097911 1126002 1153530 1179207 1201923 1220862 1235365 1244963 1249791 1250889 1249793 1247734
62172 1247734 1245454 1243879 1244635 1249570 1259811 1275522 1296558 1322968 1354640 1390620 1429157 1468505
62160A468505L8949L7495L4580L0049K4593J9208J4339R908N948K693O6k462n351
62147A678520q582j1821j4647j6608j7396j7174j6443j5473j4016j1744q746n555
62135A520315k827r19M42K042M381O971Q784R416R490R875J0869J2188J3420J4273
62121A618720J4757J5291J6287J7587J8566J8966J9255K0002K1201K2382K3157
62110A826171K3440K3384K3282K3317K3380K3339K3397K3889K4787K5784K6937
62099B091107K8613L0768L2709L3768L3684L2330K9715K6636K4577K4420K5627
62088B413954K7201K8962L1262L3736L5109L4405L2001K9386K8055K8548L0305
62077B752924L2327L3992L5172L5750L5438L4166L2285L0273K8458K7047K5995
$$ plain form
62160 1468505 1507454 1544949 1579529 1609578 1634171 1653379 1667718 1677626 1683574 1686267 1686333 1683871 1678520
62147 1678520 1669938 1658117 1643470 1626862 1609466 1592292 1575849 1560376 1546360 1534616 1525870 1520315
62135 1520315 1517488 1516569 1517011 1519053 1523434 1530405 1539189 1548605 1558095 1567970 1578839 1591027 1604447 1618720
62121 1618720 1633477 1648768 1665055 1682642 1701208 1720174 1739429 1759431 1780632 1803014 1826171
62110 1826171 1849611 1872995 1896277 1919594 1942974 1966313 1989710 2013599 2038386 2064170 2091107
62099 2091107 2119720 2150488 2183197 2216965 2250649 2282979 2312694 2339330 2363907 2388327 2413954
62088 2413954 2441155 2470117 2501379 2535115 2570224 2604629 2636630 2666016 2694071 2722619 2752924
62077 2752924 2785251 2819243 2854415 2890165 2925603 2959769 2992054 3022327 3050785 3077832 3103827
62066C103827K4794K2854K0323J8069J6631J5648J4412J2546R896O328K044k374
62054C264998o546j0570j4498j8016k0951k3592k6175k8572l0777l3066l5255
62043C016980l6572l6736l6505l6455l5903l3902l0746k7616k5127k3053k1085
62032B673280j8982j6314j3080j0335r189r299r370r077r409j0990j3176j5021
62020B529038j6218j6861j7150j7648j8882k0318k0616j9392j7886j7281j7077
62009B329709j5946j3594j0945q759o921m946k671l67J459K434K724K839K832
61996B277848K009k09l532p401j1921j7533k3885k9775l4339l7705m0277m1979
61984B031301m2491m1865m0440l8371l5698l2759l0104k7944k6018k4142k2569
$$ plain form
62066 3103827 3128621 3151475 3171798 3189867 3206498 3222146 3236558 3249104 3259000 3265328 3267372 3264998
62054 3264998 3258452 3247882 3233384 3215368 3194417 3170825 3144650 3116078 3085301 3052235 3016980
62043 3016980 2980408 2943672 2907167 2870712 2834809 2800907 2770161 2742545 2717418 2694365 2673280
62032 2673280 2654298 2637984 2624904 2614569 2605380 2596081 2586711 2577634 2568225 2557235 2544059 2529038
62020 2529038 2512820 2495959 2478809 2461161 2442279 2421961 2401345 2381953 2364067 2346786 2329709
62009 2329709 2313763 2300169 2289224 2280465 2273544 2268598 2265927 2265560 2267019 2269453 2272177 2275016 2277848
61996 2277848 2279857 2279648 2276116 2268715 2256794 2239261 2215376 2185601 2151262 2113557 2073280 2031301
61984 2031301 1988810 1946945 1906505 1868134 1832436 1799677 1769573 1741629 1715611 1691469 1668900
61973A668900k1501k0569j9182j7386j5881j5124j4807j4412j3909j3469j2891
61962A489769j1801j0332r016q011o962n713m633l954l271k056l41J534L557N951
61948A434721Q642J1361J4230J7669K1578K5170K7949L0493L3728L7645M1195
61937A704381M3501M4650M5190M5256M4640M3426M2089M0940L9819L8414L6656
61926B168962L4615L2264K9589K6880K4728K3745K4332K6686L0936L7209M5592
61915B505538N5960O7917Q0982R4931J09932J26238J43718J61675J79212J95878
61905C721981K12035K28615K46488K66070K87485L10716L35420L60621L84710
61896F354141M05557M20371M25541M16933L90591L43340K73452J81770P2886m4985
$$ plain form
61973 1668900 1647399 1626830 1607648 1590262 1574381 1559257 1544450 1530038 1516129 1502660 1489769
61962 1489769 1477968 1467636 1458620 1450609 1443647 1437934 1433301 1429347 1426076 1424020 1423679 1425213 1428770 1434721
61948 1434721 1443363 1454724 1468954 1486623 1508201 1533371 1561320 1591813 1625541 1663186 1704381
61937 1704381 1747882 1792532 1837722 1882978 1927618 1971044 2013133 2054073 2093892 2132306 2168962
61926 2168962 2203577 2235841 2265430 2292310 2317038 2340783 2365115 2391801 2422737 2459946 2505538
61915 2505538 2561498 2629415 2710397 2805328 2915260 3041498 3185216 3346891 3526103 3721981
61905 3721981 3934016 4162631 4409119 4675189 4962674 5273390 5608810 5969431 6354141
61896 6354141 6759698 7180069 7605610 8022543 8413134 8756474 9029926 9211696 9284582 9239597
61886I239597j61954k69007l59520m29285m76143n00244n04479m93742m72781
61877E572442m44481m10426l72845l35066k99793k67615k37831k10140j84867
61868B809378j62129j41708j23624j07863r3651p9923o6591n4518m4059l4501
61858A900811k5117j5915p002J933J0989J9616K7356L4387M0777M5826M8860N0147
61846B132668N0377M9513M6884M2151L5593K7591J8416Q551j232j0076j7141k1754
61834B361541k3687k3128k0180j4804p549J94P160J3067J7930K0933K0778J7062
61822B369317J0700K863n996j5899k6501l6723m5272n1493n5698n8397n9354n7944
61810A969603n4435n0134m5871m0973l4359k6169j7661r857l017K937Q242J3497
$$ plain form
61886 9239597 9077643 8808636 8449116 8019831 7543688 7043444 6538965 6045223 5572442
61877 5572442 5127961 4717535 4344690 4009624 3709831 3442216 3204385 2994245 2809378
61868 2809378 2647249 2505541 2381917 2274054 2180403 2100480 2033889 1979371 1935312 1900811
61858 1900811 1875694 1859779 1852777 1854710 1865699 1885315 1912671 1947058 1987835 2033661 2082521 2132668
61846 2132668 2183045 2232558 2279442 2321593 2357186 2384777 2403193 2411744 2410512 2400436 2383295 2361541
61834 2361541 2337854 2314726 2294546 2279742 2272193 2272387 2279547 2292614 2310544 2331477 2352255 2369317
61822 2369317 2380017 2382880 2376884 2360985 2334484 2297761 2252489 2200996 2145298 2086901 2027547 1969603
61810 1969603 1915168 1865034 1819163 1778190 1743831 1717662 1700001 1690144 1687127 1690064 1698306 1711803
61798A711803J9308K5603L1755L7354M2524M7576N2824N8661O5399P3017Q1276
61787B247100R0027R9224J08996J19935J32951J48416J65831J84744K05638K29415
61777C732277K56352K86161L18865L55032L95247M39741M88287N40075N93967
61768G406004O48998P03995P56006P99540Q27940Q35014Q14909P61508O69679
61759A4223593N37710L68637J70330m4533k59418m57249o24381p52276q37176
61750A2325237q80036q86556q65168q23843p68934p06246o41346n78204n18636
61741E656268m63508m13453l68309l27253k90156k57878k30585k06842j85056
61732B913228j64982j47140j31585j17944j05924r5063q4613p4425o5371n8213
$$ plain form
61798 1711803 1731111 1756714 1788469 1825823 1868347 1915923 1968747 2027408 2092807 2165824 2247100
61787 2247100 2337127 2436351 2545347 2665282 2798233 2946649 3112480 3297224 3502862 3732277
61777 3732277 3988629 4274790 4593655 4948687 5343934 5783675 6271962 6812037 7406004
61768 7406004 8055002 8758997 9515003 10314543 11142483 11977497 12792406 13553914 14223593
61759 14223593 14761303 15129940 15300270 15255737 14996319 14539070 13914689 13162413 12325237
61750 12325237 11445201 10558645 9693477 8869634 8100700 7394454 6753108 6174904 5656268
61741 5656268 5192760 4779307 4410998 4083745 3793589 3535711 3305126 3098284 2913228
61732 2913228 2748246 2601106 2469521 2351577 2245653 2150590 2065977 1991552 1926181 1867968
61722A867968n2612m7919m4329m2384m1771m1473m1000m0713m1015m1706m2096
61711A390950m1468l9554l6816l4052l1536k8901k5961k3172k1033j9477j8232
61700A070748j7272j6584j5944j5268j4706j4206j3527j2905j2998j3757j4128
61689I09453j3431j2310j1710j1578j1372j1125j1103j0946j0168r181q822r097
61677G78610r289r139q917q513p486o091n188m945m544l482k329j765j639j563
61663G03720j735k505l451l636k770j619j144j461j764j185L55K117L355M008
61649F92285M477M946N249N340N451N653N606M954L740K256O25j119k756l971
61635G32736m735n278n549n028l387j187N17J357K082L568N697P510Q259Q012
$$ plain form
61722 1867968 1815356 1767437 1723108 1680724 1638953 1597480 1556480 1515767 1474752 1433046 1390950
61711 1390950 1349482 1309928 1273112 1239060 1207524 1178623 1152662 1129490 1108457 1088980 1070748
61700 1070748 1053476 1036892 1020948 1005680 990974 976768 963241 950336 937338 923581 909453
61689 909453 896022 883712 872002 860424 849052 837927 826824 815878 805710 796529 787707 778610
61677 778610 769321 760182 751265 742752 735266 729175 723987 719042 714498 711016 708687 706922 705283 703720
61663 703720 701985 699480 696029 692393 689623 688004 686860 685399 683635 682450 682805 684922 688277 692285
61649 692285 696762 701708 706957 712297 717748 723401 729007 733961 737701 739957 740582 739463 736707 732736
61635 732736 728001 722723 717174 712146 708759 707572 708089 709446 711528 715096 720793 728303 736562 744574
61621G44574P224O130M534K047j456n445q942j1345j2872j3958j4516j4273j3488
61608F68214j2746j2122j1243j0133r222q532p592o412n691n725n844n359m435
61595E63158l591k922k377k157k240k021j063J84R91J335J631J961K213K628L377
61580E61107M024M213M629O186Q416R758R689R470J0411J2351J4346J6049J7627
61567F88276J8981J9890K0667K1803K3106K3836K3717K3188K2566K1649K0372
61556I28051J9215J8527J7904J6824J5610J5101J5412J5664J5090J3810J2258
61545A103466J0467Q371O374M951L863K372J73k402n007p610j0120j2248j3838
61532A088812j4966j5585j5451j4437j2651j0210p323m479k100J9K413N101P671
$$ plain form
61621 744574 751798 757928 762462 764509 763053 757608 748666 737321 724449 710491 695975 681702 668214
61608 668214 655468 643346 632103 621970 612748 604216 596624 590212 584521 578796 572952 567593 563158
61595 563158 559567 556645 554268 552111 549871 547850 546787 546971 547962 549297 550928 552889 555102 557730 561107
61580 561107 565131 569344 573973 580159 588575 598333 608022 617492 627903 640254 654600 670649 688276
61567 688276 707257 727147 747814 769617 792723 816559 840276 863464 886030 907679 928051
61556 928051 947266 965793 983697 1000521 1016131 1031232 1046644 1062308 1077398 1091208 1103466
61545 1103466 1113933 1122304 1128678 1133629 1137492 1139864 1140037 1137635 1132628 1125018 1114898 1102650 1088812
61532 1088812 1073846 1058261 1042810 1028373 1015722 1005512 998189 993710 991610 991629 994042 999143 1006814
61519A006814J0223J3483J7687K2105K6048K9810L4146L9335M5151N1336N7717
61508A353855O4287P1504Q0028Q9758R9717J09339J19259J30247J41858J52843
61498B412695J62419J70319J75788J77381J73714J63897J47443J24436R5785O2917
61488C866794K7425q569m2171p0843r3788j11642j24862j33116j36219j34810
61478C038199j29853j22158j12593j02157r1462q0585o9682n9283m9708m0644
61468B180074l1694k3043j5130p921r63N880J2127J7235K1283K4914K8646L2368
61456B243776L5599L8121M0188M2059M3564M4312M4171M3384M2363M1492M1023
61445B700052M0980M1219M1659M2205M2417M1665L9861L7570L5089L1812K7183
$$ plain form
61519 1006814 1017037 1030520 1048207 1070312 1096360 1126170 1160316 1199651 1244802 1296138 1353855
61508 1353855 1418142 1489646 1569674 1659432 1759149 1868488 1987747 2117994 2259852 2412695
61498 2412695 2575114 2745433 2921221 3098602 3272316 3436213 3583656 3708092 3803877 3866794
61488 3866794 3894219 3885650 3843479 3772636 3678848 3567206 3442344 3309228 3173009 3038199
61478 3038199 2908346 2786188 2673595 2571438 2479976 2399391 2329709 2270426 2220718 2180074
61468 2180074 2148380 2125337 2110207 2102286 2101323 2107203 2119330 2136565 2157848 2182762 2211408 2243776
61456 2243776 2279375 2317496 2357684 2399743 2443307 2487619 2531790 2575174 2617537 2659029 2700052
61445 2700052 2741032 2782251 2823910 2866115 2908532 2950197 2990058 3027628 3062717 3094529 3121712
61434C121712K1899J7390J4140J1267P915M295J036j901n003q303j1311j3837
61422C159299j6308j9101k1920k4094k5400k6217k6915k7388k7282k6460k4932
61411B893282k2558j9313j5869j3446j2724j3100j3321j2787j2071j2299j4054
61400B731740j6850j9490k0966k1099k0261j8692j6325j3094r015l887K672J0716
61388B585449J9909L0039M1197N3298O5872P8619R1801J05720J20133J34503J48492
61377C475032J61886J74240J84831J92709J96579J95021J87184J73032J52711
61368E093225J26256R4416N9327K3650j0818m3225p2656r7828j17973j33535j45726
61357D775113j55461j62743j66976j67925j66354j63465j59663j54360j47130
$$ plain form
61434 3121712 3143611 3161001 3175141 3186408 3194323 3198618 3199654 3197753 3192750 3184447 3173136 3159299
61422 3159299 3142991 3123890 3101970 3077876 3052476 3026259 2999344 2971956 2944674 2918214 2893282
61411 2893282 2870724 2851411 2835542 2822096 2809372 2796272 2782951 2770164 2758093 2745794 2731740
61400 2731740 2714890 2695400 2674434 2653335 2633074 2614382 2598057 2584963 2575948 2572061 2574733 2585449
61388 2585449 2605358 2635397 2676594 2729892 2795764 2874383 2966184 3071904 3192037 3326540 3475032
61377 3475032 3636918 3811158 3995989 4188698 4385277 4580298 4767482 4940514 5093225
61368 5093225 5219481 5313897 5373224 5396874 5386056 5342831 5270175 5172347 5054374 4920839 4775113
61357 4775113 4619652 4456909 4289933 4122008 3955654 3792189 3632526 3478166 3331036
61348C331036j38534j29453j20170j10635j01185r2299q3905p5572o7314n9567
61338B352402n2522m5940l9592l3317k6754j9558j1926m481K424Q859J4872K0274
61326B164741K4868K8533L1183L2915L4118L5058L5472L5031L3943L2632L0960
61315B519454K8479K5470K2976K1543K0427J8466J5357J1688P931L887q23o028
61303B688827j1024j5261j8775k1764k4043k5283k5678k5917k6432k7105k7830
61292B439715k8765k9848l0529l0408k9707k8771k7469k5477k2825j9800j6635
61281B149481j3603j0975q627o139l676k155k042k581k827k876l300l905l994
61268B082781l499k858j883K24L551O978R257J0072R939R509R151Q908Q871R621
$$ plain form
61348 3331036 3192502 3063049 2942879 2832244 2731059 2638760 2554855 2479283 2411969 2352402
61338 2352402 2299880 2253940 2214348 2181031 2154277 2134719 2122793 2118312 2120736 2129595 2144467 2164741
61326 2164741 2189609 2218142 2249325 2282240 2316358 2351416 2386888 2421919 2455862 2488494 2519454
61315 2519454 2547933 2573403 2596379 2617922 2638349 2656815 2672172 2683860 2691791 2695678 2694855 2688827
61303 2688827 2677803 2662542 2643767 2622003 2597960 2572677 2546999 2521082 2494650 2467545 2439715
61292 2439715 2410950 2381102 2350573 2320165 2290458 2261687 2234218 2208741 2185916 2166116 2149481
61281 2149481 2135878 2124903 2116276 2110137 2106461 2104306 2102264 2099683 2096856 2093980 2090680 2086775 2082781
61268 2082781 2079282 2076424 2074541 2074765 2078316 2085294 2094551 2104623 2114562 2124071 2133222 2142130 2151001 2160622
61254B160622J1983J6085K1153K6669L3175M1341N0639N9730O7775P4538P9544
61243B643254Q2019Q1537P7823P0138N7694M0790K0736j256k4419m7669o9423
61232B931224q8237j03122j13241j18135j18356j15208j09797j02803r4921q6832
61222A880572p8706p0511o2658n5710m9552m3805l8825l5291l2795k9935k6141
61211A356643k2303j9209j6299j2538p939l476L8K699N285Q594J2709J6856K0115
61198A341175K2161K2962K2196J9656J6019J2417R315O534M176K639J708N93r91
61185A480560k656m334o543r386j2158j4241j5708j6816j7571j8080j8594j9034
61173A325439j9094j8987j9382k0423k1534k2306k2857k3142k2779k1796k0839
$$ plain form
61254 2160622 2172605 2188690 2209843 2236512 2269687 2311028 2361667 2421397 2489172 2563710 2643254
61243 2643254 2725273 2806810 2884633 2954771 3012465 3053255 3073991 3072735 3048316 3000647 2931224
61232 2931224 2842987 2739865 2626624 2508489 2390133 2274925 2165128 2062325 1967404 1880572
61222 1880572 1801866 1731355 1668697 1612987 1563435 1519630 1480805 1445514 1412719 1382784 1356643
61211 1356643 1334340 1315131 1298832 1286294 1278355 1274879 1274917 1277616 1282901 1291495 1304204 1321060 1341175
61198 1341175 1363336 1386298 1408494 1428150 1444169 1456586 1465901 1472435 1476611 1479250 1480958 1481551 1480560
61185 1480560 1477904 1473570 1467027 1457641 1445483 1431242 1415534 1398718 1381147 1363067 1344473 1325439
61173 1325439 1306345 1287358 1267976 1247553 1226019 1203713 1180856 1157714 1134935 1113139 1092300
61162A092300k0282j9821j9147j8317j7212j5435j3008j0625q927q165q545j0168
61150I22648j2530j4862j7134j9798k2450k3758k3071k1133j8946j6742j4462
61139G17762j2245j0080p781n648m265l330j733P53K902L764M002M775O172P549
61125G02597Q616R429R879R908R850R970J0168J0421J0905J1353J1062J0019R161
61112H33338R016Q923Q191P139O238N032K851m2k835n279p564r490j0571j0740
61098H34207j0388r877r392r038q680q029p153o540o497o914p636q494q935q492
61084G18142p701p586q068q019p129o423o465o380n468m475m209m037k988j503
61070F37691p64q91j015p67n45n93p56r65j171j054m37K79P32J197K027K879L244
$$ plain form
61162 1092300 1072018 1052197 1033050 1014733 997521 982086 969078 958453 949526 941361 932816 922648
61150 922648 910118 895256 878122 858324 835874 812116 789045 767912 748966 732224 717762
61139 717762 705517 695437 687656 682008 677743 674413 672680 673433 676335 680099 684101 688876 695048 702597
61125 702597 711213 720642 730521 740429 750279 760249 770417 780838 791743 803096 814158 824177 833338
61112 833338 842354 851277 859468 866607 872845 877877 880728 880686 877851 872572 865008 855518 844947 834207
61098 834207 823819 813942 804550 795512 786832 778803 771650 765110 758613 751699 744063 735569 726634 718142
61084 718142 710441 702855 694787 686768 679639 673216 666751 660371 654903 650428 646219 642182 639194 637691
61070 637691 636927 636036 635021 634254 633709 633116 632360 631395 630224 629170 628733 629012 629744 630941 632968 635847 639091
61053F39091L336L766M553N108N002M304L405K891L204M084M809N201N917P395
61039G02066R107J0226J0521J0374J0307J0733J1554J2019J1640J1157J1678J2986
61027H34368J3875J4084J4500J5378J5979J6291J7329J9180K0555K0992K1710
61016A024241K3362K4775K5116K5651K7919L1600L5501L9325M3100M6146M8059
61005A394795M9690N2072N5417O0091O7111P6720Q7942J00452J15172J32275J50675
60994B342412J70409J93179K19656K49453K84959L31424L91185M62110N44553
60985E189340O45053P69748R20128J100339J319896J577370J845600K085893K271540
60976A7724907K375205K330439K041739J474683P40740O3755l61730m83710l77049
$$ plain form
61053 639091 642427 646193 650746 655854 660856 665160 668565 671456 674660 678744 683553 688754 694671 702066
61039 702066 711173 721399 731920 742294 752601 763334 774888 786907 798547 809704 821382 834368
61027 834368 848243 862327 876827 892205 908184 924475 941804 960984 981539 1002531 1024241
61016 1024241 1047603 1072378 1097494 1123145 1151064 1182664 1218165 1257490 1300590 1346736 1394795
61005 1394795 1444485 1496557 1551974 1612065 1679176 1755896 1843838 1944290 2059462 2191737 2342412
60994 2342412 2512821 2706000 2925656 3175109 3460068 3791492 4182677 4644787 5189340
60985 5189340 5834393 6604141 7524269 8624608 9944504 11521874 13367474 15453367 17724907
60976 17724907 20100112 22430551 24472290 25946973 26687713 26751468 26389738 25906028 25528979
60967B5528979j50564J00608K67809K15617j49044p83275j504075k095513k428961
60958A9001581k497347k366717k117319j817758j519711j253268j026877q37909
60950E564675o83116n59087m59488l77938l11955k60947k22207j91805j67559
60941B330573j48558j33164j19851j08595r9346r0444q0527p0672o2669n6452
60931A360295n1087m6985m5054m4649m4313m3708m3097m1812l9037l5473l2563
60920H92517l0572k8777k6895k5082k3159k1078j9421j8375j7064j5008j3188
60909F53898j2508j2204j1114r498q207p125n881n186n779o821o928o130n367
60896E51150m773l967l337l430l592k787j383o43q54j303j675k096k281j969j808
$$ plain form
60967 25528979 25378415 25479023 25746832 25962449 25813405 25030130 23526055 21430542 19001581
60958 19001581 16504234 14137517 12020198 10202440 8682729 7429461 6402584 5564675
60950 5564675 4881559 4322472 3862984 3485046 3173091 2912144 2689937 2498132 2330573
60941 2330573 2182015 2048851 1929000 1820405 1721059 1630615 1550088 1479416 1416747 1360295
60931 1360295 1309208 1262223 1217169 1172520 1128207 1084499 1041402 999590 960553 925080 892517
60920 892517 861945 833168 806273 781191 758032 736954 717533 699158 682094 667086 653898
60909 653898 641390 629186 618072 608574 600367 593242 587361 582175 576396 569575 562647 556517 551150
60896 551150 546377 542410 539073 535643 532051 529264 527881 527238 526384 525081 523406 521310 519029 517060 515252
60881E15252k465l337l435l093l358m220m822m988n108m934m023k986k739k801
60867D62943j955l85N28M68N40J308K053K281K499L150L958M686N518O457P324
60852E01373Q394J0003J1515J1864J1170J0640J0806J1042J1054J1459J2456J3018
60840F34794J2069R678O726M041K207J451J318R30k05j959l953n686o546o438
60826F48427o190o532p010o790o151o045o369o049m864l872l771m079m297m717
60812E71691n531o138n988n346m742m267l814l456l188k827k362j929j357l84
60798E20362O96J233J186J115J202J140J079J665K917L948M226M274M679N207
60784E54929N391N319N288N264N110M901M648M227L855M055M772N168M711L922
$$ plain form
60881 515252 512787 509450 506015 502922 499564 495344 490522 485534 480426 475492 471469 468483 465744 462943
60867 462943 460988 460603 461131 461599 462139 463447 465500 467781 470280 473430 477388 482074 487592 494049 501373
60852 501373 509767 519770 531285 543149 554319 564959 575765 586807 597861 609320 621776 634794
60840 634794 646863 656541 663267 667308 669515 670966 672284 673214 673009 671050 667097 661411 654865 648427
60826 648427 642237 635705 628695 621905 615754 609709 603340 597291 592427 588555 584784 580705 576408 571691
60812 571691 566160 560022 554034 548688 543946 539679 535865 532409 529221 526394 524032 522103 520746 520362
60798 520362 521058 522291 523477 524592 525794 526934 528013 529678 532595 536543 540769 545043 549722 554929
60784 554929 560320 565639 570927 576191 581301 586202 590850 595077 598932 602987 607759 612927 617638 621560
60770F21560L561L603L515L143K797K723K881L098L085K594J759J035N72N0o66
60755F55310j195j277j309j759k377k509k040j523j356j330j114q45r88j671k524
60740F31493l216l943n100o531p527p606o982o141n290m456l700l001k293j818
60726E63889k031k754l006k223j126p67j099j245q67m44l43l69k62L5N57J183
60710E49128J440R80J73m07p74j231j583j531j583k513l974m764m628m646n510
60695E18577o471o559n970n541n564n709n694n425m916m489m679n432n878n326
60681D40924m173l363l266l512l599l243k381j315o59p18j027r23l52K35O88J307
60665D14623K207L022L462L764M249M694M624M215M275N137O036O190O038O605
$$ plain form
60770 621560 625121 628724 632239 635382 638179 640902 643783 646881 649966 652560 654319 655354 655926 655976 655310
60755 655310 654115 652838 651529 649770 647393 644884 642844 641321 639965 638635 637521 636676 635688 634017 631493
60740 631493 628277 624334 619234 612703 605176 597570 590588 584447 579157 574701 571001 568000 565707 563889
60726 563889 561858 559104 556098 553875 552749 551982 550883 549638 548771 548327 547984 547615 547353 547388 547945 549128
60710 549128 550568 551548 551721 551314 550540 549309 547726 546195 544612 542099 538125 533361 528733 524087 518577
60695 518577 512106 505547 499577 494036 488472 482763 477069 471644 466728 462239 457560 452128 446250 440924
60681 440924 436751 433388 430122 426610 423011 419768 417387 416072 415413 414695 413668 412745 412393 412628 413316 414623
60665 414623 416830 419852 423314 427078 431327 436021 440645 444860 449135 454272 460308 466498 472536 479141
60651D79141P820Q438P841O918O700O983P014O762O624O395N488M013K759K241
60637E65137K424L147M121M687M365L582L167L233L232K953K657K375J845J121
60623F08046M65k84j435k617l085k927l014l657m165m028l695l784m244m598m473
60608E62505l653k171n91L44N87Q38J561K508L232L465K936J492l46j629k041
60593E69037k140k370k470k129j471o72L35J449K253K622K964L572M287N014N943
60578E86224O971P472P044N986M702L164J325m26j645k285k489k312j954j914
60564F09863k512l481m214m263l570k533j857j873k090j778r32j10N40J412K594
60549E85196L726M721N908P312Q632J0085J2363J5542J8852K1941K5422K9735
$$ plain form
60651 479141 486961 495399 503240 510158 516858 523841 530855 537617 544241 550636 556124 560137 562896 565137
60637 565137 567561 570708 574829 579516 583881 587463 590630 593863 597095 600048 602705 605080 606925 608046
60623 608046 608511 608227 606792 604175 601090 598163 595149 591492 587327 583299 579604 575820 571576 566978 562505
60608 562505 558852 556681 556090 556434 557021 557859 559420 561928 565160 568625 571561 573053 572707 571078 569037
60593 569037 566897 564527 562057 559928 558457 557785 558120 559569 561822 564444 567408 570980 575267 580281 586224
60578 586224 593195 600667 607711 613697 618399 621563 622888 622462 620817 618532 616043 613731 611777 609863
60564 609863 607351 603870 599656 595393 591823 589290 587433 585560 583470 581692 580760 580650 581190 582602 585196
60549 585196 588922 593643 599551 606863 615495 625580 637943 653485 672337 694278 719700 749435
60537G49435L4347L8597M2717M7323N2425N7285O0745O1304N7668M9743L8587
60526A290176K5036R234q069k4611l7909m6913n1751n2531m9341m3115l5591k8371
60514I46244k2247j7180j2547p796l247J26J953L026M295O000Q182J1194J5088
60501I33091J9188K3019K7125L2192L8022M4201N1201N9677O9095P8009Q5571
60490A460391R1745R6140R7756R6221R2605Q8764Q6394Q6904R1692J02156J19292
60479B510060J43034J71731K02501K32202K57747K75258K79709K66290K32284
60470D570816J77698J05214K0416o8510j52842k25639k82191l19276l35611l33200
60460C156875l16982k92392k63423k32779k02737j75123j50813j29755j11475
$$ plain form
60537 749435 783782 822379 865096 912419 964844 1022129 1082874 1144178 1201846 1251589 1290176
60526 1290176 1315212 1324446 1316377 1291766 1253857 1206944 1155193 1102662 1053321 1010206 974615 946244
60514 946244 923997 906817 894270 886474 883227 883353 885306 888332 892627 898627 906809 918003 933091
60501 933091 952279 975298 1002423 1034615 1072637 1116838 1168039 1227716 1296811 1374820 1460391
60490 1460391 1552136 1648276 1746032 1842253 1934858 2023622 2110016 2196920 2288612 2390768 2510060
60479 2510060 2653094 2824825 3027326 3259528 3517275 3792533 4072242 4338532 4570816
60470 4570816 4748514 4853728 4874144 4805634 4652792 4427153 4144962 3825686 3490075 3156875
60460 3156875 2839893 2547501 2284078 2051299 1848562 1673439 1522626 1392871 1281396
60451A281396r5526q1825p0528o1459n3832m6907m0739l5664l1286k6772k2195
60440G14663j8696j6967j6274j5437j4179j2949j1896j0695r216p790o767o259
60428E67538o223o458o496n936m978m324m311m457m059l063k035j372r07l51K20
60413E12788N40O37Q67J450K115K307J794R93O63J140K036K845L562M349M841
60398E42927M529L788L648M306M749M333L852M241N116N535N484N415N008L762
60384F06693K408K103K371J520p00k611l184l345m011m472l870k869k531k606
60370E84896k278j789j886k277k100j433j054r10j82J150K092K101J774J860K424
60355E82388L235M126M788M832M390M098M343M847N154N096M731M191L675L262
$$ plain form
60451 1281396 1185870 1104045 1033517 972058 918226 871319 830580 794916 763630 736858 714663
60440 714663 695967 679000 662726 647289 633110 620161 608265 597570 588354 580564 573797 567538
60428 567538 561315 554857 548361 542425 537447 533123 528812 524355 520296 517233 515198 513826 512919 512568 512788
60413 512788 513328 513965 514832 516282 518397 520704 522498 523491 524154 525294 527330 530175 533737 538086 542927
60398 542927 547456 551244 554892 559198 563947 568280 572132 576373 581489 587024 592508 597923 602931 606693
60384 606693 609101 611204 613575 615095 614395 611784 608600 605255 601244 596772 592902 590033 587502 584896
60370 584896 582618 580829 578943 576666 574566 573133 572079 571169 570987 572137 574229 576330 578104 579964 582388
60355 582388 585623 589749 594537 599369 603759 607857 612200 617047 622201 627297 632028 636219 639894 643156
60341F43156K743J885P79k93j229k023k572k833k977l061k812k147j520j373j437
60326F24286j137m09L13P63J001J185J581K449L490L742K672J004j37n75q58j101
60310F38269j032r45j551k738l484l260k711k526k466k024j439j410k048k728
60296F07907k908k725k627k751k761k308j482p35l52k66l34n14o49l81M25J465
60280E89004K369L046L547L940M557N823P423Q216P497O065N325N623O137O209
60266F64781O048O085O333O656P168Q068R263J0342J0906J0955J0956J1419J2301
60253G81281J3166J3950J5144J7035J9329K1785K4619K7860L0962L3644L6534
60242A035309M0267M4415M8123N1467N5283N9880O4840O9878P5003P9788Q3406
$$ plain form
60341 643156 645899 647784 648563 648270 647041 645018 642446 639613 636636 633575 630763 628616 627096 625723 624286
60326 624286 623149 622740 623053 623816 624817 626002 627583 630032 633522 637264 639936 640940 640803 640228 639370 638269
60310 638269 637237 636292 634741 632003 628519 625259 622548 620022 617556 615532 614093 612683 610635 607907
60296 607907 604999 602274 599647 596896 594135 591827 590345 589610 589258 588992 588658 588144 587495 587114 587539 589004
60280 589004 591373 594419 597966 601906 606463 612286 619709 627925 635422 641487 646812 652435 658572 664781
60266 664781 670829 676914 683247 689903 697071 705139 714402 724744 735650 746605 757561 768980 781281
60253 781281 794447 808397 823541 840576 859905 881690 906309 934169 965131 998775 1035309
60242 1035309 1075576 1119991 1168114 1219581 1274864 1334744 1399584 1469462 1544465 1624253 1707659
60231A707659Q5606Q6916Q7636Q7291Q5182Q1042P4981O7337N8719M9706M0362
60220B512437L0401J9864R245j034j0775j9599k6937l2544l6549l8878l9008l6560
60208B330063l1866k5829j9296j2563n328K834J1872K1313L0913M0833N0932O0447
60196B454325O8804P6310Q3460Q9912R4706R7117R6720R3000Q5765P5722O4037
60185C379878N1334L7755K3678R590m503j8829l2982m5995n7235o6515p3404p7139
60173C125633p7284p4018o7905n9871n1039m1844l1624j9904p719L318J3092K2918
60161B733753L3375M3357N1536N7606O1652O3322O2249N8586N2684M4731L5130
60150C297981K4677J4088L845n381j2827j8284k2049k3994k3446k0216j4953q120
$$ plain form
60231 1707659 1793265 1880181 1967817 2055108 2140290 2221332 2296313 2363650 2422369 2472075 2512437
60220 2512437 2542838 2562702 2571947 2570913 2560138 2540539 2513602 2481058 2444509 2405631 2366623 2330063
60208 2330063 2298197 2272368 2253072 2240509 2235181 2238015 2249887 2271200 2302113 2342946 2393878 2454325
60196 2454325 2523129 2599439 2682899 2772811 2867517 2964634 3061354 3154354 3240119 3315841 3379878
60185 3379878 3431212 3468967 3492645 3502235 3497732 3478903 3445921 3399926 3342691 3276176 3202772 3125633
60173 3125633 3048349 2974331 2906426 2846555 2795516 2753672 2722048 2702144 2694425 2697743 2710835 2733753
60161 2733753 2767128 2810485 2862021 2919627 2981279 3044601 3106850 3165436 3218120 3262851 3297981
60150 3297981 3322658 3336746 3340591 3335210 3322383 3304099 3282050 3258056 3234610 3214394 3199441 3191321
60138C191321O09J1420K3512L5701M7512N9360P2118Q6609J02981J20355J37701
60127C889199J55202J73939J93954K13622K31448K47577K62691K76135K86112
60118E929879K91347K91641K87000K77064K61450K40059K13074J81027J44806
60109H117347J05199O2567J7301k9491p6154j21165j63273k01080k33003k57685
60099G220563k74237k82164k81482k73009k58137k38113k13674j85515j54898
60090E059334j23506r2706o3151l5177r290J3999L4513N2005O5545P4000P7343
60079E052909P6785P3279O6549N6151M2848K8109J2711l184j8934l3378m6001
60068E307844n7284o7775p7562q6693r5393j03600j10853j16812j21314j23946
$$ plain form
60138 3191321 3191930 3203350 3226862 3262563 3310075 3369435 3441553 3528162 3631143 3751498 3889199
60127 3889199 4044401 4218340 4412294 4625916 4857364 5104941 5367632 5643767 5929879
60118 5929879 6221226 6512867 6799867 7076931 7338381 7578440 7791514 7972541 8117347
60109 8117347 8222546 8285113 8302414 8272923 8196769 8075604 7912331 7711251 7478248 7220563
60099 7220563 6946326 6664162 6382680 6109671 5851534 5613421 5399747 5214232 5059334
60090 5059334 4935828 4843122 4779971 4744794 4735504 4749503 4784016 4836021 4901566 4975566 5052909
60079 5052909 5129694 5202973 5269522 5325673 5368521 5396630 5409341 5406157 5387223 5353845 5307844
60068 5307844 5250560 5182785 5105223 5018530 4923137 4819537 4708684 4591872 4470558 4346612
60058D346612j24140j21881j17671j11783j04046r4492q3551p1567n8770m5763
60048C412948l3245k1051q302N233J8616L0945M2391N3596O4586P4821Q3840R1348
60036C815726R6846R9601R8967R4682Q6981P6397O3198M7214K8666Q847j0672
60025D506453k9476m8108o6453q3097r6624j06791j14042j18422j19417j16559
60015C607464j09941j00341q8969p6792o4112n0974l7718k4710j1792J297J4305
60004C057717K6954L9727N3201O6913P9888R2166J04576J16959J27968J36686
59994C902755J43108J46637J45612J38998J27452J12119R3502P2217M9643K6784
59984D958827L454k0451m3730o4853q3507j00018j13840j23582j28257j27708
$$ plain form
60058 4346612 4222472 4100591 3982920 3871137 3767091 3672599 3589048 3517481 3458711 3412948
60048 3412948 3379703 3358652 3350350 3355583 3374199 3405144 3447535 3501131 3565717 3640538 3724378 3815726
60036 3815726 3912572 4012173 4111140 4205822 4292803 4369200 4432398 4479612 4508278 4517125 4506453
60025 4506453 4476977 4428869 4362416 4279319 4182695 4075904 3961862 3843440 3724023 3607464
60015 3607464 3497523 3397182 3308213 3231421 3167309 3116335 3078617 3053907 3042115 3043412 3057717
60004 3057717 3084671 3124398 3177599 3244512 3324400 3416566 3521142 3638101 3766069 3902755
59994 3902755 4045863 4192500 4338112 4477110 4604562 4716681 4810183 4882400 4932043 4958827
59984 4958827 4962281 4941830 4898100 4833247 4749740 4649722 4535882 4412300 4284043 4156335
59974D156335j22151j12156r8833q3321o6232m8040k9634j1983M359J8973L1332
59963C638649M1489N0380N8716O5974P1249P4762P7611Q0203Q1695Q1081P8222
59952D400031P3671O7922O1063N3017M4044L4931K6544J9250J3091Q374N607N064
59940D812609P008J2234K1536L4589N0286O8356Q9664J14589J42026J70514J99350
59929E722761K28057K55562K80516L01718L17587L25983L25095L13840K91114
59920H362233K55714K07820J49705Q4358J4357n7187j25741j86803k37781k77662
59910H189013l05696l21582l26364l21905l09729k91210k68297k42864k15610
59901E585756j86588j56522j26628r7478o9032m1581j5589R180L3373N6898P8865
$$ plain form
59974 4156335 4034184 3922028 3823195 3739874 3673642 3625602 3595968 3583985 3588344 3607317 3638649
59963 3638649 3680138 3730518 3789234 3855208 3926457 4001219 4078830 4159033 4240728 4321809 4400031
59952 4400031 4473702 4541624 4602687 4655704 4699748 4734679 4761223 4780473 4793564 4801938 4807545 4812609
59940 4812609 4819617 4831851 4853387 4887976 4938262 5006618 5096282 5210871 5352897 5523411 5722761
59929 5722761 5950818 6206380 6486896 6788614 7106201 7432184 7757279 8071119 8362233
59920 8362233 8617947 8825767 8975472 9059830 9074187 9017000 8891259 8704456 8466675 8189013
59910 8189013 7883317 7561735 7235371 6913466 6603737 6312527 6044230 5801366 5585756
59901 5585756 5399168 5242646 5116018 5018540 4949508 4907927 4892338 4901518 4934891 4991789 5070654
59890E070654R8565J15719J29776J39758J44797J44239J37461J24082J04143P7618
59880F286812M4365N328l6725p8587j18360j54952j86518k10848k27268k36932
59870E086315k41077k40025k34088k24348k12024j97782j82016j65281j48190
59861C241484j31255j14977r9660q5162p1206n7985m6133l6174k8352k2793j9363
59850B528424j7548j6889j7246j8238j8831j8130j6244j3768j0747o933k816N22
59838B371556K567L523L335J351k788q413j4274j9350k3198k5825k7406k7978
59826B233100k7545k6515k5717k5640k5880k5528k3851k0572j5929j0801o203
59815A998919k478N87K911M228N260P636J2089J7679K3314K8967L4614L9272M2200
$$ plain form
59890 5070654 5169219 5284938 5414714 5554472 5699269 5843508 5980969 6105051 6209194 6286812
59880 6286812 6331177 6336505 6299780 6221193 6102833 5947881 5761363 5550515 5323247 5086315
59870 5086315 4845238 4605213 4371125 4146777 3934753 3736971 3554955 3389674 3241484
59861 3241484 3110229 2995252 2895592 2810430 2739224 2681239 2635106 2598932 2570580 2547787 2528424
59850 2528424 2510876 2493987 2476741 2458503 2439672 2421542 2405298 2391530 2380783 2373850 2371034 2371556
59838 2371556 2374123 2377646 2380981 2382332 2379544 2371131 2356857 2337507 2314309 2288484 2261078 2233100
59826 2233100 2205555 2179040 2153323 2127683 2101803 2076275 2052424 2031852 2015923 2005122 1998919
59815 1998919 1996441 1997028 1999939 2004167 2009427 2017063 2029152 2046831 2070145 2099112 2133726 2172998 2215198
59802B215198M4023M5366M5247M2223L6555K9907K3472J7565J2517Q541N238K521
59790B528373J551L361P149J1454J6524K3728L3019M2860N2746O3890P7108R1739
59778B953502J07085J23492J41547J61457J83584K08200K34241K59458K82082
59769D654648L00932L13476L15133L01158K68393K15297J42667N5880l4654j17077
59759F415853j82770k28068k53236k60991k55340k40333k19350j95296j70608
59750D409861j46647j23616j01570q1091o2702m6215l1049j6839l445R241K1362
59739C827290L3306M5763N9011P2350Q5044R7714J11831J27773J44483J61334
59729D765899J79246J99454K22022K46173K71443K97975L26102L56035L87406
$$ plain form
59802 2215198 2259221 2304587 2349834 2392057 2428612 2458519 2481991 2499556 2512073 2520614 2525852 2528373
59790 2528373 2529924 2533285 2540434 2551888 2568412 2592140 2625159 2668019 2720765 2784655 2861763 2953502
59778 2953502 3060587 3184079 3325626 3487083 3670667 3878867 4113108 4372566 4654648
59769 4654648 4955580 5269056 5584189 5885347 6153740 6369037 6511704 6567584 6532930 6415853
59759 6415853 6233083 6005015 5751779 5490788 5235448 4995115 4775765 4580469 4409861
59750 4409861 4263214 4139598 4038028 3956937 3894235 3848020 3816971 3800132 3796687 3805928 3827290
59739 3827290 3860596 3906359 3965370 4037720 4122764 4220478 4332309 4460082 4604565 4765899
59729 4765899 4945145 5144599 5366621 5612794 5884237 6182212 6508314 6864349 7251755
59720G251755M18884M48687M75646M99239N18492N31512N36320N31752N17616
59711A1729903M94889M65992M34259M02998L75398L54837L43873L42546L48438
59702A5293133L58637L70779L82214L89425L88935L78135L55020L18225K68010
59693A8502513K06618J37359O3964r058p6669j34808j81214k14578k33643k37709
59683A7822775k27312k03894j69183j25132p3739j6423M6006J12598J82101K53742
59673A7601539L27264M01746M74955N44211O07236O61592P03705P28737P31207
59664B2782192P05799O48352N56798M31458K75215R4308j01246k99073m86827
59655B4606976o53315p88762q86245r43649r63503r50700r11018q51307p79284
$$ plain form
59720 7251755 7670639 8119326 8594972 9094211 9612703 10144215 10680535 11212287 11729903
59711 11729903 12224792 12690784 13125043 13528041 13903439 14258276 14602149 14944695 15293133
59702 15293133 15651770 16022549 16404763 16794188 17183123 17561258 17916278 18234503 18502513
59693 18502513 18709131 18846490 18910454 18901396 18824727 18689919 18508705 18294127 18060484 17822775
59683 17822775 17595463 17391569 17222386 17097254 17023515 17007092 17053098 17165696 17347797 17601539
59673 17601539 17928803 18330549 18805504 19349715 19956951 20618543 21322248 22050985 22782192
59664 22782192 23487991 24136343 24693141 25124599 25399814 25494122 25392876 25093803 24606976
59655 24606976 23953661 23164899 22278654 21335005 20371502 19420802 18509784 17658477 16879193
59646A6879193p02299o26876n59349n05621m70009m55028m61743m88421n28428
59637A2081419n71356o07368o30137o36308o24760n97504n59429n15535m68976
59628F870046m22099l77497l36770k99576k65345k34799k08582j85555j64058
59619D375765j44069j26715j12130r9176q6934p5358o4728n5402m7787m1885l7182
59608C484399l3567l1688l1888l3540l6132m0053m5500n1416n6494o0521o3824
59597B999776o6146o7068o6869o5948o3997o0665n6351n1480m5748l9067l2460
59586B383977k6898k1961j6793j1639p273l501L09L881O566Q749J1331J4095J6049
59573B356892J7169J8368J9826K0834K1292K2010K3310K4635K5816K7611L0561
$$ plain form
59646 16879193 16176894 15550018 14990669 14485048 14015039 13560011 13098268 12609847 12081419
59637 12081419 11510063 10902695 10272558 9636250 9011490 8413986 7854557 7339022 6870046
59628 6870046 6447947 6070450 5733680 5434104 5168759 4933960 4725378 4539823 4375765
59619 4375765 4231696 4104981 3992851 3893675 3806741 3731383 3666655 3611253 3563466 3521581 3484399
59608 3484399 3450832 3419144 3387256 3353716 3317584 3277531 3232031 3180615 3124121 3063600 2999776
59597 2999776 2933630 2866562 2799693 2733745 2669748 2609083 2552732 2501252 2455504 2416437 2383977
59586 2383977 2357079 2335118 2318325 2306686 2299413 2295912 2296221 2300102 2306668 2315417 2326748 2340843 2356892
59573 2356892 2374061 2392429 2412255 2433089 2454381 2476391 2499701 2524336 2550152 2577763 2608324
59562B608324L4320L8528M3481M9465N6132O3059P0364P8392Q7157R6473J06293
59551C331988J16711J27781J39453J51476J63412J74840J85499J95049K02879
59542D789088K08372K11188K11178K08255K02415J93643J81775J66873J49602
59533F522389J30427J08573Q2894N4232K5893J150j8938l4857m6926n5162n9919
59522F709756o1438n9207n2618m1751k6921q033J4767M0395O7516R5228J22245
59511F799939J46115J64185J74819J76820J68538J48706J17734P7232K8868k5343
59501G977613q2303j38696j92180k40643k81021l10405l28116l35470l33661l23243
59491E411875l05477k82807k57622k31421k05165j79558j54907j31415j09543
$$ plain form
59562 2608324 2642644 2681172 2724653 2774118 2830250 2893309 2963673 3042065 3129222 3225695 3331988
59551 3331988 3448699 3576480 3715933 3867409 4030821 4205661 4391160 4586209 4789088
59542 4789088 4997460 5208648 5419826 5628081 5830496 6024139 6205914 6372787 6522389
59533 6522389 6652816 6761389 6844283 6898515 6924408 6925558 6906620 6871763 6824837 6769675 6709756
59522 6709756 6648318 6589111 6536493 6494742 6467821 6459788 6474555 6514950 6582466 6677694 6799939
59511 6799939 6946054 7110239 7285058 7461878 7630416 7779122 7896856 7974088 8002956 7977613
59501 7977613 7895310 7756614 7564434 7323791 7042770 6732365 6404249 6068779 5735118 5411875
59491 5411875 5106398 4823591 4565969 4334548 4129383 3949825 3794918 3663503 3553960
59482C553960q9492p0773n3018l6641k1761p118Q685K5267M1159N6018P0830Q5997
59470C563113J00780J14711J28288J41942J55240J67235J76732J82324J83144
59461D913509J79463J71590J58442J38431J11567P9469M3474M262l6629p6528
59451E687050j13382j46468j75008j97449k12778k21504k24658k22842k16751
59442C956210k07704j96915j84862j71925j58934j46516j34484j22448j10594
59433B521828r9405q9007p9176o9736o0672n2166m4555l8031l2330k7087k2325
59422A907338j8172j4250r914m988J96N319J0142J4333J7787K0824K3604K5826
59410A978045K7508K9211L0473K8939K2717J3321M774j09j188Q49N692J2428J9222
$$ plain form
59482 3553960 3464468 3393695 3340677 3304036 3282275 3275157 3283842 3309109 3350268 3406286 3477116 3563113
59470 3563113 3663893 3778604 3906892 4048834 4204074 4371309 4548041 4730365 4913509
59461 4913509 5092972 5264562 5423004 5561435 5673002 5752471 5795945 5800207 5763578 5687050
59451 5687050 5573668 5427200 5252192 5054743 4841965 4620461 4395803 4172961 3956210
59442 3956210 3748506 3551591 3366729 3194804 3035870 2889354 2754870 2632422 2521828
59433 2521828 2422423 2333416 2254240 2184504 2123832 2071666 2027111 1989080 1956750 1929663 1907338
59422 1907338 1889166 1874916 1865002 1860014 1860210 1865529 1875671 1890004 1907791 1928615 1952219 1978045
59410 1978045 2005553 2034764 2065237 2094176 2116893 2130214 2134988 2134879 2133691 2134540 2140232 2152660 2171882
59397B171882K4988L0109L4656L7151L6213L2781K9741K9724L3675M0957N0172
59386B552049O0220P1014Q3033R6224J09993J24245J39609J56426J74342J93218
59376C760373K13679K36368K61270K88066L16536L46253L76350M05736M32939
59367F637570M55657M71194M77779M74984M62978M42089M13456L79362L42537
59358A0557606L05395K69858K37187K07727J81209J57230J34891J12169Q6518
59349A2249790N6270K0822k0239o7128j18886j73346k28324k82018l32155l75840
59339A0728946m10757m35977m51471m57535m54977m45014m28763m07278l82029
59330F855145l54606l25855k96120k66258k37609k10918j86157j63323j42540
$$ plain form
59397 2171882 2196870 2226979 2261635 2298786 2334999 2367780 2397521 2427245 2460920 2501877 2552049
59386 2552049 2612269 2683283 2766316 2862540 2972533 3096778 3236387 3392813 3567155 3760373
59376 3760373 3974052 4210420 4471690 4759756 5076292 5422545 5798895 6204631 6637570
59367 6637570 7093227 7564421 8042200 8517184 8980162 9422251 9835707 10215069 10557606
59358 10557606 10863001 11132859 11370046 11577773 11758982 11916212 12051103 12163272 12249790
59349 12249790 12306060 12326882 12306643 12239515 12120629 11947283 11718959 11436941 11104786 10728946
59339 10728946 10318189 9882212 9430741 8973206 8518229 8073215 7644452 7237174 6855145
59330 6855145 6500539 6174684 5878564 5612306 5374697 5163779 4977622 4814299 4671759
59321D671759j23451j05577q9324p5541o4082n3974m5116l8523l4703l2968l2578
59310C975922l3358l4831l6180l7480l9684m2806m5432m6608m6984m7343m7243
59299C517973m6005m3956m1685l8938l5183l0559k5454j9781j3375o511N53P962
59287C225041J5684K3306L0877L9234M8924N9608P0867Q2689R4655J05684J15232
59276C911801J23760J31147J35805J36293J33105J27885J21565J14235J05991
59267E041587R6712Q5372P0613N1942K9829N105k1044m6970p1243r3190j12344
59256E036369j27917j39438j47358j52278j54109j52636j48478j42727j35977
59247C735451j28381j20281j12103j03789r4965q5584p6065o6928n8480n0551
$$ plain form
59321 4671759 4548308 4442731 4353407 4277866 4213784 4159810 4114694 4076171 4041468 4008500 3975922
59310 3975922 3942564 3907733 3871553 3834073 3794389 3751583 3706151 3659543 3612559 3565216 3517973
59299 3517973 3471968 3428012 3386327 3347389 3312206 3281647 3256193 3236412 3223037 3216526 3217079 3225041
59287 3225041 3240725 3264031 3294908 3334142 3383066 3442674 3513541 3596230 3690885 3796569 3911801
59276 3911801 4035561 4166708 4302513 4438806 4571911 4699796 4821361 4935596 5041587
59267 5041587 5138299 5223671 5294284 5346226 5376055 5381160 5360116 5313146 5241903 5148713 5036369
59256 5036369 4908452 4769014 4621656 4469378 4315269 4162633 4014155 3871428 3735451
59247 3735451 3607070 3486789 3374686 3270897 3175932 3090348 3014283 2947355 2888875 2838324
59237B838324m2464l3703k4654j6102p959O48R975J9386K8783L9162N1144O4060
59225B926600P7266R1385J07376J25169J44185J64479J86376K09516K33121K56737
59215D522210K79814L00931L18198L30055L34912L30589L14945K87017K47058
59206G265729J96043J35785O9049j229p2478j41767k05166k58787l00370l29382
59196F357427l46030l50884l45142l30577l09257k83588k56083k28553k01781
59187C705532j76395j53485j33885j17417j03371r1265q0638p0775o1371n2941
59177B663989m5939l9842l3699k7241k0825j4736r031l745J182N896J0187J3616
59165B499812J6305J8911K1439K2936K2870K2007K1218K0253J8472J6078J3615
$$ plain form
59237 2838324 2795860 2762157 2737503 2721401 2713442 2714090 2724065 2743451 2772234 2811396 2862540 2926600
59225 2926600 3003866 3095251 3202627 3327796 3471981 3636460 3822836 4032352 4265473 4522210
59215 4522210 4802024 5102955 5421153 5751208 6086120 6416709 6731654 7018671 7265729
59206 7265729 7461772 7597557 7666606 7665377 7592899 7451132 7245966 6987179 6686809 6357427
59196 6357427 6011397 5660513 5315371 4984794 4675537 4391949 4135866 3907313 3705532
59187 3705532 3529137 3375652 3241767 3124350 3020979 2929714 2849076 2778301 2716930 2663989
59177 2663989 2618050 2578208 2544509 2517268 2496443 2481707 2472676 2468931 2470113 2476009 2486196 2499812
59165 2499812 2516117 2535028 2556467 2579403 2602273 2624280 2645498 2665751 2684223 2700301 2713916
59154B713916J0851P168K725j657n578r289j3011j6590j9644k1709k2544k2570
59142B602068k2517k2372k1316j9030j6286j3823j1433q774o209m090j908J075
59130B455385M821Q809J2800J6792K0932K5850L2260L9625M6279N1513N6584O2798
59118B834448O9642P5863Q1406Q7052R2901R8382J03216J07214J09711J10328
59108C770163J09831J09140J07982J05553J02007R8178R4369R0518Q7131Q4796
59098D759668Q3091Q1037P8385P5290P0916O3443N1468L4661J3137j2921m3018
59087E255157p6089j10212j42351j69274j89497k03724k12865k16530k14355k07666
59077C512594j98561j87979j75892j62769j49557j36694j24312j12978j03126
$$ plain form
59154 2713916 2724767 2731935 2734660 2733003 2727425 2718136 2705125 2688535 2668891 2647182 2624638 2602068
59142 2602068 2579551 2557179 2535863 2516833 2500547 2486724 2475291 2466517 2460308 2456218 2454310 2455385
59130 2455385 2460206 2469015 2481815 2498607 2519539 2545389 2577649 2617274 2663553 2715066 2771650 2834448
59118 2834448 2904090 2979953 3061359 3148411 3241312 3339694 3442910 3550124 3659835 3770163
59108 3770163 3879994 3989134 4097116 4202669 4304676 4402854 4497223 4587741 4674872 4759668
59098 4759668 4842759 4923796 5002181 5077471 5148387 5211830 5263298 5297959 5311096 5298175 5255157
59087 5255157 5179068 5068856 4926505 4757231 4567734 4364010 4151145 3934615 3720260 3512594
59077 3512594 3314033 3126054 2950162 2787393 2637836 2501142 2376830 2263852 2160726
59068B160726r4283q5891p8343p2065o6325o0206n4146m9091m4732m0063l5176
59057A480405l0939k7236k3167j8702j4632j0983p080l070J66K609N113P747R595
59044A369826J0273J0273R634P710M525J129j773m345o537p667p462o529n504
59031A373553m552l848l542l149j862L43K789N159P544R567J0558J0591J0280
59018A413431R570P988O043M978M930M696L763L209L952N260N881N782N798O094
59004A491375N898M663K805J087n74l225p565j2713j6911j9523k1467k3420k4726
58991A375704k4739k4056k3385k2219j9900j7095j4819j2684r752o511m305l135
58979A193104j729L33K209L476M667O038P290Q644J0736J3336J5450J6871J8320
$$ plain form
59068 2160726 2066443 1980552 1902209 1830144 1763819 1703613 1649467 1600376 1555644 1515581 1480405
59057 1480405 1449466 1422230 1399063 1380361 1365729 1354746 1347666 1344596 1344762 1347371 1352484 1360231 1369826
59044 1369826 1380099 1390372 1400006 1407716 1412241 1413370 1411597 1407252 1400715 1393048 1385586 1379057 1373553
59031 1373553 1369001 1365153 1361611 1358462 1356600 1356943 1359732 1364891 1372435 1382002 1392560 1403151 1413431
59018 1413431 1423001 1430989 1437032 1442010 1446940 1451636 1455399 1458608 1462560 1467820 1473701 1479483 1485281 1491375
59004 1491375 1497273 1501936 1504741 1505828 1505254 1502029 1494464 1481751 1464840 1445317 1423850 1400430 1375704
58991 1375704 1350965 1326909 1303524 1281305 1261405 1244310 1229491 1216807 1207055 1200544 1196239 1193104
58979 1193104 1191375 1191708 1193917 1197393 1202060 1208098 1215388 1224032 1234768 1248104 1263554 1280425 1298745
58966A298745K0058K1579K2770K3973K4835K4515K3261K2353K2312K2434K2287
58955A549122K2317K2724K3098K3404K4051K4765K4762K4221K4205K4771K4725
58944A812165K3689K3006K3881K5921K8196L0576L3338L6351L9443M2806M6610
58933B165982N0787N5424O0633O6010P1113P6464Q3035R0820R8982J07433J16866
58922C043549J27289J37994J49210J62222J77417J93664K10156K27536K46647
58913D675684K67480K89879L14039L39672L65781L91956M18747M46117M72507
58904G981862M95977N15250N28948N34913N31019N15909M88347M46643L89502
58895A2428370L17077K31115J34753L2273p1671j72858k67087l49659m16728m67286
$$ plain form
58966 1298745 1318803 1340382 1363152 1387125 1411960 1436475 1459736 1482089 1504401 1526835 1549122
58955 1549122 1571439 1594163 1617261 1640665 1664716 1689481 1714243 1738464 1762669 1787440 1812165
58944 1812165 1835854 1858860 1882741 1908662 1936858 1967434 2000772 2037123 2076566 2119372 2165982
58933 2165982 2216769 2272193 2332826 2398836 2469949 2546413 2629448 2720268 2819250 2926683 3043549
58922 3043549 3170838 3308832 3458042 3620264 3797681 3991345 4201501 4429037 4675684
58913 4675684 4943164 5233043 5547082 5886754 6252535 6644491 7063238 7509355 7981862
58904 7981862 8477839 8993089 9522037 10056950 10587969 11103878 11592225 12038868 12428370
58895 12428370 12745447 12976562 13111315 13143588 13071917 12899059 12631972 12282313 11865585 11398299
58885A1398299n02660n24090n32007n27631n13562m92471m66412m37490m07603
58876F994373l77288l46369l16035k88622k64950k43682k23909k06611j92685
58867D534222j81256j71113j62300j55079j48409j40808j31980j22680j13630
58858C206967j05260r7770r0814q3729p6446o9472o2828n6052m9350m3495l8338
58847B433413l2743k6384k0302j5235j0723o290k145J767O088J0877J5416J9634
58835B373373K4341K9680L4750L9249M3938M9049N3800N8125O3238O9719P6681
58824B915943Q3513R0817R8895J07031J15204J24799J36540J49371J62402J76396
58814D160911J92191K09267K27211K47046K69705K94374L19649L45212L71229
$$ plain form
58885 11398299 10895639 10371549 9839542 9311911 8798349 8305878 7839466 7401976 6994373
58876 6994373 6617085 6270716 5954681 5666059 5401109 5157427 4933518 4726907 4534222
58867 4534222 4352966 4181853 4019553 3864474 3716065 3575257 3443277 3320597 3206967
58858 3206967 3101707 3003937 2913123 2829394 2752948 2683476 2620648 2564596 2515246 2471751 2433413
58847 2433413 2400670 2374286 2353984 2338749 2328026 2321736 2319591 2321358 2327446 2338323 2353739 2373373
58835 2373373 2397714 2427394 2462144 2501393 2545331 2594380 2648180 2706305 2769543 2839262 2915943
58824 2915943 2999456 3090273 3189168 3296199 3411403 3536202 3672742 3822113 3984515 4160911
58814 4160911 4353102 4562369 4789580 5036626 5306331 5600705 5920354 6265566 6636795
58805F636795L97331M23191M48794M72936M92724N05699N11127N08130M94055
58796A0890782M66143M23632L66896K95977K11655J17076J6815q4983j84385k76737
58786A2242871l57457m23477m73316n06743n25165n31245n27215n14431m94970
58777G888852m71921m47197m20695l92655l65155l40055l17139k95545k75407
58768D563083k56610k37750k18139j99387j83200j68977j55248j42117j30499
58759B871156j20190j10535j01916r4701q7793q0000p1821o4307n7270n0298m4244
58748A988081l9770l5589l0151k4117j9225j5615j2247r059o771n242m013l782
58736A782500n487q579j1902j5542k0114k4992k8969l1834l3682l3747l1825k9771
$$ plain form
58805 6636795 7034126 7457317 7906111 8379047 8871771 9377470 9888597 10396727 10890782
58796 10890782 11356925 11780557 12147453 12443430 12655085 12772161 12788976 12703993 12519608 12242871
58786 12242871 11885414 11461937 10988621 10481878 9956713 9425468 8898253 8383822 7888852
58777 7888852 7416931 6969734 6549039 6156384 5791229 5451174 5134035 4838490 4563083
58768 4563083 4306473 4068723 3850584 3651197 3467997 3299020 3143772 3001655 2871156
58759 2871156 2750966 2640431 2538515 2443814 2356021 2276021 2204200 2139893 2082623 2032325 1988081
58748 1988081 1948311 1912722 1882571 1858454 1839229 1823614 1811367 1802308 1795537 1790295 1786282 1782500
58736 1782500 1777013 1768434 1756532 1740990 1720876 1695884 1666915 1635081 1601399 1567652 1535827 1506056
58724A506056k9429l0005k9660k8754k9025l0351l0997l0714l0955l2001l2337
58713A171828l1102k9160k7409k5904k4757k4200k3581k1868j9324j7165j5681
58702I11677j4137j2444j1395j1212j1207j0968j0712j0596j0682j1184j1868
58691G85272j1828j0856j0174j0598j1064j0360r082q269p353n466l519k722k045
58678F81936K95L559N375N424N617O784P817Q178Q708R620R821Q739P008N083
58664G73964K904J018K44Q4q06k533l961m753n685p017q199r158j0139j0420r007
58649G06536o552m820m306l996l245k184n59J887M188N186N579O907Q895J0021
58635G23537J0464J2033J5029J7612J8644J8936J9266J9345J9308K0181K2229
$$ plain form
58724 1506056 1476627 1446622 1416962 1388208 1359183 1328832 1297835 1267121 1236166 1204165 1171828
58713 1171828 1140726 1111566 1084157 1058253 1033496 1009296 985715 963847 944523 927358 911677
58702 911677 897540 885096 873701 862489 851282 840314 829602 819006 808324 797140 785272
58691 785272 773444 762588 752414 741816 730752 720392 711310 703041 695688 690222 686703 683981 681936
58678 681936 682231 685790 691165 696589 702206 708990 716807 724985 733693 743313 753134 761873 768881 773964
58664 773964 776868 777886 778130 778214 777408 774875 770914 766161 760476 753459 745260 736102 725963 715543 706536
58649 706536 699984 695164 690858 686862 683617 681433 680874 682761 686949 692135 697714 704621 713516 723537
58635 723537 734001 746034 761063 778675 797319 816255 835521 854866 874174 894355 916584
58624I16584K4625K7187L0665L4927L8703M1711M5323N0545N6836O3406P0222
58613A400734P7276Q4327R1679R9934J08835J17523J25862J34224J42089J48439
58603B530922J53084J55961J55386J48960J36067J17663R4040O4958L1917k029
58593C586929l4836o5866r3699j15996j31882j42438j48411j49496j46228j40447
58583B417630j33321j24681j14660j04254r3845q2973p1874o1592n2431m3917
58573A534082l6297l0285k5335k0136j4821j0651p601m314m80K899N662Q556J1058
58560A412337J1488R485O159J629n139j3794k2384l0045l7393m3829m7126m6509
58548A194879m3770m0626l7094l3210k9948k7607k5274k2644k0470j8812j6859
$$ plain form
58624 916584 941209 968396 999061 1033988 1072691 1114402 1159725 1210270 1267106 1330512 1400734
58613 1400734 1478010 1562337 1654016 1753950 1862785 1980308 2106170 2240394 2382483 2530922
58603 2530922 2684006 2839967 2995353 3144313 3280380 3398043 3492083 3557041 3588958 3586929
58593 3586929 3552093 3486227 3392528 3276532 3144650 3002212 2853801 2704305 2558077 2417630
58583 2417630 2284309 2159628 2044968 1940714 1846869 1763896 1692022 1630430 1577999 1534082
58573 1534082 1497785 1467500 1442165 1422029 1407208 1396557 1388956 1384642 1384162 1387061 1392723 1401279 1412337
58560 1412337 1423825 1433310 1439469 1441098 1435959 1422165 1399781 1369736 1332343 1288514 1241388 1194879
58548 1194879 1151109 1110483 1073389 1040179 1010231 982624 957350 934706 914236 895424 878565
58537H78565j4903j4231j4661j4431j3019j1759j1263j0646r765r737j0529j0485
58525G33136r061p719p406p410p292p611q113p602o245n662o149o219n376m838
58511F36433m941m498l265k374j780j04K362L477K865K690L909M904M800N055
58497F49533O458P649Q024R070J1364J3180J3644J4350J6237J7669J7382J6542
58485H01102J6129J4961J2136Q911O306L306q21m803p639j0273j3364j5711j6488
58472G93752j6747j7252j7180j6307j5927j6221j5421j3007j0928j0187r146o910
58460F28519n310n548n848m547k780j982j405k01O29N00Q45K370L327K562J735
58445F12866K403L564M086M937O793Q187Q198Q411R976J1451J1748J2349J4283
$$ plain form
58537 878565 863662 849431 834770 820339 807320 795561 784298 773652 763887 754150 743621 733136
58525 733136 724075 716356 708950 701540 694248 686637 678524 670922 664677 659015 652866 646647 641271 636433
58511 636433 631492 626994 623729 621355 619575 619471 621833 625310 628175 630865 634774 639678 644478 649533
58497 649533 655991 663640 671664 680734 692098 705278 718922 733272 749509 767178 784560 801102
58485 801102 817231 832192 844328 853239 859545 862851 862030 857227 849588 839315 825951 810240 793752
58472 793752 777005 759753 742573 726266 710339 694118 678697 665690 654762 644575 635429 628519
58460 628519 623209 617661 611813 607266 604486 602504 601099 600898 601527 602027 602872 605242 608569 611131 612866
58445 612866 615269 618833 622919 627856 634649 642836 651034 659445 669421 680872 692620 704969 719252
58432G19252J5661J4816J3111J2063J0374O464J541k528n964r278j1209j0972
58420G53331j0144r974r308p302n446m601l039R4K566K936L481O239R358J0524
58406G38715J0961J2659J4494J4589J3906J3940J3399J0572O655L392o2m671q491
58393H40058r533r219r590r652p904n878n507n409l498j020k88o50k34M46K14
58378G72336K61J872L347K719J393J603K487K169J436J916K834K946L320M990
58364H05629O372O261O520Q529J0072R345Q676J0466J2784J3107J3040J4868J6833
58351I42502J6472J5436J6218J7173J5784J3668J3350J3093J0195O413M701L521
58339A088526q7m501o245o015o476o659m310j178j94J45K791O184P128O990Q985
$$ plain form
58432 719252 734913 749729 762840 774903 785277 791741 793282 790754 784790 775512 764303 753331
58420 753331 743187 733213 723905 716603 711157 706556 703517 703611 706177 709113 712594 718833 728191 738715
58406 738715 749676 762335 776829 791418 805324 819264 832663 843235 849890 853282 853220 848549 840058
58393 840058 830525 821306 811716 802064 794160 788282 782775 777366 773868 772848 772560 771910 771676 772122 772336
58378 772336 772597 774469 777816 780535 781928 783531 786018 788187 789623 791539 794373 797319 800639 805629
58364 805629 812001 818262 824782 833311 843383 852728 861404 871870 884654 897761 910801 925669 942502
58351 942502 958974 974410 990628 1007801 1023585 1037253 1050603 1063696 1073891 1080304 1085005 1088526
58339 1088526 1088439 1083938 1077693 1071678 1065202 1058543 1054233 1053055 1052861 1053006 1055797 1061981 1069109 1076099 1085084
58324A085084J1857J2509J2290J4273J6795J6414J4853J6237J9547K0751K0407
58313A261017K2057K4945K5381K3815K3499K3690K1134J6815J4348J3139R980
58302A479820N863M358M807M044L121N256Q889R998R528J1343J4663J6026J6633
58289A594349J9993K4313K5269K4360K6353L0372L1922L1840L4501L8898M0441
58278A922611M0046M2456M7040M9375N0380N4502O0272O2231O0872O1172O2628
58267B513585O0473N5315N1723M8827M2492L5119L2737L4049L3191L1463L4899
58256B973873M2020M5970M7381N2706O1169O6004O7667P2848Q1217Q6253Q8433
58245C685541R4255J02919J07716J09745J16326J26626J33261J37110J45660J57873
$$ plain form
58324 1085084 1096941 1109450 1121740 1136013 1152808 1169222 1184075 1200312 1219859 1240610 1261017
58313 1261017 1283074 1308019 1333400 1357215 1380714 1404404 1425538 1442353 1456701 1469840 1479820
58302 1479820 1485683 1490041 1494848 1498892 1502013 1507269 1516158 1526156 1535684 1547027 1561690 1577716 1594349
58289 1594349 1614342 1638655 1663924 1688284 1714637 1745009 1776931 1808771 1843272 1882170 1922611
58278 1922611 1962657 2005113 2052153 2101528 2151908 2206410 2266682 2328913 2389785 2450957 2513585
58267 2513585 2574058 2629373 2681096 2729923 2772415 2807534 2840271 2874320 2907511 2938974 2973873
58256 2973873 3015893 3061863 3109244 3161950 3223119 3289123 3356790 3429638 3510855 3597108 3685541
58245 3685541 3779796 3882715 3990431 4100176 4216502 4343128 4476389 4613499 4759159 4917032
58235D917032J66214J72297J84285K00236K11271K19716K35887K58328K76371
58226F841637K91010L13075L41797L66479L88638M20103M59790M95842N30354
58217A0448725N77324O36454O95072P55749Q34232R30435J031189J141635J282159
58208A8332974J454598J646063J866152K143068K483054K874419L330924L885293
58200C8016545M540639N280941O131425P152581Q376613R818603J1550576J3684013
58192A04551936J6277018J9346676K2941227K7012543L1151764L4616274L6689407
58185B92586845L6784619L4053358K7276438J5779912O80823j5062388k8138835
58178C63960772l6547095m0063686l9616378l6520674l2055673k7227131k2629157
$$ plain form
58235 4917032 5083246 5255543 5439828 5640064 5851335 6071051 6306938 6565266 6841637
58226 6841637 7132647 7445722 7787519 8153998 8542636 8962739 9422529 9918371 10448725
58217 10448725 11026049 11662503 12357575 13113324 13947556 14877991 15909180 17050815 18332974
58208 18332974 19787572 21433635 23299787 25442855 27925909 30800328 34131252 38016545
58200 38016545 42557184 47838125 53969550 61122131 69498744 79317347 90867923 104551936
58192 104551936 120828954 140175630 163116857 190129400 221281164 255897438 292586845
58185 292586845 329371464 363424822 390701260 406481172 407161995 392099607 363960772
58178 363960772 327413677 287349991 247733613 211212939 179157266 151930135 129300978
58171A29300978j8510946j4965872j2014541r582916p545730n818056m347461
58164E6515456l052544j864819q12823K8638O49152J047347J075046M92348p39395
58155E3338406k295162l684037m572020m895985m762161m330376l762811l185476
58147B1850378k659327k199661j814696j508617j267063j069264r08273p82696
58139I640781o80758n90236n13145m55034m10172l70620l38678l17553l00651
58130E663934k81873k65597k55598k45020k27783k09043j94293j79060j59276
58121C646391j41080j30245j21904j10546j00634r7777r8432r7302r6319r7793
58111B554359r7188r1065q4192q0868p7199o9398o1631n8177n5571m9968m4697
$$ plain form
58171 129300978 110790032 95824160 83809619 74226703 66680973 60862917 56515456
58164 56515456 53462912 51598093 50785270 50813908 51463060 52510407 53585453 54077801 53338406
58155 53338406 51043244 47359207 42787187 37891202 33129041 28798665 25035854 21850378
58147 21850378 19191051 16991390 15176694 13668077 12401014 11331750 10423477 9640781
58139 9640781 8960023 8369787 7856642 7401608 6991436 6620816 6282138 5964585 5663934
58130 5663934 5382061 5116464 4860866 4615846 4388063 4179020 3984727 3805667 3646391
58121 3646391 3505311 3375066 3253162 3142616 3041982 2944205 2845773 2748471 2652152 2554359
58111 2554359 2457171 2366106 2281914 2201046 2123847 2054449 1992818 1934641 1879070 1829102 1784405
58100A784405m3268m2269l8211l4266l3384l1831k6440k1311k0563k1200j9731
58089A451931j9149k2628k6734k7634k7937l0857l3591l2841l1261l2112l3037
58078A134150l1270k9417l0086l0225k6901k3384k3378k4322k2436j9482j8601
58067H54648j8105j5420j2635j2357j2351r926p397p682q683p543o252p568r413
58054G19316q880p871r249j1071j0223q256q215q896p582n486n309o159n764m990
58040F11365n581o228n211m142m777n183l253j049j263k486k255j822l404n552
58026E59159n677m535m071l450j353M81J21p96l7J175R64P44K407M338M297L537
58010E57304M108M843M020L118L856M386K719J030K146M496N041M603N556O743
$$ plain form
58100 1784405 1741137 1698868 1660657 1626391 1593007 1561176 1534736 1513425 1492862 1471662 1451931
58089 1451931 1432782 1410154 1383420 1355786 1327849 1296992 1263401 1230560 1199299 1167187 1134150
58078 1134150 1102880 1073463 1043377 1013152 986251 962867 939489 915167 892731 873249 854648
58067 854648 836543 821123 808488 796131 783780 773854 766457 758775 750092 742549 736297 728729 719316
58054 719316 710436 702565 693316 682245 672022 663766 655551 646655 639073 633587 628278 622119 616355 611365
58040 611365 605784 599556 594345 590203 585426 580243 576990 575941 574678 572192 569937 568115 564711 559159
58026 559159 553482 548947 544876 541426 540073 540554 540675 539879 539842 541017 541981 542725 545132 549470 553767 557304
58010 557304 561412 566255 570275 573393 577249 581635 584354 585384 587530 592026 597067 601670 607226 613969
57996F13969N557K975J668R64j529n011o846p403q905j0828j0911r650r460j0314
57982E44276j0208r127q725q930q433p558p292o632m198j286J3L15J351K509K409
57967D78484K236L847O120O809O572P410Q656Q369P339P618Q290O772L471J120
57953E63113J94j117l020l938l816l996m159k773k55J476K140K875L456K818J603
57938E54601J180Q32j053l698m953m829n115o168p067q054r828j1326j1223j0741
57924D72558j1847j3658j3867j2747j2349j2576j1637r672q428p824o277m082
57912C47594l004k826j648O46K470L714N593P546P717O383N734O252O415N893
57898C98479N955O715O980O714O779O399M028N97j225j052j034k178l361m031
$$ plain form
57996 613969 619526 622501 624169 625133 623604 618593 611747 604344 595439 584611 573700 564050 554590 544276
57982 544276 534068 524941 516216 507286 498853 491295 484003 477371 473173 471887 471900 472215 473566 476075 478484
57967 478484 480720 484567 490687 497496 504068 511478 520134 528503 535842 543460 551750 558522 561993 563113
57953 563113 563307 562190 559170 555232 551416 547420 543261 540488 540233 541709 543849 546724 550180 552998 554601
57938 554601 555781 556613 555560 551862 546909 542080 536965 530797 523730 515676 505848 494522 483299 472558
57924 472558 460711 447053 433186 420439 408090 395514 383877 374205 365777 357953 351676 347594
57912 347594 344590 341764 340116 340762 343232 346946 352539 360085 367802 374185 379919 386171 392586 398479
57898 398479 404434 411149 418129 424843 431622 438021 442049 442646 441421 440369 439335 437157 433796 429765
57884D29765m780n173l997j935j064j594j848j478j706k400j982n17J82j78J68
57869D01463J848L505M469N526O663O739N814N245N189M510L227K383J494r36
57855D57139m248n991n783n732o633o875n772m807m657l973k178p67o31o05L35
57840C98822J636K822M279N574N288L445J973J853J911J096j29j384l144n240
57826D18802o546o888p330q134q447q376r128j0674j1455j0966j0341r970q840
57813C01707o843n407n161n090m548l973l208j406R83K397K750L473M786N454
57799B85914N626O943R250J0096Q476O244M974M124L442M193O583Q648R198R378
57785C83089R977R708P778N675M588L290L85l292o285q703j1094j2897j3553j3697
$$ plain form
57884 429765 424985 419812 415815 413880 412816 411222 409374 407896 406190 403790 401808 401291 401473 401295 401463
57869 401463 403311 406816 411285 416811 423474 430213 436027 441272 446461 450971 454198 456581 458075 457139
57855 457139 452891 446900 441117 435385 428752 421877 416105 411298 406641 402668 400490 399723 399092 398487 398822
57840 398822 400458 403280 407559 413133 418421 421866 423839 425692 427603 428699 428570 427186 424042 418802
57826 418802 412256 405368 398038 389904 381457 373081 363953 353279 341824 330858 320517 310547 301707
57813 301707 294864 289457 284296 279206 274658 270685 267477 266071 267054 269451 272201 275674 280460 285914
57799 285914 291540 298483 307733 317829 326305 332549 337523 341647 345089 349282 355865 364513 373711 383089
57785 383089 393066 402774 410552 416227 420815 424105 424490 421198 414913 406210 395116 382219 368666 354969
57771C54969j3843j3403j2162j1057j0409r160p004n353m969m587l218j859j471
57758B56474j162kJ207J538J699K571L518L667L452L481L328K756K610L250L636
57743B92023L183K923L437L468K104N76K54N08K49Q0J011K348K769K413K261K375
57727C21982K336K459L102L693L741L883M675N431N435N207N365N426M919M533
57713C82187M862N189M830M529N231O495P370P854Q358Q743Q993R711J1034J2150
57699D87536J2784J3796J5475J6781J7343J8494K1162K4355K7142L0378L4978
57688G20224M0058M4530M9108N5009O1918O8946P6472Q5476R6082J08167J22119
57677A528109J37605J52954J67275J81746J97296K12545K25734K36825K45527
$$ plain form
57771 354969 341126 327723 315561 304504 294095 284935 277931 272578 267609 263022 259804 257945 256474
57758 256474 255312 255310 256517 258055 259754 262325 265843 269510 272962 276443 279771 282527 285137 288387 292023
57743 292023 295206 298129 301566 305034 307138 307714 307968 308476 308725 308805 309816 312164 314933 317346 319607 321982
57727 321982 324318 326777 329879 333572 337313 341196 345871 351302 356737 361944 367309 372735 377654 382187
57713 382187 387049 392238 397068 401597 406828 413323 420693 428547 436905 445648 454641 464352 475386 487536
57699 487536 500320 514116 529591 546372 563715 582209 603371 627726 654868 685246 720224
57688 720224 760282 804812 853920 908929 970847 1039793 1116265 1201741 1297823 1405990 1528109
57677 1528109 1665714 1818668 1985943 2167689 2364985 2577530 2803264 3040089 3285616
57668C285616K48774K42582K25338J96696J54220R4304J7170p0250j56163k27938
57658D010349k76250k98467k98774k84188k60536k32260k03603j77504j54173
57649A824594j32706j13452r7221q3396p0881o0185n2369m6610m0890l4644k8767
57638A063473k3393j7739j1915o945l019O64M432P998J1537J5506J9639K3495
57626A083733K7625L2772L8442M3683M8820N4908O1915O9018P6328Q4687R4005
57615A715936J03148J11323J18282J23491J26190J25862J21638J11979R6151P5275
57605B829275N0758K2775q218l9584o7982r2021j11754j26516j35337j38851j38766
57594B043779j35794j29933j22223j14210j06052r7095q7916p9861p2872o5881
$$ plain form
57668 3285616 3534390 3776972 4002310 4199006 4353226 4447530 4464700 4394450 4238287 4010349
57658 4010349 3734099 3435632 3136858 2852670 2592134 2359874 2156271 1978767 1824594
57649 1824594 1691888 1578436 1481215 1397819 1326938 1266753 1214384 1167774 1126884 1092240 1063473
57638 1063473 1040080 1022341 1010426 1003481 1000462 1001126 1005558 1013556 1025093 1040599 1060238 1083733
57626 1083733 1111358 1144130 1182572 1226255 1275075 1329983 1391898 1460916 1537244 1621931 1715936
57615 1715936 1819084 1930407 2048689 2172180 2298370 2424232 2545870 2657849 2754000 2829275
57605 2829275 2880033 2902808 2894590 2855006 2787024 2695003 2583249 2456733 2321396 2182545 2043779
57594 2043779 1907985 1778052 1655829 1541619 1435567 1338472 1250556 1170695 1097823 1031942
57584A031942n8966n3205m8519m3799l8935l4790l1309k7671k4277k2331k1522
57573F26618k0158j7835j5831j4708j3533j1914j0670j0066r211p797o690o199
57561D82006n544m514m033m411m571l675k225r28K11J213J811K231L163M599N822
57546D71155O728P898R300J0290J1066J2544J4593J5963J6394J7189J9194K1752
57534F34066K4194K6901L0156L3322L5999L8916M2851M7624N2791N8441O4666
57523A089927P1058P7223Q3151Q8704R3522R7542J00775J02331J00630R4780Q4874
57512B084517P0930N2663L0621O514j7905m1457o2892q0699r3889j02355j06376
57501A739672j06547j04110j00325r5394q8848q0963p2872o5334n8353n1929m6187
$$ plain form
57584 1031942 972976 919771 871252 827453 788518 753728 722419 694748 670471 648140 626618
57573 626618 606460 588625 572794 558086 544553 532639 521969 511903 502692 494895 488205 482006
57561 482006 476462 471948 467915 463504 458933 455258 453033 452105 452316 453529 455340 457571 460734 465333 471155
57546 471155 477883 485781 495081 505371 516437 528981 543574 559537 575931 593120 612314 634066
57534 634066 658260 685161 715317 748639 784638 823554 866405 914029 966820 1025261 1089927
57523 1089927 1160985 1238208 1321359 1410063 1503585 1601127 1701902 1804233 1904863 1999643 2084517
57512 2084517 2155447 2208110 2238731 2245245 2227340 2185883 2122991 2042292 1948403 1846048 1739672
57501 1739672 1633125 1529015 1428690 1333296 1244448 1163485 1090613 1025279 966926 914997 868810
57490H68810m0823l5391l0062k5272k0949j6998j3964j2046j0045o793l024l42
57478F53101J326L388O132Q638J0958J4216J8378K2044K4864K8180L2736L7642
57466H61603M2163M6800N1948N7261O2952O9920P7861Q4882Q9860R3455R5993
57455A634698R6032R2201Q4879P4796O1238M3092K0809l730k8593n2163p2924
57444A950335q9808j02339j10088j12772j11208j07179j01898r5517q8392q1501
57434I49633p5118o8343o0799n3624m8005m3594l9329l5004l1212k8279k5875
57423D40451k3441k0610j7650j5441j4478j4006j2885j1120r659q928q622q607
57411B75004q880q848q023p061o747o477n383m396m999o311n986m031k952l660
$$ plain form
57490 868810 827987 792596 762534 737262 716313 699315 685351 673305 663260 656467 653443 653101
57478 653101 654427 657815 663947 672585 683543 697759 716137 738181 763045 791225 823961 861603
57466 861603 903766 950566 1002514 1059775 1122727 1192647 1270508 1355390 1445250 1538705 1634698
57455 1634698 1730730 1822931 1907810 1982606 2043844 2086936 2107745 2104015 2075422 2023259 1950335
57444 1950335 1860527 1758188 1648100 1535328 1424120 1316941 1215043 1119526 1031134 949633
57434 949633 874515 806172 745373 691749 643744 600150 560821 525817 494605 466326 440451
57423 440451 417010 396400 378750 363309 348831 334825 321940 310820 301161 292233 283611 275004
57411 275004 266124 257276 249253 242192 235445 228968 223585 219189 214190 207879 201893 197862 194910 191250
57397A91250m053k699j188j329k320k440j678r43k61N67R02L35k87k03M2j93m57
57380A75045l64n54j423k108j928j474j261o98L94Q40m4j104j273j329k193k966
57364A57560k402j116m71l36K32R77R22K05j81j1K31M82Q23P30j55j116j382j335
57346A53657j552j503n82M52M73j63k22M84J120J275J160Q03K03j13K89R62J261
57329A58004J183Q70P9r16r51M51K046K533K265K304K666K843L053L601L907L410
57313A87348K682K395K104J409J273K593M286M557L449K556K661L225L778M325
57299B28641M692M812N275O459P547P657P350P774Q893R870J0655J1810J3213
57286C34648J4214J4721J5022J5075J5079J5905J7755J9152J8664J6897J5379
$$ plain form
57397 191250 187197 184498 183310 181981 179661 177221 175543 174600 174339 174906 175808 176143 175856 175653 175695 175502 175045
57380 175045 174681 174127 172704 170596 168668 167194 165933 165235 165629 166469 166425 165321 164048 162719 160526 157560
57364 157560 155158 154042 153571 153235 153467 154444 155366 155571 155390 155379 155610 156092 156915 157645 157490 156374 154992 153657
57346 153657 152105 150602 150020 150472 150945 150782 150560 151044 152164 153439 154599 155402 155605 155492 155781 156743 158004
57329 158004 159187 160057 160136 159220 158269 158720 160766 163299 165564 167868 170534 173377 176430 180031 183938 187348
57313 187348 190030 192425 194529 195938 197211 199804 204090 208647 212096 214652 217313 220538 224316 228641
57299 228641 233333 238145 243420 249879 257426 265083 272433 280207 289100 298970 309625 321435 334648
57286 334648 348862 363583 378605 393680 408759 424664 442419 461571 480235 497132 512511
57275E12511J4287J2751J0707Q660O251K723j604n903j0328j5241j9504k1444
57263D93866k1305k0982k1391k1708k1166k0051j8812j7496j6172j4842j3138
57252B86803j1046r465r003q816p813o372n511n055m196l154k695k571k099j668
57238B07339j989k404j804o71l30o16k80O31Q87L35J9J33q7m67L8J267J857J487
57220B05345J300J786K117J863J614J589J260O76N88J064J472J929L051M297M340
57205B34291L254K498K505K260J481J248J921K352J898J452J841K667L415M186
57191B67269M838M828M441M672N434N434M334L417L538M006M130M363N091N665
57177C31460N552N234N307N649O029O524O986P134P323Q083Q821Q483P531P661
$$ plain form
57275 512511 526798 539549 550256 558916 565167 567890 566286 560383 550055 534814 515310 493866
57263 493866 472561 451579 430188 408480 387314 367263 348451 330955 314783 299941 286803
57252 286803 275757 266292 257289 248473 240660 234288 228777 223722 219526 216372 213677 211106 209007 207339
57238 207339 205350 202946 201142 200471 200141 199525 199245 199876 200763 201098 201117 201250 201163 200696 200734 202001 203858 205345
57220 205345 206645 208431 210548 212411 214025 215614 216874 217550 218138 219202 220674 222603 225654 229951 234291
57205 234291 237545 240043 242548 244808 246289 247537 249458 251810 253708 255160 257001 259668 263083 267269
57191 267269 272107 276935 281376 286048 291482 296916 301250 304667 308205 312211 316341 320704 325795 331460
57177 331460 337012 342246 347553 353202 359231 365755 372741 379875 387198 395281 404102 412585 420116 427777
57163D27777R312J1113J2166J3084J4375J5529J6318J7280J8379J8811J8761J9590
57151F12495K1599K3411K4312K5475K7870L0714L2989L4985L7208L9231M0741
57140I51030M2405M4598M6448M7215M7430M7854M8467M9283N0904N3365N5695
57129A484694N7435N9397O2148O5131O8072P1814P6813Q2214Q7375R2935R9406
57118B307434J06121J12570J19443J27291J35598J44254J54566J67623J83089
57109C557989K00846K22404K49327K81712L19795L65905M23213M93584N78267
57100F693042O79778Q01630R46847J118163J318734J551113J815897K112247K438523
57091A9475974K790817L161420L539830L914323M271046M592815M861119N059363
$$ plain form
57163 427777 437089 448202 460368 473452 487827 503356 519674 536954 555333 574144 592905 612495
57151 612495 634094 657505 681817 707292 735162 765876 798865 833850 871058 910289 951030
57140 951030 993435 1038033 1084481 1131696 1179126 1226980 1275447 1324730 1375634 1428999 1484694
57129 1484694 1542129 1601526 1663674 1728805 1796877 1868691 1945504 2027718 2115093 2208028 2307434
57118 2307434 2413555 2526125 2645568 2772859 2908457 3052711 3207277 3374900 3557989
57109 3557989 3758835 3981239 4230566 4512278 4832073 5197978 5621191 6114775 6693042
57100 6693042 7372820 8174450 9121297 10239460 11558194 13109307 14925204 17037451 19475974
57091 19475974 22266791 25428211 28968041 32882364 37153410 41746225 46607344 51666707
57083E1666707N171402N174397N032414M699911M139505L347411K368518J284789
57075H2885054J81507q82602j879389k793742l606323m290313m818435n171124
57067E9624633n341859n339234n185086m909695m546823m130142l690421l253102
57059B3228271k836979k454050k110186j806825j543299j318002j127954r68799
57051I062177q36366p27636o39410n66982n05233m50789m02295l59321l21655
57042D252490k89115k61044k36301k14213j94862j77985j62509j47911j34964
57033B433586j24255j14923j05788r6906q8965q1967p5500o9590o4320n9351n4565
57022A497456n0447m6954m3089l8344l3440k8787k3414j6459q399K74J0190K1819
$$ plain form
57083 51666707 56838109 62012506 67044920 71744831 75884336 79231747 81600265 82885054
57075 82885054 83066561 82183959 80304570 77510828 73904505 69614192 64795757 59624633
57067 59624633 54282774 48943540 43758454 38848759 34301936 30171794 26481373 23228271
57059 23228271 20391292 17937242 15827056 14020231 12476932 11158930 10030976 9062177
57051 9062177 8225811 7498175 6858765 6291783 5786550 5335761 4933466 4574145 4252490
57042 4252490 3963375 3702331 3466030 3251817 3056955 2878970 2716461 2568550 2433586
57033 2433586 2309331 2194408 2088620 1991714 1902749 1820782 1745282 1675692 1611372 1552021 1497456
57022 1497456 1447009 1400055 1356966 1318622 1285182 1256395 1232981 1216522 1208123 1208397 1218587 1240406
57010A240406L4758M9566O8219R0677J12937J30701J42670J46585J34025R4926
57000B245470K9366m8087j17332j64764j87113j87954j73759j51663j27515j04592
56990A012057q4185o6871n2843m1626l2301k4044j6524j0188o070m913o614j0812
56978F55066j7359k5406l2722l7166l8570l8125l6248l2352k6621k0516j5229
56967C34752j0582n839q33M002Q125J1343J4126J7330K1169K4829K7508K9136
56955D75066K9412K6998K0770J1320L18j0796k0461k6412k7378k4967k2121j9769
56943D11980j6549j1764o728k846R5L045O377J0097J4377J9241K4295K9102L3214
56930E13936L5664L5102L0687K2411J0738l313j7709k9807l7655m0732l9764l6298
$$ plain form
57010 1240406 1275164 1324730 1392949 1483626 1596563 1727264 1869934 2016519 2150544 2245470
57000 2245470 2274836 2226749 2109417 1944653 1757540 1569586 1395827 1244164 1116649 1012057
56990 1012057 927872 861001 808158 766532 734231 710187 693663 683475 677405 672492 665878 655066
56978 655066 637707 612301 579579 542413 503843 465718 429470 397118 370497 349981 334752
56967 334752 324170 318331 317498 321500 329625 340968 355094 372424 393593 418422 445930 475066
56955 475066 504478 531476 552246 563566 563884 553088 532627 506215 478837 453870 431749 411980
56943 411980 395431 383667 376939 374093 374188 377233 383610 393707 408084 427325 451620 480722 513936
56930 513936 549600 584702 615389 637800 648538 645225 627516 597709 560054 519322 479558 443260
56918D43260l2097k8188k4501k0714j7096j4068j1606r662q514q007p148n347
56906B56312l354k057j097K40J519J859J611J932L092M383N446O498P580Q674
56892B92638J0248J2579J5007J6844J8518K0631K2565K3254K2639K0915J7111
56881D92949J0180J156p473j4188j8764k0746j9626j6363j2834r632n936j523
56869C77200K868P134J1993J7408K2556K7579L3649M0909M7854N3078N6163N6516
56857G54907N2721M3601K9007R761j1847l1665m5578n2236n2933m9146m1781l2513
56845E72298k3507j5416p227J610J0641J9993L0484M1722N2245O2047P2711Q4069
56833I01670R2747R5125Q9877P6499N3668K1378j6177n1767p9056r4954r9497
$$ plain form
56918 443260 411163 382975 358474 337760 320664 306596 294990 285328 276814 268807 261659 256312
56906 256312 252958 250901 249804 250044 251563 253422 255033 256965 260057 264440 269886 276384 283964 292638
56892 292638 302886 315465 330472 347316 365834 386465 409030 432284 454923 475838 492949
56881 492949 503129 504285 496812 482624 463860 443114 423488 407125 394291 384659 378723 377200
56869 377200 380068 387202 399195 416603 439159 466738 500387 541296 589150 642228 698391 754907
56857 754907 807628 851229 880236 889997 878150 846485 800907 748671 695738 646592 604811 572298
56845 572298 548791 533375 526148 527758 538399 558392 588876 630598 682843 744890 817601 901670
56833 901670 994417 1089542 1179419 1255918 1309586 1330964 1314787 1263020 1183964 1089010 989513
56822I89513r5034q5041p2398n8548m4450l1397k0224j0422q67Q970J9004K9079
56810F28185L8988M8336N6647O3180O6489O4741N6525M1104J8589q954l6782n9448
56798I77600p3880p9971p8793p1826o1672n1370m2212l3500k4749j6706r819l404
56786D29698L095R396J5482K1908K8310L2973L4720L3914L0774K4050J2563k677
56774F74206j8723l2431m1606m5595m5487m3178l9731l5197k9929k4910k0666
56763B96753j6978j3858j1618r912q054o423o028o505o198m576k899k103j706
56750A99895j268j117j024p5J386J624L09n68K80J332P64o52q50M96J908K192
56734B04632J231n40k205k639j739p67o19p20l42K7l39j050j265r56n80l02k36
$$ plain form
56822 989513 894479 809438 737040 678492 634042 602645 582421 571999 571132 580102 599106 628185
56810 628185 667173 715509 772156 835336 901825 966566 1023091 1064195 1082784 1073830 1037048 977600
56798 977600 903720 823749 744956 673130 611458 560088 517876 484376 459627 442921 433102 429698
56786 429698 432793 442189 457671 479579 507889 540862 575582 609496 640270 664320 676883 674206
56774 674206 655483 623052 581446 535851 490364 447186 407455 372258 342329 317419 296753
56763 296753 279775 265917 254299 244387 236333 229910 223882 217377 211179 206603 203704 201601 199895
56750 199895 198627 197510 196486 196411 197797 199421 199730 199162 199442 200774 201538 200886 200036 200532 202440 204632
56734 204632 205863 205323 203118 200479 198740 197973 197354 196634 196292 196319 195980 194930 193665 192709 192129 191827 191591
56717A91591o77j383j524q66j55J74N14Q87O43j57m95j71k44r88j150k06M07m47
56699A85753j688j785r46k15K88P85Q05J59j30O61J641J766J438J376J136K47
56683A91291m54j50L46n1p40m64N27J004O99K66o1k95N3J241K391K619K342K301
56665B02865K108J103j56o22l62k00m13p97j316j649j059K81Q28k39j598j749
56649A97025j189j208j697j757j510j596j709j287q85j299k047k209k076k429
56635A74127k992l035k775k678k245r94K13M06J79N47J021O45L3M63J577J926
56619A66418J271N95L07J51L42J134J777J505R82J107J207K48r89r60O3N75M13
56602A76146O05J082Q02n5k36L23M88J53L73J208J507J080J087J916K464J992
$$ plain form
56717 191591 190914 189531 188007 187141 186986 187160 187674 188561 189204 189047 188552 188381 188137 187149 185999 185793 186200 185753
56699 185753 184065 182280 181334 181119 181407 182192 182997 183156 183026 183687 185328 187094 188532 189908 191044 191291
56683 191291 190837 190687 191033 190982 190242 189778 190305 191309 192008 192274 192213 191918 191971 193212 195603 198222 200564 202865
56665 202865 204973 206076 205920 205298 204936 204736 204323 203526 202210 200561 199502 199783 200611 200372 198774 197025
56649 197025 195836 194628 192931 191174 189664 188068 186359 185072 184187 182888 180841 178632 176556 174127
56635 174127 171135 168100 165325 162647 160402 159408 159621 160027 160206 160753 161774 162419 162452 162915 164492 166418
56619 166418 167689 168284 168591 168742 169084 170218 171995 173500 174482 175589 176796 177044 176055 175095 175158 175733 176146
56602 176146 176751 177833 178635 178580 178344 178667 179155 179308 179681 180889 182396 183476 184563 186479 188943 190935
56586A90935J104M77L3l48n57q86j673k301j817n02N11R52J389J793J636J249
56570A91995J453K011K027J671J903K639K962K976L656M833N287M892M777N193
56556B38275N088M188L615L901M155L784L448L570L374K188N50o70j301j545j501
56541B71119j428j670k129k537l159m313n374n403m580l859l390k602j680j495
56527B27500k040k340k014j688j738j852j904k104k250j983j653j813k039j517
56513B00565n77k59o14q35q69j308j868j631p72m42p40n56M20J080O71k63j016
56496A90986j534j786j525r32m82q5N86J102P59j09n47m42l29o0Q58J831J742
56479A90033Q20M60J165K159K839L157K760J347j23j90J108K423L123L643M059
$$ plain form
56586 190935 192039 192516 192549 192201 191644 190758 189085 186784 184967 184465 184976 185928 187317 189110 190746 191995
56570 191995 193448 195459 197486 199157 201060 203699 206661 209637 213293 218126 223413 228305 233082 238275
56556 238275 243363 247551 251166 255067 259222 263006 266454 270024 273398 275586 276136 275466 274165 272620 271119
56541 271119 269691 268021 265892 263355 260196 255883 250509 245106 240526 236667 233277 230675 228995 227500
56527 227500 225460 223120 221106 219418 217680 215828 213924 211820 209570 207587 205934 204121 202082 200565
56513 200565 199988 199729 199115 198280 197411 196103 194235 192604 191832 191390 190650 190094 190514 191594 192265 192002 190986
56496 190986 189452 187666 186141 185209 184727 184642 185228 186330 187089 186980 186433 185991 185662 185602 186460 188291 190033
56479 190033 190853 191313 192478 194637 197476 200633 203393 204740 204617 204427 205535 207958 211081 214724 218783
56464B18783M013L825M048M096L029J515J144J887K109J145On16o42m80J69P63
56448B44894M43n11j174j600k273k496j384lj20j179j032L98Q78m79k038k516
56432B29808k481k420j819q98r02j830k033r31K0j28l88J78R69J243J254J234
56416B20876Q88N03Q72J667J684J029J094J978K119R24l07p46j151j917k161j496
56400B25856q48o84l40L34N42L12P26J837K382K004J730J802J233qo61o00j168
56383B34449k474k804j495l4M98P02Q92L88l91K25K244L453K836J982K087K172
56367B44730J494J132J794K421K356K455K895K369Q04J97J306K111J231K54Q73
56352B68422K114K392K074K116K210K022K294L108L076J791R45J450J773P71j99
$$ plain form
56464 218783 222796 226621 230669 234765 237794 239309 240453 242340 244449 245594 245600 245084 244442 243962 244131 244894
56448 244894 245337 244826 243652 242052 239779 237283 235899 235896 235776 234597 233565 233963 234841 234362 232324 229808
56432 229808 227327 224907 223088 222190 221288 219458 217425 216494 216514 216386 215998 216176 217145 218388 219642 220876
56416 220876 221764 222267 223139 224806 226490 227519 228613 230591 232710 233634 233327 232581 231430 229513 227352 225856
56400 225856 225008 224324 223984 224318 224860 225172 225898 227735 230117 232121 233851 235653 236886 236878 236217 235617 234449
56383 234449 231975 229171 227676 227642 228140 228842 229734 230122 229731 229956 232200 235653 238489 240471 242558 244730
56367 244730 246224 247356 249150 251571 253927 256382 259277 261646 262450 262647 263953 266064 267295 267549 268422
56352 268422 270536 272928 275002 277118 279328 281350 283644 286752 289828 291619 292564 294014 295787 296558 296359
56337B96359J07N42j41q40j59J055J367J175J572K390L066L799M379L756K189
56322C20616J708K989M067L630L111L764M274L404K445K777L313K763K215L036
56308C64112M236M304L756L642L425K591K352L436M224L329K066K045K393J779
56294D07690J088J564K241J776J022J213J504P90J98J167K793L598M160N509O770
56279D43083O971P394R414J1779J2702J2949J4102J5560J6018J6341J8140K0990
56267F05443K3622K6358K9851L3080L5237L7869M2498M7871N2194N6199O1275
56256A051497O6486P0459P4296P9465Q4525Q7127Q7693Q7971Q7586Q5120Q0977
56245A943202P6015O8983N8651M6870L6143K5791J3967J883p663j4682k1149k6964
$$ plain form
56337 296359 296466 297008 296867 296027 295868 296923 298290 299465 301037 303427 306493 310292 314671 318427 320616
56322 320616 322324 325313 329380 333010 336121 339885 344159 347563 350008 352785 356098 358861 361076 364112
56308 364112 368348 372652 376408 380050 383475 386066 388418 391854 396078 399407 401473 403518 405911 407690
56294 407690 408778 410342 412583 414359 415381 416594 418098 418888 419086 420253 423046 426644 430804 436313 443083
56279 443083 450054 457448 466862 478641 491343 504292 518394 533954 549972 566313 584453 605443
56267 605443 629065 655423 685274 718354 753591 791460 833958 881829 934023 990222 1051497
56256 1051497 1117983 1188442 1262738 1342203 1426728 1513855 1601548 1689519 1777105 1862225 1943202
56245 1943202 2019217 2088200 2146851 2193721 2229864 2255655 2269622 2271505 2263842 2249160 2228011 2201047
56233B201047l0484l2159l4064l6452l8139l9558m2142m5370m7617m9224n1790
56222A754048n5139n7902o0062o2148o3109o1887n9906n9001n8219n5708n2255
56211A108712m9757m7683m4401m0491l7298l3882k9011k4517k2798k2442k0420
56200G36012j7167j5295j4567j2600r613q021p937p362o263o330p138o648n067
56187F12004m269l983k555q23j044k429k010L44J938K022K435L671M291M254M957
56172F18803O088O091N548O437Q293Q904Q363Q780J0353J1482J2227J3834J5462
56159G40665J5369J4726J6177J9074K0449K0201K1036K3567K5900K7859L1325
56148I76348L6459M1659M7277N5308O5605P6353Q8045J02973J20994J39578J57433
$$ plain form
56233 2201047 2170563 2138404 2104340 2067888 2029749 1990191 1948049 1902679 1855062 1805838 1754048
56222 1754048 1698909 1641007 1580945 1518797 1455688 1393801 1333895 1274894 1216675 1160967 1108712
56211 1108712 1058955 1011272 966871 926380 889082 855200 826189 801672 778874 756432 736012
56200 736012 718845 703550 688983 676383 666770 658749 650812 643450 637187 630857 623719 617071 612004
56187 612004 607735 603752 601197 600374 599330 596901 594891 595235 597173 599195 601630 605301 609592 613846 618803
56172 618803 624891 630982 636530 642967 651260 660164 668527 677307 687660 699142 711369 725203 740665
56159 740665 756034 770760 786937 806011 826460 846661 867697 891264 917164 945023 976348
56148 976348 1012807 1054466 1101743 1157051 1222656 1299009 1387054 1490027 1611021 1750599 1908032
56137A908032J74235J87501J93884J92882J85523J70892J48499J22796J00272
56128C384516Q2969O9297N9274N3254M6984L4526J5980l367k0802l7171n1169
56117C634291n9825o5110p3536q8127j06483j26754j49124j70637j85041j89419
56107B420235j85815j75812j59175j38381j18373j00683q3167o6095n2690m3115
56097A296929l4001k4668j7925j3957r524m065n46N89K282M856N271L160J552
56084A209953Q86j471n154o688o042o652q429p551l936j829k095j113J723K846
56070A164448J932K903O263P981P418Q559J1895J3002J0947J0217J2344J3541
56058A271450J2579J3111J6048J7509J6497J6667J8668J8796J7004J7817K1379
$$ plain form
56137 1908032 2082267 2269768 2463652 2656534 2842057 3012949 3161448 3284244 3384516
56128 3384516 3467485 3536782 3596056 3649310 3696294 3730820 3746800 3743433 3722631 3685460 3634291
56117 3634291 3574466 3509356 3435820 3347693 3241210 3114456 2965332 2794695 2609654 2420235
56107 2420235 2234420 2058608 1899433 1761052 1642679 1541996 1458829 1392734 1340044 1296929
56097 1296929 1262928 1238260 1220335 1206378 1196854 1192789 1192243 1192832 1195114 1199970 1205241 1208401 1209953
56084 1209953 1210839 1209368 1204214 1197526 1191484 1184832 1176403 1168852 1164916 1163087 1160992 1159879 1161602 1164448
56070 1164448 1166380 1169283 1175546 1183527 1190945 1199504 1211399 1224401 1235348 1245565 1257909 1271450
56058 1271450 1284029 1297140 1313188 1330697 1347194 1363861 1382529 1401325 1418329 1436146 1457525
56047A457525K2469K0291K0189K3497K5119K3570K3678K6703K7723K5752K6302
56036A722818L0651L2838L0894L0684L4727L7709L7160L8021M2236M4445M2671
56025B124854M2706M7166N0653N0559N1974N7097O0682O0715O2543O7653O9982
56014B746584O8111O9110P5187P9102P8119P9486Q6342R1663R2292R5184J03190
56003C664370J08891J09557J13569J24511J33774J36888J41911J53414J63760
55994D850645J68969J77151J92101K05166K12703K24468K44957K64390K78350
55985F818900K97366L26197L53663L74721M01643M40693M79721N12592N52884
55976A0558380O08592O67484P23476P92157Q82854R82174J084018J207717J366434
$$ plain form
56047 1457525 1479994 1500285 1520474 1543971 1569090 1592660 1616338 1643041 1670764 1696516 1722818
56036 1722818 1753469 1786307 1817201 1847885 1882612 1920321 1957481 1995502 2037738 2082183 2124854
56025 2124854 2167560 2214726 2265379 2315938 2367912 2425009 2485691 2546406 2608949 2676602 2746584
56014 2746584 2814695 2883805 2958992 3038094 3116213 3195699 3282041 3373704 3465996 3561180 3664370
56003 3664370 3773261 3882818 3996387 4120898 4254672 4391560 4533471 4686885 4850645
55994 4850645 5019614 5196765 5388866 5594032 5806735 6031203 6276160 6540550 6818900
55985 6818900 7116266 7442463 7796126 8170847 8572490 9013183 9492904 10005496 10558380
55976 10558380 11166972 11834456 12557932 13350089 14232943 15215117 16299135 17506852 18873286
55967A8873286J548021J749270J996622K309074K675716L096007L603214M218672
55959D0069882M926626N729233O680269P828436R183907J0786314J2741517J5137005
55951A13083189J7994065K1351794K5253459K9489715L3438127L6319000L7495861
55944C14425210L6266820L1496699K2065440Q157954p978217k2906043l3818835
55937C47709028l9672658m0978173l8973067l5008455l0252085k5509239k1182277
55930A16133074j7417263j4265137j1708918r652223p983705o639872n576177
55923D2889779m723554m017499l435928k970228k588078k257076j976070j750836
55915A9170510j562746j389677j234966j108703j000857q97571q04732p31823
$$ plain form
55967 18873286 20421307 22170577 24167199 26476273 29151989 32247996 35851210 40069882
55959 40069882 44996508 50725741 57406010 65234446 74418353 85204667 97946184 113083189
55951 113083189 131077254 152429048 177682507 207172222 240610349 276929349 314425210
55944 314425210 350692030 382188729 404254169 412412123 404433906 381527863 347709028
55937 347709028 308036370 267058197 228085130 193076675 162824590 137315351 116133074
55930 116133074 98715811 84450674 72741756 63089533 55105828 48465956 42889779
55923 42889779 38166225 34148726 30712798 27742570 25154492 22897416 20921346 19170510
55915 19170510 17607764 16218087 14983121 13874418 12873561 11975990 11171258 10439435
55907A0439435o69780o06526n48100n03988m66925m26497l88170l60441l37043
55898F131965l09360k83267k66783k53516k34624k15303k03714j94895j80843
55889C989660j65907j57433j51115j39866j27824j21903j18356j10673j02283
55880B794300r8900r6626q9729q2121p9481p7795p1186o3334o0034n7863n1293
55869A965938m3813m1074l9920l4958k9433k8971l0669k8720k5104k4923k6819
55858A611534k7503k9994l7754m6025m8400m6922m6811m6551m2235l6609l4552
55847A168178l4116l0862k6661k5668k5937k3464k0266k0147k0598j7229j2319
55836I10911j0875j1798j0866q800q628q619n645k195k429m435l865k099l398
$$ plain form
55907 10439435 9769655 9163129 8615029 8111041 7644116 7217619 6829449 6469008 6131965
55898 6131965 5822605 5539338 5272555 5019039 4784415 4569112 4365398 4170503 3989660
55889 3989660 3823753 3666320 3515205 3375339 3247515 3125612 3007256 2896583 2794300
55880 2794300 2695400 2598774 2509045 2426924 2347443 2269648 2198462 2135128 2075094 2017231 1965938
55869 1965938 1922125 1881051 1841131 1806173 1776740 1747769 1717100 1688380 1663276 1638353 1611534
55858 1611534 1584031 1554037 1516283 1470258 1421858 1374936 1328125 1281574 1239339 1202730 1168178
55847 1168178 1134062 1103200 1076539 1050871 1024934 1001470 981204 961057 940459 923230 910911
55836 910911 900036 888238 877372 868572 859944 851325 845680 843485 841056 836621 832756 830657 827259
55823H27259o945q999j0195j3471j7431j8739j8606k0163k1946k0660j7923j7521
55811F34660j8328j6518j2666j0337r597q075o302o110n742k513J721L423L515
55798E47131N128P515P835O767O771O873M722J677M65J5k141m701n154m919o474
55783E71510q006o665m440m831o187m681j665j564m361o524p807j0631j3942j4216
55769D75990j1813j0309j0109q556n741m446m723m098k900m064p791j1225j3278
55756C76937j5102j6274j5163j2698j1366j0990r631p764p259p269n675l552l581
55743B50613n048n100l955m101n218m805l062k361k514j339O84J128L70R06K364
55728B18562K000k20j688j941k894m586n210n010n693o494n259k993k595l609
$$ plain form
55823 827259 820314 811315 801120 787649 770218 751479 732873 712710 690764 670104 652181 634660
55811 634660 616332 599814 587148 576811 567214 559139 552837 546727 540985 538472 540193 543616 547131
55798 547131 552259 559774 567609 574376 581147 588020 592742 594419 594884 594899 592758 588057 582903 577984 571510
55783 571510 563504 556839 552399 547568 541381 536700 535035 533471 529110 522586 514779 504148 490206 475990
55769 475990 464177 453868 443759 435203 429462 425016 420293 416195 413295 409231 401440 390215 376937
55756 376937 361835 345561 330398 317700 306334 295344 285713 277949 270690 263421 257746 254194 250613
55743 250613 245565 240465 236510 232409 227191 222386 219324 216963 214449 213110 213794 214922 215292 216198 218562
55728 218562 220562 220342 218654 216713 213819 209233 204023 199013 193320 186826 181567 178574 175979 172370
55714A72370k980o73M12j04K75J822K147J212J784M318O025N777N458N733M825
55699B08401K336J50j186l054n195n589m402m008m563l648r92P13M62M26J787
55684A81638L059L471M296N781O341N736N653O314N941M248K979K384P30k034
55670B36537l738l834m090m796m065j775m02q33r82L07J569K106L413N796P038
55655B32251O029M625M439M704M616M849N453N036L375K097J739Q10j176k615
55641B76232k746k870l651m057l879m465n912o485n807n731o874p374o296n437
55627B04648o171p306p418o957o684o298n790n954o561o309n220m758n079m736
55613A19407l699l590m401m078k248j081j474j546k37P99L54l39k66l71j146j296
$$ plain form
55714 172370 169390 168717 169129 169025 169300 171122 173269 174481 176265 180583 186608 192385 197843 203576 208401
55699 208401 210737 210887 209701 206647 201452 195863 191461 187453 182890 179242 178250 178963 179425 179851 181638
55684 181638 184697 188168 192464 198245 204586 210322 215975 222289 228230 232478 235457 237841 238571 236537
55670 236537 232799 228965 224875 220079 216014 214239 213837 213004 212022 212329 213898 216004 219417 225213 232251
55655 232251 238280 242905 247344 252048 256664 261513 266966 272002 275377 277474 279213 280023 278847 276232
55641 276232 273486 270616 266965 262908 259029 254564 248652 242167 236360 230629 223755 216381 210085 204648
55627 204648 198477 191171 183753 176796 170112 163814 158024 152070 145509 139200 133980 129222 124143 119407
55613 119407 115708 112118 107717 103639 101391 100310 98836 97290 97053 97852 98206 97867 97601 97230 96084 94788
55597I4788l98j36j323k417k414k503l324l422k124j143j581k072j625j516k484
55582F6306k848j550m24j119k223j773m72m4l45l64l44p49p98MM99j53q79p27
55564E1997o25j321j552k33J315J392N72L78P66Q61Q02J024J040N51M27J114J476
55547E9984P04j78j14K81L26P27J881K460J497K51J96P20N80J42L51Q91J122J523
55529G3344K539L302L092K747L124L504L075K510K559K611K152K069K894L408
55515A12930K714K029K530L099K247P59K79N49K17p69j650k610m057n170n143
55500A07954m923n704o744o629n759n460n496m553k683j227p08n46n03q80j506
55485E4633j907k105k249k071j595j567k156k343j539o85n78n49m4O0q35j529
$$ plain form
55597 94788 94390 94254 92931 90514 88100 85597 82273 78851 76727 75584 74003 71931 70306 68790 66306
55582 66306 63458 61908 61484 60365 58142 56369 55897 55853 55508 55144 54800 54051 53253 53257 53756 53603 52724 51997
55564 51997 51372 50051 48499 48266 49581 50973 51545 51923 52689 53550 54352 55376 56416 56967 57394 58508 59984
55547 59984 60688 60510 60396 60677 61003 61730 63611 66071 67568 67819 68015 68735 69315 69457 69808 70699 71821 73344
55529 73344 75883 79185 82277 85024 88148 91652 94727 97237 99796 102407 104559 106628 109522 112930
55515 112930 115644 117673 120203 123302 125549 126308 126587 127136 127353 126584 124934 122324 118267 113097 107954
55500 107954 103031 97327 90583 83954 78195 72735 67239 62686 60003 58776 58068 57522 57019 56139 54633
55485 54633 52726 50621 48372 46301 44706 43139 40983 38640 37101 36416 35838 35289 35245 35305 34470 32941
55469C2941r39p3k53p69l20N08L32m96o94m11o53j120q11j55l82j211j285m81
55451B3728J55L77P68J164Q88K92K94O12K01p82j168o86j42J23M22O33M33L39
55433B7651J009J823J578M18l50j92L11P00R52P96P4n49m52k35p77j533j280j77
55415B9767M00p2p54q39k94O30J484J509N16m75m70J08K86J03J27R9m81j071q73
55396B9700l83o37j356j454r27o82p49l56M01O05J86L0K92J26p38j450j371q36
55378B0401l76r0L0n7k13l38o10r89r23k12M04L10K2J96M69L06J78O57J061M53
55358B0679o29q67k08K67J76J20L35M04K03Oj56k85L8Q89J334O46l75n23rJ32
55338B2177j64k10j28n81j311j354o02J66N88Q12O62p8q29r28p08p71p03Q7R19
$$ plain form
55469 32941 32002 31929 31676 30907 30587 31095 31427 30931 30237 29826 29173 28053 27242 27087 26705 25494 24209 23728
55451 23728 23883 24260 25028 26192 27080 27372 27666 28278 28479 27697 26529 25843 25701 25824 26246 26879 27312 27651
55433 27651 28660 30483 32061 32479 32129 31937 32248 32948 33900 34696 34770 34221 33769 33534 32757 31224 29944 29767
55415 29767 30167 30095 29341 28502 28208 28838 30322 31831 32347 31872 31402 31510 31796 31899 32026 32125 31644 30573 29700
55396 29700 29317 28680 27324 25870 24943 24261 23512 23156 23557 24162 24348 24378 24670 24796 24058 22608 21237 20401
55378 20401 20025 19935 19965 19908 19695 19357 18747 17758 16835 16623 17027 17337 17359 17555 18024 18330 18508 19165 20226 20679
55358 20679 20050 19183 18975 19242 19418 19538 19873 20277 20480 20486 20330 20045 20083 20972 22306 22952 22577 22054 22045 22177
55338 22177 22013 21803 21675 21094 19783 18429 17827 17993 18581 19393 20055 19977 19148 18220 17512 16741 16038 16125 17044
55319A7044P37n8k65P4n4o93r41o77n87o35j68N79O98K76K83Q39J095Q08N46L88
55299A9289r4o30m65K57O93P71J044J312R17K06R4L31j41j197j560q56K0N79J098
55280B1668J335O28n73j028o84o83j308j635j357j117q69J19J337J195l32j231
55264A5465m05P80R05N49Q20J363J213M97jj59l31n00m55l28k72j81o3j52l19
55245A8426j10M82R19R36O97K08o04j229j056l80J07N49J430K134J510j06j111
55228B2802r22n08m35j81L30L24j48J10J308J940J070j69l75J62L66N9l15p25
55210B4693j171j096j37J086J683J518J023N32J94ll80j085j490q98J74M87j42
55193B4988o82n63j95K40J025J693J133n99k008k210j839j472p80J70L54m51r02
$$ plain form
55319 17044 17781 17723 17458 17532 17478 16785 15844 15167 14580 13945 13777 14356 15054 15330 15613 16452 17547 18355 18901 19289
55299 19289 19195 18565 18100 18357 19050 19821 20865 22177 23094 23300 23394 23725 23584 22387 20827 19971 19991 20570 21668
55280 21668 23003 23631 23058 22030 21346 20663 19355 17720 16363 15246 14377 14496 15833 17028 16696 15465
55264 15465 15060 15840 16745 17294 18114 19477 20690 21187 21186 21027 20696 20196 19741 19413 19141 18960 18897 18745 18426
55245 18426 18316 18798 19717 20653 21350 21558 20954 19725 18669 18289 18396 18945 20375 22509 24019 23913 22802
55228 22802 21880 21372 20937 20756 21086 21410 21262 21372 22680 24620 25690 25521 25146 25308 25674 25733 25418 24693
55210 24693 23522 22426 22289 23375 25058 26576 27599 28131 28325 28322 27942 26857 25367 24469 24643 25130 24988
55193 24988 24306 23743 23548 23788 24813 26506 27639 27040 25032 22822 20983 19511 18731 18901 19255 18804 17902
55176A7902p5J070J218N56K5j49j89N3N82P60K68k73l33k67l84k44L38O06P1n72
55156B0963n85l39m66p48p56p18q97q70l11L08N62Q13J330J538R76J89j08l5J9
55137B0865J20K12j61q46p22O82K149K331J505P71L84n0m09k31L97J031J542J910
55119C1480J936J753J976K649K865K106J051L74k74j183j566p56M75R33N93N9
55103D4471o76j732k328j674l51L96L56J92Q6k06l86L0N97M31l58p64l81K23M74
55084C8400L59P4q1L37J271J797J191J13k12K71M70j60r31j010m38J95N10N63
55066D2719N62M44j15j107j666q95P42J710J370O67M40K43m11p72m2J001Q66n61
55048D5195j946k207j337R7J320J509N56n49p62k03L42O11P80P21L13Q4N35J230
$$ plain form
55176 17902 17827 18897 20115 20671 20696 20547 20358 20411 20993 21753 22021 21748 21415 21148 20764 20520 20858 21464 21535 20963
55156 20963 20378 20039 19573 18825 18069 17351 16454 15584 15273 15581 16143 16956 18286 19824 20800 20989 20881 20846 20865
55137 20865 20985 21197 21036 20190 19468 20150 22299 24630 26135 26906 27290 27240 26831 26600 26997 28028 29570 31480
55119 31480 33416 35169 37145 39794 42659 44765 45816 46190 45916 44733 43167 42411 42886 43819 44412 44471
55103 44471 43795 42063 39735 38061 37710 38106 38462 38654 38740 38534 38148 38178 38775 39206 38848 38084 37703 37926 38400
55084 38400 38759 38833 38752 39089 40360 42157 43348 43461 43249 43520 43990 43830 42899 41889 41451 41646 42156 42719
55066 42719 43281 43725 43610 42503 40837 39942 40684 42394 43764 44431 44871 45114 44703 43931 43889 44890 45756 45195
55048 45195 43249 41042 39705 39802 41122 42631 43187 42638 41876 41673 42015 42626 43406 44127 44440 44524 45059 46289
55030D6289J429J258J249J115J46j320k025j412j99P55J252J392J232R73Q55P57
55014E3746L99j00l38k29L4M27R82J421J432J194J056R49N80O6j99r3J75M26N04
54995F2432J92m77j100j397j481j402r99m55l44p15q60m25O2K18M29Q29P20q6
54977E5141m73L87J519J563Q58P20J267J453Q84J68k89n16k74O02J323J040L69
54960F5742P29K158L200L059K433K115K083K278L022M163M932N084N309O086P028
54945A19421P786Q710J0076J1401J2070J2151J2162J2351J2477J1910R844N969
54933B46328J028l736p708j1000j3521j4763j4628j3793j2971j2217j1237r918
54921A21864q454p175o377n996n533m584l292k052r54J00J013J726K449L262L768
$$ plain form
55030 46289 47718 48976 50225 51340 51486 50166 48141 46729 46530 47285 48537 49929 51161 52134 52989 53746
55014 53746 54145 54045 53707 53478 53512 53939 54921 56342 57774 58968 60024 60973 61553 61619 61420 61327 61502 61928 62432
54995 62432 62624 62147 61047 59650 58169 56767 55768 55313 54969 54254 53394 52969 53031 53249 53678 54507 55227 55141
54977 55141 54668 55055 56574 58137 58995 59715 60982 62435 63319 63487 63198 62682 62408 63010 64333 65373 65742
54960 65742 66471 68629 71829 74888 77321 79436 81519 83797 86819 90982 95914 100998 106307 112393 119421
54945 119421 127207 135917 145993 157394 169464 181615 193777 206128 218605 230515 240359 246328
54933 246328 247356 243620 235912 224912 211391 196628 182000 168207 155236 143019 131782 121864
54921 121864 113410 106235 99858 93862 88329 83745 80453 78401 77447 77547 78560 80286 82735 85997 89765
54906H9765L742L731M399N594O769P925R327J0643J1322J1633J2385J3620J4382
54893B05237J3855J1960Q824M481o59n652r595j2179j3679j4632j5347j5460j4351
54880A42803j2228j0243r033p921o200m449l637l596l423k945k631k426j908j279
54866G0884j111j266j175r56j147j477j160k56M28P14J094J414Q87m27j407j499
54850F3540j315j367j306q80o01r24j552k031k286k268j816j124p09o39m36J13
54834D4399O41P99N43j25j013j501j145m51j65n9N95J554J817J237P04O34N34
54817D8998K29K36O40P61L28r6j02J30N69J340J900J475N37M86J537K411K531
54800F3910K884M015M840M452L730L903M775N579O499P997R502J0195J0507J1470
$$ plain form
54906 89765 93507 97238 101637 107231 114000 121925 131252 141895 153217 164850 177235 190855 205237
54893 205237 219092 231052 239876 244357 243698 238046 228451 216272 202593 187961 172614 157154 142803
54880 142803 130575 120332 111299 103378 97178 92729 89092 85496 82073 79128 76497 74071 72163 70884
54866 70884 69773 68507 67332 66376 65229 63752 62592 62336 62764 63478 64572 65986 66873 66446 65039 63540
54850 63540 62225 60858 59552 58672 58071 57147 55595 53564 51278 49010 47194 46070 45361 44722 44286 44399
54834 44399 45040 45839 46382 46257 45244 43743 42598 42147 41982 41923 42518 44072 45889 47126 47830 48464 48998
54817 48998 49227 49463 50103 50864 51192 51096 50994 51124 51693 53033 54933 56408 56945 57431 58968 61379 63910
54800 63910 66794 70809 75649 80101 83831 87734 92509 98088 104587 112584 122086 132281 142788 154258
54786A54258J3033J4253J4756J4874J4536J3131J0460O906K797j645n861r206
54774B42292j1574j3194j3975j3652j2411j0803r183p708o590n777m712k998j201
54761A28514k51j25J96J365K759L251K648K027K577M248N862O619P075Q196R931
54746A84892J1373J2141J2633J2936J2540J1431J0431R877Q768N941J556l201
54734B91318p454j1082j4129j6383j7499j7377j6434j5453j4731j3571j1261q524
54722A27420o995p086p329o343m496l004k230j738j425j604k203k622k432j742
54708G6171r94n92o14p37o07l39k31j42K84Q39R68P78R34J368J137n3j259j683
54690G5228j712j832j568l86J121J907J801J323P13n1o45p17m68k42J24Q30J433
$$ plain form
54786 154258 167291 181544 196300 211174 225710 238841 249301 256207 259004 257359 251498 242292
54774 242292 230718 217524 203549 189897 177486 166683 157500 149792 143202 137425 132713 129715 128514
54761 128514 128263 128138 128334 129699 132458 135709 138357 140384 142961 147209 153071 159690 166765 174961 184892
54746 184892 196265 208406 221039 233975 246515 257946 268377 278254 287022 292963 294519 291318
54734 291318 283864 272782 258653 242270 224771 207394 190960 175507 160776 147205 135944 127420
54722 127420 120425 113339 106010 99667 95171 92167 89937 88199 86774 85170 82967 80345 77913 76171
54708 76171 75177 74585 73971 73234 72627 72288 72057 71915 72199 73038 74006 74784 75718 77086 78223 78170 76911 75228
54690 75228 73516 71684 70116 69730 70851 72758 74559 75882 76595 76544 75899 75182 74714 74472 74596 75426 76859
54673G6859J388R83R61J439J851J834J522J135Q61R51J444J910J872J351O97K26
54657I7284K82J140K400L062K739K319K733L594L851L465L474M465N801O570O664
54642A49843O706P273Q333R319R704R529R199Q726P498N010J519k100n011o818
54628B18730p757q490r409j0139j0187r819r634r430q506p041o062n735m999l366
54614A08156j887j588j999k081j728j404j169r64j174j966k651k602k174j958
54600H2811j789j345r85j071j167q39n71q58j082m74M46O52K39j2j73q92j944
54583G0946k453k377k325k177j328k17q4r82j507q50K07P46R41J244J415J083
54567F2282N51L51N16O85N67Q0n25o49M9R53J107M75j07k11k24l50k07L14O37
$$ plain form
54673 76859 78247 79230 80191 81630 83481 85315 86837 87972 88833 89784 91228 93138 95010 96361 97058 97284
54657 97284 97566 98706 101106 104168 106907 109226 111959 115553 119404 122869 126343 130808 136609 143179 149843
54642 149843 156549 163822 172155 181474 191178 200707 209906 218632 226130 231140 232659 230559 225548 218730
54628 218730 210973 202483 193074 182935 172748 162929 153295 143865 135359 128318 122256 116521 111522 108156
54614 108156 106269 104681 102682 100601 98873 97469 96300 95336 94162 92196 89545 86943 84769 82811
54600 82811 81022 79677 78692 77621 76454 75615 75044 74186 73104 72630 73076 73728 73967 73955 73782 72890 70946
54583 70946 68493 66116 63791 61614 60286 60069 59985 59003 57496 56646 56853 57599 58540 59784 61199 62282
54567 62282 62833 63184 63700 64385 64952 65032 64507 63858 63907 64860 65967 66442 66335 66124 65900 65550 65343 65657 66294
54548F6294M17J49M41J144J706J845J600J034L75Q5M71J408K545L569M191M271
54532I1545M075M126M610N155N181M389L006J760J304J444J174j31j889l156l789
54517A18804m186m285l782l115l156l872m188l459k287j565j415j375j185r82
54503G9952r78j170j268r24k66Q1j90n60m68j77k02l25pM50K79l77n63j15l3q16
54483G2323j519j055K83J307J420J002O47N37M52O5o29j122q55O3R16J196J019
54466G6050P39N08K89m1n87j122j080k90M99M50j92m38j2L63K39P3L53P75P80
54447G7356L65m5j77k2L72Q55J118Q32r9j322k007j432P4J160R05j85j075j574
54429G5099k018k100j230J86R99R27P61Q86P93K50j34m6j4l33l86K82J088J280
$$ plain form
54548 66294 66711 66860 67301 68445 70151 71996 73596 74630 75005 75090 75561 76969 79514 83083 87274 91545
54532 91545 95620 99746 104356 109511 114692 119081 122087 123847 125151 126595 127769 127638 125749 122593 118804
54517 118804 114618 110333 106551 103436 100280 96408 92220 88761 86474 84909 83494 82119 80934 79952
54503 79952 78974 77804 76536 75612 75346 75427 75237 74677 74209 74032 73830 73505 73498 73948 74227 73850 73287 73172 73139 72323
54483 72323 70804 69749 70032 71339 72759 73761 74408 74945 75397 75462 74833 73711 72856 72919 73835 75031 76050
54466 76050 76789 77297 77586 77545 76958 75836 74756 74466 74965 75415 75223 74785 74773 75136 75375 75448 75801 76576 77356
54447 77356 77721 77676 77499 77477 77849 78704 79822 80654 80555 79233 77226 75794 75868 77028 77933 77748 76673 75099
54429 75099 73081 70981 69751 69937 70936 71863 72624 73510 74303 74553 74419 74373 74359 74026 73640 73922 75010 76290
54411G6290R91P69O69N32O03J138J809K087J949J711J486J242J059R30O45K45
54395I4155J98P83J640K221K362K098J407M47k91n13m29l71m19o17j103j731k015
54378I7822j770j393j238j136q36m62k52k20l53p05j092j148r00o89m54K66J282
54361H6722J621R05Q7J86R07J195O64k03q21q26q6R66J437J036N91Q81J449J392
54343I8103Q16N53P49P91N80P25J321J504O76n16j012o50j97k96q71j435j654
54326I9187j585j495j586j858k166k327k203j857j603j700j958j946j623j397
54312G3883j413j241n88P0N3n67j069j025o71m04k78j35P7K41K15o1m64p19o38
54293F5266k97K4R1q7k79k07J29L66J92k29m58l53j74q3N5L10M31J90k97p42j019
$$ plain form
54411 76290 77281 78050 78719 79251 79854 80992 82801 84888 86837 88548 90034 91276 92335 93265 93910 94155
54395 94155 94353 95136 96776 98997 101359 103457 104864 105311 105020 104507 104078 103707 103288 102671 101568 99837 97822
54378 97822 96052 94659 93421 92285 91449 90987 90735 90515 90162 89457 88365 87217 86317 85628 85174 85440 86722
54361 86722 88343 89248 89335 89521 90428 91623 92287 92084 91263 90437 90351 91317 92754 93790 94381 95262 96711 98103
54343 98103 98919 99472 100221 101012 101592 102317 103638 105142 105818 105302 104290 103640 103443 103147 102276 100841 99187
54326 99187 97602 96107 94521 92663 90497 88170 85967 84110 82507 80807 78849 76903 75280 73883
54312 73883 72470 71229 70641 70711 70764 70197 69128 68103 67432 67028 66750 66615 66692 66933 67148 67087 66623 65904 65266
54293 65266 64969 64993 65084 64997 64718 64511 64640 65006 65198 64969 64511 64158 63984 63901 63956 64266 64697 64887 64590 63848 62829
54272F2829j130j021o48j11L92P24Q82R42R22P04K81N6M99J341J586P25m44p88
54254F7741l03J01m6m15o81p95m72N79J782J968R29j71l32J14L06J37O7J78J42
54235G0829j80n85q34q34p21p97j048p73O19K391K937J797L12k19k01p46j761
54218G0186k093j252J6Q21J056J023Q40M32j12m87m39j85k78q87j321q04L09P33
54200F7558j39j476k069j603n92L38P38M30k43o62o69o46p26n64j30jm19q25p16
54181E7584l42j8M85J269J714J320N63J64L6l08p29o88j50L94O50O48M74L51N93
54162F4010J009Q43j71j209j484j336j430j499q79J24N23Q5m63o05n59o23p92
54145E5544j006j220j142m97N05J368J815J756J143L32O7N24Q65M01k97k95K61
$$ plain form
54272 62829 61699 60678 60030 59919 60311 61035 61917 62859 63781 64485 64766 64822 65321 66662 68248 68973 68529 67741
54254 67741 67438 67539 67493 67078 66397 65602 65130 65709 67491 69459 70388 70217 69885 69999 70305 70442 70509 70687 70829
54235 70829 70649 70064 69230 68396 67675 66878 65830 65057 65676 68067 71004 72801 73113 72894 72693 71947 70186
54218 70186 68093 66841 66857 67678 68734 69757 70597 71029 70917 70430 69991 69806 69528 68641 67320 66516 66825 67558
54200 67558 67419 65943 63874 62271 61679 62017 62755 63185 62942 62280 61611 60965 60239 59675 59545 59544 59125 58300 57584
54181 57584 57242 57224 57709 58978 60692 62012 62575 62739 62775 62467 61738 61050 60900 61294 61944 62592 63066 63417 64010
54162 64010 65019 65862 65691 64482 62998 61662 60232 58733 57854 57978 58501 58586 58123 57518 56959 56336 55544
54145 55544 54538 53318 52176 51679 52184 53552 55367 57123 58266 58598 58665 59189 60054 60455 60158 59863 60124
54128F0124N69N55P58J038O74l40j171j394j357j260p78J25Q76R99N44k03q59
54111E8900r10k52L68K63m7M20J413J615O07n34q49o08m04k18J39M55O23R94J703
54092F3678K191J925J055P6o85r74n76K30P34O47L83L29L72L27K88K73J05p5J43
54073G0446O90R68Q80J065J734K078J485O01M11P25O09m7l01M01J450J913J677
54056H6785J377J431J574J304O66L00O92J559K234K438K382K223J949J749J929
54041A10592K328K367J926J673K216L358M524N535O464P016O776O033N808O720
54027A73336Q169Q886Q292O971N874N394N349N505N614N228M097K722J877J495
54013B48809P82m11j186j072r92j986l605m612m801n074n910o814p259p322p246
$$ plain form
54128 60124 60693 61248 62006 63044 63718 63378 62207 60813 59456 58196 57418 57543 58419 59418 59962 59759 58900
54111 58900 57990 57738 58106 58369 58322 58742 60155 61770 62377 61843 60994 60386 59982 59764 59903 60358 60981 61975 63678
54092 63678 65869 67794 68849 68925 68240 67266 66690 66920 67654 68301 68684 69013 69385 69712 70000 70273 70378 70303 70446
54073 70446 71136 72104 72984 74049 75783 77861 79346 79947 80358 81083 81692 81645 81344 81745 83195 85108 86785
54056 86785 88162 89593 91167 92471 93137 93437 94129 95688 97922 100360 102742 104965 106914 108663 110592
54041 110592 112920 115287 117213 118886 121102 124460 128984 134519 140983 147999 154775 160808 166616 173336
54027 173336 181505 190391 198683 205654 211528 216922 222271 227776 233390 238618 242715 245437 247314 248809
54013 248809 249591 249180 247994 246922 245930 243944 240339 235727 230926 225852 219942 213128 205869 198547 191301
53998A91301p062o716o071m920l531k836l336m129l919k775j858j622j446j012
53984A40068p89r74j141j183j515j968j706o50P5k60r56j077o95l43r9K3l56j202
53966A25252j618r98k0L53K03J63K25ll27k50M5Ok54r1N49J038J115J258J871
53947A28517K703L293L520L624L950M713N753O593O967P179P624Q194Q507Q515
53933B09652Q468Q293P554O003L930J892K89p92j498j931j934j283j27J018J878
53918B41412K725L890N160N980O025N446M745M561N327O900Q657J0022J0718J0520
53904C32088R275P334N501M225L125J647j24j634k584l107l390l502l552l779
53890C41523m410n411o408o935o977p070p619q325q726r012r617j0157r628p880
$$ plain form
53998 191301 184239 177523 171452 166532 163001 160165 156829 152700 148781 146006 144148 142526 141080 140068
53984 140068 139279 138305 137164 135981 134466 132498 130792 130142 130217 129957 129001 127924 127229 126886 126787 126810 126454 125252
53966 125252 123634 122636 122616 122969 123172 123335 123560 123557 123230 122980 123025 123031 122777 122686 123235 124273 125388 126646 128517
53947 128517 131220 134513 138033 141657 145607 150320 156073 162666 169633 176812 184436 192630 201137 209652
53933 209652 218120 226413 233967 239970 243900 245792 246081 245289 243791 241860 239926 238643 238516 239534 241412
53918 241412 244137 248027 253187 259167 265192 270638 275383 279944 285271 292171 300828 310850 321568 332088
53904 332088 341363 348697 354198 358423 361548 363195 363071 361437 358853 355746 352356 348854 345302 341523
53890 341523 337113 331702 325294 318359 311382 304312 296693 288368 279642 270630 261013 250856 241228 233348
53876B33348o069n303n480n836o020o116o085n740n049m056k879j962j938k917
53862A67898m201n017n093m472l331k287k153k927l505k982j770j017j236j998
53848A25909k561k346j233J91R81Q08K37j67n07r57j216j072r59j239j407q01
53832A13661K96R71Q99N39K81M1k82n35n29k22L07Q62J197J288J301J254J093
53815A22422J133J807K781L069K441J881K134K647K681K673L461M726N390N219
53801A64465M915M844M720M582M989N992O842P026O882O873O744N905M333K761
53787B41873K064K477L271L300K035P0j489k032j711j129r31j444k442l437m276
53772B36199n073n589n373m677m451n020n567n411m991m938m999m689m270m106
$$ plain form
53876 233348 227279 221976 216496 210660 204640 198524 192439 186699 181650 177594 174715 172753 170815 167898
53862 167898 163697 158680 153587 149115 145784 143497 141344 138417 134912 131930 130160 129143 127907 125909
53848 125909 123348 121002 119769 119960 120941 121749 121986 121819 121312 120355 119139 118067 117108 115869 114462 113661
53832 113661 113957 114928 115827 116366 116647 116688 116406 115871 115342 115120 115427 116289 117486 118774 120075 121329 122422
53815 122422 123555 125362 128143 131212 133653 135534 137668 140315 142996 145669 149130 153856 159246 164465
53801 164465 169380 174224 178944 183526 188515 194507 201349 208375 215257 222130 228874 234779 239112 241873
53787 241873 243937 246414 249685 252985 255020 255090 253601 251569 249858 248729 247798 246354 243912 240475 236199
53772 236199 231126 225537 220164 215487 211036 206016 200449 195038 190047 185109 180110 175421 171151 167045
53758A67045l754k708j562j288j743j979j739j550j507j183o79p03j477k411k875
53743A39887k604j518K3J014P63q6l86r3k7l26l48j3P5r9J64Q98J246Q64M15L16
53723A40165J67j89j92K99N50K47K07J103K304K781K406J623N92n04q86J09K014
53706A52796L637M246M001L449L083L120L276L057K524K425L240M509N388N459
53692B04210M792L646K517K007K224K612K677K561K658L035L467L704L456K665
53678B46231J833J677K171K521K290J939J917J855J234L66R9P63J802K323J831
53663B70852O17l93n18k2L37L68M26M64j8r09j341r91o45r78j605j937k159k563
53645B58985k643j848p24l63r34j568j562j001k81K96N73O16P51J122J412J392
$$ plain form
53758 167045 163291 160583 159021 157733 155990 154011 152272 150722 149215 148032 147353 146650 145173 142762 139887
53743 139887 137283 135765 135788 136802 137565 137479 137093 137000 136973 136647 136299 136286 136361 136262 136426 137324 138570 139434 139849 140165
53723 140165 140332 140143 139951 140250 140800 141047 141254 142357 144661 147442 149848 151471 152063 151559 150673 150782 152796
53706 152796 156433 160679 164680 168129 171212 174332 177608 180665 183189 185614 188854 193363 198751 204210
53692 204210 209002 212648 215165 217172 219396 222008 224685 227246 229904 232939 236406 240110 243566 246231
53678 246231 248064 249741 251912 254433 256723 258662 260579 262434 263668 264034 264133 264896 266698 269021 270852
53663 270852 271469 271076 270558 270536 270873 271241 271667 272131 272113 271204 269863 268872 268227 267249 265644 263707 261548 258985
53645 258985 256342 254494 253770 253407 252473 250905 249343 248342 248061 248357 248930 249546 250297 251419 252831 254223
53629B54223J370J702K109K119J859J816K007J995J680J499J825K570L386L907
53615B84067L873L425L155L537M344M933M959M624M350M544N399O536P132O752
53601C51630N959N655O035O544O725O616O476O464O597O710O505N940N350M984
53587D38190M655M152L720L691L885L833L479L164L000K712K139J528J207J201
53573D80556J179P09k91j322j765j682j739k230k576k265j698j605j971k249k330
53558D58721k604l164l626l740l591l140k220j119n96j018j840k182j695p28R9
53543D27557L51J8m92p14m72J06Q60J600K016J863J335J005J344K319L521M474
53527D46691M934N048N287O112P543R069R916R692Q925Q812J0071J2063J3502
$$ plain form
53629 254223 255593 257295 259404 261523 263382 265198 267205 269200 270880 272379 274204 276774 280160 284067
53615 284067 287940 291365 294520 298057 302401 307334 312293 316917 321267 325811 331210 337746 344878 351630
53601 351630 357589 363244 369279 375823 382548 389164 395640 402104 408701 415411 421916 427856 433206 438190
53587 438190 442845 446997 450717 454408 458293 462126 465605 468769 471769 474481 476620 478148 479355 480556
53573 480556 481735 482444 482153 480831 479066 477384 475645 473415 470839 468574 466876 465271 463300 461051 458721
53558 458721 456117 452953 449327 445587 441996 438856 436636 435517 434921 433903 432063 429881 428186 427458 427557
53543 427557 427908 427926 427434 426720 426248 426354 427214 428814 430830 432693 434028 435033 436377 438696 442217 446691
53527 446691 451625 456673 461960 468072 475615 484684 494600 504292 513217 522029 532100 544163 557665
53514E57665J3973J4295J5268J6733J8099J9196K0179K1029K1708K2406K3252
53503G63803K4073K4825K5885K7502K9332L0946L2351L3498L3894L3347L2643
53492A092099L2658L3146L3270L2993L2956L3172L3047L2752L3322L5053L6769
53481A461237L7342L7127L7173L7582L7515L6465L4807L3053L1213K9048K6669
53470A839231K4611K3372K2921K2670K1976K0646J8964J7395J6385J6176J6443
53459B060790J6191J4454J1249P531M125R55k523o436j0297j3552j6113j8339
53447B048035k0549k2688k4534k6130k7794k9583l1060l1837l2134l2512l3240
53436A735974l4174l5062l5663l5690l5040l4059l3193l2385l1167k9423k7658
$$ plain form
53514 557665 571638 585933 601201 617934 636033 655229 675408 696437 718145 740551 763803
53503 763803 787876 812701 838586 866088 895420 926366 958717 992215 1026109 1059456 1092099
53492 1092099 1124757 1157903 1191173 1224166 1257122 1290294 1323341 1356093 1389415 1424468 1461237
53481 1461237 1498579 1535706 1572879 1610461 1647976 1684441 1719248 1752301 1783514 1812562 1839231
53470 1839231 1863842 1887214 1910135 1932805 1954781 1975427 1994391 2011786 2028171 2044347 2060790
53459 2060790 2076981 2091435 2102684 2110215 2114340 2115295 2112772 2106336 2096039 2082487 2066374 2048035
53447 2048035 2027486 2004798 1980264 1954134 1926340 1896757 1865697 1833860 1801726 1769214 1735974
53436 1735974 1701800 1666738 1631075 1595385 1560345 1526286 1493093 1460708 1429541 1400118 1372460
53425A372460k6386k5401k3910k1387j8181j5213j2991j1142r027o558l951j003
53413A197310K566O108Q438R597J1155J4130J7582K0188K2250K4861K7812K9877
53401A391874L0947L2228L4252L6206L7583L9095M1290M3587M5434M7408N0247
53390A830151N3616N6756N9731O3044O6575O9782P2692P5756P8911Q1581Q3493
53379B592088Q4826Q5642Q5908Q5913Q5997Q5786Q4516Q2156P9497P6907P3709
53368C502945O9291O4150N9332N5135N1091M6970M3170L9985L7062L3775K9783
53357D032689K4942J9113J2355N103k253r791j7765k6180l5054m4802n5587o6383
53345C836387p5511q2244q7138r0622r2223r1677q9898q8031q6322q4660q3523
$$ plain form
53425 1372460 1346074 1320673 1296763 1275376 1257195 1241982 1228991 1217849 1208822 1202264 1198313 1197310
53413 1197310 1199876 1205984 1214422 1224019 1235174 1249304 1266886 1287074 1309324 1334185 1361997 1391874
53401 1391874 1422821 1455049 1489301 1525507 1563090 1602185 1643475 1687062 1732496 1779904 1830151
53390 1830151 1883767 1940523 2000254 2063298 2129873 2199655 2272347 2348103 2427014 2508595 2592088
53379 2592088 2676914 2762556 2848464 2934377 3020374 3106160 3190676 3272832 3352329 3429236 3502945
53368 3502945 3572236 3636386 3695718 3750853 3801944 3848914 3892084 3932069 3969131 4002906 4032689
53357 4032689 4057631 4076744 4089099 4094202 4091949 4082158 4064393 4038213 4003159 3958357 3902770 3836387
53345 3836387 3760876 3678632 3591494 3500872 3408649 3316972 3227074 3139043 3052721 2968061 2884538
53334B884538q3251q3019q1743p9740p8271p7627p6921p5665p4215p2537o9984
53323B031565o6594o3291o0269n6473n1360m5980m1497l7750l4223l1322k9474
53312A513332k7822k5216k2017j9540j7970j6183j3548j0717q442o693n274m357
53300A335553l946l414k043K50L003N586P454Q387Q778R435J0951J3380J6420
53287A409794J9610K2537K5174K7944L1010L3707L5253L5914L6828L8532M0319
53276A756622M1210M1064M0352L9355L8009L6314L4516L2881L1429K9828K7595
53265B149175K4656K1722J9712J8710J7810J6090J3481J0445P219L664l55m809
53253B297520r606j4613j9563k4171k8347l2281l6313m0681m5187m9040n1342
$$ plain form
53334 2884538 2801287 2718268 2636525 2556785 2478514 2400887 2323966 2248301 2174086 2101549 2031565
53323 2031565 1964971 1901680 1841411 1784938 1733578 1687598 1646101 1608351 1574128 1542806 1513332
53312 1513332 1485510 1460294 1438277 1418737 1400767 1384584 1371036 1360319 1351877 1345184 1339910 1335553
53300 1335553 1331607 1328193 1326150 1326400 1329403 1334989 1342443 1350830 1359608 1369043 1379994 1393374 1409794
53287 1409794 1429404 1451941 1477115 1505059 1536069 1569776 1605029 1640943 1677771 1716303 1756622
53276 1756622 1797832 1838896 1879248 1918603 1956612 1992926 2027442 2060323 2091752 2121580 2149175
53265 2149175 2173831 2195553 2215265 2233975 2251785 2267875 2281356 2291801 2299020 2302684 2302329 2297520
53253 2297520 2287914 2273301 2253738 2229567 2201220 2168939 2132626 2091945 2046758 1997718 1946376
53242A946376n2019n2021n2262n2515n1785m9816m7591m6089m4983m3260m0843
53231A413192l8844l8123l8289l8583l9068m0198m1587m2106m1303l9866l8452
53220I76773l6835l4585l1997k9652k7495k4968k1947j8946j6530j4928j4164
53209G04726j4078j4221j4141j3854j3697j3743j3685j3317j2860j2661j2820
53198E55649j3069j2925j2097j0949j0366j0743j1375j1273j0399r541r089q653
53186D25170q056p923q820j0257j1078j0653r355q021p294p246p380p019n950
53173C16118m651l775l489l519l581l647l820m139m466m526m150l512k945k557
53159B63341k230j994k039k297k439k389k416k551k370j738j267j517k100k184
$$ plain form
53242 1946376 1894357 1842336 1790074 1737559 1685774 1635958 1588367 1542278 1497295 1454035 1413192
53231 1413192 1374348 1336225 1297936 1259353 1220285 1180087 1138500 1096394 1055091 1015225 976773
53220 976773 939938 905353 873356 843704 816209 791241 769294 750348 733818 718890 704726
53209 704726 690648 676427 662286 648432 634735 620992 607307 593990 581130 568469 555649
53198 555649 542580 529655 517558 506609 496243 485500 474125 462852 452453 442912 433823 425170
53186 425170 417114 409191 400371 390114 379036 368383 359028 351007 343713 336467 329087 322068 316118
53173 316118 311467 307692 304203 300684 297103 293456 289636 285497 281031 276505 272355 268843 265898 263341
53159 263341 261111 259117 257078 254781 252342 249953 247537 244986 242616 240878 239611 238094 235994 233810
53145B33810j670j152r49q06o40q46j570k292k409j883r87R4J119J573J082j2
53129B22462q75r65m67l4k33j062j910k086j552r25o85o85n69l45k10j03R1J08
53111B09955m91j620k567k643j751l77P29R41J99q52j436j357j031r34j236j872
53095A93657k591k993k825k247j573q66j45K11j21p20p76j97L33N55J066K114
53079A82882K822K281Q49l84j011j372j588j415j025j082j839k797l373l402k897
53064A66649j936r91p55j312j873j706r45k40P3Q6p3l92q24j274j719k111k295
53047A48362k178j844j418r09l80l8mj02j48l14q71j618j883j266k12M02J95m35
53029A35339r73j373j779j960j546q10n23r07j220p94j8K64o4m48p20j283k211
$$ plain form
53145 233810 232140 230988 230039 229233 228593 227747 226177 223885 221476 219593 218606 218700 219819 221392 222474 222462
53129 222462 221587 220622 220155 220121 219888 218826 216916 214830 213278 212353 211668 210983 210414 210069 209859 209756 209847 209955
53111 209955 209464 207844 205277 202634 200883 200506 201235 202176 202375 201523 200087 198730 197699 196765 195529 193657
53095 193657 191066 188073 185248 183001 181428 180562 180417 180628 180507 179787 179011 178814 179147 179702 180768 182882
53079 182882 185704 187985 188834 188450 187439 186067 184479 183064 182039 180957 179118 176321 172948 169546 166649
53064 166649 164713 163722 162967 161655 159782 158076 157131 156891 156964 157050 156977 156585 155761 154487 152768 150657 148362
53047 148362 146184 144340 142922 142013 141633 141595 141591 141489 141341 141027 140156 138538 136655 135389 135177 135579 135774 135339
53029 135339 134366 132993 131214 129254 127708 126898 126375 125468 124248 123454 123436 123700 123636 123188 122468 121185 118974
53012A18974k846k629j801j021o12m27j94K33Q08J285J442J264Q83M03J5M1L91
52995A16209L43o00j744j873q93M7K13J36N13J110J388J366J190N37o80j504r22
52978A14836O27J662J525R97R43J249J308Q94J82n79j071r65k77N23J026J215
52962A24095J255J194J146J373J907K301K113J550J318J721K228K074J217M75
52948A45967O17J515K334K462K031J545J295J246J268J331J544K068K808L216
52934A71247K723J486M22K79Q73J485J763J892K035J968J373K98p35j143q18k19
52918A84929J64L02M25N44N26M96O06N10k94j492k094j744j197j092j037m59L69
52901A79462Q71J126J480J665J188K61m92r67j373j356m18R26J452Q43P9L4M92
$$ plain form
53012 118974 116128 113499 111698 110677 110065 109638 109444 109677 110485 111770 113212 114476 115359 115762 115777 115818 116209
52995 116209 116552 115952 114208 112335 111442 111489 111702 111838 112351 113461 114849 116215 117405 117942 117262 115758 114836
52978 114836 115463 117125 118650 119647 120590 121839 123147 124041 124223 123644 122573 121608 121331 121854 122880 124095
52962 124095 125350 126544 127690 129063 130970 133271 135384 136934 138252 139973 142201 144275 145492 145967
52948 145967 146584 148099 150433 152895 154926 156471 157766 159012 160280 161611 163155 165223 168031 171247
52934 171247 173970 175456 175878 176157 177030 178515 180278 182170 184205 186173 187546 187844 187109 185966 185148 184929
52918 184929 185093 185395 185820 186364 186890 187386 187992 188502 188208 186716 184622 182878 181681 180589 179552 179093 179462
52901 179462 180333 181459 182939 184604 185792 186053 185561 184594 183221 181865 181447 182373 183825 184668 184747 184781 185273
52884A85273Q53R71R39P69O38Q78J391J535R63N8o48j001r85o01k17m07j044j208
52866A88157l96P53J353J320J014N06k16p77q69p71q13o79M5R41J189P33L22L94
52848A92206O80Q62R84J072R45N73J89j61o87j433k094k416k365j876r40m2P4
52831A85571o42j296j095k57M69Q06R34Q16J54r43j840k021j542p46Q3O81Q42
52814A79974O97O52Q56J000Q14M82J88k77j035j540j234n70o04j472k110j798
52798A74023j197j310k069k667k799k745k499j753o69R2K77K45K06j01p71j419
52782A54844j804k184k706l023k874k621k727l105l318l177k727k003j191p86
52768A20598j022j402j217n03%k26r44j570j774j600j278j015q68p58o65p10r58
$$ plain form
52884 185273 186126 187097 188036 188805 189443 190321 191712 193247 194210 194268 193620 192619 191634 191033 190816 190409 189365 188157
52866 188157 187761 188514 189867 191187 192201 192707 192491 191714 190845 190074 189261 188582 188627 189568 190757 191490 191812 192206
52848 192206 192886 193748 194732 195804 196749 197322 197511 197350 196663 195230 193136 190720 188355 186479 185539 185497 185571
52831 185571 184929 183633 182538 182281 182750 183556 184490 185306 185460 184517 182677 180656 179114 178368 178451 179132 179974
52814 179974 180671 181323 182179 183179 183993 184475 184663 184386 183351 181811 180577 180007 179403 177931 175821 174023
52798 174023 172826 171516 169447 166780 163981 161236 158737 156984 156315 156407 156684 156929 157135 157034 156263 154844
52782 154844 153040 150856 148150 145127 142253 139632 136905 133800 130482 127305 124578 122575 121384 120598
52768 120598 119576 118174 116957 116454 116454 116228 115284 113714 111940 110340 109062 108047 107179 106421 105756 105046 104088
52751A04088j247j369j292j078p74n06m83p10q75p21m04k24l02o28j229j927k164
52734H8155j567n41J04Q4j48r6K61O80J006J121R25N04J43n4k61o00p88n23j5
52715H8390J18m13j143j377j027o67p65j120j270j186j127j017m42N75J376J441
52699H0346R86N47L26K34K91M96N89L14j62m80n42m37j44L22N94L60r1j22M39
52680H3866J159J573J527J075N38N14J212J865J445J17p87l81Q16J774K154K163
52664A00630J903J431J047R40Q00L06k67m25k11p3j87l80n79q10q93o76m37n25
52646A01594p05m93q3j48p09r57m87P8J35N0M11Q74O38k55r62j138j294j686j673
52627I3190p25N50J047O18J75L89Q79Q80L00l19o26p75q91o82R4J016J266O44
$$ plain form
52751 104088 102841 101472 100180 99102 98328 97822 97339 96629 95754 95033 94629 94405 94103 93475 92246 90319 88155
52734 88155 86588 86047 86151 86235 86087 85991 86252 86932 87938 89059 89984 90488 90631 90577 90316 89716 88928 88405 88390
52715 88390 88508 88095 86952 85575 84548 83881 83116 81996 80726 79540 78413 77396 76954 77529 78905 80346
52699 80346 81332 81879 82205 82439 82730 83226 83815 84129 83967 83487 82945 82508 82364 82686 83280 83640 83549 83427 83866
52680 83866 85025 86598 88125 89200 89738 90252 91464 93329 94774 94891 94104 93723 94539 96313 98467 100630
52664 100630 102533 103964 105011 105951 106751 107057 106790 106365 106154 106081 105894 105514 104935 104125 103232 102556 102119 101594
52646 101594 100889 100396 100313 100165 99456 98499 98012 98090 98225 98275 98686 99560 100198 99943 98981 97843 96549 94863 93190
52627 93190 92465 93015 94062 94680 94855 95244 96123 97003 97303 96984 96358 95583 94692 94010 94104 95120 96386 97030
52609I7030l2K49J494K619K577J413J59k48K16Q44J029P63M55M29P46J325J964
52592A13032K322K127J545J093J075J321J561J765J924J784J221O67O89J186J462
52577A34774J170P32O56Q79J008R38R04J094J487J914K160K087J783J455J070
52562A54111M38l31p39m99J45Q87J679K279K002N77j068j577p18M48Q91N36j41
52545A58920p65j087r39m31R8N08Q47Q75K24p93j162m24N61O91J3n22l56K43Q90
52526A57391J479J858J770J363J134J202J080M72j20l6O23J143J122P24J40o59
52510A70686j455j583o43Q16J685J343J24j146j745j437o25j88o22j364j353l78
52494A62115O72J038R19P53L68m09r38m69N57Q98K48l31P0J085J824J978J698
$$ plain form
52609 97030 96998 97247 98741 101360 103937 105350 105509 105261 105477 106321 107350 108113 108568 108997 109743 111068 113032
52592 113032 115354 117481 119026 120119 121194 122515 124076 125841 127765 129549 130770 131437 132126 133312 134774
52577 134774 135944 136676 137332 138211 139219 140157 141061 142155 143642 145556 147716 149803 151586 153041 154111
52562 154111 154549 154218 153479 152980 153125 154012 155691 157970 159972 160549 159481 157904 157186 157634 158525 159061 158920
52545 158920 158155 157068 156129 155698 155796 156304 157151 158026 158250 157457 156295 155871 156432 157123 157136 156614 156258 156501 157391
52526 157391 158870 160728 162498 163861 164995 166197 167277 167749 167629 167593 168216 169359 170481 171205 171345 170686
52510 170686 169231 167648 167005 167821 169506 170849 170973 169827 168082 166645 166020 165832 165210 163846 162493 162115
52494 162115 162787 163825 164744 165497 165865 165456 164518 164049 164606 165504 165752 165421 165491 166576 168400 170378 172076
52477A72076J007o9j096j570j490j182q41n32l85m17l60j9L42L53L1l54o96j001
52459A63797j113q47k82L56R39J343J319Q13J67l39q45j389j391l19J303K210
52443A65722J798O87j75l88k9O23J036O73l17j105j195j078j371j750j352j11
52427A61668R66J040L98j16j80r2k1K62Q42J336J295P41N2m53o58n29j14M55J131
52408A68023J864K260J762N31k54K88J473J916J432J147J644K130J840J183Q89
52393A88128R04R07J093J593J735J039L14O17J484J506N38l4O60J848K439K314
52377B07085J849J156M77M51J238J950J761J059P77J025J172R89R11J174J489
52362B24563J660J886K291K595K551K310K179K166K034J639J099O71N87R07J459
$$ plain form
52477 172076 173083 173014 171918 170348 168858 167676 166835 166303 165918 165501 165141 165122 165464 165817 165848 165494 164798 163797
52459 163797 162684 161837 161555 161911 162850 164193 165512 166325 166492 166153 165308 163919 162528 162209 163512 165722
52443 165722 167520 168207 168032 167644 167615 168238 169274 169947 169630 168525 167330 166252 164881 163131 161779 161668
52427 161668 162634 163674 164072 163956 163776 163684 163663 163925 164767 166103 167398 168139 168191 167738 167080 166551 166437 166892 168023
52408 168023 169887 172147 173909 174440 174186 174474 175947 177863 179295 180442 182086 184216 186056 187239 188128
52393 188128 189032 189939 191032 192625 194360 195399 195713 196330 197814 199320 199858 199824 200484 202332 204771 207085
52377 207085 208934 210090 210567 211018 212256 214206 215967 217026 217803 218828 220000 220989 221900 223074 224563
52362 224563 226223 228109 230400 232995 235546 237856 240035 242201 244235 245874 246973 247644 248231 249138 250597
52347B50597J861J752J124M35K50P50J629K477L055L088K232O36o81o15Q03K432
52331B71825L335L550L451K949J857O59K93J214K951M616N566N724N463N288N436
52316C24177N859O543P611Q891R730R646R055Q964R823J1035J1685J1570J1303
52303D45892J1545J2428J3704J5222J6922J8401J8950J8309J7184J6637J6929
52292F22123J7409J7476J7254J7092J6922J6436J5640J4763J3806J2562J1086
52281G92569R728Q648P570O201M654L378K697K452K076J080m31j779k351k197
52267H34295j894j885k151k466k758l084l430l668l609l050j869k76J134J815
52253H07104J917K292L619N660P552Q809R723J0715J1632J2055J2034J2182J2911
$$ plain form
52347 250597 252458 254210 255334 255769 256019 256769 258398 260875 263930 267018 269250 269886 269205 268590 269393 271825
52331 271825 275160 278710 282161 285110 286967 287626 287919 289133 292084 296700 302266 307990 313453 318741 324177
52316 324177 330036 336579 344190 353081 362811 372457 381512 390476 400299 411334 423019 434589 445892
52303 445892 457437 469865 483569 498791 515713 534114 553064 571373 588557 605194 622123
52292 622123 639532 657008 674262 691354 708276 724712 740352 755115 768921 781483 792569
52281 792569 802297 810945 818515 824716 829370 832748 835445 837897 839973 841053 840622 838843 836492 834295
52267 834295 832401 830516 828365 825899 823141 820057 816627 812959 809350 806300 804431 804155 805289 807104
52253 807104 809021 811313 814932 820592 828144 836953 846676 857391 869023 881078 893112 905294 918205
52240I18205J3915J4538J4492J4171J4180J4633J4880J4114J2277J0244Q915Q277
52228A072841P610O434M909L400K087J075M49L9n84j611k719l485l928m434n252
52213A076831o263p172p766p987p845p384o692n987n595n656n853n565m440k752
52199I89874j219m07k78k15L72J425K244K276J740J380J688K552L438L757L235
52184A011862K213J451J307J349J036N12K32Q8l77r87j000l36L8o29j869k674
52168A012216k773k736l130m018n051n738n762n332n010n031n102m998m928n027
52154I47580m989m658m500m946n580n642n096m550m327m240m228m466m781m638
52140H80939l949l351l348l635l628l326l221l586m214m727m890m703m420m400
$$ plain form
52240 918205 932120 946658 961150 975321 989501 1004134 1019014 1033128 1045405 1055649 1064564 1072841
52228 1072841 1080451 1086885 1091794 1095194 1097281 1098356 1098805 1098844 1098260 1096649 1093930 1090445 1086517 1082083 1076831
52213 1076831 1070568 1063396 1055630 1047643 1039798 1032414 1025722 1019735 1014140 1008484 1002631 997066 992626 989874
52199 989874 988655 988248 987970 987755 988127 989552 991796 994072 995812 997192 998880 1001432 1004870 1008627 1011862
52184 1011862 1014075 1015526 1016833 1018182 1019218 1019730 1019962 1020050 1019673 1018686 1017686 1017350 1017388 1016759 1014890 1012216
52168 1012216 1009443 1006707 1003577 999559 994508 988770 983008 977676 972666 967635 962533 957535 952607 947580
52154 947580 942591 937933 933433 928487 922907 917265 912169 907619 903292 899052 894824 890358 885577 880939
52140 880939 876990 873639 870291 866656 863028 859702 856481 852895 848681 843954 839064 834361 829941 825541
52126H25541m666m709m014k774j707j195r04m76j27k22m60j04J014K261L126L850
52110H14434M843O049P235Q561J0251J2043J3590J5110J6880J8329J8606J8107
52098I64038J8348J9984K1938K2990K3344K3800K4147K3498K1826K0107J8898
52087A202918J7723J6029J3963J1961J0127Q368O695N125L589K202J253O65j33
52074A300485j511l033m000m441n100o395p808q541q493q201q025p794p309o662
52060A213172n861m550k574n11Q24J290J407J583J886K490L669N231O564P330
52046A231950P700P771P442O969O906P236P228O586N966N849N575M272K198L59
52032A314007q23j667k367k928l697n164p084q579r190r315r521j0076j1113j2661
$$ plain form
52126 825541 820875 816166 812152 809378 807671 806476 805572 805096 804969 804747 804287 804183 805197 807458 810584 814434
52110 814434 819277 825326 832561 841122 851373 863416 877006 892116 908996 927325 945931 964038
52098 964038 982386 1002370 1024308 1047298 1070642 1094442 1118589 1142087 1163913 1184020 1202918
52087 1202918 1220641 1236670 1250633 1262594 1272721 1281089 1287784 1292909 1296498 1298700 1299953 1300618 1300485
52074 1300485 1298974 1295941 1291941 1287500 1282400 1276005 1268197 1259656 1251163 1242962 1234937 1227143 1219834 1213172
52060 1213172 1207311 1202761 1200187 1199676 1200500 1201790 1203197 1204780 1206666 1209156 1212825 1218056 1224620 1231950
52046 1231950 1239650 1247421 1254863 1261832 1268738 1275974 1283202 1289788 1295754 1301603 1307178 1311450 1313648 1314007
52032 1314007 1313184 1311517 1309150 1306222 1302525 1297361 1290277 1281698 1272508 1263193 1253672 1243596 1232483 1219822
$$ [...]
##END NTUPLES=NMR SPECTRUM
##END=
